##TITLE=AC1517_ROEFFECT0003_8213605_iCf7iwwBfp
##JCAMPDX= 6.0         $$ Bruker NMR JCAMP-DX V2.0
##DATA TYPE= NMR SPECTRUM
##DATA CLASS= NTUPLES
##ORIGIN= BRUKER
##OWNER= Administrator
$$ 1.72 TOPSPIN		Version 2.1
$$ 2013-10-04 17:09:50.567 -0700  Administrator@X
$$ Compression mode = diff/dup
##.OBSERVE FREQUENCY= 400.02188249412
##.OBSERVE NUCLEUS= ^1H
##.ACQUISITION MODE= SIMULTANEOUS (DQD)
##.ACQUISITION SCHEME= undefined
##.AVERAGES= 8
##.DIGITISER RES= 22
##SPECTROMETER/DATA SYSTEM= spect
##.PULSE SEQUENCE= zg30
##.SOLVENT NAME= COFFEE_meoh
##.SHIFT REFERENCE= INTERNAL, COFFEE_meoh, 1, 14.98509
##AUDIT TRAIL= $$ (NUMBER, WHEN, WHO, WHERE, PROCESS, VERSION, WHAT)
$$ ##TITLE= Audit trail, TOPSPIN		Version 2.1
$$ ##JCAMPDX= 5.01
$$ ##ORIGIN= Bruker BioSpin GmbH
$$ ##OWNER= Administrator
$$ $$ E:\/data/COFFEE/nmr/AC1517_ROEFFECT0003_8213605_iCf7iwwBfp/10/pdata/1/auditp.txt
$$ ##AUDIT TRAIL=  $$ (NUMBER, WHEN, WHO, WHERE, PROCESS, VERSION, WHAT)
(   1,<2013-10-04 17:09:43.692 -0700>,<Administrator>,<X>,<go>,<TOPSPIN 2.1>,
      <created by zg
	started at 2013-10-04 17:08:37.676 -0700,
	POWCHK enabled, PULCHK disabled,
       configuration hash MD5:
       C8 4E 4E 5D D3 5C D8 9E 9F 52 82 E0 59 8A DE 15
       data hash MD5: 64K
       AF 8A AF 18 F9 57 45 34 88 77 EF 20 8B 41 C3 8A>)
(   2,<2013-10-04 17:09:46.598 -0700>,<Administrator>,<X>,<proc1d>,<TOPSPIN 2.1>,
      <Start of raw data processing
       efp LB = 0 FT_mod = 6 PKNL = 1 PHC0 = 0 PHC1 = 0 SI = 32K 
       data hash MD5: 32K
       B1 47 4B 57 AC A4 0A D1 89 D7 1A 0C FB 10 AF E9>)
(   3,<2013-10-04 17:09:46.926 -0700>,<Administrator>,<X>,<proc1d>,<TOPSPIN 2.1>,
      <pk PHC0 = 97.44873 PHC1 = 0 
       data hash MD5: 32K
       CD 58 83 2F DB 90 44 45 38 B7 85 78 66 21 0E 29>)
(   4,<2013-10-04 17:09:47.051 -0700>,<Administrator>,<X>,<proc1d>,<TOPSPIN 2.1>,
      <abs ABSG = 1 
       data hash MD5: 32K
       9F 48 AD 30 29 01 2E A4 F8 89 C9 91 27 E0 BB 89>)
(   5,<2013-10-04 17:09:47.114 -0700>,<Administrator>,<X>,<proc1d>,<TOPSPIN 2.1>,
      <abs ABSG = 2 
       data hash MD5: 32K
       36 93 70 99 6F 51 E0 7E 70 46 3E C9 F1 94 2E 72>)
(   6,<2013-10-04 17:09:47.161 -0700>,<Administrator>,<X>,<proc1d>,<TOPSPIN 2.1>,
      <abs ABSG = 3 
       data hash MD5: 32K
       6B 75 9E 93 52 CC C5 E7 3D 4A 85 57 A7 67 D9 C6>)
(   7,<2013-10-04 17:09:47.286 -0700>,<Administrator>,<X>,<proc1d>,<TOPSPIN 2.1>,
      <abs ABSG = 4 
       data hash MD5: 32K
       7B 61 2C 4A EB D6 FC F5 BC 5B F6 94 73 C0 8D BC>)
(   8,<2013-10-04 17:09:47.442 -0700>,<Administrator>,<X>,<proc1d>,<TOPSPIN 2.1>,
      <abs ABSG = 5 
       data hash MD5: 32K
       FD E0 9F 2E 21 0C 66 31 E1 FD FA 4D 24 10 FD B6>)
$$ ##END=
$$ 
$$ $$ hash MD5
$$ $$ 6E BD 5F 40 10 E5 E1 2B BC 20 FB AE 4F E6 15 D3
##$RELAX= 
##$RELAX= 
##$RELAX= 
##$RELAX= 
##$RELAX= 
##$RELAX= 
##$RELAX= 
$$ Bruker specific parameters
$$ --------------------------
##$DU= <E:\>
##$EXPNO= 10
$$ [...]
150 150 150 150 150 150 150 150
##$TP07= 0
##$TPNAME0= <>
##$TPNAME1= <>
##$TPNAME2= <>
##$TPNAME3= <>
##$TPNAME4= <>
##$TPNAME5= <>
##$TPNAME6= <>
##$TPNAME7= <>
##$TPOAL= (0..7)
0.5 0.5 0.5 0.5 0.5 0.5 0.5 0.5
##$TPOFFS= (0..7)
0 0 0 0 0 0 0 0
##$TUNHIN= 0
##$TUNHOUT= 0
##$TUNXOUT= 0
##$USERA1= <user>
##$USERA2= <user>
##$USERA3= <user>
##$USERA4= <user>
##$USERA5= <user>
##$V9= 5
##$VALIST= <valist>
##$VCLIST= <CCCCCCCCCCCCCCC>
##$VD= 0
##$VDLIST= <DDDDDDDDDDDDDDD>
##$VPLIST= <PPPPPPPPPPPPPPP>
##$VTLIST= <TTTTTTTTTTTTTTT>
##$WBST= 2048
##$WBSW= 25
##$XGAIN= (0..3)
0 0 0 0
##$XL= 0
##$YL= 0
##$YMAX_a= 617885
##$YMIN_a= -525611
##$ZGOPTNS= <>
##$ZL1= 120
##$ZL2= 120
##$ZL3= 120
##$ZL4= 120
##$ABSF1= 14.98509
##$ABSF2= -5.573092
##$ABSG= 5
##$ABSL= 3
##$ALPHA= 0
##$AQORDER= 0
##$ASSFAC= 0
##$ASSFACI= 0
##$ASSFACX= 0
##$ASSWID= 0
##$AUNMP= <proc_prof1d_extract_pilot.lims>
##$AXLEFT= 0
##$AXNAME= <>
##$AXNUC= <1H>
##$AXRIGHT= 0
##$AXTYPE= 0
##$AXUNIT= <>
##$AZFE= 0.1
##$AZFW= 0.1
##$BCFW= 0
##$BC_mod= 0
##$BYTORDP= 0
##$COROFFS= 0
##$CY= 15
##$DATMOD= 1
##$DC= 0
##$DFILT= <>
##$DTYPP= 0
##$F1P= 0
##$F2P= 0
##$FCOR= 0.5
##$FTSIZE= 32768
##$FT_mod= 6
##$GAMMA= 0
##$GB= 0
##$INTBC= 1
##$INTSCL= 1
##$ISEN= 128
##$LB= 0
##$LEV0= 0
##$LPBIN= 0
##$MAXI= 10000
##$MC2= 0
##$MEAN= 0
##$ME_mod= 0
##$MI= 0
##$NCOEF= 0
##$NC_proc= -8
##$NLEV= 6
##$NOISF1= 0
##$NOISF2= 0
##$NSP= 0
##$NTH_PI= 0
##$NZP= 0
##$OFFSET= 14.98509
##$PC= 1
##$PHC0= 97.44873
##$PHC1= 0
##$PH_mod= 1
##$PKNL= yes
##$PPARMOD= 0
##$PPDIAG= 0
##$PPIPTYP= 0
##$PPMPNUM= 2147483647
##$PPRESOL= 1
##$PSCAL= 4
##$PSIGN= 0
##$PYNMP= <proc.py>
##$REVERSE= no
##$SF= 400.02
##$SI= 32768
##$SIGF1= 0
##$SIGF2= 0
##$SINO= 400
##$SIOLD= 32768
##$SPECTYP= <>
##$SREGLST= <1H.CDCl3>
##$SSB= 0
##$STSI= 32768
##$STSR= 0
##$SW_p= 8223.68421052631
##$SYMM= 0
##$S_DEV= 0
##$TDeff= 65536
##$TDoff= 0
##$TI= <>
##$TILT= no
##$TM1= 0
##$TM2= 0
##$TOPLEV= 0
##$USERP1= <user>
##$USERP2= <user>
##$USERP3= <user>
##$USERP4= <user>
##$USERP5= <user>
##$WDW= 1
##$XDIM= 32768
##$YMAX_p= 427780878
##$YMIN_p= -712856
##$CURPLOT= <Network HP LaserJet P1505>
##$CURPRIN= <$Network HP LaserJet P1505>
##$DFORMAT= <normdp>
##$LAYOUT= <+/1D_H.xwp>
##$LFORMAT= <normlp>
##$PFORMAT= <normpl>
##$SURQMSG= 1
$$ End of Bruker specific parameters
$$ ---------------------------------
##NTUPLES= NMR SPECTRUM
##VAR_NAME=  FREQUENCY,     SPECTRUM/REAL,   SPECTRUM/IMAG
##SYMBOL=    X,             R,               I
##VAR_TYPE=  INDEPENDENT,   DEPENDENT,       DEPENDENT
##VAR_FORM=  AFFN,          ASDF,            ASDF
##VAR_DIM=   32768,         32768,           32768
##UNITS=     HZ,            ARBITRARY UNITS, ARBITRARY UNITS
##FACTOR=    0.250966925370066, 1,           1
##FIRST=     8223.43324360094, -154047,      -189000
##LAST=      0,             142305,          -58278
##MIN=       0,             -712856,         0
##MAX=       8223.43324360094, 427780878,    0
$$ Real data points
##PAGE= N=1
##DATA TABLE= (X++(R..R)), XYDATA
$$ [...]
19564b20663J3115A47559J09934b01902n970H8065l1233a05841k44055F336b06654
19552B67972a89288B04445K882a00142a8991l9287G7992i8665J857c1897I9275
19540g3272A6504a36426k02735h3811k45128A84341o7214b57292e065j61431J5668
19529a50828D2799a29563l6445j17759b551l87074d9139K993j54879P9300J1657
19518a10068j73285D543a56422b6665B71608c9234A05211f9493h128F1946d85967
19506E5917b99600e7143m99438B28953d111A85755c09336R9156e6742o0946B64624
19494H0439e1798o4662A25474e3409j49400B77524a53054g2961a4507k14375a11926
19482I7101K5659L765a44771B78554e5395F7385N4016a5522C22635E29d5283l45786
$$ plain form
19564 -220663 -207548 147559 257493 -201902 -207872 88065 56832 -105841 -349896 6336 -206654
19552 267972 -189288 204445 207327 -100142 -18991 -58278 77992 -98665 -96808 -31897 99275
19540 -73272 16504 -136426 -339161 -83811 -328939 184341 117127 -257292 -5065 -166496 -150828
19529 -150828 42799 -129563 -166008 -283767 -2551 -389625 -49139 -46146 -201025 -121725 -110068
19518 -110068 -283353 4543 -156422 -26665 271608 -39234 105211 -69493 -8128 61946 -485967
19506 55917 -299600 -57143 -556581 228953 -4111 185755 -309336 -210180 -56742 -117688 264624
19494 80439 -51798 -116460 125474 -53409 -202809 277524 -153054 -72961 -14507 -228882 -111926
19482 97101 122760 126525 -144771 278554 -55395 67385 121401 -15522 322635 529 -45283 -391069
19470c91069g864p4581K1896j85304a4095l32214a7758G6877H962b70374A27490
19458C3037K54093H3863L80J14089A076L17943b92365a2440j72607G0159J11393
19447A81552e1624q5449q8362D001b24101E0217d7420B51955b32549L1151B26883
19435D2336c9638j18448d2712A5335a29687j09357J8220L4836c3094l7175C5415
19423E1139b31551Q609l4916B20767a01570A64487G9216b5674m1725f792p8447
19412h5239B4779h6425d2557k48009j3447A98695E4551a25618O0328C14844b46940
19400a23439m8886D8183d0328A41680N2603h9776d3149l4550A33958K4593c08320
19388a33691K2073A35733e4070p4984b1702H8708I893L8501J79274E4964a27405
$$ plain form
19470 -391069 -7864 -82445 -60549 -245853 -14095 -346309 -17758 76877 8962 -270374 127490
19458 33037 287130 83863 84243 198332 1076 319019 -292365 -12440 -185047 70159 181552
19447 181552 -51624 -137073 -225435 4001 -224101 50217 -47420 251955 -232549 -201398 226883
19435 42336 -39638 -158086 -42712 15335 -129687 -239044 -220824 -185988 -33094 -70269 35415
19423 51139 -231551 -222942 -257858 220767 -101570 164487 79216 -25674 -67399 -6792 -85239
19412 -85239 24779 -86425 -42557 -290566 -304013 198695 54551 -125618 -65290 314844 -246940
19400 -123439 -172325 48183 -40328 141680 194283 -89776 -43149 -77699 133958 158551 -308320
19388 -133691 -111618 135733 -54070 -129054 -21702 88708 9893 48394 227668 54964 -127405
19376a13078j65915B52086c7812A15967a25431d7328k24936K5440a7133k64763
19366b81896J29911b9732k90777J18429q5428L9409f041B7981i673A60475D4879
19354a32805I3194a89734K6743C2307c1880p2601d1126q0659C4717q964b66876
19342b11171b8439B38699b88621a1518A70667p4376c78363G6026a7750K546B259
19330c88111J92076j11053m2534B32452g6903A27657n727M0418a60255e2330k56554
19319c08884B30753H7237C6739J47444b30463d4602j9489k10626G0382h317G6673
19307d8308n3931o2801D5058d1438H0641J8770a711F2148f6139D0813I564h1774
19294A28377h4489C05805a43570A84257b2154B23913a23838C7893J14825a81988
$$ plain form
19376 -113078 -278993 252086 -37812 115967 -125431 -47328 -272264 -246824 -17133 -281896
19366 -281896 -151985 -29732 -320509 -202080 -287508 -248099 -6041 27981 -9673 160475 44879
19354 -132805 93194 -189734 -162991 32307 -31880 -104481 -41126 -121785 34717 25753 -266876
19342 -211171 -28439 238699 -288621 -11518 170667 96291 -378363 76026 -17750 -15204 2259
19330 -388111 -196035 -307088 -349622 232452 -76903 127657 121930 162348 -160255 -52330 -308884
19319 -308884 230753 87237 36739 184183 -230463 -44602 -64091 -274717 70382 -8317 76673
19307 -48308 -102239 -165040 45058 -41438 80641 99411 -1711 62148 -66139 40813 9564 -81774
19294 128377 -84489 305805 -143570 184257 -22154 223913 -123838 37893 152718 -181988
19283E6923b22954r4946q371A1539k354a14721H3920b28659H902K01657q2247
19272A28312d15507a18017F5220f6488k95147i3531j39423a7814c671I0187a44834
19260B714b32145l4806a2513I7553c2505k24004f562E149e8704G7883b00543A39203
19247D6635c2473k74405C03245A13417b07068L4086q8976e4777j86422A97798
19236G1514a59957h621j75308A4838J34110D157J5332g5383F395L559c04936e1619
19223g2142B57539h289p04567B24746G7265b54094c2315j68176j76425A21424
19212A51356a55633D18063C7184L8328c74981J24411a11882N4659a5005k5327
19202d0332j29236B00127f7638A4300J05726c8114l1181I5756b97072m8258a08864
$$ plain form
19283 56923 -222954 -317900 -326271 11539 9185 -114721 83920 -228659 8902 210559 128312
19272 128312 -415507 -118017 65220 -66488 -361635 -93531 -232954 -17814 -3671 90187 -144834
19260 2714 -232145 -266951 -12513 97553 -32505 -256509 -6562 5149 -58704 77883 -200543 139203
19247 46635 -32473 -306878 303245 113417 -207068 -172982 -261958 -54777 -241199 197798
19236 71514 -159957 -8621 -183929 14838 148948 4157 19489 -75383 6395 9954 -304936 -51619
19223 -72142 257539 -8289 -712856 224746 77265 -254094 -32315 -200491 -376916 121424
19212 151356 -155633 418063 37184 75512 -374981 -250570 -111882 -57223 -15005 -40332
19202 -40332 -169568 200127 -67638 14300 120026 -38114 -69295 95756 -297072 -345330 -108864
19190e3000e636j15078c1995k95656a43283A6329p890J06238c02520i6207A10344
19178g3303b5434j25213P4470j88646D6733P0703k753c27300a36714K3575f608
19166b5501B56296A20181g3534k1806A19635a41090L2444j08207C07017A40468
19155a30378J5908A78514a00599E1891h0717b7199k60735q6255A58429c1282I9718
19143d5650A97896G8382L88589g7413j4596B19205c04111A0371a58885d7834C04397
19131b82168N2186e5241l8940c1891A8471c14885C74222j33198a52679E7378Q2818
19120A40196a03740l9908A29982j8408d5282j88068K2112a2491j63161j10177
19110b85829E565J76816e0256a4917k0328A99566n424a89491j70308a25465L3014
$$ plain form
19190 -53000 -5636 -120714 -31995 -327651 -143283 16329 8439 114677 -302520 -96207 110344
19178 -73303 -25434 -150647 -76177 -264823 46733 117436 114683 -327300 -136714 -113139 -6608
19166 -25501 256296 120181 -73534 -95340 119635 -141090 -108646 -216853 307017 140468
19155 -130378 -114470 178514 -100599 51891 -80717 -27199 -287934 -374189 158429 -31282 99718
19143 -45650 197896 78382 466971 -77413 -92009 219205 -304111 10371 -158885 -47834 304397
19131 -282168 -229982 -55241 -94181 -31891 18471 -314885 374222 241024 -152679 57378 140196
19120 140196 -103740 -143648 129982 111574 -45282 -233350 -211238 -12491 -175652 -285829
19110 -285829 5565 182381 -50256 -14917 -35245 199566 194142 -189491 -359799 -125465 -92451
19099i2451J9462j4918B6463a06573B7331q454m303b43756A01169D9770P9187
19088A28957h6430c0629l37404A26086J3890b45204Q2657j0883a514l18785J00764
19077b19535I5773d5098m8074K1321C7619a45169B17391b96691E9176b36410i6090
19065e4744B12212a172A03603a76087G465J47195j2822a19621L2296L8465m4391
19054i3251a0190o9143k26972c3746o4630L211F9494J20087Q3494A3656a94374
19042A98247c58574J30405a13120l870M0481O376A60857J02174C7465a03718D7495
19030c64692B6070L755b21409a221A55834b37538i4577A77990l3698f4906j1624
19019g6530A3813a86586m908I9602b17534A27890k4165e4725I8099J44468r2228
$$ plain form
19099 -92451 -72989 -87907 26463 -106573 27331 18877 14574 -243756 101169 49770 128957
19088 128957 -86430 -30629 -368033 126086 139976 -245204 -162547 -173430 -1514 -320299 -219535
19077 -219535 95773 -45098 -93172 -71851 37619 -145169 217391 -296691 59176 -236410 -96090
19065 -54744 212212 -1172 103603 -176087 7465 154660 141838 -119621 -87325 -48860 -93251
19054 -93251 -10190 -79333 -306305 -33746 -98376 -95165 69494 189581 273075 13656 -194374
19042 198247 -358574 -228169 -113120 -116990 -76509 -70133 160857 263031 37465 -103718 47495
19030 -364692 26070 29825 -221409 -1221 155834 -237538 -94577 177990 144292 -64906 -76530
19019 -76530 13813 -186586 -191494 99602 -217534 127890 103725 -54725 98099 242567 150339
19008A50339b89806a15069l7867H2571a43715j1693m2818n8348J13124A12187
18997a09551l8807a9900l83515c8005j1332n5755p3096a4564n7901p5976r912
18986a58353q8979A5769a38985B33787J81605b34843c9338n3753j29575A52451
18975A47142C5254a48835j49464F6095b22182e3873A75220f3205B6736d02582
18964a58298K1393A91291b75180J03748N9422L8494j71275j8801G077M2186M1465
18953I0728O0473B8616c02218d9784q6321G0973P8255K7483a19377A60742L7969
18942A98711J96060E6444a8597A3121g9319J1092c363j12982C46h138p1526I1238
18929a82198g9592l51334C23183d453C7443Q3088R6161C9919R4446n1646k8831
$$ plain form
19008 150339 -289806 -115069 -152936 82571 -143715 -155408 -198226 -256574 -143450 112187
18997 -109551 -148358 -19900 -403415 -38005 -49337 -105092 -178188 -14564 -72465 -148441 -158353
18986 -158353 -247332 15769 -138985 233787 415392 -234843 -39338 -93091 -222666 152451
18975 147142 35254 -148835 -298299 66095 -222182 -53873 175220 -63205 26736 -402582
18964 -158298 -136905 191291 -275180 -171432 -112010 -73516 -244791 -263592 7077 49263 90728
18953 90728 151201 28616 -302218 -49784 -136105 70973 149228 176711 -119377 160742 198711
18942 198711 394771 56444 -18597 13121 -79319 -68227 -3363 -116345 346 -8138 -79664 91238
18929 -182198 -79592 -430926 323183 -4453 37443 120531 216692 39919 134365 82719 53888
18918E3888N3100c8900q6171J54k6560k44445a72442h898p1546m2062k13244a6803
18905d5n9154j98275f4011e27n8876F0521L6393P7727c76354D3444b17637l38561
18893e56198B870c5650k38635a21432C96712A46024c208A91008d32577a61929
18882c23149A4346J7349c32929Q3134E2305i9578A46091R435B4333b92934P8413
18871b14521A90543a34133A06163n0833K26144D0611d3876K1272A39749A944b5943
18859a45013b1794I3096b70510c0908n504I4331a03311A28382c85955g8955A10207
18847C68480A2338a99256E0348c87588D2938a23973g74n5992C3192J05771b63224
18835B16242i8292r3941k85231g2662l6974k8257B71465a30074q8791B11282q4782
$$ plain form
18918 53888 106988 -38900 -125071 -124917 -151477 -395922 -172442 -8898 -80444 -122506 -335750 -16803
18905 -45 -59199 -257474 -64011 -527 -59403 60521 96914 174641 -376354 43444 -217637 -556198
18893 -556198 2870 -35650 -274285 -121432 396712 146024 -3208 191008 -432577 -161929
18882 -323149 14346 31695 -332929 -249795 52305 -99578 146091 155526 24333 -292934 -214521
18871 -214521 190543 -134133 106163 55330 281474 40611 -43876 -22604 139749 1944 -25943
18859 -145013 -21794 93096 -270510 -30908 -36412 94331 -103311 128382 -385955 -78955 110207
18847 368480 12338 -199256 50348 -387588 42938 -123973 -774 -56766 33192 138963 -263224
18835 216242 -98292 -192233 -477464 -72662 -109636 -137893 271465 -130074 -218865 211282 126500
18824A26500O1049o1286M0555L0912e7816A1990R3510J34275k0854f1429N02a3759
18811D8100a02418C45428A08238A2553N2643J18137F3186a76241e280k3894j22806
18800a51980e6662m09962b02070K4939g3243j34253G1342J93395A4285a13666
18789i3341E3945d64288J91409H1613k8830b08064A70943D4941a1685k86368g8763
18777a35392C1954R6660a67294N37L4491P461L8262b2945A02158b38930A15630
18765A67953q0794a74960A57967Q6437H4133J98828c9413A3897a56952A44293
18754B59785r2917M6310a55764k95078K11202I8915J2777a27394A93849b4286
18743d56821B38032b30338j23601J40128a06022C2943L46339a17288j95381A43014
$$ plain form
18824 126500 187549 126263 166818 197730 -57816 11990 105500 239775 218921 -61429 -60927 -13759
18811 48100 -102418 345428 108238 12553 65196 183333 63186 -176241 -5280 -29174 -151980
18800 -151980 -56662 -466624 -202070 -177131 -73243 -207496 71342 264737 14285 -113666
18789 -93341 53945 -464288 -272879 81613 52783 -208064 170943 44941 -11685 -298053 -78763
18777 -135392 31954 128614 -167294 -166757 -132266 -124805 -86543 -22945 102158 -238930 115630
18765 167953 87159 -174960 157967 244404 84133 282961 -39413 13897 -156952 144293
18754 259785 166868 213178 -155764 -450842 -239640 98915 111692 -127394 193849 -24286
18743 -456821 238032 -230338 -353939 -213811 -106022 32943 379282 -117288 -312669 143014
18732a71325A41636e0372j63583J05058A07008a08061j2267A28588Q0726D8784
18721B21919h6506a6832A89456b71912A58962a39095j18282h5257j18621g4998
18710f1555a4451j09038r1760A80948a90509O9222m2135N1069j64956a23358h692
18698H3690L83029i5029E7690b51341e3349G7677J88313a2213D72055A51840a40725
18686c31816A49147i8438j40681A43896F1957j4674b38653j16202J37888A28021
18675d6834F7306c835j17239L1957c996k11564A83014c56830B01680f8401A15820
18663e4969j471l0681N708l6065a6817j48962k8659k11047a77003k6474o7042
18652b70519a08215o4359O4539j00437k1971R9967A50625p4962J5076Q2109H1277
$$ plain form
18732 -171325 141636 -50372 -213955 -108897 107008 -108061 -120328 128588 209314 48784
18721 221919 -86506 -16832 189456 -271912 158962 -139095 -257377 -85257 -203878 -74998
18710 -61555 -14451 -123489 -215249 180948 -190509 -121287 -163422 -112353 -277309 -123358 -8692
18698 83690 466719 -95029 57690 -251341 -53349 77677 265990 -12213 472055 151840 -140725
18686 -331816 149147 -98438 -239119 143896 61957 47283 -238653 -354855 -216967 128021
18675 -46834 67306 -3835 -121074 -89117 -3996 -215560 183014 -356830 201680 -68401 115820
18663 -54969 -56440 -87121 -81413 -117478 -16817 -165779 -194438 -405485 -177003 -203477 -270519
18652 -270519 -108215 -172574 -108035 -208472 -230443 -130476 150625 75663 90739 172848 81277
18640a1971j6768A63001N4718i1220F1183Q1803C1697g4916E5136f33571b81052
18628B41364g9117A69822F4194Q7996B0776J0060R3683B4556a44212N0503j63987
18617b57696a8884j5381C42106A37951a41169C73794E3682b80363d0736j07275
18607a48011m0715E1609a62023D0763b02177k1965p0890A12582C9082J50258c72217
18595c6498A13786P5294p8033k8947a71086A23332f14I402a05451n560j47392
18584b58403b0731h695H8644e6004A52285b59552A72796b78172f4858A2887a02313
18572e36069a78319J6056J527J3740C301Q3107M088M9182A9843c24794J19170
18561b05624A01696i489j96396j0601g2615p2084C9866b84223R9945N1117m2856
$$ plain form
18640 -11971 -28739 163001 217719 -91220 61183 142986 31697 -74916 55136 -633571 -281052
18628 241364 -79117 169822 64194 152190 20776 30836 124519 24556 -144212 -93709 -257696
18617 -257696 -18884 -34265 342106 137951 -141169 373794 53682 -280363 -40736 -148011
18607 -148011 -188726 51609 -162023 40763 -202177 -224142 -295032 112582 39082 189340 -372217
18595 -36498 113786 189080 111047 82100 -171086 123332 -614 9402 -105451 -111011 -258403
18584 -258403 -20731 -8695 88644 -56004 152285 -259552 172796 -278172 -64858 12887 -102313
18572 -536069 -178319 -162263 -160736 -146996 3301 86408 90496 139678 19843 -324794 -205624
18561 -205624 101696 -9489 -205885 -216486 -72615 -144699 39866 -284223 -184278 -133161 -176017
18550a76017A16160m624b27142B92622d947k17629B88700d9491B08164A01066
18539a8561k5367j40052K7009D4539c04994G4328b58045B18738d4847B4694K65840
18528B90534j00196d7353q4503C682a76544O602A9527a3888j16587B44418b78408
18516B12533a82255H0253f8330j8533C47090A24373a38899l4852O8515G7584H750
18504c2793J2863B2005J5314m256J62698j6540o5310b9215H164a21180r4313b5584
18491d5914E4671a44909A32444b96031J40782I0015a23791E5726g8747o6394O8233
18480g6908A5625b81438A04093i5263j7839A8301K19285Q753o8886F5265b02796
18468a61051B67325i3196C02452A9893b24264G1816J08932G9714b03946f3720
$$ plain form
18550 -176017 116160 111536 -227142 292622 -4947 -222576 288700 -49491 208164 101066
18539 -18561 -43928 -183980 -156971 44539 -304994 74328 -258045 218738 -44847 24694 290534
18528 290534 190338 -47353 -131856 3682 -176544 -169942 19527 -13888 -130475 244418 -278408
18516 212533 -182255 80253 -68330 -86863 347090 124373 -138899 -173751 -105236 77584 8750
18504 -32793 -19930 22005 37319 33063 195761 179221 113911 -29215 8164 -121180 -215493 -25584
18491 -45914 54671 -144909 132444 -296031 -155249 90015 -123791 55726 -78747 -145141 -76908
18480 -76908 15625 -281438 104093 -95263 -113102 18301 237586 246339 177453 65265 -202796
18468 -161051 267325 -93196 302452 19893 -224264 71816 180748 79714 -203946 -63720
18457A8933a38406E8430a79298j15059J057B64773a4084G9497a45726o59o5978
18446b12363D9789b38691I6652b01207e8587n1539c5515j49310j23114A20554
18435B9380a99896h4826d0056I691a23086j99828A86047b62573B5242a08046C84686
18423d85825I4734f2578k59031a1770A75379m7582a90229j01449Q8782j3075R5271
18412a20700D4239J28462c46632e6473F6301R3844g0576D5723k70L3206b66487
18400A43183f0282k40303N7716i0742O941H9275h6628j54254h5266j4209E2286
18388a77511B07143p9305f0833A47527a71367A28982c31897a20287j2097A45021
18377F7400b69745J16033P315J7192B04176k6632d3314H1805C3365J92942k541
$$ plain form
18457 18933 -138406 58430 -179298 -294357 -293300 264773 -14084 79497 -145726 -146385 -212363
18446 -212363 49789 -238691 96652 -201207 -58587 -110126 -35515 -184825 -307939 120554
18435 29380 -199896 -84826 -40056 9691 -123086 -322914 186047 -262573 25242 -108046 384686
18423 -485825 94734 -62578 -321609 -11770 175379 127797 -190229 -291678 -202896 -215971 -120700
18412 -120700 44239 172701 -346632 -56473 66301 160145 -70576 45723 45453 78659 -266487
18400 143183 -60282 -300585 -242869 -90742 -83801 89275 -86628 -240882 -85266 -99475 52286
18388 -177511 207143 127838 -60833 147527 -171367 128982 -331897 -120287 -132384 145021
18377 67400 -269745 -153712 -146397 -129205 204176 177544 -43314 81805 33365 226307 223766
18366B23766k9202a64553A34264e4890E2549M3668R851b26186D8578f0228n5005
18355a15233m2979j33320a01206E1498b42951A14511c03650a49406a0962j12041
18345a23003j0571p6092K6211I7026J18169a31617f2664B890J21380a87143A39437
18333c53283c421H062a69565g2124A5332a47872l8123h2030k07036a25707B35755
18321a72209F210a91380A0053d13166e4145h731k41571D8780b14344i6830k2417
18310a19247N9060A39668L4834c9616E3526c22246A28763a81882j74039A01165
18299d8575p7494A67956F6534b92740a09633B66826M6307J5274A08405A0225J49306
18288A59531d6013m76986K17548a37220C8828h6118j30162B6796J38959b89382
$$ plain form
18366 223766 194564 -164553 134264 -54890 52549 96217 106068 -226186 48578 -60228 -115233
18355 -115233 -158212 -291532 -101206 51498 -242951 114511 -303650 -149406 -10962 -123003
18345 -123003 -133574 -209666 -183455 97026 215195 -131617 -62664 2890 124270 -187143 139437
18333 -353283 -3421 8062 -169565 -72124 15332 -147872 -185995 -82030 -289066 -125707 235755
18321 -172209 6210 -191380 10053 -413166 -54145 -8731 -250302 48780 -214344 -96830 -119247
18310 -119247 -60187 139668 174502 -39616 53526 -322246 128763 -181882 -355921 101165
18299 -48575 -126069 167956 66534 -292740 -109633 266826 313133 328407 108405 10225 159531
18288 159531 -46013 -522999 -305451 -137220 38828 -86118 -216280 26796 165755 -289382
18277A70346J47121G2990C0955J04793K821b8995k25020A14492J59391b15492
18266a74092A7002L9788J10783e4260E6241F284a91655A93194p7017a41361d8944
18254B0356b20897B65760A32327i1069A04065b06697A25811h6502r2046A63259
18243I6008k0292J26312J3069e8291j61586e6401n4465n7016b9726A21623b95924
18231c21109M1362A054d0157l14389B94366e3310j33286k243j15526A10026i5312
18219a45349f1595k0704B11044e1030l1145E0115g0833A10030J86982g4270C13560
18207c20369c0878A86246d1744j33872D1195a61617A58193Q0879b9675B60341
18196C36283e4556C8420a31593A16817c9519j57451a0519j26402q4675A4095K63744
$$ plain form
18277 170346 317467 72990 30955 135748 138569 -28995 -254015 114492 273883 -215492
18266 -174092 17002 56790 167573 -54260 56241 6284 -191655 193194 116177 -141361 -48944
18254 20356 -220897 265760 132327 -91069 104065 -206697 125811 -86502 -178548 163259
18243 96008 75716 202028 215097 -58291 -219877 -56401 -110866 -167882 -29726 121623 -295924
18231 -321109 -279747 1054 -40157 -354546 294366 -53310 -186596 -188839 -304365 110026 -95312
18219 -145349 -61595 -82299 211044 -51030 -82175 50115 -70833 110030 297012 -74270 313560
18207 -320369 -30878 186246 -41744 -175616 41195 -161617 158193 239072 -29675 260341
18196 336283 -54556 38420 -131593 116817 -39519 -196970 -10519 -136921 -221596 14095 277839
18185B77839j29273a43843B51333b6713j00802K1176B9319j4454b39348h8107
18174F755L1097b91995I3068d5198j71074P4012l4626A13991K9110a24406E3911
18162c92493e7575p0269E1862J61887c03559B353P0082b57538c7566A85416h9240
18150b76316a07640M6251K7707B1302a32636A08413d12158C1802a96091A59557
18139f0072j80269A44040o6604J58422p1241b18230B43538a15170M2115b168j11663
18128a13831n6352h354K742I9319K2252K03702h2750r1723k0486r0349A32694
18116a18706d7839B47169iA10313c8338A02446L816h0149A60237a24881p5085
18105a99966e1027m2726b1002q8093I601J26555i8052K7636A62830m2712J41634
$$ plain form
18185 277839 148566 -143843 251333 -26713 -127515 -106339 29319 14865 -239348 -88107
18174 6755 37852 -291995 93068 -45198 -216272 -142260 -176886 113991 143101 -124406 53911
18162 -392493 -57575 -127844 51862 213749 -303559 2353 72435 -257538 -37566 185416 -89240
18150 -276316 -107640 -61389 -33682 21302 -132636 108413 -412158 31802 -196091 159557
18139 -60072 -240341 144040 77436 235858 164617 -218230 243538 -115170 -73055 -2168 -113831
18128 -113831 -170183 -8354 -5612 99319 121571 325273 -82750 -174473 -194959 -285308 132694
18116 -118706 -47839 247169 -9 110313 -38338 102446 106262 -80149 160237 -124881 -199966
18105 -199966 -51027 -93753 -21002 -109095 9601 136156 -98052 -70416 162830 120118 261752
18094B61752d5229A58322g6993F0691L9737P0095b7540C15526d6276A06125a68203
18082b28570M9050B6322a78622B4770b17923A62098a05628k8007p7033J1273O6602
18071a32793o7553l3133B094J22981K3801Q7148a17233A31415b17853G1731J29592
18060B01323b57608c15k9965C67122j28007h8819C18783b55280A46752J52603
18050B99355a07357B56149b98437A45708b3378k06C6833K8692a13155C3186e3380
18038A24867f2911k1523a2687H5759h5606k9172D7691J39895F2041e3457B35602
18026A45941b24510r2890A58239J738a77208l9258e312A51137a44672A97679p7042
18015A20637b96420a45796r8369f6994B88679N9139j72081G9105b8514A62612
$$ plain form
18094 261752 -45229 158322 -76993 60691 100428 170523 -27540 315526 -46276 106125 -168203
18082 -228570 -179520 26322 -178622 24770 -217923 162098 -105628 -133635 -210668 -199395 -132793
18071 -132793 -200346 -233479 2094 125075 148876 236024 -117233 131415 -217853 71731 201323
18060 201323 -257608 -315 -30280 367122 239115 -88819 318783 -255280 146752 299355
18050 299355 -107357 256149 -298437 145708 -23378 -23584 36833 65525 -113155 33186 -53380
18038 124867 -62911 -84434 -12687 85759 -85606 -114778 47691 187586 62041 -53457 235602
18026 145941 -224510 -317400 158239 159977 -177208 -216466 -5312 151137 -144672 197679 120637
18015 120637 -296420 -145796 -244165 -66994 288679 347818 175737 79105 -28514 162612
18004a64809m4020a7146I4891a13907J1366n12875b76143J30006A66573E3960
17993e9111j34446A03402b96477e3675q2669A807a44565r4197Q8338m14978a7270
17981c89826a4432l0690B67588M0040a45628L9081a0239D6960b46616a01222I3985
17969b5272A77594C4080h8860E1297a62773a7782j56896A10472a42195A8447h8520
17957E1599K212G493a61620B21904b42558A79105C7036J24855J96406i3147D3790
17945C3404R4827O5017J38352i8514j76290d6687D5288J36165j8366n3580E4480
17933a72015P4205k1996B36325f037A89136b30536i0897D9436b17432c2651O968
17922b5683j1519q4741D3638A3140b14593A94725C0783a87440A44241a33923m5429
$$ plain form
18004 -164809 -208829 -17146 94891 -113907 -102541 -615416 -276143 -146137 166573 53960
17993 -59111 -193557 103402 -296477 -53675 -136344 1807 -144565 -238762 -150424 -565402 -17270
17981 -389826 -14432 -45122 267588 307628 -145628 -106547 -10239 46960 -246616 -101222 93985
17969 -25272 177594 34080 -88860 51297 -162773 -17782 -174678 110472 -142195 18447 -88520
17957 51599 53811 7493 -161620 221904 -242558 179105 37036 161891 358297 -93147 43790
17945 33404 128231 193248 331600 -98514 -274804 -46687 45288 181453 163087 109507 54480
17933 -172015 -97810 -119806 236325 -6037 189136 -230536 -90897 49436 -217432 -32651 -25683
17922 -25683 -37202 -121943 43638 13140 -214593 194725 30783 -187440 144241 -133923 -179352
17911a79352h873j8714B23891D6827e6786l25E6739b00380i3229c6727F5232H350
17898A85278q3401d2074A59451b20777K4177D75581C5253a65454Q1737K4847A07803
17886E5729K00244g1098j0941K3332A36398n7081O5699k9190K21175F8502K3509
17875I2011a40974I418P530a21515F2935d5250J1418N373j93327C937J88392m9418
17863A42911f9239k159C78518C522N8044b6806j82987N5932B14490D9635J55174
17852B04809f7889k4668q2600C683f9032L193H9690N2411I416R6949a09573A45826
17839e7940k21568A62476C9696c6686j33201B95673E1336b9440p77A0311J37744
17828A48055E4592K34369F6327b05154N4700r6294L7496d7930e108E2004B4921
$$ plain form
17911 -179352 -8873 -27587 223891 46827 -56786 -57111 56739 -200380 -93229 -36727 65232 8350
17898 185278 101877 -42074 159451 -220777 -196600 475581 35253 -165454 -83717 -58870 107803
17886 55729 255973 -71098 -82039 -58707 136398 79317 145016 115826 337001 68502 92011
17875 92011 -140974 9418 16948 -121515 62935 -45250 -33832 -28459 -221786 3937 192329 142911
17863 142911 -69239 -71398 378518 3522 61566 -26806 -209793 -153861 214490 49635 204809
17852 204809 -67889 -92557 -175157 3683 -69032 -65839 89690 142101 9416 106365 -109573 145826
17839 -57940 -279508 162476 39696 -36686 -169887 295673 51336 -29440 -30217 10311 148055
17828 148055 54592 288961 66327 -205154 -150454 -246748 -209252 -47930 -5108 52004 24921
17816H1514Q1166n0339O2923l2542a5955B90037G4605C0670a37366B44065d4191
17804a83037i0733B40052c53481B17319A02617a44479j77682m4560d949j05761
17794a10710A21474a57114d0104k0357A44156a3991r8093B8792L03737H6775f5477
17782C1K37619A07308a7737k72290B39817h7354G0006a8746M55F2026a21753M2239
17770g9514q9067p4016a20507A09537a35916L270j02368C91324b43052j20755
17760c63807J03500a18782A21557D4612g3744j89382C49062C1783D989b46012
17749A61666c2691r1285j48737J24203E1441g0659K3339B76971c7716J0773A16298
17737b54249E8161J23796H4884J14176h4237G6503a29359N4078j35279C60494
$$ plain form
17816 81514 162680 112341 175264 142722 -15955 290037 74605 30670 -137366 244065 -44191
17804 -183037 -90733 240052 -353481 217319 102617 -144479 -322161 -366721 -4949 -110710
17794 -110710 121474 -157114 -40104 -60461 144156 -13991 -112084 28792 332529 86775 -65477
17782 31 237650 107308 -17737 -290027 239817 -87354 70006 -18746 -18291 62026 -121753 -79514
17770 -79514 -168581 -242597 -120507 109537 -135916 -132646 -235014 391324 -243052 -363807
17760 -363807 -260307 -118782 121557 44612 -73744 -263126 349062 31783 4989 -246012
17749 161666 -32691 -123976 -272713 -148510 51441 -70659 -47320 276971 -37716 -26943 116298
17737 -254249 58161 181957 84884 199060 -84237 76503 -129359 -75281 -210560 360494
17726G6868c25845B5876K3619c50404a38665J5397A76371d57193G0818a39707
17715a95670B34272A06518b69564B0109i5999o5817e2156A15176K88150j65758
17705B37568A1158a4274E3983h0723B04602L2946e7027B93011b96324A54933J14944
17694B69877A3178J95205a34506B50798d1288F4152J3213b80486B6517K0690Q2164
17683A29371d5080a171m5983D55729j99027j08523F3931i6038p2951B36448b33086
17671e8279r1255d7227B12820c88813Q6895B2863P1403C3951a12051j4195B8304
17659A29072c296k391A90026H0079L193h1646C0721R6999m199a54832l1143D22921
17646A76164c102F7754g9082c6643m9302B74575i240D07935A98805H2161a7859
$$ plain form
17726 76868 -325845 25876 49495 -350404 -138665 -123268 176371 -457193 70818 -139707
17715 -195670 234272 106518 -269564 20109 -95999 -161816 -52156 115176 403326 237568
17705 237568 11158 -14274 53983 -80723 204602 237548 -57027 293011 -296324 154933 269877
17694 269877 13178 208383 -134506 250798 -41288 64152 77365 -280486 26517 47207 129371
17683 129371 -45080 -1171 -47154 455729 256702 148179 63931 -96038 -168989 236448 -233086
17671 -58279 -149534 -47227 212820 -388813 -301918 22863 94266 33951 -112051 -126246 28304
17659 129072 -3296 -5687 190026 80079 83272 -81646 30721 127720 123521 -154832 -185975 422921
17646 176164 -3102 67754 -79082 -36643 -85945 274575 -9240 407935 198805 82161 -17859
17634H2629k2386a73722L4100B68027G3899e0383B76784e4419R353p2550a8778
17622I9009D7134K5980L62106g0703A63939G6530e9278a2837C5669d7330C67328
17610A32685m1657R8025J06218A6660J03178h4339A37009h1078b2038j06867L990
17599a24915G5709b19421D76004A06774J56324c3797j41218C2378N5631J1284
17589I9293C8703K00452a03129N1214m8902K0544A93485M7909j08378m3549J73083
17578B62550f8467I74c3059B07603k0217I594J18350J00572b9573A08400C4738
17566C60225b4166D2972k437b4559j47974C3948k139J09466K63305A64813a39862
17554F1442N221j2947J77512L5704K662B0343P9426g3540E5817K39079a45754
$$ plain form
17634 82629 60243 -173722 -139622 268027 73899 -50383 276784 -54419 -45066 -117616 -18778
17622 99009 47134 73114 435220 -70703 163939 76530 -59278 -12837 35669 -47330 367328
17610 132685 91028 189053 295271 16660 119838 -84339 137009 -81078 -22038 -128905 -124915
17599 -124915 75709 -219421 476004 106774 263098 -33797 -175015 32378 88009 99293
17589 99293 38703 239155 -103129 -51915 -100817 -80273 193485 241394 133016 89467 262550
17578 262550 -68467 974 -33059 207603 187386 9594 127944 228516 -29573 108400 34738
17566 360225 -24166 42972 40535 -24559 -172533 33948 31809 141275 404580 164813 -139862
17554 61442 66663 53716 231228 266932 269594 20343 99769 -73540 55817 294896 -145754
17542A35651f1066m5515a5116E21010h6037A42727h1077C09228a53079q1874A96826
17530a57321e8354A46359B9331K92719A57622c1162C82422a88470C44539f2802
17519C06226O4107j79420C9061J02057g3340A11630L8356L8637b13021f9207A82010
17507A36448n3534M0472N0837j4911d4229F6779L07688B1192b40074B35391j06894
17496A28497l082J67567F2257J15337a42888q7165A78391d736E37044A38667a94432
17484A0833J35316L2372A4745K34425A20641K5086F4242b51150R0325B69941E3111
17472A10536J06965K53004a65898C4289d5582D24394a65060p0192A39404e2969
17461A75317k56f2842A49820j3372a03348B65311r3354a84135c3526J6081G9898
$$ plain form
17542 135651 -61066 -106581 -15116 521010 -86037 142727 -81077 309228 -153079 -234953 196826
17530 -157321 -58354 146359 29331 322050 157622 -31162 382422 -188470 344539 -62802
17519 306226 370333 190913 39061 141118 -73340 111630 149986 188623 -213021 -69207 182010
17507 136448 82914 123386 174223 159312 -44229 66779 374467 21192 -240074 235391 128497
17496 128497 125415 292982 62257 177594 -142888 -230053 178391 -4736 537044 138667 -194432
17484 10833 146149 178521 14745 249170 120641 145727 64242 -251150 -160825 269941 53111
17472 110536 217501 470505 -165898 34289 -45582 424394 -165060 -235252 139404 -52969
17461 175317 175061 -62842 149820 136448 -103348 265311 171957 -184135 -33526 -17445 79898
17449A56682J25344q9848J071K20769G3986L49802E3086J56962L35645f1479D1751
17437A32691M155j3224Q2242r1607L50423O0686a6608C69689J20010j52629p2983
17426B64087l7841H1659c1748A51818M4250J61395L0808G6493I205J93365K12042
17415D14612H6758Q3714J07137I8401J7393l2472R1962k0136B5473a45935M2832
17404a03103A35311M9414A0310J70273j8777M4149n2094Q0066k0947E1115J19609
17393A70724J53126E074L65809A57374J035i3839C12063B578J37340F8165i1151
17381h5933D09241j00388o6497o0454d381C23970H0269J79602q1207J42996C7881
17369g4964A34308k9657J56383h6910B20272p8530k1399N8020M7984a14925C85410
$$ plain form
17449 156682 282026 192178 193249 414018 73986 423788 53086 210048 545693 -61479 41751
17437 132691 136846 123622 205864 114257 464680 525366 -16608 369689 489699 337070 264087
17426 264087 226246 81659 -31748 151818 196068 357463 388271 76493 9205 202570 414612
17415 414612 86758 170472 277609 98401 115794 83322 175284 155148 25473 -145935 -103103
17404 -103103 135311 184725 10310 180583 161806 205955 153861 233927 212980 51115 170724
17393 170724 323850 5074 370883 157374 158409 -93839 312063 2578 139918 68165 -91151
17381 -85933 409241 308853 242356 181902 -4381 323970 80269 259871 178664 321660 37881
17369 -74964 134308 104651 261034 -86910 220272 141742 120343 178363 226347 -114925 385410
17357I5400J86499E3078K58582N1129f274B67813j09158L3453o1969a7213B65635
17345C63060A23939L57561A09301D8434K1177b18803F9007a768A84164Q2092O4574
17334C30830A27061C0759J11514K59195A5731L68030A15170k3353K09567d2652
17323a79028D03286j20037a9372B14677a6700C43425A24059N773M65843d0771
17312h1516G6015J37450a80206A6801J17301d608H6238L44849j58456d8518C48984
17300B99642N6638q6658e9243B66264r4554j5952Q5019I6546L97298A38394h573
17288A78882K84503G7983h6767A88281l2734p3481C9552M08498E5748R9439J13602
17277B68789j11859L74755k47704Q9984A16696P7248m4175K39561j58953a84143
$$ plain form
17357 95400 281899 53078 311660 362789 -6274 267813 158655 192108 130139 -17213 265635
17345 363060 123939 481500 109301 48434 69611 -218803 69007 -1768 184164 266256 330830
17334 330830 127061 30759 142273 401468 15731 383761 115170 91817 301384 -42652
17323 -179028 403286 283249 -19372 214677 -16700 343425 124059 129832 595675 -40771
17312 -81516 76015 213465 -180206 16801 134102 -4608 86238 431087 272631 -48518 348984
17300 299642 356280 269622 -59243 266264 171710 155758 240777 96546 493844 138394 -8573
17288 178882 463385 77983 -86767 188281 155547 82066 39552 448050 55748 155187 268789
17277 268789 156930 531685 283981 373965 116696 193944 149769 389330 230377 -184143
17266D75888j53408E363L18150A30661K07076J09044A69013q1980J06877n7788
17256A36122R3814a5179E04123B37991j4666J63454k1629j50898q1768E7417J80189
17245B37606a90882h7326C59553h4173B66388R1243f7451C92083j60752C6502
17234c2300B62009A10326b1045B50016J96717C1923L50843m5428G1343L41477
17224D12820J21118A69617i1748B83506A33761K42042e6106G2628p459J55510
17214B20679P4829E8346a44532D24344A21684N2183D5368j7984K49038m4495J01876
17203C33803j38383L29681d1922g425A04867K85257a52210B00991F1917K80349
17193C42266m6929j4333J4900a09518A46052C2854L45806h778B84599M74893A84462
$$ plain form
17266 475888 322480 5363 323513 130661 337737 446781 169013 87033 193910 136122
17256 136122 229936 -15179 504123 237991 223325 386779 365150 214252 132484 57417 237606
17245 237606 -190882 -87326 359553 -84173 266388 357631 -67451 392083 231331 36502
17234 -32300 262009 110326 -21045 250016 446733 31923 382766 337338 71343 412820
17224 412820 533938 169617 -91748 283506 133761 375803 -56106 72628 65169 220679
17214 220679 295508 58346 -144532 424344 121684 173867 45368 27384 276422 231927 333803
17203 333803 195420 525101 -41922 -7425 104867 390124 -152210 200991 61917 342266
17193 342266 295337 281004 295904 -109518 146052 32854 378660 -8778 284599 759492 184462
17181B45763L8875O1120r9625J03448r6385m9940M5429M9333A00468L29809M2028
17170D72305A76315J37501E67K81039Q2296J31966B30246O5006j13947k3070l0787
17159A27448J47220K78943j01176j8594J91369l04290A41423J54227l0420e4337
17148B77136f9380G2151l1000J71759J68136L59641C26391q3349c0589C98783
17137D27207A18479m9923J74830J34874n6026A49344K88987A83049L35038o2438
17127D55649G2530K21038J62331j08819J64478J7399k61220H5992a00163C34081
17116E61532l8070p4229A90759b0724A07771c7910B69194K0946H3940M60270j67260
17105C76950L49733C27456J27443A76897M12672o9676k40500J50882F4819L14745
$$ plain form
17181 245763 284638 345758 246133 349581 253196 203256 248685 298018 100468 430277 472305
17170 472305 176315 313816 567 281606 363902 495868 230246 295252 181305 158235 127448
17159 127448 274668 553611 452435 433841 625210 320920 141423 295650 265230 -54337
17148 277136 -69380 72151 41151 212910 381046 740687 326391 243042 -30589 398783
17137 427207 118479 68556 243386 378260 322234 149344 438331 183049 518087 455649
17127 455649 72530 293568 455899 347080 511558 528957 267737 85992 -100163 334081
17116 561532 523462 449233 190759 -20724 107771 -37910 269194 290140 83940 544210 376950
17105 376950 726683 327456 454899 176897 589569 519893 279393 430275 64819 379564
17095C79564J36581L1235B59818K37179B36749J74990J00380G290N82511n530
17085E84271j57216J28324j27059J73303k85700L3729A47994L03193J64827G8767
17074C34205J43761j91700K42176R773k56764l7796K49533k03135P7490j53327
17064B14216L53382I7194K9327R2101R9840J06898J54132k3901B35829M9375M17609
17053G02813k02064j60109K12943L9620J22176l32936J48142j75793J79863m7715
17043D86940A58713K29312A62862P28054B99205M11395C42052L61916L532l06186
17033D01314l1968J84952j45773L11519B60733L30709k41623N5737K57321O2461
17023G25338k90246J27537n3822J52982j40009L4476j81391J31776L1738k0527
$$ plain form
17095 379564 516145 547380 259818 496997 236749 411739 512119 7290 589801 584271
17085 584271 427055 555379 428320 601623 315923 349652 147994 451187 616014 78767
17074 334205 477966 286266 528442 538215 281451 243655 493188 290053 367543 214216
17064 214216 567598 97194 126521 218622 318462 425360 579492 555591 235829 285204 702813
17053 702813 500749 340640 553583 593203 715379 382443 530585 354792 534655 486940
17043 486940 158713 388025 162862 890916 299205 710600 342052 703968 707500 401314
17033 401314 369346 554298 408525 720044 260733 591442 349819 405556 662877 725338
17023 725338 435092 562629 508807 661789 521780 556256 374865 506641 538379 517852
17013E17852M65054C79292k9110L48277p1394J86959R8204k83321p5425J19336
17003F72818K2565j21225J41101j85861J55865J7346C25392P9370L13017C54592
16992C73117K44691J57348k37401K91764l65074Q5099j6204K76991o5128C67080
16981F95364o3290J86868R7519p3808K7361j14225J16841k45604L11310l54675
16971E83661L39560K2425k82478K33327k67124L0595p8692L67818l50723J52092
16961G50461J51502J20573l08272J13366k4948q0456J00517K73164n36559K95496
16951H54844j24806Q2984J79850p3051J81584r8907M1837K8895L7962R0556K7927
16940A229675m14586J58787n5076j250L4566K71046m89919k077K40681K49205
$$ plain form
17013 517852 982906 379292 350182 698459 627065 814024 912228 628907 553482 672818
17003 672818 695383 574158 715259 529398 685263 702609 325392 404762 717779 354592
16992 373117 617808 775156 537755 829519 464445 549544 533340 810331 745203 367080
16981 695364 632074 818942 916461 842653 870014 755789 872630 627026 938336 583661
16971 583661 923221 945646 663168 896495 629371 659966 581274 949092 598369 750461
16961 750461 901963 1022536 714264 827630 802682 722226 822743 1095907 559348 854844
16951 854844 730038 813022 992872 919821 1101405 1002498 1044335 1073230 1111192 1201748 1229675
16940 1229675 815089 973876 918800 917550 952116 1223162 733243 731166 971847 1221052
16930A221052j27817L1010j98833L25293p822j17649q8720K10554K05426j72855
16920A279639j81944K99885j5831k39727L06601q1453k25258L75050K47198q26462
16910I37698N21720j09663J83628J1185N2976N4542K09758L6973k74012J64210
16900A789015P3842l86729L89340m38989J31031k13998K09910J22614k08481J59931
16890A627486M1279K87917K8735k04765o5470J51546k5242J3930P9154j58196
16880A776374j912L35749q7094K11464j32694p6644L6060l13318P26032k57028
16870B216989n3041L23377j69483l20994L13453K22294k72975l551Q7488R7498
16860B441055J75104Q0095k3208P0511l80806L33493Q6005j9143m50653L06097
$$ plain form
16930 1221052 1093235 1124245 925412 1250705 1242883 1125234 1036514 1247068 1452494 1279639
16920 1279639 1097695 1397580 1381749 1142022 1448623 1367170 1141912 1516962 1764160 937698
16910 937698 1459418 1349755 1533383 1544568 1597544 1652086 1861844 1898817 1624805 1789015
16900 1789015 1862857 1476128 1865468 1426479 1557510 1343512 1553422 1676036 1467555 1627486
16890 1627486 1668765 1956682 1985417 1780652 1715182 1866728 1841486 1855416 1934570 1776374
16880 1776374 1774462 2110211 2023117 2234581 2101887 2025243 2061303 1747985 2474017 2216989
16870 2216989 2163948 2487325 2317842 1996848 2310301 2532595 2259620 2256069 2343557 2441055
16860 2441055 2616159 2696254 2673046 2743557 2362751 2696244 2782249 2763106 2312453 2618550
16850B618550O30735l63495K67774j48456K2627R3423l2620k9015M02129n57R0631
16839C551726o4628q3817L04562k87284J27538O7072N14083k55423L06065l49267
16829C830627N34655l12357J83472K54828O2190k72726K94418O9931J1563L93991
16819E050592k69485M30847k62115K51147K57063m4187N8912J67960K91048m8967
16809E882815l6623M1995K88932K10982Q5268k98599O46389r8690K71834K45414
16799G239717K47830L8994K38214L35091M31235K7888K57074J54959J92475Q1405
16789I244882K96988K28829L38365K91109N27362J13408M0419Q32576K28716L43385
16779A2486039N50007Q4213L23708N85863P96947M01364J69810O05969Q20610
$$ plain form
16850 2618550 3249285 2885790 3153564 3005108 3027735 3121158 3088538 3059523 3461652 3461095 3551726
16839 3551726 3487098 3403281 3707843 3420559 3548097 3615169 4129252 3873829 4179894 3830627
16829 3830627 4365282 4052925 4236397 4491225 4553415 4280689 4575107 4645038 4656601 5050592
16819 5050592 4781107 5211954 4949839 5200986 5458049 5413862 5472774 5640734 5931782 5882815
16809 5882815 5846192 5888187 6177119 6388101 6473369 6174770 6821159 6722469 6994303 7239717
16799 7239717 7487547 7526541 7764755 8099846 8531081 8558969 8816043 8971002 9163477 9244882
16789 9244882 9541870 9770699 10109064 10400173 10927535 11040943 11081362 11913938 12142654 12486039
16779 12486039 13036046 13120259 13443967 14029830 14826777 15228141 15397951 16003920 16824530
16770A6824530O88707M32954N87657P98182O72244J247789M5836J294459J181176
16761B3773534N16956J484375J127992Q72920J154622J787180J311503J369220
16753C3398302J653701J745259J552545K150351K266913J847694K520591K904195
16745E0039551K730325K851759L251261L400951L786535L854149M353191M929264
16737G9196986M972723M882747O127013N934555O228066O786240P047459P690801
16729A28866590P771098P426574Q054752P540146P065936O687891O079108N035307
16721A84527402M203062K957883J639481J10117j502849l065246l859132n438726
16713A79571992n548754o910218p523409p670088q023157p733473p611207p486875
$$ plain form
16770 16824530 17513237 17946191 18533848 19332030 20004274 21252063 21297899 22592358 23773534
16761 23773534 24290490 25774865 26902857 27775777 28930399 30717579 32029082 33398302
16753 33398302 35052003 36797262 38349807 40500158 42767071 44614765 47135356 50039551
16745 50039551 52769876 55621635 58872896 62273847 66060382 69914531 74267722 79196986
16737 79196986 84169709 89052456 95179469 101114024 107342090 114128330 121175789 128866590
16729 128866590 136637688 144064262 152119014 159659160 166725096 173412987 179492095 184527402
16721 184527402 188730464 191688347 193327828 193437945 191935096 188869850 185010718 179571992
16713 179571992 174023238 167113020 159589611 151919523 143896366 136162893 128551686 121064811
16705A21064811p311403p003743o580346o073327n861386n566480m961276m501036
16697G3205814m502807m329500l757429l670034l230490k779712l118610k408553
16689D5408679k349860k287659j646564k306180j842666j779856j254522j628135
16681C0313237j635030q25523j710557j303744m47012j140006r54813r75862q30625
16672B0490065p34996o19264r73255n64210q60588m63019p26486p52299j05779
16663A4690169p18985k09101o67740j97510k73135l75209j160877j2638J62618
16654A1237592p82289j58269o5435k67679k99385q85663J15046m06264l8690m86662
16644G962302k6998l55797Q077o3540k79550j75915l06721K12226m04149k17907
$$ plain form
16705 121064811 113753408 106749665 100169319 94095992 88234606 82668126 77706850 73205814
16697 73205814 68703007 64373507 60616078 56946044 53715554 50935842 47817232 45408679
16689 45408679 43058819 40771160 39124596 36818416 34975750 33195894 31941372 30313237
16681 30313237 28678207 27852684 26142127 24838383 24391371 23251365 22296552 21320690 20490065
16672 20490065 19755069 19135805 18162550 17598340 16737752 16274733 15548247 14795948 14690169
16663 14690169 13971184 13762083 13094343 12896833 12623698 12248489 11087612 11074974 11237592
16654 11237592 10455303 10297034 10231599 9963920 9664535 8778872 8893918 8487654 8448964 7962302
16644 7962302 7935304 7579507 7587584 7524044 7244494 7068579 6761858 6974084 6569935 6352028
16634F352028j43316k99082l68261K4041L8996K22312k91818o72826M60286j92838
16624E129522m27887K02957m11703o5888M62116n37199L77905n76382K16753k00873
16614D169321m05113L0982R6679k79945Q9243j02377J47269n8670j23689J2543
16604C576243p54653L85446q8205j85152Q7018n8461l88790J96502j879r8956
16594B669113k3138J57320j6018l09848l8911K23503k17779J28157m87424L70365
16584B455340k01083J40001q7118j58877q0003K41935l258m03182K96706q7715
16574B112746k6921l66463K61362j04189J68168q3848j47345k22362J98991j95994
16564A594145L68457l01562L21854j01095k02038J7007m0013q8285L1320j56177
$$ plain form
16634 6352028 6208712 5909630 5541369 5565410 5604406 5826718 5534900 4862074 5322360 5129522
16624 5129522 4701635 4904592 4492889 4427001 4889117 4351918 4729823 4153441 4370194 4169321
16614 4169321 3764208 3795190 3891869 3611924 3701167 3598790 3746059 3687389 3563700 3576243
16604 3576243 2821590 3207036 3118831 2933679 3020697 2962236 2573446 2769948 2768069 2669113
16594 2669113 2645975 2803295 2787277 2477429 2438518 2662021 2444242 2572399 2084975 2455340
16584 2455340 2254257 2394258 2307140 2148263 2068260 2310195 2306937 1903755 2200461 2112746
16574 2112746 2085825 1719362 1980724 1876535 2044703 1960855 1813510 1591148 1790139 1594145
16564 1594145 1962602 1661040 1982894 1881799 1679761 1696768 1656755 1568470 1599790 1443613
16554A443613j4167J18379J0231k76903K59285k27339K1088J55149j59516M6633
16544A376453K12062k38194k82857j60477M68519L1874k22238L84056m69694K97272
16534A396776o5910n70340K50269m5123L08409k98835M27988r0243J66414k51462
16524A227943L7767L16370n51367j39618K12259M85J35796n15471L82569k7718
16514A079015j50045j26244l1615K82818O5427o7755k33800J78926k71961M41787
16504A166553l12462K63636l90061K73416k03964j84085L08562k83346L5099J26970
16494H00318J86496K67368l36522j05623K13888l73770K03336k33289P2100j46319
16484E47983M23348j39214j37443r853j8201r6522L75613k72066j28454J63794
$$ plain form
16554 1443613 1429446 1547825 1558056 1281153 1540438 1313099 1334187 1489336 1329820 1376453
16544 1376453 1588515 1350321 1067464 906987 1375506 1407380 1185142 1569198 1099504 1396776
16534 1396776 1330866 760526 1010795 965672 1274081 975246 1403234 1312991 1479405 1227943
16524 1227943 1265710 1582080 1030713 891095 1103354 1103839 1239635 724164 1106733 1079015
16514 1079015 928970 802726 771111 1053929 1119356 1051601 817801 996727 724766 1166553
16504 1166553 854091 1117727 727666 1001082 797118 613033 921595 638249 673348 800318
16494 800318 986814 1254182 917660 812037 1025925 652155 855491 622202 694302 547983
16484 547983 971331 832117 694674 684821 666620 570098 945711 673645 545191 708985
16474G08985K77327k24568N2638k04433k20583K84103j45595J43575q077p8545
16464E84827k08171L64637K978k42327M3714J13957k82930L85079n9191j67869
16454E34704J22767m5833j97232N35580k52418P5029J86646k6525m52211J78279
16444F58786j96413M5427j18104J55372J26666D34N49332K22213j16190j09077
16434E46712N7428k2683N3530M6387j34826L2395o5665j21230K318J48033p5227
16423D67172n1366q1360L17425j34009L03835l29951R8464J23255C44037J87594
16413E31631n9257q5187j0084J32952m911L42492B30269L55910k41130J60612
16403E05661N7011B80096J42272A20964M95348j13100j31715k0759K96583B56788
$$ plain form
16474 708985 986312 761744 814382 609949 389366 673469 527874 671449 663372 584827
16464 584827 376656 741293 744271 501944 545658 659615 376685 761764 702573 534704
16454 534704 657471 611638 414406 949986 697568 772597 959243 932718 480507 658786
16444 658786 462373 507800 389696 545068 671734 434 549766 771979 655789 546712
16434 546712 604140 581457 634987 681374 546548 578943 513278 392048 394366 542399 467172
16423 467172 415806 334446 651871 517862 821697 491746 590210 713465 344037 531631
16413 531631 472374 387187 377103 510055 505144 847636 230269 586179 345049 505661
16403 505661 562672 280096 422368 120964 616312 503212 371497 350738 647321 256788
16392B77926K65122m9868n0152j00174J76533A77407K55723K31793B74793K96964
16382E71757M1653l05635J56957l4019B15232K73156j96286J7404P0972F1251
16371E51591q3659L2486n0983j81336A26196L053N47729l23397j43681J20814
16361C30714m6639L91860o5942j25008N458j75127J29989j20392L41564o4507
16351F01970B35707J16458Q0136A28987M97211j42823j01841J45364H7968J755
16341H9723J55355I7011K87223Q5082j78535j13773J85313M31598C11553J34514
16331D46067L0732B29171M5515n6670r3513N12896k82175m9090J39100A88773
16320D34027B15270P7339A39586M29748j84219n612j6907j19367p705c7471C52275
$$ plain form
16392 277926 543048 493180 443028 342854 519387 177407 433130 664923 274793 571757
16382 571757 613410 307775 464732 430713 215232 488388 292102 309506 380478 61251
16371 551591 467932 500418 449435 268099 126196 129249 676978 353581 209900 330714
16361 330714 284075 675935 609993 484985 490443 315316 445305 324913 666477 601970
16351 601970 235707 352165 432301 128987 626198 483375 381534 526898 87968 89723
16341 89723 245078 97011 384234 469316 290781 177008 362321 793919 311553 446067
16331 446067 476799 229171 274686 218016 124503 637399 355224 306134 445234 188773
16320 434027 215270 292609 139586 569334 385115 379503 362596 243229 235524 -37471 352275
16308C9187N39425k34989j20719K20113J03015l3109A18039L30567j28329K5325
16298C45602J1857J87599j44923L5397J8636r7686J63007L3948a13404A37649
16287E10352k704j11223A70918Q4972M6244o0996M3215j7936P774A20143L69723
16276D89866E6597K06108N0309A54772a28625c1823G4567K10995J60270F8690
16265B52389j03614N1573J70868O3589N7708k07951a72367B37723k6422J82916
16255C94217A49676L94703B21388K668I6823L12195A62272D2406N3216c7883n3500
16244i1383A16405K33627p7991N9139J72762B10018R1449Q0492a07114C45030
16233A61963J25751P184M7544A33930K10895F7967J72830m5196Q4736R7525A78123
$$ plain form
16308 39187 578612 343623 222904 443017 546032 512923 118039 448606 320277 345602
16298 345602 357459 545058 400135 435532 454168 356482 519489 553437 -113404 137649
16287 510352 507648 396425 170918 255890 302134 241138 284353 266417 274191 120143 489866
16276 489866 56597 262705 313014 154772 -128625 -31823 74567 285562 445832 68690
16265 252389 148775 200348 371216 434805 492513 284562 -172367 237723 211301 394217
16255 394217 149676 544379 221388 224056 96823 409018 162272 42406 95622 -37883 -91383
16244 -91383 116405 350032 272041 331180 503942 210018 301467 381959 -107114 345030
16233 161963 287714 294898 342442 133930 344825 67967 240797 195601 280337 377862 178123
16221A85628L4793A08729a4473B95849o6619C236a7208C50927j00701F9775c8777
16209I644J37072J5316K20976a33378A83496K23920A35223L27647j39876H8424
16198C80332H7964O3478c8808B47748A05744q392D6447M85325a56723D9744J21153
16187A70897F4597A4390J32558m047l1220J40183i2182F8095M5887J06263a4045
16175B61895N8703j4360k2134j21046D2109J03436E1186R4636A2449J78971O9256
16164B60676a52464A21589g1713C85812r0365J72962k11638b26273A39870L08472
16154D48342K0241H1823b2572D1043h3415A83709H2771K14583A18606h0405D8323
16142c8572j04103c4534J2950A63276a24065B60490F423L27212j07688r4851b8068
$$ plain form
16221 185628 220421 108729 -14473 295849 229230 3236 -17208 350927 250226 69775 -38777
16209 9644 146716 162032 383008 -133378 183496 407416 135223 462870 322994 88424
16198 380332 87964 151442 -38808 247748 105744 97352 46447 531772 -156723 49744 170897
16187 170897 64597 14390 146948 142901 111681 251864 -92182 68095 113982 220245 -14045
16175 261895 320598 306238 284104 163058 42109 145545 51186 145822 12449 191420 260676
16164 260676 -152464 121589 -71713 385812 295447 468409 256771 -226273 139870 448342
16154 448342 468583 81823 -22572 41043 -83415 183709 82771 297354 118606 -80405 48323
16142 -38572 -142675 -34534 -21584 163276 -124065 260490 6423 333635 225947 131096 -28068
16130A96325Q9956l4679j22996O8539j8461O0965a4552I8724d6441C45811p5901
16119B69910f939A26228n8879L50956a48863B0174e3034C6946J67583C9379K36978
16108B76357A31484j5252a52666C55178A61296c0358D4407d2321G994b7232n8075
16097h5307A40470l3697a43474B1749K62531k2374a20919b6210D8082b34114A01331
16085A47348k4112g5381k86459G6509K5738b04875k4019Q5324B02223b95282B6141
16073a04204B26335j01841b28831A47547J71219d6736p259A16112b5976l49911
16063c75887A4196J17591i5578b5274C94527C1226L21709H6749l4252a46304H2457
16051d37526a72940A26238a75256q8789i2148E9829c866B95484a52613O956A5221
$$ plain form
16130 196325 286281 251602 128606 197145 178684 239649 -14552 98724 -46441 345811 269910
16119 269910 -6939 126228 67349 418305 -148863 20174 -53034 36946 204529 39379 276357
16108 276357 131484 116232 -152666 355178 161296 -30358 44407 -42321 7994 -27232 -85307
16097 -85307 140470 106773 -143474 21749 284280 261906 -120919 -26210 48082 -234114 101331
16085 147348 123236 -75381 -361840 76509 102247 -204875 -228894 -143570 202223 -295282 26141
16073 -104204 226335 124494 -228831 147547 318766 -46736 -53995 116112 -25976 -375887
16063 -375887 14196 131787 -95578 -25274 394527 31226 352935 86749 52497 -146304 82457
16051 -437526 -172940 126238 -175256 -264045 -92148 59829 -3866 295484 -152613 -145657 15221
16039A08766b1961j30275N9379R825b4174B10843D5019J79280E9658i4128A13634
16027b4419E492M9535N8098P2814p9059c73178a25801n4591B20768G1729d0272
16015G0771O7566b14547A77243P0002g3493j90c1177A21674k1379k4598O3312
16004A39009a99667R7267J2738G2809a8295r0908m055B03747D6860h7683J7710
15993f9973A97188a7528k8416B8799J58188c1862A15061a86006r0380C6866b37498
15981G3450R3773d1328D1928J20387k6773J07127g0951m1952A82859d8487A52212
15969c74976C10609I6029j4585i9855m2377A28192A6510J9497h7090q8918r3455
15958b69463J26404K3164B23998c8790C2703a90374F0527J75506a16119b5902
$$ plain form
16039 108766 -21961 -152236 -92857 -83032 -24174 210843 45019 224299 59658 -94128 113634
16027 -24419 5492 55027 113125 185939 106880 -373178 -125801 -180392 220768 71729 -40272
16015 70771 138337 -214547 177243 247245 -73493 -73683 -31177 121674 100295 75697 139009
16004 139009 -199667 -102400 -89662 72809 -18295 -109203 -113258 203747 46860 -87683 -69973
15993 -69973 197188 -17528 -45944 28799 186987 -31862 115061 -186006 -276386 36866 -237498
15981 73450 167223 -41328 41928 162315 135542 242669 -70951 -112903 182859 -48487 152212
15969 -374976 310609 96029 81444 -99855 -142232 128192 16510 36007 -87090 -176008 -269463
15958 -269463 -143059 -119895 223998 -38790 32703 -190374 60527 236033 -116119 -25902
15947A7206K8827e8416C8526J4811g3146B55378a66626E2760b58649A79737a34818
15935b43486R4274l1217A92640o2350d3573n4823N237b8687k09514M8196K6513
15924a63492c0461l71166C1876b02084L2505P2298C74096b0480k36703g1405m1917
15913a13322j01572Q8415r4311H4750b5352D0509L1147i6651M1776I8448a99402
15901I2404a16827A13848a13918D06733j59762A15624h1714B44826e5221h507
15890C4149L1622a29955j45052E1707a57997O6944B25425C4419a7445Q067p5557
15879h4935l0563J531G5614g5181D8683J01845J47503h5049j1628a1567j16420
15868a27987l77945A75553c02956A1745a78967E0531O8971b5481A44418J22646
$$ plain form
15947 17206 46033 -58416 38526 53337 -73146 255378 -166626 52760 -258649 179737 -134818
15935 -243486 -149212 -180429 192640 130290 -43573 -98396 -93159 -28687 -238201 -190005 -163492
15924 -163492 -30461 -401627 31876 -202084 -169579 -97281 374096 -20480 -257183 -71405 -113322
15913 -113322 -214894 -126479 -220790 84750 -25352 40509 71656 -96651 -54875 98448 -199402
15901 92404 -116827 113848 -113918 406733 246971 115624 -81714 244826 -55221 -8507
15890 34149 65771 -129955 -275007 51707 -157997 -91053 225425 34419 -17445 -9378 -84935
15879 -84935 -115498 -113967 75614 -75181 48683 150528 298031 -85049 -96677 -11567 -127987
15868 -127987 -505932 175553 -302956 11745 -178967 50531 119502 -25481 144418 267064
15858B67064j27680n6250R597b0860B5786c96168J86691B1761d26113i3465c9318
15846b04727k22688J41827a20339B11468b04822a3572q3017c8754j26060H8613
15835A85653h2690r2502P1695d936k02903m375d4984B34355J78042b34685A9131
15823B75292a29710f2080A70847a26659j36734J09721j10290d1287D3754J16467
15813A60221E6228c18375g2813j73094A03859p498b09209h4429A00106J1534n2857
15802E8783b36296D736j909O8052a33027A08145b19300A57135F5042k4643J57877
15791A98276c4602a2122k03840a1227j40577P3528q8749A54429a51860J8103k3504
15780a57261m5951E3462J35674b25057a03175p3305m2166A05232i8516F437f6376
$$ plain form
15858 267064 139384 83134 92731 -20860 25786 -396168 -209477 21761 -426113 -93465 -39318
15846 -204727 -427415 -285588 -120339 211468 -204822 -13572 -96589 -38754 -164814 88613
15835 185653 -82690 -175192 -103497 -4936 -207839 -212214 -44984 234355 412397 -234685 19131
15823 275292 -129710 -62080 170847 -126659 -263393 -153672 -263962 -41287 43754 160221
15813 160221 56228 -318375 -72813 -245907 103859 96361 -209209 -84429 100106 111640 58783
15802 58783 -236296 4736 2827 70879 -133027 108145 -219300 157135 65042 40399 198276
15791 198276 -34602 -12122 -215962 -11227 -151804 -78276 -167025 154429 -151860 -133757 -157261
15780 -157261 -203212 53462 189136 -225057 -103175 -176480 -218646 105232 -98516 6437 -66376
15768E9542N9797a83891B51434K178h3221n6466D0435h4829H907b7594I2477a4002
15755A01401N0846M0741e7025k91084c6889j5649J0484l0636H1554f0200G0358
15743a67091N4572G1269a35230n1597M9099I2129d78711J88908I708P2790i9483
15731I4779L70720a04817E8429a47246M1488A13259a05217B4408n734C497a51678
15719a3791n6831J2488n0212A25704m9430i6291K7899a2538m8063a7704A16142
15707b6269F6749b32846C93402a43568o9808Q6450L7751j13207m3337A42884d59502
15695f9535n4093c2038D3382a64696Q1606n8216C63316j69949A1269a8261E0676
15683c11220d4676I1315c33315h1280A55394a32887C6443e4125E4488J31349d3803
$$ plain form
15768 59542 119339 -183891 251434 253612 -83221 -139687 40435 -84829 8907 -27594 92477 -14002
15755 101401 152247 192988 -57025 -348109 -36889 -52538 -42054 -72690 81554 -60200 70358
15743 -167091 -112519 71269 -135230 -186827 -137728 92129 -478711 -289803 9708 82498 -99483
15731 94779 465499 -104817 58429 -147246 -105758 113259 -105217 24408 18674 3497 -151678
15719 -13791 -70622 -58134 -108346 125704 76274 -96291 -68392 -12538 -60601 -17704 116142
15707 -26269 66749 -232846 393402 -143568 -213376 -126926 -89175 -202382 -245719 142884 -459502
15695 -69535 -123628 -32038 43382 -164696 -83090 -141306 363316 193367 11269 -18261 50676
15683 -311220 -44676 91315 -333315 -81280 155394 -132887 36443 -54125 54488 185837 -43803
15671C17784a88588H4099c26325J38988D7508h0512k69390m4979a15570k27286
15661c42856a03484d7184E4734Q5707d23524c2324j68644i682o7406B23501r128
15650B14373A00525P8589a22039M5700j85058a27768e614j32109O8653A32259
15639I1951a29715r4514b4658j3388A25788d4695o586k12788g5077j82867d4969
15627F4096J5636b30179R4626O1698A11987f2419a3435A70820o0372b19376B14429
15615A89743a65946A14936Q9084D9224a77291H2251d7586J4298l0556A2334L51628
15604C63962I136c34207f1567A03096b4576A38696a43117m7320j50936d0267A12305
15592C8703a17777A70764l4738B613a62011B45893D1819f1428F0670c2885q8281
$$ plain form
15671 317784 -188588 84099 -326325 -187337 47508 -80512 -349902 -394881 -115570 -342856
15661 -342856 -103484 -47184 54734 140441 -423524 -32324 -200968 -9682 -77088 223501 214373
15650 214373 100525 179114 -122039 -76339 -261397 -127768 -5614 -137723 -69070 132259
15639 91951 -129715 -224229 -24658 -38046 125788 -44695 -51281 -264069 -75077 -257944 -44969
15627 64096 79732 -230179 -135553 -73855 111987 -62419 -13435 170820 110448 -219376 214429
15615 189743 -165946 114936 204020 49224 -177291 82251 -47586 -33288 -63844 12334 363962
15604 363962 9136 -334207 -61567 103096 -24576 138696 -143117 -190437 -341373 -40267 112305
15592 38703 -117777 170764 136026 2613 -162011 245893 41819 -61428 60670 -32885 -121166
15581a21166G5491a47726I5049j4062a5106B8602a5254o7229k82482i4870H6706
15569a55293A67364M3071r8927C5299a41150K1537F9156c60152A06570l9678L9917
15558A06809N0601N3545l9445b03171g4456A03571L1559b20389h0554A25758J569
15547A27327n811b4739A77576a40268o0572C98969i4453C64559r4544a59348H052
15535D8791a51315g5388m1678j89001e3040r846E0672K73448j56424G0824R4278
15524A65102E1176J54985H09d09371A95293d5045A23277E0686J0845a29218B23307
15512A16522J8474E0040J41158d9780A82629a40031P664j39957I8310I198K6680
15501C5878N3968a07152D1230K17521H6655d38120C1359a74446o8030B03942l2753
$$ plain form
15581 -121166 75491 -147726 95049 80987 -15106 28602 -15254 -82483 -364965 -94870 86706
15569 -155293 167364 210435 111508 35299 -141150 -119613 69156 -360152 106570 66892 106809
15558 106809 157410 210955 171510 -203171 -74456 103571 135130 -220389 -80554 125758 127327
15547 127327 121516 -24739 177576 -140268 -200840 398969 -94453 364559 270015 -159348 8052
15535 48791 -151315 -75388 -117066 -306067 -53040 -62886 50672 324120 167696 70824 165102
15524 165102 51176 206161 809 -409371 195293 -45045 123277 50686 61531 -129218 223307
15512 116522 134996 50040 191198 -49780 182629 -140031 -132367 -272324 98310 9198 35878
15501 35878 89846 -107152 41230 258751 86655 -438120 31359 -174446 -242476 203942 171189
15490A71189o2425J07654g0259C27565A12398J2709E6901i0392j15512A48571
15479C6440b18735I8108J92605C1084J78447q0045a15000A78703D1695b6312H6316
15467A22040D9991g7581A20798J3933a52527K0387e759j10738A7629M0695a44890
15455b1541j44441n5863A14268i0636H7061a70842F6543J61319J3054A038h6189
15443A98594c32839d9974j8594l47118a54277H946K42726c14771J07190O1953
15433a45628A25909f10k33699C6603d38154D1598i0010D2713R916b16648A7463
15421b13178N6566j07105R1856O5401A69111M1507R461j09883j5738a9317r6291
15410a15608A22650e39244B25260J30507a65807K3962B43646b28763B04233a09649
$$ plain form
15490 171189 108764 216418 -70259 327565 112398 125107 56901 -90392 -205904 148571
15479 36440 -218735 98108 290713 31084 209531 129486 -115000 178703 41695 -26312 86316
15467 122040 49991 -77581 120798 134731 -152527 -132140 -5759 -116497 17629 58324 -144890
15455 -21541 -165982 -221845 114268 -90636 87061 -170842 66543 227862 240916 1038 -86189
15443 198594 -332839 -49974 -68568 -415686 -154277 8946 251672 -314771 -207581 -145628
15433 -145628 125909 -610 -234309 36603 -438154 41598 -90010 42713 52629 -216648 17463
15421 -213178 -156612 -263717 -171861 -106460 169111 210618 220079 110196 94458 -19317 -115608
15410 -115608 122650 -539244 225260 355767 -165807 -141845 243646 -228763 204233 -109649
15399A20930A7775c11538a53257O3563H3744J00566d6490p914c315k56610J13707
15388a46218M9724b0658o8646R926j75755A66608a95506D3365a57835P7441K7826
15377e2568A95064a70476L5298a5854F7426J30567C4513e6339B14188l4580P2189
15366B51797B6004h2469r8677j8947M8979d454B61204j8741D4833h1046C63814
15354G9339a23380B23616e4750F507a67513k10174B73729a3933n1953a0272D3065
15342A4748K04575j158j07422O9594J842R2524A2546E276c6733D04489a39046
15330b03434B48748a33473M1757p5437c9027F0542k1968c1314n7534l9449j93516
15319c21813a47525Q028d2670A56854a20460a1714B9742e428C25300a27376A80794
$$ plain form
15399 120930 17775 -311538 -153257 -89694 83744 184310 -46490 -54404 -3315 -259925 -146218
15388 -146218 -96494 -20658 -89304 -79378 -255133 166608 -195506 43365 -157835 -80394 -52568
15377 -52568 195064 -170476 -135178 -15854 67426 197993 34513 -56339 214188 179608 251797
15366 251797 26004 -82469 -181146 -200093 -151114 -4454 261204 242463 44833 -81046 363814
15354 79339 -123380 223616 -54750 6507 -167513 -377687 273729 -13933 -65886 -10272 43065
15342 14748 219323 218165 110743 180337 182179 274703 12546 5276 -36733 404489 -139046
15330 -203434 248748 -133473 -91716 -167153 -39027 60542 38574 -31314 -88848 -128297 -321813
15319 -321813 -147525 -139497 -42670 156854 -120460 -11714 29742 -5428 325300 -127376 180794
15307A19184A3441J65384j0421a46297B63028a05287d4441J5007A54276O0211
15297B14487B782J28925d9376C35582H97a4218j85672C61066A23479N107J9836
15286A48422i7584A37147K842J00471a31191l9364B07432H2663A700L76969g8999
15274H1576q848a3546B47921n5215J79007b44051A62056D7066d6419B11511D1335
15262D7293a73271A16392K7571J27187R0652A02350N83840B52908F8678J91640
15252B60318e359B66042K77565N55782N72330l20099j9860Q9563C83045A56015
15241e8275j44570H2155J95031c7339p7491N1905j52020A8974J35757b83837p6331
15230c60168F9076J30284b4727C7550O2995b6495j5006B880a17380a9762A02638
$$ plain form
15307 119184 13441 178825 168404 -146297 263028 -105287 -44441 -29434 154276 214487
15297 214487 2782 131707 -49376 335582 897 -14218 -199890 361066 123479 128586 148422
15286 148422 -97584 137147 139989 240460 -131191 -170555 207432 82663 1700 378669 -78999
15274 81576 72728 -13546 247921 192706 371713 -244051 162056 47066 -46419 211511 41335
15262 47293 -173271 116392 143963 271150 361802 102350 686190 252908 68678 260318
15252 260318 -5359 266042 543607 1099389 1671719 1351620 1331760 1421323 383045 156015
15241 -58275 -202845 82155 277186 -37339 -114830 -62925 -214945 18974 154731 -283837 -360168
15230 -360168 69076 199360 -24727 37550 100545 -26495 -41501 2880 -117380 -19762 102638
15218C4818Q9914a08698j46632C94394j72396J16649a69354G2112g8330q0717
15208a59047A20300a114A05261D1634K26157C5813g2269E6185J29144n3073a19895
15196I1524G381J31527l5384O8459a02830l7865I9097N9047b06699E7491h1737
15184b42468I5150a15931E0985L31751h2065A05909K21145C3671G451R4893a6421
15172D2618h7270B84282F8004a64857M699B42717A19809b2072A45415o0035k3859
15161F1521h133C95039A39474b51852E3795i8954J8024B98775j21551a5691f525
15149a48997C25212j32702n6697f2921B02861r1223n0155H261O7601O2154a18576
15137e4166O6A36079a44457a5408A4738J59886B2395O6327K43670D3514J51295
$$ plain form
15218 34818 124732 -108698 -255330 394394 221998 338647 -169354 72112 -78330 -159047
15208 -159047 120300 -1114 105261 41634 267791 35813 -72269 56185 185329 132256 -119895
15196 91524 7381 138908 103524 171983 -102830 -140695 99097 158144 -206699 57491 -81737
15184 -242468 95150 -115931 50985 382736 -82065 105909 327054 33671 7451 102344 -16421
15172 42618 -87270 284282 68004 -164857 -160158 242717 119809 -22072 145415 85380 61521
15161 61521 -8133 395039 139474 -251852 53795 -98954 -80930 298775 177224 -15691 -6525
15149 -148997 325212 192510 135813 -62921 202861 111638 61483 8261 75862 138016 -118576
15137 -54166 -54100 136079 -144457 -15408 14738 174624 22395 88722 332392 43514 194809
15126A94809g7813L3288B25479D8402A4237L58264D5159J33608j4765m3299D7200
15114B19320O8090j22473l2076r102J28671r1671c6104k9939D11809c43982A34328
15102F1328M9912O4163J77436I6884d3984A8396Q3263m9246a09399B41668F315
15090E60735B35338M8254M1364d999B69663G1867k2963J8776a39805D04129j29940
15079B74189J09677I4238O3384o4756i266B04336A5018J94457B3454L13003j39815
15068A96642A1135P4156l3583N3777C6925L70244j60405r275L96232a3217A62940
15056C5810J30193a47342E70639A98701p9261a83093A23616J98374B5270R6539
15046A21809J25576j15187J31053q8693L35880A68462K81712a05557D6305P1794
$$ plain form
15126 194809 -77813 -44525 225479 48402 14237 372501 45159 178767 164002 120703 47200
15114 219320 287410 164937 132861 123759 252430 160759 -36104 -66043 411809 -343982 134328
15102 61328 111240 175403 352839 96884 -43984 18396 101659 52413 -109399 241668 6315
15090 560735 235338 283592 324956 -4999 269663 71867 48904 67680 -139805 404129 274189
15079 274189 383866 94238 157622 92866 -9266 204336 15018 209475 23454 336457 196642
15068 196642 11135 85291 51708 105485 36925 407169 246764 237489 633721 -13217 162940
15056 35810 166003 -147342 570639 198701 119440 -183093 123616 321990 25270 121809
15046 121809 247385 132198 263251 174558 510438 168462 450174 -105557 46305 118099
15036A18099F751Q7239L78442j79199e8013B03196M270l0881J12016f6991A28403
15024B76553H310J87760n6803M7596L13920k46026J86419J4106j60299J62923
15014D57906c328H0016Q9979p01K3889k837J48350j39386J0473J00082J50910
15003D60775A66255K17234I9670L60265n2225A75812l7446J8033e945A56140K4660
14992A80800I625L20082r8145k4199m9566K42236A08357J46292A01829J35514
14982B37343f6434E2761M75045B18900f1360I44K75302o1243J17685J20940F6675
14970E48053j69824A67886E2926J70297K58933l0647j87844a16225C82443J94760
14960E77203B34787L12729k16061C6421O3386K58666j46600M1680k8794E0853
$$ plain form
15036 118099 6751 93990 472432 293233 -58013 203196 207466 176585 288601 -66991 128403
15024 276553 8310 196070 139267 186863 500783 254757 441176 455282 294983 457906
15014 457906 -3328 80016 169995 169294 193183 190346 338696 199310 209783 309865 460775
15003 460775 166255 383489 99670 459935 407710 175812 138366 156399 -5945 156140 180800
14992 180800 9625 329707 231562 207363 157797 400033 108357 254649 101829 237343
14982 237343 -66434 52761 527806 218900 -61360 944 276246 215003 332688 453628 66675
14970 548053 378229 167886 52926 223223 482156 451509 263665 -116225 382443 577203
14960 577203 234787 547516 331455 36421 99807 358473 211873 253553 224759 50853
14949E08970A89738q6597L69212A83756m1823K3140j3405C7243K96167m7172J611
14938B87849D6510L41472J47047K4995B62153j03684B9664M05902q7362J65132
14928E13336k34776M18217B6590C592N22576P4303A31280K07034A12725J43161
14918B55886J21749K20251C1557J31508K64853j39639l2055j9559L4024K9110
14908B99799q273K19543F0055M14556O85j81666E9222R9891m7625K09327k7350
14897B93465p0759K92180A85399r784J52300k2570P8908Q7548M6301j94932q1997
14886B41173E3525L46929N486F5607K6059M20856k04166A30622K18253Q0852r3410
14875C36317J96032b3677q371C74172M7906J77294A67696L91225A72126L41538
$$ plain form
14949 508970 189738 103141 472353 183756 141933 165073 151668 37243 333410 286238 287849
14938 287849 46510 387982 535029 560024 262153 158469 29664 435566 348204 513336
14928 513336 278560 696777 26590 3592 526168 600471 131280 338314 112725 255886
14918 255886 377635 597886 31557 163065 427918 288279 256224 236665 270689 299799
14908 299799 291526 511069 60055 474611 475296 293630 59222 159113 111488 320815 293465
14897 293465 222706 514886 185399 175615 327915 305345 384253 471801 518102 323170 241173
14886 241173 53525 400454 405940 65607 91666 512522 308356 130622 348875 429727 336317
14875 336317 532349 -23677 -32048 374172 422078 599372 167696 558921 172126 513664
14865E13664o2872Q3785J23405k44021j99722K43177j08116M3793M80597F7117
14854D24871R978p6273J26230K2778K2486k14246j56490L6051L60197A35502J59445
14843B94947J34643J56942k27136J3386A79698M23244j84566j91153K41595j10672
14833C58146K65200J9206j68851p0012A46571Q3483O2242P0897L87664j91975
14823E58882j70131M0384P0422B43818J45082Q8154A81636J46578K66285k33279
14813C61220N16970r2956C50839L75686C34330K88982j61710J83082r181l16376
14803C19127J39031J34041o8702p5459L05524j66736m7807K2850J98537C53408
14792C19269L79897k87901j98048O28415B93611R6244M9884M32216J24853m50025
$$ plain form
14865 513664 450792 534577 657982 413961 214239 457416 349300 393093 873690 67117
14854 424871 434849 358576 484806 507584 530070 315824 159334 195385 555582 135502 294947
14843 294947 429590 586532 359396 372782 179698 602942 418376 227223 468818 358146
14833 358146 623346 642552 473701 403689 146571 230054 292296 363193 750857 558882
14823 558882 388751 429135 499557 243818 388900 477054 181636 328214 594499 361220
14813 361220 878190 785234 350839 726525 334330 623312 461602 644684 635503 319127
14803 319127 458158 592199 523497 448038 753562 586826 539019 561869 760406 353408
14792 319269 699166 411265 213217 841632 293611 389855 439739 871955 996808 546783
14782E46783J5943j90594J74811K4107M1030M6034M4000m7913J95197o3058q6959
14771F99381k96007J90886j88810L57731J28880L8262m47265B28980M18410l3850
14761F13540j60801j5912q2296L60936j29352J04458q9159B37866M11058j77093
14751D71831J86930m3701j33868J49537K47019r8808j58889k35628K39931J51399
14741G75753O2270J4521o5881j88713L3943K27591j99013n8945q4822M13573r3042
14730H37235k5115P939j79420j70199J17667L62626j89294l6327l358k20434K36418
14719G37738j5394J53665j52164J04987k06338Q0129K0415K27161k89183L01766
14709I62782K76288E88597O34262n23172J96446k4080j78536q5251J44344J67055
$$ plain form
14782 546783 562726 372132 546943 571050 612080 658114 702114 654201 849398 786340 699381
14771 699381 403374 594260 405450 763181 892061 930323 483058 228980 647390 613540
14761 613540 452739 436827 354531 715467 586115 690573 601414 237866 648924 471831
14751 471831 658761 615060 481192 630729 877748 778940 620051 384423 624354 775753
14741 775753 838023 852544 786663 597950 631893 859484 660471 601526 516704 930277 837235
14730 837235 812120 820059 640639 470440 588107 950733 761439 725112 721754 501320 737738
14719 737738 722344 876009 723845 828832 622494 702623 723038 950199 661016 962782
14709 962782 1239070 588597 1222859 699687 896133 872053 693517 608266 752610 919665
14699I19665J50278j96133l08589M09597m7168J28711O1221j30966J01910J26333
14689A214859k06919j96379K95005l04742L37355J08992l26412k99588M73068
14680A095239q0359k92689L09826p5818R8184j86581K89711o4739k49145l2379
14670H11250p5177J34060M19434k64319L1269M7114j75815J19199k27242K12199
14660A031972J00878J85692j38072l04468M25366j92494j56568P6273L39049O7005
14650A434633l56563J85033Q7863l78191K74350j19580k526L13529J40512n40295
14640A038765L75609l8239m59997N67351n88820L06427M5457j43364K02171m0050
14630A265310J52626l24502K62190J0045P8681L35038j50884l29065M7227M73659
$$ plain form
14699 919665 1069943 873810 565221 974818 927650 1056361 1117582 986616 1088526 1214859
14689 1214859 1007940 811561 1106566 801824 1139179 1248171 921759 622171 1095239
14680 1095239 1014880 722191 1032017 956199 1054383 867802 1157513 1092774 843629 811250
14670 811250 736073 870133 1289567 1025248 1056517 1103631 927816 1047015 819773 1031972
14660 1031972 1132850 1318542 1180470 876002 1301368 1108874 952306 1028579 1367628 1434633
14650 1434633 1078070 1263103 1350966 972775 1247125 1127545 1125019 1438548 1579060 1038765
14640 1038765 1414374 1376135 916138 1483489 894669 1201096 1246553 1103189 1305360 1265310
14630 1265310 1417936 1093434 1355624 1365669 1444350 1779388 1628504 1299439 1346666 1820325
14620A820325l49866K62520k54689j55503K8269l9774N03271k92554N4420j02753
14610A473666R6467N3893J76756l08903J00745J55873j66340j6464j0050n1308
14600A504335J16779O5679N2860j30180M438K0964j76421N04433j38795J2199
14590A836291p9090J55607l0860l70964N80322k24034k767K2655N5692j18886
14580A823966M2007l12795N31945Q5903k25267L12751l66909J84598q5473L02935
14570B293661J38643J42838l13255J28095l56049M29340J11893l6053k29883N17976
14560B827206k36149N34875l0950p3903J41370Q9794K46683Q5900N46297O14091
14550D745214Q64198J959370L522272Q110381J3725066P668542j7784291A0176110
$$ plain form
14620 1820325 1470459 1732979 1478290 1322787 1351056 1311282 1814553 1521999 1576419 1473666
14610 1473666 1570133 1624026 1800782 1491879 1592624 1748497 1582157 1565693 1555643 1504335
14600 1504335 1621114 1686793 1739653 1609473 1613911 1634875 1458454 1962887 1824092 1836291
14590 1836291 1757201 1912808 1881948 1510984 2091306 1867272 1864505 1887160 1942852 1823966
14580 1823966 1865973 1553178 2085123 2171026 1945759 2258510 1891601 2076199 1990726 2293661
14570 2293661 2432304 2575142 2261887 2389982 2033933 2463273 2575166 2539113 2309230 2827206
14560 2827206 2591057 3125932 3094982 3021079 3162449 3252243 3498926 3584826 4131123 4745214
14550 4745214 5609412 7568782 11091054 19201435 32926501 40595043 22810752 10176110
14541E734991j756962j266529j32724k93226j78248j65818K52072j04753o5146
14532B023657Q2826m1356K50974k25580L38758J47334l31277K57327k10978L16611
14522B608296k08739m2901J04958k5064R2006o4874J46817j90602K80544j6555
14512B683886J811k17709M03315l41277M88885j43184M5041j80739L22693k9245
14502C033477j37546J57871l37912N87942q8973q4000J91888J46388P9405j35381
14492C413159o7478J84760M207j48529J26978N4044Q1460J32658Q8824k98395
14482C571688M6058O9521K25945j2409K11409l43186P8542N34206k43265r6675
14472D041834K95712N1776k9929J90031L9068p6571p3178l2542p7244M46556l33610
$$ plain form
14541 5734991 3978029 2711500 2578776 2285550 2107302 1941484 2193556 2088803 2023657
14532 2023657 2106483 2065127 2316101 2090521 2429279 2576613 2245336 2502663 2291685 2608296
14522 2608296 2399557 2356656 2461614 2436550 2528556 2463682 2610499 2419897 2700441 2683886
14512 2683886 2685697 2467988 2871303 2530026 3018911 2875727 2920768 2740029 3062722 3033477
14502 3033477 2895931 3053802 2715890 3303832 3214859 3130859 3322747 3469135 3548540 3413159
14492 3413159 3345681 3530441 3534648 3386119 3513097 3567141 3648601 3781259 3870083 3571688
14482 3571688 3617746 3687267 3913212 3900803 4112212 3769026 3847568 4381774 4138509 4041834
14472 4041834 4337546 4389322 4359393 4549424 4588492 4511921 4438743 4406201 4328957 4775513 4441903
14461D441903L16193K083p9538M88350n0013J421k26568J68554j16892K92938
14451E238431K8176J26739r2540J39581q0519J31412J45613K35636l04351J48732
14441E716910L69346q5603j61527N19228j77724j67415M40425J37744l05443M80343
14431F766284N7270L6041Q4999K1618J73309K2952k62788O84200j95884J18153
14421G506154J78268J27045l57864J70445L61400M74039k0458L23690j02579J42985
14411H803125p5434J09149M04908k19870J1892N45143r0451J57082L54557o9432
14401I930669O4204N01351Q7742O8190P0368L69136M0295K04527L23874J26015
14391A1786371o1882N85370k7803K43961K58310L36148K5931L19461L56621k40507
$$ plain form
14461 4441903 4758096 4760179 4680641 5168991 5118978 5120399 4893831 5062385 4945493 5238431
14451 5238431 5266607 5393346 5300806 5440387 5359868 5491280 5636893 5872529 5568178 5716910
14441 5716910 6086256 6000653 5839126 6358354 6180630 6013215 6453640 6591384 6285941 6766284
14431 6766284 6823554 6859595 6944594 6966212 7139521 7162473 6899685 7583885 7388001 7506154
14421 7506154 7684422 7811467 7453603 7624048 7985448 8459487 8439029 8762719 8660140 8803125
14411 8803125 8727691 8836840 9241748 9021878 9033770 9578913 9488462 9645544 10000101 9930669
14401 9930669 9994873 10496224 10583966 10652156 10722524 11091660 11131955 11336482 11660356 11786371
14391 11786371 11724489 12309859 12282056 12526017 12784327 13120475 13146406 13465867 13822488 13581981
14381A3581981N30383K46308K40814J05025P75226m8819K47371L80130K02579
14372A6260998M81427K04632K87263P20192J57045K96745J86859O21069O45727
14363A9861957L82180J89176O28458J29430P74166R2073P80307M99018K81120
14354B3617885P16255P55581K06978R65712L81657Q52752O01984P68177N13248
14345B9380229R41492N85502R37494J113401N51644O02033J062575R18074R36112
14336C7028556J227097J020327Q15449J511023J644161R88600J410985J207275
14328D6853473J672603J190294K015580J712641J426360J692975K252802K137954
14320F0954682K042367K622633J858538K659314K576203K771414K769941L371112
$$ plain form
14381 13581981 14112364 14358672 14599486 14704511 15479737 15430918 15678289 16058419 16260998
14372 16260998 16742425 16947057 17234320 17954512 18111557 18408302 18595161 19216230 19861957
14363 19861957 20244137 20433313 21061771 21191201 21965367 22057440 22837747 23336765 23617885
14354 23617885 24334140 25089721 25296699 26262411 26644068 27496820 28098804 28866981 29380229
14345 29380229 30321721 30907223 31844717 32958118 33509762 34111795 35174370 36092444 37028556
14336 37028556 38255653 39275980 40091429 41602452 43246613 44235213 45646198 46853473
14328 46853473 48526076 49716370 51731950 53444591 54870951 56563926 58816728 60954682
14320 60954682 62997049 65619682 67478220 70137534 72713737 75485151 78255092 81626204
14312H1626204K646352L672474L694088L725184L680057M472889M170184M852847
14304A12540279M887885N347213N836829N315446O671968O336206O730766P712685
14296A61379277P697532P965342Q818136R085844R540060J0012170J0700279J1052787
14288B36251427J1914215J1831899J2671829J2795188J3047843J3488844J3446855
14281C25448100J3375099J3411445J3033478J2135753J1487136J0788499R583808
14274D09263318Q148999O370201L150396Q47964n93249J97257j989900m246129
14266D21148857o035202p089096q003315r730344j0342684j1681732j2887738
14259C55378746j3499565j3989340j4080531j4085504j3068363j3019278j2524485
$$ plain form
14312 81626204 84272556 87945030 91639118 95364302 99044359 103517248 107687432 112540279
14304 112540279 117428164 122775377 128612206 133927652 140599620 146935826 153666592 161379277
14296 161379277 169076809 177042151 185860287 194946131 204486191 214498361 225198640 236251427
14288 236251427 248165642 259997541 272669370 285464558 298512401 312001245 325448100
14281 325448100 338823199 352234644 365268122 377403875 388891011 399679510 409263318
14274 409263318 417412317 423782518 426932914 427780878 427187629 427384886 425394986 421148857
14266 421148857 415113655 408024559 400021244 390290900 379948216 368266484 355378746
14259 355378746 341879181 327889841 313809310 299723806 286655443 273636165 261111680
14252B61111680j2559001j2142298j1337576j0966206j0401184r781951r127724
14245A84795740q595765q075271p966060p266224p281884o837502n951488n983354
14237A26838192m966486n261359n091323m603484m477357m088034l648852l971902
14229I0729395l798254k864217l729337k986493k876586k540672k690247k287456
14221F6956133k167496k055236k208202k176335j915011k019122j786326j481045
14213E1147360j095534j857557j296768j149026j672480j310189r61398p28225
14205D1076183j482337j062722j230374j015884r32321k38329j367712j085287
14197C2661217o71351j133667o49868p01355m64974j151041q02830l46665m93541
$$ plain form
14252 261111680 248552679 236410381 225072805 214106599 203705415 193923464 184795740
14245 184795740 176199975 168124704 160158644 152892420 145610536 138773034 132821546 126838192
14237 126838192 121871706 116610347 111519024 106915540 102438183 98350149 94701297 90729395
14229 90729395 86931141 84066924 80337587 77351094 74474508 71933836 69243589 66956133
14221 66956133 64788637 62733401 60525199 58348864 56433853 54414731 52628405 51147360
14213 51147360 50051826 48194269 46897501 45748475 44075995 42765806 41804408 41076183
14205 41076183 39593846 38531124 37300750 36284866 35352545 35114216 33746504 32661217
14197 32661217 31989866 30856199 30206331 29504976 29040002 27888961 27086131 26739466 26245925
14188B6245925o78024q04510n02319l60377n11910n94271p81350l89456o18166
14179B1005542l17702l68692k55690l60573o98790l22987m17084k39099m01082
14170A7623843n43512l57738j14915m69036k05496p9727n26697o12862p2249r3488
14160A4548123M6878p03630k65003k28624O2389l72818l56042j64333P9729o21876
14150A2024793j33223J70713m65936J67099o14068k19043j00261k75611j26403
14141A0428060L34307o67221J12146j70791k81325k08264P6312k57289k64017
14132I101918J54515k70733m8048k24403j75282k29208K07152l18237q5699j77464
14122G934511m8922j92660l5299l38459K39213k54711l357p6310L8551l00599
$$ plain form
14188 26245925 25567901 24763391 24261072 23900695 23388785 22794514 22013164 21623708 21005542
14179 21005542 20687840 20319148 20063458 19702885 19004095 18681108 18264024 18024925 17623843
14170 17623843 17080331 16722593 16607678 16138642 15933146 15853419 15326722 14713860 14641611 14548123
14160 14548123 14595001 13891371 13626368 13397744 13460133 13087315 12731273 12566940 12646669 12024793
14150 12024793 11891570 12062283 11596347 11763446 11149378 10930335 10830074 10554463 10428060
14141 10428060 10762367 10095146 10207292 10036501 9755176 9546912 9623224 9365935 9101918
14132 9101918 9256433 8985700 8937652 8713249 8537967 8308759 8515911 8197674 8111975 7934511
14122 7934511 7885589 7692929 7657630 7319171 7558384 7303673 7300316 7224006 7262557 6961958
14112F961958J21401j04355p2072j42657k09593k61060J82310k03425K27534l9844
14102F460197k56209j71484L4377m24171N31449m50266j11041J72678l40137p04
14092E444689q3502K06245m28197M0146q4052l3225J15569k19159o041j58167
14082D794306j52436J16540j03413K81072o82797N79047k47650K09657j35950
14073D658376l59866J5699j46162J5045Q5089k26966m6494J25440j81352J24816
14063D063625k40991K22286j83271l17753J45023k0960m1116L24268j39878k20935
14053C590298r3281Q2638k61774N00004k34258k22353j82472J66533k6282M5150
14043C364203k59685J46918m9720l40031K93655k43522N29775m08665m3164P6387
$$ plain form
14112 6961958 7083359 6979004 6906932 6764275 6554682 6293622 6475932 6272507 6500041 6460197
14102 6460197 6203988 6032504 6066881 5642710 6174159 5723893 5612852 5785530 5445393 5444689
14092 5444689 5361187 5567432 5139235 5179381 5095329 5062104 5177673 4958514 4952473 4794306
14082 4794306 4641870 4758410 4654997 4936069 4253272 4832319 4584669 4794326 4658376
14073 4658376 4298510 4314209 4168047 4183092 4268181 4041215 3994721 4120161 3938809 4063625
14063 4063625 3822634 4044920 3861649 3543896 3688919 3667959 3626843 3951111 3811233 3590298
14053 3590298 3497017 3579655 3317881 3817885 3583627 3361274 3178802 3345335 3319053 3364203
14043 3364203 3104518 3251436 3201716 2861685 3155340 2911818 3441593 3032928 2989764 3066151
14033C066151Q8554j3075k46128o1186O4909j55469R6278L2697j22678j58573
14023B591480M095L56160m50108Q4232l713j31548K93569j10217O815l93631J38288
14012B385422L0339j07645N2679l04019R8110J15792j41090L75422l64817j24278
14002B015915J91964j04669k28915J90647J25422j30901J24401J20239l27048
13993A977055o0495J26484M15872M93053Q60143K662522O624157J4392228J1722997
13984C9214016j3433964j1748430m960427k674661j363738j080759k0068k16496
13976C715473m25818m34267J9660J80656p3309n10737l049J55487k61486j03729
13966B258881k79366M94705l55979k91862r7340N78426j57477l35816J01611j1368
$$ plain form
14033 3066151 3154705 3141630 2895502 2834316 2899225 2743756 2840034 2872731 2750053 2591480
14023 2591480 2595575 2951735 2501627 2585859 2582146 2450598 2744167 2633950 2640765 2247134 2385422
14012 2385422 2415761 2308116 2360795 2056776 2154886 2270678 2129588 2505010 2140193 2015915
14002 2015915 2207879 2103210 1874295 2064942 2190364 2059463 2183864 2304103 1977055
13993 1977055 1916560 2043044 2458916 2951969 3812112 6474634 13098791 27491019 39214016
13984 39214016 25780052 14031622 9071195 6396534 5032796 3952037 3931969 3715473
13976 3715473 3289655 2855388 2875048 3055704 2982395 2471658 2468609 2624096 2362610 2258881
13966 2258881 1979515 2474220 2118241 1826379 1729039 2307465 2149988 1814172 1915783 1904415
13956A904415L65756l22996J60910j28069K78312l71313Q7139k23158J56190n81721
13946A325465N60568j5017j47935K95705n35449K3745J97671L98356m90991q4577
13936A527541K99199l11176Q5890P8728j46572J61130k12452n7628K44128Q6925
13926A755713k39289k93679J40180M7647l3232J29963m9027L6264j97922P7759
13916A374377j17263M21897m27352L33520l0696k03937J23214n7941j90610j2814
13906A212395J24400j29068K61498m8449n0914j35404Q4898K16092L0400j41519
13896A424329j2374Q8712l86150O5049L19582l72780J45520J06729M8376k86708
13886A140285R6817Q7021P9349l64380K98895j95415J20596k08717k05381O71070
$$ plain form
13956 1904415 2270171 1947175 2108085 1980016 2258328 1887015 1974154 1750996 1907186 1325465
13946 1325465 1886033 1871016 1723081 2018786 1483337 1507082 1704753 2103109 1612118 1527541
13936 1527541 1826740 1515564 1601454 1680182 1533610 1694740 1482288 1424660 1668788 1755713
13926 1755713 1516424 1222745 1362925 1410572 1377340 1507303 1458276 1494540 1296618 1374377
13916 1374377 1257114 1679011 1251659 1585179 1554483 1350546 1473760 1415819 1225209 1212395
13906 1212395 1336795 1207727 1469225 1420776 1369862 1234458 1319356 1535448 1565848 1424329
13896 1424329 1411955 1500667 1114517 1179566 1499148 1126368 1271888 1378617 1426993 1140285
13886 1140285 1237102 1324123 1403472 1039092 1337987 1142572 1263168 1054451 849070 1520140
13876A520140k32312m27989K50189l04814P9092j88793P05529l23507o6740J21088
13866A131883J91020m41184J11825L88245n17559j5851Q8139J9764m2373j4062
13856H99847J40646o1468K6986Q3340N4472l02373M32640l67862K46641j00785
13846A052084J06008k44286J89241r0249P8846k60756M81499k37525k39805K30825
13836A065882J39770D14816P25605j13559j83116l1019L33275l00216l9988P5687
13826H81485J58292m40253K60202j36404l23918L65347k14528M32929m31977J63413
13816G14588j56231J32133j63934J01954N8725l2792J48693L51724n63405J74550
13806G66005K46898l23086J84886k88687n0088M47266n8752n8927m0966j04245
$$ plain form
13876 1520140 1287828 859839 1110028 805214 884306 695513 1401042 1077535 1010795 1131883
13866 1131883 1322903 881719 993544 1381789 864230 848379 936518 956282 913909 899847
13856 899847 1040493 979025 1006011 1089351 1143823 841450 1274090 906228 1152869 1052084
13846 1052084 1158092 913806 1103047 1012798 1091644 830888 1312387 1074862 835057 1065882
13836 1065882 1205652 414816 1140421 1026862 843746 812727 1146002 845786 805798 881485
13826 881485 1039777 599524 859726 723322 399404 764751 550223 983152 551175 714588
13816 714588 558357 690490 526556 628510 687235 654443 803136 1154860 591455 766005
13806 766005 1012903 689817 874703 586016 535928 983194 924442 865515 824549 720304
13796G20304j35529L91343D21369J49919J95470C49599K29208L49134k20388l30114
13786C77439N33902p6295l1042j17613L2280K40194K25436D67369R2435K04750
13776G64554K74587j67254j79382j16646K04160k25091r931J42549j21987K24144
13766G89703P4630k70578K99971l53149K43375k34970n2411K45399J29874J5868
13756H87712l9854j94661o0490M1650L9849j72510j41403K42778J31618J72867
13746I07556C53886M7184L46466j32298k0341k5735R8730k51216J21308p5249
13736D62735K91204o3847q2416N0182k08028O770K34021m2639J90862C69837J81491
13725E51328k8524n6497k26177J13420j09045M36648j81303N2312r8422J5054
$$ plain form
13796 720304 584775 976118 421369 571288 766758 349599 578807 927941 707553 377439
13786 377439 911341 835046 804004 686391 718671 958865 1184301 467369 559804 764554
13776 764554 1039141 871887 692505 575859 780019 554928 544997 687546 565559 789703
13766 789703 864333 593755 893726 540577 783952 548982 496571 741970 871844 887712
13756 887712 847858 653197 592707 634357 674206 501696 360293 603071 734689 907556
13746 907556 353886 401070 747536 615238 594897 569162 667892 416676 537984 462735
13736 462735 753939 690092 607676 657858 449830 456600 690621 647982 838844 369837 551328
13725 551328 522804 466307 240130 353550 244505 681153 499850 552162 453740 468794
13715D68794P7208o2312J09099j45678M8140J22057k4930B25646K57567m6995
13705D36218j15984L62725A90601N81238l25267p3014o0366M96797l68784o543
13695D34662j01866R2661Q389J10643k52065K76004j51230r1474L42890j80514
13685D88100J1753E7067M42653k37496P747o9726K26306o6216l4273K48094k72298
13674C01858Q8283O0613j47213J19994I9451M78755j59537j15199p8112P0149
13664B95507K4159Q8432j99375K14564A39904M18575n7487P3256k60864L90048
13654G03432k26011k00141j10370K89262M429j85155M47268C43843J69666A50825
13643C76428K08235j45081d2291B18601J6983K13506j6336j55025K13516j64342
$$ plain form
13715 468794 546002 483690 592789 447111 495251 617308 592378 225646 483213 436218
13705 436218 320234 682959 190601 771839 446572 373558 313192 809989 441205 434662
13695 434662 332796 425457 433846 544489 292424 568428 417198 325724 668614 488100
13685 488100 499853 57067 499720 262224 269971 200245 426551 360335 326062 574156 301858
13674 301858 390141 450754 303541 423535 99451 578206 418669 303470 225358 295507
13664 295507 319666 408098 208723 423287 139904 558479 500992 574248 313384 703432
13654 703432 477421 277280 166910 456172 460601 275446 722714 343843 513509 150825
13643 376428 584663 439582 -42291 218601 235584 449090 432754 277729 491245 326903
13633C26903L26861o1578j75708r576j79492J96238n2764Q9315K2677J28064j28485
13622D82455m0385j86575m5428K7625O43872C78142J3962J30641o0044L02083
13612G64784C3016K76506J49623L8144k18975K07135J59935C22326J94268j55849
13602C60745Q2374D9198L19494A57887K93039n3417J94106l5779k13796j7555
13592C24485j4198a00802D28673A37414L57347j30023J06846o9195K584A95465
13581B23249J27161J09356r0793C9405K36760N5570J12792o9358i5910C55392
13570A24013J17509K60734o3156C6079K42378A31512J87017G5885R1012L23110
13560D90007I7270J97395J51020j16858J4217J37594f49A57090N2657M7466J72983
$$ plain form
13633 326903 653764 592186 416478 406902 227410 423648 370884 460199 482876 610940 482455
13622 482455 442070 255495 210067 237692 881564 378142 392104 522745 462701 764784
13612 764784 33016 309522 459145 497289 278314 485449 645384 322326 516594 360745
13602 360745 443119 49198 368692 157887 450926 397509 591615 555836 342040 324485
13592 324485 310287 -100802 428673 137414 494761 364738 471584 402389 404973 195465
13581 223249 350410 459766 368973 39405 276165 331735 444527 375169 -95910 355392
13570 124013 241522 502256 439100 36079 278457 131512 318529 75885 166897 490007
13560 490007 97270 294665 445685 328827 343044 480638 -649 157090 209747 257213 430196
13549D30196A80452K86291C1547N99904l06472l6665r599R6155k9380M6502A03765
13537A14838J81153a11648G0385J38164L15726A37510J22405j00552J77042A40042
13526B52261a4576B15626E0204K25037G4351J62444j7002M3428K86806j80713
13516C69314I3619K60795m8469H2816O6994l5200k9057K10544k3288A18076B0816
13504A20736L98790H6772J88221M7392H9574J30741e7899C37802J45360A18709
13493D13554A95011J50532j00477A10331O6278L98275k32846A62982K1812O5266
13483B50060a3271C33593E6558J86638J9013P1900L4839R3051j96190J44560i5281
13471b9503D07086A40477J94873r8530N8060M5963l6313j22597a96790B75405
$$ plain form
13549 430196 180452 466743 31547 631451 324979 288314 278715 374870 345490 391992 103765
13537 114838 295991 -111648 70385 208549 524275 137510 259915 159363 336405 140042
13526 252261 -14576 215626 50204 275241 74351 236795 219793 263221 550027 369314
13516 369314 93619 354414 305945 82816 149810 114610 85553 296097 272809 118076 20816
13504 120736 519526 86772 274993 322385 89574 220315 -57899 337802 483162 118709
13493 413554 195011 345543 245066 110331 176609 574884 342038 162982 184794 250060
13483 250060 -13271 333593 56558 243196 262209 334109 368948 461999 265809 410369 -95281
13471 -29503 407086 140477 335350 236820 294880 340843 304530 181933 -196790 275405
13460A62660L07458B33054Q5829b64108N7754A82797b7871B55490J02021p5614
13450B81897b6207p7988A78141J30157l4201A25865L21183j73732J17090A16701
13439B79048J71830J26200A39727m0416K56639A08267K1413M92807B43571m2599
13429B00972J67105a27892C23483o0413I7554J16394j5260Q3714N9186j17727
13419B23861E0545Q6840P7166b9807K035A3702K77154J42148j47762A02400c82476
13407B20751l2555n902k1717L83500A71091G14J15613J28191k4147J00034H3689
13395D711b755B78480o7856o4113J76758E5259h5796J6340A16298R7112A04145
13383A45383a93335A20999g9800C34749N1784J70677A93340J72695A67849A2816
$$ plain form
13460 162660 470118 233054 318883 -264108 -206354 182797 -27871 255490 357511 281897
13450 281897 -26207 -104195 178141 308298 274097 125865 447048 273316 390406 116701
13439 279048 450878 577078 139727 99311 355950 108267 129680 622487 243571 200972
13429 200972 368077 -127892 323483 263070 97554 213948 198688 282402 341588 223861
13419 223861 50545 137385 214551 -29807 -27772 13702 290856 433004 285242 102400 -382476
13407 220751 188196 182294 160577 544077 171091 714 116327 244518 220371 320405 83689
13395 4711 -2755 278480 210624 146511 323269 55259 -85796 -69456 116298 213410 104145
13383 145383 -193335 120999 -79800 334749 386533 557210 193340 366035 167849 12816
13372C18802j06564J67853E0653L4924J79491a8286D04577C7859M21939B23049
13361E8079d6613C15213B4829a62275G0956K80120H8873f2147A9810J8467P4582
13350A12859B8855J80142J5759N3275P155K31118A38873J97838J52399J39395
13340F28505E7634J71292L8764O4042A29107A8002N2546K88994j70731J95460
13330C84271d5784D38515H33J97737j2050J08661e5747A70181E7225J57622F283
13318A6948b6880B60869j10109K52413h9592D92453B03925J26017A64801l5831
13308A28970P4966A2526K06991C6275K66005d6822a085k19075A6138N40554b483
13296A45960h8229I1476K884R8394m2R3255b0846A47970J24075q0726A9740a6435
$$ plain form
13372 318802 212238 380091 50653 85577 265068 -18286 404577 37859 459798 223049
13361 58079 -46613 315213 24829 -162275 70956 351076 88873 -62147 19810 38277 112859
13350 112859 28855 208997 224756 278031 285186 516304 138873 336711 489110 628505
13340 628505 57634 228926 267690 331732 129107 18002 70548 359542 188811 384271
13330 384271 -45784 438515 833 198570 186520 295181 -55747 170181 57225 214847 6283
13318 16948 -26880 260869 150760 403173 -89592 492453 203925 329942 164801 128970
13308 128970 203936 12526 219517 36275 302280 -46822 -1085 -220160 16138 556692 -2483
13296 145960 -88229 91476 94360 192754 192712 285967 -20846 147970 272045 191319 19740 -16435
13283B32633b1247D4069l352P4487b32672a5273D57328B24459H0360d6345D78720
13271G6566L8422b01032Q1164F7211f7342l5989A42906K01652l1458A28494e5394
13259F0370R3659J09967a91199A99695q4700B172L8955b0792I2976a22099K0200
13248a01899C32741j36536F6155J35182r9628P8325a14049k35951f5014j96842
13238b61856H8667j9577D672R714K24196J57840j23589p4664C018J66335O4878
13227B34231J90681j30057A04119l3924o964I599J01194K40440B1616a84908A23280
13215A11847a48983B30479D5602J77835r5005a56771A33490g4126C48053i4034
13204b41669B82718j32905a69628A61552a4359A41328b1115A94345o9580J29043
$$ plain form
13283 232633 -21247 44069 40717 115204 -232672 -15273 457328 224459 80360 -46345 478720
13271 76566 114988 -201032 -119868 67211 -67342 -103331 142906 344558 313100 128494 -55394
13259 60370 154029 263996 -191199 199695 114995 2172 41127 -20792 92976 -122099 -101899
13248 -101899 332741 196205 66155 201337 101709 180034 -114049 -350000 -65014 -261856
13238 -261856 88667 69090 4672 14386 238582 396422 272833 198169 3018 169353 234231
13227 234231 424912 294855 104119 70195 63231 9599 110793 351233 21616 -184908 123280
13215 111847 -148983 230479 45602 223437 128432 -156771 133490 -74126 348053 -94034
13204 -241669 282718 149813 -169628 161552 -14359 141328 -21115 194345 124765 253808
13194B53808b25729B22830lB8012N5294B7414K7530a2958p785E8352L2564K5268
13182A16184J50836a70079A24626b11033B22522a80338g6656a497I9365c27029
13171a8610E4423J72150J13636a08098A15666B8605K64831E2321J52143D0380
13160A70263B231L13209j34995R0755j13758H245K2825M06845A21612k9183P943
13149A00372Q9495D8554a97432A61000E5381B6263K05205a24091G2729a91469
13138A92445a25338M0620C3957Q7817n022c35061A50150b65491A41146A403a63345
13126a30446B18438J647n2865l7482c6292E4917K00211a03C47533Q9781G4002
13114c12491b4926D2805a68303B65296b30168I6287a6279A68107J75453D351K28299
$$ plain form
13194 253808 -225729 222830 222827 28012 83306 27414 54944 -12958 -20743 58352 90916 116184
13182 116184 267020 -170079 124626 -211033 222522 -180338 -76656 -1497 99365 -327029
13171 -18610 54423 226573 340209 -108098 115666 28605 293436 52321 204464 40380
13160 170263 2231 315440 180445 271200 157442 8245 31070 437915 121612 92429 100372
13149 100372 189867 48554 -197432 161000 55381 26263 231468 -124091 72729 -191469
13138 192445 -125338 -84718 33957 121774 116752 -335061 150150 -265491 141146 1403 -163345
13126 -130446 218438 220085 167220 129738 -36292 54917 255128 -103 347533 437314 74002
13114 -312491 -24926 42805 -168303 265296 -230168 96287 -16279 168107 343560 4351 232650
13103B32650r2728F8309a23749k57453A66196F4957J93849h875G9758a41025A83429
13091A49427d0345B98929h5937l9481A0973a20660K6693B32936b87462J08275
13081a79187B79506h8410j81125B00239D5831K6155O7594A9134J52536q4487P1290
13070A58473b50433C13275A25363J65358A12556J63217g2176H4412J31214H6867
13059D06065A18877J37232r8853D7248R5039K38132A19798C4764e5606C64276
13048A40353k1373h5463B09841L3254b82401B77506K20048A70410o2474a13639
13037a60794B91374A37558P458m7096m5834f7861F6301J6200a05232j41482E9853
13025a30236C66985b0942B35051M7957P309G5833K7615J87617m8434K3328A15805
$$ plain form
13103 232650 139922 68309 -123749 -381202 166196 64957 258806 -8875 79758 -141025 183429
13091 149427 -40345 298929 -85937 -125418 10973 -120660 -93967 232936 -287462 -179187
13081 -179187 279506 -88410 -269535 200239 45831 71986 139580 19134 171670 87183 158473
13070 158473 -250433 313275 125363 290721 112556 275773 -72176 84412 215626 86867
13059 406065 118877 256109 157256 47248 142287 380419 119798 34764 -55606 364276
13048 140353 118980 -85463 209841 243095 -282401 277506 497554 170410 107936 -113639
13037 -160794 291374 137558 145016 97920 52086 -67861 66301 82501 -105232 -246714 59853
13025 -130236 366985 -20942 235051 283008 290317 75833 103448 291065 242631 265959 115805
13013a13194L7100D4054f6909A03313l0789J85817c13396e9519B37198A7564h6148
13001i9825C06329e0725A42715C0424K25401J01867h5737B11806l7523J33064
12991C07347a84229A86367B7591J28891m4595O9875a58573A40690J29921c7503
12980A43536b43226B95694f2332B46770b5340A52550n5523R7066r6864m5057b13232
12968A42710e8747d591k21598j71597A95751c88096B13787c6528j3844A09079
12957a6350B26935a6050C33540j25392j00096K4672J32209A26045b26030L2487
12947a93543B85370r6865C926L894c02061B20419j9878a75898b2610A5483h1143
12935e4370C50223g6411B25459n6013D9121b18020D3028b9146A02739e9471l3352
$$ plain form
13013 -113194 -76094 44054 -66909 103313 72524 258341 -313396 -59519 237198 17564 -86148
13001 -99825 306329 -50725 142715 30424 255825 357692 -85737 211806 174283 307347
12991 307347 -184229 186367 27591 156482 111887 181762 -158573 140690 270611 -37503
12980 143536 -243226 295694 -62332 246770 -25340 152550 97027 194093 97229 52172 -213232
12968 142710 -58747 -4591 -226189 -397786 195751 -388096 213787 -36528 -50372 109079
12957 -16350 226935 -16050 333540 208148 108052 132724 264933 126045 -226030 -193543
12947 -193543 285370 188505 3926 7820 -302061 220419 200541 -175898 -22610 15483 -81143
12935 -54370 350223 -76411 225459 169446 49121 -218020 43028 -29146 102739 -59471 -92823
12924i2823E7175a83985B5646a64120D7281J39796c90688I6944D2370K62060c4626
12912E2267I316K69576h3015E2604d6278B97906g6554A67804b51997d4080K888
12901d1192A49963c4765a1823E0614K22832a2167m1234A35571a55287C05378I5351
12889A82455C0542J53171g2255B6730J387J9322P753O7480N8084A643M9552a44411
12876A12171d1632B4412M2603b16835C50801A5772c0547f577j62962A86072a2097
12864I8780J64812O609d1252o7738k554j37712F9862a19279B43028c07104A76156
12852h5373d929B81683p8483a38185F1985J70219m6003i7386A24145J9518A0554
12840B3739a21704A13505a61119K6152I3457a03839G25J52831c0041o9784K1374
$$ plain form
12924 -92823 57175 -183985 25646 -164120 47281 187077 -390688 96944 42370 304430 -34626
12912 52267 9316 278892 -83015 52604 -46278 297906 -76554 167804 -251997 -44080 -41192
12901 -41192 149963 -34765 -11823 50614 273446 -12167 -53401 135571 -155287 305378 95351
12889 182455 30542 183713 -72255 26730 28117 47439 55192 122672 180756 1643 51195 -144411
12876 112171 -41632 24412 67015 -216835 350801 15772 -30547 -6577 -169539 186072 -12097
12864 98780 263592 270201 -41252 -108990 -111544 -249256 69862 -119279 243028 -307104 176156
12852 -85373 -4929 281683 203200 -138185 61985 232204 186201 -97386 124145 143663 10554
12840 23739 -121704 113505 -161119 -134967 93457 -103839 725 153556 -30041 -99825 -78451
12829g8451h006B31246b07351C35788G4710k8952a93154M1066I1605J00831d0049
12817a34487H3798R7448b8219B85674j41043a29580M3925K8870i109C29083A63913
12805c22218G4332a09332b215I4550C9043i3020k0536N3096k2843l4239M6241
12794g1301C9829Q3251b6812k3641l13774a50322C86591j54128K6303a00804J9592
12783h1212G0423J19242A9002a27301C5963b52305A1247J12829P7677c42030g1299
12771A16521f620j09501B38061c8834D3815b5515j41056A63181c8859k37826a10399
12759B29696A9784L141P189R5404l3301b22534A07781a91443E6161a31195k0753
12748a51948C45025G8128J52528d8768B3905a22878b6332a2112b488j40181C90142
$$ plain form
12829 -78451 -8006 231246 -207351 335788 74710 45758 -193154 -152088 91605 192436 -40049
12817 -134487 83798 181246 -28219 285674 144631 -129580 -85655 -56785 -9109 329083 163913
12805 -322218 74332 -109332 -2215 94550 39043 -93020 -113556 -60460 -83303 -117542 -71301
12794 -71301 39829 123080 -26812 -50453 -364227 -150322 386591 232463 258766 -100804 -81212
12783 -81212 70423 189665 19002 -127301 35963 -252305 11247 124076 201753 -342030 -71299
12771 116521 -6620 -116121 238061 -38834 43815 -25515 -166571 163181 -38859 -276685 -110399
12759 229696 19784 22925 30114 125518 92217 -222534 107781 -191443 56161 -131195 -151948
12748 -151948 345025 78128 230656 -48768 23905 -122878 -26332 -12112 -2488 -142669 390142
12736G5405e6470l21070J86933A66774O4529a06945B42834m9175J39693h0364
12725I8223d2298l23245e6891j09368g1516p622R646A25002A802J73171b9951
12713C7089e6063H5966K22856l6114n2745H7730R5116m9106L62453h1438B09016
12701I0151J5941N7607d2141j80660n3677r807A31758J72114j37249J64066b31767
12689I5523j8599K1860a72513A97224a64444D9056J06837F0185K72896a15529
12678B76521C8880g6876j50765A3450f3070H0770b5554B10620j3132H6784B3615
12666C95666j61824o474A08955O4967O6611A14329C4580Q0035h0933j5417A99923
12654H7204l5787J51246D6850e5308r805C06441F8297K7302P3286J5278G0724
$$ plain form
12736 75405 -56470 -377540 -190607 166774 231303 -106945 242834 193659 333352 -80364
12725 98223 -42298 -365543 -56891 -166259 -71516 -79138 -69492 125002 1802 174973 -29951
12713 37089 -56063 85966 308822 272708 219963 87730 182846 133740 496193 -81438 209016
12701 90151 106092 163699 -42141 -222801 -276478 -286285 131758 303872 166623 330689 -231767
12689 95523 76924 98784 -172513 197224 -164444 49056 155893 60185 333081 -115529
12678 276521 38880 -76876 -227641 13450 -63070 80770 -25554 210620 197488 86784 23615
12666 395666 233842 227368 108955 173922 240533 114329 34580 114615 -80933 -96350 199923
12654 87204 51417 202663 46850 -55308 -65113 306441 68297 95599 168885 184163 70724
12642G9605J37115i8702a9279C31829l4667o3826b1068B46302l9030b04796R7548
12631a07248H5818l2616L15500N246q5870N83c27733A64247i8660q2432f9871
12619C05571F9351a73777o2403E4688J20813b45591A62148b45207j0106J22581
12609a32732A05314J88781b46782g7358m8946B86718j42188a13210A64142J6634
12599A80776m7905K88747a65803d6150A87390F5283J1244j5794J58945R7211A21152
12587B29310a574n8044k5456P473A10920a11821D9337J60866a6799F9651P2735
12576A42386d0696A5935M03948F5232R1888B979b82733g8107a5605F118c4668
12564A29509b5772m5380m4961a0477j17855C1425J82981P885h6608J1343A27740
$$ plain form
12642 79605 216720 -98702 -19279 331829 297162 233336 -21068 246302 207272 -204796 -107248
12631 -107248 85818 53202 368702 373948 288078 288661 -327733 164247 -98660 -181092 -69871
12619 305571 69351 -173777 -236180 54688 175501 -245591 162148 -245207 -255313 -132732
12609 -132732 105314 294095 -246782 -77358 -126304 286718 144530 -113210 164142 180776
12599 180776 132871 421618 -165803 -46150 187390 65283 76527 60733 219678 316889 121152
12587 229310 -1574 -59618 -85074 -77601 110920 -111821 49337 210203 -16799 69651 142386
12576 142386 -40696 15935 419883 65232 157120 2979 -282733 -78107 -15605 6118 -34668
12564 129509 -25772 -71152 -116113 -10477 -128332 31425 214406 222291 -86608 -75265 127740
12552C34178a04254H9832J17590h4456C12239a895I663N129a3132H4020b29164
12540C4966e2017k6243G6716e9804j78656j78196a18995A4968a42831D5351b59734
12528B59467b56138A91173b05405A89712a24377j01355A55074g1937p727n434
12518h5098A58851f5887o4758B45208K5857q6134f6847K0052j30886C00344A23734
12506G1116M0743n4430h4017k42000C7473d9400j65709G5395J3064o033A4549
12494c7425p4606A39642g7293l93157e9780a1678d901o1964B00635A8259N7521
12483G5780J2867M7998d44548B1230J70360d7767E6999a53714c3783K50B48448
12471b11668r5691h795j15727d8809A94894m1563e0967J7324A72941L3493j6162
$$ plain form
12552 334178 -104254 89832 207422 -84456 312239 -1895 9663 14792 -13132 84020 -229164
12540 34966 -52017 -78260 76716 -59804 -238460 -416656 -118995 14968 -142831 45351 -259734
12528 259467 -256138 191173 -205405 189712 -124377 -225732 155074 -71937 -79664 -85098
12518 -85098 158851 -65887 -130645 245208 271065 184931 -66847 -46795 -177681 300344 123734
12506 71116 111859 57429 -84017 -326017 37473 -49400 -215109 75395 88459 82426 14549
12494 -37425 -112031 139642 -77293 -470450 -59780 -11678 -4901 -66865 200635 18259 75780
12483 75780 88647 136645 -444548 21230 191590 -47767 56999 -153714 -33783 -33533 248448
12471 -211668 -307359 -8795 -124522 -48809 194894 153331 -50967 -33643 172941 206434 190272
12460A90272D7510L0639K03789l0366H4698J7380P5878a35803B96178g5629q3842
12449a59471i942F0123P9431Q06K3110a39886A19705c2536j31348B40892B6980
12437c457m4018m3336A56793a57196k3459a0602j09389b4887A24979K8993c70454
12425A13497n6529b96306m2571O3127g5281n600B53388c70958L9214b395k47544
12414b49939P7229m4660C7742K41497H6121K2053b24263C91779f5813A31519o0914
12403G0605K01150a08861A57895B3596a21755A47295b31778P5582E6866O7839
12393A24705E5845b78808c4362k11966J08371I5406c33505A73615J0916q9486
12383I5045P0842r929G334c40074A29251Q191N146Q7636b42025M7583B93639g0683
$$ plain form
12460 190272 47510 78149 281938 251572 84698 102078 177956 -135803 296178 -75629 -159471
12449 -159471 -9942 60123 139554 140360 163470 -139886 119705 -32536 -163884 240892 26980
12437 -3457 -47475 -90811 156793 -157196 -180655 -10602 -119991 -24887 124979 153972 -370454
12425 113497 56968 -296306 -338877 -275750 -75281 -80881 253388 -370958 -331744 -2395 -249939
12414 -249939 -172710 -217370 37742 279239 86121 108174 -224263 391779 -65813 131519 70605
12403 70605 271755 -108861 157895 23596 -121755 147295 -231778 -156196 56866 124705
12393 124705 55845 -278808 -34362 -246328 -137957 95406 -333505 173615 184531 95045
12383 95045 165887 155958 7334 -340074 129251 137442 142588 230224 -242025 -194442 293639 -70683
12370b6470A45066c39368A19737J73389H5456j4130b89109J18745A29471A2230
12359f6485K5430E1387a13910q1562A39017n2723d73250B636b0063E1974a32576
12347D2816J7559b36631h6136l01671H621J21539J4283c17047o368E6533c39840
12335C65050A65782d6831l37044B2632J70093a6012H6796f5074o554A4311h0324
12323H5777c56727a09575E5627a16941B03018j00615l7672b51031a15192Q246
12313a06946N2140j2448B10766Q900D7567b15590B48285E0994b19372C59846d4385
12301a198A5222a84345G5252k2378d0776A90659a85455J8828B66910G8652K11844
12290B90496a29844C9774a82844P7657b4520J1521A85562a3457A65582n2884D5311
$$ plain form
12370 -26470 145066 -339368 119737 293126 85456 71326 -289109 -170364 129471 12230
12359 -66485 -41055 51387 -113910 -195472 139017 86294 -473250 2636 -20063 51974 -132576
12347 42816 60375 -236631 -86136 -387807 8621 130160 144443 -317047 -323415 56533 -339840
12335 365050 165782 -46831 -383875 22632 192725 -16012 86796 -65074 -71628 14311 -80324
12323 85777 -356727 -109575 55627 -116941 203018 102403 64731 -251031 -115192 -106946
12313 -106946 -54806 -67254 210766 219666 47567 -215590 248285 50994 -219372 359846 -44385
12301 -1198 15222 -184345 75252 52874 -40776 190659 -185455 -166627 266910 78652 290496
12290 290496 -129844 39774 -182844 -105187 -24520 -12999 185562 -13457 165582 112698 45311
12278B61014A5316K54005B3867K27085q194A14732k7757J9925K37125a13044I4992
12266B89720E3078a83741A827a0836H6395K59821a49892A31139J9966n1279a06012
12254e2447I6950L3377a00825B30713m8038e9402A45268K39208h7471A37611B3230
12242b89838B96232J03153A14052B9678N0917b08063h1943E0771O2039j5100J09247
12231B06957K69677B27071l546r5349b63283a4658p7702C82370j07128Q6200A4071
12219A38101a19591B73390d8972B40589b710B19906D6920J41242J1964J19549
12209C19675c711j03160B59253j06837J65055H4681M03182m2858B6105K51293
12199B77398K40240j89461N6369F3811J81988c2278j28683C75872L4909q7977
$$ plain form
12278 261014 15316 269321 23867 250952 242758 114732 86975 106900 344025 -113044 94992
12266 289720 53078 -183741 1827 -10836 86395 346216 -149892 131139 151105 99826 -106012
12254 -52447 96950 130327 -100825 230713 182675 -59402 145268 384476 -87471 137611 23230
12242 -289838 296232 399385 114052 29678 80595 -208063 -81943 50771 112810 97710 206957
12231 206957 476634 227071 223525 128176 -263283 -14658 -92360 382370 275242 361442 14071
12219 138101 -119591 273390 -48972 240589 -2710 219906 46920 188162 200126 319675
12209 319675 -3711 -106871 259253 152416 317471 84681 487863 445005 26105 277398
12199 277398 517638 328177 384546 63811 245799 -32278 -160961 375872 410781 322804
12189C22804A32901o4743A373R5931b97440M1036B47517j03015o3945K2812N6646
12178A60015D9145J89170o0463d5514l4132G0403Q151i5233F3241J1776J16933
12167A91950E8927a43597B61021j0380j577J39209b7453p9631B9246J19530B60
12155G0550F700J594a29790B3914N2034b09902I1218l0256j698e6135A16626J68428
12143B85054b2987B1935h2199C0937a18457A17623N7811a66942F103N5108M6666
12132A07877N4268C8538b06549O9215I8014f8098A09277L5816J08918c65168a37375
12120b46608A94297E9936d9928k5588q0200j90620A22069d5309A07792J13270
12110B21062a23894d3171j84426A56437c7415I4920c6447F1425K17606h5077F0183
$$ plain form
12189 322804 132901 68158 1373 97304 -297440 -256404 247517 144502 80557 103369 160015
12178 160015 49145 238315 177852 -45514 -79646 70403 78554 -95233 63241 75017 191950
12167 191950 58927 -143597 261021 250641 249064 388273 -27453 -107084 29246 148776 260
12155 70550 6700 8294 -129790 23914 75948 -209902 91218 60962 59264 -56135 116626 285054
12143 285054 -22987 21935 -82199 30937 -118457 117623 175434 -166942 6103 61211 107877
12132 107877 162145 38538 -206549 -137334 98014 -68098 109277 145093 254011 -365168 -137375
12120 -246608 194297 59936 -49928 -75516 -155716 -346336 122069 -45309 107792 221062
12110 221062 -123894 -43171 -227597 156437 -37415 94920 -36447 61425 279031 -85077 60183
12098A80677f0991K9779j76801K7508f0325k2950k82805g7739A61917d1233l13409
12087c54642G89i3485A37400a12008j48149i949m8503B59102b17839F9730b11547
12075A88368G1161a54891A13663a36955j5620N6833K6683K2813D3421J02547A100
12063a66512j88561H1558b71558e7232k12560A59607Q5597a02348I4231J9301
12053A13532E2392J89413d9586A55127a25039A63873p0007a28875j84327e8738
12042a68552N3364A25536l2687J97047j20838a45161B37080b38262O3389C71327
12031f4970F281N5165J6304O01719C38274A38943a31286E8604a51944A65062A9713
12019h0607q0391q1099F1766e9437A0920L57072b34j76538j3294A48517o8834
$$ plain form
12098 180677 -60991 -31212 -208013 -180505 -60325 -83275 -366080 -77739 161917 -41233 -354642
12087 -354642 789 -93485 137400 -112008 -260157 -9949 -58452 259102 -217839 69730 -211547
12075 188368 71161 -154891 113663 -136955 -152575 -95742 -69059 -46246 43421 145968 1100
12063 -166512 -355073 81558 -271558 -57232 -269792 159607 245204 -102348 94231 113532
12053 113532 52392 241805 -49586 155127 -125039 163873 93866 -128875 -313202 -58738
12042 -168552 -115188 125536 92849 289896 169058 -145161 237080 -238262 -174873 371327
12031 -64970 6281 61446 77750 679469 338274 138943 -131286 58604 -151944 165062 19713
12019 -80607 -160998 -242097 61766 -59437 10920 367992 -234 -176772 -190066 148517 79683
12008G9683c89611G23b23787J06769k8309A30530C8401b13655A31170g2556o6421
11997a38977j11469d8791l04864A16090J0599J03646a11528b5855A65309n6613
11987A08696J3227K8609G0327b22215M7717p6693C2588a26491n1626O6585L0296
11976h1236n0618N1722B0411R8846c33966f5002j85106a21782b8562j71020G9226
11964b32272E3411b5318k05514b8037E969R6546b7032o6894E3582N7613J15233
11953B26428H6751f098k27049a2060j99853j63891A11219b73890A23151e1988
11942B92166a63209O9702j24182g0929J7495q9306d5859J5408J0815j2697B46558
11930B67172g8701a2718A10119j4300l5880K41148j29577K61463a8734I4315K80255
$$ plain form
12008 79683 -389611 723 -223787 -117018 -145327 130530 38401 -213655 131170 -72556 -138977
11997 -138977 -250446 -48791 -353655 116090 126689 230335 -111528 -25855 165309 108696
11987 108696 121923 150532 70327 -222215 -174498 -251191 32588 -126491 -178117 -111532 -81236
11976 -81236 -131854 -80132 20411 119257 -333966 -65002 -250108 -121782 -28562 -199582 79226
11964 -232272 53411 -25318 -230832 -28037 5969 102515 -27032 -93926 53582 111195 226428
11953 226428 86751 -6098 -233147 -12060 -211913 -375804 111219 -273890 123151 -51988
11942 292166 -163209 -93507 -217689 -70929 -53434 -142740 -45859 -30451 -19636 -32333 246558
11930 267172 -78701 -12718 110119 95819 59939 301087 171510 432973 -18734 94315 374570
11919C74570b79149P5668B72686f6310j33584A06522d06463I4095e7244A84403
11908b42611l7481B6056a5135B41466f5461A44913b980E0080L6011b7712j84654
11897b12366B78824p9005K00445a87578o0052A46300J7665D4897L6501l9795a1487
11885A71940a80642P9440A6982J41257a39187j07017a14112A2355R4504i9903
11874b05450G2682a58768E4160a21051j88775a20279B72988Q6616g2254J2283
11864e9971j92819n9607G4334b79916h466j47000a1311o3100H2720a6805k10030
11853b26835Q0242j21194A27791K9809a65479P1368M7048j93295C7128b00793
11842d6774j72962C74990A12738p223a2357r9579j18578B3401K98072I7227K4150
$$ plain form
11919 374570 -279149 -203481 272686 -66310 -199894 106522 -406463 94095 -57244 184403
11908 -242611 -280092 26056 -15135 241466 -65461 144913 -2980 50080 86091 -27712 -212366
11897 -212366 278824 199819 400264 -187578 -247630 146300 163965 44897 81398 41603 -11487
11885 171940 -180642 -101202 16982 158239 -139187 -246204 -114112 12355 106859 -99903
11874 -205450 72682 -158768 54160 -121051 -309826 -120279 272988 359604 -72254 -59971
11864 -59971 -252790 -312397 74334 -279916 -8466 -155466 -11311 -74411 82720 -16805 -226835
11853 -226835 -146593 -267787 127791 157600 -165479 -94111 -47063 -240358 37128 -200793
11842 -46774 -219736 374990 112738 105515 -12357 -111936 -230514 23401 321473 97227 121377
11831A21377b00911b4806B23416m8505b4209C22457f9382C37764c8434a8085H6905
11819B47277b58230J13958k9974B7088a22166q9309F9743b56366J14904A02319
11808a52486D7639a31943N0130m8163B9159J00702a27759j5928j91653K7635A35470
11796a02226A9852d9741H9557J32202b58670h6723b7731j74005N4311F2557K9840
11785I2397J03186a1843F0984b38679F045c46760f0744H6144e4315b4235A85731
11773A38155a51318A97517f4241k63928J26290H8805a82159A93558m0997A0513
11762b99565g346j31836c4263J5107A68239a1089p0134j38740B27824a58245A27614
11750A53845a02882b2021b028A9015K97187A7365J35963f0137B42796a07822H3837
$$ plain form
11831 121377 -200911 -24806 223416 174911 -24209 322457 -69382 337764 -38434 -18085 86905
11819 247277 -258230 -144272 -174246 27088 -122166 -211475 69743 -256366 -141462 102319
11808 -152486 47639 -131943 -81813 -129976 29159 129861 -127759 -143687 -335340 -307705 135470
11796 -102226 19852 -49741 89557 221759 -258670 -86723 -27731 -201736 -147425 62557 92397
11785 92397 195583 -11843 60984 -238679 6045 -346760 -60744 86144 -54315 -24235 185731
11773 138155 -151318 197517 -64241 -328169 -201879 88805 -182159 193558 152561 10513
11762 -299565 -7346 -139182 -34263 -19156 168239 -11089 -81223 -219963 227824 -158245 127614
11750 153845 -102882 -22021 -2028 19015 316202 17365 153328 -60137 242796 -107822 83837
11738D2895f0514E2306b5466A95716a11078k8440J756J7191R529J5478A07329
11726A34019M6503m3372e4565I5794b6930e779q6333b8525B43461A04704i0282
11714b75900j478A79514h769C00716b7406k54107E9720A7949b83445B62521a53827
11702b06726I8881L7004a7244n3347F1635J23842J55976h197A3997b98487A35136
11690a35132B24415a77139A64488a89949K2106N1427c7894B83580a04072A40058
11679A94092m9028Q5204a2976A46788J33271h2797L5431C6402a11073M8480j16854
11668a79447A61494j735J1476o0383G191a93507B16574N2324a6213C6208a43212
11656a26285A30008P1362m3984b27116a7949o4473B96914A6688d8764i278A34395
$$ plain form
11738 42895 -60514 52306 -25466 195716 -111078 -139518 -137762 -120571 -111042 -95564 107329
11726 134019 180522 137150 -54565 95794 -26930 -5779 -92112 -28525 243461 104704 -90282
11714 -275900 -277378 179514 -8769 300716 -27406 -281513 59720 17949 -283445 262521 -153827
11702 -206726 98881 135885 -17244 -70591 61635 185477 341453 -8197 13997 -298487 135136
11690 -135132 224415 -177139 164488 -189949 -167843 -116416 -37894 283580 -104072 140058
11679 194092 145064 230268 -12976 146788 280059 -82797 -47366 36402 -111073 -62593 -179447
11668 -179447 161494 159759 171235 110852 7191 -193507 216574 268898 -16213 36208 -143212
11656 -126285 130008 201370 157386 -227116 -17949 -82422 296914 16688 -48764 -9278 134395
11644a33686D0307a03007K8113F5971J2297J46917c47253J39106L7987g5445J2564
11633f2881B6563J9197L1047i2519D73920A46619D7051j9931J6981J25313j5670
11622A53744a6013F7780M61613B09003b6379r4698o3934B102J7763J15628b51671
11610a64927E5537o294a10523n2572a0376l8387j49599a4740j11637K2995B77761
11598D18226A19316K46903b04044B21279d1292A78572l406N2158E8870e2423a4370
11586B24400H1807E68K41304j10477A1052L13924g167k10764k1227A86213c6955
11574B75138E0328O8803J1355D9026J8681p488K13467m8894L5970a07874I881
11562b06479A52626N6994P1382a87215E0233R7679Q9393n6848a4364A01535J14189
$$ plain form
11644 -133686 40307 -103007 -74894 65971 78268 225185 -347253 -208147 -170160 -75445 -62881
11633 -62881 26563 45760 76807 -92519 473920 146619 47051 27120 44101 169414 153744
11622 153744 -16013 67780 529393 209003 -26379 -121077 -185011 2102 19865 135493 -251671
11610 -164927 55537 49243 -110523 -163095 -10376 -48763 -198362 -14740 -126377 -103382 277761
11598 418226 119316 366219 -204044 221279 -41292 178572 175166 227324 58870 -52423 -14370
11586 224400 81807 568 241872 131395 11052 324976 -7167 -217931 -239158 186213 -36955
11574 275138 50328 119131 130486 49026 67707 60219 273686 224792 260762 -107874 9881
11562 -206479 152626 209620 281002 -187215 50233 147912 237305 180457 -14364 101535 215724
11551B15724o9919K726b1531A09533b98256a08895B38960o8788c16307J49096
11541a67211A79403a15952b4202A59795p6284d8105l73350a28379M7356B37554
11530B57219M7158H2087M8974J71941j44949f4782B35620g1072r0307J9326K8877
11519a13176F6897b47152A73154A1541g5744n369e282B88386A19366J6555a71494
11507B71477K37020r2475A53503a37235B94825K5724m3467L6360H7878L69J10959
11496A99206f4032A25792K12383h4081A43491R3729m7914J99454b76782B7447
11485D55803G7574N5949b6681O808C6156J77418F1417j1508O7062R1767a11538
11473D69258a33724B25542J57982j12398a88760e7196B90180o8425G4861J28239
$$ plain form
11551 215724 145805 148531 -21531 109533 -298256 -108895 238960 170172 -316307 -167211
11541 -167211 179403 -115952 -24202 159795 83511 -48105 -421455 -128379 -81023 237554
11530 257219 304377 82087 131061 303002 158053 -64782 235620 -71072 -161379 -142053 -113176
11519 -113176 66897 -247152 173154 11541 -75744 -81113 -5282 288386 119366 135921 -171494
11507 271477 508497 416022 153503 -137235 294825 320549 277082 313442 87878 88247 199206
11496 199206 -64032 125792 338175 -84081 143491 237220 189306 388760 -276782 27447
11485 455803 77574 133523 -26681 -19873 36156 213574 61417 49909 116971 208738 -111538
11473 469258 -133724 225542 383524 271126 -188760 -57196 290180 221755 74861 203100
11463B03100I5444a4459C90494A74307b90523a13571A16927d691C6566D131J49716
11452A53847K65634d6875j06653A87817b5027H6215a20744A55605n2758a87458
11441D5561d410r1848D26100j39309E6171f0778O515A45616a89131E2670K53732
11430C06402A9471c3963G5786Q9088b8326A22259a58689l2581K86E8858A1555
11418a0478A80061g1220j5345B54945c2584B06419h6975A8977b37447A76384R3307
11407B69691B0084h7459C5134a08256E2895P1854O8089c2387A92248F8979M6793
11396A15772l4443N1247L7321m5720N824J76730a53096k6322C30136c37402A00482
11384c60024a7320j01209M5921a7631l35587G9240a51774J6520a2540B44989h5214
$$ plain form
11463 203100 95444 -14459 390494 174307 -290523 -113571 116927 -4691 36566 4131 153847
11452 153847 419481 -46875 -153528 187817 -25027 86215 -120744 155605 102847 -187458
11441 45561 -4410 -96258 426100 286791 56171 -60778 -54263 145616 -189131 52670 306402
11430 306402 19471 -33963 75786 164874 -28326 122259 -158689 -191270 -190984 58858 11555
11418 -10478 180061 -71220 -86565 254945 -32584 206419 -86975 18977 -237447 176384 269691
11407 269691 20084 -87459 35134 -108256 52895 124749 192838 -32387 192248 68979 115772
11396 115772 81329 132576 169897 124177 130001 306731 -153096 -179418 330136 -337402 100482
11384 -360024 -17320 -118529 -72608 -17631 -353218 79240 -151774 -135254 -12540 244989 -85214
11372A5629K567d9637A35017O3777c00480A42569B8528K53627q8026B6893a02953
11360A50190b01392O3096j75665J42349A15709M8941b14393L9306f982k45844
11350b52826f7639A12713a12281G565R1085K52724B3882a77259C298d9449k08668
11339b58117L207D9984b2272A45711e7921a1395B18265i7024i368k49038F0775
11327e4106j7269E8361f9630B70294a18127e4500p1179B0505a93041B4234r866
11316A4368K00456e41l42629C01051A4799a50039A39205j8949a16519R809r7690
11305b04400E77102D3229j3104h9641j78349A25384a23007j75512D9453J24863
11295A74316b9754A55269a08798m8534r9220A25422a55565J6766D4507c9119F4532
$$ plain form
11372 15629 18196 -49637 135017 198794 -300480 142569 28528 282155 194129 26893 -102953
11360 150190 -201392 -138296 -313961 -171612 115709 164650 -214393 -175087 -6982 -252826
11350 -252826 -67639 112713 -112281 7565 98650 351374 23882 -177259 3298 -49449 -258117
11339 -258117 -254910 49984 -22272 145711 -57921 -11395 218265 -97024 -9368 -258406 60775
11327 -54106 -71375 58361 -69630 270294 -118127 -54500 -125679 20505 -193041 24234 14368
11316 14368 214824 -541 -343170 301051 14799 -150039 139205 120256 -116519 -106710 -204400
11305 -204400 577102 43229 30125 -89641 -267990 125384 -123007 -298519 49453 174316
11295 174316 -29754 155269 -108798 -157332 -256552 125422 -155565 -138799 44507 -39119 64532
11283f745A98428h5638B27117f5171C12507h1405H121d19788A21670J9923L43461
11272D85054b5537j97927q5350J48599B84768a94267R3579K7248C9906a01678
11261d3767I3266b28046o3186C7031a83003d6302I351b73573A91481b13939K1072
11250a92867d9448B97973c21817A82028a68645J8108B06953b97458i8788F7969
11239b94831E34618a60126C3486c1493G3680f5967I0038A698J14228b9995n13
11228c0508B42489C5338e6820f79k43413j25015A1128a42616A5046c48742A72276
11216C5640a57556o6936o6897J2775g2220k85661D24662i7604B11278b96609C0348
11204a89470B07810e9170r3824d6491j10934B04535c02307A17560d35225A13236
$$ plain form
11283 -6745 198428 -85638 227117 -65171 312507 -81405 8121 -419788 121670 141593 485054
11272 485054 -25537 -223464 -308814 -160215 284768 -194267 -100688 -73440 39906 -101678
11261 -43767 93266 -228046 -291232 37031 -183003 -46302 9351 -273573 191481 -213939 -192867
11250 -192867 -49448 297973 -321817 182028 -168645 -150537 206953 -297458 -98788 67969
11239 -294831 534618 -160126 33486 -31493 73680 -65967 90038 1698 115926 -29995 -30508
11228 -30508 242489 35338 -56820 -679 -244092 -369107 11128 -142616 15046 -348742 172276
11216 35640 -157556 -224492 -291389 -278614 -72220 -357881 424662 -97604 211278 -296609 30348
11204 -189470 207810 -59170 -152994 -46491 -157425 204535 -302307 117560 -435225 113236
11193i5008B1105J16865b7749A6018b15802B36414b42377j0184j11826a36331
11182h3697D06363A28783a57465I8048B4308R7397K98803B7502J44936d01195
11171f9041o5463E4691J01446a69170G4634g291j06199q2145c8291D15855B0141
11159I859L1307e322j37815A38553M60d72154a28214I6183a64530I5114c3186
11147a03470A39020c32053B16552A04834c13926A18998a05670C2219a74590q862
11137a83452I8926K13672j08588a95612G226a49284B19944A8724d7986A42500
11126C07944g7227K4350j19899I1123J5268J8592h2465o5501D8822L3455e6735
11114A95649J16945I3986a2887k2470k5851G19K80342a47242j69726A3857f6306
$$ plain form
11193 -95008 21105 137970 -27749 16018 -215802 236414 -242377 -252561 -364387 -136331
11182 -83697 406363 128783 -157465 98048 24308 121705 420508 27502 172438 -401195
11171 -69041 -134504 54691 156137 -169170 74634 -7291 -113490 -195635 -38291 415855 20141
11159 9859 41166 -5322 -143137 138553 139013 -472154 -128214 96183 -164530 95114 -33186
11147 -103470 139020 -332053 216552 104834 -313926 118998 -105670 32219 -174590 -183452
11137 -183452 98926 312598 204010 -195612 7226 -149284 219944 18724 -47986 142500
11126 307944 -77227 -52877 -172776 91123 106391 124983 -82465 -147966 48822 82277 -56735
11114 195649 312594 93986 -12887 -35357 -61208 719 281061 -147242 -316968 13857 -66306
11102A27327g9765B40149J6058j699F0125k4122J12415h8926D41618g1925B43033
11090A91122K0601B0342b60212B87956A31900K0282m6556R9379J74363q4641j00483
11079A94244o1983k0999a27895E6529K91498j22400K01588j64484A01704J77684
11069B79388k3936b05336C96961j97502k3770K0664K32466j62697L79953j22872
11059E23203j39321J35562j7363K82401j6487l66240J15882K19941J49201m41463
11049D45316L87849D08732J98814k66420N91864j06210j40731k50020M60864C63549
11038I07113r0698j43192P0715q0029M45301k80444j8451l48664L94474N4093
11028I10218k80112n6135K07846j27416J72849l2055J52546j11634q6251l55687
$$ plain form
11102 127327 -79765 240149 256207 254508 60125 36003 148418 -88926 441618 -71925 243033
11090 191122 211723 20342 -260212 287956 131900 152182 105626 205005 379368 294727 194244
11079 194244 132261 111262 -127895 56529 348027 225627 427215 262731 101704 279388
11069 279388 255452 -205336 396961 199459 175689 196353 428819 266122 646075 523203
11059 523203 383882 519444 502081 784482 767995 401755 517637 737578 886779 445316
11049 445316 833165 408732 607546 341126 932990 826780 686049 436029 896893 363549
11038 907113 816415 673223 743938 663909 1109210 828766 810315 461651 856125 910218
11028 910218 630106 573971 781817 654401 827250 795195 947741 836107 749856 394169
11018C94169K53255k27987M17230k26915L02682p4068k52399K8584j09307L83486
11008H88730o2319j15075L34056m51213J34374Q0306j9918J39997l73389q892
10998E46657K48885j43745q5619k70392N31684j55311k85228K0701O10071l7861
10988I79842k61154L94433l07627P4617l7835J18489K72598R2490P0222j2945
10978A383130K52640K10176P8006J89483N68494L42872r902N28446k04237k51334
10968C087774L9913J20609k66502m85335m54167l08644L3437m60817J90240k22630
10958A273878j32623L10500N9728j75453l60190J12338m61417j1784K24185m06638
10948D32524Q1659j40744P978j80591R5338K2371l7390Q3768c2761A57610K93103
$$ plain form
11018 394169 647424 419437 836667 609752 912434 838366 585967 614551 505244 888730
11008 888730 826411 711336 1045392 594179 728553 808859 788941 928938 555549 546657
10998 546657 795542 651797 566178 295786 827470 672159 386931 407632 1017703 979842
10988 979842 718688 1113121 805494 880111 842276 960765 1233363 1325853 1396075 1383130
10978 1383130 1635770 1845946 1923952 2113435 2681929 3024801 3014899 3543345 3339108 3087774
10968 3087774 3127687 3248296 2981794 2496459 2042292 1733648 1767085 1306268 1496508 1273878
10958 1273878 1141255 1451755 1511483 1336030 975840 1088178 626761 614977 839162 432524
10948 432524 514183 373439 381417 200826 296164 318535 281145 364913 -32761 157610 450713
10937D50713p5799j52041e5894n4393B22606c72364A77874L5781b4646B4625L9347
10926F3972j2339L7564c42026J46298o7463h0542A72644d1007A41120a63207a3103
10914i8090I6028O0284J18061a1384G4089a76873B61998A10913e7474E4240C564
10902b620l8648l1739r8201C35455a01872j25746A95177C2578d06204B29973B0645
10890A79491b2495A01410K8526e9715C0139Q9071a53028d7604j45350B34129i6830
10878g0615a3813m0560K4564B0902d6218J0753J0596r4552C48260g2534l3346
10867a05880G9259a53257c2303D0540K76126Q9797d27056b13071L7128E6277M4173
10856A00450J47l3785a86574P4489B96544A07491O9512c15539g7882B29725a50289
$$ plain form
10937 450713 374914 222873 -55894 -110287 222606 -372364 177874 213655 -24646 24625 63972
10926 63972 51633 89197 -342026 -195728 -263191 -80542 172644 -41007 141120 -163207 -13103
10914 -98090 96028 156312 274373 -11384 74089 -176873 261998 110913 -57474 54240 3564
10902 -2620 -41268 -73007 -171208 335455 -101872 -227618 195177 32578 -406204 229973 20645
10890 179491 -22495 101410 129936 -59715 30139 119210 -153028 -47604 -192954 234129 -96830
10878 -70615 -13813 -54373 -29809 20902 -46218 -35465 -24869 -119421 348260 -72534 -105880
10867 -105880 79259 -153257 -32303 40540 316666 406463 -427056 -213071 -175943 56277 100450
10856 100450 100597 66812 -186574 -112085 296544 107491 177003 -315539 -77882 229725 -150289
10844b31317F9741a10905k8636q6121c2540j06295A27220F282g5936K7765r8075
10833a46246c3894F9524j5258h3821C8287K7342a3718j28690e2966A55516a47446
10821a00951r061H67d6207r7698p6474g7965A95043C9538d5759l11013e5968r9992
10809a55960c1566b235D6480A8208b6104q1268l9644M1211a2928l31636a1820
10797a19626l1096A50612b32521p917b2041E6898g0534G4370J01001b8364o7171
10786i5535j0805j0013o2348d9844E3637h5190r6456o7776D3346L32897Q968B7519
10773b83827p3879A52463b48255a18146e0682A2422L57403G3628J20188d853A9236
10761a40180c38o4083A18339e1353n698A2395b08148H8558c6644l51667A15913
$$ plain form
10844 -231317 69741 -110905 -139541 -225662 -32540 -138835 127220 6282 -75936 -48171 -146246
10833 -146246 -33894 69524 54266 -83821 38287 65629 -13718 -142408 -52966 155516 -147446
10821 -100951 -110012 867 -46207 -143905 -220379 -77965 195043 39538 -45759 -356772 -55968 -155960
10809 -155960 -31566 -2235 46480 18208 -26104 -107372 -147016 -105805 -12928 -344564 -11820
10797 -119626 -150722 150612 -232521 -240438 -22041 56898 -70534 74370 175371 -28364 -95535
10786 -95535 -106340 -116353 -178701 -49844 53637 -85190 -181646 -249422 43346 376243 385211 27519
10773 -283827 -357706 152463 -248255 -118146 -50682 12422 369825 73628 193816 -4853 19236
10761 -140180 -338 -64421 118339 -51353 -57051 12395 -208148 88558 -36644 -388311 115913
10749A3617d62067g035j35327A67871a0486j5688B9289P379c3669R134m1941F5804
10736i1699j2468j1299A1086i7753d4655j38890j68556a22581A33225a48664L3884
10725a14780A17418a6736k1057C4249a54054B14365d2466j33019P75B10399P8868
10714B89267I3520B8998j0660Q0797D6002d0427J1976k63541C5183f9369F5235
10702e56A91143b43086B31994p5928p3670b18A39043c36129l593g4862C18891
10690a22223a0716l6755B9670c87245A064i7535j41171G1576Q2839c35064B5376
10678d27201G4653g6724B05581a48424k72204h192A45643n3322N083O4397a4602
10666a50604a9700j3914A97439b60835c0265A25948K3223E5037d46921R6206a15709
$$ plain form
10749 13617 -462067 -7035 -142362 167871 -10486 -26174 29289 36668 -33669 -24535 -66476 65804
10736 -91699 -104167 -115466 11086 -97753 -44655 -183545 -352101 -122581 133225 -148664 -114780
10725 -114780 117418 -16736 -37793 34249 -154054 214365 -42466 -175485 -174710 210399 289267
10714 289267 93520 28998 18338 99135 46002 -40427 -28451 -291992 35183 -69369 65235
10702 -556 191143 -243086 231994 156066 82396 -218 139043 -336129 -339722 -74862 318891
10690 -122223 -10716 -47471 29670 -387245 1064 -97535 -238706 71576 154415 -335064 25376
10678 -427201 74653 -76724 205581 -148424 -420628 -8192 145643 92321 97404 161801 -14602
10666 -150604 -19700 -33614 197439 -260835 -30265 125948 149171 55037 -446921 -350715 -115709
10654D9422J72547b15301A85044c42584b7143j35693l585b9460A22985d699j46399
10643a51098C6360e0288F2072b6253j39303b3439A40760C2390L86840A38214b85398
10631B7744J2669J24197C3655R3422f2731A30961g2579j43902d0136A76983c55934
10619C1272a22831N9944l3246K6737j30860d6025j20792o5225O0355g1461A1915
10607d4107j23346B85017j11962d1225a2270j71915A09543a20666r4802f3427
10596a50175N9192k848a8622A60108A0392a38869k8005B11038b38252C80g4456
10584B04479h2629C360i418j57761A33730b80742a10323C3377a88969k4875f6162
10572A48677h0298B25446f0020k84476a44678B5384Q3325b92815f490r607j000
$$ plain form
10654 49422 221969 -215301 185044 -342584 -27143 -162836 -166421 -29460 122985 -4699 -151098
10643 -151098 36360 -50288 62072 -26253 -165556 -23439 140760 32390 419230 138214 -285398
10631 27744 40413 164610 33655 127077 -62731 130961 -72579 -216481 -40136 176983 -355934
10619 31272 -122831 -62887 -96133 -69396 -200256 -46025 -166817 -232042 -171687 -71461 11915
10607 -44107 -167453 285017 173055 -41225 -12270 -184185 109543 -120666 -215468 -63427
10596 -150175 -90983 -93831 -18622 160108 10392 -138869 -166874 211038 -238252 380 -74456
10584 204479 -82629 3360 -9418 -167179 133730 -280742 -110323 33377 -188969 -213844 -66162
10572 148677 -80298 225446 -60020 -344496 -144678 25384 108709 -292815 -6490 -16097 -17097
10561a7097k09837a04179n223l908j7892C3964g6970A67683c07356A34304h0594
10549d3757d017o0370r7579e2070A06129a13449A53672e9940H9666J21102m6240
10538A64528O3447d9946n0647j03360L8029j0438j7223B25180B8587M9789J30339
10527B08715d9260A22020P1873a9238B9938r261N2502R6747p8481J85632A00856
10515a78350B54621A25763c2268A58013J49038h3560j16192i5921A47878a15218
10504d5726j84004d3873o8630A9465R0502k6867L7449a0500C61377b18394I3698
10492c08115i098A31813a67131N1390I7999b1056A79001d3647P939H0192K17610
10481B97802n4664K31510M8806j53632a61250B94507D2050b13661G2694a84181
$$ plain form
10561 -17097 -226934 -104179 -109402 -113310 -131202 33964 -76970 167683 -307356 134304 -80594
10549 -43757 -4017 -64387 -161966 -52070 106129 -113449 153672 -59940 89666 210768 164528
10538 164528 227975 -49946 -100593 -203953 -165924 -176362 -193585 225180 28587 78376 208715
10527 208715 -49260 122020 193893 -19238 29938 20677 73179 169926 91445 277077 100856
10515 -178350 254621 125763 -32268 158013 307051 -83560 -199752 -95921 147878 -115218
10504 -45726 -229730 -43873 -112503 19465 109967 83100 120549 -10500 361377 -218394 93698
10492 -308115 -9098 131813 -167131 -115741 97999 -21056 179001 -43647 -35708 80192 297802
10481 297802 243138 474648 523454 369822 -161250 294507 42050 -213661 72694 -184181
10470c6380j39741P0653I3468b36533d9238C521g4221j747N200j99561G958d1051
10457F2983B7029K0262J36918K12041b9233j37281G085J40800E7885h4667J9768
10446f4899E9884i1148D8748M9065K03388a92623a2327k2529j77817N0249j58525
10435c20949J45600A48640l6365a1676j69742M1558A20683b25528p4478F0136
10424e6228l41653J21722h217j78873e2269k15538a9180n7255Q283A15890M6991
10413A62881g4197q0174e4305a4681k1876j5554k74738A44964M0959b89790B44509
10401c1411F6612a68164c2987j0534J8545A80238F4882M0804L89442j92570q9505
10390B13053H1339k2707K59044F3885a93399f8300B29258d267o2658B95195i2187
$$ plain form
10470 -36380 -176121 -105468 93468 -236533 -49238 3521 -74221 -75968 -70768 -270329 7958 -41051
10457 62983 27029 47291 184209 396250 -29233 -166514 7085 147885 57885 -84667 -64899
10446 -64899 59884 -91148 48748 97813 301201 -192623 -12327 -34856 -212673 -162424 -320949
10435 -320949 -175349 148640 112275 -11676 -181418 -139860 120683 -225528 -300006 60136
10424 -56228 -397881 -276159 -8217 -187090 -52269 -267807 -19180 -76435 -68152 115890 162881
10413 162881 -74197 -154371 -54305 -14681 -36557 -52111 -326849 144964 185923 -289790 244509
10401 -31411 66612 -168164 -32987 -43521 -24976 180238 64882 105686 495128 302558 213053
10390 213053 81339 58632 317676 63885 -193399 -68300 229258 -4267 -66925 295195 -92187
10378A94538q0115R1792J22240j11719A04368J23298J31863G2255a87275A20933
10367C31408J79714J30029k65421Q4726O0730F0131K14668j36990M2884a03381
10356B9924K71239O6815k7243l7754K7643J36121K33733R6034l01224B15286L4270
10345B49556K21199N3824k929n5695q0750H152J01372K48299k4980p8950M8227
10334C02120c3658G5911J31505a55012B17295F6028K28362g6643A14217k2541
10324I1676P1342K36451n7972C4042J1625J57045K141E1181Q8262p160N8679b18385
10311a3011j14063J4813O961d3531A36172a2354A52891E4491J49781c3203j43860
10300a77063P1725C18796A02139k3191L8843n4256J49120H8060K07610a22052
$$ plain form
10378 194538 114423 206215 328455 216736 104368 227666 359529 72255 -187275 120933
10367 331408 511122 641151 375730 460456 521186 60131 274799 137809 180693 -103381
10356 29924 301163 367978 340735 302981 330624 466745 700478 796512 495288 215286 249556
10345 249556 470755 524579 521650 465955 385205 8152 109524 357823 332843 253893 302120
10334 302120 -33658 75911 207416 -155012 217295 66028 294390 -76643 114217 91676
10324 91676 163018 399469 341497 34042 45667 202712 204853 51181 139443 132283 190962 -218385
10311 -13011 -127074 -112261 -105300 -43531 136172 -12354 152891 54491 204272 -33203 -177063
10300 -177063 -105338 318796 102139 78948 117791 63535 212655 88060 295670 -122052
10289D1997Q1384o159a89992d5911D8810I997c13232F7480Q8859J41339G6892
10277b64530a01442J6268L3630A32705J23637i6318d2103k81824b1361o6738c7553
10265a72430A69646a28143j04969B22801a0061B7820J5787L78595a01435C86783
10254B64108j03887D9129a44061A9575a12870A3801J02591a56829P2890b4301
10243b91668B1863q161a09904d7656r015j01535A06811b03878j3601H307J37234
10232A45541b19752o4229B19213d4624o3553m6751A04505c907k5510A88181l5415
10221A52766k7494j0456C566b07648N4134n2787L1013k7350A44076e4683a9845
10209a54973f8749k92640d7364A96490i7667K7435C5488K5779d01913A73900b23799
$$ plain form
10289 41997 123381 117222 -189992 -45911 48810 9997 -313232 67480 156339 297678 76892
10277 -264530 -101442 -85174 -51544 132705 256342 -96318 -42103 -323927 -21361 -88099 -37553
10265 -172430 169646 -128143 -233112 222801 -10061 27820 43607 422202 -101435 386783
10254 264108 160221 49129 -144061 19575 -112870 13801 116392 -156829 -83939 -24301
10243 -291668 21863 13702 -109904 -47656 -56671 -158206 106811 -203878 -217479 8307 145541
10232 145541 -219752 -283981 219213 -44624 -108177 -154928 104505 -3907 -29417 188181 152766
10221 152766 125272 114816 3566 -207648 -153514 -206301 -175288 -202638 144076 -54683 -19845
10209 -154973 -68749 -361389 -47364 196490 -97667 -70232 35488 61267 -401913 173900 -223799
10197c18817b1682A19880p676a3012j59235M7764n062k8908c8344m9621B35186
10185a04811p0226M4977p1236a816j56939P4939A78902J14148a79057J5494D88014
10173D7097i9370A26479H670b26034C06575a32072A15268e4026l18817A73589
10162G687a17290I2128b09611F1302b17812g2458g011j88101d9516E9623F563
10150a35411D8347F546K13438g1794C6922c0781j56503p8418B51324a98526i6190
10138f622A43236i1841B85067a01929k39285J05672g3352b3180m907j88536e1847
10126b21745j19941K3765i3266F0122a2988r3576A62310b27407O3356M4169B10435
10114a71450a9873C64719G8449j2991f0964l29822d5010j84735C1530a26313n9826
$$ plain form
10197 -318817 -21682 119880 112204 -13012 -172247 -124483 -129545 -158453 -38344 -87965 235186
10185 -104811 -175037 -130060 -201296 -1816 -158755 -83816 178902 293050 -179057 -163563 488014
10173 47097 -99370 126479 8670 -226034 306575 -132072 115268 -54026 -372843 173589
10162 7687 -117290 92128 -209611 61302 -217812 -72458 -7011 -195112 -49516 59623 6563
10150 -135411 48347 6546 219984 -71794 36922 -30781 -187284 -265702 251324 -198526 -96190
10138 -6622 143236 -91841 285067 -101929 -341214 -235542 -73352 -23180 -28087 -216623 -51847
10126 -221745 -341686 -317921 -93266 60122 -12988 -106564 162310 -227407 -164051 -119882 210435
10114 -171450 -19873 364719 78449 65458 -60964 -390786 -45010 -229745 31530 -126313 -186139
10103a86139f1596k69388e0456B73372A7217a38645D5228a40979M9104F1633J62369
10092B24002A04998D7219J24791o6015J21906a90850I8715a44541j02463J19425
10082a27579B39781C8774J70346G4035L4814B2847b565j47248m3571A78283a35326
10070A0461a36832O1158C31215h4897k6745r3027f0108j60482N8778P4825C7348
10058a3428l811A6018b34286J1259P6375k05937e1795A8062f2081k21893Q3474
10047b00500B4553b45476h325A72928h2793j15141C7940O3341b78208a04050K1201
10036h2849I1296D0377c54359d9415B3527c06821A22949a79710E7254g4087E6962
10024A02418B070K5970L64138F5770f0250A51399a01949c5668F9451J6887c3966
$$ plain form
10103 -186139 -61596 -330984 -50456 273372 17217 -138645 45228 -140979 -91875 61633 224002
10092 224002 104998 47219 172010 105995 227901 -190850 98715 -144541 -247004 -127579
10082 -127579 239781 38774 209120 74035 108849 22847 -2565 -149813 -193384 178283 -135326
10070 10461 -136832 -75674 331215 -84897 -111642 -204669 -60108 -220590 -161812 -86987 37348
10058 -13428 -17239 16018 -234286 -223027 -146652 -352589 -51795 18062 -62081 -283974 -200500
10047 -200500 24553 -245476 -8325 172928 -82793 -197934 37940 101281 -278208 -104050 -82849
10036 -82849 91296 40377 -354359 -49415 23527 -306821 122949 -179710 57254 -74087 56962
10024 102418 2070 28040 392178 65770 -60250 151399 -101949 -35668 69451 86338 -33966
10012C5777R403M18a35199a7743j58038P0896j98266a35937r4732G9685c48248
10000d09855J98177m1249f3103m6695A05288l0463f9860A7970O0042a69664j4179
9989a83843B00515c8928A8119a79851Q9728o4159j90061B47359f0221k3574o243
9978i0038B66269o1191b33589k48584a97522n1259b8115j14652k24084a30369
9967d41575J86095j7657a5336j99529A1228K6635a14602b7320B14211l4193m8583
9956A31435c42374I4168f6766j049B7758a51494p0770R7831Q292J1779G1572a93684
9943a4212C325K14148b26696A08769M1997C2641f299m5548E2480M0595c8734o5329
9931a04063A13816a23444G7069a21064k7289E7557j0655j1626b75743a8609A35348
$$ plain form
10012 35777 45180 45598 -135199 -17743 -175781 -104885 -303151 -135937 -230669 79685 -348248
10000 -409855 -211678 -252927 -63103 -109798 105288 74825 -69860 17970 78012 -169664 -183843
9989 -183843 200515 -38928 18119 -179851 -90123 -154282 -344343 247359 -60221 -83795 -90038
9978 -90038 266269 205078 -233589 -482173 -197522 -248781 -28115 -142767 -366851 -130369
9967 -441575 -255480 -273137 -15336 -214865 11228 37863 -114602 -27320 214211 180018 131435
9956 131435 -342374 94168 -66766 -67815 27758 -151494 -222264 -124433 -116141 -104362 71572 -193684
9943 -14212 3325 217473 -226696 108769 150766 32641 -6299 -51847 52480 93075 -38734 -104063
9931 -104063 113816 -123444 77069 -121064 -148353 57557 46902 35276 -275743 -18609 135348
9919a04161G7060J49323F2746b2394C5357N9395e47475g6062A7602N7072a5452
9907a01283o8611K1419d740C12647b34368K2736d1249j5181j01839I8178a22543
9895a99854I0831b87938h8774L1059j59511K0591q1083J30141r0943I6045A672
9883B25854a56575l3721j24447G0686J12105i9082B2810J56108P305b6150G5447
9871c29853a13723j65711d5140j73168R9482H2774J51138b08647h5245c5854A06261
9859a55868i26j05120o0555L7934k32245F0505c34154A29773c22713B05492F71
9847h3632A32957M8047d3775J4938A36302Q8369i5827j86574c0153k36958B34446
9835B19430e4276b633k5416A84355R210b64338l12716a03013k8556I2243a14934
$$ plain form
9919 -104161 77060 226383 62746 -22394 35357 94752 -547475 -76062 17602 74674 -15452
9907 -101283 -169894 -148475 -4740 312647 -234368 -211632 -41249 -56430 -158269 98178 -122543
9895 -199854 90831 -287938 -88774 -57715 -217226 -196635 -277718 -147577 -238520 96045 1672
9883 225854 -156575 -190296 -314743 70686 182791 -99082 22810 178918 186223 -26150 75447
9871 -329853 -113723 -279434 -45140 -218308 -118826 82774 233912 -208647 -85245 -35854 106261
9859 -155868 -926 -106046 -166601 -128667 -360912 60505 -334154 129773 -322713 205492 671
9847 -83632 132957 181004 -43775 -28837 136302 224671 -95827 -282401 -30153 -267111 234446
9835 219430 -54276 -2633 -28049 184355 193565 -264338 -577054 -103013 -131569 92243 -114934
9823b07768j081M7642A9045a41306M1223k06011Q6750F6241e5755l07172A20287
9811a35391a4219m3566j92568l0439J04462A40397a05079k13091C0807g1048j50888
9800b21936f6605j22959Q3005J7947B93489c2440j45190D0803a48834F0912a20096
9788b12423L6137O9261j18919O4396a6467G0473J12657c44925A8640b37179a07000
9776h6736H984b24615B45052h2999n2219F4070J72289a39352I3729M5463g9320
9764a79159B30743a4976j34139j04025B62639h0575r8200B05593d0974j25318
9754a66292L2924o5122e6708K8140r5808j33748a4136j77340e6598j43262F5244
9742b77640a23910M001H1321h4242B40620c09927d4477A83716m0268f261m5310
$$ plain form
9823 -207768 -208849 -161207 19045 -141306 -100083 -306094 -219344 66241 -55755 -362927 120287
9811 -135391 -14219 -57785 -250353 -280792 -176330 140397 -105079 -318170 30807 -71048 -221936
9800 -221936 -66605 -189564 -106559 -88612 293489 -32440 -177630 40803 -148834 60912 -120096
9788 -212423 -176286 -107025 -225944 -161548 -16467 70473 183130 -344925 18640 -237179 -107000
9776 -86736 8984 -224615 245052 -82999 -135218 64070 236359 -139352 93729 139192 -79320
9764 -179159 230743 -14976 -149115 -253140 262639 -80575 -178775 205593 -40974 -166292
9754 -166292 -133368 -198490 -56708 -28568 -124376 -258124 -14136 -191476 -56598 -199860 65244
9742 -277640 -123910 -119909 81321 -84242 240620 -309927 -44477 183716 143448 -6261 -51571
9731e1571A0058b71761a14538n902o7108j81350h6512J843a0485E6879c4713j46355
9719a81068I2694a39993G9622C6216L08575a66799A4894K05494b1269j4783l04562
9708c40614A2276a68232A51876L3438e4224l0066L9582B5555k885d05230A130
9696f7466j16991j31527D442J1618R543b54155h1449L7590I7549a20237j44721
9685b64958f9844A69844b32642L472E7646b36432A04445a99290D9075a86512B5786
9673H170a61744O9351C02324e5015R527l8885j98380H7011b6229a911k67420a10383
9660A03291B3889a65536C0780i8443A27296h5724m5983E0662A4327d5826j44076
9649a89902e491j11909k51727a1220E4538L8153a3137r3752K2306o832o1561d3679
$$ plain form
9731 -51571 10058 -271761 -114538 -120440 -187548 -368898 -86512 -84669 -10485 56879 -34713 -181068
9719 -181068 92694 -139993 79622 36216 344791 -166799 14894 220388 -21269 -36052 -340614
9708 -340614 12276 -168232 151876 185314 -54224 -84290 -44708 25555 22670 -405230 1130
9696 -67466 -184457 -315984 4442 16060 25603 -254155 -81449 -43859 97549 -120237 -264958
9685 -264958 -69844 169844 -232642 -229170 57646 -236432 104445 -199290 49075 -186512 25786
9673 8170 -161744 -92393 302324 -55015 -45488 -84373 -282753 87011 -26229 -1911 -269331 -110383
9660 103291 23889 -165536 30780 -98443 127296 -85724 -131707 50662 14327 -45826 -189902
9649 -189902 -5491 -117400 -369127 -11220 54538 92691 -13137 -106889 -84583 -91415 -152976 -43679
9636a67847d4160k39762A96330b91514b9335A36080h6485q0661f2910n8629l22174
9625d43713G1223a05807r3642k47814B90252a19037m654C8315b48069h7637J6418
9614g1219k17728I7291m436D0967c1082A87307h9500K7701m6528b6084j26224
9603a52308K4420B7349a19829p0284k29554A44090b90959J34294J2311e7781k35649
9592b93430E4072p031J04205K8582e415k04371N2673P6001A4034J65514b59162
9580D7976P7991K2768K7124b20219c8703r9626A47033b81318N2464A88231n7262
9569A30969e8212K088j77623B46179A00306a00017a4878A87144J20735E436a2462
9557a61395L4986A69177b88025J32004B11110g8813B88542B61b89955c0150j5678
$$ plain form
9636 -167847 -44160 -283922 196330 -291514 -29335 136080 -86485 -167146 -62910 -121539 -443713
9625 -443713 71223 -105807 -199449 -447263 290252 -119037 -123691 38315 -248069 -87637 -71219
9614 -71219 -288947 97291 92855 40967 -31082 187307 -89500 -61799 -108327 -26084 -152308
9603 -152308 -127888 27349 -119829 -190113 -419667 144090 -290959 -156665 -144354 -57781 -293430
9592 -293430 54072 47041 151246 179828 -5415 -209786 -157113 -81112 14034 179548 -259162
9580 47976 125967 148735 175859 -220219 -38703 -138329 147033 -281318 -228854 188231 130969
9569 130969 -58212 -56124 -233747 246179 100306 -100017 -14878 187144 307879 5436 -12462
9557 -161395 -126409 169177 -288025 -156021 211110 -78813 288542 261 -289955 -30150 -45828
9546d5828H165Q7831a71173q6124R3662d4225D2374J05744c42623a2502D9996
9534b47096j12389c4965F1479b35319C23791H755b30632p1219b1463A4784a51022
9522c47404A5677b76093B6123J16514k3593a24922A51696b36060m0126i6475b3401
9510a44024p1880r168A50397E8321J35392m3057D1772f3950j23220n2482a02930
9498b39849D3030h6181j03153C5482j2984a51110g1572b1022k69328A78327B3449
9486A1402K6534c4073k43246a28416j60791a08004m4042a9176j57946h0056n8496
9475a38552D9241M28261b28315k8809J00290j32804A46957J51074I3080J97679
9465B90759c37229B48619R3178a56183A18429K7237a47534N2895j42586N8347
$$ plain form
9546 -45828 8165 95996 -171173 -257297 -163635 -44225 42374 148118 -342623 -12502 49996
9534 -247096 -359485 -34965 61479 -235319 323791 8755 -230632 -301851 -21463 14784 -151022
9522 -347404 15677 -276093 26123 142637 119044 -124922 151696 -236060 -276186 -96475 -23401
9510 -144024 -215904 -225072 150397 58321 193713 150656 41772 -63950 -187170 -239652 -102930
9498 -239849 43030 -86181 -189334 35482 22498 -151110 -71572 -21022 -290350 178327 23449
9486 11402 37936 -34073 -277319 -128416 -289207 -108004 -152046 -19176 -177122 -80056 -138552
9475 -138552 49241 477502 -228315 -257124 -156834 -289638 146957 298031 93080 290759
9465 290759 -337229 248619 341797 -156183 118429 145666 -147534 -94639 -237225 -178878
9455a78878C08156E1022N5607a89747M5298d8556A32844f9841k29087H0330a60027
9443a24834k17887e2472i124j33274A66397a3053A7176a56506P6941l03747A490
9431A87210n0304j1604a79189d2216j16145A00592f9741r2070D95520C7022p034
9420B9988b02627A59988a601j00642l63671P7027A01400R9711i4421j65891A21713
9408g7036A31173E7058g33j63322j1765O8211b9681k8975R250C82582a66513F8030
9395b54688C6441a34398I516a44718q0920k2256c5779A99971i6695c5418a0659
9383a71119e80o5607j28255d8642k67980B33691a2531o7566p4242A37002b20749
9371A21203b02236a9975A33357b00626E8242K79978b17513J507B77792a38519
$$ plain form
9455 -178878 308156 51022 106629 -189747 -144449 -48556 132844 -69841 -298928 80330 -160027
9443 -124834 -342721 -52472 -9124 -142398 166397 -13053 17176 -156506 -79565 -383312 1490
9431 187210 136906 125302 -179189 -42216 -158361 100592 -69741 -161811 495520 37022 29988
9420 29988 -202627 159988 -1601 -102243 -465914 -388887 101400 201111 -94421 -260312 121713
9408 -77036 131173 57058 -733 -164055 -175820 -107609 -29681 -58656 -49406 382582 -166513 68030
9395 -254688 36441 -134398 9516 -144718 -225638 -247894 -35779 199971 -96695 -35418 -10659
9383 -171119 -580 -66187 -194442 -48642 -316622 233691 -12531 -80097 -154339 137002 -220749
9371 121203 -202236 -19975 133357 -200626 58242 338220 -217513 -216006 277792 -138519
9360B42997d053l68181N7979d537q3336K5797B78873a6458B8301J46766i9460
9348b91349a40997D032K92330M0614j31023G7965a53051M008g3547o285j36026
9337b15858d7333p3022n9276g9029j48949A4510a07728F4791K1250h2305B854
9325B5366c80971N5801Q5250A21569a07739A26497a45477A2787b74567C2284K7744
9314F0028j870d9861j45359J0748j05050f4347p4395A42938J39621c41302J44390
9303a96912k91820a00578A2010b2457B05844h2422j05543C0978M2980a86271O5256
9292a21015j16196j51356A44977c39816H3791A7554b12213D5590K1077f8149j86734
9281b54883a01518a4945I6961J01378a64040A75311a54817D06592A11114e379
$$ plain form
9360 242997 -4053 -372234 -314255 -4537 -87873 -62076 278873 -16458 28301 175067 -99460
9348 -291349 -140997 4032 296362 336976 205953 77965 -153051 -149043 -73547 -79832 -215858
9337 -215858 -47333 -120355 -179631 -79029 -227978 14510 -107728 64791 86041 -82305 2854
9325 25366 -380971 -325170 -239920 121569 -107739 126497 -145477 12787 -274567 32284 60028
9314 60028 58158 -49861 -195220 -184472 -289522 -64347 -138742 142938 282559 -341302 -196912
9303 -196912 -488732 -100578 12010 -22457 205844 -82422 -187965 30978 73958 -186271 -121015
9292 -121015 -237211 -388567 144977 -339816 83791 17554 -212213 45590 66667 -68149 -254883
9281 -254883 -101518 -14945 96961 198339 -164040 175311 -154817 406592 111114 -5379
9270b93146n0920A18361P058b80745R1568G421b64902c8756j07528L2843k59895
9259c73336A17139n8225a76008c5118A46641j8831a75122L0969j16663A63960
9248a39714j05549o8680D6750c1476A85393E0266a19665m1675b2545A29314a66461
9236B6640K2299J6892c2295H4719a47035L3938n2117P8083A7490o404M4769d33850
9223A37600n5701r101d1464p9365A70984Q6750b86054I229h5669j94041A74841
9211d50339R2703k580J61626P9446j26194B48077b87029c142k87730f1069j9597
9200h0666j54230L3049r8049p1218N696a1692I6940c37159J47364q6050d1746
9188c97168a30622d7323p4439A78077a1910E9109e58677K75426J39424H7278B4393
$$ plain form
9270 -293146 -344066 118361 125419 -280745 -189177 7421 -264902 -38756 -146284 -113441 -373336
9259 -373336 117139 58914 -176008 -35118 146641 127810 -175122 -144153 -260816 163960
9248 -139714 -245263 -313943 46750 -31476 185393 50266 -119665 -161340 -22545 129314 -166461
9236 26640 48939 65831 -32295 84719 -147035 -113097 -165214 -87131 17490 11086 55855 -433850
9223 137600 81899 72798 -41464 -120829 170984 257734 -286054 9229 -85669 -279710 174841
9211 -450339 -357636 -360216 -198590 -119144 -245338 248077 -287029 -3142 -290872 -61069 -80666
9200 -80666 -234896 -201847 -299896 -371114 -365418 -11692 96940 -337159 -189795 -275845 -41746
9188 -397168 -130622 -47323 -121762 178077 -11910 59109 -558677 -283251 -143827 87278 24393
9176H982f2990A27815a62195g4845A60443b33817B50750J6859H4131b61520O3023
9165a98497B3533b07947L3193j22666a315A45675D0342g7023j06452b7313D7608
9153b18006a1434E7561N7058a10690k03017e1034B14161g5699H6530b50374I4116
9141g7757L7900j50618f405j54101L517f7820o9872l0479D37567A67124R5684
9130B62808i0182j5182j35315A57230j2439N63h6896C419a98354R3890d5179J402
9118d3777l37844J43945g2265b7032C3940b78285P0969B4023R9235b01457L5526
9107a65931c9157B7165d16613C8316b49269D8053h9499m4394D5294N2819a72500
9095D7891J10714C9013J09244C9433A4056b16869d4433A12883b44095B24100A06345
$$ plain form
9176 8982 -62990 127815 -162195 -74845 160443 -233817 250750 267609 84131 -261520 -198497
9165 -198497 23533 -207947 -174754 -297420 -1315 145675 40342 -77023 -183475 -27313 47608
9153 -218006 -11434 57561 114619 -110690 -313707 -51034 214161 -75699 86530 -250374 94116
9141 -77757 -39857 -190475 -6405 -160506 -156989 -67820 -137692 -168171 437567 167124 262808
9130 262808 -90182 -105364 -240679 157230 144791 145354 -86896 3419 -198354 -104464 -45179 -43777
9118 -43777 -381621 -237676 -72265 -27032 33940 -278285 -207316 24023 123258 -201457 -165931
9107 -165931 -39157 27165 -416613 38316 -249269 48053 -89499 -133893 45294 98113 -172500
9095 47891 158605 39013 148257 39433 14056 -216869 -44433 112883 -244095 224100 106345
9083d3H9857b77683G9399b01316B46124G4897J70877a50830R026j71012G8777
9071e0522D08760b79124e2213j04749f0547A65941C9136b54212g4647A84250b27576
9059h3710A45675C7011a72293I2502P345b91249A16276a79831A69944A9235h8115
9047a82332B5840b14306A53711a4496r1712p0995P102j129l85838A56223o1411
9036I4812a389n6407j46130F0693D074b58604j45992N2665b3806j21086k66219
9025d11111B5266a60168A53473N5043A6270a71697p8230A45456b50536A06003
9014B5108J48301c96642J40459g7929n6820r1822a00924j26913q4661R2993m0463
9003b59968Q9344l06618C0776d5326j73117g4443D9743b664m13267R9602J03401
$$ plain form
9083 -43 89857 -277683 79399 -201316 246124 74897 245774 -150830 -141804 -312816 78777
9071 -50522 408760 -279124 -52213 -156962 -60547 165941 39136 -254212 -74647 184250 -227576
9059 -83710 145675 37011 -172293 92502 99847 -291249 116276 -179831 169944 19235 -88115
9047 -182332 25840 -214306 153711 -14496 -106208 -177203 -170101 -171230 -557068 156223 94812
9036 94812 -1389 -57796 -203926 60693 4074 -258604 -404596 -351931 -23806 -144892 -411111
9025 -411111 25266 -160168 153473 208516 16270 -171697 -249927 145456 -250536 106003
9014 25108 173409 -396642 -256183 -77929 -134749 -226571 -100924 -227837 -312498 -219505 -259968
9003 -259968 -170624 -477242 30776 -45326 -218443 -74443 49743 -2664 -415931 -316329 -212928
8992b12928f079K95j22724A8743d7162A37238J46905B8870L4662e907n0193B027
8979a7737B97524c60175A78734b24033A17237h063j77851K1865O6830a8290k96572
8968c14862F134J8158a60091B6511L3663J20915F280a12611L4071B48593M1661
8957B90254A40366l2418J10337a0770A56084a66992G7157b26230A9810a85384
8946c45118A06911B5135p12h1053E3296f9150k92248d4017j81013H5135L4798
8935A19933L04523p8796A04703d3290A73798P3801m5995n7491K08680J95843J38832
8924F87468O80538L670308J0040408m643530B336599I00346l96473q1898A56197
8914A791a37079A82241D3025a06848j46155E9795J92144A3643a97975r4744f9096
$$ plain form
8992 -212928 -6079 -5784 -128508 18743 -47162 137238 284143 28870 63532 -5907 -56100 2027
8979 -17737 297524 -360175 178734 -224033 117237 -8063 -185914 -164049 -97219 -18290 -314862
8968 -314862 6134 24292 -160091 26511 60174 181089 6280 -112611 -78540 248593 290254
8957 290254 140366 107948 218285 -10770 156084 -166992 77157 -226230 19810 -185384
8946 -345118 106911 25135 24423 -81053 53296 -69150 -361398 -44017 -225030 85135 119933
8935 119933 424456 345660 104703 -43290 173798 247599 201604 144113 352793 548636 687468
8924 687468 1368006 5038314 15078722 10435192 2336599 900346 503873 421975 156197
8914 1791 -137079 182241 43025 -106848 -253003 59795 251939 13643 -197975 -292719 -69096
8902F8004b22250A11990J06840c78964a69542k20904B97171c23708c1993k73890
8892c05883f0939k8950j30284N6775n4614A65171G3370j9430J15724m0469k7659
8881A01536h7833B59887G1341a60121C6042h5219I3235J29067H1692a04320C25188
8869c67918K7290B11861b47264H369d06308A55043b61503c4873p2503K7628j41985
8858b21733c8174m43175A42163k0127a01135L0886n449B58581a6591B31881a09231
$$ plain form
8902 68004 -222250 111990 218830 -378964 -169542 -390446 297171 -323708 -31993 -305883
8892 -305883 -60939 -89889 -220173 -163398 -218012 165171 73370 53940 169664 129195 101536
8881 101536 -87833 259887 71341 -160121 36042 -85219 93235 222302 81692 -104320 325188
8869 -367918 -340628 211861 -247264 8369 -406308 155043 -261503 -34873 -107376 -79748 -221733
8858 -221733 -38174 -481349 142163 122036 -101135 -70249 -75698 258581 -16591 231881 -109231
$$ [...]
##END NTUPLES=NMR SPECTRUM
##END=
