##TITLE=AC1517_ROEFFECT0003_8213605_iCf7iwwBfp
##JCAMPDX= 6.0         $$ Bruker NMR JCAMP-DX V2.0
##DATA TYPE= NMR SPECTRUM
##DATA CLASS= NTUPLES
##ORIGIN= BRUKER
##OWNER= Administrator
$$ 1.72 TOPSPIN		Version 2.1
$$ 2013-10-04 17:22:48.650 -0700  Administrator@X
$$ Compression mode = diff/dup
##.OBSERVE FREQUENCY= 400.02188249412
##.OBSERVE NUCLEUS= ^1H
##.ACQUISITION MODE= SIMULTANEOUS (DQD)
##.ACQUISITION SCHEME= undefined
##.AVERAGES= 64
##.DIGITISER RES= 22
##SPECTROMETER/DATA SYSTEM= spect
##.PULSE SEQUENCE= noesygpps1d.comp
##.SOLVENT NAME= COFFEE_meoh
##.SHIFT REFERENCE= INTERNAL, COFFEE_meoh, 1, 14.9608
##AUDIT TRAIL= $$ (NUMBER, WHEN, WHO, WHERE, PROCESS, VERSION, WHAT)
$$ ##TITLE= Audit trail, TOPSPIN		Version 2.1
$$ ##JCAMPDX= 5.01
$$ ##ORIGIN= Bruker BioSpin GmbH
$$ ##OWNER= Administrator
$$ $$ E:\/data/COFFEE/nmr/AC1517_ROEFFECT0003_8213605_iCf7iwwBfp/12/pdata/1/auditp.txt
$$ ##AUDIT TRAIL=  $$ (NUMBER, WHEN, WHO, WHERE, PROCESS, VERSION, WHAT)
(   1,<2013-10-04 17:22:43.650 -0700>,<Administrator>,<X>,<go>,<TOPSPIN 2.1>,
      <created by zg
	started at 2013-10-04 17:11:14.098 -0700,
	POWCHK enabled, PULCHK disabled,
       configuration hash MD5:
       C8 4E 4E 5D D3 5C D8 9E 9F 52 82 E0 59 8A DE 15
       data hash MD5: 64K
       2A 96 4C BF 0F A7 2E 6F 8A E4 CF 6C 29 83 F3 35>)
(   2,<2013-10-04 17:22:46.713 -0700>,<Administrator>,<X>,<proc1d>,<TOPSPIN 2.1>,
      <Start of raw data processing
       efp LB = 0.3 FT_mod = 6 PKNL = 1 PHC0 = 0 PHC1 = 0 SI = 128K 
       data hash MD5: 128K
       91 33 35 6B 9B 24 4B 92 B1 78 88 C4 B4 7D 16 CE>)
(   3,<2013-10-04 17:22:47.713 -0700>,<Administrator>,<X>,<proc1d>,<TOPSPIN 2.1>,
      <pk PHC0 = -80.7605 PHC1 = 0 
       data hash MD5: 128K
       BC 33 03 FE 07 71 DE 92 F4 94 8B 89 96 2D D8 8A>)
(   4,<2013-10-04 17:22:48.119 -0700>,<Administrator>,<X>,<proc1d>,<TOPSPIN 2.1>,
      <abs ABSG = 1 
       data hash MD5: 128K
       0B 7F B6 97 2B 29 78 D7 33 46 AB 8D 31 00 19 01>)
(   5,<2013-10-04 17:22:48.260 -0700>,<Administrator>,<X>,<proc1d>,<TOPSPIN 2.1>,
      <abs ABSG = 2 
       data hash MD5: 128K
       2A 0B CB 6E 0B D6 E8 AF D7 F3 2F F7 E3 C9 49 78>)
(   6,<2013-10-04 17:22:48.322 -0700>,<Administrator>,<X>,<proc1d>,<TOPSPIN 2.1>,
      <abs ABSG = 3 
       data hash MD5: 128K
       81 86 A4 3E 45 98 E6 9B 8B 28 64 C7 75 E7 60 52>)
(   7,<2013-10-04 17:22:48.400 -0700>,<Administrator>,<X>,<proc1d>,<TOPSPIN 2.1>,
      <abs ABSG = 4 
       data hash MD5: 128K
       20 B5 70 F8 70 7B 36 26 13 A2 D6 A8 A6 C2 D2 65>)
(   8,<2013-10-04 17:22:48.494 -0700>,<Administrator>,<X>,<proc1d>,<TOPSPIN 2.1>,
      <abs ABSG = 5 
       data hash MD5: 128K
       0E 39 07 17 45 D8 62 88 F3 B7 B8 AA 17 C4 B8 CD>)
$$ ##END=
$$ 
$$ $$ hash MD5
$$ $$ 08 01 F4 81 F0 0E 8A F0 63 6D 47 5B 2F 7B 0D CD
##$RELAX= 
##$RELAX= 
##$RELAX= 
##$RELAX= 
##$RELAX= 
##$RELAX= 
##$RELAX= 
##$RELAX= 
$$ Bruker specific parameters
$$ --------------------------
##$DU= <E:\>
##$EXPNO= 12
$$ [...]
150 150 150 150 150 150 150 150
##$TP07= 0
##$TPNAME0= <>
##$TPNAME1= <>
##$TPNAME2= <>
##$TPNAME3= <>
##$TPNAME4= <>
##$TPNAME5= <>
##$TPNAME6= <>
##$TPNAME7= <>
##$TPOAL= (0..7)
0.5 0.5 0.5 0.5 0.5 0.5 0.5 0.5
##$TPOFFS= (0..7)
0 0 0 0 0 0 0 0
##$TUNHIN= 0
##$TUNHOUT= 0
##$TUNXOUT= 0
##$USERA1= <user>
##$USERA2= <user>
##$USERA3= <user>
##$USERA4= <user>
##$USERA5= <user>
##$V9= 5
##$VALIST= <valist>
##$VCLIST= <CCCCCCCCCCCCCCC>
##$VD= 0
##$VDLIST= <DDDDDDDDDDDDDDD>
##$VPLIST= <PPPPPPPPPPPPPPP>
##$VTLIST= <TTTTTTTTTTTTTTT>
##$WBST= 2048
##$WBSW= 25
##$XGAIN= (0..3)
0 0 0 0
##$XL= 0
##$YL= 0
##$YMAX_a= 6745488
##$YMIN_a= -13204510
##$ZGOPTNS= <>
##$ZL1= 120
##$ZL2= 120
##$ZL3= 120
##$ZL4= 120
##$ABSF1= 14.9608
##$ABSF2= -5.597382
##$ABSG= 5
##$ABSL= 3
##$ALPHA= 0
##$AQORDER= 0
##$ASSFAC= 0
##$ASSFACI= 0
##$ASSFACX= 0
##$ASSWID= 0
##$AUNMP= <proc_prof1d_extract.lims>
##$AXLEFT= 0
##$AXNAME= <>
##$AXNUC= <1H>
##$AXRIGHT= 0
##$AXTYPE= 0
##$AXUNIT= <>
##$AZFE= 0.1
##$AZFW= 0.1
##$BCFW= 0
##$BC_mod= 0
##$BYTORDP= 0
##$COROFFS= 0
##$CY= 15
##$DATMOD= 1
##$DC= 0
##$DFILT= <>
##$DTYPP= 0
##$F1P= 0
##$F2P= 0
##$FCOR= 0.5
##$FTSIZE= 131072
##$FT_mod= 6
##$GAMMA= 0
##$GB= 0
##$INTBC= 1
##$INTSCL= 1
##$ISEN= 128
##$LB= 0.3
##$LEV0= 0
##$LPBIN= 0
##$MAXI= 10000
##$MC2= 0
##$MEAN= 0
##$ME_mod= 0
##$MI= 0
##$NCOEF= 0
##$NC_proc= -2
##$NLEV= 6
##$NOISF1= 0
##$NOISF2= 0
##$NSP= 0
##$NTH_PI= 0
##$NZP= 0
##$OFFSET= 14.9608
##$PC= 1
##$PHC0= -80.7605
##$PHC1= 0
##$PH_mod= 1
##$PKNL= yes
##$PPARMOD= 0
##$PPDIAG= 0
##$PPIPTYP= 0
##$PPMPNUM= 2147483647
##$PPRESOL= 1
##$PSCAL= 4
##$PSIGN= 0
##$PYNMP= <proc.py>
##$REVERSE= no
##$SF= 400.020009716632
##$SI= 131072
##$SIGF1= 0
##$SIGF2= 0
##$SINO= 400
##$SIOLD= 131072
##$SPECTYP= <>
##$SREGLST= <1H.CDCl3>
##$SSB= 0
##$STSI= 131072
##$STSR= 0
##$SW_p= 8223.68421052631
##$SYMM= 0
##$S_DEV= 0
##$TDeff= 65536
##$TDoff= 0
##$TI= <>
##$TILT= no
##$TM1= 0
##$TM2= 0
##$TOPLEV= 0
##$USERP1= <user>
##$USERP2= <user>
##$USERP3= <user>
##$USERP4= <user>
##$USERP5= <user>
##$WDW= 1
##$XDIM= 131072
##$YMAX_p= 392308923
##$YMIN_p= -11530
##$CURPLOT= <Network HP LaserJet P1505>
##$CURPRIN= <$Network HP LaserJet P1505>
##$DFORMAT= <normdp>
##$LAYOUT= <+/1D_H.xwp>
##$LFORMAT= <normlp>
##$PFORMAT= <normpl>
##$SURQMSG= 1
$$ End of Bruker specific parameters
$$ ---------------------------------
##NTUPLES= NMR SPECTRUM
##VAR_NAME=  FREQUENCY,     SPECTRUM/REAL,   SPECTRUM/IMAG
##SYMBOL=    X,             R,               I
##VAR_TYPE=  INDEPENDENT,   DEPENDENT,       DEPENDENT
##VAR_FORM=  AFFN,          ASDF,            ASDF
##VAR_DIM=   131072,        131072,          131072
##UNITS=     HZ,            ARBITRARY UNITS, ARBITRARY UNITS
##FACTOR=    0.0627417313425164, 1,          1
##FIRST=     8223.62146879497, -281,         -67951
##LAST=      0,             2127,            -68117
##MIN=       0,             -11530,          0
##MAX=       8223.62146879497, 392308923,    0
$$ Real data points
##PAGE= N=1
##DATA TABLE= (X++(R..R)), XYDATA
$$ [...]
$$ plain form
61668 454628 453345 451694 449865 448144 446357 444054 441271 438730 437071 436150 435432 434872 434951 435843 437029 437928
61652 437928 438537 439182 440021 441175 442992 445554 448086 449556 450025 450785 452946 456449 460790 466024 472436
61637 472436 479602 486606 493015 498978 504287 508017 509364 508425 505968 502758 499279 495734 492086 488322
61623 488322 484814 482182 480702 480094 480008 480470 481775 484276 488367 494259 501527 509153 516321 522913 529035
61608 529035 534375 538383 540786 541521 540377 537211 532479 527090 521694 516422 511324 506546 501916 496812
61594 496812 490828 484378 478250 472656 467136 461413 455897 451028 446411 441082 434699 428011 421864 416067
61580 416067 409705 402560 395712 390536 387337 385214 383109 380702 378312 376172 374000 371310 368045 364701
61566 364701 361679 358632 354762 349797 344458 339838 336453 333977 331715 329153 326224 323237 320583 318471
$$ packed form
61668D54628j283j651j829j721j787k303k783k541j659r21p18n60P9Q92J186Q99
61652D37928O09O45Q39J154J817K562K532J470M69P60K161L503M341N234O412
61637D72436P166P004O409N963N309L730J347r39k457l210l479l545l648l764
61623D88322l508k632j480o08q6M62J305K501M091N892P268P626P168O592O122
61608E29035N340M008K403P35j144l166m732n389n396n272n098m778m630n104
61594D96812n984o450o128n594n520n723n516m869m617n329o383o688o147n797
61580D16067o362p145o848n176l199k123k105k407k390k140k172k690l265l344
61566C64701l022l047l870m965n339m620l385k476k262k562k929k987k654k112
$$ plain form
61552 318471 316957 316111 315920 316056 316065 315950 316208 317055 317897 317971 317342 316884 317278 318373 319568 320465 321098 321793 323008
61533 323008 325089 328007 331398 334971 338680 342415 345712 348038 349282 349714 349433 348071 345211 341016 336333
61518 336333 332108 328753 326058 323666 321515 319749 318258 316557 314363 312185 310994 311135 311842 312035 311378
61503 311378 310216 308748 306863 304799 303281 302645 302291 301468 300239 299172 298324 297217 295761 294567 294128
61488 294128 294185 294181 293972 293714 293263 292134 290168 288087 287070 287602 288820 289298 288614 287770 287856 288772 289734 290611
61470 290611 291882 293408 294169 293517 291999 290589 289680 289165 288875 288487 287493 285851 284294 283515 283346 283260 283312
61453 283312 283996 285386 287053 288677 290196 291411 292062 292314 292621 293074 293394 293656 294534 296577 299616 303052
61437 303052 306478 309895 313570 317777 322482 327312 332042 336980 342468 348092 352902 356425 358874 360278
$$ packed form
61552C18471j514q46j91J36Rj15K58Q47Q42P4o29m58L94J095J195Q97O33O95J215
61533C23008K081K918L391L573L709L735L297K326J244M32k81j362k860m195m683
61518C36333m225l355k695k392k151j766j491j701k194k178j191J41P07J93o57
61503C11378j162j468j885k064j518o36l54q23j229j067q48j107j456j194m39
61488B94128N7mk09k58m51j129j966k081j017N32J218M78o84q44Q6R16R62Q77
61470B90611J271J526P61o52j518j410r09n15k90l88r94j642j557p79j69q6N2
61453B83312O84J390J667J624J519J215O51K52L07M53L20K62Q78K043L039L436
61437C03052L426L417L675M207M705M830M730M938N488N624M810L523K449J404
$$ plain form
61423 360278 360148 358478 356453 355504 355896 356865 357981 359706 362559 366349 370444 374385 377944 380911 383168
61408 383168 384824 385975 386421 385870 384350 382101 379070 374874 369455 363513 358050 353559 349815 346293 342554
61393 342554 338431 334206 330585 328127 326578 325113 323333 321625 320336 319012 316932 314196 311768 310356
61379 310356 309708 309157 308534 308229 308493 309046 309435 309537 309517 309402 309084 308845 309484 311470 314127 316143 316950 317158
61361 317158 317590 318481 319864 322114 325473 329348 332790 335638 338643 342457 346950 351628 356341 361462 367643
61346 367643 375424 384785 395032 405440 415938 426789 437611 447342 455431 462574 469852 477425 484554
61333 484554 490651 495816 500350 504194 507011 508559 508792 507759 505528 502161 497671 492151 486059 480257
61319 480257 475525 471942 468889 465732 462403 459210 456296 453586 451224 449668 449130 449188 449193 448971 448966 449814 451956
$$ packed form
61423C60278j30j670k025r49L92R69J116J725K853L790M095L941L559K967K257
61408C83168J656J151M46n51j520k249l031m196n419n942n463m491l744l522l739
61393C42554m123m225l621k458j549j465j780j708j289j324k080k736k428j412
61379C10356o48n51o23l05K64N53L89J02k0j15l18k39O39J986K657K016Q07K08
61361C17158M32Q91J383K250L359L875L442K848L005L814M493M678M713N121O181
61346C67643P781R361J0247J0408J0498J0851J0822R731Q089P143P278P573P129
61333D84554O097N165M534L844K817J548K33j033k231l367m490n520o092n802
61319D80257m732l583l053l157l329l193k914k710k362j556n38N8Nk22nQ48K142
$$ plain form
61302 451956 455521 460325 466008 472332 479230 486371 492887 497861 501104 503069 503998 503517 501237 497435 492886
61287 492886 488210 483647 479335 475407 471721 467796 463323 458706 454843 452264 450707 449655 449058 449186 449916
61272 449916 450709 451461 452908 455877 460351 465616 471074 476536 481838 486639 490685 494028 496964 499983 503796
61257 503796 509109 516227 524986 535139 546690 559766 574177 589113 603353 615967 626868 636441
61245 636441 644641 650720 654033 654766 653584 650823 646340 639906 631428 621080 609641 598474 588607 579914
61231 579914 571595 563286 555212 547502 540131 533579 528740 525883 524256 523027 522186 522260 523542 525868 528816
61216 528816 531871 534793 538027 542305 547541 552544 556268 558983 561793 565307 569290 573362 577370 581043
61202 581043 583881 585682 586907 588331 590512 593725 598282 604659 613296 624332 637652 653214 671224
$$ packed form
61302D51956L565M804N683O324O898P141O516M974L243J965R29m81k280l802m549
61287D92886m676m563m312l928l686l925m473m617l863k579j557j052n97J28P30
61272D49916P93P52J447K969M474N265N458N462N302M801M046L343K936L019L813
61257E03796N313P118Q759J0153J1551J3076J4411J4936J4240J2614J0901R573
61245F36441Q200O079L313P33j182k761m483o434q478j0348j1439j1167r867q693
61231E79914q319q309q074p710p371o552m839k857j627j229q41P4J282K326K948
61216E28816L055K922L234M278N236N003L724K715K810L514L983M072M008L673
61202E81043K838J801J225J424K181L213M557O377Q637J1036J3320J5562J8010
$$ plain form
61189 671224 691883 715004 740056 766478 793694 820817 846746 870816 893113 913907 933035
61178 933035 950221 965898 981177 996779 1012184 1026060 1037410 1046101 1052431 1056553 1058412 1057913 1054861
61165 1054861 1048972 1040329 1029704 1017878 1004613 988852 970186 949503 927803 904976 880403 854382
61153 854382 828137 802600 778035 754799 733571 714539 697197 681362 667818 657347 649574 643293
61141 643293 637700 632735 628346 623990 619008 613195 606832 600335 594060 588466 584267 582101 581974 583320
61127 583320 585827 589894 595937 603559 612103 621980 634734 651499 671832 694271 717721 742176 768501
61114 768501 797789 830601 866610 905110 945862 989070 1034449 1080783 1126624 1171127 1214100
61103 1214100 1255636 1295837 1334516 1370951 1404219 1433798 1459409 1480269 1495158 1503512 1505850 1502813
$$ packed form
61189F71224K0659K3121K5052K6422K7216K7123K5929K4070K2297K0794J9128
61178I33035J7186J5677J5279J5602J5405J3876J1350Q691O330M122J859m99l052
61165A054861n889q643j0625j1826j3265j5761j8666k0683k1700k2827k4573k6021
61153H54382k6245k5537k4565k3236k1228j9032j7342j5835j3544j0471p773o281
61141F43293n593m965m389m356m982n813o363o497o275n594m199k166j27J346
61127E83320K507M067O043P622Q544R877J2754J6765K0333K2439K3450K4455K6325
61114G68501K9288L2812L6009L8500M0752M3208M5379M6334M5841M4503M2973
61103A214100M1536M0201L8679L6435L3268K9579K5611K0860J4889Q354K338l037
$$ plain form
61091 1502813 1494363 1480375 1461416 1438333 1411379 1380439 1345939 1309013 1270806 1231966 1192814
61080 1192814 1153657 1114862 1076793 1039685 1003621 968769 935598 904646 876092 849830 825822
61069 825822 804032 784173 766095 750347 737666 727876 719957 713272 708055 704600 702909 703234 705956
61056 705956 710499 715419 720167 725870 733709 743342 753647 764173 775114 786687 799479 814691 833026
61043 833026 853863 876453 901288 929329 960499 994118 1030372 1070125 1113519 1159827 1208581
61032 1208581 1259806 1313351 1368944 1426786 1487156 1549475 1612544 1675531 1738092 1800064 1861999
61021 1861999 1925644 1992968 2065171 2143455 2229874 2326008 2431414 2545004 2667800 2803327
61011 2803327 2956672 3135455 3351273 3617896 3948442 4356669 4860455 5481227 6241507
$$ packed form
61091A502813q450j3988j8959k3083k6954l0940l4500l6926l8207l8840l9152
61080A192814l9157l8795l8069l7108l6064l4852l3171l0952k8554k6262k4008
61069H25822k1790j9859j8078j5748j2681r790p919o685n217l455j691L25K722
61056G05956M543M920M748N703P839R633J0305J0526J0941J1573J2792J5212J8335
61043H33026K0837K2590K4835K8041L1170L3619L6254L9753M3394M6308M8754
61032A208581N1225N3545N5593N7842O0370O2319O3069O2987O2561O1972O1935
61021A861999O3645O7324P2203P8284Q6419R6134J05406J13590J22796J35527
61011B803327J53345J78783K15818K66623L30546M08227N03786O20772P60280
$$ plain form
61002 6241507 7168369 8299690 9679673 11341759 13292896 15501680 17871797 20202218
60994 20202218 22188633 23522638 24054835 23895892 23361383 22806446 22486527 22518270 22890914
60985 22890914 23456359 23919960 23914621 23165825 21635162 19524927 17150212 14792479 12629569
60976 12629569 10742852 9149687 7829391 6743126 5850448 5117116 4514211 4016642 3604287
60967 3604287 3261665 2975106 2731738 2521343 2337022 2173424 2025982 1892214 1771739
60958 1771739 1664038 1567384 1480482 1403622 1337287 1280573 1231649 1188808 1150354 1114358 1079422
60947 1079422 1045338 1012517 981322 952267 926181 903526 883878 866420 850576 835896 821812
60936 821812 807865 793877 779727 765315 750876 736872 723393 710121 696975 684257 672024
$$ packed form
61002F241507R26862J131321J379983J662086J951137K208784K370117K330421
60994B0202218J986415J334005N32197j58943n34509n54937l19919L1743L72644
60985B2890914N65445M63601n339p48796j530663k110235k374715k357733k162910
60976A2629569j886717j593165j320296j086265q92678p33332o02905m97569m12355
60967C604287l42622k86559k43368k10395j84321j63598j47442j33768j20475
60958A771739j07701r6654q6902p6860o6335n6714m8924m2841l8454l5996l4936
60947A079422l4084l2821l1195k9055k6086k2655j9648j7458j5844j4680j4084
60936H21812j3947j3988j4150j4412j4439j4004j3479j3272j3146j2718j2233
$$ plain form
60925 672024 659974 648240 637680 628947 621605 614533 606876 598401 589381 580506 572529 565610 559206
60912 559206 552826 546531 540474 534384 528000 521739 516408 512300 508913 505547 501866 497902 493796 489669
60898 489669 485652 481903 478535 475511 472691 470061 467729 465569 463022 459583 455405 451106 447009 442933
60884 442933 438704 434473 430414 426477 422652 419180 416226 413485 410322 406307 401606 396943 393110 390348
60870 390348 388208 386169 384292 383027 382559 382709 383393 384722 386603 388734 391133 394305 398546 403340 407668
60855 407668 410868 413148 415412 418601 422988 428034 433050 437867 442618 446979 450154 451694 451945 451577 450994
60840 450994 450295 449385 447961 445679 442546 438810 434349 428585 421281 413122 405150 397876 391225 385085 379507
60825 379507 374427 369562 364747 360264 356792 354935 354663 355218 355730 355879 355792 355475 354793 353988 353648 353935 354299
$$ packed form
60925F72024j2050j1734j0560q733p342p072p657q475r020q875p977o919o404
60912E59206o380o295o057o090o384o261n331m108l387l366l681l964m106m127
60898D89669m017l749l368l024k820k630k332k160k547l439m178m299m097m076
60884D42933m229m231m059l937l825l472k954k741l163m015m701m663l833k762
60870C90348k140k039j877j265m68J50O84J329J881K131K399L172M241M794M328
60855D07668L200K280K264L189M387N046N016M817M751M361L175J540K51l68n83
60840D50994o99r10j424k282l133l736m461n764p304q159p972p274o651o140n578
60825C79507n080m865m815m483l472j857k72N55N12J49q7l17o82q05l40K87L64
$$ plain form
60808 354299 354289 354233 354802 356207 358261 360972 364614 369289 374738 380555 386311 391605 396261 400449 404414
60793 404414 408134 411403 414103 416250 417946 419505 421367 423616 425695 426902 426984 426056 424216 421626 418765
60778 418765 416103 413610 410974 408201 405489 402597 398944 394473 389806 385342 380754 375766 370990 367438
60764 367438 365381 364123 362808 361081 359076 357162 355702 354767 354052 353330 352890 353145 353774 353736 352433 350589
60748 350589 349701 350724 353474 357089 360738 363968 366762 369390 372072 374700 376940 378565 379555 379917 379620
60733 379620 378794 377901 377604 378426 380401 382988 385447 387456 389268 391186 393160 395167 397630 400876 404284
60718 404284 406636 407541 407941 408917 410428 411599 411856 411360 410585 409887 409382 408882 408027 406710 405121 403240 400668
60701 400668 397317 393868 390992 388394 385255 381436 377589 374159 370954 367727 364476 361015 356945 352412
$$ packed form
60808C54299j0n6N69J405K054K711L642M675N449N817N756N294M656M188L965
60793D04414L720L269K700K147J696J559J862K249K079J207Q2r28j840k590k861
60778D18765k662k493k636k773k712k892l653m471m667m464m588m988m776l552
60764C67438k057j258j315j727k005j914j460r35p15p22m40K55O29l8j303j844
60748C50589q88J023K750L615L649L230K794K628K682K628K240J625R90L62k97
60733C79620q26q93k97Q22J975K587K459K009J812J918J974K007K463L246L408
60718D04284K352R05M00R76J511J171K57m96p75o98n05n00q55j317j589j881k572
60701D00668l351l449k876k598l139l819l847l430l205l227l251l461m070m533
$$ plain form
60687 352412 348342 345460 343384 341146 338437 335978 334763 335204 336976 339481 342414 345871 349893 354102
60673 354102 358013 361639 365415 369525 373626 377324 380653 383948 387481 391257 394984 398222 400840 403279
60659 403279 406002 408698 410495 411025 410845 410610 410302 409597 408546 407437 406205 404459 402116 399727 398079
60644 398079 397510 397612 397579 396869 395475 393520 390889 387589 384224 381573 379750 378287 376993 376101 375528 374746
60628 374746 373638 372821 372811 373477 374698 376838 379959 383144 385369 386723 388104 389956 391990 393934 395832
60613 395832 397596 398920 399761 400458 401231 401998 402766 403918 405943 408973 412562 415849 418151 419593 420953
60598 420953 422738 424749 426797 429335 432819 436793 440250 442846 445158 447825 450881 453921 456467 458227
60584 458227 459454 460871 462733 464088 463637 461280 458185 455330 452680 449929 447200 444664 442140 439566
$$ packed form
60687C52412m070k882k076k238k709k459j215M41J772K505K933L457M022M209
60673C54102L911L626L776M110M101L698L329L295L533L776L727L238K618K439
60659D03279K723K696J797N30j80k35l08p05j051j109j232j746k343k389j648
60644C98079n69J02l3p10j394j955k631l300l365k651j823j463j294q92n73p82
60628C74746j108q17j0O66J221K140L121L185K225J354J381J852K034J944J898
60613C95832J764J324Q41O97P73P67P68J152K025L030L589L287K302J442J360
60598D20953J785K011K048K538L484L974L457K596K312K667L056L040K546J760
60584D58227J227J417J862J355m51k357l095k855k650k751k729k536k524k574
$$ plain form
60570 439566 437443 436371 436470 437618 439851 443158 447258 452015 457705 464353 471013 476332 479842 482216 484158
60555 484158 485488 485504 483977 481511 478983 476870 475253 474371 474897 477408 481601 486271 490251 493306 496100
60540 496100 499441 503627 508427 513410 518256 522779 526793 530127 532803 535108 537391 539849 542520 545293
60526 545293 547921 550316 553029 557084 562974 570055 577363 584765 592769 601395 610018 618481 627673 638649
60512 638649 651594 665930 681018 696365 711545 726337 740814 754997 768644 781635 794420
60501 794420 807770 822171 837685 854343 872453 892440 914296 937124 959473 980525 1000761
60490 1000761 1020861 1039885 1055225 1064582 1067299 1063510 1052966 1035548 1012357 985264 955536 923758
60478 923758 890925 858616 827890 798771 771066 745017 720829 698142 676415 655500 635587
$$ packed form
60570D39566k123j072R9J148K233L307M100M757N690O648O660N319L510K374J942
60555D84158J330J6j527k466k528k113j617q82N26K511M193M670L980L055K794
60540D96100L341M186M800M983M846M523M014L334K676K305K283K458K671K773
60526E45293K628K395K713M055N890P081P308P402Q004Q626Q623Q463R192J0976
60512F38649J2945J4336J5088J5347J5180J4792J4477J4183J3647J2991J2785
60501G94420J3350J4401J5514J6658J8110J9987K1856K2828K2349K1052K0236
60490A000761K0100J9024J5340R357K717l789j0544j7418k3191k7093k9728l1778
60478I23758l2833l2309l0726k9119k7705k6049k4188k2687k1727k0915j9913
$$ plain form
60467 635587 616949 599998 585128 572137 560104 548221 536512 525482 515364 506098 497772 490537
60455 490537 484129 477917 471499 464952 458423 451782 444880 438012 431895 427110 423541 420384 416838 412782
60441 412782 408681 404848 401058 397032 392973 389317 386055 382703 378995 375324 372345 370255 368594 366727
60427 366727 364460 362176 360300 358684 356697 354016 351152 349024 348176 348592 350002 351983 353880 355113 355659
60412 355659 355909 356040 355919 355714 356099 357498 359479 361196 362241 362740 362912 362951 363195 363927 364976 365878 366446
60395 366446 366882 367308 367541 367414 367064 366825 367059 368036 369659 371217 371842 371395 370581 370016 369523 368670 367668 367246
60377 367246 367745 368719 369507 369898 370150 370534 370987 371200 371018 370738 370910 371775 373006 374044 374526 374346 373638 372932
60359 372932 373032 374288 376029 377067 376839 375841 375004 374918 375690 377148 378963 380711 382044 382893 383602 384892
$$ packed form
60467F35587j8638j6951j4870j2991j2033j1883j1709j1030j0118r266q326p235
60455D90537o408o212o418o547o529o641o902o868o117m785l569l157l546m056
60441D12782m101l833l790m026m059l656l262l352l708l671k979k090j661j867
60427C66727k267k284j876j616j987k681k864k128q48M16J410J981J897J233N46
60412C55659K50J31j21k05L85J399J981J717J045M99J72L9K44P32J049R02N68
60395C66446M36M26K33j27l50k39K34R77J623J558O25m47q14n65m93q53j002m22
60377C67246M99R74P88L91K52L84M53K13j82k80J72Q65J231J038M82j80p08p06
60359C72932J00J256J741J038k28r98q37q6P72J458J815J748J333Q49P09J290
$$ plain form
60343 384892 387484 391441 395967 400090 403541 406678 409739 412673 415759 419802 425290 431738 438240 444434
60329 444434 450409 455856 459850 461656 461299 459146 455203 449262 441717 433877 427151 421973 417684 413533
60315 413533 409573 406349 403932 401751 399494 397766 397437 398561 400359 402232 404470 407948 413476 421506
60301 421506 432066 444601 458030 471198 483304 493816 502111 507390 508879 506021 498716 487699
60289 487699 474651 461559 449728 439465 430550 422728 415794 409723 404993 402416 402228 403486 404760
60276 404760 405342 405503 405730 406146 406623 406921 406606 405298 403251 401362 400319 400058 400270 401096 402912 405706 409139
60259 409139 413145 418032 423922 430455 437039 443051 447664 449832 448798 444711 438698 432266 426489 421565
60245 421565 417074 412659 408400 404575 401310 398581 396378 394639 393167 391804 390602 389679 389075 388902 389374
$$ packed form
60343C84892K592L957M526M123L451L137L061K934L086M043N488O448O502O194
60329D44434N975N447L994J806l57k153l943n941p545p840o726n178m289m151
60315D13533l960l224k417k181k257j728l29J124J798J873K238L478N528Q030
60301D21506J0560J2535J3429J3168J2106J0512Q295N279J489k858p305j1017
60289D87699j3048j3092j1831j0263q915p822o934o071m730k577j88J258J274
60276D04760N82J61K27M16M77K98l15j308k047j889j043k61K12Q26J816K794L433
60259D09139M006M887N890O533O584O012M613K168j034m087o013o432n777m924
60245D21565m491m415m259l825l265k729k203j739j472j363j202r23o04j73M72
$$ plain form
60230 389374 390395 391400 391998 392552 393747 395763 398365 401534 405345 409268 412334 414194 415384 416410 417285
60215 417285 418222 419980 422939 426439 429675 432821 436526 440687 444543 447886 451352 455469 460069 464808
60201 464808 469576 474157 478096 481341 484614 488650 493306 497720 501202 503630 505183 506101 506714 507356 508142
60186 508142 509037 510145 511719 513753 515701 516764 516418 514696 512076 509124 506129 502949 499230 494843 490103
60171 490103 485548 481603 478460 476162 474632 473681 473110 472816 472714 472713 473006 474283 477254 481752 486643 490879
60155 490879 494446 498016 501861 505490 508285 510054 510895 510932 510335 509399 508406 507595 507391 508380 510814 514338
60139 514338 518492 523425 529814 538039 547707 558151 569129 580715 592500 603314 611970 618053 621628
60126 621628 622340 619489 613200 605028 596907 589767 583539 578155 573789 570271 567035 563886 561242 559344
$$ packed form
60230C89374J021J005N98N54J195K016K602L169L811L923L066J860J190J026Q75
60215D17285R37J758K959L500L236L146L705M161L856L343L466M117M600M739
60201D64808M768M581L939L245L273M036M656M414L482K428J553R18O13O42P86
60186E08142Q95J108J574K034J948J063l46j722k620k952k995l180l719m387m740
60171D90103m555l945l143k298j530r51n71k94j02jK93J277K971M498M891M236
60155D90879L567L570L845L629K795J769Q41L7n97r36r93q11k04R89K434L524
60139E14338M154M933O389Q225R668J0444J0978J1586J1785J0814Q656O083L575
60126F21628P12k851o289q172q121p140o228n384m366l518l236l149k644j898
$$ plain form
60112 559344 557750 556022 554439 553563 553389 553471 553731 554539 555956 557362 558091 558138 557992 557869 557369 555948 553565
60095 553565 550747 548079 545846 544236 543629 544383 546463 549568 553590 558640 564656 571256 578034 584727 591143
60080 591143 597267 603434 609996 616724 622979 628509 633520 637755 640152 639898 637333 633348 628252 621911
60066 621911 614649 607213 599831 591958 583174 573882 564883 556536 548566 540581 532675 525510 519709 515165
60052 515165 511121 507070 503297 500369 498464 497556 497822 499295 501275 502793 503699 504788 506792 509674 512981
60037 512981 516379 519708 522975 526519 530813 535894 541192 546047 550143 553386 555696 556950 556829 554643
60023 554643 549796 542572 534033 524920 515035 503978 492100 480335 469403 459521 450647 442590 435058
60010 435058 428015 421890 417084 413274 409628 405743 402037 399129 397107 395582 394255 393231 392834 393306 394701
$$ packed form
60112E59344j594j728j583q76j74Q2K60Q08J417J406P29M7j46j23n00j421k383
60095E53565k818k668k233j610o07P54K080L105M022N050O016O600O778O693O416
60080E91143O124O167O562O728O255N530N011M235K397k54k565l985n096o341
60066F21911p262p436p382p873q784r292q999q347p970p985p906p165n801m544
60052E15165m044m051l773k928j905r08K66J473J980J518R06J089K004K882L307
60037E12981L398L329L267L544M294N081N298M855M096L243K310J254j21k186
60023E54643m847p224q539r113r885j1057j1878j1765j0932r882q874q057p532
60010D35058p043o125m806l810l646l885l706k908k022j525j327j024l97M72J395
$$ plain form
59995 394701 396963 399940 403352 406844 410227 413651 417426 421726 426522 431728 437176 442477 447141 450968
59981 450968 454159 456918 459091 460325 460455 459637 458197 456413 454355 451857 448690 444842 440559 436218 432307
59966 432307 429372 427560 426203 424297 421731 419683 419406 420821 422629 423634 423583 422819 421694 420479 419450
59951 419450 418725 418151 417526 416867 416371 416213 416441 416924 417349 417381 416951 416301 415653 414884 413632 411663 409052 406089
59933 406089 403097 400320 397802 395313 392489 389181 385725 382764 380705 379366 378238 377158 376558 376965 378303
59918 378303 379904 381186 382134 383049 384037 384948 385752 386735 388208 390133 392095 393693 394991 396612 399311 403381
59902 403381 408454 413825 418803 422753 425224 426429 427404 429194 431771 434143 435647 436715 438179 440267
59888 440267 442694 445412 448786 453125 458416 464492 471123 478034 485151 492707 500789 508959 516731 524204
$$ packed form
59995C94701K262K977L412L492L383L424L775M300M796N206N448N301M664L827
59981D50968L191K759K173J234J30q18j440j784k058k498l167l848m283m341l911
59966D32307k935j812j357j906k566k048k77J415J808J005n1p64j125j215j029
59951D19450p25n74o25o59m96j58K28M83M25L2m30o50o48p69j252j969k611k963
59933D06089k992k777k518k489k824l308l456k961k059j339j128j080o00M07J338
59918C78303J601J282R48R15R88R11Q04R83J473J925J962J598J298J621K699M070
59902D03381N073N371M978L950K471J205R75J790K577K372J504J068J464K088
59888D40267K427K718L374M339N291O076O631O911P117P556Q082Q170P772P473
$$ plain form
59874 524204 531658 538619 544074 547665 549949 551137 550314 546432 539694 531461 523059 515040 507349 499784
59860 499784 492421 485857 480808 477284 474524 472020 470268 470162 472111 476121 482307 490672 500645 511426
59846 511426 522554 533537 543164 549989 553562 554639 554198 552859 551246 550163 550012 550326 550038 547994 543351
59831 543351 536062 527178 518340 510862 505404 502226 501132 501224 501372 501069 500352 498894 495893 491112 485368
59816 485368 479575 473758 467369 460223 452768 445729 439767 435238 432030 429812 428495 428152 428457 428720 428678
59801 428678 428787 429452 430372 430885 430563 429189 426586 422909 418779 414808 411176 407928 405374 403863 403339 403346
59785 403346 403301 402711 401434 399849 398452 397234 395911 394737 394286 394329 393836 392554 391693 392323 393852 394956
59769 394956 395421 396073 397330 398903 400691 402904 405278 407154 408481 409935 411886 414004 416004 417995 419875
$$ packed form
59874E24204P454O961N455L591K284J188q23l882o738q233q402q019p691p565
59860D99784p363o564n049l524k760k504j752j06J949M010O186Q365R973J0781
59846E11426J1128J0983R627O825L573J077m41j339j613j083j51L14k88k044m643
59831E43351p289q884q838p478n458l178j094R2J48l03p17j458l001m781n744
59816D85368n793n817o389p146p455p039n962m529l208k218j317l43L05K63m2
59801D28678J09O65R20N13l22j374k603l677m130l971l632l248k554j511n24P
59785D03346m5n90j277j585j397j218j323j174m51M3m93j282q61O30J529J104
59769C94956M65O52J257J573J788K213K374J876J327J454J951K118K000J991J880
$$ plain form
59754 419875 421189 421924 422867 424744 427471 430524 433533 436175 438021 438959 439499 440308 441705 443719 446260
59739 446260 448900 450923 452026 452731 453749 455149 456464 457399 458054 458614 459184 459872 460700 461423 461683 461364 460640
59722 460640 459717 458673 457544 456371 455175 453980 452954 452473 452944 454437 456463 458257 459412 460130 460752
59707 460752 461255 461496 461745 462478 463626 464498 464624 464313 464178 464400 464688 464735 464494 464202 464268 464901 465717 465987 465444
59688 465444 464552 463753 462865 461597 460315 459694 459762 459846 459564 459341 459776 460891 462259 463513 464444 464789 464272 462807
59670 462807 460440 457177 453123 448732 444635 441144 438092 435264 432779 430950 429942 429700 430105 431024 432310
59655 432310 433932 435977 438318 440428 441931 443291 445491 448803 452319 455028 457024 459186 461843 464270
59641 464270 465492 465111 463252 460174 456226 451946 447882 444397 441763 440304 440249 441464 443448 445604 447538
$$ packed form
59754D19875J314P35R43J877K727L053L009K642J846R38N40Q09J397K014K541
59739D46260K640K023J103P05J018J400J315R35O55N60N70O88Q28P23K60l19p24
59722D60640r23j044j129j173j196j195j026m81M71J493K026J794J155P18O22
59707D60752N03K41K49P33J148Q72J26l11j35K22K88M7k41k92O6O33Q16K70n43
59688D65444q92p99q88j268j282o21O8Q4k82k23M35J115J368J254R31L45n17j465
59670D62807k367l263m054m391m097l491l052k828k485j829j008k42M05R19J286
59655D32310J622K045K341K110J503J360K200L312L516K709J996K162K657K427
59641D64270J222l81j859l078l948m280m064l485k634j459n5J215J984K156J934
$$ plain form
59626 447538 449199 450812 452603 454638 456989 459902 463496 467298 470424 472346 473178 473072 471770 469163 466010
59611 466010 463481 461962 460798 459448 458434 458739 460550 463071 465566 468075 470932 473988 476678 478620
59597 478620 479743 479949 479093 477345 475107 472485 469288 465778 462934 461434 460643 459240 456778 454100 452100
59582 452100 450619 448838 446385 443619 440994 438486 435737 432593 429404 426777 424958 423527 421838 419784
59568 419784 417926 416848 416607 416909 417571 418583 419880 421310 422827 424515 426470 428714 431183 433658 435808
59553 435808 437465 438859 440444 442488 444964 447778 450918 454273 457501 460264 462625 465076 468166 472220
59539 472220 477516 484647 494459 507599 524236 544247 567196 591578 614175 630833 638643 637711 630926
59526 630926 622162 614565 609904 608789 611201 616975 625891 637325 649995 662413 673611 683185 690690
$$ packed form
59626D47538J661J613J791K035K351K913L594L802L126J922Q32j06j302k607l153
59611D66010k529j519j164j350j014L05J811K521K495K509K857L056K690J942
59597D78620J123K06q56j748k238k622l197l510k844j500p91j403k462k678k000
59582D52100j481j781k453k766k625k508k749l144l189k627j819j431j689k054
59568D19784j858j078k41L02O62J012J297J430J517J688J955K244K469K475K150
59553D35808J657J394J585K044K476K814L140L355L228K763K361K451L090M054
59539D72220N296P131R812J3140J6637K0011K2949K4382K2597J6658P810r32o785
59526F30926q764p597m661j115K412N774Q916J1434J2670J2418J1198R574P505
$$ plain form
59513 690690 695455 697210 696411 693525 688327 680397 670077 658232 645158 630572 614915 599792 586534
59500 586534 574884 563833 553290 544042 536302 529369 522902 517582 514052 511907 510325 509251 509300 510700
59486 510700 512892 515109 517037 518974 521634 525696 531273 537848 544886 552369 560658 570182 581474 595014
59472 595014 610490 626398 640886 652957 662528 669555 673681 674800 673508 670959 668596 667960 670133
59459 670133 675135 682173 690710 701112 714245 730784 751004 774949 802592 833964 869189 908260
59447 908260 950839 996526 1045066 1095620 1145443 1189584 1222231 1238472 1235214 1211635 1169875 1115328
59435 1115328 1055371 996798 943744 897401 857159 821842 790295 761557 735142 711327 690913
59424 690913 674504 662088 653404 648468 647487 650448 657180 667742 682372 700980 723058 748156 776057
$$ packed form
59513F90690M765J755p99k886n198p930j0320j1845j3074j4586j5657j5123j3258
59500E86534j1650j1051j0543r248p740o933o467n320l530k145j582j074M9J400
59486E10700K192K217J928J937K660M062N577O575P038P483Q289R524J1292J3540
59472E95014J5476J5908J4488J2071R571P027M126J119j292k549k363o36K173
59459F70133N002P038Q537J0402J3133J6539K0220K3945K7643L1372L5225L9071
59447I08260M2579M5687M8540N0554M9823M4141L2647J6241l258k3579m1760n4547
59435A115328n9957n8573n3054m6343m0242l5317l1547k8738k6415k3815k0414
59424F90913j6409j2416q684m936r81K961O732J0562J4630J8608K2078K5098K7901
$$ plain form
59411 776057 806194 837263 867799 896802 923053 943644 953951 950180 932456 905305 874945 846132
59399 846132 821302 801644 787967 780540 778726 780694 782831 779787 766730 742760 711784 679454
59387 679454 649505 623128 600563 581893 566609 553715 542576 533005 524656 517100 510460 505094
59375 505094 500695 496515 492576 489705 488192 487305 486462 485918 485826 485553 484650 483887 484507 486779 489895 493062
59359 493062 496155 499511 503611 508917 515645 523670 532778 542922 554243 567133 582251 600039 620162
59346 620162 641862 664949 689812 716360 743660 770984 798446 826099 852972 877611 899074
59335 899074 916847 930254 938572 941402 938431 929337 914610 895989 875218 852552 827258 799488
59323 799488 770797 742827 716275 691292 668146 647065 627869 610158 593751 578803 565653
$$ packed form
59411G76057L0137L1069L0536K9003K6251K0591J0307l771j7724k7151l0360k8813
59399H46132k4830j9658j3677p427j814J968K137l044j3057k3970l0976l2330
59387F79454k9949k6377k2565j8670j5284j2894j1139r571q349p556o640n366
59375E05094m399m180l939k871j513q87q43n44r2k73r03p63O20K272L116L167
59359D93062L093L356M100N306O728Q025R108J0144J1321J2890J5118J7788K0123
59346F20162K1700K3087K4863K6548K7300K7324K7462K7653K6873K4639K1463
59335H99074J7773J3407Q318K830k971r094j4727j8621k0771k2666k5294k7770
59323G99488k8691k7970k6552k4983k3146k1081j9196j7711j6407j4948j3150
$$ plain form
59312 565653 554649 545935 539347 534562 531317 529471 529038 530320 533800 539748 548098 558810 572074 587938
59298 587938 605875 624558 641523 653070 655646 648345 633836 616289 598635 582071 567297 555026
59286 555026 545429 538151 532989 529888 528299 527365 526933 527704 530179 533996 538473 543390 549175 556728 566974
59271 566974 579946 594404 609033 624076 640958 660206 680578 700511 719429 737042 752236
59260 752236 763610 770727 774033 773746 769564 761408 749837 735690 719854 703421 687576 673041 659878
59247 659878 647908 637131 627661 619536 612787 607618 604375 603302 604355 607223 611570 617303 624593 633600
59233 633600 644201 656031 668656 681572 694060 705303 714747 722238 727631 730357 729638 725243 717768
59220 717768 708024 696356 682770 667528 651238 634465 617674 601533 586735 573329 560693 548437
$$ packed form
59312E65653j1004q714o588m785l245j846m33J282L480N948Q350J0712J3264J5864
59298E87938J7937J8683J6965J1547K576p301j4509j7547j7654j6564j4774j2271
59286E55026r597p278n162l101j589r34m32P71K475L817M477M917N785P553J0246
59271E66974J2972J4458J4629J5043J6882J9248K0372J9933J8918J7613J5194
59260G52236J1374P117L306k87m182q156j1571j4147j5836j6433j5845j4535j3163
59247F59878j1970j0777r470q125o749n169l243j073J053K868M347N733P290R007
59233F33600J0601J1830J2625J2916J2488J1243R444P491N393K726p19m395p475
59220G17768r744j1668j3586j5242j6290j6773j6791j6141j4798j3406j2636j2256
$$ plain form
59208 548437 536948 526760 517747 509391 501654 495084 490118 486555 483750 481131 478531 476095 473778 471064
59194 471064 467561 463925 461583 461235 462062 462803 463127 463416 463747 463922 464291 465625 467993 470525 472554 474492
59178 474492 477288 481356 486329 491609 496891 502261 507955 514014 520302 526974 534815 544745 556932 570574
59164 570574 584730 599300 615146 633099 652679 671905 688685 702369 713603 722712 728983 731679
59152 731679 730988 727451 721163 712236 701478 689812 677369 663975 650190 637074 625099 614122
59140 614122 604179 595355 586978 577954 568096 558381 549773 542461 536268 530977 526138 521350 517030 514174
59126 514174 513162 513404 514322 515927 518185 520652 523163 526255 530481 535791 541894 548721 556194 564082 572450
59111 572450 581729 592009 602729 613351 623947 634799 645861 656840 667416 677206 686012 694292
$$ packed form
59208E48437j1489j0188r013q356p737o570m966l563k805k619k600k436k317k714
59194D71064l503l636k342l48Q27P41L24K89L31J75L69J334K368K532K029J938
59178D74492K796M068M973N280N282N370N694O059O288O672P841R930J2187J3642
59164E70574J4156J4570J5846J7953J9580J9226J6780J3684J1234R109O271K696
59152G31679o91l537o288q927j0758j1666j2443j3394j3785j3116j1975j0977
59140F14122r943q824q377r024r858r715q608p312o193n291m839m788m320k856
59126E14174j012K42R18J605K258K467K511L092M226N310O103O827P473P888Q368
59111E72450R279J0280J0720J0622J0596J0852J1062J0979J0576R790Q806Q280
$$ plain form
59099 694292 702799 711526 719594 726438 732449 738107 743156 747125 750037 752106 753251 753521 753605 754320 755858
59084 755858 757879 760014 761846 762779 762347 760434 756913 751515 744388 736344 728154 720026 712139 705214 700154
59069 700154 697549 697896 701780 709333 720050 733673 750696 771462 795328 821342 849085 877834
59057 877834 905204 927577 941800 945919 938858 920669 893316 860229 824639 788645 753723 721166
59045 721166 691697 665281 641709 621039 603284 588119 575163 564259 555254 547783 541504 536367
59033 536367 532483 529812 528077 526924 526145 525816 526253 527813 530822 535539 541922 549413 557378 565879 575621
59018 575621 586907 599098 611388 623620 635904 647870 658857 668514 676559 682211 684609 683897 681388
59005 681388 678612 676515 675446 675364 675985 677217 679609 684071 691039 700089 710293 720689 730600 739914
$$ packed form
59099F94292Q507Q727Q068O844O011N658N049L969K912K069J145K70Q4P15J538
59084G55858K021K135J832R33m32j913l521n398p127q044q190q128p887o925n060
59069G00154k605L47L884P553J0717J3623J7023K0766K3866K6014K7743K8749
59057H77834K7370K2373J4223M119p061j8189k7353l3087l5590l5994l4922l2557
59045G21166k9469k6416k3572k0670j7755j5165j2956j0904r005p471o279n137
59033E36367l884k671j735j153p79l29M37J560L009M717O383P491P965Q501R742
59018E75621J1286J2191J2290J2232J2284J1966J0987R657Q045N652K398p12k509
59005F81388k776k097j069q2O21J232K392M462O968R050J0204J0396R911R314
$$ plain form
58991 739914 749107 758635 768256 777138 784582 790320 794191 795939 795375 792472 787227 779650 769981 758770
58977 758770 746802 735044 724468 715601 708304 702232 697503 694688 694168 695726 698791 702953 708203 714696
58963 714696 722329 730643 739231 748022 756921 765391 772951 779940 787014 793701 798192 798898 795644 789039
58949 789039 779489 767420 753798 739634 725404 711641 699664 690829 685314 682372 681572 683076 686774
58936 686774 691871 697297 701895 704306 703305 698355 689541 677225 662279 646285 630798 616496 603565
58923 603565 592530 583851 576990 570846 565099 560240 556326 552703 549153 546320 544656 543784 543292 543409 544443
58908 544443 546212 548587 552119 557565 565116 574502 585514 598049 611908 626933 643178 660631 678836
58895 678836 696923 713897 728947 741873 753404 764803 777037 790529 805730 823511 844722
$$ packed form
58991G39914R193R528R621Q882P444N738L871J748n64k903n245p577r669j1211
58977G58770j1968j1758j0576q867p297o072m729k815n20J558L065M162N250O493
58963G14696P633Q314Q588Q791Q899Q470P560O989P074O687M491P06l254o605
58949G89039r550j2069j3622j4164j4230j3763j1977q835n515k942q00J504L698
58936F86774N097N426M598K411j001m950q814j2316j4946j5994j5487j4302j2931
58923F03565j1035q679o861o144n747m859l914l623l550k833j664q72m92J17J034
58908E44443J769K375L532N446P551R386J1012J2535J3859J5025J6245J7453J8205
58895F78836J8087J6974J5050J2926J1531J1399J2234J3492J5201J7781K1211
$$ plain form
58884 844722 869565 897502 927528 958292 988140 1015218 1037830 1055066 1067309 1075684 1080542 1080684
58872 1080684 1074540 1061853 1043614 1020674 993305 962178 928840 894934 861642 830222 802237
58861 802237 778629 758962 742168 727717 715573 705265 695638 685622 674905 663815 652795 642100
58849 642100 631822 622041 612861 604393 596837 590504 585476 581197 576839 572257 568142 564881 561783 557998
58835 557998 553772 549994 546706 542927 538030 532574 527565 523442 520004 516879 513881 511213 509372 508577
58821 508577 508364 508175 508133 508779 510241 512268 514914 518415 522455 526358 530076 534200 538861 543376 547238
58806 547238 550728 554255 557650 560379 562005 562401 561983 561649 561744 561205 558706 554671 551015 548669 546613 543898
58790 543898 541324 540155 540130 539941 539188 538844 540024 543067 547625 552969 558368 563669 569314 575450 581479
$$ packed form
58884H44722K4843K7937L0026L0764K9848K7078K2612J7236J2243Q375M858J42
58872A080684o144j2687j8239k2940k7369l1127l3338l3906l3292l1420k7985
58861H02237k3608j9667j6794j4451j2144j0308r627j0016j0717j1090j1020j0695
58849F42100j0278r781r180q468p556o333n028m279m358m582m115l261l098l785
58835E57998m226l778l288l779m897n456n009m123l438l125k998k668j841p95
58821E08577k13j89m2O46J462K027K646L501M040L903L718M124M661M515L862
58806E47238L490L527L395K729J626L96m18l34R5n39k499m035l656k346k056k715
58790E43898k574j169k5j89p53l44J180L043M558N344N399N301N645O136O029
$$ plain form
58775 581479 586864 591817 596540 600347 602346 602664 602192 601277 599412 596125 591580 586243 580541 574853 569443
58760 569443 564390 559852 556220 553699 552025 550959 550731 551544 553030 554868 557658 562374 568885 575769 581774
58745 581774 586917 591892 596918 601577 605593 609382 613768 619257 625639 632284 638696 644718 650351 655691
58731 655691 661059 666817 672884 678711 683929 688798 693899 699601 705903 712450 718600 723815 728200 732350
58717 732350 736500 740221 743231 746118 749961 755425 762485 770793 780026 790027 800655 811330 820836
58704 820836 828059 832958 836242 837988 837231 833098 825634 815127 801454 784776 766296 747517 729050
58691 729050 710781 692944 676356 661672 648997 638164 628975 621212 614734 609426 604765 599704 593355
58678 593355 585684 577322 568939 561082 554246 548750 544692 542219 541491 542226 543764 545943 549431 554874 562221
$$ packed form
58775E81479N385M953M723L807J999L18m72r15j865l287m545n337n702n688n410
58760E69443n053m538l632k521j674j066k28Q13J486J838K790M716O511O884O005
58745E81774N143M975N026M659M016L789M386N489O382O645O412O022N633N340
58731F55691N368N758O067N827N218M869N101N702O302O547O150N215M385M150
58717G32350M150L721L010K887L843N464P060Q308R233J0001J0628J0675R506
58704H20836P223M899L284J746p57m133p464j0507j3673j6678j8480j8779j8467
58691G29050j8269j7837j6588j4684j2675j0833r189p763o478n308m661n061o349
58678E93355p671q362q383p857o836n496m058k473p28P35J538K179L488N443P347
$$ plain form
58663 562221 571209 581778 593489 605206 616172 626786 637425 646985 653630 656765 657266 655896 652613
58650 652613 647636 642122 637215 632950 628593 623780 619015 615174 612653 610964 609256 607332 605899 605644
58636 605644 606441 607802 609682 612324 615639 619343 623500 628316 633451 638082 641622 643971 645249 645704 645685
58621 645685 645283 644254 642809 642093 643218 646145 650282 655923 664111 675165 688270 702533 717452 732144
58607 732144 745218 755943 764786 772241 777773 780585 780964 780200 779424 779049 779073 779273 779150 778180 776341 774179
58591 774179 772359 771278 770991 771232 771556 771774 772402 774405 778300 783704 790005 797302 806189 816599 827452
58576 827452 837793 847713 857546 866572 873448 877913 881174 884382 887545 890304 893043 896662 901742 908481
58562 908481 917085 927701 940250 954619 970721 988085 1005808 1023192 1039939 1055422 1068345 1077646
$$ packed form
58663E62221Q988J0569J1711J1717J0966J0614J0639R560O645L135N01j370l283
58650F52613m977n514m907m265m357m813m765l841k521j689j708j924j433k55
58636F05644P97J361J880K642L315L704M157M816N135M631L540K349J278M55j9
58621F45685m02j029j445p16J125K927M137N641Q188J1054J3105J4263J4919J4692
58607G32144J3074J0725Q843P455N532K812L79p64p76l75K4K00j23r70j839k162
58591G74179j820j081k87K41L24K18O28K003L895N404O301P297Q887J0410J0853
58576H27452J0341R920R833R026O876M465L261L208L163K759K739L619N080O739
58562I08481Q604J0616J2549J4369J6102J7364J7723J7384J6747J5483J2923R301
$$ plain form
58550 1077646 1083203 1085239 1083680 1078684 1071249 1062522 1052954 1042756 1032636 1023242 1014203 1004557 993868
58537 993868 982190 969302 954896 939357 923530 907855 892505 878160 865749 855481 846925 840032
58525 840032 835231 832546 831478 831906 834252 838514 843803 849171 854352 859470 864511 869264 873450 876723
58511 876723 878917 880350 881639 883148 884864 886713 888762 891195 894315 898336 902949 907464 911695 916234
58497 916234 921489 927044 932573 938747 946458 955585 965335 975291 985219 994268 1001503 1006921 1010829 1012391
58483 1012391 1010134 1004011 995816 987346 979253 971927 966296 963083 962117 962955 965522 969539 973910 977276
58469 977276 978945 978880 977121 973579 968183 960955 952068 941936 931134 920317 910373 902366 896924 893769
58455 893769 892249 892127 893441 895903 899022 902720 907240 912463 917739 922259 925253 926095 924756 921882 917985
$$ packed form
58550A077646N557K036j559m996p435q727r568j0198j0120r394r039r646j0689
58537I93868j1678j2888j4406j5539j5827j5675j5350j4345j2411j0268q556o893
58525H40032m801k685j068M28K346M262N289N368N181N118N041M753M186L273
58511H76723K194J433J289J509J716J849K049K433L120M021M613M515M231M539
58497I16234N255N555N529O174P711R127R750R956R928R049P235N418L908J562
58483A012391k257o123q195q470q093p326n631l213r66Q38K567M017M371L366
58469I77276J669o5j759l542n396p228q887j0132j0802j0817r944q007n442l155
58455H93769j520j22J314K462L119L698M520N223N276M520K994Q42j339k874l897
$$ plain form
58440 917985 912926 906718 900357 895163 891662 889800 889747 891640 894999 899358 905090 912565 920845 928437 935309
58425 935309 943066 953085 965408 979345 994121 1008855 1022927 1036565 1050279 1063655 1075397 1084470
58413 1084470 1090488 1093305 1093230 1091485 1089396 1087058 1083633 1078727 1072628 1065499 1057515 1049570 1042693 1036930
58399 1036930 1031908 1028212 1026853 1027586 1029266 1031893 1036783 1044544 1054250 1064760 1075442 1085402 1093468 1099324
58385 1099324 1103399 1105409 1104362 1100258 1094410 1087801 1080478 1072790 1065612 1058838 1051209 1042338 1033615 1026514
58371 1026514 1021262 1017710 1016094 1016249 1017327 1019108 1022495 1028036 1035068 1042929 1051919 1062388 1073902 1085967
58357 1085967 1098637 1111909 1125433 1139221 1153531 1167682 1180108 1189977 1197673 1203392 1206666 1207714
58345 1207714 1207925 1208444 1209576 1211917 1216547 1223498 1231525 1240120 1250306 1262777 1276804 1291751 1308194
$$ packed form
58440I17985n059o208o361n194l501j862n3J893L359M359N732P475Q280P592O872
58425I35309P757J0019J2323J3937J4776J4734J4072J3638J3714J3376J1742R073
58413A084470O018K817p5j745k089k338l425m906o099p129p984p945o877n763
58399A036930n022l696j359P33J680K627M890P761R706J0510J0682R960Q066N856
58385A099324M075K010j047m104n848o609p323p688p178o774p629q871q723p101
58371A026514n252l552j616J55J078J781L387N541P032P861Q990J0469J1514J2065
58357A085967J2670J3272J3524J3788J4310J4151J2426R869P696N719L274J048
58345A207714K11N19J132K341M630O951Q027Q595J0186J2471J4027J4947J6443
$$ plain form
58332 1308194 1326501 1345710 1364774 1383704 1402530 1420413 1436732 1451901 1466238 1479153 1490299
58321 1490299 1500307 1509569 1517431 1523508 1528724 1534356 1541027 1549077 1558645 1568870 1578497 1587896 1599095
58308 1599095 1613286 1629848 1648271 1669150 1692453 1716706 1740981 1766014 1792476 1819885 1848106
58297 1848106 1877964 1909185 1939589 1967660 1994232 2020520 2046284 2071230 2096365 2122543 2149336
58286 2149336 2176675 2205925 2238046 2272437 2308828 2348373 2391473 2436475 2481965 2528321 2575391
58275 2575391 2620782 2662279 2700120 2735062 2766133 2792228 2814194 2833515 2850866 2867847 2888325
58264 2888325 2915854 2951143 2993635 3043702 3101521 3165740 3235187 3310160 3390291 3473180 3556994
58253 3556994 3642368 3730028 3818843 3908172 3999660 4094628 4192165 4291992 4396621 4508343 4626667
$$ packed form
58332A308194J8307J9209J9064J8930J8826J7883J6319J5169J4337J2915J1146
58321A490299J0008R262P862O077N216N632O671Q050R568J0225R627R399J1199
58308A599095J4191J6562J8423K0879K3303K4253K4275K5033K6462K7409K8221
58297A848106K9858L1221L0404K8071K6572K6288K5764K4946K5135K6178K6793
58286B149336K7339K9250L2121L4391L6391L9545M3100M5002M5490M6356M7070
58275B575391M5391M1497L7841L4942L1071K6095K1966J9321J7351J6981K0478
58264B888325K7529L5289M2492N0067N7819O4219O9447P4973Q0131Q2889Q3814
58253C556994Q5374Q7660Q8815Q9329R1488R4968R7537R9827J04629J11722J18324
$$ plain form
58242 4626667 4751114 4883685 5025966 5176642 5334871 5503265 5684574 5878122 6082531
58233 6082531 6299145 6529698 6773600 7030826 7304477 7597231 7908487 8238422 8591376
58224 8591376 8971541 9379005 9814073 10281754 10787793 11334309 11923916 12563974 13261874
58215 13261874 14020544 14844105 15743743 16732604 17819797 19015789 20339082 21811291 23451239
58206 23451239 25281596 27336639 29656600 32281501 35261072 38667749 42594942 47154019
58198 47154019 52487578 58781519 66254994 75148716 85737367 98343925 113325342 131050502
58190 131050502 151892816 176185265 204074816 235314147 269073503 303768543 336894444
58183 336894444 365061507 384540545 392308923 387080499 369707221 342795007 309868689
$$ packed form
58242D626667J24447J32571J42281J50676J58229J68394J81309J93548K04409
58233F082531K16614K30553K43902K57226K73651K92754L11256L29935L52954
58224H591376L80165M07464M35068M67681N06039N46516N89607O40058O97900
58215A3261874P58670Q23561Q99638R88861J087193J195992J323293J472209J639948
58206B3451239J830357K055043K319961K624901K979571L406677L927193M559077
58198D7154019N333559O293941P473475Q893722J0588651J2606558J4981417J7725160
58190A31050502K0842314K4292449K7889551L1239331L3759356L4695040L3125901
58183C36894444K8167063J9479038P768378n228424j7373278k6912214l2926318
$$ plain form
58176 309868689 274507096 239681468 207396386 178673453 153795928 132614260 114760651
58169 114760651 99772935 87185140 76586797 67631896 60024802 53520666 47930311
58162 47930311 43105443 38918631 35262753 32057636 29240768 26752896 24540460 22565395
58154 22565395 20800717 19218610 17791036 16498313 15328077 14267616 13304205 12430246
58146 12430246 11640593 10926268 10276625 9685552 9149680 8662462 8215554 7803875 7423852
58137 7423852 7068655 6730861 6408625 6104345 5818575 5549732 5298040 5064684 4847833
58128 4847833 4643887 4451905 4273015 4106465 3949913 3802597 3664614 3534172 3409060
58119 3409060 3289794 3177896 3072089 2969508 2869744 2774425 2683785 2596804 2513846 2435992
$$ packed form
58176C09868689l5361593l4825628l2285082k8722933k4877525k1181668j7853609
58169A14760651j4987716j2587795j0598343q954901p607094o504136n590355
58162D7930311m824868m186812l655878l205117k816868k487872k212436j975065
58154B2565395j764678j582107j427574j292723j170236j060461r63411q73959
58146A2430246p89653p14325o49643n91073n35872m87218m46908m11679l80023
58137G423852l55197l37794l22236l04280k85770k68843k51692k33356k16851
58128D847833k03946j91982j78890j66550j56552j47316j37983j30442j25112
58119C409060j19266j11898j05807j02581r9764r5319r0640q6981q2958p7854
$$ plain form
58109 2435992 2362533 2291918 2224315 2160490 2099188 2038469 1978564 1920534 1863173 1804360 1744680
58098 1744680 1686696 1631404 1578409 1528899 1485120 1446967 1411810 1377725 1344609 1312506 1281310
58087 1281310 1251956 1225582 1201652 1178837 1157217 1137572 1119087 1100111 1080747 1062490 1045704
58076 1045704 1029565 1014004 999467 985162 969784 953746 938588 924525 910626 897010 884646
58065 884646 873254 861605 849767 838927 829119 819204 809044 799650 791135 782479 773363 764428 755613
58052 755613 746060 735699 725313 715030 704446 694153 685426 678353 671901 665777 660640 656502 652537
58039 652537 648464 644580 640525 635563 629989 624729 619699 614142 608272 602872 597408 590487 582189 574149
58025 574149 567180 560534 553643 546814 540052 532939 525976 520340 516006 511748 507338 504050 502524 501726
$$ packed form
58109B435992p3459p0615o7603o3825o1302o0719n9905n8030n7361n8813n9680
58098A744680n7984n5292n2995m9510m3779l8153l5157l4085l3116l2103l1196
58087A281310k9354k6374k3930k2815k1620j9645j8485j8976j9364j8257j6786
58076A045704j6139j5561j4537j4305j5378j6038j5158j4063j3899j3616j2364
58065H84646j1392j1649j1838j0840r808r915j0160r394q515q656r116q935q815
58052G55613r553j0361j0386j0283j0584j0293q727p073o452o124n137m138l965
58039F52537m073l884m055m962n574n260n030n557n870n400n464o921q298q040
58025E74149o969o646o891o829o762p113o963n636m334m258m410l288j526p98
$$ plain form
58011 501726 500585 499174 497787 496288 494901 494246 493924 492407 488987 484728 480916 477748 475140 473525 473018
57996 473018 472688 471463 469145 466063 462450 458538 454536 450187 445036 439361 434050 429413 424996 420765
57982 420765 417439 415362 413974 412797 412044 411830 411587 410781 409524 408133 406663 405175 403896 402819 401687
57967 401687 400451 399230 397799 395793 393443 391433 390003 388842 387861 387276 386910 386204 385035 383798 382710
57952 382710 381679 380812 380223 379401 377597 374828 371710 368411 364710 361048 358451 357228 356668 356191 355974 356314
57936 356314 357247 358924 361558 364839 368163 371531 375431 379870 384313 388550 392688 396296 398580 399493 399667
57921 399667 399143 397138 393324 388381 383059 377550 371928 366329 360500 354095 347545 341797 337085 332911
57907 332911 329331 327126 326525 326848 327669 329158 330874 331380 329742 326584 323128 320005 317425 315654 314659
$$ packed form
58011E01726j141j411j387j499j387o55l22j517l420m259l812l168k608j615n07
57996D73018l30j225k318l082l613l912m002m349n151n675n311m637m417m231
57982D20765l326k077j388j177p53k14k43q06j257j391j470j488j279j077j132
57967D01687j236j221j431k006k350k010j430j161r81n85l66p06j169j237j088
57952C82710j031q67n89q22j804k769l118l299l701l662k597j223n60m77k17L40
57936C56314R33J677K634L281L324L368L900M439M443M237M138L608K284R13J74
57921C99667n24k005l814m943n322n509n622n599n829o405o550n748m712m174
57907C32911l580k205o01L23Q21J489J716N06j638l158l456l123k580j771r95
$$ plain form
57892 314659 313900 312952 311880 310818 309850 309414 310026 311378 312559 313362 314427 315860 316749 316468 315486 314369
57876 314369 312919 310847 308434 305968 303307 300508 298094 296138 293858 290708 287169 283938 281058 278378
57862 278378 276137 274470 273047 271766 271154 271499 272260 272978 274116 276394 279823 284061 289094 294866 300641
57847 300641 305444 308908 311302 313046 314540 315933 316757 316312 314743 313094 311901 310468 308018 304841 301621
57832 301621 298336 294576 290463 286465 282641 278772 275015 271854 269566 268140 267449 267160 266851 266583 266970
57817 266970 268385 270548 273236 276777 281288 285812 288758 288929 285875 279815 271718 263008 254654 246793
57803 246793 239417 232859 227253 222179 217367 213138 209649 206346 202829 199654 197508 196139 194897 193847
57789 193847 193416 193229 192316 190437 188343 186703 185520 184740 184706 185676 187293 188853 190003 191102 192989 196337
$$ packed form
57892C14659p59r48j072j062r68m36O12J352J181Q03J065J433Q89k81r82j117
57876C14369j450k072k413k466k661k799k414j956k280l150l539l231k880k680
57862B78378k241j667j423j281o12L45P61P18J138K278L429M238N033N772N775
57847C00641M803L464K394J744J494J393Q24m45j569j649j193j433k450l177l220
57832C01621l285l760m113l998l824l869l757l161k288j426o91k89l09k68L87
57817B66970J415K163K688L541M511M524K946J71l054o060q097q710q354p861
57803B46793p376o558n606n074m812m229l489l303l517l175k146j369j242j050
57789A93847m31j87r13j879k094j640j183p80l4R70J617J560J150J099J887L348
$$ plain form
57773 196337 201032 206203 210935 214933 218503 222082 225790 229160 231356 231965 231550 230975 230262 228655 225815
57758 225815 222248 218474 214501 210371 206419 202666 198733 194847 192097 191110 191170 191319 191696 192938 194787
57743 194787 196244 196858 196969 196795 196060 194624 192888 191461 190690 190524 190557 190311 189667 188885 188094 187114 185978
57726 185978 185188 185116 185529 185993 186411 186850 187245 187633 188307 189344 190342 190887 190931 190503 189560 188449 187884 187987 187897
57707 187897 186884 185327 184062 183219 182389 181536 181091 181336 182212 183511 184814 185525 185461 185180 185316 185875 186463
57690 186463 186845 186929 186597 185935 185236 184458 183231 181703 180729 180813 181567 182762 185147 189516 195698 203311 212854
57673 212854 225198 240581 259155 282008 310558 345179 385384 430841 480782 532093 578780
57662 578780 613576 630073 624571 597827 555449 505421 454404 406276 363251 326833 297319 273568
$$ packed form
57773A96337M695N171M732L998L570L579L708L370K196O09m15n75p13j607k840
57758B25815l567l774l973m130l952l753l933l886k750r87O0J49L77J242J849
57743A94787J457O14J11j74p35j436j736j427p71j66L3k46o44p82p91r80j136
57726A85978p90p2M13M64M18M39L95L88O74J037R98N45M4m28r43j111n65J03r0
57707A87897j013j557j265q43q30q53m45K45Q76J299J303P11o4k81J36N59N88
57690A86463L82Q4l32o62o99p78j227j528r74Q4P54J195K385M369O182P613R543
57673B12854J2344J5383J8574K2853K8550L4621M0205M5457M9941N1311M6687
57662E78780L4796J6497n502k6744m2378n0028n1017m8128m3025l6418k9514k3751
$$ plain form
57650 273568 254046 237797 224293 213025 203570 195647 188917 183103 178323 174891 172726 171322 170212
57637 170212 169090 167656 165905 164425 163859 164157 164847 165758 166852 167600 167337 166221 165080 164312 163626 162856
57621 162856 162232 161775 161127 160150 159108 158126 157089 156097 155460 155125 154701 154089 153547 153118 152604 152157 152207 152701
57603 152701 153003 152694 151946 151042 150098 149316 148867 148377 147179 145260 143431 142363 141884 141358 140251 138325 135757
57586 135757 133192 131244 129892 128740 127698 126874 126029 124867 123715 123092 122697 121775 120515 120077 120926 122067
57570 122067 122364 121804 121074 120603 120473 120608 120588 119863 118532 117411 116964 116768 116403 116199 116604 117396 118094 118690
57552 118690 119431 120222 120773 121029 121074 120913 120715 120888 121521 122073 122049 121694 121620 122059 122859 123931 125276 126751 128180
57533 128180 129595 131043 132316 133059 133080 132455 131584 131129 131552 132534 133231 133225 132829 132361 131679 130768 130236 130714 132019
$$ packed form
57650B73568j9522j6249j3504j1268r455p923o730n814m780l432k165j404j110
57637A70212j122j434j751j480n66K98O90R11J094P48k63j116j141p68o86p70
57621A62856o24m57o48r77j042r82j037r92o37l35m24o12n42m29n14m47N0M94
57603A52701L02l09p48r04r44p82m49m90j198j919j829j068m79n26j107j926k568
57586A35757k565j948j352j152j042q24q45j162j152o23l95r22j260m38Q49J141
57570A22067K97n60p30m71j30J35k0p25j331j121m47j96l65k04M05P92O98N96
57552A18690P41P91N51K56M5j61j98J73O33N52k4l55p4M39Q00J072J345J475J429
57533A28180J415J448J273P43K1o25q71m55M23R82O97ol96m68o82r11n32M78J305
$$ plain form
57514 132019 133401 134397 135065 135572 135980 136395 137017 138001 139375 141050 142791 144285 145333 145896 145955 145490 144574
57497 144574 143333 141846 140236 138726 137374 135916 134171 132400 130926 129679 128602 128177 128842 130058 130739
57482 130739 130562 130075 129606 128999 128482 128697 129480 129662 128636 127347 127072 127868 128875 129513 129705 129368 128432 127131
57464 127131 125785 124487 123348 122706 122771 123376 124348 125729 127375 128890 130204 131643 133140 134092 134393 134809
57448 134809 135776 136596 136582 136289 136718 137847 138872 139525 140234 141212 142243 143174 143857 143857 142981 141884 141321 141003
57430 141003 140075 138607 137684 137971 139022 140070 140747 140918 140647 140535 141370 143067 144477 144508 143025 140600 137982
57413 137982 135961 135092 135162 135347 135193 135079 135516 136450 137496 138416 139044 139147 138758 138345 138276 138310 137991 137372 136933
57394 136933 136919 137110 137305 137646 138271 138942 139260 139232 139330 139944 141026 142425 144271 146669 149136 150881 151720 152295
$$ packed form
57514A32019J382R96O68N07M08M15O22R84J374J675J741J494J048N63N9m65r16
57497A44574j241j487j610j510j352j458j745j771j474j247j077m25O65J216O81
57482A30739j77m87m69o07n17K15P83J82j026j289k75P96J007O38J92l37r36j301
57464A27131j346j298j139o42O5O05R72J381J646J515J314J439J497R52L01M16
57448A34809R67Q20j4k93M29J129J025O53P09R78J031R31O83%q76j097n63l18
57430A41003r28j468r23K87J051J048O77J71k71j12Q35J697J410L1j483k425k618
57413A37982k021q69P0J85j54j14M37R34J046R20O28J03l89m13o9L4l19o19m39
57394A36933j4J91J95L41O25O71L18k8R8O14J082J399J846K398K467J745Q39N75
$$ plain form
57376 152295 153199 154330 155339 156278 157359 158385 158895 158778 158367 158015 157910 158230 159108 160463 162072 163773
57360 163773 165438 166911 168195 169568 171294 173312 175393 177403 179262 180895 182476 184376 186548 188249
57346 188249 188792 188348 187629 187076 186772 186892 187584 188476 188868 188463 187554 186565 185837 185780 186734 188562 190678 192459
57328 192459 193426 193291 192304 191403 191431 192207 192838 192925 192860 192970 192977 192542 191813 191188 190877 190909 191265 191841 192577 193645
57308 193645 195215 197036 198656 200097 201817 203900 205809 207178 208370 209890 211658 213292 214821 216658
57294 216658 218929 221262 223307 225231 227518 230281 232955 234859 236073 237443 239524 241824 243514 244605
57280 244605 245851 247611 249488 251233 253301 256189 259689 263201 266457 269556 272617 275763 279159 282761
57266 282761 286190 289266 292427 296201 300365 304092 306959 309440 312360 316149 320700 325622 330435 334773
$$ packed form
57376A52295R04J131J009R39J081J026N10j17m11l52j05L20Q78J355J609J701
57360A63773J665J473J284J373J726K018K081K010J859J633J581J900K172J701
57346A88249N43m44p19n53l04J20O92Q92L92m05r09r89p28n7R54J828K116J781
57328A92459R67j35r87r01K8P76O31Q7o5J10Pm35p29o25l11L2L56N76P36J068
57308A93645J570J821J620J441J720K083J909J369J192J520J768J634J529J837
57294B16658K271K333K045J924K287K763K674J904J214J370K081K300J690J091
57280B44605J246J760J877J745K068K888L500L512L256L099L061L146L396L602
57266B82761L429L076L161L774M164L727K867K481K920L789M551M922M813M338
$$ plain form
57252 334773 338706 342744 347237 351785 355525 358124 360250 362877 366270 369991 373756 377878 382807 388602
57238 388602 395006 401680 408161 413971 419107 424199 429849 436055 442604 449675 457547 465953 474344 482728
57224 482728 491589 500973 510340 519501 529078 539592 550574 561055 570663 579846 589234 599187 609896
57211 609896 621457 633715 646199 658387 670093 681608 693431 705795 718506 731341 744454
57200 744454 758204 772667 787621 802937 818604 834334 849654 864606 879954 896373 913641
57189 913641 930985 948034 965074 982453 1000118 1017814 1035458 1053238 1071510 1090752 1111420
57178 1111420 1133647 1157075 1181154 1205708 1231061 1257509 1284839 1312579 1340564 1368770 1396510
57167 1396510 1422338 1445201 1465426 1484244 1502585 1520789 1539224 1558487 1578902 1600325 1622610
$$ packed form
57252C34773L933M038M493M548L740K599K126K627L393L721L765M122M929N795
57238C88602O404O674O481N810N136N092N650O206O549P071P872Q406Q391Q384
57224D82728Q861R384R367R161R577J0514J0982J0481R608R183R388R953J0709
57211F09896J1561J2258J2484J2188J1706J1515J1823J2364J2711J2835J3113
57200G44454J3750J4463J4954J5316J5667J5730J5320J4952J5348J6419J7268
57189I13641J7344J7049J7040J7379J7665J7696J7644J7780J8272J9242K0668
57178A111420K2227K3428K4079K4554K5353K6448K7330K7740K7985K8206K7740
57167A396510K5828K2863K0225J8818J8341J8204J8435J9263K0415K1423K2285
$$ plain form
57156 1622610 1645823 1669882 1694435 1719381 1745171 1772302 1800791 1830365 1860913 1892471 1924933
57145 1924933 1958055 1991662 2025674 2060062 2094901 2130363 2166532 2203462 2241507 2281302 2323107
57134 2323107 2366338 2410070 2453984 2498608 2544728 2592829 2643089 2695552 2750107 2806486 2864524
57123 2864524 2924412 2986597 3051428 3119084 3190015 3265369 3346796 3435680 3532623 3637685 3750982
57112 3750982 3872995 4004528 4146749 4301479 4471441 4660219 4871942 5110885 5381439
57103 5381439 5688660 6039131 6441443 6906234 7446298 8076969 8816346 9685256 10707310
57094 10707310 11908857 13317906 14961835 16864862 19045728 21514843 24270879 27298539
57086 27298539 30568266 34036494 37645196 41321629 44978353 48510701 51791481 54670578
$$ packed form
57156A622610K3213K4059K4553K4946K5790K7131K8489K9574L0548L1558L2462
57145A924933L3122L3607L4012L4388L4839L5462L6169L6930L8045L9795M1805
57134B323107M3231M3732M3914M4624M6120M8101N0260N2463N4555N6379N8038
57123B864524N9888O2185O4831O7656P0931P5354Q1427Q8884R6943J05062J13297
57112C750982J22013J31533J42221J54730J69962J88778K11723K38943K70554
57103E381439L07221L50471M02312M64791N40064O30671P39377Q68910J022054
57094A0707310J201547J409049J643929J903027K180866K469115K756036L027660
57086B7298539L269727L468228L608702L676433L656724L532348L280780K879097
$$ plain form
57078 54670578 56989262 58608157 59434754 59436148 58634844 57095765 54912698 52197343 49071118
57069 49071118 45659002 42084010 38461097 34891055 31456161 28218372 25219600 22483381
57061 22483381 20017634 17817956 15870904 14157111 12654183 11338896 10188459 9181272
57053 9181272 8297705 7520663 6835595 6230092 5693489 5216568 4791366 4411123 4070202
57044 4070202 3763769 3487502 3237768 3011894 2807911 2623907 2457881 2308168 2173720
57035 2173720 2054025 1949034 1858981 1783910 1723648 1678793 1651377 1643535 1655354 1684209 1724978
57024 1724978 1768449 1799327 1799148 1755172 1668002 1550524 1419783 1289640 1168455 1059975 964842
57013 964842 882271 811438 751427 700338 655553 615232 578843 546132 516430 489330 465198
$$ packed form
57078E4670578K318684J618895Q26597J394q01304j539079k183067k715355l126225
57069D9071118l412116l574992l622913l570042l434894l237789k998772k736219
57061B2483381k465747k199678j947052j713793j502928j315287j150437j007187
57053I181272q83567p77042o85068o05503n36603m76921m25202l80243l40921
57044D070202l06433k76267k49734k25874k03983j84004j66026j49713j34448
57035B173720j19695j04991r0053p5071o0262m4855k7416p842J1819K8855M0769
57024A724978M3471L0878j79m3976q7170j17478j30741j30143j21185j08480r5133
57013I64842q2571p0833o0011n1089m4785m0321l6389l2711k9702k7100k4132
$$ plain form
57002 465198 444361 426243 409854 394771 381200 369392 359503 351851 346873 344783 345466 348661 354105
56989 354105 361611 371087 382427 395322 409291 423868 438503 452282 464022 472693 477541 477747 472391
56976 472391 461124 444844 425528 405343 385813 367604 350972 336368 324453 315494 309042 304574
56964 304574 302263 302634 305616 310533 317170 326157 337890 351564 365749 379527 392364 402946 408910
56951 408910 408188 400472 387269 370756 352802 334742 317532 301836 288043 276394 267092 260256
56939 260256 255874 254022 255129 259799 268287 280226 295031 312373 332077 353524 375257 395109
56927 395109 410632 419550 420201 411930 395403 372661 346751 320715 296443 274342 254144 235945
56915 235945 220265 207304 196485 186931 178244 170663 164477 159451 154999 150916 147657 145668 144632
$$ packed form
57002D65198k0837j8118j6389j5083j3571j1808r889p652m978k090O83L195N444
56989C54105P506R476J1340J2895J3969J4577J4635J3779J1740Q671M848K06n356
56976D72391j1267j6280j9316k0185j9530j8209j6632j4604j1915q959o452m468
56964C04574k311L71K982M917O637Q987J1733J3674J4185J3778J2837J0582N964
56951D08910p22p716j3203j6513j7954j8060j7210j5696j3793j1649r302o836
56939B60256m382j852J107M670Q488J1939J4805J7342J9704K1447K1733J9852
56927C95109J5523Q918O51q271j6527k2742k5910k6036k4272k2101k0198j8199
56915B35945j5680j2961j0819r554q687p581o186n026m452m083l259j989j036
$$ plain form
56902 144632 143805 143042 143025 144292 146578 149425 152956 157515 162889 168572 174736 182303 191924 203402 216310
56887 216310 230675 246694 263983 281424 297573 311006 320448 324997 324450 319388 310887 300105 288109
56874 288109 276015 265100 256553 251018 248574 249309 253751 262498 275538 292200 311899 334808 361814
56861 361814 393880 431268 472954 516506 558461 594940 622220 637278 638463 626097 602652 572262
56849 572262 539572 508284 480321 456400 437342 424469 418612 419301 425484 436901 454357 478897
56837 478897 511270 552092 601819 660096 725222 794111 862280 923689 971191 998127 1000424 978031
56825 978031 934978 878024 814511 750531 690292 636469 590665 553532 524914 504232 490879
56814 490879 484453 484852 492210 506628 527962 555968 590525 631337 677065 724559 768842 803950
$$ packed form
56902A44632q27p63j7J267K286K847L531M559N374N683O164P567R621J1478J2908
56887B16310J4365J6019J7289J7441J6149J3433R442M549n47n062q501j0782j1996
56874B88109j2094j0915q547n535k444P35M442Q747J3040J6662J9699K2909K7006
56861C61814L2066L7388M1686M3552M1955L6479K7280J5058J185j2366k3445l0390
56849E72262l2690l1288k7963k3921j9058j2873n857O89O183J1417J7456K4540
56837D78897L2373M0822M9727N8277O5126O8889O8169O1409M7502K6936K297k2393
56825I78031m3053n6954o3513o3980o0239n3823m5804l7133k8618k0682j3353
56814D90879o426L99P358J4418K1334K8006L4557M0812M5728M7494M4283L5108
$$ plain form
56802 803950 824275 825915 807705 771733 723069 668298 613177 560978 512884 469681 432533 402281
56790 402281 378823 361644 350456 344938 344374 348092 355946 367944 383769 403042 425446 449793
56778 449793 473188 491840 502609 503545 493713 473670 445988 414216 381049 348002 316543 288352
56766 288352 264161 243300 224845 208640 194908 183537 174146 166368 159705 153577 147769 142463 137677
56753 137677 133151 128959 125635 123453 122011 120728 119237 117222 114504 111531 109096 107318 105584 103774
56739 103774 102719 102934 103636 103697 102965 101991 100999 99849 98622 97551 96638 95962 95977 96904 98169 99116 99884 100891
56721 100891 101825 102078 101961 102507 104022 105690 106781 107484 108336 109523 111014 112792 114576 115773 116038 115583
56705 115583 114764 113823 113252 113826 115684 117672 118267 117186 115674 115087 115530 116033 115739 114625 113212 111962
$$ packed form
56802H03950K0325J640j8210l5972m8664n4771n5121n2199m8094m3203l7148l0252
56790D02281k3458j7179j1188n518n64L718P854J1998J5825J9273K2404K4347
56778D49793K3395J8652J0769R36r832k0043k7682l1772l3167l3047l1459k8191
56766B88352k4191k0861j8455j6205j3732j1371r391p778o663o128n808n306m786
56753A37677m526m192l324k182j442j283j491k015k718k973k435j778j734j810
56739A03774j055K15P02O1p32r74r92j150j227j071r13o76J5R27J265R47P68J007
56721A00891R34K53j17N46J515J668J091P03Q52J187J491J778J784J197K65m55
56705A15583q19r41n71N74J858J988N95j081j512n87M43N03k94j114j413j250
$$ plain form
56689 111962 111047 110385 109700 108798 107967 107902 108903 110354 111359 111781 112159 112723 113048 112797 112212 111681 111309 111177
56671 111177 111460 111955 111963 111132 110030 109480 109608 110021 110599 111582 113000 114485 115627 116219 116319 116308 116701 117613
56653 117613 118597 119259 119741 120320 120924 121433 122109 123237 124628 125928 127128 128279 129066 129325 129707 131057 133211
56636 133211 135139 136286 137116 138221 139531 140551 140881 140376 139279 138299 138050 138297 138184 137281 135937 134607
56620 134607 133452 132703 132705 133272 133620 133327 132866 132763 132672 131898 130501 129292 128854 129059 129562 130248 131057 131734 132000
56601 132000 131883 131725 131893 132542 133590 134768 135685 135979 135643 135203 135331 136129 136999 137393 137548 138175 139580 141402
56583 141402 143213 144982 146848 148724 150330 151503 152323 152960 153507 153989 154535 155382 156585 157790 158643 159462
56567 159462 161120 164010 167442 170411 172715 175009 177969 181822 186524 191975 198030 204506 211092 217113
$$ packed form
56689A11962r15o62o85r02q31o5J001J451J005M22L78N64L25k51n85n31l72j32
56671A11177K83M95Qq31j102n50J28M13N78R83J418J485J142N92J00j1L93R12
56653A17613R84O62M82N79O04N09O76J128J391J300J200J151P87K59L82J350K154
56636A33211J928J147Q30J105J310J020L30n05j097r80k49K47j13r03j344j330
56620A34607j155p49KN67L48k93m61j03r1p74j397j209m38K05N03O86Q09O77K66
56601A32000j17j58J68O49J048J178R17K94l36m40J28P98Q70L94J55O27J405J822
56583A41402J811J769J866J876J606J173Q20O37N47M82N46Q47J203J205Q53Q19
56567A59462J658K890L432K969K304K294K960L853M702N451O055O476O586O021
$$ plain form
56553 217113 221681 224452 225990 227006 227534 227356 226944 227187 228211 229078 228904 227773 226374 225148 224018 222688
56537 222688 221049 219428 218316 217655 216583 214302 211074 207884 205210 202692 200005 197385 195080 192817
56523 192817 190191 187324 184859 183399 182972 182935 182501 181503 180403 179367 177775 175230 172627 171397 171845 172998
56507 172998 174013 174804 175324 175280 174879 174890 175490 175844 175359 174580 174274 174286 174074 173880 174512 176170 178129 179565
56489 179565 180218 180341 180349 180520 180791 180931 181019 181457 182378 183352 183896 184011 183998 184053 184239 184518 184622 184201 183323 182520
56469 182520 182235 182531 183409 184911 186793 188612 190231 191672 192429 191821 190321 189538 190239 191268 191227 190414 190034
56452 190034 190149 189722 188470 187357 187050 187022 186555 185801 185300 185044 184622 184010 183694 184042 184835 185522 185852 186174
56434 186174 187023 188459 189994 191195 192110 193032 194092 195226 196268 196957 197170 197265 197835 198924 199930 200434
$$ packed form
56553B17113M568K771J538J016N28j78m12K43J024Q67j74j131j399j226j130j330
56537B22688j639j621j112o61j072k281l228l190k674k518k687k620k305k263
56523A92817k626k867k465j460m27l7m34r98j100j036j592k545k603j230M48J153
56507A72998J015P91N20m4m01J1O00L54m85p79l06J2k12j94O32J658J959J436
56489A79565O53J23QJ71K71J40Q8M38R21R74N44J15j3N5J86K79J04m21q78q03
56469A82520k85K96Q78J502J882J819J619J441P57o08j500p83P01J029m1q13l80
56452A90034J15m27j252j113l07k8m67p54n01k56m22o12l16L48P93O87L30L22
56434A86174Q49J436J535J201R15R22J060J134J042O89K13R5N70J089J006N04
$$ plain form
56418 200434 200687 201042 201487 202092 203297 205193 207014 207981 208278 208613 209133 209405 209162 208483 207524 206697 206789 208142
56400 208142 209922 210927 211064 211337 212444 214056 215401 215901 215258 213619 211811 210848 211038 211953 213219 214830
56384 214830 216747 218760 220760 222665 224104 224800 225225 226257 228120 230201 231991 233531 234851 235669 235950
56369 235950 236184 236734 237328 237482 237151 236724 236632 237093 237941 238663 238999 239474 240850 242938 244562 244991 244863 245299
56351 245299 246564 248067 249372 250611 251962 253280 254403 255468 256666 257868 258845 259830 261420 263631 265462
56336 265462 265965 265624 265942 267546 269512 270856 271881 273370 275186 276598 277553 278659 280094 281481 282799
56321 282799 284508 286658 288639 289979 290772 291310 291960 293369 295945 298935 300848 301111 300699 300840 301738 302877
56305 302877 303828 304306 304053 303352 303288 304859 307902 311311 314224 316748 319570 323135 327158 330850 333549 335152
$$ packed form
56418B00434K53L55M45O05J205J896J821R67K97L35N20K72k43o79r59q27R2J353
56400B08142J780J005J37K73J107J612J345N00o43j639j808r63J90R15J266J611
56384B14830J917K013K000J905J439O96M25J032J863K081J790J540J320Q18K81
56369B35950K34N50N94J54l31m27r2M61Q48P22L36M75J376K088J624M29j28M36
56351B45299J265J503J305J239J351J318J123J065J198J202R77R85J590K211J831
56336B65462N03l41L18J604J966J344J025J489J816J412R55J106J435J387J318
56321B82799J709K150J981J340P93N38O50J409K576K990J913K63m12J41Q98J139
56305C02877R51M78k53p01o4J571L043L409K913K524K822L565M023L692K699J603
$$ plain form
56289 335152 335963 336416 337122 338782 341549 344678 347385 349939 353323 357820 362555 366612 370128 374089 379393
56274 379393 386148 393603 400766 407389 414210 421895 430039 437812 445307 453436 462555 472067 481510 491296
56260 491296 502129 514298 527725 542131 557092 572539 589313 608596 630710 655201 682174
56249 682174 712688 747514 786228 827951 872384 919864 970920 1025968 1084761 1145846 1207084
56238 1207084 1266882 1324349 1378262 1426795 1468504 1502679 1528328 1543723 1547611 1540282 1523008 1497014
56226 1497014 1463394 1423367 1378122 1328831 1277073 1224565 1172209 1120171 1069205 1020918 976177
56215 976177 934150 893687 854964 819074 786651 757638 731841 708910 688170 669209 652319
56204 652319 637834 625355 614086 603574 593780 584957 577762 572778 569471 566369 562802 559720 558161
$$ packed form
56289C35152Q11M53P06J660K767L129K707K554L384M497M735M057L516L961N304
56274C79393O755P455P163O623O821P685Q144P773P495Q129R119R512R443R786
56260D91296J0833J2169J3427J4406J4961J5447J6774J9283K2114K4491K6973
56249F82174L0514L4826L8714M1723M4433M7480N1056N5048N8793O1085O1238
56238A207084N9798N7467N3913M8533M1709L4175K5649J5395L888p329j7274k5994
56226A497014l3620m0027m5245m9291n1758n2508n2356n2038n0966m8287m4741
56215I76177m2027m0463l8723l5890l2423k9013k5797k2931k0740j8961j6890
56204F52319j4485j2479j1269j0512r794q823p195m984l307l102l567l082j559
$$ plain form
56191 558161 557727 557319 556657 556156 555935 555889 556235 557066 557768 557752 557446 557751 558896 560549 562618 565076 567450 569406
56173 569406 571555 574712 578607 582225 585290 588516 592468 597004 601804 606725 611611 616382 621375 627129
56159 627129 633841 641370 649568 658263 667189 676387 686389 697614 709978 723455 738465 755176 772924
56146 772924 790968 809445 829071 850462 874418 902325 935480 974364 1019169 1070585 1129369
56135 1129369 1195570 1268756 1348355 1432787 1518648 1601577 1677847 1744885 1801353 1847924 1887619
56124 1887619 1924220 1960130 1995822 2030283 2060996 2084298 2097216 2099146 2091413 2075980 2055231 2031697
56112 2031697 2006135 1976022 1937158 1886772 1824579 1751943 1671788 1588909 1508546 1434185 1367416
56101 1367416 1309387 1260954 1221568 1189506 1163457 1142988 1127541 1116169 1108252 1103461 1101040 1100058
$$ packed form
56191E58161m34m08o62n01k21m6L46Q31P02j6l06L05J145J653K069K458K374J956
56173E69406K149L157L895L618L065L226L952M536M800M921M886M771M993N754
56159F27129O712P529Q198Q695Q926R198J0002J1225J2364J3477J5010J6711J7748
56146G72924J8044J8477J9626K1391K3956K7907L3155L8884M4805N1416N8784
56135A129369O6201P3186P9599Q4432Q5861Q2929P6270O7038N6468M6571L9695
56124A887619L6601L5910L5692L4461L0713K3302J2918J930p733j5433k0749k3534
56112B031697k5562l0113l8864n0386o2193p2636q0155q2879q0363p4361o6769
56101A367416n8029m8433l9386l2062k6049k0469j5447j1372p917m791k421r82
$$ plain form
56089 1100058 1100310 1101995 1104754 1108000 1111925 1117119 1123407 1130195 1137675 1146492 1156403 1166557 1176906 1188120
56075 1188120 1200182 1212374 1224635 1237733 1252054 1267317 1283378 1300218 1317236 1333793 1350416
56064 1350416 1368368 1388074 1408989 1430807 1453699 1477593 1502369 1528513 1556428 1585421 1614570
56053 1614570 1644118 1674715 1705748 1735922 1765074 1793914 1822410 1850187 1878141 1907835 1939428
56042 1939428 1971893 2005126 2040085 2076992 2115128 2154270 2194571 2235228 2275061 2314245 2353635
56031 2353635 2392545 2429161 2462960 2494827 2525181 2554276 2584229 2618309 2658022 2702881 2752873
56020 2752873 2808738 2869845 2934390 3001936 3073441 3148674 3226181 3305985 3389710 3477751 3568871
56009 3568871 3662879 3761111 3863999 3970939 4082786 4201568 4327330 4458257 4594399 4738220
$$ packed form
56089A100058K52J685K759L246L925N194O288O788P480Q817R911J0154J0349J1214
56075A188120J2062J2192J2261J3098J4321J5263J6061J6840J7018J6557J6623
56064A350416J7952J9706K0915K1818K2892K3894K4776K6144K7915K8993K9149
56053A614570K9548L0597L1033L0174K9152K8840K8496K7777K7954K9694L1593
56042A939428L2465L3233L4959L6907L8136L9142M0301M0657L9833L9184L9390
56031B353635L8910L6616L3799L1867L0354K9095K9953L4080L9713M4859M9992
56020B752873N5865O1107O4545O7546P1505P5233P7507P9804Q3725Q8041R1120
56009C568871R4008R8232J02888J06940J11847J18782J25762J30927J36142J43821
$$ plain form
55999 4738220 4890968 5051726 5220724 5400320 5591845 5794581 6008740 6236218 6477605
55990 6477605 6731779 6999472 7284025 7587846 7911507 8257090 8628743 9029046 9458578
55981 9458578 9919925 10418250 10957211 11538629 12167063 12850220 13594084 14402638 15283534
55972 15283534 16248991 17310160 18476514 19762419 21188757 22777199 24549988 26537946
55964 26537946 28782977 31332457 34240508 37579089 41442734 45944011 51217251 57432455
55956 57432455 64798456 73552805 83962074 96334836 111019322 128381334 148785820
55949 148785820 172561325 199880030 230547173 263782487 298040403 330851681 358805841
55942 358805841 378005591 385158456 378863538 360246063 332471619 299514590 264990424
$$ packed form
55999D738220J52748J60758J68998J79596J91525K02736K14159K27478K41387
55990F477605K54174K67693K84553L03821L23661L45583L71653M00303M29532
55981I458578M61347M98325N38961N81418O28434O83157P43864Q08554Q80896
55972A5283534R65457J061169J166354J285905J426338J588442J772789J987958
55964B6537946K245031K549480K908051L338581L863645M501277N273240O215204
55956E7432455P366001Q754349J0409269J2372762J4684486J7362012K0404486
55949A48785820K3775505K7318705L0667143L3235314L4257916L2811278K7954160
55942C58805841J9199750P152865o294918j8617475k7774444l2957029l4524166
$$ plain form
55935 264990424 231555136 200828858 173574377 149950912 129764831 112659068 98218670
55928 98218670 86027025 75707110 66941750 59466247 53056271 47528153 42738213 38570103
55920 38570103 34924102 31718652 28891488 26391231 24171127 22192760 20428269 18853571
55912 18853571 17443485 16176085 15036193 14010719 13084796 12245307 11483565 10791439 10158828
55903 10158828 9577531 9043547 8552935 8099251 7677440 7286342 6924808 6588928 6275451
55894 6275451 5984282 5715044 5464553 5230185 5012451 4811663 4625092 4450041 4286956
55885 4286956 4136889 3998358 3869049 3748049 3633815 3522086 3408463 3291755 3173267
55876 3173267 3054764 2938798 2828761 2726386 2630588 2540103 2455387 2376484 2301231 2227443
$$ packed form
55935B64990424l3435288l0726278k7254481k3623465k0186081j7105763j4440398
55928I8218670j2191645j0319915q765360p475503o409976n528118m789940m168110
55920C8570103l646001l205450k827164k500257k220104j978367j764491j574698
55912A8853571j410086j267400j139892j025474r25923q39489p61742o92126o32611
55903A0158828n81297n33984m90612m53684m21811l91098l61534l35880l13477
55894F275451k91169k69238k50491k34368k17734k00788j86571j75051j63085
55885D286956j50067j38531j29309j21000j14234j11729j13623j16708j18488
55876C173267j18503j15966j10037j02375r5798r0485q4716p8903p5253p3788
$$ plain form
55866 2227443 2155188 2085338 2017609 1951561 1887680 1825893 1764639 1702875 1641420 1581187 1522045
55855 1522045 1464794 1412101 1365696 1324322 1286021 1250636 1218465 1188365 1159239 1131795 1106906
55844 1106906 1083578 1060399 1037724 1016623 996818 977414 958577 940858 923921 907525 892736
55833 892736 880589 870459 861085 852155 843603 834632 824992 816064 809051 803129 796880 790372 784128 777145
55819 777145 767893 756536 744371 731645 717636 702434 687072 672223 658171 645567 634841 625242
55807 625242 615706 606251 597476 589453 582367 577441 575572 575555 575270 574308 573947 574817 576115 577088 577856 578636
55791 578636 579340 580175 581616 583639 585714 587596 589446 591227 592638 593499 593509 591650 586386 576529 561867
55776 561867 543443 523488 504413 487348 472139 458867 448397 441012 435628 431155 427618 425143
$$ packed form
55866B227443p2255o9850o7729o6048o3881o1787o1254o1764o1455o0233n9142
55855A522045n7251n2693m6405m1374l8301l5385l2171l0100k9126k7444k4889
55844A106906k3328k3179k2675k1101j9805j9404j8837j7719j6937j6396j4789
55833H92736j2147j0130r374q930q552q971r640q928p013n922o249o508o244o983
55819G77145r252j1357j2165j2726j4009j5202j5362j4849j4052j2604j0726r599
55807F25242r536r455q775q023p086m926j869j7k85r62l61Q70J298R73P68P80
55791E78636P04Q35J441K023K075J882J850J781J411Q61J0j859n264r857j4662
55776E61867j8424j9955j9075j7065j5209j3272j0470p385n384m473l537k475
$$ plain form
55764 425143 422887 420042 417002 414465 412193 409760 407652 406420 405478 403974 402180 400728 399084 396067
55750 396067 391373 385312 377625 367997 357324 347048 337511 328303 319888 313343 308632 304580 300673 297555
55736 297555 295634 294429 293490 292845 292297 291236 289393 287001 284218 281204 278562 276630 274337 269939 263199
55721 263199 255894 249934 245793 242932 240839 239231 237846 236459 234833 232723 230399 228873 228898 229905 230688
55706 230688 231013 231715 233257 235069 236397 236959 236691 235569 233786 231502 228425 224341 219940 216248 213222
55691 213222 209786 205403 200757 196736 193623 191506 190600 190693 190971 190884 190711 190919 191442 191981 192599 193647 195303
55674 195303 197438 199712 201665 202868 203083 202208 200260 197689 195447 194320 194304 194968 196225 198192 200492
55659 200492 202291 203098 203120 202928 203191 204603 207470 211318 215296 218905 222038 224521 226125 226926 227198 227061
$$ packed form
55764D25143k256k845l040k537k272k433k108j232r42j504j794j452j644l017
55750C96067m694o061p687r628j0673j0276r537r208q415o545m711m052l907l118
55736B97555j921j205r39o45n48j061j843k392k783l014k642j932k293m398o740
55721B63199p305n960m141k861k093j608j385j387j626k110k324j526K5J007P83
55706B30688L25P02J542J812J328N62k68j122j783k284l077m084m401l692l026
55691B13222l436m383m646m021l113k117r06R3K78q7j73K08N23N39O18J048J656
55674A95303K135K274J953J203K15q75j948k571k242j127j6O64J257J967K300
55659B00492J799Q07K2j92K63J412K867L848L978L609L133K483J604Q01K72j37
$$ plain form
55643 227061 226616 226174 225871 225312 224123 222553 220892 218565 214599 208902 202411 196020 189983 184277 178893
55628 178893 173772 169003 164970 161803 158979 156217 154438 154834 157029 159178 160028 159948 159737 159420 158659 157502
55612 157502 156115 154298 151827 148951 146115 143455 140803 138013 135092 132253 129898 128306 127315 126576 126001
55597 126001 125593 124963 123551 121379 119156 117551 116689 116313 116088 115812 115680 116232 117658 119358 120623 121519
55581 121519 122594 123948 125230 126334 127387 128179 128418 128529 129436 131428 133849 136032 137972 140077 142836
55566 142836 146684 151449 155908 158572 159014 157894 155772 152687 148868 144947 141269 137730 134494 132074
55552 132074 130450 128819 126496 123434 119726 115367 110829 107027 104289 101965 99538 97485 96579 96818 97497
55537 97497 97995 98134 98060 98047 98190 98220 97962 97869 98487 99459 99819 99394 99045 99277 99477 98972 98059 97388 96998 96633
$$ packed form
55643B27061m45m42l03n59j189j570j661k327l966n697o491o391o037n706n384
55628A78893n121m769m033l167k824k762j779L96K195K149Q50q0k11l17p61j157
55612A57502j387j817k471k876k836k660k652k790k921k839k355j592r91p39n75
55597A26001m08o30j412k172k223j605q62l76k25k76j32N52J426J700J265Q96
55581A21519J075J354J282J104J053P92K39J11R07J992K421K183J940K105K759
55566A42836L848M765M459K664M42j120k122l085l819l921l678l539l236k420
55552A32074j624j631k323l062l708m359m538l802k738k324k427k053r06K39O79
55537I7497M98J39p4j3J43L0k58r3O18R72L60m25l49K32K00n05r13o71l90l65
$$ plain form
55517 96633 96456 96750 97242 97340 96873 96178 95669 95656 96275 97250 97952 98020 97668 97162 96372 95143 93754 92620 91830
55498 91830 91249 90879 90873 91374 92523 94344 96547 98704 100659 102385 103480 103418 102447 101586 101424 101487 101135 100493
55480 100493 100055 99873 99679 99445 99329 99316 99340 99534 99914 100072 99540 98347 96918 95585 94418 93354 92288
55463 92288 91199 90337 90061 90368 90833 91113 91226 91261 91141 90806 90317 89669 88844 88072 87618 87302 86687 85813 85224
55444 85224 85167 85376 85741 86550 87771 88738 88905 88428 87740 87088 86740 86995 87603 87775 87184 86435 86142 86164 86235 86706
55424 86706 87975 89642 90940 91665 92083 92221 91922 91479 91561 92529 94211 96270 98373 100099 101085 101296 100943
55407 100943 100207 99166 97838 96220 94503 93272 93078 93654 93976 93328 91964 90568 89513 88836 88437 88003
55391 88003 87188 86195 85717 86023 86562 86789 86878 87274 88003 88859 89783 90621 90913 90421 89537 88771 88184 87649 87305
$$ packed form
55517I6633j77K94M92R8m67o95n09j3O19R75P02O8l52n06p90j229j389j134p90
55498I1830n81l70oN01J149J821K203K157J955J726J095o2r71q61j62O3l52o42
55480A00493m38j82j94k34j16j3K4J94L80J58n32j193j429j333j167j064j066
55463I2288j089q62k76L07M65K80J13L5j20l35m89o48q25p72m54l16o15q74n89
55444H5224n7K09L65Q09J221R67J67m77o88o52l48K55O08J72n91p49k93K2P1M71
55424H6706J269J667J298P25M18J38k99m43Q2R68J682K059K103J726R86K11l53
55407A00943p36j041j328j618j717j231j94N76L22o48j364j396j055o77l99m34
55391H8003q15r93m78L06N39K27Q9L96P29Q56R24Q38K92m92q84p66n87n35l44
$$ plain form
55372 87305 87381 87889 88761 89880 90755 90700 89679 88433 87484 86591 85608 85128 85676 86838 87804 88323 88563 88563 88436
55353 88436 88580 89018 89054 88215 87085 86510 86481 86519 86680 87293 88119 88605 88707 88669 88242 87011 85276 83768 82637
55334 82637 81501 80413 79988 80495 81423 81984 81648 80386 78822 77888 77876 78156 78223 78475 79397 80633 81680 82869
55316 82869 84625 86254 86660 86013 85459 85352 85030 84352 84181 85006 86178 86914 87185 87207 86895 86293 85924 86236
55298 86236 87108 88110 88914 89335 89416 89544 90080 90967 92005 93199 94255 94228 92573 90296 88962 88682 88237
55281 88237 87224 86771 87769 89571 91006 91763 92126 92133 91668 90856 89866 88778 87958 87951 88668 89282 89308 89192 89468
55262 89468 90014 90585 91403 92718 94289 95786 97197 98346 98652 97942 97063 97025 97815 98594 98724 98119 96870
55245 96870 95137 93329 91913 91030 90524 90176 89739 89042 88307 88089 88609 89401 89868 89920 89838 89798 89848 90141 90833
$$ packed form
55372H7305P6N08Q72J119Q75n5j021j246r49q93r83m80N48J162R66N19K40%j27
55353H8436J44M38L6q39j130n75k9L8J61O13Q26M86J02l8m27j231j735j508j131
55334H2637j136j088m25N07R28N61l36j262j564r34j2K80O7K52R22J236J047J189
55316H2869J756J629M06o47n54j07l22o78j71Q25J172P36K71K2l12o02l69L12
55298H6236Q72J002Q04M21Q1J28N36Q87J038J194J056k7j655k277j334k80m45
55281H8237j013m53R98J802J435P57L63Pm65q12r90j088q20pP17O14K6j16K76
55262H9468N46N71Q18J315J571J497J411J149L06p10q79l8P90P79J30o05j249
55245I6870j733j808j416q83n06l48m37o97p35k18N20P92M67N2q2m0N0K93O92
$$ plain form
55226 90833 91843 92823 93313 93007 92137 91491 91577 91824 91228 89886 89162 90093 92208 94262 95472 95622 94652 92875
55208 92875 91202 90456 90565 90886 91117 91424 91883 92295 92430 92121 91236 89906 88660 88025 88059 88447 88869 89102
55190 89102 89066 89028 89530 90829 92574 94245 95626 96607 96879 96180 94702 92993 91610 90963 91153 91774 92192
55173 92192 92302 92642 93550 94623 95366 95886 96491 97029 97200 97243 97740 98866 100313 101793 103132 104043 104320 104193
55155 104193 104002 103648 102844 101823 101228 101266 101459 101372 101082 100813 100521 100124 99812 99820 100025 99982 99298 97926 96200
55136 96200 94672 93803 93688 94057 94528 94861 95034 95196 95543 96194 97157 98350 99540 100366 100619 100506 100401 100311
55118 100311 99848 98797 97385 95872 94300 92891 92282 92886 94198 95178 95344 95132 95196 95739 96609 97743 99224
55101 99224 100985 102708 104125 105321 106574 107842 108642 108623 108047 107396 106655 105446 103875 102729 102604 103219
$$ packed form
55226I0833J010R80M90l06q70o46Q6K47n96j342p24R31K115K054J210J50r70j777
55208I2875j673p46J09L21K31L07M59M12J35l09q85j330j246o35L4L88M22K33
55190H9102l6l8N02J299J745J671J381R81K72o99j478j709j383o47J90O21M18
55173I2192J10L40R08J073P43N20O05N38J71M3M97J126J447J480J339R11K77j27
55155A04193j91l54q04j021n95L8J93q7k90k69k92l97l12QK05m3o84j372j726
55136I6200j528q69j15L69M71L33J73J62L47O51R63J193J190Q26K53j13j05r0
55118A00311m63j051j412j513j572j409o09O04J312R80J66k12O4N43Q70J134J481
55101I9224J761J723J417J196J253J268Q00j9n76o51p41j209j571j146j25O15
$$ plain form
55085 103219 103873 104252 104553 105044 105823 106775 107513 107526 106644 105243 103862 102772 102064 101864 102185 102786 103418 104050
55067 104050 104669 105081 105189 105218 105397 105555 105375 104916 104564 104536 104655 104654 104455 104188 104036 104092 104316 104672 105227 105940
55047 105940 106434 106346 105894 105715 105996 106224 105963 105497 105367 105674 106115 106408 106371 105928 105362 105205 105532 105736 105389
55028 105389 104873 104641 104266 102944 100737 98588 97216 96655 96843 97891 99626 101456 102930 103996 104559 104371
55012 104371 103591 102944 102902 103040 102606 101565 100681 100634 101317 102050 102345 102406 102878 104096 105621 106638 106767 106318
54994 106318 105812 105476 105293 105320 105779 106863 108514 110336 111729 112230 111789 110729 109468 108311 107458 107059 107212
54977 107212 107870 108769 109520 109924 110201 110721 111500 112250 112975 114137 115901 117536 118083 117576 117128 117658 118890
54960 118890 119809 119881 119538 119552 120206 121145 121803 121833 121218 120205 119165 118313 117514 116532 115546 115098 115415 116068 116625
$$ packed form
55085A03219O54L79L01M91P79R52P38J3q82j401j381j090p08k00L21O01O32O32
55067A04050O19M12J08K9J79J58j80m59l52k8J19jj99k67j52N6K24L56N55P13
55047A05940M94q8m52j79K81K28k61m66j30L07M41K93l7m43n66j57L27K04l47
55028A05389n16k32l75j322k207k149j372n61J88J048J735J830J474J066N63j88
55012A04371p80o47m2J38m34j041q84m7O83P33K95O1M72J218J525J017J29m49
54994A06318n06l36j83K7M59J084J651J822J393N01m41j060j261j157q53l99J53
54977A07212O58Q99P51M04K77N20P79P50P25J162J764J635N47n07m48N30J232
54960A18890R19P2l43J4O54R39O58L0o15j013j040q52p99r82r86m48L17O53N57
$$ plain form
54941 116625 117270 118357 119672 120738 121624 122691 123626 123620 122690 121918 121999 122422 122606 123032 124382 126148 127105 126943
54923 126943 126592 126967 128179 130035 132590 135959 140007 144401 148772 152796 156468 160293 164856 170140 175420
54908 175420 179694 182045 181885 179334 175302 170784 166156 161439 157018 153497 150936 148746 146414 143919
54894 143919 141442 139118 137144 135730 134834 134231 133850 133737 133729 133591 133422 133521 133851 134121 134380 135011 136040 137007
54876 137007 137723 138709 140630 143695 147799 152803 158314 163563 167955 171607 175102 178753 182176 184448 184631
54861 184631 182464 178695 174436 170108 165374 160222 155510 151969 149117 145832 141842 138002 135019 132597
54847 132597 130129 127704 125862 124652 123555 122383 121649 121754 122246 122352 122029 121929 122359 122849 122899 122661 122581
54830 122581 122721 122845 122927 123184 123690 124312 124927 125446 125698 125572 125250 125027 124921 124657 124053 123250 122581 122294 122344
$$ packed form
54941A16625O45J087J315J066Q86J067R35or30p72Q1M23J84M26J350J766R57j62
54923A26943l51L75J212J856K555L369M048M394M371M024L672L825M563N284N280
54908A75420M274K351j60k551m032m518m628m717m421l521k561k190k332k495
54894A43919k477k324j974j414q96o03l81j13qj38j69R9L30K70K59O31J029R67
54876A37007P16R86J921L065M104N004N511N249M392L652L495L651L423K272J83
54861A84631k167l769m259m328m734n152m712l541k852l285l990l840k983k422
54847A32597k468k425j842j210j097j172p34J05M92J06l23j00M30M90N0k38q0
54830A22581J40J24Q2K57N06O22O15N19K52j26l22k23j06k64o04q03o69k87N0
$$ plain form
54811 122344 122411 122301 122328 123019 124308 125423 125790 125658 125523 125370 124969 124500 124268 124029 123312 122338 121895 122259 122862
54792 122862 123210 123567 124439 125789 127108 128024 128585 129052 129577 130056 130320 130440 130720 131293 132006 132851 134124 135788
54774 135788 137089 137333 136823 136507 136978 138397 141046 145068 149722 153810 157034 160176 163790 167541 171114
54759 171114 174923 179370 184028 188150 191532 194343 196435 197367 196872 194889 191309 186148 179876 173262 166914
54744 166914 161083 155773 150905 146571 143229 141352 140763 140614 140210 139583 139130 138989 139029 139142 139290 139434 139576
54727 139576 139730 139722 139355 138855 138866 139895 141985 145001 148843 153283 158005 162931 168158 173490 178476 182998
54711 182998 187187 190562 191955 190703 187381 182900 177514 171283 164945 159482 155050 151088 147361 144239
54697 144239 141992 140436 139327 138562 137917 137024 135793 134551 133654 133199 133089 133111 132948 132408 131714 131394 131816
$$ packed form
54811A22344O7j10K7O91J289J115L67j32j35j53m01m69k32k39p17r74m43L64O03
54792A22862L48L57Q72J350J319R16N61M67N25M79K64J20K80N73P13Q45J273J664
54774A35788J301K44n10l16M71J419K649M022M654M088L224L142L614L751L573
54759A71114L809M447M658M122L382K811K092R32m95j983l580n161o272o614o348
54744A66914n831n310m868m334l342j877n89j49m04o27m53j41M0J13J48J44J42
54727A39576J54ql67n00J1J029K090L016L842M440M722M926N227N332M986M522
54711A82998M189L375J393j252l322m481n386o231o338n463m432l962l727l122
54697A44239k247j556j109p65o45q93j231j242q97m55j10K2j63n40o94l20M22
$$ plain form
54680 131816 132921 134263 135185 135123 134004 132300 130572 129114 128107 127775 128054 128419 128393 128054 127670 127112 126128
54663 126128 125026 124534 124965 125923 126840 127377 127347 126719 125835 125231 125117 125316 125688 126252 126826 127042 126865 126712 126848
54644 126848 127015 126878 126534 126312 126348 126596 127037 127567 127904 127971 128215 129170 130716 132146 132974 133357 133597 133573 132901
54625 132901 131484 129625 127735 126189 125366 125497 126360 127369 128102 128589 129024 129377 129472 129258 128846 128419 128245
54608 128245 128585 129334 129977 130165 130145 130285 130391 130001 129222 128665 128531 128427 128281 128718 130027 131275 131168 129622
54590 129622 127881 127127 127426 128076 128525 128730 128904 129195 129575 129954 130344 130823 131278 131395 131107 130870 131236 132134
54572 132134 132829 132666 131650 130272 128994 128052 127591 127686 128184 128749 129223 129819 130756 131770 132266 132023 131476 131192
54554 131192 131350 131904 132887 134166 135207 135554 135409 135273 135103 134394 133065 131725 130915 130591 130515 130724 131359 132442
$$ packed form
54680A31816J105J342R22o2j119j704j728j458j007l32K79L65k6l39l84n58r84
54663A26128j102m92M31R58R17N37l0o28q84o04j14J99L72N64N74K16j77j53J36
54644A26848J67j37l44k22L6K48M41N30L37O7K44R55J546J430Q28L83K40k4o72
54625A32901j417j859j890j546q23J31Q63J009P33M87M35L53R5k14m12m27j74
54608A28245L40P49O43J88k0J40J06l90p79n57j34j04j46M37J309J248j07j546
54590A29622j741p54K99O50M49K05J74K91L80L79L90M79M55J17k88k37L66Q98
54572A32134O95j63j016j378j278r42m61R5M98N65M74N96R37J014M96k43n47k84
54554A31192J58N54R83J279J041L47j45j36j70p09j329j340q10l24p6K09O35J083
$$ plain form
54536 132442 133982 135945 137979 139557 140537 141171 141432 140890 139505 138044 137278 137203 137393 137715 138301 139162 140198
54519 140198 141296 142114 142212 141731 141417 141585 141571 140766 139603 138831 138315 137554 136970 137593 139422 141147 141764 141587
54501 141587 141328 140954 140035 138725 137739 137531 137860 138128 137953 137439 136977 136697 136271 135465 134737 134841 135850 137014
54483 137014 137668 137855 137934 138021 138076 138228 138653 139306 139945 140299 140184 139691 139349 139763 140923 142164 143041 143897 145236
54464 145236 146752 147468 146873 145591 144781 145012 145802 146168 145587 144441 143624 143696 144460 145280 145657 145484 144936 144322
54446 144322 144003 144213 144836 145453 145701 145567 145259 144840 144165 143178 142112 141312 140954 140958 141047 140847 140151 139263 138823
54427 138823 139089 139658 140164 140944 142472 144352 145572 145816 145846 146367 147158 147679 147972 148437 149109 149692 150069 150275
54409 150275 150121 149356 148219 147425 147451 148033 148405 147970 146858 145869 145762 146515 147516 148405 149347 150443 151418 152200
$$ packed form
54536A32442J540J963K034J578R80O34K61n42j385j461p66p5J90L22N86Q61J036
54519A40198J098Q18R8m81l14J68j4q05j163p72n16p61n84O23J829J725O17j77
54501A41587k59l74r19j310r86k08L29K68j75n14m62k80m26q06p28J04J009J164
54483A37014O54J87P9Q7N5J52M25O53O39L54j15m93l42M14J160J241Q77Q56J339
54464A45236J516P16n95j282q10K31P90L66n81j146q17P2P64Q20L77j73n48o14
54446A44322l19K10O23O17K48j34l08m19o75r87j066q00l58MQ9k00o96q88m40
54427A38823K66N69N06P80J528J880J220K44L0N21P91N21K93M65O72N83L77K06
54409A50275j54p65j137p94K6N82L72m35j112r89j07P53J001Q89R42J096R75P82
$$ plain form
54391 152200 153284 155011 156829 157769 157494 156506 155457 154621 153891 153023 151967 151158 151194 152026 152853 153109 153163 153660
54373 153660 154562 155285 155452 155048 154189 153278 153087 154082 155830 157516 158806 159794 160541 161252 162482 164411 166176
54356 166176 166683 165901 164637 163318 161830 160361 159374 158751 157888 156771 156055 155907 155637 154783 153779 153203 153014
54339 153014 152868 152640 152305 151851 151548 151801 152529 153150 153330 153221 152880 152127 151172 150705 151068 151941 152966 154000
54321 154000 154529 153751 151731 149785 149147 149817 151098 152543 153775 154111 153262 152008 151432 151724 152334 152963 153753
54304 153753 154738 155769 156852 158022 159055 159756 160361 161132 161817 162002 161814 161683 161651 161520 161521 162078 162899 162965 161691
54285 161691 159642 157893 157067 157120 157688 158414 159155 159957 160702 160855 159981 158499 157474 157447 157824 157674 156811 155832
54267 155832 155317 155413 156084 157309 158858 160189 160817 160752 160395 160084 159873 159633 159179 158423 157693 157783 159172 161141
$$ packed form
54391A52200J084J727J818R40k75r88j049q36p30q68j056q09L6Q32Q27K56N4M97
54373A53660R02P23J67m04q59r11j91R95J748J686J290R88P47P11J230J929J765
54356A66176N07p82j264j319j488j469r87o23q63j117p16j48k70q54j004n76j89
54339A53014j46k28l35m54l03K53P28O21J80j09l41p53r55m67L63Q73J025J034
54321A54000N29p78k020j946o38O70J281J445J232L36q49j254n76K92O10O29P90
54304A53753R85J031J083J170J033P01O05P71O85J85j88j31l2j31JN57Q21O6j274
54285A61691k049j749q26N3N68P26P41Q02P45J53q74j482j025k7L77j50q63r79
54267A55832n15R6O71J225J549J331O28o5l57l11k11k40m54p56p30R0J389J969
$$ plain form
54249 161141 162271 162145 161984 163080 165067 166481 166718 166547 166717 167058 167225 167513 168303 169199 169325 168303 166583
54232 166583 164925 163831 163347 163160 162982 162876 163120 163794 164682 165487 165836 165248 163642 161763 160474 159637 158432
54215 158432 156930 156428 157757 160037 161766 162527 162923 163333 163641 163918 164422 164876 164505 163095 161525 160992 161914
54198 161914 163701 165341 166165 166233 166173 166612 167720 169230 170762 172101 173344 174811 176641 178525 180108 181631
54182 181631 183776 186758 189992 192767 194791 195906 195767 194244 191792 189060 186305 183429 180312 176931
54168 176931 173472 170489 168514 167305 165982 164193 162558 161642 161092 160327 159486 158944 158420 157409 156291 156096
54152 156096 157160 158662 159555 159439 158543 157376 156518 156306 156639 157272 158138 159118 159782 159830 159582 159566 159860 160326
54134 160326 161220 162852 164816 166274 166997 167457 167913 168161 168339 169141 170801 172459 173105 172827 172627 173127 173874
$$ packed form
54249A61141J130j26j61J096J987J414K37j71J70L41J67K88P90Q96J26j022j720
54232A66583j658j094m84j87j78j06K44O74Q88Q05L49n88j606j879j289q37j205
54215A58432j502n02J329K280J729P61L96M10L08K77N04M54l71j410j570n33R22
54198A61914J787J640Q24O8o0M39J108J510J532J339J243J467J830J884J583J523
54182A81631K145K982L234K775K024J115j39j523k452k732k755k876l117l381
54168A76931l459k983j975j209j323j789j635r16n50p65q41n42n24j011j118j95
54152A56096J064J502Q93j16q96j167q58k12L33O33Q66R80O64M8k48j6K94M66
54134A60326Q94J632J964J458P23M60M56K48J78Q02J660J658O46k78k00N00P47
$$ plain form
54117 173874 173939 173020 171857 171574 172623 174387 175838 176465 176521 176608 177163 178171 179157 179605 179522 179353 179246 178788
54099 178788 177725 176499 175664 175151 174609 174049 173538 172562 170475 167491 164535 162172 160340 159109 158931 159935
54083 159935 161560 163118 164295 164972 165080 164802 164545 164534 164800 165526 166921 168664 170027 170724 171186 171872 172767
54066 172767 173693 174606 175361 175668 175545 175349 175145 174527 173414 172509 172533 173310 174040 174251 174077 173844 173812 174247 175299
54047 175299 176802 178437 180155 182233 184872 187906 190978 193927 196947 200309 204010 207815 211647 215656
54033 215656 219722 223186 225424 226573 227344 228192 229017 229635 230149 230858 232020 233670 235302 235905 234784 232415
54017 232415 230120 228854 228602 228750 228532 227252 224851 222356 221056 220946 220576 218766 215876 212966 210337
54002 210337 207572 204581 201887 199930 198645 197713 196825 195672 194035 192014 189987 188275 186975 186028 185330
$$ packed form
54117A73874O5r19j163k83J049J764J451O27N6Q7N55J008R86M48q3j69j07m58
54099A78788j063j226q35n13n42n60n11r76k087k984k956k363j832j231j78J004
54083A59935J625J558J177O77J08k78k57j1K66P26J395J743J363O97M62O86Q95
54066A72767R26R13P55L07j23j96k04o18j113r05K4P77P30K11j74k33l2M35J052
54047A75299J503J635J718K078K639L034L072K949L020L362L701L805L832M009
54033B15656M066L464K238J149P71Q48Q25O18N14P09J162J650J632O03j121k369
54017B32415k295j266k52J48k18j280k401k495j300j10l70j810k890k910k629
54002B10337k765k991k694j957j285r32q88j153j637k021k027j712j300r47o98
$$ plain form
53987 185330 184811 184506 184481 184597 184469 183779 182589 181281 180249 179620 179163 178483 177422 176254 175337 174711 174278
53970 174278 174199 174649 175188 174963 173806 172712 172827 174207 175924 177185 177966 178630 179380 180235 181259 182516 183819
53953 183819 184686 184728 184064 183262 182836 182917 183395 184158 185096 186131 187391 189093 191098 192904 194373 196098 198634
53936 198634 201716 204749 207776 211275 215235 219149 222936 227077 231714 236300 240370 244089 247777 251396
53922 251396 254723 257583 259733 260986 261637 262318 263253 264114 264715 265303 266094 267150 268816 271492 274628 276806
53906 276806 277320 276995 276885 276847 276075 274401 272266 269866 267235 264856 263286 262260 260927 258921 256540 253926
53890 253926 250855 247404 244109 241185 238140 234437 230231 226227 223083 221032 219769 218556 216724 214281
53876 214281 211877 210044 208610 206960 204795 202541 201002 200623 201088 201686 202030 202279 202668 203078 203185 202812
$$ packed form
53987A85330n19l05k5J16j28o90j190j308j032o29m57o80j061j168r17o26m33
53970A74278p9M50N39k25j157j094J15J380J717J261P81O64P50Q55J024J257J303
53953A83819Q67M2o64q02m26Q1M78P63R38J035J260J702K005J806J469J725K536
53936A98634L082L033L027L499L960L914L787M141M637M586M070L719L688L619
53922B51396L327K860K150J253O51O81R35Q61O01N88P91J056J666K676L136K178
53906B76806N14l25j10l8p72j674k135k400k631k379j570j026j333k006k381k614
53890B53926l071l451l295k924l045l703m206m004l144k051j263j213j832k443
53876B14281k404j833j434j650k165k254j539l79M65N98L44K49L89M10J07l73
$$ plain form
53860 202812 201984 200799 199359 197723 195899 194065 192797 192740 193891 195477 196644 197030 196675 195831 195028 194874
53844 194874 195422 196080 196382 196510 196866 197464 198088 198662 199146 199430 199579 199815 199981 199526 198433 197615 197862 198809
53826 198809 199519 199626 199280 198431 197062 195876 195816 196803 197731 197812 197342 197064 197345 198141 199232 200320 201206 201950
53808 201950 202565 202749 202379 202126 202946 204957 207390 209680 212004 214667 217606 220701 223986 227277 230071
53793 230071 232088 233527 234604 235296 235763 236520 237772 238961 239428 239326 239437 240193 241203 241748 241462 240441
53777 240441 238912 236998 234840 232757 231058 229683 228344 227063 226248 226037 225973 225647 225253 225011 224489 223178
53761 223178 221476 220295 219730 218994 217748 216638 216186 215927 215191 214167 213642 213969 214805 215645 216236 216656 217246
53744 217246 218362 219970 221668 223209 224764 226577 228629 230765 232834 234584 235809 236814 238339 240771
$$ packed form
53860B02812q28j185j440j636j824j834j268n7J151J586J167L86l55q44q03j54
53844A94874N48O58L02J28L56N98O24N74M84K84J49K36J66m55j093q18K47R47
53826A98809P10J07l46q49j369j186o0R87R28Q1m70k78K81P96J091J088Q86P44
53808B01950O15J84l70k53Q20K011K433K290K324K663K939L095L285L291K794
53793B30071K017J439J077O92M67P57J252J189M67j02J11P56J010N45k86j021
53777B40441j529j914k158k083j699j375j339j281q15k11o4l26l94k42n22j311
53761B23178j702j181n65p36j246j110m52k59p36j024n25L27Q36Q40N91M20N90
53744B17246J116J608J698J541J555J813K052K136K069J750J225J005J525K432
$$ plain form
53730 240771 243763 246841 249971 253266 256571 259720 262900 266366 270130 274376 279830 287187 296297 306387
53716 306387 317048 328664 342044 358013 377232 400044 426468 456642 491057 529876 571864
53705 571864 614018 651954 680527 694876 692291 673835 643963 608223 571090 535425 503030 475152
53693 475152 452473 434792 420870 408971 398090 388573 381155 375492 370246 364624 359162 354679 351067
53680 351067 347626 344131 340996 338596 336942 335884 335150 334229 332678 330595 328414 326272 323969 321546 319392
53665 319392 317604 315740 313516 311397 310110 309718 309547 309017 308218 307684 307733 308096 308129 307466 306466 305838 305840 306091
53647 306091 306288 306650 307355 307918 307692 306831 306172 306158 306468 306811 307514 309016 311176 313407 315265 316679 317887
53630 317887 319396 321747 325015 328650 331992 334785 337132 339263 341533 344257 347265 349987 352291 354896
$$ packed form
53730B40771K992L078L130L295L305L149L180L466L764M246N454P357R110J0090
53716C06387J0661J1616J3380J5969J9219K2812K6424L0174L4415L8819M1988
53705E71864M2154L7936K8573J4349k585j8456k9872l5740l7133l5665l2395k7878
53693D75152k2679j7681j3922j1899j0881r517p418n663n246n622n462m483l612
53680C51067l441l495l135k400j654j058p34r21j551k083k181k142k303k423k154
53665C19392j788j864k224k119j287l92j71n30p99n34M9L63L3o63j000o28KK51
53647C06091J97L62P05N63k26q61o59j4L10L43P03J502K160K231J858J414J208
53630C17887J509K351L268L635L342K793K347K131K270K724L008K722K304K605
$$ plain form
53616 354896 358546 363123 368096 373474 379605 386200 392342 397555 402158 406386 409866 412360 414489 417211
53602 417211 420853 425048 429337 433395 436789 439020 439955 439990 439699 439419 439203 439023 438904 438836 438597 437849 436534
53585 436534 435108 434137 433656 433106 431945 430134 427967 425669 423329 421078 419077 417286 415302 412582 408952
53570 408952 404958 401515 399077 397290 395593 393973 392793 392108 391596 391100 390730 390357 389563 388315 387201 386694
53554 386694 386610 386620 386878 387629 388577 389229 389734 390669 392007 392946 393017 392876 393696 396097 399954 404851 410306 415789
53536 415789 421061 426540 432960 440564 448895 457411 466050 475133 485033 496088 508511 522080 536100
53523 536100 550027 564056 578844 594758 611768 629973 649739 671131 693637 716757 740627
53512 740627 765718 792048 819042 846139 873249 900563 928143 955838 983406 1010586 1037086
$$ packed form
53616C54896L650M577M973N378O131O595O142N213M603M228L480K494K129K722
53602D17211L642M195M289M058L394K231R35L5k91k80k16j80j19o8k39p48j315
53585D36534j426r71m81n50j161j811k167k298k340k251k001j791j984k720l630
53570D08952l994l443k438j787j697j620j180o85n12m96l70l73p94j248j114n07
53554C86694q4J0K58P51R48O52N05R35J338R39P1j41Q20K401L857M897N455N483
53536D15789N272N479O420P604Q331Q516Q639R083R900J1055J2423J3569J4020
53523E36100J3927J4029J4788J5914J7010J8205J9766K1392K2506K3120K3870
53512G40627K5091K6330K6994K7097K7110K7314K7580K7695K7568K7180K6500
$$ plain form
53501 1037086 1062705 1087595 1112353 1137704 1163922 1190695 1217674 1245093 1273653 1303892 1335981
53490 1335981 1370132 1406863 1446737 1490052 1536903 1587255 1640726 1696310 1752111 1804857 1849693
53479 1849693 1881358 1896645 1896120 1883532 1863717 1840875 1817922 1796450 1777027 1759695 1744257 1730099
53467 1730099 1716164 1701426 1685284 1667496 1648151 1627961 1608040 1588886 1569935 1550517 1530732
53456 1530732 1510759 1489795 1466642 1441218 1414711 1388287 1362374 1337135 1312744 1288987 1265381
53445 1265381 1241914 1219102 1197153 1175825 1155387 1137021 1121723 1109259 1098557 1088748 1079581 1071229
53433 1071229 1064102 1058536 1054415 1051390 1049575 1049621 1051915 1056177 1062034 1069481 1078550 1089099 1101294 1115754
53419 1115754 1132750 1151723 1172023 1193705 1217025 1241589 1266651 1292110 1318654 1347006 1377464
$$ packed form
53501A037086K5619K4890K4758K5351K6218K6773K6979K7419K8560L0239L2089
53490A335981L4151L6731L9874M3315M6851N0352N3471N5584N5801N2746M4836
53479A849693L1665J5287n25j2588j9815k2842k2953k1472j9423j7332j5438j4158
53467A730099j3935j4738j6142j7788j9345k0190j9921j9154j8951j9418j9785
53456A530732j9973k0964k3153k5424k6507k6424k5913k5239k4391k3757k3606
53445A265381k3467k2812k1949k1328k0438j8366j5298j2464j0702r809r167q352
53433A071229p127n566m121l025j815M6K294M262N857P447R069J0549J2195J4460
53419A115754J6996J8973K0300K1682K3320K4564K5062K5459K6544K8352L0458
$$ plain form
53408 1377464 1410091 1444926 1481985 1521332 1563112 1607310 1653619 1701733 1751614 1803358 1857091
53397 1857091 1913159 1971988 2033443 2096627 2160687 2225527 2291440 2358344 2425775 2493236 2560163
53386 2560163 2625846 2689860 2752283 2813055 2871429 2926486 2977788 3024951 3066999 3102977 3133046
53375 3133046 3158228 3179162 3195793 3208116 3216338 3220224 3219144 3212964 3202150 3186681 3165609 3138039
53363 3138039 3103958 3063741 3017545 2965733 2909358 2849544 2786690 2720905 2653055 2584840 2517876
53352 2517876 2453096 2390882 2331278 2274009 2218657 2164966 2112749 2061578 2010866 1960380 1910461
53341 1910461 1861668 1814338 1768554 1724481 1682712 1644223 1609844 1579645 1552951 1529086 1507948
53330 1507948 1489778 1474648 1462444 1452999 1445714 1439181 1431725 1422493 1411492 1398537 1382862 1364211
$$ packed form
53408A377464L2627L4835L7059L9347M1780M4198M6309M8114M9881N1744N3733
53397A857091N6068N8829O1455O3184O4060O4840O5913O6904O7431O7461O6927
53386B560163O5683O4014O2423O0772N8374N5057N1302M7163M2048L5978L0069
53375C133046K5182K0934J6631J2323Q222L886j080o180j0814j5469k1072k7570
53363C138039l4081m0217m6196n1812n6375n9814o2854o5785o7850o8215o6964
53352B517876o4780o2214n9604n7269n5352n3691n2217n1171n0712n0486m9919
53341A910461m8793m7330m5784m4073m1769l8489l4379l0199k6694k3865k1138
53330A507948j8170j5130j2204r445p285o533p456r232j1001j2955j5675j8651
$$ plain form
53318 1364211 1343744 1323226 1303639 1285186 1268263 1253473 1240706 1229267 1219330 1212338 1209290 1209262
53306 1209262 1210473 1212412 1216031 1222104 1230388 1240558 1253009 1268279 1286231 1306260 1327990 1351428
53294 1351428 1376753 1404230 1434057 1465939 1499033 1532583 1566369 1600227 1633344 1664518 1693062
53283 1693062 1719161 1743233 1765152 1784197 1799675 1811436 1819802 1825148 1827787 1828200 1826891 1823700 1817613
53270 1817613 1807807 1794704 1779491 1762774 1744398 1724468 1703562 1681638 1657669 1630916 1601826
53259 1601826 1571069 1538411 1503479 1467099 1430832 1395232 1359437 1322609 1285025 1247584 1210895
53248 1210895 1175161 1140531 1107239 1075499 1045382 1016628 988667 961044 933749 906929 880531
53237 880531 854635 829918 807178 786356 766595 747335 728866 711734 696118 681994 669373
$$ packed form
53318A364211k0467k0518j9587j8453j6923j4790j2767j1439r937o992l048k8
53306A209262J211J939L619O073Q284J0170J2451J5270J7952K0029K1730K3438
53294A351428K5325K7477K9827L1882L3094L3550L3786L3858L3117L1174K8544
53283A693062K6099K4072K1919J9045J5478J1761Q366N346K639M13j309l191o087
53270A817613r806j3103j5213j6717j8376j9930k0906k1924k3969k6753k9090
53259A601826l0757l2658l4932l6380l6267l5600l5795l6828l7584l7441l6689
53248A210895l5734l4630l3292l1740l0117k8754k7961k7623k7295k6820k6398
53237H80531k5896k4717k2740k0822j9761j9260j8469j7132j5616j4124j2621
$$ plain form
53226 669373 658021 647272 636493 625539 614543 603442 591934 579681 566433 552192 537516
53215 537516 523451 510819 499632 489317 479406 469870 460929 452771 445346 438250 430957 423335 415861
53202 415861 409000 402471 395457 387738 380305 374497 370534 367178 362946 357508 351766 346783 342882 339675
53188 339675 336594 333252 329561 325761 322290 319476 317287 315316 312993 309979 306580 303657 301789 300558
53174 300558 299024 296974 295258 294756 295492 297000 299070 301654 304428 307068 309918 313890 319678 327221 335722
53159 335722 343836 350047 353473 354374 353585 351504 347969 343027 337279 331346 325383 319336 313376 307882 303078
53144 303078 298834 294827 290918 287376 284606 282630 281092 279910 279513 280171 281401 282428 282958 282970 282104 279979
53128 279979 277121 274892 274240 274944 276182 277397 278428 279254 279918 280486 280951 281313 281731 282318 282813 282845 282478
$$ packed form
53226F69373j1352j0749j0779j0954j0996j1101j1508j2253j3248j4241j4676
53215E37516j4065j2632j1187j0315r911r536q941q158p425p096p293p622p474
53202D15861o861o529p014p719p433n808l963l356m232n438n742m983l901l207
53188C39675l081l342l691l800l471k814k189j971k323l014l399k923j868j231
53174C00558j534k050j716n02P36J508K070K584K774K640K850L972N788P543Q501
53159C35722Q114O211L426R01p89k081l535m942n748n933n963o047n960n494m804
53144C03078m244m007l909l542k770j976j538j182l97O58J230J027N30J2q66k125
53128B79979k858k229o52P04J238J215J031Q26O64N68M65L62M18N87M95L2l67
$$ plain form
53111 282478 282108 281829 281406 280912 280836 281336 281913 282125 282177 282455 282824 282869 282665 282906 284261 286736 289621 291998
53093 291998 293463 294400 295443 296726 297955 299083 300414 301910 302947 303062 302544 301918 301262 300409 299550 299101
53077 299101 299067 298979 298448 297440 296038 294242 292132 290010 288250 286987 285886 284251 281631 278465 275879
53062 275879 274595 274136 273452 272184 270965 270450 270464 270329 269789 269236 269039 268968 268507 267613 266899 267009 268007 269461
53044 269461 270916 272084 272686 272404 271111 269029 266680 264633 263183 262185 261346 260736 260778 261594 262663 263426
53028 263426 263923 264439 264787 264501 263678 262990 262780 262675 262307 261918 261966 262510 263335 264380 265686 267054 268088 268572
53010 268572 268604 268428 268274 268352 268882 270004 271588 273146 274171 274685 275242 276175 277060 277292 276991 276916 277581 278920
52992 278920 280759 283035 285445 287363 288335 288341 287538 286208 285039 284877 285856 287156 287881 287877 287533 287185 287034 287188
$$ packed form
53111B82478l70k79m23m94p6N00N77K12N2K78L69M5k04K41J355K475K885K377
53093B91998J465R37J043J283J229J128J331J496J037J15n18o26o56q53q59m49
53077B99101l4q8n31j008j402j796k110k122j760j263j101j635k620l166k586
53062B75879j284m59o84j268j219n15J4j35n40n53j97p1m61q94p14J10R98J454
53044B69461J455J168O02k82j293k082k349k047j450r98q39o10M2Q16J069P63
53028B63426M97N16L48k86q23o88k10j05l68l89M8N44Q25J045J306J368J034M84
53010B68572L2j76j54P8N30J122J584J558J025N14N57R33Q85K32l01p5O65J339
52992B78920J839K276K410J918R72Oq03j330j169j62R79J300P25ml44l48j51J54
$$ plain form
52974 287188 287428 287197 286235 285011 284237 284113 284296 284415 284307 283964 283550 283388 283723 284512 285526 286481 287057 287084
52956 287084 286833 286830 287219 287540 287288 286415 285162 283740 282411 281536 281238 281236 281215 281102 280837 280195 279143 278029 277125
52937 277125 276162 274615 272319 269641 267249 265720 265079 264644 263714 262488 261840 262066 262496 262520 262302 262130 261878
52920 261878 261667 262259 263953 265711 266310 265875 265318 264721 263550 262263 262212 263674 265232 265671 265464 265679 266308
52903 266308 266579 266325 266020 265724 264935 263552 262174 261281 260680 260108 259917 260709 262506 264618 266287 267199 267422
52886 267422 267185 266853 266848 267328 267991 268368 268232 267620 266609 265326 264058 263056 262228 261330 260409 259711 259120 258171
52868 258171 256766 255467 254851 254843 254918 254684 254056 253219 252640 252792 253539 254081 253837 253141 252709 252738 252956 253301 253971
52849 253971 254864 255442 255273 254419 253285 252347 252004 252444 253588 255262 257281 259268 260694 261393 261820 262446 263079
$$ packed form
52974B87188K40k31r62j224p74j24J83J19j08l43m14j62L35P89J014R55N76K7
52956B87084k51lL89L21k52q73j253j422j329q75k98kk1j13k65o42j052j114r04
52937B77125r63j547k296k678k392j529o41m35r30j226o48K26M30K4k18j72k52
52920B61878k11N92J694J758N99m35n57n97j171j287n1J462J558M39k07K15O29
52903B66308K71k54l05k96p89j383j378q93o01n72j91P92J797K112J669R12K23
52886B67422k37l32nM80O63L77j36o12j011j283j268j002q28q98r21o98n91r49
52868B58171j405j299o16qP5k34o28q37n79J52P47N42k44o96m32K9K18L45O70
52849B53971Q93N78j69q54j134r38l43M40J144J674K019J987J426O99M27O26O33
$$ plain form
52832 263079 263100 262228 260685 258749 256612 254627 253242 252566 252258 251882 251209 250234 249107 248027 247047 246084 245240
52815 245240 244847 245005 245404 245862 246698 248198 250089 252076 254557 258115 262494 266822 270798 274860 279013
52800 279013 282221 283362 282273 279509 275512 270474 264774 259115 254191 250345 247469 245137 242899 240562
52786 240562 238199 236068 234545 233921 233947 233786 232805 231300 230123 229656 229553 229384 229112 228914 228917 229209 229822 230696
52768 230696 231873 233514 235408 236692 236635 235573 234569 234243 234492 235184 236266 237192 237186 236396 235970 236567 237479
52751 237479 237721 237306 236883 236744 236879 237483 238593 239550 239659 239208 239094 239543 239959 240032 240162 240637 241104 241204 241095
52732 241095 241022 240878 240660 240888 242000 243605 244905 245742 246646 247895 249048 249528 249199 248270 247085 246114 245657
52715 245657 245258 243943 241450 238795 237107 236367 235954 235967 237022 238826 240115 240249 239919 239853 239782 239337 239122
$$ packed form
52832B63079K1q72j543j936k137j985j385o76l08l76o73r75j127j080r80r63q44
52815B45240l93J58L99M58Q36J500J891J987K481L558M379M328L976M062M153
52800B79013L208J141j089k764l997n038n700n659m924l846k876k332k238k337
52786B40562k363k131j523o24K6j61r81j505j177m67j03j69k72j98LK92O13Q74
52768B30696J177J641J894J284n7j062j004l26K49O92J082R26op90m26N97R12
52751B37479K42m15m23j39J35O04J110R57J09m51j14M49M16P3J30M75M67J00j09
52732B41095p3j44k18K28J112J605J300Q37R04J249J153M80l29r29j185r71m57
52715B45657l99j315k493k655j688p40m13J3J055J804J289J34l30o6p1m45k15
$$ plain form
52698 239122 239995 241767 243491 244671 245337 245259 244073 242145 240445 239462 238953 238751 239055 239820 240609 241290 242223
52681 242223 243516 244687 245346 245673 245987 246356 246955 248246 250385 252829 254954 256756 258569 260407 261954
52666 261954 263055 263861 264602 265451 266488 267581 268426 268876 269151 269614 270492 271859 273662 275663 277553 279220
52650 279220 280748 282101 283088 283694 284143 284456 284211 282988 280922 278637 276711 275338 274480 274186 274652 275917
52634 275917 277636 279414 281356 283917 287074 290212 293134 296614 301352 306865 312221 317419 323001 328442
52620 328442 332065 332787 330966 327354 322274 316312 310736 306342 302570 298569 294660 291939 290738 290232 289421
52605 289421 287963 286159 284588 283638 283054 282229 281189 280858 281863 283507 284594 284973 285539 286840 288439 289714
52589 289714 290639 291517 292416 293150 293603 293884 294212 294678 295020 294805 293994 293152 292876 293193 293816 294758 296201 297847
$$ packed form
52698B39122Q73J772J724J180O66p8j186j928j700r83n09k02L04P65P89O81R33
52681B42223J293J171O59L27L14L69N99J291K139K444K125J802J813J838J547
52666B61954J101Q06P41Q49J037J093Q45M50K75M63Q78J367J803K001J890J667
52650B79220J528J353R87O06M49L13k45j223k066k285j926j373q58k94M66J265
52634B75917J719J778J942K561L157L138K922L480M738N513N356N198N582N441
52620C28442L623P22j821l612n080n962n576m394l772m001l909k721j201n06q11
52605B89421j458j804j571r50n84q25j040l31J005J644J087L79N66J301J599J275
52589B89714R25Q78Q99P34M53K81L28M66L42k15q11q42k76L17O23R42J443J646
$$ plain form
52571 297847 298918 299047 298838 299241 300438 301602 301877 301427 301239 301792 302287 301621 299886 298321 297783 297903 297976
52554 297976 297977 298284 298903 299509 299921 300077 299861 299419 299359 300152 301566 303123 304748 306389 307355 306867 305273 303945
52536 303945 303845 304721 305855 306942 308030 309117 310206 311398 312639 313583 313977 313932 313620 312925 311634 309834
52520 309834 307866 306037 304561 303721 303752 304577 305831 307168 308430 309531 310451 311544 313591 317124 321620
52505 321620 325736 328579 330504 332378 334376 335900 336439 335976 334552 332114 328994 325950 323373 320790 317568
52490 317568 313885 310679 308754 308169 308307 308343 307801 306859 306043 305580 305263 304933 304753 304869 305252 306034 307554 309788
52472 309788 312093 313912 315394 316976 318714 320454 322300 324434 326619 328396 329684 330795 331985 333360
52458 333360 335093 337291 339653 341581 342626 342621 341507 339316 336268 332678 328806 324944 321443 318467 315916
$$ packed form
52571B97847J071J29k09M03J197J164K75m50j88N53M95o66j735j565n38J20P3
52554B97976JL07O19O06M12J56k16m42o0P93J414J557J625J641R66m88j594j328
52536C03945j00Q76J134J087J088J087J089J192J241R44L94m5l12o95j291j800
52520C09834j968j829j476q40L1Q25J254J337J262J101R20J093K047L533M496
52505C21620M116K843J925J874J998J524N39m63j424k438l120l044k577k583l222
52490C17568l683l206j925n85J38L6n42r42q16m63l17l30j80J16L83P82J520K234
52472C09788K305J819J482J582J738J740J846K134K185J777J288J111J190J375
52458C33360J733K198K362J928J045nj114k191l048l590l872l862l501k976k551
$$ plain form
52443 315916 313760 312202 311277 310610 309791 308749 307548 306229 305132 304897 305656 306601 306889 306749 307165 308717
52427 308717 311145 313776 315845 316717 316463 316036 316246 316662 316216 314787 313514 313443 314433 315530 315954 315658 315367
52410 315367 316124 318471 322058 326362 331541 338180 346434 356055 367049 379437 392292 403688 411836
52397 411836 415793 415183 410066 401421 391059 380581 370740 361913 354603 349151 345407 343093 342116 342211 342602
52382 342602 342478 341671 340617 339752 339145 338611 338119 338098 339281 342042 346005 350532 355434 360805 366431 371929
52366 371929 377368 383063 388723 393477 396919 399444 401317 402098 401372 399464 396996 394275 391647 389886 389512
52351 389512 389961 390171 389875 389766 390438 391736 393292 395180 397704 400903 404558 408603 413208 418456 424181
52336 424181 430281 437015 444760 453551 463122 473401 484617 496833 509784 523422 538165 554251
$$ packed form
52443C15916k156j558r25o67q19j042j201j319j097k35P59R45K88j40M16J552
52427C08717K428K631K069Q72k54m27K10M16m46j429j273p1R90J097M24k96k91
52410C15367P57K347L587M304N179O639Q254R621J0994J2388J2855J1396Q148
52397D11836L957o10n117q645j0362j0478r841q827p310n452l744k314r77R5L91
52382C42602j24q07j054q65o07n34m92k1J183K761L963M527M902N371N626N498
52366C71929N439N695N660M754L442K525J873P81p26j908k468k721k628j761l74
52351C89512M49K10k96j09O72J298J556J888K524L199L655M045M605N248N725
52336D24181O100O734P745Q791R571J0279J1216J2216J2951J3638J4743J6086
$$ plain form
52324 554251 571211 588555 606621 626088 646734 667430 687392 706774 725933 744784 763162
52313 763162 781188 798890 815884 831855 847085 862158 877383 892758 908167 923262 937288
52302 937288 949406 959354 967744 975729 984249 993385 1002400 1010427 1016961 1021550 1023517 1022522 1019187 1014554
52288 1014554 1008961 1002055 993812 984835 975572 966025 956500 947893 940852 935192 930519 926933 924790 924234
52274 924234 925326 928195 932675 938244 944730 952653 962456 973770 985879 998528 1011793 1025485 1039220
52261 1039220 1052870 1066529 1080220 1094020 1108189 1122717 1136920 1150028 1162049 1173611 1185038
52250 1185038 1195973 1205773 1213825 1219526 1222518 1223139 1222308 1220713 1218233 1214241 1208365 1200916 1192696 1184476
52236 1184476 1176587 1168941 1161305 1153516 1145554 1137682 1130458 1124365 1119372 1115048 1111086 1107523 1104511 1102242
$$ packed form
52324E54251J6960J7344J8066J9467K0646K0696J9962J9382J9159J8851J8378
52313G63162J8026J7702J6994J5971J5230J5073J5225J5375J5409J5095J4026
52302I37288J2118R948Q390P985Q520R136R015Q027O534M589J967r95l335m633
52288A014554n593o906q243q977r263r547r525q607p041n660m673l586k143n56
52274I24234J092K869M480N569O486P923R803J1314J2109J2649J3265J3692J3735
52261A039220J3650J3659J3691J3800J4169J4528J4203J3108J2021J1562J1427
52250A185038J0935R800Q052N701K992O21q31j595k480l992n876p449q220q220
52236A184476p889p646p636p789p962p872p224o093m993m324l962l563l012k269
$$ plain form
52222 1102242 1101054 1101182 1102308 1103758 1105305 1107437 1110737 1115334 1120977 1127210 1133377 1138973 1144227 1149943
52208 1149943 1156579 1163867 1171534 1179766 1188656 1197670 1206101 1213731 1220738 1227277 1233455 1239367 1244883 1249768
52194 1249768 1254231 1258876 1263757 1268016 1270870 1272467 1273382 1273817 1273834 1273799 1273828 1273189 1271050 1267573 1263486 1258731
52178 1258731 1252365 1243829 1233649 1222763 1211777 1201024 1190853 1181605 1173570 1167069 1162344 1159299 1157555
52165 1157555 1156768 1156779 1157640 1159670 1163288 1168535 1174962 1182214 1190353 1199288 1208212 1216101 1222506 1227413 1230713
52150 1230713 1232387 1233006 1233326 1233472 1233124 1232444 1232120 1232461 1233070 1233570 1234054 1234550 1234507 1233110 1229915 1225074 1219231
52133 1219231 1213320 1208217 1204473 1202420 1202407 1204693 1209228 1215895 1224877 1236513 1250915 1268068 1288217
52120 1288217 1311734 1338595 1368241 1399855 1432550 1465454 1497976 1529815 1560405 1588721 1614178
$$ packed form
52222A102242j188J28J126J450J547K132L300M597N643O233O167N596N254N716
52208A149943O636P288P667Q232Q890R014Q431P630P007O539O178N912N516M885
52194A249768M463M645M881M259K854J597R15M35J7l5K9o39k139l477m087m755
52178A258731o366q536j0180j0886j0986j0753j0171r248q035o501m725l045j744
52165A157555p87J1Q61K030L618N247O427P252Q139Q935Q924P889O405M907L300
52150A230713J674O19L20J46l48o80l24L41O09N00M84M96m3j397l195m841n843
52133A219231n911n103l744k053j3K286M535O667Q982J1636J4402J7153K0149
52120A288217K3517K6861K9646L1614L2695L2904L2522L1839L0590K8316K5457
$$ plain form
52109 1614178 1637475 1659845 1681511 1701504 1718926 1733689 1745955 1755673 1763018 1768721 1773592 1778016
52097 1778016 1782140 1786099 1789816 1792934 1795165 1796400 1796400 1794790 1791589 1787304 1782130 1775449 1766505 1755419
52083 1755419 1743197 1730944 1719467 1709606 1702500 1699229 1700143 1704644 1711675 1720435 1730611 1742066 1754590
52070 1754590 1768037 1782394 1797582 1813381 1829755 1846858 1864415 1881451 1897064 1911224 1924339
52059 1924339 1936338 1946738 1955468 1962944 1969322 1974234 1977304 1978476 1977809 1975461 1971849 1967277 1961321 1953076
52045 1953076 1942096 1928665 1913183 1895884 1877217 1857842 1838101 1818050 1798193 1779555 1762799
52034 1762799 1747843 1734621 1723576 1714974 1708215 1702244 1696244 1689622 1681847 1672830 1663159 1653459 1643709
52021 1643709 1633462 1622461 1610689 1598134 1584891 1571269 1557472 1543419 1529157 1515147 1501824
$$ packed form
52109A614178K3297K2370K1666J9993J7422J4763J2266R718P345N703M871M424
52097A778016M124L959L717L118K231J235%j610l201m285n174o681q944j1086
52083A755419j2222j2253j1477r861p106l271R14M501P031Q760J0176J1455J2524
52070A754590J3447J4357J5188J5799J6374J7103J7557J7036J5613J4160J3115
52059A924339J1999J0400Q730P476O378M912L070J172o67k348l612m572n956q245
52045A953076j0980j3431j5482j7299j8667j9375j9741k0051j9857j8638j6756
52034A762799j4956j3222j1045q602o759n971o000o622p775r017r671r700r750
52021A643709j0247j1001j1772j2555j3243j3622j3797j4053j4262j4010j3323
$$ plain form
52010 1501824 1489108 1476673 1464393 1452128 1439382 1425639 1410870 1395367 1379312 1362896 1346529
51999 1346529 1330285 1313235 1293963 1271895 1247793 1222935 1198314 1174732 1153155 1134477 1118921
51988 1118921 1105871 1094221 1082899 1071249 1059187 1047150 1035781 1025548 1016441 1008034 999875 991772
51976 991772 983573 974780 964622 952594 938787 923739 908223 893191 879534 867653 857449 848846
51964 848846 842114 837562 835210 834929 836646 840099 844590 849270 853649 857633 861169 863935 865216 863941
51950 863941 859063 850226 838031 823628 808185 792797 778514 766031 755443 746580 739553 734778
51938 734778 732573 732923 735508 739674 744446 748857 752301 754434 754823 753020 748980 743113 735782 726901 716156
51923 716156 703479 689181 673745 657695 641653 626354 612439 600208 589584 580269 571946 564470
$$ packed form
52010A501824j2716j2435j2280j2265j2746j3743j4769j5503j6055j6416j6367
51999A346529j6244j7050j9272k2068k4102k4858k4621k3582k1577j8678j5556
51988A118921j3050j1650j1322j1650j2062j2037j1369j0233r107q407q159q103
51976I91772q199q793j0158j2028j3807j5048j5516j5032j3657j1881j0204q603
51964H48846o732m552k352k81J717L453M491M680M379L984L536K766J281j275
51950H63941m878q837j2195j4403j5443j5388j4283j2483j0588q863p027m775
51938G34778k205L50K585M166M772M411L444K133L89j803m040n867p331q881j0745
51923G16156j2677j4298j5436j6050j6042j5299j3915j2231j0624r315q323p476
$$ plain form
51911 564470 557995 552781 548650 544700 539988 534676 530234 528230 529094 532248 537163 543908 552835 564143
51897 564143 577713 592998 609027 624761 639410 652148 661640 666301 665091 657962 645684 629665
51885 629665 611809 594022 577612 563289 551548 542656 536406 532425 530751 531738 535419 541474 549759
51872 549759 560383 573221 587912 604236 621772 639143 654363 666198 674594 679578 680502 676677
51860 676677 668093 655198 638775 620466 602650 587129 574417 564679 558562 556363 557136 559518 563010
51847 563010 567642 572792 577290 580453 582253 582704 581865 580200 578083 575137 570843 565568 560074 554245 547412
51832 547412 540018 533800 529960 528130 527479 527888 529463 531672 533759 535537 537108 538100 537780 535700 531830
51817 531830 526275 519423 512260 506102 501882 499792 499439 500196 501651 503993 507820 513276 519454 524846 528295
$$ packed form
51911E64470o475n214m131l950m712n312m442k004Q64L154M915O745Q927J1308
51897E64143J3570J5285J6029J5734J4649J2738R492M661j210p129j2278j6019
51885F29665j7856j7787j6410j4323j1741q892o250l981j674R87L681O055Q285
51872E49759J0624J2838J4691J6324J7536J7371J5220J1835Q396M984R24l825
51860F76677q584j2895j6423j8309j7816j5521j2712r738o117k199P73K382L492
51847E63010M632N150M498L163J800M51q39j665k117k946m294n275n494n829o833
51832E47412p394o218l840j830o51M09J575K209K087J778J571R92l20k080l870
51817E31830n555o852p163o158m220k090l53P57J455K342L827N456O178N392L449
$$ plain form
51802 528295 529370 528073 524531 519047 512168 504601 497050 490111 484229 479699 476655 474944 474087 473551 473137
51787 473137 473029 473460 474517 476357 479382 483991 490143 497282 504689 511932 518960 525766 531987 536964 540246
51772 540246 541858 541942 540346 536898 532053 526928 522617 519648 518205 518589 521237 526305 533317 541237 548894
51757 548894 555375 560008 562055 560684 555476 546856 535845 523448 510381 497238 484591 472948 462802
51744 462802 454648 448682 444577 441898 440744 441639 444710 449327 454762 460968 468493 477774 488696 500664
51730 500664 512817 524079 533236 539287 542039 542370 541648 540553 538546 534661 528748 521753 514842 508519
51716 508519 502562 496527 490298 484373 479714 477040 476225 476523 477367 478720 480786 483884 488746 496443 507608
51701 507608 521985 538969 558121 578449 597347 611176 617617 617458 613854 610055 607994 608586 612450
$$ packed form
51802E28295J075j297l542n484o879p567p551o939n882m530l044j711q57n36m14
51787D73137j08M31J057J840L025M609O152P139P407P243P028O806O221M977L282
51772E40246J612Q4j596l448m845n125m311k969j443L84K648N068P012P920P657
51757E48894O481M633K047j371n208q620j1011j2397j3067j3143j2647j1643j0146
51744D62802q154n966m105k679j154Q95L071M617N435O206P525R281J0922J1968
51730E00664J2153J1262R157O051K752L31p22j095k007l885n913o995o911o323
51716E08519n957o035o229n925m659k674q15K98Q44J353K066L098M862P697J1165
51701E07608J4377J6984J9152K0328J8898J3829O441j59l604l799k061N92L864
$$ plain form
51688 612450 619795 629795 640433 649044 653115 651144 643340 631475 617633 602962 587855 573064
51676 573064 559975 549677 542306 537583 535408 535539 537213 539667 542716 546242 549423 551173 551247 550278 548799
51661 548799 546902 544991 544104 545027 547458 550433 553426 556887 561955 569775 580795 594421 609439 624884
51647 624884 640408 655751 670044 681634 688404 688416 680783 666307 647146 625692 603666 582038
51635 582038 561320 541789 523780 507964 495070 485188 477542 471142 465503 460679 456872 454176 452424
51622 452424 451105 449665 448040 446683 445883 445355 444665 443801 443019 442368 441717 441072 440480 439742 438632 437395 436678
51605 436678 436871 437810 439211 441083 443579 446734 450587 455405 461476 468729 476848 485765 495848 507536
51591 507536 520929 535758 551383 566531 579305 587976 591944 591800 588637 583714 578693 575436 575102
$$ packed form
51688F12450P345J0000J0638Q611M071j971p804j1865j3842j4671j5107j4791
51676E73064j3089j0298p371m723k175J31J674K454L049L526L181J750P4r69j479
51661E48799j897j911q87R23K431K975K993L461N068P820J1020J3626J5018J5445
51647F24884J5524J5343J4293J1590O770J2p633j4476j9161k1454k2026k1628
51635E82038k0718j9531j8009j5816j2894r882p646o400n639m824l807k696j752
51622D52424j319j440j625j357q00n28o90q64p82o51o51o45n92p38j110j237p17
51605D36678J93R39J401J872K496L155L853M818O071P253Q119Q917J0083J1688
51591E07536J3393J4829J5625J5148J2774Q671L968j44l163m923n021l257l34
$$ plain form
51578 575102 577797 583548 593322 608591 630064 657324 689560 726114 766203 808582 851724 894378
51566 894378 936244 978367 1022354 1068344 1113657 1154367 1188825 1219653 1252309 1292189 1342896
51555 1342896 1406030 1481295 1566394 1656942 1746460 1826721 1889154 1927252 1938474 1924163 1887837
51544 1887837 1833394 1764231 1683307 1593677 1498808 1402105 1306131 1212666 1123672 1041718 968953
51533 968953 905905 851696 805280 766036 733293 705902 682566 662368 644812 629530 616156
51522 616156 604455 594478 586463 580493 576180 572771 569611 566440 563271 560187 557298 554699 552263 549613
51508 549613 546370 542310 537244 531022 523833 516224 508534 500461 491505 481784 472132 463398 455869 449349
51494 449349 443600 438683 435002 432973 432564 433224 434407 436080 438531 441808 445589 449556 453543 457247 460050
$$ packed form
51578E75102K695N751R774J5269K1473K7260L2236L6554M0089M2379M3142M2654
51566H94378M1866M2123M3987M5990M5313M0710L4458L0828L2656L9880N0707
51555A342896O3134P5265Q5099R0548Q9518Q0261O2433L8098J1222j4311l6326
51544A887837n4443o9163q0924q9630r4869r6703r5974r3465q8994q1954p2765
51533I68953o3048n4209m6416l9244l2743k7391k3336k0198j7556j5282j3374
51522F16156j1701r977q015n970m313l409l160l171l169l084k889k599k436k650
51508E49613l243m060n066o222p189p609p690q073q956r721r652q734p529o520
51494D49349n749m917l681k029m09O60J183J673K451L277L781L967L987L704K803
$$ plain form
51479 460050 461367 461106 459606 457156 453771 449546 445067 441171 438174 435515 432410 428797 425387 422774
51465 422774 420720 418488 415717 412913 411071 410769 411526 412149 411916 411285 411259 412225 413854 416023 419184 423615
51449 423615 428873 434429 440520 448017 457733 470263 486224 506173 530269 558303 590009 624902
51437 624902 661529 696862 726603 746762 755810 755742 750790 744829 739951 736826 734928 731812 723455 707002
51423 707002 683373 656525 630311 606745 586767 571113 559878 552190 546990 543726 541936 540862
51411 540862 540037 539751 540402 541725 543183 544758 546801 549407 552490 556191 560466 564402 566741 567313 567380 568307
51395 568307 570369 573122 576400 580452 585442 591427 598827 608395 620582 635327 652710 673581 699282
51382 699282 730943 769261 814820 868311 930471 1002065 1083842 1176122 1278242 1388508 1504551
$$ packed form
51479D60050J317k61j500k450l385m225m479l896k997k659l105l613l410k613
51465D22774k054k232k771k804j842l02P57O23k33o31k6R66J629K169L161M431
51449D23615N258N556O091P497R716J2530J5961J9949K4096K8034L1706L4893
51437F24902L6627L5333K9741K0159R048o8m952n961m878l125j898l116q357j6453
51423G07002k3629k6848k6214k3566j9978j5654j1235p688n200l264j790j074
51411E40862q25k86O51J323J458J575K043K606L083L701M275L936K339N72O7R27
51395E68307K062K753L278M052M990N985P400R568J2187J4745J7383K0871K5701
51382F99282L1661L8318M5559N3491O2160P1594Q1777R2280J02120J10266J16043
$$ plain form
51371 1504551 1623136 1739316 1846366 1937429 2007702 2055148 2079475 2080946 2060073 2017800 1955499
51360 1955499 1875010 1779129 1672094 1559259 1445921 1336129 1232377 1136159 1048661 970859
51350 970859 903209 845514 797157 757214 724273 696532 672419 651041 631872 614268 597598
51339 597598 581647 566529 552388 539621 529083 521327 515552 510039 503974 498225 493938 490932 488038
51326 488038 484572 480769 477030 473455 470140 467237 464658 462233 460222 459142 458969 459058 459067 459335 459973 460171
51310 460171 459044 456799 454456 452647 451360 450687 450954 451959 452851 453220 453818 455725 459059 462856 465933
51295 465933 467467 467013 464545 460532 455669 450505 445469 441060 437660 435274 433799 433417 434327 436239 438624
51280 438624 441508 445448 450627 456456 462218 467549 471979 474549 474523 472366 469585 467637 467109 467744 468924
$$ packed form
51371A504551J18585J16180J07050R1063P0273M7446K4327J471k0873m2273o2301
51360A955499q0489r5881j07035j12835j13338j09792j03752r6218q7498p7802
51350I70859o7650n7695m8357l9943l2941k7741k4113k1378j9169j7604j6670
51339E97598j5951j5118j4141j2767j0538p756n775n513o065n749m287l006k894
51326D88038l466l803l739l575l315k903k579k425k011j080j73Q9RK68O38J98
51310D60171j127k245k343j809j287o73K67J005Q92L69N98J907L334L797L077
51295D65933J534m54k468m013m863n164n036m409l400k386j475l82R10J912K385
51280D38624K884L940N179N829N762N331M430K570k6k157k781j948n28O35J180
$$ plain form
51265 468924 470255 471958 474605 478254 482002 484628 485604 485279 484255 482811 480728 477370 472131 465147 457514
51250 457514 450504 444694 440099 436839 435164 434918 435505 436434 437488 438446 439161 439961 441369 443192 444357 443985
51234 443985 442291 440239 438680 438095 438716 440447 442882 445774 449411 454225 460207 466925 473887 480571 486337
51219 486337 490756 493894 495826 496066 493961 489716 484447 479079 473599 467682 461617 456221 452035 448965
51205 448965 446656 444912 443788 443509 444312 446165 448614 451069 453265 455261 457032 458305 458907 459061 459141 459252
51189 459252 459272 459302 459846 461425 464128 467652 471736 476383 481633 487313 493161 499069 504929 510214 514085
51174 514085 516192 517092 517476 517054 514739 510106 504202 498622 494112 490512 487729 486132 485951 486785 487908
51159 487908 488723 488801 487776 485459 481877 477084 471144 464414 457614 451438 446207 441873 438125 434435 430408
$$ packed form
51265D68924J331J703K647L649L748K626R76l25j024j444k083l358n239o984p633
51250D57514p010n810m595l260j675k46N87R29J054R58P15Q00J408J823J165l72
51234D43985j694k052j559n85O21J731K435K892L637M814N982O718O962O684N766
51219D86337M419L138J932K40k105m245n269n368n480n917o065n396m186l070
51205D48965k309j744j124k79Q03J853K449K455K196J996J771J273O02J54Q0J11
51189D59252K0L0N44J579K703L524M084M647N250N680N848N908N860N285L871
51174E14085K107R00L84m22k315m633n904n580m510l600k783j597j81Q34J123
51159D87908Q15P8j025k317l582m793n940o730o800o176n231m334l748l690m027
$$ plain form
51144 430408 426324 423001 420874 419511 418312 417341 417030 417350 417813 418206 418861 420161 422183 424812 427820 430809
51128 430809 433502 436191 439473 443431 447479 451146 454565 457889 460619 461966 461747 460567 459198 458062
51114 458062 457288 456957 457215 458223 459929 461813 463036 463084 462172 460829 459238 457356 455565 454659 454950 455792
51098 455792 456379 456781 457756 459660 462103 464791 468152 472620 477637 481966 485041 487528 490324 493447 496155
51083 496155 497853 498430 497994 496810 495546 495007 495392 496133 496698 497261 498331 500074 502467 505854 510700 516685
51067 516685 522629 527604 531677 535258 538196 540082 541180 542281 543630 544619 544721 544189 543556 542964 542332 541668
51051 541668 540778 539154 536846 535138 535590 538417 542415 546443 550346 554437 558880 563913 570045 577569 586268
51036 586268 595910 606710 619021 632858 647930 663673 678952 692174 702130 708477 711161 709837
$$ packed form
51144D30408m084l323k127j363j199r71l11L20M63L93O55J300K022K629L008K989
51128D30809K693K689L282L958M048L667L419L324K730J347k19j180j369j136
51114D58062p74l31K58J008J706J884J223M8r12j343j591j882j791r06K91Q42
51098D55792N87M02R75J904K443K688L361M468N017M329L075K487K796L123K708
51083D96155J698N77m36j184j264n39L85P41N65N63J070J743K393L387M846N985
51067E16685N944M975M073L581K938J886J098J101J349R89J02n32o33n92o32o64
51051E41668q90j624k308j708M52K827L998M028L903M091M443N033O132P524Q699
51036E86268R642J0800J2311J3837J5072J5743J5279J3222R956O347K684j324
$$ plain form
51024 709837 704349 695498 684755 673214 661020 647685 632818 616892 601586 588997 580207 574878
51012 574878 572306 572238 574275 577368 580795 585190 591690 600344 610264 621105 633377 647290 662248 677577
50998 677577 692812 707042 718982 728140 735258 741132 745683 748646 750564 752500 755041 758031 761014
50985 761014 763604 765772 768184 772091 778600 788210 801138 817727 838292 862805 890855 921645 954016
50972 954016 986957 1020260 1054221 1088661 1122883 1156867 1191755 1228685 1267742 1308597 1351515
50961 1351515 1396937 1444480 1493258 1543044 1594301 1647021 1700178 1752491 1803161 1851638 1897104
50950 1897104 1938534 1975196 2006954 2034097 2056824 2074957 2088420 2098069 2105672 2112854 2120352 2128345
50938 2128345 2136689 2144065 2147337 2142792 2128374 2104576 2073545 2038007 2000804 1964221 1929028 1894387
$$ packed form
51024G09837n488q851j0743j1541j2194j3335j4867j5926j5306j2589q790n329
51012E74878k572o8K037L093L427M395O500Q654R920J0841J2272J3913J4958J5329
50998F77577J5235J4230J1940R158P118N874M551K963J918J936K541K990K983
50985G61014K590K168K412L907O509R610J2928J6589K0565K4513K8050L0790L2371
50972I54016L2941L3303L3961L4440L4222L3984L4888L6930L9057M0855M2918
50961A351515M5422M7543M8778M9786N1257N2720N3157N2313N0670M8477M5466
50950A897104M1430L6662L1758K7143K2727J8133J3463R649P603P182P498P993
50938B128345Q344P376L272m545j4418k3798l1031l5538l7203l6583l5193l4641
$$ plain form
50926 1894387 1859000 1822182 1783803 1743670 1701293 1656133 1607942 1557087 1504633 1451875 1399647
50915 1399647 1348195 1297711 1248753 1202141 1158695 1119079 1083575 1051930 1023647 998468 976320
50904 976320 956831 939304 923312 909004 896663 886231 877415 869965 863641 858172 853428 849466 846232
50891 846232 843402 840710 838276 836435 835380 835126 835670 837028 839216 842264 846095 850377 854751 859307 864475
50876 864475 870311 876290 882151 888543 896299 905327 914835 924598 935278 947377 960531 974228 988638
50863 988638 1004247 1021082 1038995 1058543 1080840 1106402 1134728 1165313 1198702 1236197 1278884
50852 1278884 1327302 1381873 1443208 1511942 1588552 1673353 1766480 1867838 1977179 2094172 2218296
50841 2218296 2348802 2484930 2625953 2770727 2917214 3062550 3203349 3335642 3454962
$$ packed form
50926A894387l5387l6818l8379m0133m2377m5160m8191n0855n2454n2758n2228
50915A399647n1452n0484m8958m6612m3446l9616l5504l1645k8283k5179k2148
50904I76320j9489j7527j5992j4308j2341j0432q816p450o324n469m744l962l234
50891H46232k830k692k434j841j055k54N44J358K188L048L831M282M374M556N168
50876H64475N836N979N861O392P756R028R508R763J0680J2099J3154J3697J4410
50863I88638J5609J6835J7913J9548K2297K5562K8326L0585L3389L7495M2687
50852A278884M8418N4571O1335O8734P6610Q4801R3127J01358J09341J16993J24124
50841B218296J30506J36128J41023J44774J46487J45336J40799J32293J19320
$$ plain form
50832 3454962 3557294 3640251 3703059 3745487 3767418 3769624 3754367 3724832 3684305 3636068 3583588
50821 3583588 3530293 3479345 3433771 3396245 3368091 3348661 3336047 3328093 3322262 3314990 3302195 3280637
50809 3280637 3248425 3204339 3147448 3077557 2995410 2902135 2799010 2688060 2572455 2455791
50799 2455791 2341103 2230760 2126911 2031516 1945909 1870582 1805386 1749817 1703279 1665393 1636143
50788 1636143 1615616 1603632 1599565 1602286 1610048 1620676 1632269 1643867 1655252 1666028 1675073 1681051
50776 1681051 1683349 1682382 1678989 1673636 1666212 1656461 1644442 1630580 1615296 1598559 1579690 1557652 1531721
50763 1531721 1502013 1469371 1434847 1399371 1363757 1328712 1294796 1262622 1233108 1207123 1184735
50752 1184735 1165175 1147866 1133126 1121488 1112610 1105452 1099527 1095475 1094374 1096840 1102856 1112062 1123989
$$ packed form
50832C454962J02332Q2957O2808M2428K1931K206j5257k9535m0527m8237n2480
50821C583588n3295n0948m5574l7526k8154j9430j2614p954n831p272j2795k1558
50809C280637l2212m4086n6891o9891q2147r3275j03125j10950j15605j16664
50799B455791j14688j10343j03849r5395q5607p5327o5196n5569m6538l7886k9250
50788A636143k0527j1984m067K721P762J0628J1593J1598J1385J0776R045N978
50776A681051K298r67l393n353p424r751j2019j3862j5284j6737j8869k2038k5931
50763A531721k9708l2642l4524l5476l5614l5045l3916l2174k9514k5985k2388
50752A184735j9560j7309j4740j1638q878p158n925m052j101K466O016R206J1927
$$ plain form
50739 1123989 1138359 1155405 1175862 1200579 1230209 1265128 1305365 1350588 1400474 1455138 1515013
50728 1515013 1580271 1650529 1724987 1802475 1881469 1960586 2039226 2117368 2194628 2269936 2342122
50717 2342122 2410199 2472654 2527011 2570555 2601251 2617759 2619303 2606405 2581642 2548938 2511940
50706 2511940 2473336 2435444 2400565 2370441 2345813 2326786 2313315 2305090 2301215 2300229 2300304 2299356 2295180
50693 2295180 2285720 2269137 2243744 2208391 2163266 2110138 2051501 1989490 1925665 1861600 1799335
50682 1799335 1741264 1689623 1645896 1610459 1582968 1563405 1552705 1552116 1561980 1581483 1609623 1646050
50670 1646050 1690771 1743303 1802352 1866130 1932568 1999214 2063292 2122264 2174523 2219617 2257904
50659 2257904 2290061 2316883 2339377 2358716 2375842 2391079 2404266 2415247 2424061 2430635 2434570 2435479
$$ packed form
50739A123989J4370J7046K0457K4717K9630L4919M0237M5223M9886N4664N9875
50728A515013O5258P0258P4458P7488P8994P9117P8640P8142P7260P5308P2186
50717B342122O8077O2455N4357M3544L0696J6508J544j2898k4763l2704l6998
50706B511940l8604l7892l4879l0124k4628j9027j3471q225l875r86P5r48m176
50693B295180r460j6583k5393l5353m5125n3128n8637o2011o3825o4065o2265
50682A799335n8071n1641m3727l5437k7491j9563j0700n89R864J9503K8140L6427
50670A646050M4721N2532N9049O3778O6438O6646O4078N8972N2259M5094L8287
50659B257904L2157K6822K2494J9339J7126J5237J3187J0981Q814O574L935R09
$$ plain form
50647 2435479 2433453 2429091 2423271 2417199 2412648 2411778 2416378 2427279 2444481 2467798 2497296 2533212 2575561
50634 2575561 2623852 2677145 2734300 2794187 2855881 2918946 2983548 3049947 3117456 3183622 3243873
50623 3243873 3291209 3316353 3309987 3267304 3191686 3093817 2986651 2880648 2782437 2695845 2622775
50612 2622775 2563518 2517366 2483367 2460424 2447027 2441456 2442237 2447965 2456715 2465967 2473101 2475670 2471306
50599 2471306 2457818 2433480 2397169 2348486 2288275 2218958 2143805 2065673 1986600 1908315 1832452
50588 1832452 1760069 1691518 1627047 1567206 1512456 1462891 1418609 1379933 1346816 1318356 1293378
50577 1293378 1271363 1252446 1236668 1223765 1213651 1206629 1202991 1202712 1205645 1211725 1220767 1232298 1245781
50564 1245781 1260950 1277842 1296666 1317767 1341557 1368275 1397829 1429967 1464541 1501429 1540292
$$ packed form
50647B435479k026m362n820o072m551q70M600J0901J7202K3317K9498L5916M2349
50634B575561M8291N3293N7155N9887O1694O3065O4602O6399O7509O6166O0251
50623C243873M7336K5144o366m2683p5618r7869j07166j06003r8211q6592p3070
50612B622775n9257m6152l3999k2943j3397n571P81N728Q750R252P134K569m364
50599B471306j3488k4338l6311m8683o0211o9317p5153p8132p9073p8285p5863
50588A832452p2383o8551o4471n9841n4750m9565m4282l8676l3117k8460k4978
50577A293378k2015j8917j5778j2903j0114p022l638k79K933O080R042J1531J3483
50564A245781J5169J6892J8824K1101K3790K6718K9554L2138L4574L6888L8863
$$ plain form
50553 1540292 1580718 1622697 1666702 1713041 1761208 1810077 1858677 1906522 1953174 1997791 2039360
50542 2039360 2077303 2111761 2143445 2173401 2202880 2233278 2266070 2302659 2344026 2390435 2441618
50531 2441618 2497377 2557925 2623705 2695223 2773237 2858838 2952995 3056159 3168408 3289545 3418540
50520 3418540 3553044 3689987 3826715 3961167 4091056 4213373 4324692 4421416 4499682 4555886
50510 4555886 4587911 4595534 4579240 4539035 4474958 4388525 4283045 4162495 4030642 3891375 3749383
50499 3749383 3610023 3478581 3359751 3257571 3175375 3115545 3079291 3066773 3077348 3109547
50489 3109547 3160659 3226394 3301065 3377931 3449266 3506427 3540823 3545822 3518329 3458954 3371065
50478 3371065 3259813 3131419 2992345 2848288 2703565 2561261 2423807 2293417 2172143
$$ packed form
50553A540292M0426M1979M4005M6339M8167M8869M8600M7845M6652M4617M1569
50542B039360L7943L4458L1684K9956K9479L0398L2792L6589M1367M6409N1183
50531B441618N5759O0548O5780P1518P8014Q5601R4157J03164J12249J21137J28995
50520C418540J34504J36943J36728J34452J29889J22317J11319R6724P8266N6204
50510D555886L2025P623j6294m0205o4077q6433j05480j20550j31853j39267j41992
50499C749383j39360j31442j18830j02180q2196n9830l6254j2518J0575L2199
50489C109547N1112O5735P4671P6866P1335N7161L4396M999k7493n9375q7889
50478C371065j11252j28394j39074j44057j44723j42304j37454j30390j21274
$$ plain form
50469 2172143 2061623 1962710 1875271 1798350 1730695 1671290 1619484 1574605 1535504 1500645 1468773
50458 1468773 1439373 1412302 1387091 1362909 1339264 1316406 1294776 1274299 1254484 1235152 1216770
50447 1216770 1200044 1185404 1172916 1162489 1154024 1147477 1142874 1140134 1138792 1138080 1137548 1137565 1138898 1141736
50433 1141736 1145390 1149143 1153206 1158612 1166317 1176627 1189302 1203788 1219346 1235477 1252449 1271172
50421 1271172 1292382 1316157 1342257 1370582 1401089 1433749 1468969 1507756 1551044 1599074 1651870
50410 1651870 1710006 1774270 1844586 1919824 1998709 2080388 2163975 2248034 2330779 2410489 2485641
50399 2485641 2554975 2617635 2672950 2719932 2757142 2782996 2795933 2794406 2777310 2744582 2697019
50388 2697019 2635549 2561427 2477425 2388090 2298167 2210975 2128619 2053250 1987472 1933725 1893845
$$ packed form
50469B172143j10520r8913q7439p6921o7655n9405n1806m4879l9101l4859l1872
50458A468773k9400k7071k5211k4182k3645k2858k1630k0477j9815j9332j8382
50447A216770j6726j4640j2488j0427q465o547m603k740j342p12n32J7J333K838
50433A141736L654L753M063N406P705J0310J2675J4486J5558J6131J6972J8723
50421A271172K1210K3775K6100K8325L0507L2660L5220L8787M3288M8030N2796
50410A651870N8136O4264P0316P5238P8885Q1679Q3587Q4059Q2745P9710P5152
50399B485641O9334O2660N5315M6982L7210K5854J2937j527j7096l2728m7563
50388B697019o1470p4122q4002q9335q9923q7192q2356p5369o5778n3747l9880
$$ plain form
50377 1893845 1868964 1859161 1863153 1878742 1903615 1935389 1971056 2006978 2039498 2065258 2081052 2084066
50365 2084066 2072673 2046792 2007409 1956039 1894746 1826184 1753140 1677992 1602663 1528813 1457804
50354 1457804 1390571 1327719 1269740 1216906 1168934 1124966 1084086 1045882 1010525 978410 949840
50343 949840 925037 904177 887169 873464 862266 852889 844819 837650 831354 826505 823693 822581 822055
50330 822055 821610 822132 824859 829896 836191 842701 849006 854908 860141 864729 869191 873997 878930 883141 885821
50315 885821 886858 887020 887401 888530 889998 891118 891783 892550 894114 897033 901682 907934 914898 921611 928032
50300 928032 934765 941652 947363 950817 952490 953784 955601 958210 962111 967984 975632 983758 991160 997630
50286 997630 1003318 1007746 1010070 1010100 1008501 1006019 1002974 999540 996059 992779 989590 986369 983471 981668 981563
$$ packed form
50377A893845k4881r803L992J5589K4873L1774L5667L5922L2520K5760J5794L014
50365B084066j1393k5881l9383n1370o1293o8562p3044p5148p5329p3850p1009
50354A457804o7233o2852n7979n2834m7972m3968m0880l8204l5357l2115k8570
50343I49840k4803k0860j7008j3705j1198r377q070p169o296m849k812j112n26
50330H22055m45N22K727N037O295O510O305N902N233M588M462M806M933M211K680
50315H85821J037J62L81J129J468J120O65P67J564K919M649O252O964O713O421
50300I28032O733O887N711L454J673J294J817K609L901N873P648Q126P402O470
50286I97630N688M428K324L0j599k482l045l434l481l280l189l221k898j803j05
$$ plain form
50271 981563 983147 985837 988778 991112 992216 991838 990070 987156 983283 978503 972884 966773 960786 955326
50257 955326 950181 944910 939710 935520 932922 931208 928959 925524 921612 918459 916732 916204 916130 915812 915100
50242 915100 914469 914453 915002 915615 916000 916248 916383 916251 915969 915979 916330 916396 915626 914300 913143 912507 912272 912283 912401
50223 912401 912307 911782 911077 910547 909958 908582 906018 902450 898043 892586 885949 878462 870556 862304 853610 844580
50207 844580 835355 825771 815609 805191 795376 786794 779324 772484 766133 760536 755817 751718 748013 744966
50193 744966 743130 742718 743310 744146 744662 744848 745189 746097 747325 748101 748054 747756 748043 749001 750051 750830 751455 751995
50175 751995 752370 752863 754067 756039 758161 760207 762935 767127 772580 778651 785388 793425 803122 814524
50161 814524 828006 844105 862640 882528 902453 921169 937307 949732 958438 964596 969549 974227
$$ packed form
50271I81563J584K690K941K334J104l78j768k914l873m780n619o111n987n460
50257I55326n145n271n200m190k598j714k249l435l912l153j727n28p4l18p12
50242I15100o31j6N49O13L85K48J35j32k82J0L51O6p70j326j157o36k35J1J18
50223I12401r4n25p05n30n89j376k564l568m407n457o637p487p906q252q694r030
50207H44580r225r584j0162j0418r815q582p470o840o351n597m719m099l705l047
50193G44966j836m12N92Q36N16J86L41R08J228P76m7k98K87R58J050P79O25N40
50175G51995L75M93J204J972K122K046K728M192N453O071O737Q037R697J1402
50161H14524J3482J6099J8535J9888J9925J8716J6138J2425Q706O158M953M678
$$ plain form
50149 974227 979401 985599 992281 997743 1000479 1000275 997520 991879 982300 968177 949940 928638 905605
50136 905605 882637 861853 844888 832286 823774 818893 817174 817928 820198 822975 825381 826774 826938 826219
50122 826219 825259 824463 823802 823212 822943 823331 824411 826062 828380 831567 835540 840058 845224 851316 858061 864681
50106 864681 870967 877669 885312 893124 899833 905242 910378 916290 923449 932246 943253 956795 972831
50093 972831 991465 1013068 1037782 1065586 1097156 1134097 1177724 1227851 1283102 1342125 1404165
50082 1404165 1468683 1534857 1601314 1666101 1727160 1783360 1835234 1884588 1933433 1983308 2035238
50071 2035238 2089758 2146585 2204157 2259363 2307711 2344132 2364122 2364488 2343456 2300793 2238234 2159474
50059 2159474 2069185 1971901 1871873 1773403 1680309 1594720 1516967 1447051 1385802 1334144 1291610
$$ packed form
50149I74227N174O198O682N462K736k04k755n641r579j4123j8237k1302k3033
50136I05605k2968k0784j6965j2602q512m881j719P54K270K777K406J393J64p19
50122H26219r60p96o61n90k69L88J080J651K318L187L973M518N166O092O745O620
50106H64681O286O702P643P812O709N409N136N912P159Q797J1007J3542J6036
50093I72831J8634K1603K4714K7804L1570L6941M3627N0127N5251N9023O2040
50082A404165O4518O6174O6457O4787O1059N6200N1874M9354M8845M9875N1930
50071B035238N4520N6827N7572N5206M8348L6421J9990L66k1032m2663o2559p8760
50059B159474r0289r7284j00028r8470r3094q5589p7753o9916o1249n1658m2534
$$ plain form
50048 1291610 1256442 1227272 1204089 1187347 1176784 1171684 1171874 1177701 1188962 1204464 1222706 1242442
50036 1242442 1262334 1280516 1295041 1304730 1309571 1310623 1309669 1308560 1308462 1309712 1312330 1316210 1320609 1324063
50022 1324063 1325418 1324692 1322494 1318974 1313927 1307621 1300648 1292935 1283637 1272271 1259421 1246078 1232717
50009 1232717 1219291 1205756 1192298 1179174 1166502 1154098 1141612 1129162 1117889 1109550 1105493 1106283
49997 1106283 1112250 1123953 1141949 1166379 1196801 1232013 1269997 1308583 1346488 1383428 1419094
49986 1419094 1452545 1483011 1511047 1538373 1566514 1595644 1624548 1651550 1675679 1697259 1717578
49975 1717578 1738167 1760607 1786856 1819220 1859656 1909174 1967833 2034995 2109351 2188955 2271498
49964 2271498 2354758 2437096 2517902 2597547 2676754 2756209 2837179 2922258 3014684 3116438 3226962
$$ packed form
50048A291610l5168k9170k3183j6742j0563n100J90N827J1261J5502J8242J9736
50036A242442J9892J8182J4525R689M841J052r54j109r8J250K618L880M399L454
50022A324063J355p26k198l520n047o306o973p713r298j1366j2850j3343j3361
50009A232717j3426j3535j3458j3124j2672j2404j2486j2450j1273q339m057P90
49997A106283N967J1703J7996K4430L0422L5212L7984L8586L7905L6940L5666
49986A419094L3451L0466K8036K7326K8141K9130K8904K7002K4129K1580K0319
49975A717578K0589K2440K6249L2364M0436M9518N8659O7162P4356P9604Q2543
49964B271498Q3260Q2338Q0806P9645P9207P9455Q0970Q5079R2426J01754J10524
$$ plain form
49953 3226962 3343388 3461383 3575666 3680388 3769538 3837319 3878888 3891859 3877352 3838909
49943 3838909 3780021 3703005 3609999 3503848 3387492 3263244 3133334 3000559 2867732 2736670
49933 2736670 2608018 2481557 2356399 2231648 2107737 1986913 1872022 1765099 1667373 1579830
49923 1579830 1502996 1436581 1379981 1332757 1294060 1262248 1235956 1215060 1199547 1187699 1176541
49912 1176541 1164072 1150160 1135330 1119817 1104149 1089715 1078120 1070402 1067016 1067907 1072251 1078694
49900 1078694 1086358 1095503 1107159 1122485 1142415 1167151 1195387 1224212 1250132 1270375 1283596 1289938
49888 1289938 1290620 1287114 1280540 1271808 1261803 1250761 1237686 1221188 1200856 1177024 1149350 1116951
$$ packed form
49953C226962J16426J17995J14283J04722Q9150O7781M1569J2971j4507l8443
49943C838909n8888p7016r3006j06151j16356j24248j29910j32775j32827j31062
49933B736670j28652j26461j25158j24751j23911j20824j14891j06923r7726q7543
49923A579830p6834o6415n6600m7224l8697l1812k6292k0896j5513j1848j1158
49912A176541j2469j3912j4830j5513j5668j4434j1595p718l386Q91M344O443
49900A078694P664R145J1656J5326J9930K4736K8236K8825K5920K0243J3221O342
49888A289938O82l506o574q732j0005j1042j3075j6498k0332k3832k7674l2399
$$ [...]
##END NTUPLES=NMR SPECTRUM
##END=
