##TITLE=AC1518_ROEFFECT0004_8202063_28mcDXYmqJ
##JCAMPDX= 6.0         $$ Bruker NMR JCAMP-DX V2.0
##DATA TYPE= NMR SPECTRUM
##DATA CLASS= NTUPLES
##ORIGIN= BRUKER
##OWNER= Administrator
$$ 1.72 TOPSPIN		Version 2.1
$$ 2013-09-26 20:31:07.066 -0700  Administrator@X
$$ Compression mode = diff/dup
##.OBSERVE FREQUENCY= 400.02188249412
##.OBSERVE NUCLEUS= ^1H
##.ACQUISITION MODE= SIMULTANEOUS (DQD)
##.ACQUISITION SCHEME= undefined
##.AVERAGES= 8
##.DIGITISER RES= 22
##SPECTROMETER/DATA SYSTEM= spect
##.PULSE SEQUENCE= zg30
##.SOLVENT NAME= COFFEE_meoh
##.SHIFT REFERENCE= INTERNAL, COFFEE_meoh, 1, 14.98509
##AUDIT TRAIL= $$ (NUMBER, WHEN, WHO, WHERE, PROCESS, VERSION, WHAT)
$$ ##TITLE= Audit trail, TOPSPIN		Version 2.1
$$ ##JCAMPDX= 5.01
$$ ##ORIGIN= Bruker BioSpin GmbH
$$ ##OWNER= Administrator
$$ $$ E:\/data/COFFEE/nmr/AC1518_ROEFFECT0004_8202063_28mcDXYmqJ/10/pdata/1/auditp.txt
$$ ##AUDIT TRAIL=  $$ (NUMBER, WHEN, WHO, WHERE, PROCESS, VERSION, WHAT)
(   1,<2013-09-26 20:31:00.019 -0700>,<Administrator>,<X>,<go>,<TOPSPIN 2.1>,
      <created by zg
	started at 2013-09-26 20:29:55.212 -0700,
	POWCHK enabled, PULCHK disabled,
       configuration hash MD5:
       C8 4E 4E 5D D3 5C D8 9E 9F 52 82 E0 59 8A DE 15
       data hash MD5: 64K
       B6 FA 63 67 74 2C 93 72 30 8B 56 81 3D E1 5C F5>)
(   2,<2013-09-26 20:31:03.003 -0700>,<Administrator>,<X>,<proc1d>,<TOPSPIN 2.1>,
      <Start of raw data processing
       efp LB = 0 FT_mod = 6 PKNL = 1 PHC0 = 0 PHC1 = 0 SI = 32K 
       data hash MD5: 32K
       B2 0C A6 1E 3E D0 8D 9B 07 E4 A5 E1 08 31 7E C9>)
(   3,<2013-09-26 20:31:03.284 -0700>,<Administrator>,<X>,<proc1d>,<TOPSPIN 2.1>,
      <pk PHC0 = 94.19678 PHC1 = 0 
       data hash MD5: 32K
       90 FC 24 25 8A 79 A0 71 02 B7 54 5A BB 78 EC 0D>)
(   4,<2013-09-26 20:31:03.394 -0700>,<Administrator>,<X>,<proc1d>,<TOPSPIN 2.1>,
      <abs ABSG = 1 
       data hash MD5: 32K
       EE 18 11 46 A3 2F BA 01 D1 59 AC A9 35 1F 17 27>)
(   5,<2013-09-26 20:31:03.550 -0700>,<Administrator>,<X>,<proc1d>,<TOPSPIN 2.1>,
      <abs ABSG = 2 
       data hash MD5: 32K
       2E 80 FA 0F B3 4F B2 79 53 F9 FD 89 A1 60 28 F5>)
(   6,<2013-09-26 20:31:03.644 -0700>,<Administrator>,<X>,<proc1d>,<TOPSPIN 2.1>,
      <abs ABSG = 3 
       data hash MD5: 32K
       2F 8A 4B 53 10 FD 9E 45 8E 7D 82 5C D1 BD DD 09>)
(   7,<2013-09-26 20:31:03.706 -0700>,<Administrator>,<X>,<proc1d>,<TOPSPIN 2.1>,
      <abs ABSG = 4 
       data hash MD5: 32K
       4F 4F 83 2D 39 31 A6 CF 7F 2B CF 39 A8 34 B6 81>)
(   8,<2013-09-26 20:31:03.769 -0700>,<Administrator>,<X>,<proc1d>,<TOPSPIN 2.1>,
      <abs ABSG = 5 
       data hash MD5: 32K
       3B 1A FF 5F 8D ED F7 50 C1 10 AC 9D 1C 36 19 83>)
$$ ##END=
$$ 
$$ $$ hash MD5
$$ $$ 95 E1 48 39 25 BA 79 0B A9 A0 13 D3 E1 7D 07 99
##$RELAX= 
##$RELAX= 
##$RELAX= 
##$RELAX= 
##$RELAX= 
##$RELAX= 
##$RELAX= 
$$ Bruker specific parameters
$$ --------------------------
##$DU= <E:\>
##$EXPNO= 10
$$ [...]
##$TP= (0..7)
150 150 150 150 150 150 150 150
##$TP07= 0
##$TPNAME0= <>
##$TPNAME1= <>
##$TPNAME2= <>
##$TPNAME3= <>
##$TPNAME4= <>
##$TPNAME5= <>
##$TPNAME6= <>
##$TPNAME7= <>
##$TPOAL= (0..7)
0.5 0.5 0.5 0.5 0.5 0.5 0.5 0.5
##$TPOFFS= (0..7)
0 0 0 0 0 0 0 0
##$TUNHIN= 0
##$TUNHOUT= 0
##$TUNXOUT= 0
##$USERA1= <user>
##$USERA2= <user>
##$USERA3= <user>
##$USERA4= <user>
##$USERA5= <user>
##$V9= 5
##$VALIST= <valist>
##$VCLIST= <CCCCCCCCCCCCCCC>
##$VD= 0
##$VDLIST= <DDDDDDDDDDDDDDD>
##$VPLIST= <PPPPPPPPPPPPPPP>
##$VTLIST= <TTTTTTTTTTTTTTT>
##$WBST= 1024
##$WBSW= 4
##$XGAIN= (0..3)
0 0 0 0
##$XL= 0
##$YL= 0
##$YMAX_a= 683310
##$YMIN_a= -580125
##$ZGOPTNS= <>
##$ZL1= 120
##$ZL2= 120
##$ZL3= 120
##$ZL4= 120
##$ABSF1= 14.98509
##$ABSF2= -5.573092
##$ABSG= 5
##$ABSL= 3
##$ALPHA= 0
##$AQORDER= 0
##$ASSFAC= 0
##$ASSFACI= 0
##$ASSFACX= 0
##$ASSWID= 0
##$AUNMP= <proc_prof1d_extract_pilot.lims>
##$AXLEFT= 0
##$AXNAME= <>
##$AXNUC= <1H>
##$AXRIGHT= 0
##$AXTYPE= 0
##$AXUNIT= <>
##$AZFE= 0.1
##$AZFW= 0.1
##$BCFW= 0
##$BC_mod= 0
##$BYTORDP= 0
##$COROFFS= 0
##$CY= 15
##$DATMOD= 1
##$DC= 0
##$DFILT= <>
##$DTYPP= 0
##$F1P= 0
##$F2P= 0
##$FCOR= 0.5
##$FTSIZE= 32768
##$FT_mod= 6
##$GAMMA= 0
##$GB= 0
##$INTBC= 1
##$INTSCL= 1
##$ISEN= 128
##$LB= 0
##$LEV0= 0
##$LPBIN= 0
##$MAXI= 10000
##$MC2= 0
##$MEAN= 0
##$ME_mod= 0
##$MI= 0
##$NCOEF= 0
##$NC_proc= -8
##$NLEV= 6
##$NOISF1= 0
##$NOISF2= 0
##$NSP= 0
##$NTH_PI= 0
##$NZP= 0
##$OFFSET= 14.98509
##$PC= 1
##$PHC0= 94.19678
##$PHC1= 0
##$PH_mod= 1
##$PKNL= yes
##$PPARMOD= 0
##$PPDIAG= 0
##$PPIPTYP= 0
##$PPMPNUM= 2147483647
##$PPRESOL= 1
##$PSCAL= 4
##$PSIGN= 0
##$PYNMP= <proc.py>
##$REVERSE= no
##$SF= 400.02
##$SI= 32768
##$SIGF1= 0
##$SIGF2= 0
##$SINO= 400
##$SIOLD= 32768
##$SPECTYP= <>
##$SREGLST= <1H.CDCl3>
##$SSB= 0
##$STSI= 32768
##$STSR= 0
##$SW_p= 8223.68421052631
##$SYMM= 0
##$S_DEV= 0
##$TDeff= 65536
##$TDoff= 0
##$TI= <>
##$TILT= no
##$TM1= 0
##$TM2= 0
##$TOPLEV= 0
##$USERP1= <user>
##$USERP2= <user>
##$USERP3= <user>
##$USERP4= <user>
##$USERP5= <user>
##$WDW= 1
##$XDIM= 32768
##$YMAX_p= 480393703
##$YMIN_p= -782553
##$CURPLOT= <Network HP LaserJet P1505>
##$CURPRIN= <$Network HP LaserJet P1505>
##$DFORMAT= <normdp>
##$LAYOUT= <+/1D_H.xwp>
##$LFORMAT= <normlp>
##$PFORMAT= <normpl>
##$SURQMSG= 1
$$ End of Bruker specific parameters
$$ ---------------------------------
##NTUPLES= NMR SPECTRUM
##VAR_NAME=  FREQUENCY,     SPECTRUM/REAL,   SPECTRUM/IMAG
##SYMBOL=    X,             R,               I
##VAR_TYPE=  INDEPENDENT,   DEPENDENT,       DEPENDENT
##VAR_FORM=  AFFN,          ASDF,            ASDF
##VAR_DIM=   32768,         32768,           32768
##UNITS=     HZ,            ARBITRARY UNITS, ARBITRARY UNITS
##FACTOR=    0.250966925370066, 1,           1
##FIRST=     8223.43324360094, -114215,      -363966
##LAST=      0,             -130375,         93987
##MIN=       0,             -782553,         0
##MAX=       8223.43324360094, 480393703,    0
$$ Real data points
##PAGE= N=1
##DATA TABLE= (X++(R..R)), XYDATA
$$ [...]
19508c55390J68978Q1125p4182Q7324I3147i9920r2780c4440j43717j74568a4005
19496a44349N5633A93878c18824f0765k90250d6109H4985D0625i4952A04545L1203
19485A35748a76596B73794h2341k8353B37468l5106d6867k0601E6578a67226L9329
19474a27897O1817G2128a10417m4622c2437B0302a97153Q3017C527J16190m6088
19463G3629a69530I4783e32638g5680j04029G3340e7504C30934I4191b73374D3144
19451f4937F5262a95836A54922a62466A09865b30013C8612b23198d254j3064l23513
19440c40831H4268b4241m5077j80518J17493B1803a55767f8424A98118a45616
19429I3212C2662f9220J5052E9735K08254H2788b47358q0678a12187G0558a68441
$$ y = [-355390, -186412, -105287, -179469, -92145, 93147, -99920, -192700, -34440, -178157, -352725, -14005, -144349, -88716, 193878, -318824, -60765, -351015, -46109, 84985, 40625, -94952, 104545, 135748, -176596, 273794, -82341, -110694, 237468, 202362, -46867, -67468, 56578, -167226, -127897, -66080, 72128, -110417, -155039, -32437, 20302, -197153, -114136, 3527, 119717, 73629, -169530, 94783, -532638, -75680, -179709, 73340, -57504, 330934, 94191, -273374, 43144, -64937, 65262, -195836, 154922, -162466, 109865, -230013, 38612, -223198, -4254, -17318, -340831, 84268, -24241, -69318, -249836, -132343, 21803, -155767, -68424, 198118, -145616, 93212, 32662, -69220, -54168, 59735, 267989, 82788, -247358, -328036, -112187, 70558, -168441]
19417B09599k1212h7516C2985N8176d0608j50051j87265a29622c5244A49068B4594
19405c57136i5102I688Q7836a27970C2760J24364a43417j01749R480Q6303M8577
19394a00806E1724b17046L9842a9957A4119a8335m753B11295i6413A40881b79549
19382a33546K1161A09068h7560A63782M2558b71810b2224A555N9445a32152A36195
19370a34255l1516b2752k75722C4487j2530i6431i500j15695j29736E5365a61951
19358A67763a11698j4421j8555o3765N1656O9687j73144E3755K79057f5786K8378
19347c7408k47957c6015B1450I821K2367a47380K2679k17700C4129J52097b78512
19335a25828o5148A9843b64745B53005a48655g2143p6785C9968M7720i1687A01661
$$ y = [209599, 188387, -87516, 32985, 91161, -40608, -190659, -377924, -129622, -35244, 149068, 24594, -357136, -95102, 9688, 97524, -127970, 32760, 157124, -143417, -245166, -235686, -149383, -100806, 51724, -217046, -177204, -19957, 14119, -18335, -23088, 211295, -96413, 140881, -279549, -133546, -112385, 109068, -87560, 163782, 206340, -271810, -22224, 1555, 61000, -132152, 136195, -134255, -165771, -22752, -298474, 34487, 21957, -96431, -9500, -125195, -254931, 55365, -161951, 167763, -111698, -126119, -144674, -208439, -156783, -87096, -260240, 53755, 332812, -65786, -37408, -285365, -36015, 21450, 9821, 32188, -147380, -124701, -342401, 34129, 186226, -278512, -125828, -190976, 19843, -264745, 253005, -148655, -72143, -148928, 39968, 87688, -91687, 101661]
19323B30463b39839b9412j83644e1906j42014G1039d02577i9853A69452a82813
19312D4655d059n0364A28440C3336a95457j91723A53460f760G6300m529a46358
19300D7035b66051H3674a0111k32511G204g1784K2306k3917L0464l23650O446
19289c60135J12578i2745J5514m8079J4394n9070B4434a03719e0844m6425A12782
19277a53789k78223A04637a33878A750a44989l5461j03857A3380D092R6025c0295
19265f8922j14890c2358r4228J892a6374I3407A7449K7963g4858j99597B29566
19253a62605A11280J92998i7138B18289a23935D9031a86964c8359L934o3210j66684
19242b64319i3138j37246e7380k34882J44407O7626H6642d619p8260C14485e6171
$$ y = [230463, -239839, -29412, -213056, -51906, -193920, 71039, -402577, -99853, 169452, -182813, 44655, -4059, -54423, 128440, 33336, -195457, -387180, 153460, -6760, 76300, 71771, -146358, 47035, -266051, 83674, -10111, -242622, 7204, -71784, -49478, -73395, -42931, -366581, -360135, -247557, -92745, -77231, -125310, -110916, -169986, 24434, -103719, -50844, -97269, 112782, -153789, -432012, 104637, -133878, 1750, -144989, -180450, -284307, 13380, 4092, 100117, -30295, -68922, -183812, -32358, -126586, -124694, -16374, 93407, 17449, 45412, -74858, -274455, 229566, -162605, 111280, 304278, -97138, 218289, -123935, 49031, -186964, -38359, -34425, -97635, -264319, -93138, -230384, -57380, -292262, -147855, -80229, 86642, -4619, -82879, 314485, -56171]
19230i4835A08135e2624m2875A31220D6030b7386j7846k15771f0822C73161c19321
19218e21755F2709a53163k30417O2061Q3505D3741d0282o2441A14619g2457B02710
19206d46132f1985a8855r4188k1578b981B9659K1936b26875i448l9516k6874A23690
19193a07999b7178p3928k66349J40013D15601b12813G6226i390j47865N777C47327
19181a43917m7463k09758a59674o8859a05699d7084j69545r1623B82501A07733
19170a11288l22474J01502B97714E3565i7496m1786n4245E817R047a15879j74370
19159b90249g1794m12532I388J88020e96984K47401A45139O283a51231J165A46032
19147c51319b1369B60056G175a63995a6296A0711J48334b59869M3362B58214F7028
$$ y = [-94835, 108135, -52624, -95499, 131220, 46030, -27386, -45232, -261003, -60822, 373161, -319321, -521755, 62709, -153163, -383580, -321519, -238014, 43741, -40282, -102723, 114619, -72457, 202710, -446132, -61985, -18855, -113043, -134621, -2981, 29659, 51595, -226875, -9448, -48964, -75838, 123690, -107999, -27178, -101106, -367455, -227442, 415601, -212813, 76226, -9390, -157255, -151478, 347327, -143917, -191380, -401138, -159674, -228533, -105699, -47084, -216629, -308252, 282501, 107733, -111288, -433762, -332260, 297714, 53565, -97496, -139282, -193527, 5817, 14864, -115879, -290249, -71794, -484326, 9388, 197408, -596984, -349583, 145139, 151422, -151231, -150066, 146032, -351319, -21369, 260056, 7175, -163995, -16296, 10711, 159045, -259869, -216507, 258214, 67028]
19135C3066r286J12277b7031l5875D64059a17083B6409d1288E5645a19093M6817
19124g2276K759F3974b8813a1351j23137F0509h3984k34916A55811J05299b10453
19112e4965P324k13507G577N91a78112o0752A16134A5037a10107o4988A12173
19100a60576E2013i8047C42302a9816A10479i3926H7511f2900A24415J90101E5061
19088b90775J11464N220k58P2774p816B0675R8018K38011c40786R8997Q8213B48527
19075d05288B04380d5358k11558D5861b48496E2098c12132h8822j58770A0201
19064A86866p4218b53531H2630M0886g1520o0160e0996j22355c4966A39896C0494
19052a16752A39959l9548b27288J9906h1341I8893d09544B86364a33062M3105
$$ y = [33066, 23780, 136057, -27031, -62906, 464059, -117083, 26409, -41288, 55645, -119093, -72276, -69517, 63974, -28813, -11351, -134488, 60509, -83984, -318900, 155811, 261110, -210453, -54965, -47641, -261148, 7577, 8168, -178112, -238864, 116134, 15037, -110107, -175095, 112173, -160576, 52013, -98047, 342302, -19816, 110479, -93926, 87511, -62900, 124415, 314516, 55061, -290775, -179311, -174091, -174349, -101575, -109391, 20675, 118693, 356704, -340786, -241789, -153576, 248527, -405288, 204380, -45358, -256916, 45861, -248496, 52098, -312132, -88822, -247592, 10201, 186866, 112648, -253531, 82630, 123516, -71520, -131680, -50996, -173351, -34966, 139896, 30494, -116752, 139959, 100411, -227288, -207382, -81341, 98893, -409544, 286364, -133062, -89957]
19042h9957A35817j6499b58311F5186P4817A6761a59459E1604J57396I8097a40257
19030a0530A02582I475A41J37315O5878o7274a17476b1455D3861b98505O0224
19019b38281e7076J9293b768k8879l25242C19393q4131e91233a12860b6046A00581
19007a69541M9631j2953O2205F4901a59710D02648a15825C8041a82719A77164
18996C54460c8111l7659A70200a11726A29835i1446j91627O0376A00915m3361
18986E7554c33157I89J46126m8614K89946a41260A78562g4260j62107P9305k0272
18975a77334P6862C29134a28110b4157j24077m4778M1314d86A66830a88923I4112
18963H7153d6243B31160a37491k33845h1355n5827M114j8007q3724N0022p9003
$$ y = [-89957, 135817, 119318, -258311, 65186, 140003, 16761, -159459, 51604, 209000, 98097, -140257, -10530, 102582, 9475, 141, 137456, 203334, 136060, -117476, -21455, 43861, -298505, -238281, -57076, -37783, -2768, -31647, -356889, 319393, 235262, -591233, -112860, -26046, 100581, -169541, -119910, -132863, -70658, 64901, -159710, 402648, -115825, 38041, -182719, 177164, 354460, -38111, -75770, 170200, -111726, 129835, -91446, -283073, -222697, 100915, 57554, -333157, 989, 147115, 98501, 388447, -141260, 178562, -74260, -236367, -157062, -177334, -100472, 329134, -128110, -24157, -148234, -193012, -151698, -486, 166830, -188923, 94112, 87153, -46243, 231160, -137491, -371336, -81355, -137182, -133068, -151075, -234799, -184777, -263780]
18952b63780P3536A23116a18173j80117H0012L45507g0520C7848c01387L1171
18942b70216I047J57722j0832a15638E68224c4250D6271J64599d350j19467k05307
18931c29124b9518A23331Q4622h6967r1389a5051j91046K0887g6588k82296G9257
18919A98618d5135B3807J87062b3366d221B59409g0726K5460j65757j04027a15805
18907B04885b4397A28258a56769A23840j8136a13025D4532J55535h2855c5122
18896a41942l9603B160a27402N5445k02539D6814a5674k73672f5292j24179A30940
18884e3340j43892A40222a48688N6034A56482a61146j69565h8608k675A01232
18873H8455A2090a5396j98839j31461M9079A67803f0488j88844B08782i4073q4925
$$ y = [-263780, -190244, 123116, -118173, -298290, 80012, 425519, -70520, 37848, -301387, -270216, 9047, 166769, 155937, -115638, 568224, -34250, 46271, 210870, -4350, -123817, -329124, -29518, 123331, 207953, -86967, -178356, -15051, -206097, -185210, -76588, -358884, 79257, 198618, -45135, 23807, 210869, -23366, -4221, 259409, -70726, -45266, -211023, -315050, -115805, 204885, -24397, 128258, -156769, 123840, 105704, -113025, 44532, 200067, -82855, -35122, -141942, -181545, 2160, -127402, -71957, -274496, 46814, -15674, -289346, -65292, -189471, 130940, -53340, -197232, 140222, -148688, -92654, 156482, -161146, -330711, -88608, -91283, 101232, 88455, 12090, -15396, -214235, -345696, -296617, 167803, -60488, -249332, 208782, -94073, -178998]
18862a78998B7216a3322n2737j65748M6739J6009J1294A62764J42623A0641J8904
18851B9545M02913a8475H3895h3880A97723C3126j6145a97395O8226B0427c4444
18839a89495A3483b86338h5280A0001a60375g8701b0010j22940A23948n6256h8365
18827a5438I1087h5819M38A66599b70640g5753A99747d2204j84124B33398j05848
18816A27550J02877b2723p9459B74222a97480d1053k03719B23231o0198N0592
18806B13625n7268c0304A37370a68412b6397k92155e3716k36349J22784P4453
18796i2828k06491A0785a57811I1970c40873a65105B03940a27513A20431a10621
18785C51309e7700C7201c43904a30547F7930K6970K94233A24407D0369e0802j9297
$$ y = [-178998, 27216, -13322, -66059, -231807, -185068, -169059, -157765, 162764, 305387, 10641, 29545, 432458, -18475, 83895, -83880, 197723, 33126, 16981, -197395, -129169, 20427, -34444, -189495, 13483, -286338, -85280, 10001, -160375, -78701, -20010, -142950, 123948, 67692, -88365, -15438, 91087, -85819, -85381, 166599, -270640, -75753, 199747, -42204, -226328, 233398, 127550, 230427, -22723, -102182, 274222, -197480, -41053, -244772, 223231, 163033, 213625, 156357, -30304, 137370, -168412, -26397, -318552, -53716, -290065, -167281, -92828, -299319, 10785, -157811, 91970, -340873, -165105, 203940, -127513, 120431, -110621, 351309, -57700, 37201, -343904, -130547, 67930, 94900, 389133, 124407, 40369, -50802, -70099]
18774g0099o3134L2172C2063J6398a20360G0963f6913j16347k53704k1522a85330
18762a78407O1476j341M0346j00047O7354A78226b07606l2530b2913l0088j01587
18751a54588B35298b87905J23604E6299b76250a23192B58500i6402c1390j08507
18741a39897q1627A14606C4510J66156q1331Q2058f3719A78696b92791P4389J01311
18730a17091r68j5965O221B85225A3366J296c05194j182A86116D0620c9239A87407
18717b99543I1965h4918A57244a65437B48291j05826k1574a6177j119k41057o5134
18706c23487A44578a60065c9434l07507c4357j32166A50395c2523m7330A00878
18695F7520B2053N4613b71034g859k46608Q3912A03132e2831p7481A71526b24366
$$ y = [-70099, -133233, -101061, 32063, 48461, -120360, 70963, -66913, -183260, -436964, -458486, -185330, -178407, -116931, -118272, -77926, -177973, -110619, 178226, -207606, -240136, -22913, -53001, -154588, 235298, -287905, -164301, 56299, -276250, -123192, 258500, -96402, -31390, -139897, -221524, 114606, 34510, 200666, 119335, 201393, -63719, 178696, -292791, -218402, -117091, -118059, -134024, -127803, 285225, 13366, 14662, -305194, -306376, 186116, 40620, -39239, 187407, -299543, 91965, -84918, 157244, -165437, 248291, 142465, 120891, -16177, -17296, -258353, -323487, 144578, -160065, -39434, -346941, -34357, -166523, 150395, -32523, -79853, 100878, 67520, 22053, 76666, -271034, -7859, -254467, -170555, 103132, -52831, -130312, 171526, -224366]
18683a18678n1692j38660a7181j77872K995Q6270o6111I5626J54298f3002A8697
18671A71738N7429b22819K6089l8394J00725J7231d7535k65542M0257f1146n2923
18660a14069B39473A12516e5731j4361A59616a15830a4386I0516k6188K80875
18650C45203d9862A73552b10997N1753j1519c3522k67327A66595L780g0364A39125
18638A11684J65449q1141h1017j46242a08477G8968c87553a31833A50307a84323
18627A52042c03774e4153J9696j96330h863j63056C8522b07146G7590M9212g82553
18615F7253f8947l1143c6978m1671j13150g5224o3550k28587a0421B19923E8634
18603c0888A4080J14216O0521c9828n8651j93656J40946J684k3466P0165A03448
$$ y = [-118678, -170370, -309030, -17181, -195053, -192058, -105788, -171899, 95626, 249924, -63002, 18697, 171738, 229167, -222819, -196730, -235124, -134399, -117168, -47535, -313077, -272820, -61146, -114069, 239473, 112516, -55731, -70092, 159616, -115830, -14386, 90516, 64328, 345203, -49862, 173552, -210997, -159244, -170763, -33522, -300849, 166595, 170375, -70364, 139125, 111684, 277133, 195992, -81017, -227259, -108477, 78968, -387553, -131833, 150307, -184323, 152042, -303774, -54153, -34457, -230787, -8863, -171919, 38522, -207146, 77590, 126802, -782553, 67253, -68947, -100090, -36978, -78649, -191799, -75224, -138774, -367361, -10421, 219923, 58634, -30888, 14080, 128296, 188817, -39828, -98479, -292135, -151189, -149505, -172971, -102806, 103448]
18591a02882B9061a00292A9836d6333k535A96839p8656d14002N5177B9582b83799
18579a74745J4102Q867j7869e0918K4275k26966R0096K6726B10312a8537l48337
18568c66874A10620f2571D2515a44207A61301c0863p5147C7170Q8004a72393j8642
18557a91035k03861g0244j80059D08027d2176B88973h6625l4070K983I8262c1135
18545a00175A7008b3908l43175B6169f8384A14821a31937a9454j81978M0074A17550
18533d11608a85078J5054C52001F8561M263i8008r6651M2491E1277B4453a83258
18521f4233A03292a92734d0312k08277N6192C24338o3065i6263B5565O2708b64558
18509a90499C69224b97993l4982J58002J9914a147B30342g3644A1435b3698B16199
$$ y = [-102882, 29061, -100292, 19836, -46333, -48868, 196839, 118183, -414002, -358825, 29582, -283799, -174745, -160643, -151776, -169645, -50918, -26643, -253609, -163513, -136787, 210312, -18537, -366874, 110620, -62571, 42515, -144207, 161301, -30863, -106010, 37170, 125174, -172393, -191035, -394896, -70244, -250303, 408027, -42176, 288973, -86625, -120695, -117712, 98262, -31135, -100175, 17008, -23908, -367083, 26169, -68384, 114821, -131937, -19454, -201432, -161358, 117550, -411608, -185078, -170024, 352001, 68561, 72824, -98008, -194659, -152168, 51277, 24453, -183258, -64233, 103292, -192734, -40312, -248589, -192397, 324338, 261273, -96263, 25565, 88273, -264558, -190499, 369224, -297993, -332975, -174973, -155059, -1147, 230342, -73644, 11435, -23698, 216199]
18497B65224a28919A4089d0563j20890j04485H1946J51390b78989A11972a16552
18486c060I9405c2322A10223e65710I8274a88007A96269a38528j36543J30662
18476a44409D0975A7947a61098G1503b72351a18456a3930C7980d48901E765K94763
18465C00528A9089e0056B65588i6565j23089A23442j7355c504k58830J18052j25830
18454b70112a23991A9097a98604A04987d18441i330k81926B37534j2570p8652
18444A46312B3882K8730f5909K9159D497J41726f2355I4379d00278B1597d94671
18432b53214K6981h8290b3257j21247A53678d98616B59057a28890i62k85555B49209
18420b40204J11574A29334o3690b6229e571I2547b43029E0521K70447a92966A87244
$$ y = [265224, -128919, 14089, -40563, -161453, -265938, 81946, 233336, -278989, 111972, -116552, -3060, 99405, -32322, 110223, -565710, 98274, -188007, 196269, -138528, -275071, -144409, 40975, 17947, -161098, 71503, -272351, -118456, -13930, 37980, -448901, 5765, 300528, 19089, -50056, 265588, -96565, -219654, 123442, 106087, -3504, -262334, -144282, -270112, -123991, 19097, -198604, 104987, -418441, -9330, -291256, 237534, 224964, 146312, 23882, 52612, -65909, -36750, 4497, 146223, -62355, 94379, -400278, 21597, -494671, -253214, -226233, -88290, -23257, -144504, 153678, -498616, 259057, -128890, -962, -286517, 249209, -240204, -128630, 129334, 65644, -26229, -5571, 92547, -243029, 50521, 320968, -192966, 187244]
18408A66593d0158F0053J24928P5478j24089i3732j25181R8567B64656C6418M210
18397D0628b04870d7327K1766J0351k78487F2795i9786C038c14380J33090l0530
18386b11820F9287P5042E2764J86006d48278c8580j90852p491r160l1881N5217
18375b22747H0021l511L1761f8756B34935p9029a45473G3186A293Q6470K4691
18364A12454d7903a8488n283q3511p6359F2811b72554A35507J59085d09943a43480
18352F9385a59480L5320k46249I8596D5835A7641J20966a9832j84240j31214a49656
18340d2435F1630k3369J39875D3684a36102n8210R5010j43545A3447J92208E9828
18328i3638M3206j65165j6799k672E7472O7009p760C9979a70824A82428e5332
$$ y = [166593, -40158, 60053, 184981, 260459, 136370, -93732, -218913, -120346, 264656, 36418, 40628, -204870, -47327, -25561, -15210, -293697, 62795, -99786, 3038, -314380, -181290, -211820, 69287, 144329, 52764, 238770, -448278, -38580, -229432, -236923, -246083, -277964, -222747, 80021, 76510, 108271, -68756, 234935, 155906, -145473, 73186, 1293, 87763, 112454, -47903, -18488, -23771, -107282, -183641, 62811, -272554, 135507, 294592, -409943, -143480, 69385, -159480, -124160, -370409, 98596, 45835, 17641, 138607, -19832, -204072, -335286, -149656, -42435, 61630, 38261, 178136, 43684, -136102, -194312, -99302, -242847, 13447, 205655, 59828, -93638, -50432, -215597, -232396, -235068, 57472, 124481, 116721, 39979, -170824, 182428, -55332]
18316C39733f0181j56404D733J45406h5307a0918j24486q1396M1340r7764G5366
18304c3864o8181k09349A07935d8055A31293L5446d43886J29506O0398P614A31791
18292a61310B90401b73353J24788a6411G666K66178j3889c11503g7598k37745
18282c15343g5038C286h9214B04769D7126C457d8534l25466J29692A75913G1282
18270g514A2785e4554m00300a9590E3352a90081i805C96374a5307k14687C6613
18258c08134b3519j1068k0355k5261j43792a1098A26180b91299M0711A29360J14736
18247B44096a64749j13245i3044j21912c0175j47226A42778c43470I0464a07908
18236A40472I409O8894i7511C5177d03013d6310j19313k051C13700a89987I7104
$$ y = [339733, -60181, -216585, 4733, 150139, -85307, -10918, -135404, -216800, -175460, -273224, 75366, -33864, -102045, -311394, 107935, -48055, 131293, 166739, -443886, -314380, -253982, -246368, 131791, -161310, 290401, -273353, -148565, -16411, 7666, 273844, 259955, -311503, -77598, -315343, -75038, 3286, -89214, 204769, 47126, 3457, -48534, -374000, -244308, 175913, 71282, -7514, 12785, -54554, -454854, -19590, 53352, -190081, -9805, 396374, -15307, -229994, 36613, -308134, -23519, -34587, -54942, -80203, -223995, -11098, 126180, -291299, -250588, 129360, 244096, -164749, -277994, -93044, -214956, -30175, -177401, 142778, -343470, 90464, -107908, 140472, 9409, 78303, -97511, 35177, -403013, -46310, -165623, -167674, 313700, -189987, 97104]
18224a54743a1359l00364h2749R849D030f5238a5417j04350A77566b21165J07341
18213a13824E0538M0016L2509B873P3117J8951N3295f3831L1370d068E1194A1722
18200A00180f6454N940B54718r9658J2630b12085B2962K1533P1659J86945a1145
18188A14244a57949e8038r5819b0987B62863c07734h1176j21188B0698g248l57223
18177c64471C5578a40692H2911a99992A19077a87888n7832J10692M6850k70579
18167c58757A21432c67082H4590l0501A7591e1288m9481k04103a13331A7676J32320
18156A49996i2451A8635K29480M6320a23915C62677e1498A48059J20618C8569
18145A34110j3178c30337A62997M0432a9598n5856b6991A179b06593i9728B8558
$$ y = [-154743, -11359, -311723, -82749, -72900, 4030, -65238, -15417, -119767, 177566, -221165, -113824, 50538, 90554, 123063, 2873, 75990, 94941, 148236, -63831, -32461, -4068, 51194, 11722, 100180, -66454, -60514, 254718, 155060, 167690, -212085, 22962, 44495, 116154, 303099, -11145, 114244, -157949, -58038, -153857, -20987, 262863, -307734, -81176, -202364, 20698, -7248, -364471, 35578, -140692, 82911, -199992, 119077, -187888, -245720, -135028, -88178, -358757, 121432, -367082, 84590, 54089, 17591, -51288, -100769, -304872, -113331, 17676, 149996, -92451, 18635, 248115, 294435, -123915, 362677, -51498, 148059, 268677, 38569, 134110, 120932, -330337, 162997, 203429, -19598, -75454, -26991, 1179, -206593, -99728, 28558]
18133b05146C9943a09998A00809a161k66994A29182d79334B01773Q8500d6187
18122I1670A6890K78300C8311b16163D2576b65815a17612l9071k47711J34039
18112b70355a30988j43185R9150h5386q0530B25314F0149a2930l0905n4459b4425
18100H0058g2410j06403A11355b27688L5581J4052f533p7691B99667j01703B399
18088A66067o758D135J91341a6205j85253j79955g994p8451j19288g5663G3063
18076B5730K14745F1929k9227J39136l3419F5295c3994B41637h046j38742j47992
18065b94780f2557C30582a03249A19496K8419c27549c2507H1611K1314b4278k13565
18054b37843Q8675g1955k96104e2034G1756C0226J04993k0220L9575a46066C5246
$$ y = [-205146, 39943, -109998, 100809, -1161, -268155, 129182, -479334, 201773, 290273, -46187, 91670, 16890, 295190, 38311, -216163, 42576, -265815, -117612, -156683, -404394, -270355, -130988, -274173, -175023, -85386, -165916, 225314, 60149, -12930, -43835, -98294, -24425, 80058, -72410, -178813, 111355, -227688, -192107, -178055, -6533, -84224, 299667, 197964, 2399, 166067, 159309, 4135, 195476, -16205, -201458, -381413, -7994, -86445, -205733, -75663, 73063, 25730, 240475, 61929, 32702, 171838, 138419, 65295, -33994, 241637, -8046, -146788, -294780, -62557, 330582, -103249, 119496, 147915, -327549, -32507, 81611, 102925, -24278, -237843, -149168, -71955, -368059, -52034, 71756, 30226, 135219, 114999, 154574, -146066, 35246]
18042c6968j13879B96508g8337n84080i6819k5636A44860J63499b54252f3478
18031I9687a49958b1126A08329J08649b14193C2584a50552m3060Q5038L8642k08212
18020b78144a34506A36923b75075b5059r6527I1928K22431A10492K42886a20344
18009A9529J57264c19064A5772a00557D51368a66689A27843e3893l34943A26163
17998E3341a76948p7388j602A38738d5689H3994h5201q8191d8620j91885e6220
17986a42805o9082h6506B43782C7688P7081L67306e4853m4967B8629K526b62464
17974B13454b98038A62257a7847I0664a36268d4427m52898i0256A78166a35077
17963b70392b1699r5321I6705a5739r6273D0737b6434l72039a47682A95330a65508
$$ y = [-36968, -150847, 296508, -78337, -662417, -96819, -122455, 144860, 308359, -254252, -63478, 99687, -149958, -21126, 108329, 216978, -214193, 32584, -150552, -193612, -108574, -69932, -278144, -134506, 136923, -275075, -25059, -121586, 91928, 314359, 110492, 353378, -120344, 19529, 176793, -319064, 15772, -100557, 451368, -166689, 127843, -53893, -388836, 126163, 53341, -176948, -254336, -255938, 138738, -45689, 83994, -85201, -173392, -48620, -240505, -56220, -142805, -211887, -86506, 243782, 37688, 114769, 482075, -54853, -99820, 28629, 31155, -262464, 213454, -298038, 162257, -17847, 90664, -136268, -44427, -497325, -90256, 178166, -135077, -270392, -21699, -117020, 96705, -15739, -112012, 40737, -26434, -398473, -147682, 195330, -165508]
17951b25982B21552j00947J60077b66044H0107a56504A94727J53423A11585e6369
17940b16400n8088a16212q284L6658F5884c38809g5207p4928A32375J81872a29515
17928F7756a01771C66433B8084b32343D6424J9264a96923A32903A6375L1596J8268
17917F6239h2935A14086c17646a09199A21913a96026D61942c8615A52770B4984
17906d16914B84387a67955F7945a74500D40831I6170A3584e4963m1543o4932I1554
17894a8891k68199a36954G6161a20361A60994o7700j7064h0877k95489F6938R0618
17883A57556B9643O0969b8664C37434d1269j28924A48731b64167A02160D5164
17872D9218i9587d0331j22796N2499E3089c23853f3327l9512I1659L497a022C6013
$$ y = [-225982, 221552, 120605, 280682, -266044, 80107, -156504, 194727, 348150, 111585, -56369, -216400, -274488, -116212, -124496, -87838, 65884, -338809, -75207, -150135, 132375, 314247, -129515, 67756, -101771, 366433, 28084, -232343, 46424, 65688, -196923, 132903, 16375, 47971, 66239, -82935, 114086, -317646, -109199, 121913, -196026, 461942, -38615, 152770, 24984, -416914, 284387, -167955, 67945, -174500, 440831, 96170, 13584, -54963, -96506, -161438, 91554, -18891, -287090, -136954, 76161, -120361, 160994, 93294, 76230, -80877, -376366, 66938, 157556, 29643, 90612, -28664, 337434, -41269, -170193, 148731, -264167, 102160, 45164, 49218, -99587, -40331, -163127, -110628, 53089, -323853, -63327, -102839, 91659, 95156, -1022, 36013]
17859H511K33306P3339c53057K3539B07890b07574B98616A03410c93548e8709
17848g6028A92914b48818A02336D1850b42670p5391D0877a71468l2425m0489F6317
17836b62846L7537A15103j3272n706k1831a3353o2097j31722Q6395n8348j68664
17825c47789R1788E9993f1933l17754A98889a03730A30964B2853b34872N342A35646
17813f7702j90932I5411i5639A55112A1989P1597N4926i7040d8192k69869A67300
17801B54762b42278F0318B5645c9121B0596O1189K29098a13281j47907A65482
17790F7035N9186a83977B09593b11102B66956a75890j97174B56620k6433a14079
17779A86024J44116c1858E4906a44000M6552g003B00828D1098d7192A30419d8568
$$ y = [8511, 241817, 315156, -353057, -329518, 207890, -207574, 298616, 103410, -393548, -58709, -76028, 192914, -248818, 102336, 41850, -242670, -318061, 40877, -171468, -203893, -244382, 66317, -262846, -225309, 115103, 101831, 96125, 74294, -13353, -75450, -207172, -120777, -179125, -347789, -256001, 59993, -61933, -379687, 198889, -103730, 130964, 22853, -234872, -229530, 135646, -67702, -258634, 95411, -95639, 155112, 11989, 83586, 138512, -97040, -48192, -318061, 167300, 254762, -242278, 60318, 25645, -39121, 20596, 81785, 310883, -113281, -261188, 165482, 67035, 126221, -183977, 209593, -211102, 266956, -175890, -373064, 256620, 230187, -114079, 186024, 330140, -31858, 54906, -144000, -97448, -7003, 200828, 41098, -47192, 130419, -48568]
17767h1039q1284A44236n6239B828a19310A83148H2583a09535M9813C41379a26028
17755A15602m1512P7185B8761a15772d4846a5530A29489j8015j3927a70322Q615
17744a61707B51944A2333L2539p944e9767o0479a4864I6323C739J44948c0369
17732h3114B8739c6176A97355D1663K49627f208D90821D1730L0877J84757o4091
17721A93273o6990C075c9710n2611d0372E0675a97398F564J41907J5161a97536
17709c6868B93953F859a62600f7300A6122L86060A0891p99a80454O7655M9949
17698f2850a2374k6136F3896f8397A27661d6189B20481a9899j78662G6915a78014
17686A18244a29684B33901C6871K10371n0180H683b20821H4696b53562F9256Q5284
$$ y = [-81039, -162323, 144236, 87997, 2828, -119310, 183148, 82583, -109535, -59722, 341379, -126028, 115602, 74090, 151275, 28761, -115772, -44846, -15530, 129489, 111474, 97547, -170322, -161707, 251944, 12333, 44872, 36928, -59767, -120246, -14864, 96323, 3739, 148687, -30369, -83114, 28739, -36176, 197355, 41663, 291290, -6208, 490821, 41730, 72607, 257364, 193273, 126283, 3075, -39710, -92321, -40372, 50675, -197398, 6564, 148471, 163632, -197536, -36868, 293953, 6859, -162600, -67300, 16122, 402182, 10891, 10092, -180454, -112799, -62850, -12374, -38510, 63896, -68397, 127661, -46189, 220481, -19899, -198561, 76915, -178014, 118244, -129684, 233901, 36871, 247242, 197062, 8683, -220821, 84696, -253562, 69256, 154540]
17675A54540J75585j54473c8377B04397J30868a2223k84427a26930q217C1378
17664A12137b2982A37819K9756A0735i8988q7710D547c08189a415C48350a77931
17652d1798E4930L8862a8104j07396A16037D216d26310A40223R7478A15567f7
17640F3009J79617a37088M0730j57407I2299K13672G2212c0641j02301A40159
17629a26661a8851k02534e4259l36957A70396F8083I271a93862A11a25403C42290
17617A6636a82766e1814K5156D7842K35812C9527A4736a09770N0337j17650A79726
17605B27812C3318a34755A53685a22353M4898L8010A67814G9725P8110e8652H8887
17593A44656D8278M9979A2090a73029B30641F5378K17526a65577A04998c55391
$$ y = [154540, 330125, 175652, -38377, 204397, 335265, -12223, -296650, -126930, -135147, 31378, 112137, -22982, 137819, 167575, 10735, -98988, -186698, 4547, -308189, -1415, 348350, -177931, -41798, 54930, 93792, -18104, -125500, 116037, 4216, -426310, 140223, 237701, 115567, -67, 63009, 242626, -137088, -96358, -253765, 92299, 305971, 72212, -30641, -132942, 140159, -126661, -18851, -221385, -54259, -391216, 170396, 68083, 9271, -193862, 111, -125403, 342290, 16636, -182766, -51814, -26658, 47842, 283654, 39527, 14736, -109770, -59433, -177083, 179726, 227812, 33318, -134755, 153685, -122353, -77455, -39445, 167814, 79725, 157835, -58652, 88887, 144656, 48278, 98257, 12090, -173029, 230641, 65378, 282904, -165577, 104998, -355391]
17582A37867a35849N3443k12826A77637G4593K14245D3135c22524A84936l0506
17572A54430o9668J31550E6900J943a39360F4012K9905A2096L89346a90362m5559
17561b35921a10541D7590K7883A241R7851K20935g4420A52048G3691l3088J25047
17550A65650B4781c9281A67030a29235K6195M2053K1646B55093A19616a04833
17539B25960K07984B1150J99264h9327C46394Q0165A27294E5497i2263C54629
17528B9318J19092p3703L31414A28499K52811A53355a1930A75508C1977L24348
17518C56325b16840B33102h6983A71569c02746A88208f3445C52464g1937A44124
17507A82363j019o0783B1420b7703C8551J37990K81481A70037O1426b7564B10996
$$ y = [137867, -135849, -82406, -295232, 177637, 74593, 288838, 43135, -322524, 184936, 154430, 84762, 216312, 56900, 58843, -139360, 64012, 93917, 12096, 401442, -190362, -235921, -110541, 47590, 75473, 1241, 99092, 320027, -74420, 152048, 73691, 40603, 165650, 24781, -39281, 167030, -129235, -103040, -60987, -39341, 255093, 119616, -104833, 225960, 433944, 21150, 220414, -89327, 346394, 426559, 127294, 55497, -92263, 354629, 29318, 148410, 74707, 406121, 128499, 381310, 153355, -11930, 175508, 31977, 356325, -216840, 233102, -86983, 171569, -302746, 188208, -63445, 352464, -71937, 144124, 182363, 181344, 120561, 21420, -27703, 38551, 176541, 458022, 170037, 231463, -27564, 210996]
17495a31244d575A00827b61982e0781H9106R5534j7012B3136P1144D0291Q1855
17484A22146Q9001N0877A04090h666j35489H9664K17492L50643f9916A4144K08151
17473B22295H3485Q6112e7835b0667C14867D6175L00403a19907B74694M9923q91
17462C23726q6914J5320j10746L3676D2241O4069B5114N9169P0777P1132K43384
17451D69576A46083O5914J07698j51080L30327a09180A81409E3517K37630B0813
17440d1372C98476j37824J70569m8634A23122K43197A16344J84428L2487p3634
17430B59625K74860j07833j51914o3783J79504e0621D30529M2165j31983A35480
17419B77440Q6917A49801L35470j22898j35700K01646B4029R2115l2796N8980
$$ y = [-131244, -4575, 100827, -261982, -50781, 89106, 184640, 167628, 23136, 94280, 40291, 122146, 211147, 262024, 104090, -8666, -144155, 89664, 307156, 657799, -69916, 14144, 222295, 83485, 169597, -57835, -20667, 314867, 46175, 346578, -119907, 274694, 324617, 323726, 236812, 252132, 141386, 175062, 42241, 106310, 25114, 84283, 155060, 226192, 469576, 146083, 211997, 319695, 168615, 498942, -109180, 181409, 53517, 291147, 20813, -41372, 398476, 260652, 431221, 382587, 123122, 366319, 116344, 300772, 333259, 259625, 534485, 426652, 274738, 210955, 390459, -50621, 430529, 472694, 340711, 135480, 277440, 364357, 149801, 485271, 362373, 226673, 428319, 24029, 116144, 83348, 142328]
17409A42328K0639K3586J56228A09235i581A19367a77469A72020K05814H1737
17398C69579A43709K6338p7653L3574Q9811A01512L72210a66345A23648K59637
17388C83285a40645E50524B23554C9239M2583k1904K71138I467M80280k24842
17378B64905I3608J85410H1214N2313K24652c374H2454c13286c3722I4406c7625
17366C33362A03091M39275B49738C4920j0680J85789J46381a3402C38418e2769
17355e6146C47895m0935l1815M12354F6315O1102M61992A87160P6987L20705I3636
17343a72212B62277n2872o634a15188C45877a10469B6453o990R2357M26248p8227
17332D59841A94743L5004E8961k9061I914J00876a00790C80773j08983N7008j48126
$$ y = [142328, 162967, 186553, 342781, 109235, -9581, 119367, -177469, 172020, 377834, 81737, 369579, 143709, 170047, 92394, 125968, 215779, 101512, 473722, -166345, 123648, 383285, -140645, 550524, 223554, 39239, 81822, 59918, 331056, 9467, 489747, 264905, 93608, 279018, 81214, 133527, 358179, -3374, 82454, -313286, -33722, 94406, -37625, 333362, 103091, 542366, 249738, 34920, 24240, 210029, 356410, -13402, 338418, -52769, -56146, 347895, 306960, 275145, 687499, 66315, 127417, 589409, 187160, 264147, 584852, 93636, -172212, 262277, 209405, 202771, -115188, 345877, -110469, 26453, 19463, 111820, 538068, 459841, 194743, 229747, 58961, 29900, 9914, 110790, -100790, 380773, 271790, 328798, 180672]
17321A80672d22293A44370m8648J68040A03480A2070J77276J07973J35392a19129
17310c59554B34367K63771j49699A01755e9241C85347A66449d9337q7480C39019
17299a05404A23359L28630a37549A01592K32866e2682A58925K21913b0422C32169
17288B59179B709K31395d2889l1245c4547F4240J55518K49232a87596B82085J91449
17277D73534M1485A42799L4326b02490C70152O6263b24383E544J19265L13418
17267D38227o253j68834L47579k49541a06634b2615F7086Q2824L7039K63182j86548
17256B63583r7047Q8843P83H6079J63124G0031g3708B29476l3044a1480m1379
17245e2859A47167J57430J39722F2184a05004n4357C21040B5224L73888j53037
$$ y = [180672, -422293, 144370, 95722, 263762, 103480, 12070, 189346, 297319, 432711, -119129, -359554, 234367, 498138, 348439, 101755, -59241, 385347, 166449, -49337, -136817, 339019, -105404, 123359, 451989, -137549, 101592, 334458, -52682, 158925, 380838, -20422, 332169, 259179, 2709, 234104, -42889, -74134, -34547, 64240, 219758, 468990, -187596, 282085, 473534, 515019, 142799, 177125, -202490, 370152, 436415, -224383, 5544, 124809, 438227, 431974, 263140, 610719, 361178, -106634, -22615, 67086, 149910, 186949, 450131, 263583, 166536, 255379, 256162, 86079, 249203, 70031, -73708, 229476, 196432, -11480, -52859, 147167, 304597, 444319, 62184, -105004, -159361, 321040, 25224, 399112, 246075]
17235B46075n5752D0895K51787l8552O6403a33745C20958J7748J10298A89879
17224B45761F5247K88598R2300N2487A43772b89373A65310O2988k3527M7161K32946
17213D84878a4274A00861l3445g4696D62422G220M47968j56497A21926J03870
17203B25796R4130A25827g9714C96350G1597c8717C50538j14977f2084A88519
17192A61866M0702J65504j17112M2223F2611L58085j73927j16510J18646M8468
17182B97373K11647p7167j56398m5630n3368j5958K70556j44185K76583j13206
17172D50247J14551k16883j72535L83028H4425K73993r8492p5560J17306n6464
17162B45208b6114C77373p0205K18839j17176K20734A44090M89135B0380M18360
$$ y = [246075, 190323, 40895, 292682, 254130, 320533, -133745, 320958, 338706, 449004, 189879, 245761, 65247, 353845, 446145, 498632, 143772, -289373, 165310, 228298, 204771, 251932, 484878, -14274, 100861, 67416, -74696, 462422, 7220, 455188, 298691, 121926, 225796, 319926, 125827, -79714, 396350, 71597, -38717, 350538, 235561, -62084, 188519, 161866, 202568, 368072, 250960, 293183, 62611, 420696, 246769, 130259, 248905, 297373, 509020, 431853, 275455, 229825, 176457, 160499, 431055, 286870, 563453, 450247, 564798, 347915, 175380, 558408, 84425, 358418, 259926, 184366, 301672, 245208, -26114, 377373, 307168, 526007, 408831, 629565, 144090, 633225, 20380, 438740]
17152D38740k13265N4858J76225m8388J7204j91489J63470n94J13186k26552F1120
17140F11663A51440E8674L55426K9740k07364n8368K72919A92641M89412j73431
17130E08622M0525l0067N7702E2495M15241J21586h8828C16202G9011L28165k6768
17119C80408j6522J46540k41699A31477J23512J05489A65446N2547O2273J0331
17109B90597A22560M68517j21505k7838K49472j94741j2963j38271L1113l6657
17099C39687L10354B33388N0303J26212J84736r5017E3829N01971l1194J01451
17089F26057l1845l1225j5781O4168A89835J41663M30134C38815K43962J0435
17079E93212J99000j72124k90480K85133j61992n0611k3510L97681k28961A86550
$$ y = [438740, 225475, 280333, 456558, 408170, 425374, 233885, 397355, 396761, 509947, 283395, 61120, 611663, 151440, 58674, 414100, 443840, 236476, 178108, 451027, 192641, 682053, 508622, 549147, 519080, 576782, 52495, 467736, 589322, -88828, 316202, 79011, 407176, 380408, 363886, 510426, 268727, 131477, 254989, 360478, 165446, 217993, 280266, 290597, 122560, 591077, 469572, 441734, 691206, 496465, 483502, 345231, 376344, 339687, 650041, 233388, 283691, 409903, 594639, 499622, 53829, 555800, 524606, 626057, 594212, 562987, 547206, 611374, 189835, 331498, 761632, 338815, 582777, 593212, 792212, 620088, 329608, 614741, 452749, 402138, 378628, 776309, 547348, 186550]
17068C74183M09115B88477k2205M3955K40525j24938j38826M8723K65882j76390
17058D25203J86074j79138o5497j9702r5847K4241J71752J66845K4436k9656B69350
17046H53621k7584l67112L39824C71915n4434K84729K84101j19708B17237P23418
17036I40655k05937R8184D07970C4876R04972j11397k55626J7669J86987k39923
17026E37558J17138Q9677j96878J18305O6451J68077j95576m2444j4797k18211
17016D29300N29690D37878J07697P6581k9372o4480N12529j40288k96978P4882
17006F78449q4019K01606J77737j82620k77996Q5541n6991L31587j58397L15443
16996A030340k05213J36625j45309K70426E20560M16064p6539P9997k08817J77550
$$ y = [374183, 783298, 288477, 266272, 310227, 550752, 425814, 286988, 335711, 601593, 425203, 611277, 432139, 366642, 346940, 251093, 275334, 447086, 613931, 638367, 608711, 269350, 853621, 826037, 458925, 798749, 371915, 317481, 602210, 886311, 766603, 217237, 940655, 734718, 832902, 407970, 34876, 939848, 828451, 572825, 590494, 777481, 537558, 654696, 744373, 547495, 665800, 732251, 900328, 704752, 662308, 647511, 429300, 958990, 437878, 545575, 622156, 592784, 528304, 1040833, 900545, 603567, 678449, 594430, 796036, 973773, 791153, 513157, 598698, 541707, 873294, 714897, 1030340, 825127, 961752, 816443, 1086869, 520560, 936624, 860085, 940082, 731265, 908815]
16986I08815Q7207o7387L9979k41772r7511N17062n44236J08434L33418j65159
16976H78850J1525l02290J59584j76876L48880l8604K5120M1832J53426k77881
16966H23566K77457k59905J60286L29573m07787K20159j92351K71952k70738J73208
16956A125420j61688J38838P8817l08723O4628M56124m38230J87364N4075J94697
16946A391322K16560n37105J2664Q1729O0835p6885N03635j35140j03844J93672
16936A607443k25259R4747l05885q281K0811M01206k80851p5063p6695M15360
16926A567533l43150R7601K71774n05465M95524k15954M4191j8021J64976k67203
16916A291806J57393K50489k63532K27951M7579K81130l77573K34348J83669j44623
$$ y = [908815, 996022, 928635, 968614, 726842, 629331, 1146393, 602157, 710591, 1044009, 878850, 890375, 588085, 747669, 570793, 919673, 881069, 906189, 948021, 1101447, 823566, 1101023, 841118, 1001404, 1330977, 923190, 1143349, 950998, 1222950, 952212, 1125420, 963732, 1102570, 1181387, 872664, 937292, 1393416, 955186, 1142550, 1196625, 1391322, 1607882, 1070777, 1083441, 1165170, 1226005, 1149120, 1652755, 1517615, 1413771, 1607443, 1382184, 1476931, 1171046, 1162765, 1183576, 1584782, 1303931, 1228868, 1152173, 1567533, 1224383, 1321984, 1593758, 1088293, 1583817, 1367863, 1412054, 1394033, 1559009, 1291806, 1449199, 1699688, 1436156, 1664107, 1711686, 1992816, 1615243, 1849591, 2033260, 1888637]
16906A888637m94745J22299L97801k30020K99349K82137p40734K33879J62120
16897A920723M5894K73500j86061P9312R8907J9937j41330K09747j57941P2671
16887B235359j07673L43681q3981j96470r4738O2395K46066J28561k63631n1455
16877B218114J43326R5772k470J39252j48631J69739Q5677k009J6695k45283L67917
16866B838099J36161J701p4498k8438k9135L73811k93783n0953o4109M12680M70226
16855C691762k84096k25104J2772L39492l23886L65372R51M38127r4117j66852
16845C754421k35305M06942k3016n60844P87727j19339L36518k78650q289K53187
16835D313352o8983K68442K13193J5232q6403J36044J08501M35585p445m6224
$$ y = [1888637, 1393892, 1516191, 1913992, 1683972, 1983321, 2265458, 1524724, 1758603, 1920723, 1966617, 2240117, 2054056, 2133368, 2232275, 2252212, 2110882, 2320629, 2162688, 2235359, 2127686, 2471367, 2387386, 2190916, 2096178, 2158573, 2404639, 2533200, 2269569, 2218114, 2361440, 2457212, 2454742, 2593994, 2445363, 2615102, 2700779, 2698770, 2715465, 2470182, 2838099, 2974260, 2975961, 2901463, 2873025, 2843890, 3217701, 2923918, 2872965, 2808856, 3221536, 3691762, 3407666, 3182562, 3195334, 3534826, 3210940, 3576312, 3577263, 4015390, 3921273, 3754421, 3519116, 3926058, 3903042, 3342198, 4129925, 4010586, 4347104, 4068454, 4060165, 4313352, 4244369, 4512811, 4726004, 4741236, 4654833, 4790877, 4899378, 5334963, 5327518, 5281294]
16825E281294J7430L89938j53989J88633j02873M6124M97804N619J5993K66156
16815F452129K44587j44018L67760J08010M61431k73384L11133l29439L68921
16806G567130J73987L78065K29275n5635K937N80202J91257J59421K10464J4361
16796I451464L24114M28496J80633L56377O31115j14954M36372J07177J81593
16787A1982387L77883O24146l19927J006989L82137K47308R23407J63639N35444
16778A5923413N93127K85847N75101L94002P32947P81586O93535M61545N64590
16769B1005693J043805P06125M98450Q04049J582573R18394J150391R28608J162715
16760B9800803J454234J077392J616809J156262K032979J722978J783787K194658
$$ y = [5281294, 5298724, 5688662, 5534673, 5723306, 5620433, 5666557, 6164361, 6169980, 6185973, 6452129, 6696716, 6552698, 6920458, 7028468, 7489899, 7216515, 7527648, 7198209, 7567130, 7741117, 8119182, 8348457, 8292822, 8295759, 8875961, 9067218, 9226639, 9437103, 9451464, 9775578, 10204074, 10384707, 10741084, 11372199, 11257245, 11693617, 11800794, 11982387, 12360270, 12984416, 12664489, 13671478, 14053615, 14300923, 15224330, 15387969, 15923413, 16516540, 16802387, 17377488, 17771490, 18504437, 19286023, 19979558, 20441103, 21005693, 22049498, 22755623, 23254073, 24058122, 25640695, 26559089, 27709480, 28638088, 29800803, 31255037, 32332429, 33949238, 35105500, 37138479, 38861457, 40645244, 42839902]
16752D2839902J701744K183871K934198K091421L045520L078590K695947L626645
16744F4197838L206150M061951M276514M602536M491278N165811N332611O086285
16736A01420974N829678O473290O926782P178145P350466P612916P540551P732547
16728A58065349P435516P328756O655053O258159N234947M548150L716022K204790
16720B01446742J167402K44193r48140k177192k959770m520070m950739o404264
16712A80898162o592273p192008p826750p583530q299562p551934p832323o985390
16704A21034392p600981o289646o563019n976663n571240n404749m800161m914971
16696G3912962m214848m022681l418838l387723l313925l130000k495622k830391
$$ y = [42839902, 44541646, 46725517, 49659715, 51751136, 54796656, 57875246, 60571193, 64197838, 67403988, 71465939, 75742453, 80344989, 84836267, 90002078, 95334689, 101420974, 107250652, 113723942, 120650724, 127828869, 135179335, 142792251, 150332802, 158065349, 165500865, 172829621, 179484674, 185742833, 190977780, 195525930, 199241952, 201446742, 202614144, 202858337, 201910197, 199733005, 196773235, 192253165, 187302426, 180898162, 174305889, 167113881, 159287131, 151703601, 143404039, 135852105, 128019782, 121034392, 113433411, 107143765, 100580746, 94604083, 89032843, 83628094, 78827933, 73912962, 69698114, 65675433, 62256595, 58868872, 55554947, 52424947, 49929325, 47098934]
16688D7098934k483798k247608k027162j894884j612763j951587j534528j753138
16680C1593466j073850j651416q97809j242344j263769j046739q25711p59874
16672B2831954o36210j376637p67602q33620n42160q21401k66339j077113l68982
16663A6141890m48554k58187p98703p29203m057k99525m28082o42363n01476j07652
16653A1924088m66075n78451l39314k44308j51802k12817k94395p4226j21634
16644I441066o36543m88006R4131k10232k84607m18577k27474j94659L20850m94769
16634F901180K38365k80289Q344n68892l996r3853j02294j97765l38281L77078
16624E939597m93568o1594j42308k92295J376n8341k25275J57000k78621m04242
$$ y = [47098934, 44615136, 42367528, 40340366, 38445482, 36832719, 34881132, 33346604, 31593466, 30519616, 28868200, 27970391, 26728047, 25464278, 24417539, 23591828, 22831954, 22195744, 20819107, 20051505, 19217885, 18675725, 17854324, 17587985, 16510872, 16141890, 15693336, 15435149, 14636446, 13907243, 13903186, 13603661, 13175579, 12533216, 12031740, 11924088, 11458013, 10879562, 10540248, 10295940, 10144138, 9931321, 9636926, 9562700, 9441066, 8804523, 8316517, 8410648, 8200416, 7915809, 7497232, 7269758, 7075099, 7395949, 6901180, 7139545, 6859256, 6867600, 6298708, 6294712, 6200859, 6098565, 5900800, 5562519, 5939597, 5446029, 5384435, 5242127, 4949832, 4951208, 4892867, 4667592, 4824592, 4545971, 4141729]
16614D141729N38085k91530J78472l71824M3637l22906M8304M16095o86052L72382
16604D066392k75366j14835R4314l15319l3501P6206j97342Q7528l38096M82422
16594C532403n96205J69650o7374J04156R086l10849J74328j72665M1282n22735
16584B361077K20526J15245K8036j47048k67718J50866J12706k37211L55464l69163
16574B322780o6279j3817M5622j54307J49028n30494K07976n2905l7722K75040
16564B144922j22659J75345m20391J71110J20983l86065M11743o65102M16473
16555A846359K0931o8737j52571q8803K16063p8582l23867J38811J56971k47652
16545A418923J54784L02285m29684K30756J4755j2105M5246m37951L5102k02837
$$ y = [4141729, 4679814, 4388284, 4566756, 4194932, 4238569, 3915663, 3963967, 4380062, 3694010, 4066392, 3791026, 3676191, 3770505, 3455186, 3421685, 3497891, 3300549, 3388077, 3049981, 3532403, 2936198, 3105848, 3038474, 3142630, 3151716, 2840867, 3015195, 2842530, 2883812, 2361077, 2581603, 2696848, 2724884, 2577836, 2310118, 2460984, 2573690, 2336479, 2691943, 2322780, 2256501, 2242684, 2288306, 2133999, 2283027, 1752533, 1960509, 1907604, 1869882, 2144922, 2022263, 2197608, 1777217, 1948327, 2069310, 1683245, 2094988, 1429886, 1846359, 1867290, 1798553, 1645982, 1557179, 1773242, 1694660, 1370793, 1509604, 1666575, 1418923, 1573707, 1875992, 1446308, 1677064, 1691819, 1679714, 1724960, 1287009, 1322111, 1119274]
16535A119274N25804k82215M1144k18441L12704k97219M7068l19026M36833L7158
16525A403084l8974j47985R5046l86969M19219l82171Q3956M67568p06493L88265
16515A194546l56541J87630K33580o8233m24380L31298P2168l23111J17112q3838
16505H80231K10133J51767m89623J20116J46670L15815n35623K53357m72787L38784
16495I18840k64374L89874m9892j80579p0878P5963K32470k66024q2765J1279
16485G13914J34275R1659l22801M21638J08399l96813j18518p1163L16176k61623
16475F15143L41495k50640j8135j64181J38941J03481j73349N34440k34190k37010
16465F55995K32139l14550r1073K55183K9488k15141o4784J29918K544k21170
$$ y = [1119274, 1645078, 1362863, 1404007, 1185566, 1498270, 1201051, 1248119, 929093, 1365926, 1403084, 1364110, 1216125, 1311171, 924202, 1343421, 961250, 1045206, 1512774, 806281, 1194546, 838005, 1025635, 1259215, 1190982, 766602, 1097900, 1170068, 846957, 964069, 880231, 1090364, 1242131, 752508, 872624, 1019294, 1335109, 799486, 1052843, 580056, 918840, 654466, 1044340, 994448, 813869, 742991, 818954, 1051424, 785400, 702635, 713914, 848189, 939848, 617047, 1038685, 1147084, 750271, 631753, 560590, 876766, 615143, 956638, 705998, 687863, 523682, 662623, 766104, 592755, 1127195, 893005, 655995, 888134, 573584, 482511, 737694, 767182, 552041, 487257, 617175, 619719, 398549]
16455C98549L40169j08129r7136j40016K54197k45849K66341J13148j63246j61113
16445D56915j1446r3412K20997k2970n4577K83372j34807J72199l00179B24148
16434D24844o4424L32427k77529n6875j27301L54775B55945N4609J53957j91614
16424B72897L99790j63434k23056m2314M08652j77462k524Q7669j68169A05870
16413C43942K16141J533R2523l06364K26610q9395j33319A36906K72174r2481
16403C16599K41188k71689J28076p0940I078O07314m2433k01388n9532p464L8702
16392C44277P1625o0834J20471j47766M0487O5847A70202J96911j48265L10802
16382E29650j95183M3169A72934J59359J02733j34123I4685M97118A46282R1923
$$ y = [398549, 738718, 630589, 533453, 393437, 647634, 401785, 668126, 781274, 618028, 456915, 445469, 352057, 573054, 550084, 495507, 778879, 644072, 816271, 516092, 224148, 424844, 360420, 692847, 415318, 358443, 231142, 585917, 255945, 310554, 464511, 272897, 672687, 509253, 286197, 243883, 652535, 475073, 472549, 560218, 392049, 105870, 343942, 560083, 561616, 654139, 347775, 574385, 484990, 351671, 136906, 409080, 316599, 557787, 286098, 414174, 343234, 9078, 616392, 573959, 372571, 313039, 305575, 344277, 415902, 355068, 475539, 327773, 368260, 434107, 170202, 367113, 218848, 529650, 334467, 377636, 172934, 332293, 435026, 300903, 94685, 591803, 146282, 238205]
16372B38205R1962J50517m0763N200A46079J66540A35678J42015L0636J99269
16362E07598j58026a09464D02565j97726J1222j3440C7503O5903b3091C19788
16351A98194l5005a7473E05638a4276D95090a58927A97051p7369k1173J33316
16341B31825R8054j40545K50385C8636K23182R4584j49643J18853A07281B4032
16330A89424b3822A44192f1560B23476A5292K56279A34547J85341I0196K52444
16320C42640O7246A97737b08304C12299j34063J99983n6992A15055M03014b66560
16309a1352A71957d8951A90280B5091K75070b84829B06948J14581A29786J43123
16299B72909o6082e2638C19927n4599j06488Q2064p3685c0902B54900K93143A18866
$$ y = [238205, 330167, 480684, 439921, 445121, 146079, 312619, 135678, 277693, 308329, 507598, 349572, -109464, 402565, 204839, 216061, 202621, 37503, 103406, -23091, 319788, 198194, 163189, -17473, 505638, -14276, 495090, -158927, 197051, 119682, 98509, 231825, 329879, 189334, 439719, 38636, 261818, 356402, 206759, 325612, 107281, 24032, 189424, -23822, 144192, -61560, 223476, 15292, 271571, 134547, 319888, 90196, 342640, 409886, 197737, -208304, 312299, 178236, 378219, 321227, 115055, 518069, -266560, -11352, 171957, -48951, 190280, 25091, 300161, -284829, 206948, 321529, 129786, 272909, 206827, -52638, 319927, 265328, 158840, 240904, 167219, -30902, 254900, 548043, 118866]
16287B32150J16355j50947R0665P4284E5432Q8972J61631A5932K75779j01831
16277A89880M24868k13099A01567k3742K884j3175j1801Q7790h2608B97365b82376
16265A44216a99889f7361B8936L05606J7029e8094c128A49857N4299D3889J01707
16254A45596A0802K9840b1510C60394A11796k228C1240b24129D69512k04075H3654
16242a1786H3315a931E4364J01774o3710l2336O5049a29624L580C27778I4222
16230E20235A62320B7940J30925g4808B02004a05014B91151h163p194A37123M1421
16219A78544L3120b1453j61460C08406J20671A9729J90107F0378P7548J55164
16209B93090H9727a9763A63547p040e8669p4206D29645G4591O9275a31173r6656
$$ y = [232150, 348505, 197558, 288223, 362507, 55432, 144404, 306035, 15932, 291711, 189880, 614748, 401649, 101567, 77825, 80709, 67534, 55733, 143523, -82608, 297365, -282376, 144216, -199889, -67361, 28936, 334542, 351571, -58094, -3128, 149857, 204156, 43889, 145596, 10802, 40642, -21510, 360394, 111796, 109568, 31240, -224129, 469512, 265437, 83654, -11786, 83315, -1931, 54364, 156138, 92428, 60092, 125141, -129624, -126044, 327778, 94222, 520235, 162320, 27940, 158865, -74808, 202004, -105014, 291151, -8163, -15357, 137123, 178544, 211664, -21453, -182913, 308406, 429077, 19729, 209836, 60378, 137926, 293090, 89727, -19763, 163547, 156507, -58669, -132875, 429645, 74591, 143866, -131173, -227829]
16198b27829l123A70681G891J18309a59769G3924M10251B7669M6678g5563m3476
16187a19039c962A70050b30398A87766a93921G5593c4296E7111B4325M07315I4692
16175a22963A67692a00338J6537B8978Q7644b5534D45656A81883c27418g7448
16164e6336a4714A00843a05362e1809j79936A46567a11862M8549l0205O415B89750
16152f6595I7635a06574D10696A35885J03156a59658h351C6394g0024b8205G617
16140I9095a1351B34946B9725a92747H1557c34749a05973B39766f1280j8656J1830
16129f8106A25704c12485G7131O3588A4680f7110B82608k1542r1663d30966a15357
16117c35489h396k42079C0328P6426D948M5576N1326m5653a25593D8497f0457
$$ y = [-227829, -230952, 170681, 7891, 126200, -159769, 73924, 484175, 27669, 74347, -75563, -119039, -3962, 170050, -230398, 187766, -193921, 75593, -34296, 57111, 24325, 431640, 94692, -122963, 167692, -100338, -83801, 28978, 116622, -25534, 445656, 181883, -327418, -77448, -56336, -14714, 100843, -105362, -51809, -231745, 146567, -111862, -63313, -93518, -87103, 289750, -66595, 97635, -106574, 410696, 135885, 239041, -159658, -8351, 36394, -70024, -28205, 7617, 99095, -11351, 234946, 29725, -192747, 81557, -334749, -105973, 239766, -61280, -79936, -68106, 125704, -312485, 77131, 140719, 14680, -67110, 282608, 261066, 169403, -430966, -115357, -335489, -8396, -250475, 30328, 106754, 4948, 50524, 101850, 56197, -125593, 48497, -60457]
16105A28869m3840K22416D8424J22541b9893k13262C83763d770j03146A58653
16094F1999f3793b069D23428A1666a74928K8829j19333A41247a29101C6124N1443
16083H7567K75669C007d4688A32346B1038N2716K9357J12896d37868I7819e5225
16071f2602H9548j8465J3583l7828K11835a13439A7094b4760k6834j17487b7784
16059B87784D8116a60174C6601a38183e1422p2373j71008A32020n4515a73638
16048h1012E5470b15411h6418A96869c28790B7333b54830K7241B60264G3532i4627
16036a30654A37680d8093l88A14824K06841A10614J61338J28944a28233D460a33637
16024B11823F6993M7947O2945a61862E6937b74339P7372A76514a13688B99127
$$ y = [128869, 85029, 307445, 48424, 170965, -29893, -243155, 383763, -4770, -107916, 158653, 61999, -63793, -2069, 423428, 11666, -174928, -146099, -265432, 141247, -129101, 36124, 87567, 363236, 3007, -44688, 132346, 21038, 73754, 103111, 216007, -437868, 97819, -55225, -62602, 89548, 71083, 84666, 46838, 258673, -113439, 17094, -24760, -51594, -169081, -27784, 287784, 48116, -160174, 36601, -138183, -51422, -123795, -294803, 132020, 77505, -173638, -81012, 55470, -215411, -86418, 196869, -328790, 27333, -254830, -227589, 260264, 73532, -94627, -130654, 137680, -48093, -48481, 114824, 321665, 110614, 271952, 400896, -128233, 4460, -133637, 211823, 66993, 114940, 177885, -161862, 56937, -274339, -196967, 176514, -113688, 299127]
16013B23130b86298C17525a29914d0239n240H8963a35321B57978b16301C17163
16002A35295j490b05051F7231P6123a01276k74901A92966a46643N8938A6996a36511
15990B40477a89048G5876a46277E4729G569b55222A61618M3152N0402o6368K0677
15979B09481n0749n9222q149k0570Q3388P255C3601a13803B53883J9078M4314
15968C17275A11730J23244a93303g2527A55960p7829a38546M5615K9849k57024
15958c20106B3025N9226a06908r5768L1479P6933j6512A46238c19596D3717g7464
15946d25376a87174a0701j53157r9826k13598c6384m58032A14427a41331e8773
15935a33337a2861A8206J34495l1664c01041E9465J35796a13711m01056a90155
$$ y = [223130, -286298, 317525, -129914, -40239, -45479, 88963, -135321, 257978, -216301, 317163, 135295, 133805, -205051, 67231, 143354, -101276, -376177, 192966, -146643, -87705, 16996, -136511, 240477, -189048, 75876, -146277, 54729, 7569, -255222, 161618, 204770, 255172, 188804, 209481, 158732, 99510, 91361, 70791, 154179, 161434, 33601, -113803, 253883, 272961, 317275, 111730, 234974, -193303, -72527, 155960, 78131, -138546, -92931, -63082, -320106, 23025, 82251, -106908, -202676, -171197, -94264, -110776, 146238, -319596, 43717, -77464, -425376, -187174, -10701, -163858, -263684, -477282, -36384, -494416, 114427, -141331, -58773, -133337, -12861, 18206, 152701, 121037, -301041, 59465, 195261, -113711, -514767, -190155]
15924d7820A7595J13376b25274A565b58309a8054l4150E0457b39278A09488L8753
15913A48241B8635d0233A9742a97321m9340i9010L4009k29210J21719A25344a58828
15901C84662b97275P6508P6666E4457B6866a37575j83587A92578H8697a32463
15890C9771b15262A66909a27160A53581E4181K02285G4979B6335J23957b94999
15879a43250j26679R4504B60104a27164n4437k06708A82517m4789L8432D7881
15868b27067B69456B1153g971B59727j00314b01760D1545J72061E848d5206A58644
15856C11052h7200L7010A92281P7641m8446b56396B47037n8490C580J17904K69210
15845C90694b50552m7798B47980d2594k41025A10441a24720B0614Q7052n1379
$$ y = [-47820, 17595, 130971, -225274, 1565, -258309, -18054, -52204, 50457, -239278, 109488, 148241, 28635, -40233, 19742, -197321, -246661, -99010, -65001, -294211, -172492, 125344, -158828, 384662, -297275, -220767, -144101, 54457, 26866, -137575, -321162, 192578, 88697, -132463, 39771, -215262, 166909, -127160, 153581, 54181, 256466, 74979, 26335, 150292, -294999, -143250, -269929, -175425, 260104, -127164, -181601, -388309, 182517, 137728, 176160, 47881, -227067, 269456, 21153, -7971, 259727, 159413, -201760, 41545, 213606, 5848, -45206, 158644, 311052, -87200, -50190, 192281, 269922, 221476, -256396, 247037, 188547, 3580, 121484, 390694, -250552, -298350, 247980, -42594, -283619, 110441, -124720, 20614, 107666, 56287]
15835E6287O4734l6154c7976C4571O5501b02191f6163j62776Q5948G7079a81812
15823b69176J18875A65080a00501j44333a3482A07858a92554R0151B6678J80191
15813B06869m0368f3892B9792J51481a05032B9716c82259B170d8081A13823K03492
15802C17315G4656b92712A19520J56013N236B8130K95352b78543L0353N1805e4240
15790A72981G8342g9924A78276a7163l8139k84616J03113A759a12487I4272L7193
15779A31465o4769c27197a0924j1655M416j51162P5282E4528P6619a49197B59344
15767B75774a52067k57909i2934j37239A26526b83743B7719j1103R5728L49175
15757D61519a50179E1858a21404A12712h2229j926k73517G3985A5581a31875r135
$$ y = [56287, 121021, 84867, -37976, 34571, 100072, -202191, -66163, -228939, -142991, 77079, -181812, -269176, -150301, 165080, -100501, -244834, -13482, 107858, -192554, -102403, 26678, 206869, 166501, -63892, 29792, 181273, -105032, 29716, -382259, 2170, -48081, 113823, 317315, 74656, -292712, 119520, 275533, 280769, 28130, 323482, -278543, -248190, -196385, -54240, 172981, 78342, -79924, 178276, -17163, -55302, -339918, -236805, 1759, -112487, 94272, 131465, 66696, -327197, -10924, -22579, -18163, -169325, -94043, 54528, 131147, -149197, 259344, 275774, -152067, -409976, -92934, -230173, 126526, -283743, 27719, 16616, 112344, 461519, -150179, 51858, -121404, 112712, -82229, -84155, -357672, 73985, 15581, -131875, -141010]
15746a41010j21098A91743D936c3300j68587B18435d1781A57965c8169l92124
15736d30293a48224C0531o16K0100K68172e6628j02714B21661D0654J8081J93893
15725B52628g9182k07310P2496H7732b47837Q7103F5845a76718l4497j78664a29930
15713a00855J0334r4382c433m282q3391C18632A3917K34022E4642a33006M4328
15702h8678d1994D3510b55666A18145e07j69877C502b86811J35228d0340A80482
15690d01182b3068j3832F9119a47104c8346A10745e4429B79860e4455D0320g749
15678a02451i648D689b31859J5447E60136A98600b02206M9961I2357J52400j01378
15667A43379Q5536b38146H3824g1508a9290l80200J67124j58914b4275b139A29110
$$ y = [-141010, -262108, 191743, 4936, -33300, -201887, 218435, -41781, 157965, -38169, -430293, -148224, 30531, 29915, 50015, 318187, -56628, -159342, 221661, 40654, 58735, 252628, -79182, -286492, -213996, 87732, -247837, -160734, 65845, -176718, -211215, -389879, -129930, -100855, -90521, -184903, -3433, -7715, -91106, 318632, 13917, 247939, 54642, -133006, -88678, -41994, 43510, -255666, 118145, -507, -170384, 3502, -286811, -151583, -40340, 180482, -401182, -23068, -36900, 69119, -147104, -38346, 110745, -54429, 279860, -54455, 40320, -7749, -102451, -9648, 4689, -231859, -216412, 560136, 198600, -202206, -152245, 92357, 244757, 143379, 228915, -238146, 83824, -71508, -19290, -399490, -232366, -391280, -24275, -2139, 129110]
15655a65859j14477j50296H7251k6496i7007J1782i127k8041q408o35428f0690
15643a34600b6040A1098K50278b52044I36a27616M3417m00021C9386a82975l2041
15632b15016B9164a34315A3804h0616A48456i1062c3373A92432a63758L0050H704
15620b42690Q3929f388D1090l365J18403a2997k13798E0683O1828k4989j296J7572
15608A03798a68085j11751A86685J94529L2676I0429b14099A12619i4100A32397
15597a28703o9736I529c6157A35034A1394K05340F1256j7107f8127o1833l06L9989
15585i0277J2824j6005B76333c1409F5345e1014I6544g1598K8544A8627a31726
15573D6117b29604R988A16266b14756B02672E7025a25810r2566b5600k7044r3302
$$ y = [-165859, -280336, -430632, 87251, 60755, -97007, -85225, -9127, -37168, -45576, -681004, -60690, -134600, -26040, 11098, 261376, -252044, 936, -127616, -84199, -484220, 39386, -182975, -215016, 29164, -134315, 13804, -80616, 148456, -91062, -33373, 192432, -163758, -133708, 8704, -242690, -158761, -6388, 41090, 37725, 156128, -12997, -226795, 50683, 112511, 87522, 86226, 103798, -168085, -279836, 186685, 381214, 413890, 90429, -214099, 112619, -94100, 132397, -128703, -198439, 9529, -36157, 135034, 11394, 216734, 61256, 44149, -68127, -129960, -130266, -90277, -77453, -93458, 276333, -31409, 65345, -51014, 96544, -71598, -43054, 18627, -131726, 46117, -229604, -219616, 116266, -214756, 202672, 57025, -125810, -218376, -25600, -52644, -145946]
15562a45946b9729j57833l2781O5595L2447A50520E2968a02407l8089A59850e9303
15550d1779A48619c93720a91465P773k04036J82114A02160d3410j9132l06801
15540c69343a81813l4079g8132A98037c6098D98749a05177n5474H4507a02409
15529A53612C3018a65659E3832b07711A86000J7048R7136b62531b7359I1587A1658
15517a20442B16021i2858D4078j3671K13101A17268K9390J37285g2059C8057a75900
15505a68693C2766a68014r5478C1227K4117a51668l8735o2341a05896a9146j09562
15494a28708j4281D3757a15007B37513d3665j7239A05118i2107K1806H7901c3958
15482A21374m6027L6512c24882A5299a4863A21601a8883A92943a50005B31410
$$ y = [-145946, -29729, -187562, -220343, -154748, -122301, 150520, 52968, -102407, -140496, 159850, -59303, -41779, 148619, -393720, -191465, -183692, -387728, -205614, 102160, -43410, -62542, -369343, -181813, -215892, -78132, 198037, -36098, 498749, -105177, -160651, 84507, -102409, 153612, 33018, -165659, 53832, -207711, 186000, 203048, 300184, -262531, -27359, 91587, 11658, -120442, 216021, -92858, 44078, 30407, 243508, 117268, 146658, 283943, -72059, 38057, -175900, -168693, 32766, -168014, -263492, 31227, 55344, -151668, -190403, -252744, -105896, -19146, -128708, -142989, 43757, -115007, 237513, -43665, -60904, 105118, -92107, -70301, 87901, -33958, 121374, 75347, 111859, -324882, 15299, -14863, 121601, -18883, 192943, -150005, 231410]
15471i6669A3064i4487C46483f0616m2159l8898A00182b8229Q251I9127e6896
15459B43486R5817K2360H4271b31310B08785a24643B1691Q29h0397l55069K07895
15448b27571b4516m2008C16752a12393G8671R0953I230K5083f8521p0208l362
15437a42091k1163D5782J32328R5393a68450A17327J24013A481a94972C8858Q2327
15426A21185n1758a7496B38740P2420a97678A23516a75935L8265D0860K8485J93567
15415B62912l6770a30071A96562b19958A28114B1786e4271r9993e0546G464d46563
15403e6296A08109L10070H3802M9288a30644N017A71649h2692F0411J3549J86374
15392B60334J22690a29822G4294a22993d1246j1075j89595D96215k01992c9410
$$ y = [-96669, 13064, -94487, 346483, -60616, -102775, -141673, 100182, -28229, -19978, 99127, -56896, 243486, 339303, 361663, 84271, -231310, 208785, -124643, 21691, 22520, -80397, -435466, -227571, -24516, -66524, 316752, -112393, 78671, 169624, 9230, 34313, -68521, -138729, -142091, -163254, 45782, 178110, 273503, -168450, 117327, 241340, 1481, -194972, 38858, 121185, 69427, -17496, 238740, 311160, -197678, 123516, -175935, -137670, 40860, 69345, 262912, 226142, -130071, 196562, -219958, 128114, 21786, -54271, -154264, -50546, 7464, -446563, -56296, 108109, 418179, 83802, 133090, -130644, -125627, 171649, -82692, 60411, 73960, 260334, 383024, -129822, 74294, -122993, -41246, -52321, -241916, 496215, 294223, -39410]
15381F0271k1243a92246a1046k3702A06515d4652D4331c6017j46061B79139E9313
15369B61125a22688b6713A06313B4613b2392A43586Q496J9353J21293C5014K41233
15358B76247I627Q5204a46682k3652j81646a67985j89002h9912k4111B5374O2863
15347H8237m018e4196c041o9024H7400R169k1444a16766F3443a01817L9520m17827
15335d80124a7590k1686B26867a04046C12219c50586A63147c9861D6813K02610
15325B49423A8515J64118B5494h7457m3499B1530a62884A7008a19255o5038l513
15314a87806E3885d2726C0173K47236b08715C91007a96406L6212f8358k28560
15304b96918C50407d4925B31237b9271H9272C5209K766c80622E3140J64298a97555
$$ y = [60271, 39028, -192246, -11046, -34748, 106515, -44652, 44331, -36017, -182078, 279139, 59313, 261125, -122688, -26713, 106313, 24613, -22392, 143586, 152082, 171435, 292728, 35014, 276247, 9627, 94831, -146682, -170334, -351980, -167985, -356987, -89912, -114023, 25374, 88237, 84219, -54196, -3041, -72065, 87400, 96569, 75125, -116766, 63443, -101817, -62297, -480124, -17590, -39276, 226867, -104046, 312219, -350586, 163147, -39861, 46813, 249423, 18515, 182633, 25494, -87457, -130956, 21530, -162884, 17008, -119255, -184293, -187806, 53885, -42726, 30173, 277409, -208715, 391007, -196406, -160194, -68358, -296918, 350407, -44925, 231237, -29271, 89272, 35209, 37975, -380622, 53140, 217438, -197555]
15292A18611K2572D9336N2912l1999a29124A79161I300a53416f3372a7769D92636
15280A45642J4457A6469g3B01560n7330N8922L8660A20652J61764D2049R1010
15269A33059l6367R5630R5438a93331C24757d0077B0264c3728D83572F6145L6241
15258A02386J31487C494a8051C68934A64290a45236C69156o0583P9985N07482
15248H96040r3843Q9729L81764J56798o54057K78293m13117k05898k14232J27582
15238C49059j61997h603A15598K37665j36743b53156d7654F0945L9934b3394L451
15227a9943I2161K06185A2722J23830a91921E8174e6572D0891K40645b7572A7501
15215B99250j5651K35290f2335C22827a78248G2838f0159B46186k7909p8085a68390
$$ y = [118611, 141183, 49336, 102248, 70249, -129124, 179161, 9300, -153416, -63372, -17769, 492636, 145642, 160099, 16469, -73, 201560, 144230, 203152, 241812, 120652, 282416, 42049, 133059, 96692, 192322, 287760, -193331, 324757, -40077, 20264, -33728, 483572, 66145, 102386, 233873, 3494, -18051, 368934, 164290, -145236, 369156, 308573, 388558, 896040, 802197, 891926, 1273690, 1430488, 776431, 1054724, 641607, 435709, 221477, 349059, 187062, -8603, 115598, 353263, 216520, -253156, -47654, 60945, 100879, -23394, -19943, 92161, 298346, 12722, 136552, -191921, 58174, -56572, 40891, 281536, -27572, 17501, 299250, 283599, 518889, -62335, 322827, -178248, 72838, -60159, 246186, 218277, 140192, -168390]
15203H0401A9416K83404A03202J40876n213k9813A7474N9921M01885E720J82565
15192A88285d9267m306H6376p427b0427j32868I5454A5459h8653p1749A22742
15180A19206l5898J94732c6982G5662K58953J35696H8189R0798G4415L23613K4256
15169D22284A00854j8098R1095J36661G9415a30467E2180M28207E9494i9847B19280
15157D80873b24632B1959K65932b79558A59335K43613A11576O1286J36088g5823
15146C59980b32924I9887d8178B01205B238M8617J08979J78295H4396H394J72401
15135A80795p4538B7633K73017j15186J01022p5892l0462J06707h0856J7836I3710
15123b17686C10955P5442A01239K5240J09092C1614a89114B44505o3370K35456
$$ y = [80401, 19416, 302820, 103202, 244078, 238865, 209052, 17474, 77395, 479280, 5720, 188285, -49267, -53573, 86376, 78949, -20427, -153295, 95454, 15459, -88653, -160402, 122742, 119206, 83308, 278040, -36982, 75662, 334615, 470311, 88189, 178987, 74415, 398028, 422284, 100854, 82756, 173851, 310512, 79415, -130467, 52180, 480387, 59494, -99847, 219280, 480873, -224632, 21959, 287891, -279558, 159335, 402948, 111576, 172862, 308950, -75823, 359980, -232924, 99887, -48178, 201205, 2238, 50855, 159834, 338129, 84396, 8394, 180795, 106257, 27633, 300650, 185464, 286486, 210594, 180132, 286839, -80856, -63020, 93710, -217686, 310955, 386397, 101239, 126479, 235571, 31614, -189114, 244505, 181135, 416591]
15113D16591C4396J01052d0054o5963B68513L5761K17335B5853J81953F0856m348
15102E6508d2305B78852r2005Q7702m546q9006a16107k77590A54249E2291J69256
15091B21547h4913A85186J03702J04941m1132r3617b7934A40185J6755l0069J48834
15080B75705K16543C8535J79992K9870F1634J46337J83931e4587B63734J34324
15070C98058j41085g413B48645H5499O3450m8713P69j9262K61141A41339J56701
15059B98040D4322J37323K33750k9633a75823A92108h0447A91870E9680M8712
15049A08392J50298F4037J31890K86R1425L9824J99859A62805E7912L01099p4282
15038B84729q60A7654K07662O6377E9231K33487a4415E50163j95678j6506p6772
$$ y = [416591, 34396, 135448, -40054, -106017, 268513, 304274, 521609, 25853, 207806, 60856, 56508, -42305, 278852, 186847, 274549, 270003, 180997, -116107, -393697, 154249, 52291, 221547, -84913, 185186, 288888, 393829, 352697, 259080, -27934, 140185, 156940, 126871, 275705, 492248, 38535, 218527, 248397, 61634, 207971, 391902, -54587, 263734, 398058, 256973, -7413, 248645, 85499, 148949, 100236, 101005, 81743, 342884, 141339, 298040, 44322, 181645, 415395, 385762, -175823, 192108, -80447, 191870, 59680, 108392, 258690, 64037, 195927, 196213, 287638, 327462, 527321, 162805, 57912, 359011, 284729, 283869, 17654, 225316, 291693, 59231, 292718, -14415, 550163, 354485, 337979, 261207]
15027B61207J03360A71801j60B8258L73196A65425M72471b4752C88292H8542J53927
15016B42469J92150N885F9373K27679j01781k7739J79997A17359K65241q3494
15006B99106J03152A60461e3220B26881A03443J64105j29018K74288j05156q0102
14996B27560Q7143j17947J90078j83724Q5143O3888f3673D02510J24506k18062
14986C08954j53869J51631j37092K88373j28079b3660C88277B2017J11099L83985
14976E17101k40022B1893a16652E8672K60375j55647K060k502L03393j32459j55310
14965A78582B3060a3610A84929K25733j39741r7210G4420M08405j91100A09739
14954D07494D8314L21679J85591k61904l8798A23991B9390M40559n7888j43512
$$ y = [261207, 364567, 171801, 171641, 28258, 401454, 165425, 637896, -24752, 388292, 88542, 242469, 434619, 440504, 69373, 297052, 195271, 167532, 347529, 117359, 382600, 299106, 402258, 160461, -53220, 226881, 103443, 267548, 138530, 412818, 307662, 227560, 314703, 196756, 386834, 203110, 288253, 352141, -63673, 402510, 527016, 308954, 155085, 306716, 169624, 457997, 329918, -23660, 388277, 22017, 133116, 517101, 277079, 21893, -116652, 58672, 319047, 163400, 165460, 162958, 466351, 333892, 178582, 23060, -13610, 184929, 410662, 270921, 173711, 74420, 482825, 291725, 109739, 407494, 48314, 369993, 555584, 293680, 254882, 123991, 29390, 469949, 412061, 268549]
14944B68549M07873G7431M8940K9021J19181J24415N1017A82888L66865A61490
14933C13126o3428K43438A30810J08446O4844O7655p7951K25234j09849j53885
14923B55304A11351K47711N2741n4423m1320o6461J05421Q4022B00296G3365M37626
14912E10991A95928K36389a49498F32426k5670k2125k07202A23658J63539r4615
14902A92582J93887J9194r3834J62836A47279M07670p2303O7606B24750p8351
14892A46399J57467K2812P1706q1050M07290A76600R7140J82247k05968K50526
14882E00545J65524A73387J03935K7304L99710B75921j10155N00307B62164J94900
14872D57064j79620P8299j03683N1888O19673C97711J06300o0490k9610L20469
$$ y = [268549, 676422, 77431, 126371, 155392, 274573, 398988, 450005, 182888, 549753, 161490, 313126, 249698, 493136, 130810, 239256, 304100, 371755, 293804, 519038, 409189, 255304, 111351, 359062, 411803, 357380, 316060, 249599, 355020, 439042, 200296, 73365, 510991, 195928, 432317, -149498, 632426, 606756, 584631, 377429, 123658, 287197, 192582, 386469, 405663, 311829, 474665, 147279, 554949, 482646, 550252, 224750, 146399, 303866, 326678, 398384, 317334, 724624, 176600, 273740, 455987, 250019, 500545, 666069, 173387, 277322, 304626, 704336, 275921, 165766, 666073, 262164, 457064, 277444, 355743, 252060, 303948, 923621, 397711, 504011, 443521, 413911, 734380]
14862G34380j76426J0481p0796n2386P9136K33769j49582q4044j4988J12114A52572
14850G45516C38795R6421l7254L28715H7418N34758J44071k43350j25655N42090
14840I39332k85107j09893A59706M23880r7270j77599K08687L63869B18494O5457
14830B83951L8520L39955k99355K12676J71234B16661L09322J38416p4063j3171
14820E77165K79968B22305L76564j62472K24342k2921B69437M93263j53813O7863
14810F76750k17717J07109J1085K92232D12035K05677n8595m6886L17872C75033
14799G89809j65297k00792j2840J05564K81169k81172J90654j66544K58848j12193
14789F87206j25883j24325J06287K59392K9472j39378k19773j79779J90322K02472
$$ y = [734380, 557954, 568435, 497639, 445253, 524389, 758158, 608576, 524532, 509544, 621658, 152572, 745516, 338795, 435216, 397962, 726677, 87418, 622176, 766247, 522897, 397242, 939332, 654225, 544332, 159706, 583586, 486316, 308717, 517404, 881273, 218494, 283951, 322471, 662426, 363071, 575747, 746981, 216661, 525983, 664399, 590336, 577165, 857133, 222305, 598869, 436397, 660739, 637818, 269437, 762700, 608887, 676750, 459033, 566142, 577227, 869459, 412035, 617712, 559117, 512231, 830103, 375033, 789809, 624512, 423720, 410880, 516444, 797613, 516441, 707095, 540551, 799399, 687206, 561323, 436998, 543285, 802677, 832149, 692771, 472998, 293219, 483541, 686013]
14779F86013l38268K38466N5866J07834k49437j49565O60080r2576l20846J21366
14769G18933m8168R1096J85396k67158J77786j92797K4415o4576j05207J5845
14759E35565B53901J83794K16382j0386O7589J13506j5125j95431M7227J7080
14749F78537J10119j31603L8023k27309M98449k45416L64814n41476J01093K33073
14739H78304k74368j5162K84901l28256K72761q5621P6772J0862j96162m0211
14729E83820Q8908j15963L55759l64923N60898j05678C66458O25924J33770m78822
14719F47330J47169J71430k1379o9114K86137D51462L69026j72981K93924J26260
14709A067691J2894l81541J09197m1595n1097p1342K80003Q913j87061J57266
$$ y = [686013, 347745, 586211, 642077, 749911, 500474, 350909, 1010989, 918413, 597567, 718933, 670765, 761861, 947257, 680099, 857885, 665088, 689503, 624927, 519720, 535565, 253901, 437695, 654077, 643691, 711280, 824786, 809661, 614230, 661457, 678537, 788656, 657053, 695076, 467767, 966216, 720800, 1085614, 544138, 645231, 878304, 603936, 588774, 873675, 545419, 818180, 732559, 809331, 820193, 624031, 583820, 672728, 556765, 912524, 547601, 1108499, 1002821, 366458, 992382, 1126152, 647330, 794499, 965929, 944550, 875436, 1161573, 451462, 820488, 647507, 941431, 1067691, 1080585, 699044, 808241, 766646, 715549, 644207, 924210, 933123, 746062, 903328]
14699I03328J64202l4573R6614O537k36236K88741J19695l88574K97965l67955
14689H49744j2970J91808j13925p4349L44151k33924J003N562L6884R6915j67528
14678I23371K09894k25890J54262N6547K18288l00456j6862P5226K34090O5933
14668A394403j31178J87105j90424J58011k79628J25724O4008k87044j74887L61317
14658A227407R7435k60076P9884P2995j05750J71046q9335J00082m15789L45498
14648A223397N41444l47361o494K28312m68197J8108K2987L87761k87718j95249
14638A116990L26793M0268l4960J2248k34568N55697j82785j59897J18856k71135
14628A287507L15184j79746K54040j18163N70236l80591k94146L87587k37981
$$ y = [903328, 1067530, 1032957, 1129571, 1136108, 899872, 1188613, 1308308, 919734, 1217699, 849744, 836774, 1028582, 914657, 840308, 1184459, 950535, 951538, 957100, 993984, 1090899, 923371, 1133265, 907375, 1061637, 1118184, 1336472, 1036016, 1019154, 1094380, 1328470, 1394403, 1263225, 1450330, 1259906, 1417917, 1138289, 1264013, 1328021, 1040977, 866090, 1227407, 1324842, 1064766, 1144650, 1217645, 1111895, 1282941, 1193606, 1293688, 877899, 1223397, 1764841, 1417480, 1410986, 1639298, 1171101, 1189209, 1212196, 1599957, 1312239, 1116990, 1443783, 1484051, 1449091, 1461339, 1226771, 1782468, 1599683, 1439786, 1558642, 1287507, 1602691, 1422945, 1676985, 1558822, 2129058, 1748467, 1454321, 1841908, 1603927]
14619A603927m7788m4548K59973o0692j9596j82555J41351L6817J72484R0092
14609A949465j41557n2616K45689k23103j20857j10061J82954Q704L20296j40591
14599A918323l62967M26596p5908K15123k59115Q487L25905m1784k24437J7723
14589A947946m8968j58346L35659n3152J64595m22200N44069m03389J59072K08124
14579B273410p4447L44712k94978j00229L35025k17816m1492Q6774k30735J54825
14569B235049N56433j02517j65877j25083L72943O3621k37676M49376P5282j2163
14559C109388K39104k77651N59760m2576L13221N32741R12020J065065L723897
14550A0134969M413792J164061K122850L116381M557171O770318j0265937j0655487
$$ y = [1603927, 1556139, 1511591, 1771564, 1710872, 1691276, 1508721, 1650072, 1686889, 1859373, 1949465, 1807908, 1755292, 2000981, 1777878, 1657021, 1546960, 1729914, 1738618, 2058914, 1918323, 1555356, 1981952, 1906044, 2121167, 1862052, 1870539, 2196444, 2154660, 1930223, 1947946, 1898978, 1740632, 2076291, 2023139, 2187734, 1765534, 2309603, 1906214, 2065286, 2273410, 2198963, 2543675, 2248697, 2148468, 2483493, 2265677, 2224185, 2310959, 2080224, 2235049, 2791482, 2688965, 2523088, 2398005, 2770948, 2834569, 2596893, 3046269, 3121551, 3109388, 3348492, 3070841, 3630601, 3588025, 3901246, 4433987, 5346007, 6411072, 10134969, 14548761, 15712822, 17835672, 20952053, 25509224, 32279542, 22013605, 11358118]
14542A1358118m395619j718040j597829j172486k22405l30001K38960K23459J42881
14533B527038k23042J00991k8434J34799J57552j34605J44685j73878K59908j56096
14523B608918l12811O24839K1210k7163k90337K14052O5798o3250J92545j55752
14513B878049j32882K03869K59732J17065o6928k87003K86364j27980n1785K85233
14503C363734o5953L6103j48223J04478J81044M0462M72347p82942L82567m6534
14493C537083M4875R572n6389M19255m10638K71243J13232m0120J85373P7165
14483D150651k26922K86516O8271j22719J54058M6064R2593j11905M10072m67842
14473D278837j16074K44357K55986k42200J00857J58044q8368J44431K43702K01690
$$ y = [11358118, 6962499, 5244459, 3646630, 2474144, 2251739, 1921738, 2160698, 2384157, 2527038, 2303996, 2404987, 2376553, 2511352, 2668904, 2534299, 2678984, 2505106, 2765014, 2608918, 2296107, 2920946, 2942156, 2914993, 2624656, 2838708, 2904506, 2841256, 3033801, 2878049, 2745167, 2949036, 3208768, 3325833, 3258905, 2971902, 3258266, 3130286, 3078501, 3363734, 3297781, 3333884, 3185661, 3290139, 3471183, 3511645, 3983992, 3201050, 3583617, 3537083, 3581958, 3591530, 3535141, 3954396, 3543758, 3815001, 3928233, 3888113, 4073486, 4150651, 3923729, 4210245, 4278516, 4155797, 4309855, 4355919, 4448512, 4336607, 4746679, 4278837, 4162763, 4407120, 4663106, 4420906, 4521763, 4679807, 4591439, 4735870, 4979572, 5181262]
14463E181262l71215K90245J2709J54918P7290j43731K47311j5458K94312J0277
14453E737920N5948m4922j23601K42393K72180j61486M044K33547j58041O42318
14443F700300k64526n9025L20656o2835M8165K1941K40369J13028K15056k06538
14433G066591J87626l68017R04028l66314J61702P5140K40638r668N2705K65205
14423H209636m175J2450O0142N79206k72288n9090K94797M96290K616K49223m24421
14412I144386L65932K87389N54983l16852J43733J75434K51225j66678O83350
14403A1122902j94579K82060K35015L84383O9702J41144j18968K75259K4398N69550
14393A2790866J90321j8314O62120j19952N07798R0628K48413M77423l0031K24562
$$ y = [5181262, 4810047, 5100292, 5113001, 5267919, 5345209, 5201478, 5448789, 5433331, 5727643, 5737920, 5793868, 5748946, 5625345, 5867738, 6139918, 5978432, 5982476, 6216023, 6057982, 6700300, 6435774, 6376749, 6697405, 6634570, 6682735, 6704676, 6945045, 7058073, 7273129, 7066591, 7254217, 6886200, 7790228, 7423914, 7585616, 7660756, 7901394, 7891726, 7944431, 8209636, 8205461, 8217911, 8278053, 8857259, 8584971, 8525881, 8820678, 9316968, 9319584, 9568807, 9144386, 9510318, 9797707, 10352690, 10035838, 10179571, 10355005, 10606230, 10439552, 11122902, 10928323, 11210383, 11445398, 11829781, 11899483, 12040627, 11921659, 12196918, 12221316, 12790866, 12981187, 12962873, 13624993, 13505041, 14012839, 14103467, 14351880, 14829303, 14799272, 15023834]
14383A5023834K96122N85958j0605M46096K53656K75249M72584K77158K76888
14374A7896940M2847N96568L20532O50626L94871L76707M43963K46729O04624
14365B1574407O27619J28247L3675R73276M08174O04245M54876N73986J151214
14356B6529719L59383K59705O69078O10966Q53661O31390R22566L93871R84553
14347C2214892O18053J469467M02390J052971Q38551J029586J202599Q07584J269057
14338D0905150R45389R92990J399973J775637J190515J652128J255553J855724
14330E1973059J350203J743838J470521K114267J903699J748396K536306K030267
14322F6870556K570829K353028K711450K398185L030187L032195L558155L170435
$$ y = [15023834, 15319956, 15905914, 15895309, 16341405, 16595061, 16870310, 17342894, 17620052, 17896940, 17939787, 18536355, 18856887, 19507513, 19902384, 20279091, 20723054, 20969783, 21574407, 22202026, 22330273, 22363948, 23337224, 23745398, 24349643, 24804519, 25378505, 26529719, 26889102, 27148807, 27817885, 28428851, 29282512, 29913902, 30836468, 31230339, 32214892, 32832945, 34302412, 34704802, 35757773, 36596324, 37625910, 38828509, 39636093, 40905150, 41850539, 42843529, 44243502, 46019139, 47209654, 48861782, 50117335, 51973059, 53323262, 55067100, 56537621, 58651888, 60555587, 62303983, 64840289, 66870556, 69441385, 71794413, 74505863, 76904048, 79934235, 82966430, 86524585, 89695020]
14314H9695020L348724M143410L709800M343287M390872M577238M976874N051603
14306A24236828N488302O166878N995620O846272O834839P280044P996542Q077198
14298A78922523R026986R174701J0110085R994063J0944592J1441067J2509823
14291B52123840J2627968J3068532J4399833J4021878J5085864J5327269J5687492
14284C52342676J6059675J6012484J6101397J5889641J5615219J4940730J3403774
14277D60365596J1805068Q223039n113275j6983832n906321J21793K905204O066637
14269D61483909R400422J598831o707316o454725j0194192j2411095j3214836
14262D23500998j4660619j5552666j6067924j6478715j6681899j6493594j6121061
$$ y = [89695020, 93043744, 97187154, 100896954, 105240241, 109631113, 114208351, 119185225, 124236828, 129725130, 135892008, 141887628, 148733900, 155568739, 162848783, 170845325, 178922523, 187949509, 197124210, 207234295, 217228358, 228172950, 239614017, 252123840, 264751808, 277820340, 292220173, 306242051, 321327915, 336655184, 352342676, 368402351, 384414835, 400516232, 416405873, 432021092, 446961822, 460365596, 472170664, 480393703, 475280428, 458296596, 452390275, 452512068, 455417272, 461483909, 470884331, 472483162, 465775846, 459321121, 449126929, 436715834, 423500998, 408840379, 393287713, 377219789, 360741074, 344059175, 327565581, 311444520]
14255C11444520j5724624j4780418j4007950j3056664j2625293j2255784j1418471
14248B17575316j0734326j0296809r295336r372081q250266p795056p315175p092509
14240A47423758p118686n685615o526253n402928m856967n211011m596527m392775
14232A03632996m313404l684258l401125l598737l309361l292897l438649l146459
14224G5448106k182979k665023k476204k201662k295034k339553j979028k044942
14216E7263681j505789j816379j524812j464671j700530j492701j140172j500554
14208D5118073j025985j481524r41685j169616j157741j104381j143645r23674
14200C6169822q80874q87508j026359r12848m13771r39117q75931m41755j160607
$$ y = [311444520, 295719896, 280939478, 266931528, 253874864, 241249571, 228993787, 217575316, 206840990, 196544181, 187248845, 177876764, 169626498, 161831442, 154516267, 147423758, 140305072, 134619457, 128093204, 122690276, 117833309, 112622298, 108025771, 103632996, 99319592, 95635334, 92234209, 88635472, 85326111, 82033214, 78594565, 75448106, 73265127, 70600104, 68123900, 65922238, 63627204, 61287651, 59308623, 57263681, 55757892, 53941513, 52416701, 50952030, 49251500, 47758799, 46618627, 45118073, 44092088, 42610564, 41668879, 40499263, 39341522, 38237141, 37093496, 36169822, 35288948, 34401440, 33375081, 32462233, 32048462, 31109345, 30233414, 29791659, 28631052]
14191B8631052o10972p74615l14852q54650n23080n60584q18489l63680o62201
14182B3147929m17173n46339J40623n36428q08048n27708l14078l42823k87297
14173A9508658l84994q35183Q3979n67333k14716m59338q8311q39420j86900j48855
14163A5867587k88670n1014l72321j36513n60376j55029j82358K31175m92924
14154A3859557j96884j47157m38536J74496o70718l84421K1756q895k67303q2673
14144A1859222n77447j02734R8648l34285K30491n35116R7862o03672k0527L4587
14134A0147029j79206O811m55447k3013P2745k33420l13704l9092K1597l08838
14124H695462P5686k34981l17629L57431k05027j40655l49352K3000k86849J71466
$$ y = [28631052, 28020080, 27245465, 26930613, 26075963, 25552883, 24992299, 24173810, 23810130, 23147929, 22730756, 22184417, 22325040, 21788612, 20980564, 20452856, 20138778, 19795955, 19508658, 19123664, 18288481, 18372460, 17805127, 17590411, 17131073, 17042762, 16203342, 16016442, 15867587, 15578917, 15527903, 15155582, 15019069, 14458693, 14303664, 14121306, 14352481, 13859557, 13662673, 13515516, 13076980, 13251476, 12580758, 12196337, 12218093, 12209198, 11941895, 11859222, 11281775, 11179041, 11277689, 10943404, 11173895, 10638779, 10736641, 10132969, 10112442, 10147029, 9967823, 9974634, 9519187, 9496174, 9568919, 9335499, 9021795, 8982703, 9004300, 8695462, 8771148, 8536167, 8218538, 8575969, 8370942, 8230287, 7880935, 7903935, 7617086, 7788552]
14114G788552l19359J40117j97203l03569K11963M2299m35657J93582l76153L2967
14104F777539n06138L09908L3259l15437K14944k81142j09620L325j20390P2449
14094F078697r4593j90854J6822j85933m0399j32701L27090P6727l77875l8400
14084E438581j85204J94769j17441m28791O42973l00277k73416n2865j80751L5661
14074D773239J03464j87724N8348K3570r4609k52944K56524K0865k35553l88015
14064D077165M23793j85402m9449k13907K74103l34741K74566j77185r4291J93159
14054D187811Q472n26692p1407J54132k14827L00246l98238J11556N5331K11159
14044C817543o51266M54061k99780K57763k4238k00821Q6168R0479l53906J51989
$$ y = [7788552, 7469193, 7609310, 7412107, 7108538, 7320501, 7362800, 6927143, 7120725, 6744572, 6777539, 6271401, 6581309, 6614568, 6299131, 6514075, 6232933, 6123313, 6126638, 6006248, 6078697, 5984104, 5793250, 5810072, 5624139, 5583740, 5451039, 5778129, 5854856, 5476981, 5438581, 5253377, 5448146, 5330705, 4901914, 5544887, 5244610, 4971194, 4918329, 4737578, 4773239, 4876703, 4688979, 4747327, 4770897, 4676288, 4423344, 4679868, 4700733, 4465180, 4077165, 4500958, 4315556, 4266107, 4052200, 4326303, 3991562, 4266128, 4088943, 3994652, 4187811, 4196283, 3669591, 3598184, 3752316, 3537489, 3837735, 3439497, 3551053, 3606384, 3817543, 3166277, 3620338, 3320558, 3578321, 3554083, 3353262, 3439430, 3529909, 3176003, 3327992]
14034C327992r283j92356K27156K38065k10139m8639o43635J62314K92645K42044
14024C386164m08701p7926k83004J74550j57746K18278o25633N77893Q2987j09579
14014B777283k18754R0915J60963l57931P7439o4998J69338o06410O27761n29570
14004B126036R6982R5149R6494J56945l20633J22164n4017J14896R4175l30538
13994B197653N22645k22560J095725K669514M815014J817783J674202K409649
13986A6979625N094615Q662609m526815j1100714o568572k007407j386636m88817
13978D657888r38800k79401j43163m98902K18590k48911j65601p2505R8807J30314
13968B758316o03693m05L69995q1644l21095K99714J88908m39215m5109M81879
$$ y = [3327992, 3318709, 3126353, 3353509, 3591574, 3381435, 3332796, 2689161, 2851475, 3144120, 3386164, 2977463, 2899537, 2616533, 2791083, 2633337, 2851615, 2225982, 2803875, 2886862, 2777283, 2558529, 2649444, 2810407, 2452476, 2529915, 2464917, 2634255, 2027845, 2655606, 2126036, 2223018, 2318167, 2414661, 2571606, 2250973, 2373137, 2319120, 2434016, 2528191, 2197653, 2720298, 2497738, 3593463, 6262977, 11077991, 12895774, 14569976, 16979625, 22074240, 30736849, 26210034, 15109320, 8540748, 6533341, 5146705, 4657888, 3719088, 3439687, 3296524, 2797622, 3016212, 2767301, 2601700, 2529195, 2628002, 2758316, 2154623, 2154218, 2524213, 2442569, 2121474, 2421188, 2610096, 2170881, 2125772, 2607651]
13958B607651o57403N7200N1239J3626j37332N9438K27320j77062r6002J58077
13948B106752K64166m67591R0167j86381l16900M34234k42346J48953j2543J64605
13938A983116j35403K33765k70715l61478N35624J41877m66303r2853J33235K32075
13928A932940k0802k11440n8649N599k7438L3559j51089K23084k93798j66569
13918A265397J82575K3218P8473L2532n0619L5234k59137L75852k08859J05388
13908A580054j50124J11973J23421j01503k51551J13841l6855j89711k294J73680
13898A370931k06268J6684K70251q5428n4186J48180l3692k6976r7120M11309
13888A713685m23766R2940j06961j9763k25187P1855K90053n2754j95514K2497
$$ y = [2607651, 1950248, 2007448, 2058687, 2072313, 1934981, 1994419, 2221739, 2044677, 1948675, 2106752, 2370918, 1903327, 1993494, 1807113, 1490213, 1924447, 1682101, 1831054, 1818511, 1983116, 1847713, 2081478, 1810763, 1449285, 1984909, 2126786, 1660483, 1567630, 1700865, 1932940, 1912138, 1700698, 1642049, 1647648, 1620210, 1653769, 1502680, 1725764, 1431966, 1265397, 1447972, 1471190, 1549663, 1582195, 1531576, 1566810, 1307673, 1683525, 1474666, 1580054, 1429930, 1541903, 1665324, 1563821, 1312270, 1426111, 1389256, 1199545, 1197251, 1370931, 1164663, 1181347, 1451598, 1366170, 1311984, 1460164, 1426472, 1399496, 1302376, 1713685, 1289919, 1382859, 1275898, 1256135, 1030948, 1102803, 1392856, 1340102, 1144588, 1167085]
13878A167085r723n5407K57436l30306L2432K94180O871k61854J59322j37675
13868A122361J82306l59628r5686M52098m6738l19926N3643J35696J28196j74626
13858A077696J01750k6947k00653O52770p75835K90484k29323K34480N8131N5659
13848A238212J33155l29446P4354n20321N25327K00166k98037K55269l59091K69259
13838A188847j96586J50434K8965j97571j01317K92890n49927r3726K72040M97774
13828A291823k27492j07113K03874k45825N9358R2867l00723O6817j73796L41701
13818A001491K13112r2427K49337m40543k5979J76234j25566K26395m41417J36972
13808H77609K0026p6479K62612k07366j28162J47222J48774q9138l01692j58088
$$ y = [1167085, 1157362, 1101955, 1359391, 1029085, 1061517, 1355697, 1362568, 1100714, 1260036, 1122361, 1304667, 945039, 849353, 1301451, 1254713, 934787, 988430, 1124126, 1252322, 1077696, 1179446, 1152499, 951846, 1604616, 828781, 1119265, 889942, 1124422, 1182553, 1238212, 1371367, 1041921, 1116275, 595954, 1121281, 1321447, 1023410, 1278679, 919588, 1188847, 992261, 1142695, 1171660, 974089, 872772, 1165662, 615735, 522009, 794049, 1291823, 1064331, 957218, 1161092, 915267, 974625, 1067492, 766769, 833586, 659790, 1001491, 1214603, 1122176, 1371513, 930970, 904991, 1081225, 955659, 1182054, 740637, 877609, 897635, 821156, 1083768, 876402, 748240, 895462, 1044236, 955098, 653406, 495318]
13798D95318M94829m24586J59371j98124n5038K53792p7269p4429J61373m6070
13788F89167N7249J45525J11563j44052j80488j05587m8262J89129M3132k01447
13778E55929M2836K01116K61r9995B81921M03190R3562j73434J11329J00794l9946
13767G77416j72564P425K91686J15222k86644J3822P164j21802j63943j49430
13757C18352L23104J34197K26502K1020K8629n08651R6242k2729j42588m1173
13747D32905M21506C86188J4681M469J93416n3361A77967L68091O5931J68621
13737G80610j52759J71210k02009L353B38411L41721R8150K36914l17631p9575
13727E17990L91905k42286K47961C18068N89260l26723L29796p8362j26135k62387
$$ y = [495318, 990147, 565561, 724932, 526808, 471770, 725562, 648293, 573864, 735237, 689167, 746416, 891941, 1003504, 859452, 678964, 573377, 525115, 714244, 757376, 555929, 598765, 799881, 800142, 700147, 281921, 685111, 778673, 605239, 716568, 817362, 777416, 604852, 612277, 903963, 1019185, 732541, 746363, 753527, 631725, 467782, 318352, 641456, 775653, 1002155, 1023175, 1051804, 543153, 639395, 616666, 474078, 432905, 854411, 386188, 400869, 405338, 598754, 545393, 177967, 546058, 611989, 780610, 627851, 799061, 597052, 600405, 238411, 580132, 678282, 915196, 597565, 517990, 909895, 667609, 915570, 318068, 907328, 580605, 910401, 832039, 705904, 443517]
13717D43517M23863J0952C76259J18704j01559O88146m36879k69633L71931l29941
13707D17028M2544p0724J74761L77270k65119j26711M7776o8406O7778j7630r4328
13696D84239J59133C00286L11558L0697O7088k71592j67894M06082B47942M23759
13686F71701r3290A29374R7283p1261M45172J8610N9317k11709m6330J42927B63888
13674C40117J46964j54618L51255B74511O0426K76759q9154j81051L90429k43091
13664D88829K9517B37626k4275P6995K16287j92225P9911N5612j82602J70530
13654D37859j04343L57814j19812R0748j31659J11485B54856r639k4969L83904
13644F04152B56301M93657l16181N7146J69000B58823L17953k53659N7104K71074
$$ y = [443517, 867380, 878332, 376259, 494963, 393404, 1081550, 644671, 375038, 746969, 417028, 459572, 388848, 563609, 940879, 675760, 549049, 596825, 528419, 596197, 578567, 484239, 643372, 300286, 611844, 642541, 709629, 438037, 270143, 676225, 247942, 671701, 578411, 129374, 226657, 155396, 600568, 619178, 678495, 466786, 420456, 563383, 263888, 340117, 487081, 332463, 683718, 274511, 334937, 611696, 522542, 341491, 731920, 488829, 518346, 237626, 213351, 290346, 506633, 314408, 394319, 449931, 267329, 437859, 333516, 691330, 571518, 662266, 530607, 642092, 254856, 245217, 220248, 604152, 256301, 749958, 433777, 490923, 659923, 258823, 576776, 323117, 380221, 651295]
13634F51295j91372J92749B44954Q2415j16113N6641M56580k78478M8972B41987
13623H85849C88557J69742B49443O4855j46975L61072m2868k8832A95867N28197
13613G24064C34463M6747K1795A25400J45091o7789L72300k04877o371J3261o1282
13602C15733K7709J66293j07497j87613J26004o6191P9233R159P1296j58975K02274
13591D77425j54775j23525p8531L66299j04941Q9225D5387O0712N18207B46944
13580B61382J88490J1009j56641l6732p7611M11884k24830J82705F4166M91044
13570E55210A88320J79113n5068L19022j14234j49102j80342L2471r7324M59766
13560E82622B38233L36131B76091r5162G7316N30719j77026B13666N37355j52150
$$ y = [651295, 459923, 652672, 244954, 327369, 211256, 267897, 724477, 445999, 494971, 241987, 885849, 388557, 558299, 249443, 314298, 167323, 528395, 485527, 456695, 195867, 724064, 334463, 381210, 403005, 125400, 270491, 202702, 575002, 370125, 363754, 377015, 315733, 343442, 509735, 402238, 214625, 340629, 274438, 353671, 362830, 434126, 275151, 477425, 322650, 199125, 120594, 486893, 381952, 471177, 45387, 106099, 624306, 246944, 261382, 449872, 460881, 304240, 267508, 189897, 601781, 376951, 559656, 64166, 555210, 188320, 367433, 312365, 631387, 517153, 368051, 187709, 220180, 122856, 582622, 238233, 574364, 276091, 180929, 77316, 608035, 431009, 213666, 751021, 598871]
13550E98871j44722A26836K72351j6281p9168l8419r1836J60801j24890K6522
13540B35916h5942D71530i8426E48648B01165l7915G6362K07740J27671A24060
13529C80045A66812L19354A36907L98868j46502o5054A14839j6858L581a14926
13518I6424K66033P8847A93801p1637N4251D873L71995A86504R1792k6514L4163
13507B85945J07930C7138N0824J12650N41542C64300J25714B11521K51659j26509
13497C36671L6048A50825J44181j15507p1569e1363F2943M95681k23848B2561
13486B71839c3136B50058A23576J30946L66577B48201q5816C6429J59040K58575
13476D54044G7075M60032k37625l5290j3038L03568p1989E7607L38258r0441j22076
$$ y = [598871, 454149, 126836, 399187, 382906, 303738, 265319, 173483, 334284, 209394, 235916, -85942, 471530, -98426, 548648, 201165, 163250, 76362, 284102, 411773, 124060, 380045, 166812, 486166, 136907, 535775, 389273, 324219, 114839, 97981, 101562, -114926, 96424, 362457, 441304, 193801, 122164, 176415, 4873, 376868, 186504, 278296, 251782, 285945, 393875, 37138, 87962, 200612, 742154, 364300, 490014, 211521, 463180, 336671, 372719, 150825, 295006, 179499, 107930, -51363, 62943, 558624, 334776, 22561, 271839, -33136, 250058, 123576, 254522, 621099, 248201, 162385, 36429, 195469, 454044, 77075, 537107, 299482, 264192, 251154, 554722, 482733, 57607, 395865, 305424, 183348]
13465A83348l4642K721L32933c2074F90361F4096N90092B09290k8390b06289D4861
13453i3168B98063j34896l9013M10374A14104J87004P8857p9959J69132m3413
13443D25725a9663A85637J50811A34692A5457J07862K32708M6560j09944C3172
13432C10024O8359l286C671K11009D8259N2515L48190K4559j84445o7004J49683
13421C71757J83943A73513b22576B42776A1852b38622g3830C12643j02643n9160
13411A50840a21888D72620A50497G4125J18359L62105A27928K33567k3379H9390
13400D78031j85710e9801B12336e2616n277B16550n1344G1601f8294H1494c95206
13388A95742k1254A43J34798j1531J79913q544J63359R4826k48362H7515K45400
$$ y = [183348, 148706, 151427, 484360, -32074, 690361, 64096, 654188, 209290, 180900, -206289, 44861, -93168, 298063, 163167, 124154, 534528, 114104, 301108, 379965, 300006, 469138, 425725, -19663, 185637, 336448, 134692, 15457, 123319, 356027, 402587, 292643, 33172, 310024, 378383, 375097, 3671, 214680, 48259, 100774, 448964, 473523, 289078, 222074, 371757, 555700, 173513, -222576, 242776, 11852, -238622, -73830, 312643, 210000, 150840, -121888, 472620, 150497, 74125, 192484, 554589, 127928, 361495, 338116, 89390, 478031, 292321, -59801, 212336, -52616, -57893, 216550, 165206, 71601, -68294, 81494, -395206, 195742, 174488, 143, 134941, 123410, 303323, 294779, 458138, 552964, 304602, 87515, 332915]
13377C32915E7575e5509I7664J81187G2490N49498B43822J87770j05885Q8253
13367D13960p8574a5900D10590j42180r531a1531C69023a0050B16562K1421j2994
13356B24989A02342K1615l4189K14062A8199J08752J80144J05093G997M19616
13346D27613j90725J84432j88944m220K10337p861k12688C7288J17862K32991
13336C88141K3627j25356A37291c4522q062D06626a218F964L93927k6408a53250
13324a23106C15675B1608J36908J56838j42348J47029A27048k0106K4026J40340
13314B71308n5838J54429j65658J36806A40823P2088p3378O7860K38317A84521
13303B7194J98762a90264A89436n9546d1794B66740A02730d7784B13117M4508
$$ y = [332915, 57575, -55509, 97664, 278851, 72490, 621988, 243822, 431592, 325707, 413960, 335386, -15900, 410590, 268410, 258879, -11531, 369023, -10050, 216562, 237983, 224989, 102342, 123957, 89768, 303830, 18199, 126951, 307095, 412188, 7997, 427613, 236888, 421320, 232376, 228156, 438493, 430632, 217944, 37288, 155150, 388141, 411768, 286412, 137291, -34522, -42584, 406626, -1218, 6964, 400891, 374483, -153250, -123106, 315675, 21608, 158516, 315354, 173006, 320035, 127048, 106942, 130968, 271308, 215470, 369899, 204241, 341047, 140823, 212911, 139533, 207393, 445710, 184521, 27194, 225956, -190264, 189436, 129890, -41794, 266740, 102730, -47784, 213117, 257625]
13293B57625D6166K27225a96709A86387i3166q4654B43503H583J0540J26868k7138
13282A18853E4084L5745L74252A71950a22365A62679N4812P1502l3379p5128j9969
13271A60517b62988A35562B9391J30816K8913p0268J28138b54601A39378J50867
13261B90245j3570e033B14922a61273A89636J11379H0684a99706A75363D2408
13250B0598J7844d4200D55753j27081G7205c8799A15511a03504A16177a87193
13239A83233K51207n1885r9081c22313a13074G5548C2954R6182J49520N051A2559
13227E4697f6972C35541c42869h3598A01057K65547A48076n5764L83345A23652
13216F3468J83829A21228L06007j69431c3316B81913j26937a60722A16026K8080
$$ y = [257625, 46166, 273391, -196709, 186387, -93166, -177820, 243503, 8583, 19123, 145991, 118853, 54084, 89829, 464081, 171950, -122365, 162679, 217491, 288993, 255614, 180486, 160517, -262988, 135562, 29391, 160207, 189120, 118852, 246990, -254601, 139378, 290245, 276675, -5033, 214922, -161273, 189636, 301015, 80684, -199706, 175363, 42408, 20598, 38442, -44200, 455753, 328672, 77205, -38799, 115511, -103504, 116177, -187193, 183233, 434440, 382555, 283474, -322313, -113074, 75548, 32954, 129136, 278656, 283707, 12559, 54697, -66972, 335541, -342869, -83598, 101057, 366604, 148076, 92312, 475657, 123652, 63468, 247297, 121228, 427235, 257804, -33316, 281913, 154976, -160722, 116026, 144106]
13206A44106F8246a42977A17091Q3902a8171k5280k8768r2582B90646A40345K44996
13195C85341G067M19700E8506e4208a0691A65116a98179K2049C31776A9429h6980
13183i2223n5746C14812A01102B7295f034I2921k7415J83574b52975A05729K02254
13172C07983G752b238q659j97797A20159f9160n6285B5574c03668b6349A3223
13160B20830p5883c652m1325A45581M64757F8367J08035N1256B0839N1959a4534
13148a86553A49229B8395b9592G3570K2868l485L0811k8769i6620D2468i4914
13136B14248M4133H2399j6034l380a66493A80937J00866g332C22568e9956l8313
13125i8269I5625Q8420o0152K40727m9105b0199R643k5304A97129b23729J7348
$$ y = [144106, 68246, -142977, 117091, 200993, -18171, -43451, -72219, -164801, 290646, 140345, 385341, 7067, 426767, 58506, -54208, -10691, 165116, -198179, -176130, 331776, 19429, -86980, -92223, -147969, 314812, 101102, 27295, -6034, 92921, 65506, 249080, -252975, 105729, 307983, 7752, -2238, -10897, -208694, 120159, -69160, -125445, 25574, -303668, -26349, 13223, 220830, 144947, -3652, -44977, 145581, 610338, 68367, 176402, 227658, 20839, 72798, -14534, -186553, 149229, 28395, -29592, 73570, 96438, 92953, 123764, 94995, -96620, 42468, -94914, 214248, 258381, 82399, 66365, 62985, -166493, 180937, 281803, -7332, 322568, -59956, -98269, 95625, 184045, 123893, 364620, 315515, -20199, -10556, -35860, 197129, -223729, -206381]
13114b06381a7662B01518a29437D2494J0813N9177B7029L0837a18641F3769M838
13103F8607k4973e2396A50735k4789m892n9141b4091j9849G5233a23565A74432
13091F9615J86872a5668q4323m6993E5591b43505C78512G2493J8988N2617j0482
13080A33616a14815E8434K78188j25998n6691N2723J27574a10248M6834k5584
13070h8998B62991A01207J415f8134A70543f516A98413j2121p6454a37871o1092
13059a98963N6231A34389R1670a1488B0970J06355a91618f9620C10791A2904h5054
13047A43548k7200j4659J40441k4374J72521I2505Q4008L4361g558D585J43960
13036A48545C7156L134L96173A19622K31564j04795a11267B41175a87487C48691
$$ y = [-206381, -17662, 201518, -129437, 42494, 53307, 112484, 27029, 57866, -118641, 63769, 68607, 43634, -52396, 150735, 125946, 121054, 61913, -24091, -43940, 75233, -123565, 174432, 69615, 256487, -15668, -99991, -146984, 55591, -243505, 378512, 72493, 91481, 144098, 133616, -114815, 58434, 336622, 210624, 153933, 206656, 334230, -110248, -63414, -88998, 262991, 101207, 102622, -68134, 170543, -6516, 198413, 186292, 109838, -137871, -198963, -142732, 134389, 226059, -11488, 20970, 127325, -191618, -69620, 310791, 12904, -85054, 143548, 116348, 101689, 242130, 217756, 390277, 92505, 176513, 210874, -7558, 4585, 148545, 37156, 40290, 436463, 119622, 351186, 246391, -111267, 241175, -187487, 348691]
13025B73640F3814J86432p5543J21159a38123k72449G6291L26954A65028a7043
13014D20152E7566G947b25006A30416a24625G9876a7671H4924B0407J20965J15696
13003B57068b2182n9274b6735A51566P4415N2090j17329K6429k2270M5830G8934
12991A91401A3087K61003A23547e8766j765D12256f1238B02421n6816P6994I1401
12979a29999B74519j31838a29029B87460A27687b1843C9461g3040H8181J73148
12969B61329A22641K03206C2267L10817J14721C7449d8714B30637C4549Q2978
12959A17527C3198b80988B67931b61960B95044j24898F9758a91560B71638A01888
12948c1334I9713e9860B25738h0149A26210O5876o7303C179L18722h2821B7051
$$ y = [273640, 63814, 250246, 174703, 295862, -138123, -410572, 76291, 403245, 165028, -17043, 420152, 57566, 7947, -225006, 130416, -124625, 79876, -17671, 84924, 20407, 141372, 257068, -22182, -81456, -26735, 151566, 225981, 278071, 160742, 187171, 164901, 210731, 78934, 191401, 13087, 274090, 123547, -58766, -60531, 412256, -61238, 202421, 145605, 222599, 91401, -129999, 274519, 142681, -129029, 287460, 127687, -21843, 39461, -73040, 88181, 261329, 122641, 325847, 32267, 343084, 457805, 37449, -48714, 230637, 34549, 117527, 33198, -280988, 267931, -261960, 295044, 170146, 69758, -191560, 271638, 101888, -31334, 99713, -59860, 225738, -80149, 126210, 192086, 124783, 3179, 321901, -82821, 27051]
12936a5190A62272h7915D1836M0468j1570b02395D9230b3811B38971B0850J91311
12925B12161a26724k1526A61018a30236A65052E9197c6319j62140f14k39522A32883
12913B40200j12363J11754f2789j03831B40761b28654L7688g1830A29495f8500
12902A56595c1848J0926A48950f4025n4152j65445b2939A00372a64081D7848N4575
12891A02423k747o744A8040J20665o1649J67913a23005H2414a7110j49813C7733
12879C3915a09879k08960A41396j7730G989J4186K61216A03744c3011r4382A50675
12867a06040j09126A29636c25309C46688e3988B18482C7846f2990C69117J9245
12857C88362E4490c57352B19942O0613j15532h5887j25022A46891J19942l3758
$$ y = [-15190, 162272, -87915, 41836, 82304, 70734, -202395, 49230, -23811, 238971, 20850, 212161, -126724, -148250, 161018, -130236, 165052, 59197, -36319, -198459, -614, -240136, 132883, 240200, 127837, 239591, -62789, -166620, 240761, -228654, -190966, -71830, 129495, -68500, 156595, -31848, -20922, 148950, -64025, -118177, -283622, -22939, 100372, -164081, 47848, 102423, 99676, 92932, 18040, 138705, 77056, 244969, -123005, 82414, -17110, -166923, 37733, 33915, -109879, -318839, 141396, 123666, 7989, 22175, 283391, 103744, -33011, -127393, 150675, -106040, -215166, 129636, -325309, 346688, -53988, 218482, 37846, -62990, 369117, 388362, 54490, -357352, 219942, 280555, 165023, -85887, -210909, 146891, 266833, 233075]
12847B33075c94631J41640A61992K70849a0493j20024c2185B59906A07022f4362
12836A53727a10436k45480C63116j20762h3939F7999A1071R108Q5115K6178j6349
12825A15123a93124a8494A64066o6118h8369C5782R7700J85844l2608a99779B25066
12813i745B1955K02986a38686o4380A74393L7904a49369A87353F3050h9066F6233
12801D34463j94466J70789F1777c78260c0638j07586B90771a74961A50826Q6990
12791B37816M697A9433c422q1572E5223b12592C7418K67603A18899e570A84627
12779A13093R6932b46420A35973a0739F0499K92107g7050E1353K05593c39454
12768C7404g9287C08374c8180C01924d093B18419M0741B0457a92947N6696l0256
$$ y = [233075, -394631, -252991, 161992, 432841, -10493, -130517, -32185, 259906, 107022, -64362, 153727, -110436, -355916, 363116, 242354, -83939, 67999, 11071, 20179, 105294, 131472, 115123, -193124, -18494, 164066, 97948, -88369, 35782, 133482, 319326, 286718, -199779, 225066, -9745, 21955, 224941, -138686, -203066, 174393, 212297, -149369, 187353, 63050, -89066, 66233, 434463, 239997, 410786, 61777, -378260, -30638, -138224, 290771, -174961, 150826, 237816, 242513, 19433, -3422, -84994, 55223, -212592, 37418, 305021, 118899, -5570, 184627, 113093, 210025, -246420, 135973, -10739, 60499, 352606, -77050, 51353, 256946, -339454, 37404, -79287, 308374, -38180, 301924, -4093, 218419, 259160, 20457, -192947, -136251, -166507]
12757a66507m904B08540a81759l9875B87025a54j38194c4293A12898l3007a52696
12745G7382O1300b49575A96820J32496b51429q2322g6784A86066b13932D18630
12734f7562A62836b7347A56187K0162L50828B05195a68193B07533K3431c9215
12723A14760c5066m06006a56498b5017l8413l0567D1074J26909J43380a09088
12712c5821K077A30533h9372B65185M12108A13580H399d5490C43741j51110K9494
12701B22125o1313a02226d1392B41132n5929L0145l7075P3558m5882g3135p752
12690h0887B66263j03071a11221A63161F2880K37914a17588A99542h9984K6326
12680f3658D28736A08617C109J0132R8293J01368R6706H647a3747A14469J52445
$$ y = [-166507, -171411, 208540, -181759, -221634, 287025, -154, -138348, -34293, 112898, 79891, -152696, 77382, 138682, -249575, 196820, 329316, -251429, -333751, -76784, 186066, -213932, 418630, -67562, 162836, -27347, 156187, 176349, 527177, 205195, -168193, 207533, 230964, -39215, 114760, -35066, -441072, -156498, -25017, -63430, -93997, 41074, 167983, 311363, -109088, -35821, -33744, 130533, -89372, 265185, 677293, 113580, 8399, -45490, 343741, 192631, 222125, 160812, -102226, -41392, 241132, 185203, 215348, 178273, 251831, 205949, -73135, -80887, 266263, 163192, -111221, 163161, 62880, 300794, -117588, 199542, -89984, -63658, 428736, 108617, 3109, 13241, 111534, 212902, 309608, 8647, -13747, 114469, 266914]
12669B66914q866b51424C10071K3845O3265J88466B6714P6223c6507m9008A75863
12657A55420Q6342E7765K3444a87596e490j31386D33431f5284C35076O2971j76776
12646B21271a94249g3518A96529a50524C94719a12836I2891a38787c8529o5777
12636a04306A77418J05790H4485J05976J26723c070q998B33637R9536Q227K63444
12625F04844F0752L9395J0621J24778e7940E776J01133e4967j52977a5057j95866
12614b10923B24631I2891K53142C4902L22485A21057n2067K55561c37664A17926
12603C35044b3511C26129A53470a6423j0549E59642k32301D9389b76752a08361
12592A05023L25520g4513B03736P2891j06814B1803N0680J29284c37319A56569
$$ y = [266914, 258048, -251424, 310071, 333916, 397181, 585647, 26714, 102937, -36507, -85515, 175863, 155420, 241762, 57765, 81209, -187596, -5490, -136876, 433431, -65284, 335076, 398047, 221271, -194249, -73518, 196529, -150524, 394719, -112836, 92891, -138787, -38529, -104306, 177418, 283208, 84485, 190461, 317184, -3070, -12068, 233637, 333173, 341400, 604844, 60752, 100147, 110768, 235546, -57940, 5776, 106909, -54967, -207944, -15057, -210923, 224631, 92891, 346033, 34902, 357387, 121057, 68990, 324551, -337664, 117926, 335044, -23511, 326129, 153470, -16423, -26972, 559642, 327341, 49389, -276752, -108361, 105023, 430543, -74513, 203736, 276627, 169813, 21803, 72483, 201767, -337319, 156569]
12581a04854B10029m4149P1763a77424j7986j66j1207B83274I1577K0084b95170
12569a07573a5802A49556a85272A0938K81328j13714M3389j08556P1819e7667
12558a650j66600C65067A36469g2290E6289L11266a21310n703p4410K7414A00609
12546b6608o9285H7311o959a60165B56406a2669j78329A37571a68669Q3679A84569
12534b65394A19837a83750P5995A93619G3560B1665b0698D2368b0838r8760A01617
12522a1792B0450J40057a14271I6469a75131K5281A32596Q321B2525N6353P3871
12511A52749M0973R3401A9973d84133A6916J72077J52851i6624C7532K14101A18432
12499e5973j17385A91112A9878O6308l2602E060J9527J7529a38896D4464J4248
$$ y = [-104854, 210029, 165880, 237643, -177424, -195410, -195576, -206783, 283274, 91577, 111661, -295170, -107573, -15802, 149556, -185272, 10938, 292266, 178552, 221941, 113385, 185204, -57667, -1650, -168250, 365067, 136469, -72290, 56289, 367555, -121310, -127013, -201423, -174009, 100609, -26608, -95893, 87311, 80352, -160165, 256406, -12669, -190998, 137571, -168669, -84990, 184569, -265394, 119837, -183750, -107755, 193619, 73560, 21665, -20698, 42368, -20838, -119598, 101617, -11792, 20450, 160507, -114271, 96469, -175131, -149850, 132596, 140917, 22525, 78878, 152749, 193722, 287123, 19973, -484133, 16916, 188993, 341844, -96624, 37532, 251633, 118432, -55973, -173358, 191112, 19878, 86186, 53584, 5060, 24587, 42116, -138896, 44464, 58712]
12488E8712a60964H5510J58545b14072a01889a9088D03145a55867m54279a70704
12477e972D7318j6643P774q669c29335A57582p1782C7889J06744b26283B27784
12465A18248J71304H863K43583F3925g1754E5730c35150i5540K3000p956D30249
12453c5975D2996J23008F9121c73481A42056e01440E7943a56522A0051i1811D1125
12441a37303G9241a05265k1119j35940f0072D1619J21325d2595B25078A5337b10398
12429b51731f4329A21862m3390a57064B31942D1130A7030J58372i8395E6889b29609
12417a59380A88922R1523r357G2802a31399B71709b03591E7725f3700j87138K3201
12406b27637A94740b24670C39259B0516e2103n1765A44448i5445k06139a27577
$$ y = [58712, -160964, 85510, 244055, -214072, -101889, -19088, 403145, -155867, -610146, -170704, -5972, 47318, 30675, 38449, 29780, -329335, 157582, 85800, 37889, 144633, -226283, 227784, 118248, 289552, 8863, 252446, 63925, -71754, 55730, -335150, -95540, -72540, -80496, 430249, -35975, 42996, 166004, 69121, -373481, 142056, -501440, 57943, -156522, 10051, -91811, 41125, -137303, 79241, -105265, -126384, -262324, -60072, 41619, 162944, -42595, 225078, 15337, -210398, -251731, -64329, 121862, 78472, -157064, 231942, 41130, 17030, 175402, -98395, 56889, -229609, -159380, 188922, 280445, 271088, 72802, -131399, 271709, -203591, 57725, -63700, -250838, -227637, 194740, -224670, 339259, 20516, -52103, -103868, 144448, -95445, -301584, -127577]
12395b65297p6634A26699A267L5162A4810c34276A12575N593a93597B06136R1810
12384B97946e2291C45235q7792H5251K1550L35853N060j85564A24621J46055E0242
12372C7841P5274a65944d0541A75217c84147i0453A31265M362A4942K97909p4632
12361B38219k3533m689b43146a4732B9674e1369H7337h9651a6306A34734a33716
12349E7075c2184j87307j30617I0201P0749k3259C2281O558j5623g7435B91657
12337a51366I1271a6841j39957l33809n5554D533h4927A05315a96785L0830l3790
12326a99745f3465G5041l1432J14724n6677B0949h2810C79822B4101L25449E737
12314a90609O0046A71107n8964K02012b30761c6299G3009g3333l6220C60871a26071
$$ y = [-265297, -341931, 126699, 1267, 36429, 14810, -334276, 112575, 118168, -193597, 206136, 297946, -52291, 345235, 257443, 85251, 106801, 442654, 447714, 262150, 124621, 270676, 50242, 37841, 113115, -165944, -40541, 175217, -384147, -90453, 131265, 135627, 14942, 312851, 238219, 214686, 209997, -243146, -14732, 29674, -51369, 87337, -89651, -16306, 134734, -133716, 57075, -32184, -219491, -350108, 90201, 160950, 137691, 32281, 38839, 23216, -77435, 291657, -151366, 91271, -16841, -156798, -490607, -546161, 4533, -84927, 105315, -196785, -165955, -199745, -63465, 75041, 43609, 158333, 101656, 20949, -82810, 379822, 24101, 349550, 5737, -190609, -130563, 171107, 112143, 314155, -230761, -36299, 73009, -73333, -109553, 360871, -126071]
12302a35379k15504J48881k626C2994Q4295C2495H043h5235c699E2025j1254J31659
12290A72430g5758q6477I8443K14019A16374N7687d8732k13792B50415C6539M6199
12279H2738f7553A22379k5230a7298B28073K3389P3052d8513j2818A5460f6730
12267B36717F8888J44689a23435M3684B41937J02313E6417Q3374D516J12918c9967
12255A03730K37006j38977G3618O6875Q583K07108c169q0939A96204a70053a956
12243B10026a28869d6008A49117J48057Q480M4138j48388a1714D9636d6388D67300
12231A26981i6380D10459N6848B05960q0417M09739B17915B0517n750J06967K39714
12220C61448j41976K74577j59168a28851G0608Q8158n1318k4695A381K92966b50684
$$ y = [-135379, -350883, -202002, -204628, 32994, 117289, 32495, 8043, -85235, -3699, 52025, 40771, 172430, -75758, -162235, 98443, 312462, 116374, 174061, -48732, -262524, 250415, 36539, 82738, -67553, 122379, 97149, -17298, 228073, 251462, 324514, -48513, -61331, 15460, -66730, 236717, 68888, 213577, -123435, -79751, 241937, 344250, 56417, 139791, 4516, 117434, -39967, 103730, 340736, 201759, 73618, 140493, 149076, 356184, -3169, -84108, 196204, -170053, -1956, 210026, -128869, -46008, 149117, 297174, 305654, 349792, 201404, -11714, 49636, -46388, 467300, 126981, -96380, 410459, 467307, 205960, 125543, 535282, 217915, 20517, 14767, 121734, 361448, 219472, 494049, 334881, -128851, 70608, 158766, 107448, 82753, 1381, 294347, -250684]
12208C03513j22703O1950a49297B01171J08007a07634D36352E6292J43506P3164
12198B72962O4734b5884A1745L03161M5000j60960P358I382K33801B5117Q2272
12187A07389a12286b293B79890R2718F5522d8765C7008L77917A78128A1651O323
12176A7974L68596a6177B77523m9710N8180K78273k41058A25263Q0576r5231M3800
12165A54408F240J13783K16874b20122d2483C8868J03584o8240b38025A45863
12154A54277K03740G792Q1628A2584a05595A81437k7012B427J13138K13013a10454
12142A44365k669a56269B608d0167k08264j57929B70990I3869L9512b4263A40437
12130b30126q6079E4923B6937J14033F8923J66364G5205r936L8464c14684R2932
$$ y = [303513, 180810, 242760, -149297, 201171, 309178, -107634, 436352, 56292, 199798, 272962, 337696, -25884, 11745, 314906, 359906, 198946, 206304, 9382, 243183, 25117, 107389, -112286, -2293, 279890, 372608, 65522, -48765, 37008, 414925, 178128, 11651, 17974, 386570, -16177, 277523, 227813, 285993, 564266, 323208, 125263, 205839, 110608, 154408, 6240, 120023, 336897, -220122, -42483, 38868, 142452, 74212, -238025, 145863, 154277, 358017, 7792, 89420, 12584, -105595, 181437, 154425, 2427, 115565, 328578, -110454, 144365, 141696, -156269, 2608, -40167, -248431, -406360, 270990, 93869, 133381, -24263, 140437, -230126, -316205, 54923, 26937, 140970, 68923, 235287, 75205, 65269, 103733, -314684, -221752]
12119b21752a03814o9280A8183c28898B39221e66536a19275m7886C60869a49905
12108B95333h1241j44001i8577B8222a66266C1282a12101p6635g7668j3276L8197
12097e2747l10806A23945j5008a85892A7120b83361P4143B90658A7723b4884j65914
12086a90798d8785C67758b34189M5453E9241J12422G9860e7104k3194m03250b12575
12074a94856A11979J04401D3320p590K89605A53211j8047C7163d5779A27346e7913
12062f237k07723A49188k8906E0901c21147e8788b0364A71953M39585j7380B09937
12050I16465P5451M4711D74667J10272B29485N924b6992r4873j906D0750b3653
12038A6680K82111A18734b13486K3283k2891P8648B3419c8776J6608C44535a6385
$$ y = [-221752, -103814, -173094, 18183, -328898, 239221, -566536, -119275, -167161, 360869, -149905, 295333, -81241, -225242, -98577, 28222, -166266, 31282, -112101, -188736, -77668, -90944, -52747, -363553, 123945, 108937, -185892, 17120, -283361, -209218, 290658, 17723, -24884, -190798, -48785, 367758, -234189, -188736, 59241, 171663, 79860, -57104, -80298, -483548, -212575, -194856, 111979, 216380, 43320, 35730, 325335, 153211, 135164, 37163, -45779, 127346, -57913, -6237, -213960, 149188, 120282, 50901, -321147, -58788, -20364, 171953, 611538, 594158, 209937, 916465, 991916, 1036627, 474667, 584939, 229485, 235409, -26992, -121865, -123771, 40750, -23653, 16680, 298791, 118734, -213486, -190203, -213094, -134446, 23419, -38776, -22168, 344535, -16385]
12026I5507b05852L7912A61a90432B26261R227q8505c484k37988N2980B87393
12014B3898J26669m2294M7501a10696k6928f1831j19468A58993M1441h7489B39465
12002a49130N6067k09060d7871C4433g5238H5945b84529a00937j34489G6637K09634
11991B86271r6018b55866J06333j600K9188m4928B44777a93794r9995f2234e013
11979I6960j8411O272C8177P6770a8738A80042b53245N2548c6468j28326r7709
11968b62503N0950d5079A33708a2876k58776a7839A40054J43661F3021l721a90358
11956e6340j87454A71484Q1810r6933b65633I3505h0529F6565a14304o0007A47980
11944A50893d025D1570L995N8963K0790O8136e11383A4795K65973b23450g9198
$$ y = [95507, -205852, -167940, 161, -190432, 226261, 235488, 146983, -3484, -241472, -188492, 287393, 23898, 150567, 108273, 155774, -110696, -137624, -61831, -181299, 158993, 200434, -87489, 239465, -149130, -93063, -302123, -47871, 34433, -75238, 85945, -284529, -100937, -235426, 76637, 286271, 190253, -255866, -149533, -151133, -121945, -166873, 244777, -193794, -293789, -62234, -5013, 96960, 78549, 84821, 38177, 114947, -18738, 180042, -253245, -200697, -36468, -164794, -262503, -211553, -45079, 133708, -12876, -271652, -17839, 140054, 283715, 63021, 59300, -190358, -56340, -243794, 171484, 253294, 156361, -265633, 93505, -80529, 66565, -114304, -174311, 147980, 150893, -4025, 41570, 45565, 104528, 125318, 193454, -511383, 14795, 280768, -223450, -79198]
11932A27777M9849E6616k6913J15938C3134K30712p7668E4064a22721A43915c2694
11920B07934R4739a2316o4011l77379a40302O8125e365A94827e1998l20740G3987
11908E2107K29244E0642R6467M6490g0181E8180a86445F2495K28230I4953g2754
11896B4264a08136I5086b98661N4170D0508b83501g9159A35515D826K33913E2229
11884a14412I7629a34403F5502b90541A15201R2895C9531a40975B77734a26108
11873g9246J0507k33376A45305L2995k6926e8212E131P6155b60841P9563d8623
11861B23409i0336l24267C9252f149k54045A51052d0141m1856k14539a00623G3308
11849A3848K1421J1273i1597G6423c32719g7760j62822R6120B45429a20378g225
$$ y = [127777, 177626, 56616, 29703, 145641, 33134, 263846, 186178, 54064, -122721, 143915, -32694, 207934, 302673, -12316, -76327, -453706, -140302, -72177, -5365, 194827, -51998, -372738, 73987, 52107, 281351, 50642, 147109, 193599, -70181, 58180, -186445, 62495, 290725, 94953, -72754, 24264, -108136, 95086, -298661, -244491, 40508, -283501, -79159, 135515, 4826, 238739, 52229, -114412, 97629, -134403, 65502, -290541, 115201, 208096, 39531, -140975, 277734, -126108, -79246, -68739, -302115, 145305, 178300, 151374, -58212, 5131, 81286, -260841, -181278, -48623, 223409, -90336, -414603, 39252, -6149, -260194, 151052, -40141, -81997, -296536, -100623, 73308, 13848, 35269, 46542, -91597, 76423, -332719, -77760, -240582, -144462, 245429, -120378, -7225]
11837C6031d5663B93541j28707a1520j76800h3506A72033K80680b6407q5890k6027
11826a38324B05784b465A31621a12923m5046l983E8646m66B4235i3112r1633j5514
11814b00259r8069b7315B6872a9665D6205N0029K93060q4090A01562a82576j46551
11803c29127A27370A9334b54591C7491c1512n5495Q523a8666C786K8801o238K82410
11791C08759A07788b26626A28798b86991B10510a44691a5346e967A41237f7555
11780b69306H5381a58439j86745J49303R1833J8092B08667b2127B19461A7689
11769a91087A20623b15308g0384o8339K2840L6183k12421b3181I9651a79558N4567
11758a24991m4926g1970A71627C2705e3605A76811K53187H884e6731j48439h0677
$$ y = [36031, -45663, 293541, 164834, -11520, -188320, -83506, 172033, 452713, -26407, -112297, -138324, 205784, -2465, 131621, -112923, -157969, -161952, 58646, 58180, 24235, -93112, -184745, -200259, -298328, -27315, 26872, -19665, 46205, 96234, 389294, 305204, 101562, -182576, -329127, 127370, 19334, -254591, 37491, -31512, -87007, -78484, -18666, 3786, 32587, 26349, 308759, 107788, -226626, 128798, -286991, 210510, -144691, -15346, -5967, 141237, -67555, -269306, 85381, -158439, -345184, -195881, -104048, -85956, 208667, -22127, 219461, 17689, -191087, 120623, -215308, -70384, -138723, -115883, -79700, -292121, -23181, 99651, -179558, -124991, -169917, -71970, 171627, 32705, -53605, 176811, 429998, 8884, -56731, -205170, -80677]
11746A00517b56843F9608M8708h1903k97292J4905a62585N3998L0489L8306j51641
11735a91433H5336d8528I3824k686a1971C26905j12476I3012K35724g9403j48126
11724b27529C32727h3975I957b20539E3247J43730K63559k25190b4372f228l4081
11713d0309l51197a7501m25237e6755B12919h6698A15021a58893A183a44610A93740
11701B33030a70213P2518b7374I2385R8790a75414C69918r5650c8165o2032c260
11689I4862J65148k0700K80492a088A99093f1812a0754C09933b17030R2944a3325
11677A95865i7037k4771A58671N5684K69603B1819K67511a79443C10429a06612
11666a69487A25129C5000J69050r0038b40670B76738j35171K94782a17095k1408
$$ y = [100517, -256843, 69608, 118316, -81903, -379195, -364290, -162585, -108587, -78098, -39792, -191433, 85336, -48528, 93824, 91138, -11971, 326905, 214429, 93012, 328736, -79403, -227529, 332727, -83975, 9957, -220539, 53247, 196977, 460536, 235346, -24372, -6228, -40309, -391506, -17501, -442738, -56755, 212919, -86698, 115021, -158893, 1183, -144610, 193740, 233030, -170213, -97695, -27374, 92385, 191175, -175414, 369918, 274268, -38165, -100197, -3260, 94862, 260010, 239310, 519802, -1088, 199093, -61812, -10754, 309933, -217030, -124086, -13325, 195865, -97037, -121808, 158671, 214355, 483958, 21819, 289330, -179443, 310429, -106612, -169487, 125129, 35000, 204050, 114012, -240670, 276738, 141567, 436349, -117095, -138503]
11656a38503A88800g8146A22501f5245E4046o843P3024c41982a08905J3597H4839
11644H001a93343P1240A47965J01078c9299j77359a01862A8000a31903A49111
11633d0346A54169R5733a98919h0533h238j29179C34531A17707l946K27418I0761
11621a2301j01573C20096A4144g228k66669C34901i1472F2719b81174d4932j6026
11610f0958A44112a95698A93119A7635b09312A01992b09672J8182A16780K87927
11600D04707j17454o9965a37918D351K48892k0664F4326R9315d85624F5630K06290
11589B71920p177e3017j9141A04854k0530L2688M2133J25944n4275p3693k6214
11578A30907n9214K56329j14983L9331R8684o4097A35765J12444I4290b25632
$$ y = [-138503, 188800, -78146, 122501, -65245, 54046, 47203, 120227, -341982, -108905, -95308, 84839, 8001, -193343, -122103, 147965, 249043, -39299, -216658, -101862, 18000, -131903, 149111, -40346, 154169, 249902, -198919, -80533, -8238, -137417, 334531, 117707, 113761, 341179, 90761, -12301, -113874, 320096, 14144, -7228, -273897, 334901, -91472, 62719, -281174, -44932, -60958, 144112, -195698, 193119, 17635, -209312, 101992, -209672, -191490, 116780, 404707, 287253, 217288, -137918, 4351, 253243, 232579, 64326, 163641, -485624, 65630, 271920, 264743, -53017, -72158, 104854, 84324, 117012, 159145, 285089, 230814, 157121, 130907, 71693, 328022, 213039, 252370, 351054, 286957, 135765, 248209, 94290, -225632]
11567A09309K8409O3690q7186J32199a88929j11335I2338P7676J98020b77408
11556a17839k88184G450a19682N3229A17949K28714c02701b3966A84492L0830
11546B15322f5290H0246K8697D5860J60797A01754D5728b70833C8151e2931A12828
11534C74927d0088B815N64279c33278F0275M9478A3107J2501J78195d591D57216
11522B96836E5818a85941B74795q1247h9138B09888D3123L094E83K24582R3888
11511C19053E2540Q1754N5583e9177A35121g5365N085R442C43058H525M02449
11500D10974G9845C8458f244C21591md1905r9647C75247E7793L31339b67982b2651
11487B33574h8604C547K24534q4036L1998a3595q9098b5973B95086b9080B40974
$$ y = [109309, 137718, 201408, 114222, 246421, -188929, -300264, 92338, 170014, 368034, -277408, -117839, -406023, 7450, -119682, -66453, 117949, 346663, -302701, -23966, 184492, 215322, -65290, 80246, 108943, 45860, 206657, 101754, 45728, -270833, 38151, -52931, 112828, 374927, -40088, 2815, 567094, -333278, 60275, 109753, 13107, 25608, 203803, -4591, 457216, 296836, 55818, -185941, 274795, 193548, -89138, 209888, 43123, 46217, 583, 225165, 319053, 52540, 134294, 189877, -59177, 135121, -75365, -70280, -60838, 343058, 8525, 410974, 79845, 38458, -6244, 321591, 321587, -41905, -141552, 375247, 57793, 389132, -267982, -22651, 233574, -88604, 3547, 228081, 144045, 176043, -13595, -102693, -25973, 295086, -29080, 240974]
11475B05542K32333k10252p8059n3447h3082A12022C3280a8349C06346a05376
11464A04513K10097A38833B8767J45439K83647e1467A58426k7638D9634K20994
11454B70628h0751B95601H197M05591A97688L315a30698E491L52382A03594k4720
11443G8874c52202A17906D5737d5652A81432a26574B34767j05946g3617B36303
11432F1420a58808E2230f4210F4141L0735l3628l0316a40630O7804D6962L22266
11421C69228A06375f6961A57277k5438L4065a42691d2330A00140b38576Q7258
11411a51318D5030K1019f5815A39784a23806L9178J5818B95916e1480j5238j2135
11400g8853r7132B1422L20174H7564f0383n312D3382J24606a60209r1572L2293
$$ y = [205542, 437875, 227623, 149564, 96117, -83082, 112022, 33280, -18349, 306346, -105376, 104513, 314610, 138833, 28767, 174206, 457853, -51467, 158426, 130788, 49634, 270628, -80751, 295601, 8197, 413788, 197688, 201003, -130698, 5491, 357873, 103594, 78874, -352202, 117906, 45737, -45652, 181432, -126574, 234767, 128821, -73617, 236303, 61420, -158808, 52230, -64210, 64141, 94876, 61248, 30932, -140630, -72826, 46962, 369228, 106375, -66961, 157277, 131839, 165904, -142691, -42330, 100140, -238576, -151318, 45030, 66049, -65815, 139784, -123806, -84628, -68810, 295916, -51480, -66718, -78853, -175985, 21422, 341596, 87564, -60383, -65695, 43382, 167988, -160209, -251781, -219488]
11389b19488d9496A25222c55490a31027A0482K65426b60786c3636r9094q2347
11379b15077A46894P0795f3884A24192J07242c4940D36382K1963F0459K16415
11369B76874a14147c4911q6771G0228a2671A05206k3227J00651D5756K12504d6472
11357B47603a45561A60724k8442m1434k7668e0622k4049A33981J20024i1557j65619
11346b57176n2751F7329h1947B23694b13225g0536q7565l4216j62846d8842D7106
11334C66996i591k51706C32350A23919i1827B04175A41J00043l3120j8201h0502
11322A72157b5487j11535j66061a22248B29984h6530K2795A19757a38690F0745
11311c43682B29982D6280b32631G4331i7008b8751r4861k59860a806B7484J42452
$$ y = [-219488, -49496, 125222, -355490, -131027, 10482, 275908, -260786, -33636, -132730, -215077, 146894, 217689, -63884, 124192, 231434, -34940, 436382, 458345, 60459, 276874, -114147, -34911, -121682, 70228, -12671, 105206, 81979, 182630, 45756, 258260, -46472, 247603, -145561, 160724, 132282, 90848, 63180, -50622, -74671, 133981, 254005, -91557, -257176, -309927, 67329, -81947, 223694, -213225, -70536, -158101, -192317, -355163, -48842, 47106, 366996, -9591, -261297, 332350, 123919, -91827, 204175, 141, 100184, 67064, 48863, -80502, 172157, -25487, -137022, -303083, -122248, 229984, -86530, -63735, 119757, -138690, 60745, -343682, 229982, 46280, -232631, 74331, -97008, -28751, -123612, -383472, -1806, 27484, 169936]
11300A69936m9617a14189C18537j56234C4336g1080K4630j44391P1712A09904
11289B98359r4086a39512k7079j35047f2003B8450O2233a71851G6423A2024b21340
11277c14109J6250A35992Q9132q1824a00463j29418a01766k98604i9741F3573
11266I800J24911c33369a44403n3457A69132J21826a03342G0844b561B18378l8030
11255A80348a62654j16635B26082A11186J87208B5683R111c65128A6316J07951
11245A24267d6907b1508k28135l0783A10293b8520l12610A31919a2414F7284f1075
11233b01834D32593A94465C119i9382j2847j5805L7560L0604A07696J03231m6266
11222A64661b9216B13821b04140E1281a3178H639N1800k0235c67068E0884e9895
$$ y = [169936, 120319, -114189, 318537, 162303, 34336, -71080, -46450, -190841, -119129, 109904, 298359, 204273, -139512, -166591, -301638, -62003, 28450, 90683, -171851, 76423, 12024, -221340, -314109, -297859, 135992, 225124, 143300, -100463, -229881, -101766, -400370, -99741, 63573, 9800, 134711, -333369, -144403, -197860, 169132, 290958, -103342, 70844, -2561, 218378, 180348, -162654, -279289, 226082, 111186, 298394, 25683, 34794, -365128, 16316, 124267, -46907, -21508, -249643, -280426, 110293, -28520, -341130, 131919, -12414, 67284, -61075, -201834, 432593, 194465, 3119, -99382, -112229, -128034, -90474, -59870, 107696, 210927, 164661, -29216, 213821, -204140, 51281, -13178, 8639, 60439, 40204, -367068, 50884, -59895]
11210h4571q1329m0094M9887f0145l522L0460k13282J22964A31815b20551g5639
11198C94991m7573d38091e3715k36945D1694a48558C21910a32292A9240J82515
11188B01755c28841A6328J20791D1661a25283G1982a67624j27027j32590d3888
11177G290C300Q3302L1062g7733A03092a54885g1730K7116q1847j68747G6856
11165b68738A68345b30955A44955e9696J4554A89626b6037B13659m8272K9174
11155A94561m5804k1551b31137a339k198k04460I7780a29148m3722M8529k16438
11144c40779R8563A49338D1645j0905b61169A74739n8375c31002B79868a37517
11133C26382b498m8517A33318N0628h1151B44043G1295b5712k61744c3641B8073
$$ y = [-84571, -165900, -205994, -156107, -60145, -63667, -33207, -246489, -123525, 131815, -220551, -75639, 394991, 347418, -438091, -53715, -290660, 41694, -148558, 321910, -132292, 19240, 201755, -328841, 16328, 137119, 41661, -125283, 71982, -167624, -294651, -427241, -43888, 7290, 3300, 86602, 117664, -77733, 103092, -154885, -71730, -44614, -126461, -295208, 76856, -268738, 168345, -230955, 144955, -59696, -45142, 189626, -26037, 213659, 165387, 194561, 148757, 127206, -231137, -1339, -3537, -207997, 97780, -129148, -172870, -124341, -340779, -242216, 149338, 41645, 30740, -261169, 174739, 116364, -331002, 279868, -137517, 326382, -2498, -51015, 133318, 183946, -81151, 244043, 71295, -25712, -287456, -33641, 28073]
11121B00611Q7478c5711a4597j44598A2083K17848F2299a01819H8467D0616J62437
11110B03053g0753E5241c63505A88366O8022g8670D1134J00492d2537B03040J03824
11099C06864E5504J09358o3703K25749j18371K6455j9325H8065b8319B29349q0961
11088A48388J89494A35599L0885K12779J77225n9890j15518Q9690L7001A12753
11077B28743I8257J33199J41826R9561j69457P8909K5388O561k1787j64866n3921
11066A73670K84312o5734k2291J8761o0967J56105J71557L83276k82647m2922
11056G13120K25015l80922l6175L73559k81512J23651N7185j16811K57298C20489
11045G41372J92165j37642k67742N0254j0034K60732j20269O6679r752J4718m6645
$$ y = [200611, 288089, -35711, -14597, -159195, 12083, 229931, 62299, -101819, 88467, 40616, 203053, -70753, 55241, -363505, 188366, 256388, -78670, 41134, 141626, -42537, 203040, 306864, 55504, 164862, 101159, 326908, 208537, 234992, 215667, 88065, -28319, 229349, 148388, 337882, 135599, 166484, 379263, 556488, 496598, 381080, 470770, 507771, 112753, 228743, 98257, 231456, 373282, 472843, 303386, 382295, 407683, 414244, 392457, 227591, 173670, 457982, 392248, 369957, 388718, 327751, 483856, 655413, 1038689, 756042, 713120, 938135, 557213, 521038, 894597, 613085, 736736, 793921, 677110, 934408, 320489, 741372, 933537, 795895, 528153, 578407, 568373, 829105, 708836, 775515, 765763, 780481, 733836]
11034G33836k02091L35937o8245N075k73690K04254j10474L27963J48263l31557
11024G69271k29122M99212j64461k32367P8060C59778L41230J02090K39864m12458
11014F30504j33547p2976J75591K00717j45661k01940J62113K50056l53416L09376
11004H20817P1929l66703L73091l4248l11049K28954r3840N2105j10090K07576
10994H38542j9667j66649r9497K59280J78730l97219M98864l2426n15109N19213
10984A064062J21384J62307P0139J78298n09688P94131k20765M96615l8435K95321
10974B413369M30419m43844N41010M35540k88914J86404j60330j37433k90961
10965B685260l82963m8500q9250K08126j27100j05169j89937R4677j94577l05666
$$ y = [733836, 531745, 867682, 799437, 804512, 530822, 735076, 624602, 952565, 1100828, 769271, 540149, 1039361, 874900, 642533, 720593, 359778, 701008, 803098, 1042962, 630504, 496957, 423981, 599572, 800289, 654628, 452688, 614801, 864857, 511441, 820817, 892746, 526043, 899134, 864886, 553837, 782791, 688951, 741056, 630966, 838542, 818875, 652226, 552729, 812009, 990739, 593520, 1092384, 1059958, 544849, 1064062, 1185446, 1347753, 1417892, 1596190, 1086502, 1880633, 1659868, 2156483, 2118048, 2413369, 2843788, 2399944, 2940954, 3376494, 3087580, 3273984, 3113654, 2976221, 2685260, 2302297, 2253797, 2164547, 2372673, 2245573, 2140404, 1950467, 2045144, 1850567, 1544901]
10955A544901L29335j57834p7020l80443j05535j81328j74005K09971m55168j97892
10945C54982o2714J64068J9223j8849R612A22034a22121e5689B06779K32975B0876
10933a5556A00809O8450J69916A36626F5065B5738L2584Q7836J66891b56695A03818
10921a29475B6369K24617a14772B5133J14796R0294f4585j63231J5312L988H8741
10909E5369a68708B94111a35996G4829b78989F2224g8785p3267b4386j07563F0845
10897A28555b60457B2068f8154F1880a58233B0250e7573j9035B66568A0216g5476
10885a06054A25959b1998H365J02720N304n4808r500k2564J90588h2539r0925
10874a73464g6142k98953j0446i4452r68A05557g3573n6446a1870n9364b1975
$$ y = [1544901, 1874236, 1716402, 1639382, 1258939, 1153404, 972076, 798071, 1008042, 552874, 354982, 292268, 456336, 475559, 456710, 466322, 122034, -122121, -55689, 206779, 439754, 20876, -15556, 100809, 169259, 339175, 136626, 65065, 25738, 58322, 146158, 313049, -256695, 103818, -129475, 26369, 250986, -114772, 25133, 139929, 230223, -64585, -227816, -212504, -208516, 88741, 55369, -168708, 294111, -135996, 74829, -278989, 62224, -78785, -152052, -24386, -131949, 60845, 128555, -260457, 22068, -68154, 61880, -158233, 20250, -57573, -76608, 266568, 10216, -75476, -106054, 125959, -21998, 8365, 111085, 116389, 61581, 52081, 29517, 220105, -82539, -173464, -76142, -375095, -385541, -94452, -95420, 105557, -73573, -130019, -11870, -71234, -21975]
10862A26479a25836B40130b68174P0837k10642J44305E0091O9532b21731C12666
10851a2257A21237L8916F0275a40960C09155a91335f357F389a25072C0983J30176
10840A61159G7230a08637B04341a17215B34241c05435R1115i7412G1246a1796
10829B91796a79167P8806D4477b8801k88341B27179c096j52285q4618h1458j01010
10818a82468M4806J3940k32938a77542a8155b513q1317q0649q3809b148l5747
10807c7895G0538M6978h3597A71168a37427C19108b90645d5835A11529b5094l16000
10796c41094A28664d3660A70328C1190j3752d11405A04205A057b3624j7936G8098
10784a85438I6394L21404A85796e3058p6591D9943a33562A54272k401c73311P2372
$$ y = [126479, -125836, 240130, -268174, -197337, -407979, -263674, 50091, 119623, -221731, 312666, -12257, 121237, 160153, 60275, -140960, 309155, -191335, -6357, 6389, -125072, 30983, 161159, 77230, -108637, 204341, -117215, 234241, -305435, -214320, -97412, 71246, -11796, 291796, -179167, -100361, 44477, -28801, -317142, 227179, -3096, -155381, -239999, -81458, -182468, -137662, -123722, -356660, -177542, -18155, -2513, -83830, -164479, -248288, -2148, -37895, 70538, 117516, -83597, 171168, -137427, 319108, -290645, -45835, 111529, -25094, -341094, 128664, -43660, 170328, 31190, 17438, -411405, 104205, 1057, -23624, -41560, 78098, -185438, 96394, 417798, 185796, -53058, -129649, 49943, -133562, 154272, 151871, -373311, -300939]
10773c00939L2365K1678a3461B19655A01161c8209B1697K3358c34302j70870A08395
10761C3478b68409J21276A63363d515j85453A66173m3589a92601I6852a38912
10750a22812j84302a1576l996j57501m58235e2B6710k191Q4538b7473j78844h6487
10737G8458R5915b20573I1888a62522K5806A09282c3047j4609D9294J7217B4770
10725G3992P0931b80211f3547l97067a02978G195J00601a77815l8957J1270B14172
10713G6783b43348A26975c86125c434E9154b19305D8520K3050K6111e8901g111
10701A39286l946a76007a1535B18514a13181A96873a28793B828R9472g45A0407
10689h8268a602r8472j25418g0366o0142B32805d7324o1262l34124a20765D9496
$$ y = [-300939, -268574, -246896, -13461, 219655, 101161, -38209, 21697, 45055, -334302, -505172, 108395, 33478, -268409, -147133, 163363, -4515, -189968, 166173, 122584, -192601, 96852, -138912, -122812, -307114, -11576, -15572, -173073, -631308, -52, 26710, 24519, 109057, -27473, -206317, -86487, 78458, 174373, -220573, 91888, -162522, -136716, 109282, -33047, -47656, 49294, 66511, 24770, 73992, 144923, -280211, -63547, -460614, -102978, 7195, 107796, -177815, -216772, -205502, 214172, 76783, -243348, 126975, -386125, -3434, 59154, -219305, 48520, 71570, 97681, -58901, -7111, 139286, 135340, -176007, -11535, 218514, -113181, 196873, -128793, 2828, 102300, -745, 10407, -88268, -1602, -100074, -225492, -70366, -130508, 232805, -47324, -108586, -442710, -120765, 49496]
10677h0639l34355g5925O910L3368H9656J09630a01163q2995j9473D3801a18318
10665e6980B28569b01233f3298j35481B05193b23098L2142j95312a84054H2336
10654b1745A81129a25458K7686g693l09384R0936h191m959E2718c6936M074j08007
10642a40869L4318k37293a31390a2536A97402a2140j01191m6270r284A07287D3514
10630E9397e852l0411k5798B29634a3828C7464A5009c03613j07978g8768j65530
10619b44298a21877G971a54439B07056b43034R945A4938h4865B06774G420Q0624
10608H8044c19506B9015c79798B53464g3299k84752a3967j4055p4814B1317K27556
10597B48873f4129b7678L674j12669M0747k23033J35068C27818d51999a25671
$$ y = [-80639, -414994, -75925, -69015, -35647, 89656, 199286, -101163, -184158, -203631, 43801, -118318, -56980, 228569, -201233, -63298, -198779, 205193, -223098, -190956, -386268, -184054, 82336, -21745, 181129, -125458, -97772, -7693, -317077, -226141, -8191, -13150, 52718, -36936, -32862, -140869, -106551, -343844, -131390, -12536, 197402, -12140, -113331, -159601, -168885, 107287, 43514, 59397, -5852, -36263, -62061, 229634, -13828, 37464, 15009, -303613, -411591, -78768, -244298, -121877, 7971, -154439, 207056, -243034, -233089, 14938, -84865, 206774, 7420, 88044, -319506, 29015, -379798, 253464, -73299, -358051, -13967, -28022, -102836, 21317, 248873, -64129, -27678, -24004, -136673, -95926, -318959, -183891, 327818, -451999, -125671]
10586B78053D6203c37861R5963A39571m1707b8207l1242C5040O7490c74156i5230
10574C5596e2769m4036q0123l16005c7285j02891I7995c78630J27943B38592a81925
10562B58666B6616b74616H8660a12502G1910b2812k99052d8938j94395B54781
10551B88658a55375p4304K7574K4062N9652B38623c64475D25d2106q9005C34960
10539A71463N5029D4596a23807b9487B5171m712F673a92734B20039i2251B0238
10527B57850j08838N6114m8434c07252O7575A3354N6125b36723C17810B4404b10894
10515A8236a57027m2819o9085f1371G1566Q3345a40638N8577H9098g8709q7063
10504a65772A45161J31811b62011j84444C12170A09410g8044B61319c69143a10425
$$ y = [278053, 46203, -337861, -241898, 139571, 97864, -28207, -59449, 35040, 102530, -374156, -95230, 35596, -52769, -96805, -176928, -492933, -37285, -140176, 97995, -378630, -250687, 238592, -181925, 258666, 26616, -274616, 88660, -112502, 71910, -22812, -321864, -48938, -243333, 254781, 288658, -155375, -229679, -202105, -178043, -118391, 238623, -364475, 425, -42106, -131111, 334960, 171463, 226492, 44596, -123807, -29487, 25171, 20459, 6673, -192734, 220039, -92251, 20238, 257850, 149012, 205126, 156692, -307252, -239677, 13354, 69479, -236723, 317810, 24404, -210894, 18236, -157027, -199846, -268931, -61371, 71566, 154911, -140638, -82061, 89098, -78709, -165772, 145161, 276972, -262011, -446455, 312170, 109410, -78044, 261319, -369143, -110425]
10493b60732A491b41058J08226M8961n3357d7132E7959L20582j74007b20353g9323
10481H5775L72394C3017K7672J69533C1630L02298b2390E0938b99791B26686b97588
10469b8954E8566L29282n8153E2258N3806C2566b2891D80592A1712c3458B53116
10457A46551k2017a09038k56963D8222K58236K4891a72797e9824l07497H6290
10446b11339C76102d1045A28596O2747k8259b6203I4717k2226J87762b07242A43970
10434B659J12255a27856O916r4161C1629J28181J80459a86631C31368m3406d3987
10422c15963A23975f4386j21991j34887D6663L9348J5050a55754C2686i6738p4563
10411a71301f3849G2455N4749h0348C8683J32990E6298c60271G2689J06385a35887
$$ y = [-260732, 1491, -241058, -132832, -83871, -137228, -47132, 57959, 378541, 204534, -220353, -79323, 85775, 458169, 33017, 60689, 230222, 31630, 333928, -22390, 50938, -299791, 226686, -297588, -28954, 58566, 387848, 329695, 52258, 106064, 32566, -22891, 480592, 11712, -33458, 253116, 146551, 124534, -109038, -366001, 48222, 306458, 331349, -172797, -59824, -367321, 86290, -211339, 376102, -41045, 128596, 191343, 163084, -26203, 94717, 72491, 260253, -207242, 143970, 2659, 114914, -127856, -120940, -215101, 31629, 159810, 340269, -186631, 331368, 287962, -43987, -315963, 123975, -64386, -186377, -321264, 46663, 86011, 101061, -155754, 32686, -96738, -171301, -63849, 72455, 127204, -80348, 38683, 171673, 56298, -360271, 72689, 179074, -135887]
10399a31386N4234B85311b51830A28017m980K29761b66949A10597b20737A10180
10388A56059a97265C6636L56177F9431R7863q2183A0966a00320G9231J21483K58012
10377D58726A27244K69876H8065K95428M7649j63247G0613J48303M9023B6915
10366A74194J63788J73234q4251j21930M34583B27748A06196J80848r2340J10935
10356C05639j2076m9370n5504R5981N3646L06758J48947B06387N1082N00278C5012
10344G2653K73109o7074g687A33237n9051O5502K74124q4297A11633j5969a33072
10332D08746q8843B6881c6991D6213J18773A4843K20201j06503G795L42596m8396
10321C01995J45819A28519B8533g4403B30808J07226k9190D7920K49805H4373
$$ y = [-131386, -77152, 285311, -251830, 128017, 123037, 352798, -266949, 110597, -220737, 110180, 156059, -197265, 36636, 392813, 69431, 167294, 85111, 10966, -100320, 79231, 200714, 458726, 127244, 397120, 88065, 383493, 431142, 267895, 70613, 218916, 267939, 26915, 174194, 337982, 511216, 426965, 305035, 739618, 227748, 106196, 287044, 194704, 305639, 293563, 244193, 188689, 284670, 338316, 645074, 794021, 206387, 257469, 757747, 35012, 72653, 345762, 278688, -7687, 133237, 74186, 139688, 413812, 329515, 111633, 95664, -133072, 408746, 319903, 26881, -36991, 46213, 164986, 14843, 235044, 128541, 7795, 350391, 301995, 447814, 128519, 28533, -74403, 230808, 338034, 308844, 47920, 297725, 84373]
10310c45236f7551A99389q3690a14708A30851a14488B76797j7292m8248a73077
10299b34979G2577d52H3307L8861a13619d4504k55702D7533n855e3528O882I2827
10286g7553l3102A212b77936a8648P29j82312H9893J20752a54418N1645c4897
10274a53260b2928j27699M7504d659j53370o6568C11014j36138a60004C4620h8432
10262A7093J98474G2628J62730k3951n5092M16629j88563R2485E2893J71050O0132
10251B84075I1608h8514A9954b29227R1485A8309K68869F9982b43140G9507g5174
10239B59L21209C6047b58021f5021A06268b5837B19793m6487a26404K630a3675
10227A531g8302j34950R1616B4917J34923a31964m40025H4960C9064h4771j65884
$$ y = [-345236, -67551, 199389, 115699, -114708, 130851, -114488, 276797, 259505, 211257, -173077, -234979, 72577, -452, 83307, 122168, -113619, -44504, -300206, 47533, 41678, -53528, -46646, 92827, -77553, -110655, 1212, -277936, -18648, -17919, -200231, 89893, 210645, -154418, -102773, -34897, -153260, -22928, -150627, -103123, -4659, -158029, -224597, 311014, 174876, -160004, 34620, -88432, 17093, 215567, 72628, 235358, 211407, 156315, 572944, 384381, 476866, 52893, 223943, 284075, 91608, -88514, 19954, -229227, -137742, 18309, 287178, 69982, -243140, 79507, -75174, 259, 321468, 36047, -258021, -65021, 106268, -25837, 219793, 173306, -126404, -123774, -13675, 1531, -78302, -213252, -121636, 24917, 159840, -131964, -571989, 84960, 39064, -84771, -250655]
10216b50655F4646k5440J01929a14175m4418C4778g8804A65075h6277I0976b6378
10204A27621b22411I0070P8370a45489j15493H8450h3528A22043a08022k2944
10194a30966k24228A99435a64644C09309a19475M9963j77492M2925c9146D9749
10183a58761A73667b2494k60546C9971a98032A3159b8132F4596J39178r5489a62953
10171c13634m3769O5536h8751A8637R5174b45865a21886C18550a6038j92435J03266
10160a05207j34245n0189D6721a49694B2614h6630j45648c7625A41420a48292
10149H971L0451b13861A8578O7408a57867D8080J29109E1536a6944A95248a79869
10137b91730A5523d02717c9348b136j97377Q4127n6080d5669r3342l1403D42683
$$ y = [-250655, 64646, 39206, 141135, -114175, -158593, 34778, -78804, 165075, -86277, 90976, -26378, 127621, -222411, 90070, 168440, -145489, -260982, 88450, -83528, 122043, -108022, -130966, -355194, 199435, -164644, 309309, -119475, -69512, -247004, -204079, -39146, 49749, -158761, 173667, -22494, -283040, 39971, -198032, 13159, -28132, 64596, 203774, 108285, -162953, -313634, -357403, -291867, -88751, 18637, 113811, -245865, -121886, 318550, -16038, -208473, -105207, -239452, -289641, 46721, -149694, 22614, -86630, -232278, -37625, 141420, -148292, 8971, 39422, -213861, 18578, 85986, -157867, 48080, 177189, 51536, -16944, 195248, -179869, -291730, 15523, -402717, -39348, -2136, -199513, -115386, -171466, -45669, -139011, -170414, 442683]
10125c18826B38514a17762B53072d10008J76557l21788a07418o7727Q2873C4940
10114a00457r3801R6738G1905a24913n907A41176J18231o0065Q0379b18661b5734
10102b52471a22499L7754L6384r0785m21913K05542C11023A52209a90774B51731
10091a53205B0303b0446q6515G7133b65663B2227L9294K8565d67245E7215d81314
10079a43041B14125a37802e2270j51541A35606D3645g5611g900m09576f2427E0602
10067a96730P7264L407B42363a85518A06671c3676k8418k38193a06216A23626
10056d02799J21002a0043A82280b95860J40105A66322b15111M8769M4288n5905
10046a77959L1034f809H7266B5397L9138b32964j8278N9060H816a49127j37397
$$ y = [-318826, 238514, -117762, 253072, -410008, -233451, -555239, -107418, -175145, -92272, 34940, -100457, -194258, -97520, 71905, -124913, -130820, 141176, 259407, 199342, 279721, -218661, -25734, -252471, -122499, -84745, -48361, -139146, -561059, -355517, 311023, 152209, -190774, 251731, -153205, 20303, -20446, -106961, 77133, -265663, 22227, 61521, 90086, -467245, 57215, -481314, -143041, 214125, -137802, -52270, -203811, 135606, 43645, -75611, -7900, -417476, -62427, 50602, -196730, -119466, -116059, 242363, -185518, 106671, -33676, -62094, -300287, -106216, 123626, -402799, -281797, -10043, 182280, -295860, -155755, 166322, -215111, -166342, -122054, -177959, -146925, -6809, 87266, 25397, 64535, -232964, -251242, -192182, 8816, -149127, -286524]
10035b86524j1186p3584B47838A02793b76403O0073o2340A9376b4568p8193A26338
10023b00048n1414A62735b21347j46125A01016P3984K394a75636F2465k4185J29947
10012A68227p6894c03889J01526K4450h2923L9425C50832a41859k8427j05259
10002b75545o6390a08703B37789j08430f1555C05960d2929k07717p0494k4218
9992c45358I9926b29065G2089b23989M5671c2875k09296M0029A44688K1457a53479
9980c7948l77978C93671i6516j74833k10024b13095h8377l66945e7175r0002l7735
9969a84912n0286b6073m97007A28655m5098g2361K9253A46429b72602M7305G6961
9957D0664b6999p7899I0397e0291K2890j03888m8440D3563a5880F4840d73781
$$ y = [-286524, -297710, -371294, 247838, 102793, -276403, -216330, -278670, 19376, -24568, -102761, 126338, -200048, -251462, 162735, -221347, -367472, 101016, 175000, 177394, -175636, 62465, 38280, 168227, 91333, -303889, -202363, -177913, -82923, -43498, 350832, -141859, -170286, -275545, -341935, -108703, 237789, 129359, -61555, 305960, -42929, -250646, -321140, -345358, 99926, -229065, 72089, -223989, -178318, -32875, -242171, -202142, 144688, 166145, -153479, -37948, -415926, 393671, -96516, -271349, -481373, -213095, -88377, -455322, -57175, -147177, -184912, -235198, -26073, -523080, 128655, 83557, -72361, -43108, 146429, -272602, -225297, 76961, 40664, -26999, -104898, 90397, -50291, -27401, -131289, -179729, 43563, -15880, 64840, -473781]
9945h4514C16151D8520J8286H040b20918B7402J06422m017p829d43450C8709a62785
9932a07182p4059P0216B36406D56c05603l8111p3898K05297A46301K213G818J58694
9920A66512P0942c10805L1727I3081a11185k84230k794a14878J4394b148E752
9908b6436l2958m99800g2398I734b69881O1560D2016A1598b67656Q8693D9163
9896b09410b3028H5564j0560a28907B0471N0559g2583o8199A05227B2642O5035
9885H7677G688a94754f1869C2245b82878j04902a52975G6117J19987c12277k4039
9874c36316r025O5732n8115P1042j11591G4013a10198B32959j01473k1566d3040
9862g373j61282D5588a57066I8421a76269G642a01195F3128c22618F3882a09742
$$ y = [-84514, 316151, 48520, 66806, 8040, -220918, 27402, 133824, 129807, 121978, -443450, 38709, -162785, -107182, -181241, -111025, 236406, 456, -305603, -343714, -417612, -212315, 146301, 148514, 7818, 166512, 237454, -310805, -279078, 93081, -111185, -395415, -398209, -114878, -100484, -2148, 5752, -26436, -59394, -559194, -72398, 9734, -269881, -208321, 42016, 11598, -267656, -178963, 49163, -209410, -23028, 85564, 75004, -128907, 20471, 71030, -72583, -140782, 105227, 22642, 87677, 7688, -194754, -61869, 32245, -282878, -387780, -152975, 76117, 196104, -312277, -336316, -345341, -279609, -337724, -266682, -378273, 74013, -110198, 232959, 131486, 109920, -43040, -7373, -168655, 45588, -157066, 98421, -176269, 7642, -101195, 63128, -322618, 63882, -109742]
9850a37305b2519A41873c16722B8438b81960j43375F9218b34316f4295D0448a89404
9838A5771a70062k8550q4754d7121k19847B40689a65908A68926G3730g5977l7823
9827a13800q0272j13370A2731K4673a0646k75640A20647c87428B39784b34880
9816B3670K10695j4349a13226l21849B1049a72178j17072J18634D13013f2196
9805a10507j29922h8647A8097b29108B0212c30150J36642H107M3712f6704A05174
9793e32552f2364l26191D3844J158c30888Q8777F2478b88758a16610q3357G655
9781a78608j29595B2513f9057A24304c032n4523j35174L2738j89218J17568Q8747
9770a42894m890q1738N2085A4494O081a34198l6327d7552o5837J0765B86341E8565
$$ y = [-137305, -22519, 141873, -316722, 28438, -281960, -425335, 69218, -234316, -64295, 40448, -189404, 15771, -170062, -198612, -283366, -47121, -266968, 240689, -165908, 168926, 73730, -75977, -113800, -194072, -307442, 12731, 37404, -10646, -286286, 120647, -387428, 239784, -234880, 23670, 234365, 220016, -113226, -435075, 21049, -172178, -289250, -170616, 413013, -62196, -110507, -240429, -88647, 18097, -229108, 20212, -330150, -193508, 8107, 51819, -66704, 105174, -532552, -62364, -388555, 43844, 45002, -330888, -242111, 62478, -288758, -116610, -199967, 7655, -178608, -308203, 22513, -69057, 124304, -3032, -57555, -192729, -159991, -349209, -231641, -142894, -147784, -229522, -177437, 14494, 20575, -134198, -170525, -47552, -113389, -102624, 286341, 58565]
9757b49008B20991a50446n6759G8161J9877f8413r5444a0122B33870F3826O5837
9746A29663b47929G2595b13154A12933e06418a79561j15912K9564D08152e46171
9735a72270F9925a14074C8395d3401l15432B38790p3952Q0470c174j91298G5680
9723c21627A86483a62952P7060a6524l31586a57104G9552c29206J03456A61054
9712f0046A47440a47928A45569i6128j17149j97307J50115A28509A5226e4741
9701F0114a35088L2365j38589m9656D2965Q5084j9684J81688C291L7548J4918
9690E5757a81127R971j02943A4253i6006j2015n3557g4099j42762b0065B4265
9678F0857J6146e8410j17573N578f7643k9325A39182h6118F686O6416A4332b02689
$$ y = [-249008, 220991, -150446, -207205, 78161, 98038, -68413, -163857, -10122, 233870, 63826, 129663, -247929, 72595, -213154, 112933, -506418, -179561, -295473, -265909, 408152, -546171, -172270, 69925, -114074, 38395, -43401, -358833, 238790, 164838, 245308, -3174, -194472, 75680, -321627, 186483, -162952, -85892, -16524, -348110, -157104, 79552, -329206, -225750, 161054, -60046, 147440, -147928, 145569, -96128, -213277, -410584, -260469, 128509, 15226, -54741, 60114, -135088, -102723, -241312, -290968, 42965, 128049, 108365, 290053, 3291, 40839, 55757, -181127, -171156, -274099, 14253, -96006, -108021, -161578, -74099, -216861, -20065, 24265, 60857, 77003, -58410, -175983, -170405, -67643, -96968, 139182, -86118, 6686, 73102, 14332, -202689]
9665B86100d21166J70140b4688m07322a03598d4023H4153J17267i9813k08120
9655c07933l134C7704c57309E4721f6351j89235B8401q119b38884c4228N87A33862
9642a20670j77608a17105C89011A6539a73809C47088a96401A5666b42278d3267
9631A15328h9089E8377K22990a5479r4239k87018g5813k79611h3625I006Q2924
9620I1930d849D0554h8028A0230J11066a55690B45437c94132c7279j87954k8042
9609b53275A72253D824L4609e7181A7493c06904b1608m48307a45855c329D1129
9597c36832g8945G9276L0625b76718G5603k7573b19614j2006A30895R5224h7179
9585a639j67020B71581a64885C20947B3143g5563j82606a01124G2571d4705j61390
$$ y = [286100, -421166, -251026, -24688, -432010, -103598, -44023, 84153, 201420, -99813, -307933, -311067, 37704, -357309, 54721, -66351, -255586, 28401, 20282, -238884, -34228, -33641, 133862, -120670, -298278, -117105, 389011, 16539, -173809, 347088, -196401, 15666, -242278, -43267, 115328, -89089, 58377, 281367, -15479, -109718, -396736, -75813, -355424, -83625, 9006, 91930, -4849, 40554, -88028, 10230, 121296, -155690, 245437, -394132, -37279, -225233, -253275, 172253, 4824, 39433, -57181, 17493, -306904, -21608, -469915, -145855, -3329, 41129, -336832, -78945, 79276, 109901, -276718, 75603, 48030, -219614, -231620, 130895, 226119, -87179, -1639, -168659, 271581, -164885, 320947, 23143, -75563, -258169, -101124, 72571, -44705, -206095]
9574b06095R432K6300H8839a21041p7482c6660I5576N4681a89159A1837b14595
9562F5815b43704C3123f8437j30613C17499b2171j98151C5939e7996i718j52657
9551a62375B00539b97430d6622j35153d9275j54773L4185b6537j24895n43474
9541f94906e6616l8708G1679a61719M0637e0174a0785m58368a28899a6867A3636
9529D9553J1971a36083o8431N8514k12791J02127d9148O272A56664m1354a22199
9517a66017n1772J05187k12813a30984j34487a17318k09917l0786L0909f8615
9506a09899l720j22318M0208L0186A23250o66a60559p5142k80455E5496e99378
9494a30994j5199l2730M2241k1268E8563R300c03643E2718b21621n1348a4084
$$ y = [-206095, -196663, -170363, 88839, -121041, -198523, -36660, 95576, 150257, -189159, 11837, -214595, 65815, -243704, 33123, -68437, -199050, 317499, -22171, -220322, 35939, -57996, -9718, -162375, 200539, -297430, -46622, -181775, -49275, -204048, -169863, -26537, -151432, -694906, -56616, -95324, 71679, -161719, -121082, -50174, -10785, -469153, -128899, -16867, 13636, 49553, 61524, -136083, -204514, -146000, -358791, -256664, -49148, -42876, 156664, 115310, -122199, -166017, -217789, -112602, -325415, -130984, -265471, -117318, -327235, -358021, -327112, -68615, -109899, -113619, -235937, -195729, -165543, 123250, 122584, -160559, -235701, -516156, 55496, -599378, -130994, -146193, -178923, -136682, -157950, 58563, 67863, -303643, 52718, -221621, -272969, -14084]
9482i0619A42310b16019O5287D444b9033k19116B25065P6581b99766c7390A51461
9470d65838B4706b56411g1241c58m48051i1081a9655G9581G809c5633k49116I3247
9457h9471N453b1536A30200e2047C842L3583J8094a19907c7653k43037a15749
9445a47852C0052i8574G3923a39051j66113o2860D919f5007F6438a65906Q0772
9434h5134E3613h517j33889A53157a65923f2173A38179b30541O304A14455R4476
9423B08931r1718d2042o7410d7921A48492a05016F5422O3149a16253P131I954
9411c91697o245a63472k06867i4153C975a26995D29949a08835p1225B82779A19374
9399B14959E7699L74051h9376i255k1317p3999A21604c848H9452c87421G2975
$$ y = [-90619, 142310, -216019, -150732, 4444, -29033, -248149, 225065, 301646, -299766, -37390, 151461, -465838, 24706, -256411, -71241, -358, -448409, -91081, -19655, 79581, 7809, -35633, -284749, 93247, -89471, -84018, -21536, 130200, -52047, 3842, 37425, 55519, -119907, -37653, -280690, -115749, -147852, 30052, -98574, 73923, -139051, -305164, -368024, 4919, -65007, 66438, -165906, -85134, 53613, -8517, -142406, 153157, -165923, -62173, 138179, -230541, -224237, 114455, 208931, 117213, -42042, -109452, -47921, 148492, -105016, 65422, 128571, -116253, -109122, 9954, -391697, -397942, -163472, -370339, -94153, 3975, -126995, 429949, -108835, -180060, 282779, 119374, 214959, 57699, 431750, -89376, -9255, -30572, -104571, 121604, -3848, 89452, -387421, 72975]
9387b56019B13738b77752g9856F527c19683f9783m0722N0313n2978l67626K07187
9376b73609k2833R7790f2766n6510l2766B74552a64018j59019A69527c5741G0332
9364A68535p6707l666a97732B1381a17705B34836f2397A78933a85611j0435O0081
9353a35965A69236a77020d9195E2388b34432i6190A79996k4476h2345a6164m9044
9342f5208o9677A44107c74473h4104k47407n2735a51053H8397B6775a92033k777
9331a94810K1472k0369e7706p7524a2036o5349k8863A00687i5276B88960A5277
9319B832e1346k54688e222k8568n0662D3432a66081o1130a06439B33707a68226
9307A71772c8246j62574B3995a21711c1597j33676m1563C95264H9506e02945a59923
$$ y = [-256019, 213738, -277752, -79856, 6527, -319683, -69783, -110505, -60192, -113170, -480796, -273609, -296442, -198652, -62766, -119276, -152042, 274552, -164018, -323037, 169527, -35741, 70332, 168535, 91828, 88162, -197732, 21381, -117705, 234836, -62397, 178933, -185611, -196046, -135965, 169236, -177020, -49195, 52388, -234432, -96190, 179996, 155520, -82345, -16164, -65208, -134885, 144107, -374473, -84104, -331511, -384246, -151053, 88397, 26775, -192033, -194810, -173338, -193707, -57706, -135230, -12036, -77385, -106248, 100687, -95276, 288960, 15277, 2832, -51346, -306034, -5222, -33790, -84452, 43432, -166081, -227211, -106439, 233707, -168226, 171772, -38246, -200820, 23995, -121711, -31597, -165273, -206836, 395264, 89506, -502945, -159923]
9295c48959a03913q4842C9328g4534A25945b14845D5002e58276A12138a96946
9284a2666A65367E3878R5156b69452d4688m6602M2595A51016b22262q1776a12427
9272a59454j87749B63051a95403r881O855J5720E31956h0026G4137b87346E2791
9260i5195K5771k16594f1383n0645I4567g737l4274l06943J48331I8411a18989
9248a30768c6614O487j55085A8070J32061a95743k3291D2900d2073k44756O8548
9237b18281j57782h7235B57456a26309f695k3006q1825a2852j04991d7824m945
9226e2769j72802m2088H903R8315c038j71794c8537m9564M227A47943d56916A46052
9213B01344F1417a66285A30030G695L1878b94291D04499b31604P812O3967A9562
$$ y = [-348959, -103913, -188755, 39328, -74534, 125945, -214845, 45002, -558276, 112138, -196946, -12666, 165367, 53878, 149034, -269452, -44688, -91290, -48695, 151016, -222262, -304038, -112427, -159454, -347203, 263051, -195403, -205284, -198429, -182709, 531956, -80026, 74137, -287346, 52791, -95195, -69424, -286018, -61383, -112028, 94567, -7737, -42011, -348954, -200623, 98411, -118989, -130768, -36614, -30127, -185212, 18070, 150131, -195743, -219034, 42900, -42073, -286829, -218281, -376063, -87235, 257456, -126309, -6695, -29701, -111526, -12852, -117843, -47824, -52769, -225571, -267659, 8903, 107218, -3038, -174832, -38537, -88101, -83874, 147943, -456916, 146052, 201344, 61417, -166285, 130030, 7695, 39573, -294291, 404499, -231604, -223792, -159825, 19562]
9201E7084M3431j3641c38565i0148G4097b46392l2735J24243k54543C8819b79289
9189d71635a25487C7970Q4573a24841j843A18170d9010j01178A79640d1043D51586
9177a79880b9235A53884g9420k88989a2889k49902j08827a49216A09132C9782
9166a82938B35055a07264A06520b39335R2297O6948K537a059j24679j95342D53847
9154c07461a11626a0494C74980a57532A72070B1521f9300M630j65912a09833e3474
9142a91912E4010b36479a03870l5435n8161g1929I4258b14163i4109M0514k76372
9131c29967C5883h119o5146k36876b8937C63553a81089A7728L26828A28593K10376
9120C38969a22438B38058a18260D0573R7681J99711F3754a1180l5058k8461L3967
$$ y = [57084, 100515, 86874, -338565, -90148, 74097, -246392, -279127, -154884, -409427, 38819, -279289, -471635, -125487, 37970, 122543, -124841, -126684, 118170, -49010, -150188, 179640, -41043, 451586, -179880, -29235, 153884, -79420, -368409, -12889, -262791, -371618, -149216, 109132, 39782, -182938, 235055, -107264, 106520, -239335, -147038, -80090, -77553, -1059, -125738, -321080, 453847, -307461, -111626, -10494, 374980, -157532, 172070, 21521, -69300, -64670, -230582, -109833, -53474, -191912, 54010, -236479, -103870, -139305, -197466, -71929, 94258, -214163, -94109, -53595, -329967, 35883, -8119, -73265, -310141, -28937, 363553, -181089, 17728, 344556, 128593, 338969, -122438, 238058, -118260, 40573, 138254, 337965, 63754, -11180, -46238, -74699, -40732]
9109d0732G2388b80432D114a65644c111j65342F4171a10292o4213A76992b25560
9097f1893B61919A549J66883k6301k0857c20471B2016b00688A42450b27088A80993
9085c02227C05390a44741p3505j3819L9865j73761J04962H3809H720b7862n5666
9074h3528l82038a07818q1349E3549g3962l44727h4511A47460c87265J60533c1362
9062a74387A51421d83301a99368o2387B9597c810B9302b09224j71308J18221a07017
9050d1508A43457A0412b45833Q4016A53959a50533j03448A104e9378r0322o4228
9039b13928N5570l2923B59431b87167A24943C5118J46460B6257b63942A22959
9028B01139e62753b58930p3922A44518c39911L6947A98820i3956I4763Q7235K4560
$$ y = [-40732, 72388, -280432, 4114, -165644, -3111, -168453, 64171, -110292, -174505, 176992, -225560, -61893, 261919, 1549, 168432, 142131, 121274, -320471, 22016, -200688, 142450, -227088, 180993, -302227, 305390, -144741, -218246, -232065, -192200, -365961, -260999, 83809, 8720, -27862, -83528, -465566, -107818, -189167, 53549, -73962, -418689, -84511, 147460, -387265, -226732, -31362, -174387, 151421, -483301, -199368, -261755, 29597, -3810, 29302, -209224, -380532, -262311, -107017, -41508, 143457, 10412, -245833, -161817, 153959, -150533, -253981, 1104, -59378, -149700, -213928, -158358, -191281, 259431, -287167, 124943, 35118, 181578, 26257, -263942, 122959, 201139, -562753, -258930, -332852, 144518, -339911, -302964, 198820, -93956, 94763, 181998, 206558]
9017B06558E9914L232a15299A32481b28531L9739E269R5831b05157F5194b37111
9005g5708j60927e2090b2076j29351B45392d11543a11654e5786F4920M464i0812
8993b47122A35788a4933l19871h4553K270b6711A06189f8351j17197N3400D1336
8981b22858N6573A6114i0115n1135B42438a15805A45747c0077A12760J02462b86435
8969b67821D59377b50132o5485I6250i3229A83084a23576n7838R340E9410B1512
8957I4800b32419a0802J405l79414A78843p1905f45608A24198a75862A54665A1136
8945c1479A39363a14901Q568a2639F2041b23878B25956A5851J2536J39477K3911
8934A91775c1067o0250l6400A30174B739K97234H2727Q62562J749796O30971l28447
$$ y = [206558, 59914, 63146, -115299, 132481, -228531, -188792, 5269, 101100, -205157, 65194, -237111, -75708, -236635, -52090, -22076, -151427, 245392, -411543, -111654, -55786, 64920, 69384, -90812, -247122, 135788, -14933, -334804, -84553, -82283, -26711, 106189, -68351, -185548, -132148, 41336, -222858, -166285, 16114, -90115, -141250, 242438, -115805, 145747, -30077, 112760, 215222, -286435, -267821, 459377, -250132, -315617, 96250, -93229, 183084, -123576, -181414, -172074, 59410, 21512, 94800, -232419, -10802, -9397, -388811, 178843, 106938, -645608, 124198, -175862, 154665, 11136, -31479, 139363, -114901, -106333, -12639, 62041, -223878, 225956, 15851, 28387, 167864, 191775, -31067, -91317, -127717, 130174, 2739, 299973, 82727, 945289, 2695085, 3326056, 2997609]
8923B997609J324128R71359L404352k033122B563959j237921F51252i008B42867
8913C54033d422C93122j83623M9619J303o9648J79122b7695k55628J01664E4535
8901f8125j52901r6873j8631A17165r996A3132L26020A67838C5692J69674d9270
8889A46710b5635l77197M7712J74780I3918J94110e01990d6280C28654a8618l82322
8878d00940H4767a67375j4970P1858B62174a22801c7775A25703d57409A3341c22082
$$ y = [2997609, 4321737, 5293096, 8697448, 6664326, 2563959, 1326038, 651252, -9008, 242867, 354033, -4422, 393122, 209499, 259118, 260421, 190773, 369895, -27695, -283323, -181659, 54535, -68125, -221026, -317899, -336530, 117165, 107169, 13132, 339152, 167838, 35692, 205366, -49270, 146710, -25635, -402832, -355120, -180340, 93918, 288028, -501990, -46280, 328654, -18618, -400940, 84767, -167375, -182345, -110487, 262174, -122801, -37775, 125703, -457409, 13341, -322082]
$$ [...]
##END NTUPLES=NMR SPECTRUM
##END=
