##TITLE=AC1518_ROEFFECT0004_8202063_28mcDXYmqJ
##JCAMPDX= 6.0         $$ Bruker NMR JCAMP-DX V2.0
##DATA TYPE= NMR SPECTRUM
##DATA CLASS= NTUPLES
##ORIGIN= BRUKER
##OWNER= Administrator
$$ 1.72 TOPSPIN		Version 2.1
$$ 2013-09-26 20:44:06.868 -0700  Administrator@X
$$ Compression mode = diff/dup
##.OBSERVE FREQUENCY= 400.02188249412
##.OBSERVE NUCLEUS= ^1H
##.ACQUISITION MODE= SIMULTANEOUS (DQD)
##.ACQUISITION SCHEME= undefined
##.AVERAGES= 64
##.DIGITISER RES= 22
##SPECTROMETER/DATA SYSTEM= spect
##.PULSE SEQUENCE= noesygpps1d.comp
##.SOLVENT NAME= COFFEE_meoh
##.SHIFT REFERENCE= INTERNAL, COFFEE_meoh, 1, 14.9614
##AUDIT TRAIL= $$ (NUMBER, WHEN, WHO, WHERE, PROCESS, VERSION, WHAT)
$$ ##TITLE= Audit trail, TOPSPIN		Version 2.1
$$ ##JCAMPDX= 5.01
$$ ##ORIGIN= Bruker BioSpin GmbH
$$ ##OWNER= Administrator
$$ $$ E:\/data/COFFEE/nmr/AC1518_ROEFFECT0004_8202063_28mcDXYmqJ/12/pdata/1/auditp.txt
$$ ##AUDIT TRAIL=  $$ (NUMBER, WHEN, WHO, WHERE, PROCESS, VERSION, WHAT)
(   1,<2013-09-26 20:44:01.633 -0700>,<Administrator>,<X>,<go>,<TOPSPIN 2.1>,
      <created by zg
	started at 2013-09-26 20:32:31.550 -0700,
	POWCHK enabled, PULCHK disabled,
       configuration hash MD5:
       C8 4E 4E 5D D3 5C D8 9E 9F 52 82 E0 59 8A DE 15
       data hash MD5: 64K
       74 D0 81 B4 61 A5 22 21 17 DC 8F F9 F3 8F FF E5>)
(   2,<2013-09-26 20:44:04.680 -0700>,<Administrator>,<X>,<proc1d>,<TOPSPIN 2.1>,
      <Start of raw data processing
       efp LB = 0.3 FT_mod = 6 PKNL = 1 PHC0 = 0 PHC1 = 0 SI = 128K 
       data hash MD5: 128K
       38 0E 4C BC 4E 1A CF 3B 14 7E 76 25 15 A5 11 75>)
(   3,<2013-09-26 20:44:05.821 -0700>,<Administrator>,<X>,<proc1d>,<TOPSPIN 2.1>,
      <pk PHC0 = -83.36975 PHC1 = 0 
       data hash MD5: 128K
       D3 C6 85 43 E5 1C 6C A0 EE E0 A0 60 50 33 39 B2>)
(   4,<2013-09-26 20:44:06.321 -0700>,<Administrator>,<X>,<proc1d>,<TOPSPIN 2.1>,
      <abs ABSG = 1 
       data hash MD5: 128K
       D2 EA F6 85 60 C4 10 D9 90 A8 32 EF F8 CE A6 72>)
(   5,<2013-09-26 20:44:06.415 -0700>,<Administrator>,<X>,<proc1d>,<TOPSPIN 2.1>,
      <abs ABSG = 2 
       data hash MD5: 128K
       4C DE B5 34 C8 60 7F 75 FF 55 05 FF 3C 1F B6 71>)
(   6,<2013-09-26 20:44:06.524 -0700>,<Administrator>,<X>,<proc1d>,<TOPSPIN 2.1>,
      <abs ABSG = 3 
       data hash MD5: 128K
       61 56 CE 72 A3 42 D0 EF BB 9A 80 83 3F C8 1C 5C>)
(   7,<2013-09-26 20:44:06.602 -0700>,<Administrator>,<X>,<proc1d>,<TOPSPIN 2.1>,
      <abs ABSG = 4 
       data hash MD5: 128K
       66 60 F9 07 A8 EC 23 FF EA A9 3F ED 9B 7F 0F CF>)
(   8,<2013-09-26 20:44:06.680 -0700>,<Administrator>,<X>,<proc1d>,<TOPSPIN 2.1>,
      <abs ABSG = 5 
       data hash MD5: 128K
       E3 8A 70 91 F3 04 6A A6 B2 E1 2E BB A8 65 69 57>)
$$ ##END=
$$ 
$$ $$ hash MD5
$$ $$ FD 19 30 3E 5A 86 7D C5 B0 16 EB FA 11 B1 C3 77
##$RELAX= 
##$RELAX= 
##$RELAX= 
##$RELAX= 
##$RELAX= 
##$RELAX= 
##$RELAX= 
##$RELAX= 
$$ Bruker specific parameters
$$ --------------------------
##$DU= <E:\>
##$EXPNO= 12
$$ [...]
##$TP07= 0
##$TPNAME0= <>
##$TPNAME1= <>
##$TPNAME2= <>
##$TPNAME3= <>
##$TPNAME4= <>
##$TPNAME5= <>
##$TPNAME6= <>
##$TPNAME7= <>
##$TPOAL= (0..7)
0.5 0.5 0.5 0.5 0.5 0.5 0.5 0.5
##$TPOFFS= (0..7)
0 0 0 0 0 0 0 0
##$TUNHIN= 0
##$TUNHOUT= 0
##$TUNXOUT= 0
##$USERA1= <user>
##$USERA2= <user>
##$USERA3= <user>
##$USERA4= <user>
##$USERA5= <user>
##$V9= 5
##$VALIST= <valist>
##$VCLIST= <CCCCCCCCCCCCCCC>
##$VD= 0
##$VDLIST= <DDDDDDDDDDDDDDD>
##$VPLIST= <PPPPPPPPPPPPPPP>
##$VTLIST= <TTTTTTTTTTTTTTT>
##$WBST= 1024
##$WBSW= 4
##$XGAIN= (0..3)
0 0 0 0
##$XL= 0
##$YL= 0
##$YMAX_a= 7418059
##$YMIN_a= -13959719
##$ZGOPTNS= <>
##$ZL1= 120
##$ZL2= 120
##$ZL3= 120
##$ZL4= 120
##$ABSF1= 14.9614
##$ABSF2= -5.596782
##$ABSG= 5
##$ABSL= 3
##$ALPHA= 0
##$AQORDER= 0
##$ASSFAC= 0
##$ASSFACI= 0
##$ASSFACX= 0
##$ASSWID= 0
##$AUNMP= <proc_prof1d_extract.lims>
##$AXLEFT= 0
##$AXNAME= <>
##$AXNUC= <1H>
##$AXRIGHT= 0
##$AXTYPE= 0
##$AXUNIT= <>
##$AZFE= 0.1
##$AZFW= 0.1
##$BCFW= 0
##$BC_mod= 0
##$BYTORDP= 0
##$COROFFS= 0
##$CY= 15
##$DATMOD= 1
##$DC= 0
##$DFILT= <>
##$DTYPP= 0
##$F1P= 0
##$F2P= 0
##$FCOR= 0.5
##$FTSIZE= 131072
##$FT_mod= 6
##$GAMMA= 0
##$GB= 0
##$INTBC= 1
##$INTSCL= 1
##$ISEN= 128
##$LB= 0.3
##$LEV0= 0
##$LPBIN= 0
##$MAXI= 10000
##$MC2= 0
##$MEAN= 0
##$ME_mod= 0
##$MI= 0
##$NCOEF= 0
##$NC_proc= -2
##$NLEV= 6
##$NOISF1= 0
##$NOISF2= 0
##$NSP= 0
##$NTH_PI= 0
##$NZP= 0
##$OFFSET= 14.9614
##$PC= 1
##$PHC0= -83.36975
##$PHC1= 0
##$PH_mod= 1
##$PKNL= yes
##$PPARMOD= 0
##$PPDIAG= 0
##$PPIPTYP= 0
##$PPMPNUM= 2147483647
##$PPRESOL= 1
##$PSCAL= 4
##$PSIGN= 0
##$PYNMP= <proc.py>
##$REVERSE= no
##$SF= 400.020009477919
##$SI= 131072
##$SIGF1= 0
##$SIGF2= 0
##$SINO= 400
##$SIOLD= 131072
##$SPECTYP= <>
##$SREGLST= <1H.CDCl3>
##$SSB= 0
##$STSI= 131072
##$STSR= 0
##$SW_p= 8223.68421052631
##$SYMM= 0
##$S_DEV= 0
##$TDeff= 65536
##$TDoff= 0
##$TI= <>
##$TILT= no
##$TM1= 0
##$TM2= 0
##$TOPLEV= 0
##$USERP1= <user>
##$USERP2= <user>
##$USERP3= <user>
##$USERP4= <user>
##$USERP5= <user>
##$WDW= 1
##$XDIM= 131072
##$YMAX_p= 294773267
##$YMIN_p= -46739175
##$CURPLOT= <Network HP LaserJet P1505>
##$CURPRIN= <$Network HP LaserJet P1505>
##$DFORMAT= <normdp>
##$LAYOUT= <+/1D_H.xwp>
##$LFORMAT= <normlp>
##$PFORMAT= <normpl>
##$SURQMSG= 1
$$ End of Bruker specific parameters
$$ ---------------------------------
##NTUPLES= NMR SPECTRUM
##VAR_NAME=  FREQUENCY,     SPECTRUM/REAL,   SPECTRUM/IMAG
##SYMBOL=    X,             R,               I
##VAR_TYPE=  INDEPENDENT,   DEPENDENT,       DEPENDENT
##VAR_FORM=  AFFN,          ASDF,            ASDF
##VAR_DIM=   131072,        131072,          131072
##UNITS=     HZ,            ARBITRARY UNITS, ARBITRARY UNITS
##FACTOR=    0.0627417313425164, 1,          1
##FIRST=     8223.62146879497, 101,          -72173
##LAST=      0,             1451,            -73350
##MIN=       0,             -46739175,       0
##MAX=       8223.62146879497, 294773267,    0
$$ Real data points
##PAGE= N=1
##DATA TABLE= (X++(R..R)), XYDATA
$$ [...]
63755C33574K21j16q81j585j744j135j66L76K48R9N25J151J159M84n1L12J598
63738C34069L222M407M543L681K673K431L072M009M805N400N611N052L852K920
63724C89747L039L930M548M170K947J528N56M46J215K340L051L004K621K505K656
63709D28303K463J504J22r54j358j321j299j582k188k800k909k264j222m03K5
63694D14117M11R30J241J048N98L33K97K47J68L07P48J292J739K022K121K077
63678D29696K056K155K219K028J638J328J271J465J818K089J925J319Q46J010
63664D52863J466J452R21N57O42O24J19l81l44j38m71j263j835j971k014j942
63648D48285j274o7P48N52m0M6R39J857K288K537L077L951M957O012P007P636
$$ y = [333574, 333795, 333679, 332798, 331213, 329469, 328334, 328168, 328544, 328792, 328891, 329416, 330567, 331726, 332210, 332159, 332471, 334069, 337291, 341698, 346241, 349922, 352595, 355026, 358098, 362107, 366912, 372312, 377923, 382975, 386827, 389747, 392786, 396716, 401264, 405434, 408381, 409909, 410465, 410911, 412126, 414466, 417517, 420521, 423142, 425647, 428303, 430766, 432270, 432392, 431438, 430080, 428759, 427460, 425878, 423690, 420890, 417981, 415717, 414495, 414092, 414117, 414528, 415458, 416699, 417747, 418345, 418678, 418975, 419222, 419390, 419697, 420445, 421737, 423476, 425498, 427619, 429696, 431752, 433907, 436126, 438154, 439792, 441120, 442391, 443856, 445674, 447763, 449688, 451007, 451853, 452863, 454329, 455781, 456702, 457259, 457901, 458525, 458644, 458263, 457919, 457781, 457310, 456047, 454212, 452241, 450227, 448285, 447011, 446944, 447692, 448244, 448204, 448250, 449189, 451046, 453334, 455871, 458948, 462899, 467856, 473868, 480875, 488511]
63632D88511P678P310O914O705O738P070P570P800P484P041P169P923Q732R481
63618E94126J0867J3223J5568J6598J6384J6305J7300J8978K0503K1610K2331
63607G83793K2486K2032K1448K1112K0651J9641J8634J8583J9274J9213J7397
63596A004264J4410J1345Q312M730O35l128n966q140j0157j2029j3323j3738j3496
63583I63719j3310j3920j5390j6914j7647j7667j7718j8087j8218j7650j6643
63572G80555j5590j4323j2537j0505q764p289n601l569j502N07K665M858O584
63559G15489P752Q941J0613J2606J4699J7100J9797K2000K2927K2906K3062K3970
63547I21862K5248K6363K7195K7720K7783K7480K7301K7623K8269K8800K8868
$$ y = [488511, 496189, 503499, 510413, 517118, 523856, 530926, 538496, 546296, 553780, 560821, 567990, 575913, 584645, 594126, 604993, 618216, 633784, 650382, 666766, 683071, 700371, 719349, 739852, 761462, 783793, 806279, 828311, 849759, 870871, 891522, 911163, 929797, 948380, 967654, 986867, 1004264, 1018674, 1030019, 1038331, 1043061, 1043696, 1040568, 1034602, 1026462, 1016305, 1004276, 990953, 977215, 963719, 950409, 936489, 921099, 904185, 886538, 868871, 851153, 833066, 814848, 797198, 780555, 764965, 750642, 738105, 727600, 718836, 711547, 705946, 702377, 700875, 701382, 704047, 708905, 715489, 723241, 732182, 742795, 755401, 770100, 787200, 806997, 828997, 851924, 874830, 897892, 921862, 947110, 973473, 1000668, 1028388, 1056171, 1083651, 1110952, 1138575, 1166844, 1195644, 1224512]
63536A224512K8044K5580K0682J3206M043n143j2729j8016k1364k3355k4026k3303
63524A188131k1893k1103k1534k2554k3294k3731k4448k5738k7395k9042l0239
63513I17160l0555k9934k8806k7413k5367k2402j9326j7478j7212j7515j7273
63502F63879j6341j5202j4135j3080j1980j0814r512q148p098o665o655o479n705
63489E32065m355k802j540r53j010j172p92K63J435K002J806J419J532K252L058
63474E33208L512L752M158M717N028M940M745M679M490L786K581J330M62L4j76
63459E81246m01o33o03p6P61J420J608J538J566J775K103K751M093O165Q509J0625
63443F22447J2448J4266J6253J8186J9634K0415K0811K1295K2014K2696K3115
$$ y = [1224512, 1252556, 1278136, 1298818, 1312024, 1316067, 1310924, 1298195, 1280179, 1258815, 1235460, 1211434, 1188131, 1166238, 1145135, 1123601, 1101047, 1077753, 1054022, 1029574, 1003836, 976441, 947399, 917160, 886605, 856671, 827865, 800452, 775085, 752683, 733357, 715879, 698667, 681152, 663879, 647538, 632336, 618201, 605121, 593141, 582327, 572815, 564667, 557569, 550904, 544249, 537770, 532065, 527710, 524908, 523368, 522415, 521405, 520233, 519441, 519704, 521139, 523141, 524947, 526366, 527898, 530150, 533208, 536720, 540472, 544630, 549347, 554375, 559315, 564060, 568739, 573229, 577015, 579596, 580926, 581388, 581422, 581246, 580845, 580212, 579609, 579533, 580294, 581714, 583322, 584860, 586426, 588201, 590304, 593055, 597148, 603313, 611822, 622447, 634895, 649161, 665414, 683600, 703234, 723649, 744460, 765755, 787769, 810465, 833580]
63432H33580K3473K4142K5173K6390K7888L0028L2776L5250L6179L4665L0484
63421A160028K4015J6277Q854L176k87j998k453j687K19K611M700O367Q069R957
63407A237848J1466J1891J0987Q861N643J610k599o371r672j2843j5867j8203
63395A222751j9518k0196k0826k1454k1762k1971k2971k5277k8094k9980l0369
63384I60333k9994k9584k8748k6638k3462k0492j8527j7049j5222j3007j0723
63373G26887q114m705r32K095M068N933Q571J1729J4600J6934J8982K0801K2238
63360H39087K3424K4696K6082K7276K8095K8653K9100K9479K9815L0065K9987
63349A145759K9349K8181K6601K4543K1946J9066J6157J2899Q681L492j939o927
$$ y = [833580, 857053, 881195, 906368, 932758, 960646, 990674, 1023450, 1058700, 1094879, 1129544, 1160028, 1184043, 1200320, 1209174, 1212350, 1212063, 1210065, 1207612, 1205925, 1206144, 1208755, 1213455, 1219822, 1227891, 1237848, 1249314, 1261205, 1272192, 1281053, 1286696, 1288306, 1285707, 1279336, 1269664, 1256821, 1240954, 1222751, 1203233, 1183037, 1162211, 1140757, 1118995, 1097024, 1074053, 1048776, 1020682, 990702, 960333, 930339, 900755, 872007, 845369, 821907, 801415, 782888, 765839, 750617, 737610, 726887, 718773, 714068, 713136, 715231, 719299, 725232, 733803, 745532, 760132, 777066, 796048, 816849, 839087, 862511, 887207, 913289, 940565, 968660, 997313, 1026413, 1055892, 1085707, 1115772, 1145759, 1175108, 1203289, 1229890, 1254433, 1276379, 1295445, 1311602, 1324501, 1333182, 1336674, 1334735, 1327808]
63337A327808j1261j4708j6709j7040j6369j5750j5753j6378j7568j9271k1220
63326A145781k3120k4950k6757k8126k8513k8044k7477k7064k6017k3548k0108
63315H62057j7043j5070j3618j1829r839q802r837j3095j7739k2473k6114k7941
63303F68657k7783k6002k3295k0432j7934j5935j4316j2969j1818j0645r165p431
63291D70932n950n111m701m241l699l465l612l698l450l162l108k974k362j610
63277D19789j482k061k536k164j001M45J807K811L079K473J497R99J373K281L123
63262D30433L550L551L212K631K005J709K049K880L608L837L893M377N256N765
63248D78756N407M634M293M644N328N988O490O645O275N714N782O937Q640R821
$$ y = [1327808, 1316547, 1301839, 1285130, 1268090, 1251721, 1235971, 1220218, 1203840, 1186272, 1167001, 1145781, 1122661, 1097711, 1070954, 1042828, 1014315, 986271, 958794, 931730, 905713, 882165, 862057, 845014, 829944, 816326, 804497, 794658, 785856, 776019, 762924, 745185, 722712, 696598, 668657, 640874, 614872, 591577, 571145, 553211, 537276, 522960, 509991, 498173, 487528, 478363, 470932, 464982, 459871, 455170, 450929, 447230, 443765, 440153, 436455, 433005, 429843, 426735, 423761, 421399, 419789, 418307, 416246, 413710, 411546, 410545, 410990, 412797, 415608, 418687, 421160, 422657, 423656, 425029, 427310, 430433, 433983, 437534, 440746, 443377, 445382, 447091, 449140, 452020, 455628, 459465, 463358, 467735, 472991, 478756, 484163, 488797, 493090, 497734, 503062, 509050, 515540, 522185, 528460, 534174, 539956, 546893, 555533, 565354]
63234E65354R957R559R572J0420J1713J2778J3359J3634J3751J3700J3637J3913
63222G11347J4527J4893J4530J3785J3407J3551J3626J3144J2208J1165J0227
63211H56410R535R136Q677P607N949M426L511K757J475l24k168l998o073q104
63197H88816r250r165q442p734o882n311k976m88J586L265N011P220R831J2317
63183H77798J4219J5714J7450J9655K1725K2961K3474K3963K4696K5207K4991
63172A111853K4089K2839K1397J9685J7571J4942J1816Q543N661L344J198j238
63160A261700m066p287j1041j5191j8980k1740k3813k6149k8958l1460l3044l3977
63148A005994l4613l4701l3986l2950l2146l1152k9047k5819k2544k0093j8360
$$ y = [565354, 575311, 584870, 594442, 604862, 616575, 629353, 642712, 656346, 670097, 683797, 697434, 711347, 725874, 740767, 755297, 769082, 782489, 796040, 809666, 822810, 835018, 846183, 856410, 865945, 875081, 883758, 891365, 897314, 901740, 905251, 908008, 909483, 909159, 906991, 902993, 896920, 888816, 879566, 870401, 861959, 854225, 847343, 842032, 839056, 838568, 840154, 843419, 848430, 855650, 865481, 877798, 892017, 907731, 925181, 944836, 966561, 989522, 1012996, 1036959, 1061655, 1086862, 1111853, 1135942, 1158781, 1180178, 1199863, 1217434, 1232376, 1244192, 1252735, 1258396, 1261740, 1262938, 1261700, 1257634, 1250347, 1239306, 1224115, 1205135, 1183395, 1159582, 1133433, 1104475, 1073015, 1039971, 1005994, 971381, 936680, 902694, 869744, 837598, 806446, 777399, 751580, 729036, 708943, 690583]
63137F90583j6841j5259j3459j1342r276p949p444o920n631l852k368j498j071
63124E87673r89j195j415j421j412j503j182R4J855K972K999K542K193J926J681
63109E94818J734K138K434K404K541L300M309M862M797M350L592K597J941K237
63095F38054L251M058M110L651L127K774K784L236L674L371K349J575J756K363
63081F80133K324J381K54m05o54q92j302j804k181k104j313R4J697L266M967O936
63065F90397Q906J0490J1693J2802J3831J4495J4807J5286J6349J7760J8974J9911
63053H65701K0979K2486K4375K6546K9046L1655L3673L4459L4197L3911L4560
63042A191588L6157L7821L8666L8585L8123L7654L6953L5694L4051L2439L0893
$$ y = [690583, 673742, 658483, 645024, 633682, 624406, 616457, 609013, 602093, 596462, 592610, 590242, 588744, 587673, 586684, 585489, 584074, 582653, 581241, 579738, 578556, 578650, 580505, 583477, 586476, 589018, 591211, 593137, 594818, 596552, 598690, 601124, 603528, 606069, 609369, 613678, 618540, 623337, 627687, 631279, 633876, 635817, 638054, 641305, 645363, 649473, 653124, 656251, 659025, 661809, 665045, 668719, 672090, 674439, 676014, 677770, 680133, 682457, 683838, 684092, 683687, 683033, 682141, 680839, 679035, 676854, 674750, 673437, 673531, 675228, 678494, 683461, 690397, 699303, 709793, 721486, 734288, 748119, 762614, 777421, 792707, 809056, 826816, 845790, 865701, 886680, 909166, 933541, 960087, 989133, 1020788, 1054461, 1088920, 1123117, 1157028, 1191588, 1227745, 1265566, 1304232, 1342817, 1380940, 1418594, 1455547, 1491241, 1525292, 1557731, 1588624]
63031A588624K9065K6828K4367K1739J8797J5675J2764J0052O938L136p84m135
63019A753066o983r857j2876j5716j8164k0165k1441k1661k0864j9325j7049j3886
63007A555079j0013n871j615K903P692J2556J7383K2017K6057K9359L2565L6338
62995A724450M0136M2627M3465M3726M4182M4087M2356L9289L6194L3694L1199
62984B165405K7971K3985J9640J5172J0619O010J336l637r311j5888k3037l0085
62972B188180l6661m2942m9010n4321n8273o1140o3729o6149o7601o7584o6519
62961A554251o4923o2660n9497n5770n2000m8373m4958m1995l9457l6873l4034
62950A013711l1428k9421k7603k5502k3421k1838k0471j8768j6938j5676j5105
$$ y = [1588624, 1617689, 1644517, 1668884, 1690623, 1709420, 1725095, 1737859, 1747911, 1754849, 1757985, 1757201, 1753066, 1746083, 1736226, 1723350, 1707634, 1689470, 1669305, 1647864, 1626203, 1605339, 1586014, 1568965, 1555079, 1545066, 1539195, 1537580, 1540483, 1548175, 1560731, 1578114, 1600131, 1626188, 1655547, 1688112, 1724450, 1764586, 1807213, 1850678, 1894404, 1938586, 1982673, 2025029, 2064318, 2100512, 2134206, 2165405, 2193376, 2217361, 2237001, 2252173, 2262792, 2268802, 2270138, 2266501, 2257190, 2241302, 2218265, 2188180, 2151519, 2108577, 2059567, 2005246, 1946973, 1885833, 1822104, 1755955, 1688354, 1620770, 1554251, 1489328, 1426668, 1367171, 1311401, 1259401, 1211028, 1166070, 1124075, 1084618, 1047745, 1013711, 982283, 952862, 925259, 899757, 876336, 854498, 834027, 815259, 798321, 782645, 767540]
62939G67540j4746j4288j3679j2685j1183r708q871q436p771o968o599o453n632
62926F40521m003k579k176k489k770k676k202j425o33j50R6L75N67L66jl5J95
62909F20981K23J77N01Q48M43l41j48J189K093J484K97j32J7j02l11J02Q11P76
62891F28908j80j245j856k102k038j562r24n89n51m81l75n25r15j225j305j160
62875F11875o60J86R00R68M59k29r61j769k545l221l864m220l733k508j602j679
62859E87397k201k527k973l797m122l210j995j794k108j438J35J095J085J299
62845E64846K061K157J171N02J081J820J560R98J287J962J872J216J099J646K069
62830E87347K173K424K752K588K014J694J730J616J366J637K561L394L560L306
$$ y = [767540, 752794, 738506, 724827, 712142, 700959, 691251, 682380, 673944, 666173, 659205, 652606, 646153, 640521, 636518, 633939, 631763, 629274, 626504, 623828, 621626, 620201, 619568, 619418, 619514, 619889, 620456, 620822, 620821, 620786, 620981, 621204, 621381, 621882, 622730, 623173, 622832, 622684, 623873, 625966, 627450, 627747, 627615, 627632, 627530, 627219, 627321, 628132, 628908, 628728, 627483, 625627, 623525, 621487, 619925, 619001, 618412, 617861, 617380, 617005, 616480, 615565, 614340, 613035, 611875, 611215, 611401, 612301, 613269, 613728, 613499, 612538, 610769, 608224, 605003, 601139, 596919, 593186, 590678, 589076, 587397, 585196, 582669, 579696, 575899, 571777, 568567, 566572, 564778, 562670, 561232, 561367, 562462, 563547, 564846, 566907, 569064, 570235, 570737, 571818, 573638, 575198, 576196, 577483, 579445, 581317, 582533, 583632, 585278, 587347, 589520, 591944, 594696, 597284, 599298, 600992, 602722, 604338, 605704, 607341, 609902, 613296, 616856, 620162]
62816F20162L105L013K886K696K439K102J783J497R89K17j69N17J885K779K764
62801F48665K627L264M709O511Q414J0227J1535J2080J2190J2450J3092J4007
62789G59771J5133J6526J8156J9899K1701K3609K5678K7989L0634L3577L6560
62778A029233L9155M0929M1653M1562M1359M1674M2387M2710M1982M0162L7544
62767A480350L4348L0839K7445K4315K0882J6399J0901N210k12n880j2368j9157
62755A613072k5081k9858l4363l9158m3458m6208m7572m8534m9320m9140m7560
62744A152820m5229m2930m0695l8287l5868l3604l1110k8012k4671k1748j9242
62733G91424j6678j4072j2008j0671r454p787n860m238l047j926o28O31J505K087
$$ y = [620162, 623267, 626280, 629166, 631862, 634301, 636403, 638186, 639683, 640672, 640889, 640720, 641237, 643122, 645901, 648665, 651292, 654556, 659265, 665776, 674190, 684417, 695952, 708032, 720222, 732672, 745764, 759771, 774904, 791430, 809586, 829485, 851186, 874795, 900473, 928462, 959096, 992673, 1029233, 1068388, 1109317, 1150970, 1192532, 1233891, 1275565, 1317952, 1360662, 1402644, 1442806, 1480350, 1514698, 1545537, 1572982, 1597297, 1618179, 1634578, 1645479, 1650689, 1650477, 1644597, 1632229, 1613072, 1587991, 1558133, 1523770, 1484612, 1441154, 1394946, 1347374, 1298840, 1249520, 1200380, 1152820, 1107591, 1064661, 1023966, 985679, 949811, 916207, 885097, 857085, 832414, 810666, 791424, 774746, 760674, 748666, 737995, 728541, 720754, 714894, 710656, 707609, 705683, 705055, 705686, 707191, 709278]
62719G09278K968M631O862Q982J0654J2215J4123J6436J8954K1548K4141K6695
62707H77487K9401L2546L5937L8933M1421M4191M7817N1640N4648N6952N9467
62696A370440O2338O4676O5952O6597O6965O6607O5120O2959O0765N8351N5032
62685B065802N0607M5393L9508L2646K4647J5760O329l564j4000k4872l5644m5510
62673B157102n3916o1027o7370p2998p7237p9420p9592p8323p6074p3075o9577
62662A368493o5936o2387n8914n5294n1283m6882m2472l8498l4981l1671k8652
62651H51523k6332k4613k2615j9731j6583j4319j3149j2254j1055r881r165q683
62639F63143q005p250o771o382n492m098k997k784l026k816j940j070q43j155
$$ y = [709278, 712246, 716877, 723739, 732721, 743375, 755590, 769713, 786149, 805103, 826651, 850792, 877487, 906888, 939434, 975371, 1014304, 1055725, 1099916, 1147733, 1199373, 1254021, 1310973, 1370440, 1432778, 1497454, 1563406, 1630003, 1696968, 1763575, 1828695, 1891654, 1952419, 2010770, 2065802, 2116409, 2161802, 2201310, 2233956, 2258603, 2274363, 2280692, 2277128, 2263128, 2238256, 2202612, 2157102, 2103186, 2042159, 1974789, 1901791, 1824554, 1745134, 1665542, 1587219, 1511145, 1438070, 1368493, 1302557, 1240170, 1181256, 1125962, 1074679, 1027797, 985325, 946827, 911846, 880175, 851523, 825191, 800578, 777963, 758232, 741649, 727330, 714181, 701927, 690872, 680991, 671826, 663143, 655138, 647888, 641117, 634735, 629243, 625145, 622148, 619364, 616338, 613522, 611582, 610512, 609669, 608514]
62625F08514j492j649j816k170k584k796k672k249j666j097o70l93j14M04J297
62610E88847K401L412M243N106O058O745O919O973P484Q362R058R620J0689J2269
62596F88186J3410J3664J3995J5423J7368J8432J8394J8288J8520J8225J6814
62585H70719J5135J4435J4757J4947J3988J1836R183O682M352J704j458m576p071
62572I64633r240j1831j4814j7346j9012k0228k1262k1769k1600k1238k0927k0171
62560G45195j8664j6996j5754j4555j2808j0908r719r215q526p220n722m489l540
62547F07079k846k534k530k488k241j905j510q41J97J397K386K814K586K198K578
62532F04340M157O137P187O890O166O292P777J0146J2507J4264J5544J6941J8794
$$ y = [608514, 607022, 605373, 603557, 601387, 598803, 596007, 593335, 591086, 589420, 588323, 587653, 587260, 587146, 587550, 588847, 591248, 594660, 598903, 604009, 610067, 616812, 623731, 630704, 638188, 646550, 655608, 665228, 675917, 688186, 701596, 715260, 729255, 744678, 762046, 780478, 798872, 817160, 835680, 853905, 870719, 885854, 900289, 915046, 929993, 943981, 955817, 965000, 971682, 976034, 977738, 976280, 971704, 964633, 955393, 943562, 928748, 911402, 892390, 872162, 850900, 829131, 807531, 786293, 765366, 745195, 726531, 709535, 693781, 679226, 666418, 655510, 645791, 636576, 628050, 620830, 615108, 610619, 607079, 604233, 601699, 599169, 596681, 594440, 592535, 591025, 590184, 590381, 591778, 594164, 596978, 599564, 601762, 604340, 608497, 614634, 621821, 628711, 634877, 641169, 648946, 659092, 671599, 685863, 701407, 718348, 737142]
62519G37142K0925K3101K5368K7646K9520L0854L2172L3890L5531L6423L6867
62508A069439L7764L9140L9883L9194L7610L6300L5678L5044L3338L0178K6220
62497A459788K2459J9057J5203J0367N228R17k264m778o973q988j1118j3386j5021
62484A470491j5330j4864j4716j4811j4079j2383j0934j0561j0782j1145j2171
62473A328715j4279j6848j9238k1750k4687k7267k8685k9629l1530l4527l7215
62462A043060l8426l8291l7538l6504l5110l3269l1070k8744k6469k4136k1476
62451F92027j8600j6027j3912j1764r240o804n108m134l429k825k310j612n64
62438E95698L87O55L19q3k38l6P27J859K354J441j34p73q7N81p9j880l651m639
$$ y = [737142, 758067, 781168, 806536, 834182, 863702, 894556, 926728, 960618, 996149, 1032572, 1069439, 1107203, 1146343, 1186226, 1225420, 1263030, 1299330, 1335008, 1370052, 1403390, 1433568, 1459788, 1482247, 1501304, 1516507, 1526874, 1532102, 1533019, 1530755, 1525977, 1519004, 1510016, 1498898, 1485512, 1470491, 1455161, 1440297, 1425581, 1410770, 1396691, 1384308, 1373374, 1362813, 1352031, 1340886, 1328715, 1314436, 1297588, 1278350, 1256600, 1231913, 1204646, 1175961, 1146332, 1114802, 1080275, 1043060, 1004634, 966343, 928805, 892301, 857191, 823922, 792852, 764108, 737639, 713503, 692027, 673427, 657400, 643488, 631724, 622484, 615680, 610572, 606438, 603009, 600184, 597874, 596262, 595698, 596085, 596740, 597059, 596976, 596738, 596702, 597429, 599288, 601642, 603083, 602949, 602176, 602089, 602670, 602591, 600711, 597060, 592421]
62420E92421m945n028n157n193m792l890k897k195j756j477j560k030k319j966
62406E47216j427j363j468r67r0J45l51m68L66J298J484J327J601K203K611K956
62390E55073L743M874N733O004N842N515N308N496N990O363O572P162Q264Q988
62376F40927Q608P840Q090R634J1384J2371J2650J2810J3345J4654J6904J9635
62364G88852K1974K3508K4555K5648K7099K9113L1681L4262L6080L7003L7713
62353A117488L8761L9890M0516M0474L9960L9066L7740L5887L3219K9297K4160
62342A516458J8765J4172J0289N845j64p284j4062j9393k3182k5945k8285l0673
62330A416541l3282l5791l7649l8722l9412l9926l9828l8702l6865l4957l3050
$$ y = [592421, 587476, 582448, 577291, 572098, 567306, 563416, 560519, 558324, 556568, 555091, 553531, 551501, 549182, 547216, 545789, 544426, 542958, 541991, 541901, 542046, 541695, 541227, 541593, 542891, 544375, 545702, 547303, 549506, 552117, 555073, 558816, 563690, 569423, 575427, 581269, 586784, 592092, 597588, 603578, 609941, 616513, 623675, 631939, 640927, 649535, 657375, 665465, 675099, 686483, 698854, 711504, 724314, 737659, 752313, 769217, 788852, 810826, 834334, 858889, 884537, 911636, 940749, 972430, 1006692, 1042772, 1079775, 1117488, 1156249, 1196139, 1236655, 1277129, 1317089, 1356155, 1393895, 1429782, 1463001, 1492298, 1516458, 1535223, 1549395, 1559684, 1565529, 1565365, 1558081, 1544019, 1524626, 1501444, 1475499, 1447214, 1416541, 1383259, 1347468, 1309819, 1271097, 1231685, 1191759, 1151931, 1113229, 1076364, 1041407, 1008357]
62319A008357l0811k8412k6483k5141k3841k2356k1087k0120j8798j6840j5072
62308G59396j4293j4031j3237j1764j0252q882p312n628m377l538k554j469j083
62295F60976j613k117j760r16l77j44K98R16J135P81M24P19J707K749L056K455
62279F68289J706J783K682L381L235K915L476M896O232O988P645Q816J0498J2341
62265G44883J4186J6128J8348K1038K4179K7260K9581L0987L2103L3570L5378
62254A027641L7086L8524L9826M0914M1324M0757L9480L8014L6466L4412L1392
62243A445836K7325K2387J6699J0305L426l489j0026j6024k1448k6240l0406l4210
62231A384135l8023m1809m4868m6386m6348m5619m4849m3560m0864l6984l3429
$$ y = [1008357, 977546, 949134, 922651, 897510, 873669, 851313, 830226, 810106, 791308, 774468, 759396, 745103, 731072, 717835, 706071, 695819, 686937, 679625, 673997, 669620, 666082, 663528, 662059, 660976, 659363, 657246, 655486, 654570, 654193, 654049, 654347, 655263, 656398, 657179, 657603, 658322, 660029, 662778, 665834, 668289, 669995, 671778, 674460, 677841, 681076, 683991, 687467, 692363, 698595, 705583, 713228, 722044, 732542, 744883, 759069, 775197, 793545, 814583, 838762, 866022, 895603, 926590, 958693, 992263, 1027641, 1064727, 1103251, 1143077, 1183991, 1225315, 1266072, 1305552, 1343566, 1380032, 1414444, 1445836, 1473161, 1495548, 1512247, 1522552, 1525978, 1522489, 1512463, 1496439, 1474991, 1448751, 1418345, 1384135, 1346112, 1304303, 1259435, 1213049, 1166701, 1121082, 1076233, 1032673, 991809, 954825, 921396]
62220I21396l1293k9965k8013k4970k1634j8917j7023j5731j4677j3387j1588
62209F94198r728q506p875p081n931n111m967m694l494j810n94J44J081K223K881
62194F40736K997L427M574N681N985N900O345P334P929P529O653O383P271Q867
62180G27611J0142J0416R996R846J0553J1790J2842J3448J3871J4399J5110J6060
62168H76084J7293J8634J9772K0685K1647K2747K3661K4151K4505K5179K6168
62157A120526K7026K7376K7037K5718K3134J9529J5604J1669P304K242k856p013
62145A297296j0072j2683j5325j7913k0296k2435k4040k4679k4460k4016k3551
62134A077826k2462k0254j7282j4166j1001p635m372j690M92K689M999O987Q422
$$ y = [921396, 890103, 860138, 832125, 807155, 785521, 766604, 749581, 733850, 719173, 705786, 694198, 684470, 675964, 668089, 661008, 655077, 649966, 644999, 640305, 636811, 635001, 634407, 634551, 635632, 637855, 640736, 643733, 647160, 651734, 657415, 663400, 669300, 675645, 682979, 690908, 698437, 705090, 711473, 718744, 727611, 737753, 748169, 758165, 768011, 778564, 790354, 803196, 816644, 830515, 844914, 860024, 876084, 893377, 912011, 931783, 952468, 974115, 996862, 1020523, 1044674, 1069179, 1094358, 1120526, 1147552, 1174928, 1201965, 1227683, 1250817, 1270346, 1285950, 1297619, 1304923, 1307165, 1304309, 1297296, 1287224, 1274541, 1259216, 1241303, 1221007, 1198572, 1174532, 1149853, 1125393, 1101377, 1077826, 1055364, 1035110, 1017828, 1003662, 992661, 985026, 980654, 978964, 979456, 982145, 987144, 994131, 1002553]
62121A002553R606J0920J2326J3576J4577J5437J6216J6760J6850J6623J6641
62110A162085J7239J7813J7393J5992J4721J4245J3858J2752J1369J0570R983
62099A318020Q517O323M998N554P198Q531R052R041Q715Q163P550O913O109N379
62085A420063N465O776Q803J0756J2393J3831J5046J6060J7219J8785K0457K1810
62073A587464K2956K4294K5728K6688K6835K6415K5818K5102K3983K2231K0067
62062A857581J8102J6677J5324J3353J0920Q982P983P296O206M831L534K064l7
62049A972816k674n456q413j1750j5306j8938k3042k7904l2822l6914m0557m4903
62037A704137m9902n4041n6271n7236n8052n8788n8790n7752n5801n3055m9791
$$ y = [1002553, 1012159, 1023079, 1035405, 1048981, 1063558, 1078995, 1095211, 1111971, 1128821, 1145444, 1162085, 1179324, 1197137, 1214530, 1230522, 1245243, 1259488, 1273346, 1286098, 1297467, 1308037, 1318020, 1326537, 1332860, 1337858, 1343412, 1350610, 1359141, 1368193, 1377234, 1385949, 1394112, 1401662, 1408575, 1414684, 1420063, 1425528, 1432304, 1441107, 1451863, 1464256, 1478087, 1493133, 1509193, 1526412, 1545197, 1565654, 1587464, 1610420, 1634714, 1660442, 1687130, 1713965, 1740380, 1766198, 1791300, 1815283, 1837514, 1857581, 1875683, 1892360, 1907684, 1921037, 1931957, 1940939, 1948922, 1956218, 1962424, 1967255, 1970789, 1972853, 1972816, 1970142, 1964686, 1956273, 1944523, 1929217, 1910279, 1887237, 1859333, 1826511, 1789597, 1749040, 1704137, 1654235, 1600194, 1543923, 1486687, 1428635, 1369847, 1311057, 1253305, 1197504, 1144449, 1094658]
62026A094658m6626m3857m0912l7163l2944k9136k6004k3127k0359j8021j6106
62015G60403j4153j2160j0901j0820j1086j0403q553o554n358m906m549l923l136
62002F53901k430j949j648j229l39Q28J464J032J17k01J77J71r76k595l494l525
61986F39304l657m683o329p688q129p759p300p375p772p605o500n261m875n181
61972E49190n214m690m268m250l989k883j317p8N46O10M0j050j888j648m01J071
61956E19781K288L395M538N503O061O344O690P333Q286R276R924J0185J0576J1661
61942F21841J3328J4918J5990J6637J7082J7404J7707J8145J8603J8669J8153
61931H08477J7351J6666J6191J5831J5481J4907J3769J2103J0531R620R183Q596
$$ y = [1094658, 1048032, 1004175, 963263, 926100, 893156, 864020, 838016, 814889, 794530, 776509, 760403, 746250, 734090, 723189, 712369, 701283, 690880, 682327, 675773, 670415, 665509, 660960, 657037, 653901, 651471, 649522, 647874, 646645, 646306, 647134, 648598, 649630, 649747, 649546, 649723, 649894, 648918, 646323, 642829, 639304, 635647, 630964, 624635, 616947, 608818, 601059, 593759, 586384, 578612, 571007, 564507, 559246, 554371, 549190, 543976, 539286, 535018, 530768, 526779, 523896, 522579, 522501, 523047, 523657, 523697, 522647, 520759, 519111, 518710, 519781, 522069, 525464, 530002, 535505, 541566, 547910, 554600, 561933, 570219, 579495, 589419, 599604, 610180, 621841, 635169, 650087, 666077, 682714, 699796, 717200, 734907, 753052, 771655, 790324, 808477, 825828, 842494, 858685, 874516, 889997, 904904, 918673, 930776, 941307, 950927, 960110, 968706]
61919I68706P578O376N313M544M162M086L892L247K497K327K837L561M475O068
61905A029669Q093R191Q537P212O844P377P267N741L577J502q20l719o538q624
61891A075309j0468j2904j5710j7934j9275k0211k0960k1184k0722j9826j8664
61880H77451j7233j5740j4500j3424j2253j1217j0789j0789j0512r763q955q068
61868G34208o425l844j186P89K309L890N442O775Q286J0371J2600J4308J5646
61855H03169J7235J9003K0276K0924K1596K2695K3856K4646K5183K5795K6458
61844A050836K6828K6592K5728K4644K3943K3748K3369K2039J9813J7234J4352
61833A299126J0838P083M179K533J330j67j526k007j841j729j540n29J207K511
$$ y = [968706, 976284, 982660, 987973, 992517, 996679, 1000765, 1004657, 1007904, 1010401, 1012728, 1015565, 1019126, 1023601, 1029669, 1037762, 1046953, 1055490, 1062702, 1069546, 1076923, 1084190, 1089931, 1093508, 1095010, 1094190, 1090471, 1083933, 1075309, 1064841, 1051937, 1036227, 1018293, 999018, 978807, 957847, 936663, 915941, 896115, 877451, 860218, 844478, 829978, 816554, 804301, 793084, 782295, 771506, 760994, 751231, 742276, 734208, 727783, 723939, 722753, 723542, 725851, 729741, 735183, 741958, 750244, 760615, 773215, 787523, 803169, 820404, 839407, 859683, 880607, 902203, 924898, 948754, 973400, 998583, 1024378, 1050836, 1077664, 1104256, 1129984, 1154628, 1178571, 1202319, 1225688, 1247727, 1267540, 1284774, 1299126, 1309964, 1317047, 1321226, 1323759, 1325089, 1324922, 1323396, 1321389, 1319548, 1317819, 1316279, 1315750, 1316957, 1319468]
61819A319468K579J836J082M74l43j617l624o838j1393j6468k0836k3960k6200
61806A214160k8027k9514l0562l1041l0657k9163k7032k5364k4741k4497k3529
61795I10033k1612j9399j7363j5321j3095j1005r440q304p216o049m983m152l441
61782G68653k651j690p09n3pm40q58q62m72Q0O42J082J158O89j34q62j220j286
61764G61060j307j460j768k106k292k239k040j848j753j818k066k300k091j344
61750G34628p41j170k580l766l662k560j667j564j683j350q04p92j464k197k386
61735G06242j971j177k10O34R77P49L18R0J66M70Q72J076Q59O24J152K360K981
61718G16212K125O62Q3L76J94q61j488o67P06J010j5j228j682j436j030r13j289
$$ y = [1319468, 1322047, 1323883, 1324965, 1325439, 1325096, 1323479, 1319855, 1313017, 1301624, 1285156, 1264320, 1240360, 1214160, 1186133, 1156619, 1126057, 1095016, 1064359, 1035196, 1008164, 982800, 958059, 933562, 910033, 888421, 869022, 851659, 836338, 823243, 812238, 802798, 794494, 787278, 781229, 776246, 772094, 768653, 766002, 764312, 763603, 763550, 763543, 763103, 762245, 761383, 760911, 760991, 761633, 762715, 763873, 764562, 764428, 763566, 762346, 761060, 759753, 758293, 756525, 754419, 752127, 749888, 747848, 746000, 744247, 742429, 740363, 738063, 735972, 734628, 733887, 732717, 730137, 726371, 722709, 720149, 718482, 716918, 715235, 713885, 713081, 712289, 710825, 708628, 706242, 704271, 703094, 702884, 703518, 704495, 705244, 705562, 705652, 705818, 706288, 707160, 708236, 709095, 709719, 710871, 713231, 716212, 718337, 718999, 719082, 719458, 719652, 718791, 717303, 716636, 717342, 718352, 718337, 717109, 715427, 713991, 712961, 712048, 710759]
61701G10759k018k636k864k950l125l056k332j275o17n11m72k20M5K73P57J522
61685F91280K080K156K127K341K434J809O73k9K88J183J741J498O18n53j701k464
61669G05481k559k200k017k308k683k755k845l470m323m539m029l762m392n260
61655F58339n271m314l286k941l185l309k626j084M49Q71J09p11o92k47k28n59
61639F31315n18k7K82J46j00m32j275k528l261k831j791j212j493k229k945l574
61623F07527m218m780m973m637m025l505l022k233j286r55j587k434k630k371
61609E64871k448k979l528m109n008n768n572m812m957o394p631p321o064n277
61595D93003n096m563l411k474k333k575k619k603l069m094m998m935l747k268
$$ y = [710759, 708741, 706105, 703241, 700291, 697166, 694110, 691778, 690503, 689886, 689375, 688903, 688683, 688728, 689001, 689758, 691280, 693360, 695516, 697643, 699984, 702418, 704227, 704900, 704871, 705159, 706342, 708083, 709581, 710199, 709646, 707945, 705481, 702922, 700722, 698705, 696397, 693714, 690959, 688114, 684644, 680321, 675782, 671753, 667991, 663599, 658339, 653068, 648754, 645468, 642527, 639342, 636033, 633407, 632323, 632772, 633643, 633752, 633041, 632349, 632102, 631874, 631315, 630797, 630770, 631052, 631198, 631098, 630666, 629391, 626863, 623602, 620771, 618980, 617768, 616275, 614046, 611101, 607527, 603309, 598529, 593556, 588919, 584894, 581389, 578367, 576134, 574848, 573893, 572306, 569872, 567242, 564871, 562423, 559444, 555916, 551807, 546799, 541031, 535459, 530647, 525690, 519296, 511665, 504344, 498280, 493003, 487907, 483344, 479933, 477459, 475126, 472551, 469932, 467329, 464260, 460166, 455168, 450233, 446486, 444218]
61581D44218j622k092k932l348l278l065k746k136j377r13r90j393j700j609j109
61566D13908m62l7k8l81q42j040o86J5M03J81n2L97J181J367Q75N97R95J531J732
61547D19654J879K152K056J332O60P28J199J370J285J397J596J413R15O16P07
61532D38959R73J275J545J566J279J001Q50M13n25j441j902k372l333m183l974
61517D30131k914k064j825j774j747j976k241k018j575j742k473k738k047j107
61503D01890o39n36n14o64r61j053r14r26j012n94K37N03j78q21m84M01Q59P68
61485C95362O66P70J004J393J728J359J59q56q00k73m49j218j359m12Q14J639
61469C99527K259K825K822J898O34j01j01K94P80J101Q57l4q95q35J50J070J128
$$ y = [444218, 442596, 440504, 437572, 434224, 430946, 427881, 425135, 422999, 421622, 420709, 419719, 418326, 416626, 415017, 413908, 413446, 413409, 413381, 413000, 412158, 411118, 410432, 410447, 410850, 411031, 410979, 411376, 412557, 413924, 414799, 415396, 416391, 417922, 419654, 421533, 423685, 425741, 427073, 427733, 428461, 429660, 431030, 432315, 433712, 435308, 436721, 437636, 438252, 438959, 439932, 441207, 442752, 444318, 445597, 446598, 447448, 447861, 447336, 445895, 443993, 441621, 438288, 434105, 430131, 427217, 425153, 423328, 421554, 419807, 417831, 415590, 413572, 411997, 410255, 407782, 405044, 402997, 401890, 401251, 400715, 400201, 399537, 398576, 397523, 396609, 395683, 394671, 394077, 394314, 394817, 394639, 393818, 393334, 393735, 394594, 395362, 396028, 396798, 397802, 399195, 400923, 402282, 402441, 401585, 400785, 400512, 400063, 398845, 397486, 397074, 397888, 399527, 401786, 404611, 407433, 409331, 409965, 409864, 409763, 410057, 410837, 411938, 412795, 412761, 411866, 411031, 411181, 412251, 413379]
61452D13379O85P55J616K384K136J127M67P04J270J429J233J162J291J258R55
61437D31851P18Q69J379J932K191K022J752J959K765L545L590K935K137J477Q78
61422D62000M59N60J143J694J880J884J923J884J672J481J389J068L03m83o99
61407D78158n04o99j607k553k781k473k422k810k963k441j895k205l122l469k748
61392D43466j819j646k007k018j510j086r63o40J72Q90Q15N6o56q38n73j58K83
61375D31768Q51J665K544K881K196R64M22J222K554L122K753K443K890L658L995
61360D65928L964M202M925N633N824N589N439N716O281O745O974P322Q184R297
61346E52023R786R161Q095P770Q558R689J0244J0086R590Q867P700O080M428L162
$$ y = [413379, 414064, 414819, 416435, 418819, 420955, 422082, 422549, 423253, 424523, 425952, 427185, 428347, 429638, 430896, 431851, 432569, 433438, 434817, 436749, 438940, 440962, 442714, 444673, 447438, 450983, 454573, 457508, 459645, 461122, 462000, 462459, 463019, 464162, 465856, 467736, 469620, 471543, 473427, 475099, 476580, 477969, 479037, 479340, 478857, 478158, 477654, 476955, 475348, 472795, 470014, 467541, 465119, 462309, 459346, 456905, 455010, 452805, 449683, 446214, 443466, 441647, 440001, 437994, 435976, 434466, 433380, 432417, 431777, 431949, 432839, 433654, 433710, 433054, 432216, 431643, 431485, 431768, 432619, 434284, 436828, 439709, 441905, 442869, 443291, 444513, 447067, 450189, 452942, 455385, 458275, 461933, 465928, 469892, 474094, 479019, 484652, 490476, 496065, 501504, 507220, 513501, 520246, 527220, 534542, 542726, 552023, 561809, 570970, 579065, 586835, 595393, 605082, 615326, 625412, 635002, 643869, 651569, 657649, 662077, 665239]
61332F65239K303J611R40L12l05j066k038k999l574l613l348l034k639k061j520
61317F44208j351j329o54J089L164M359M297L777L780M445N206N615N787O055
61303F88448O482O802O818O694O750P067P335P153O349N082L705K470J290j32
61289G62313j809l304m298n101o088o822o483n234m341m517m926m449l241k209
61275F99491j424k10J423K579K860K977L611M464N001N453O470Q067R528J0201
61261G60491J0049R487Q954Q618Q345Q001P733P803Q127Q290Q054P572P066O573
61247H75163O028N260L952K001o6j530k424l572n447p416q411q028o775n520m817
61232H38398m469l713k169m97M13P82J642L172M315M465M481N363O742P562P644
$$ y = [665239, 667542, 669153, 670093, 670405, 670100, 669034, 666996, 663997, 660423, 656810, 653462, 650428, 647789, 645728, 644208, 642857, 641528, 640874, 641963, 645127, 649486, 653783, 657560, 661340, 665785, 670991, 676606, 682393, 688448, 694930, 701732, 708550, 715244, 721994, 729061, 736396, 743549, 749898, 754980, 758685, 761155, 762445, 762313, 760504, 757200, 752902, 747801, 741713, 734891, 728408, 723174, 718833, 714316, 709390, 704941, 701700, 699491, 698067, 697857, 699280, 701859, 704719, 707696, 711307, 715771, 720772, 726225, 732695, 740762, 750290, 760491, 770540, 780027, 788981, 797599, 805944, 813945, 821678, 829481, 837608, 845898, 853952, 861524, 868590, 875163, 881191, 886451, 890403, 892404, 892338, 890808, 888384, 884812, 879365, 871949, 863538, 855510, 848735, 843215, 838398, 833929, 830216, 828047, 827550, 827963, 828745, 830387, 833559, 837874, 842339, 846820, 852183, 858925, 866487, 874131]
61217H74131P663P983Q413Q783R006Q870Q389Q165Q592R116R040Q755R191J0306
61203I96403J1195J1556J2026J3005J4202J5445J6953J8536J9554J9976K0592
61192A169443K1729K2727K3132K3504K4380K5281K5523K5330K5248K4991K3793
61181A435081K1568J8852J5771J1989P618L399j40l104n694p894r845j1965j4422
61168A461214j6886j9045k1029k2992k4608k5419k5585k5862k6712k7678k7871
61157A197527k7026k5768k4788k3951k2607k0646j8785j7600j6668j5086j2652
61146I71950j0032p815n901m004k318j273p12J37J771L707N017N441N714O692
61132I68374Q421J0295J1948J3679J5952J8735K1553K4020K6163K8190L0177L2092
$$ y = [874131, 881794, 889777, 898190, 906973, 915979, 924849, 933238, 941403, 949995, 959111, 968151, 976906, 986097, 996403, 1007598, 1019154, 1031180, 1044185, 1058387, 1073832, 1090785, 1109321, 1128875, 1148851, 1169443, 1191172, 1213899, 1237031, 1260535, 1284915, 1310196, 1335719, 1361049, 1386297, 1411288, 1435081, 1456649, 1475501, 1491272, 1503261, 1510879, 1514278, 1514138, 1511034, 1505340, 1497446, 1487601, 1475636, 1461214, 1444328, 1425283, 1404254, 1381262, 1356654, 1331235, 1305650, 1279788, 1253076, 1225398, 1197527, 1170501, 1144733, 1119945, 1095994, 1073387, 1052741, 1033956, 1016356, 999688, 984602, 971950, 961918, 954103, 948202, 944198, 941880, 940607, 939895, 940032, 941803, 945510, 950527, 955968, 961682, 968374, 976795, 987090, 999038, 1012717, 1028669, 1047404, 1068957, 1092977, 1119140, 1147330, 1177507, 1209599]
61120A209599L4059L6307L8774M0948M2359M3147M3847M4618M5013M4637M3588
61109A666896M2118M0193L7750L5008L2103K8667K4237J9007J3608Q315K998k196
61097A948704o837j0984j5298k0049k4589k8301l1605l5457m0013m4324m7363
61086A643884m8916m9466m9438m8851m7609m5960m4425m3146m1512l8798l5168
61075A150595l1676k9092k7104k4892k2141j9209j6497j4098j1938r902p767n305
61063I30974k596j26J592K480L013L863N386P405R483J1359J3097J4920J6978
61050A017828J9209K1306K2942K4194K5532K7261K9133L0792L2284L3729L4790
61039A319000L5083L4974L5324L6357L7464L8181L8631L8860L8552L7710L6914
$$ y = [1209599, 1243658, 1279965, 1318739, 1359687, 1402046, 1445193, 1489040, 1533658, 1578671, 1623308, 1666896, 1709014, 1749207, 1786957, 1821965, 1854068, 1882735, 1906972, 1925979, 1939587, 1947902, 1950900, 1948704, 1941867, 1930883, 1915585, 1895536, 1870947, 1842646, 1811041, 1775584, 1735571, 1691247, 1643884, 1594968, 1545502, 1496064, 1447213, 1399604, 1353644, 1309219, 1266073, 1224561, 1185763, 1150595, 1118919, 1089827, 1062723, 1037831, 1015690, 996481, 979984, 965886, 953948, 944046, 936279, 930974, 928378, 928252, 929844, 932324, 935337, 939200, 944586, 951991, 961474, 972833, 985930, 1000850, 1017828, 1037037, 1058343, 1081285, 1105479, 1131011, 1158272, 1187405, 1218197, 1250481, 1284210, 1319000, 1354083, 1389057, 1424381, 1460738, 1498202, 1536383, 1575014, 1613874, 1652426, 1690136, 1727050]
61028A727050L6421L5813L5040L5008L6328L8142L9176L9574M0659M3154M6672
61017B153037N0948N6472O3695P2520Q3042R6138J13035J34778J62383J96921
61007C182969K38961K88170L43504M03293M64963N25465N82661O36032O85751
60998G351769P31536P73054Q11226Q48282Q86050R24182R60234R91500J016844
60989A5294677J036622J051092J059515J060533J050756J019177R42852P93983
60981B3309207N59778K60357n3412l23382n10468o05527o24232n98469n71010
60972B0842842n87664o80738q50684j061677j258315j392946j444618j419508
60964A2146692j338434j224083j094948r64387q40773p27863o26404n36297m57483
$$ y = [1727050, 1763471, 1799284, 1834324, 1869332, 1905660, 1943802, 1982978, 2022552, 2063211, 2106365, 2153037, 2203985, 2260457, 2324152, 2396672, 2479714, 2575852, 2688887, 2823665, 2986048, 3182969, 3421930, 3710100, 4053604, 4456897, 4921860, 5447325, 6029986, 6666018, 7351769, 8083305, 8856359, 9667585, 10515867, 11401917, 12326099, 13286333, 14277833, 15294677, 16331299, 17382391, 18441906, 19502439, 20553195, 21572372, 22515224, 23309207, 23868985, 24129342, 24075930, 23752548, 23242080, 22636553, 22012321, 21413852, 20842842, 20255178, 19574440, 18723756, 17662079, 16403764, 15010818, 13566200, 12146692, 10808258, 9584175, 8489227, 7524840, 6684067, 5956204, 5329800, 4793503, 4336020]
60955D336020l89489l31338k82252k41830k09202j82707j60864j43078j28851
60946B266409j16935j06113r6373q8263q1373p4599o7968o2858n9917n7895n5285
60935A398830n2182m9636m7858m6140m4004m1434l8276l4567l1185k9056k7739
60924I56753k5908k3322k1055j9584j7991j5629j3373j2224j1640j0445q687p396
60912G69499o790o037m789l722l343l233k920k650k785l006k774k198j869k057
60898G21326k590l293m039m463m205l560l393m140n173n520n000m337m131m146
60884F63336l842l298l181l778m442m334l466k664k523k801k958k918k953l026
60870F17152k726j971j358j471j993j952r45K54O42K90K61J246K753L869M366
$$ y = [4336020, 3946531, 3615193, 3332941, 3091111, 2881909, 2699202, 2538338, 2395260, 2266409, 2149474, 2043361, 1946988, 1858725, 1777352, 1702753, 1634785, 1571927, 1512010, 1454115, 1398830, 1346648, 1297012, 1249154, 1203014, 1159010, 1117576, 1079300, 1044733, 1013548, 984492, 956753, 930845, 907523, 886468, 866884, 848893, 833264, 819891, 807667, 796027, 785582, 776895, 769499, 762709, 756672, 751883, 748161, 744818, 741585, 738665, 736015, 733230, 730224, 727450, 725252, 723383, 721326, 718736, 715443, 711404, 706941, 702736, 699176, 695783, 691643, 686470, 680950, 675950, 671613, 667482, 663336, 659494, 656196, 653015, 649237, 644795, 640461, 636995, 634331, 631808, 629007, 626049, 623131, 620178, 617152, 614426, 612455, 611097, 609626, 607633, 605681, 604736, 604990, 605632, 605922, 606183, 607429, 610182, 614051, 618417]
60855F18417M642M833M613L863L022K590K670L102L633L812L149J841R18J178
60841F62283K148K601K012R68J88k78p22j180j537j858k280k741l048l118k958
60826F50480k635k330k256k350k299j995j703j638j656j569j436j300j057q36
60812F25420j089j878k584k726k643k741k569j565l04J5p62j605j821j679j386
60797F00083o81K26L86m77j310j209o78o16q63p07k23K5J10N46J238J652J771
60780E99273J929J923J418R99J589K850L441L037K836L671M776N078M607L994
60766F41421L432K967L000L686M398M615M758N361O008N996N545N320N122M207
60752G05836K786K009K325K977L312L567L877L560K190O99M11J289K022J749R29
$$ y = [618417, 623059, 627892, 632505, 636368, 639390, 641980, 644650, 647752, 651385, 655197, 658346, 660187, 661105, 662283, 664431, 667032, 669044, 670012, 670200, 669922, 669200, 668020, 666483, 664625, 662345, 659604, 656556, 653438, 650480, 647845, 645515, 643259, 640909, 638610, 636615, 634912, 633274, 631618, 630049, 628613, 627313, 626256, 625420, 624331, 622453, 619869, 617143, 614500, 611759, 609190, 607625, 607321, 607336, 606574, 604969, 603148, 601469, 600083, 599402, 599628, 600014, 599537, 598227, 597018, 596340, 595724, 594861, 594154, 593931, 593956, 594066, 594612, 595850, 597502, 599273, 601202, 603125, 604543, 605542, 607131, 609981, 613422, 616459, 619295, 622966, 627742, 632820, 637427, 641421, 644853, 647820, 650820, 654506, 658904, 663519, 668277, 673638, 679646, 685642, 691187, 696507, 701629, 705836, 708622, 710631, 712956, 715933, 719245, 722812, 726689, 730249, 732439, 733138, 733549, 734838, 736860, 738609, 739538]
60737G39538M46N14P47P93N20o9p54j074q31m25m03o69n77J93J289K332L473M885
60719G49928O108O419N823N145N101N652O341O894P329P752Q218Q637Q762Q552
60705H46661Q442Q903R702J0072R782R524R963J0829J1356J1171J0405R299Q183
60692I74292P625P937Q683R106Q983Q633Q147P259N960M756M040L630L105K343
60678A064499J537Q16J20o89j606k404k843l046l473m365n333n859n990o226o803
60663A018335p457p897q017p743p088o471o458p044p648p983q427r205r692r108
60649I08097p623o297n892o205o524o384n785n006m430m373m903n754o495o800
60635H25626o579n892m844l673k852k847l570m254m194l523k933k690k396j830
$$ y = [739538, 739984, 740498, 741245, 742038, 742558, 742489, 741735, 740661, 739830, 739405, 739002, 738333, 737756, 737949, 739238, 741570, 745043, 749928, 756036, 762455, 768278, 773423, 778524, 784176, 790517, 797411, 804740, 812492, 820710, 829347, 838109, 846661, 855103, 864006, 873708, 883780, 893562, 903086, 913049, 923878, 935234, 946405, 956810, 966109, 974292, 981917, 989854, 998537, 1007643, 1016626, 1025259, 1033406, 1040665, 1046625, 1051381, 1055421, 1059051, 1062156, 1064499, 1066036, 1066852, 1066972, 1066283, 1064677, 1062273, 1059430, 1056384, 1052911, 1048546, 1043213, 1037354, 1031364, 1025138, 1018335, 1010878, 1002981, 994964, 987221, 980133, 973662, 967204, 960160, 952512, 944529, 936102, 926897, 917205, 908097, 900474, 894177, 888285, 882080, 875556, 869172, 863387, 858381, 853951, 849578, 844675, 838921, 832426, 825626, 819047, 813155, 808311, 804638, 801786, 798939, 795369, 791115, 786921, 783398, 780465, 777775, 775379, 773549]
60621G73549j575k310l783m909m948m266l815m056m572m681m265l823l710l655
60607G19181l266k788k874l584m182m135l920m387n625o817p165o575n547m609
60593F53707l979l576l299l259l567l947l848l100k148j477j106q77q28r00o82
60578F17114k1M59Q7p39r00j3J096J576J567J770K462L309L850L941L904M260
60562F43722N054N530N004L938L510L978M411M213L979M264M460L826K852K506
60548G01247K496J611l97k385l365l407k928k124j388j222j244l62J532K934K640
60533F93638J399P69J011J231J124J292J967K558K634K364J849Q72l43r90p58
60518G10617l81o14j217j419r48j11Q01J685K410K911L365L955M646N424O466
$$ y = [773549, 771974, 769664, 765881, 760972, 756024, 751758, 747943, 743887, 739315, 734634, 730369, 726546, 722836, 719181, 715915, 713127, 710253, 706669, 702487, 698352, 694432, 690045, 684420, 677603, 670438, 663863, 658316, 653707, 649728, 646152, 642853, 639594, 636027, 632080, 628232, 625132, 622984, 621507, 620401, 619524, 618696, 617796, 617114, 617093, 617552, 617639, 616900, 616000, 615987, 617083, 618659, 620226, 621996, 624458, 627767, 631617, 635558, 639462, 643722, 648776, 654306, 659310, 663248, 666758, 670736, 675147, 679360, 683339, 687603, 692063, 695889, 698741, 701247, 703743, 705354, 704957, 702572, 699207, 695800, 692872, 690748, 689360, 688138, 686894, 686532, 688064, 690998, 693638, 695037, 695806, 696817, 698048, 699172, 700464, 702431, 704989, 707623, 709987, 711836, 712708, 712365, 711375, 710617, 710236, 709622, 708405, 706986, 706038, 705927, 706728, 708413, 710823, 713734, 717099, 721054, 725700, 731124, 737590]
60503G37590P774Q874R341R395R608J0135J0657J0985J1335J1909J2593J3041
60491H63237J2955J2267J1319J0751J0966J1691J2203J1873J0376P592L684q49
60479I78065n490r952j4008j7366k0069k2616k5195k7063k7346k6209k4568k2800
60467G35383k0627j8255j6543j5695j4724j2892j0867r750r506r127q036o534
60455E82827n125m088l646l901m509m932m951m633l979l076k335k058j951j631
60441E32012j433j951k926l370k840j848r63l09n3n10j361j682j140m60j93J14
60425E11087Q68J400R58J36J05P72Q50j47j130r51K16J420K153K437K274J629
60409E24077P88K55L20Q54J453J698J464J126J197J751K379K710K699K316J503
$$ y = [737590, 745364, 754238, 763579, 772974, 782582, 792717, 803374, 814359, 825694, 837603, 850196, 863237, 876192, 888459, 899778, 910529, 921495, 933186, 945389, 957262, 967638, 975230, 978914, 978065, 972575, 962623, 948615, 931249, 911180, 888564, 863369, 836306, 808960, 782751, 758183, 735383, 714756, 696501, 679958, 664263, 649539, 636647, 625780, 616030, 606524, 597397, 589361, 582827, 577702, 573614, 569968, 566067, 561558, 556626, 551675, 547042, 543063, 539987, 537652, 535594, 533643, 532012, 530579, 528628, 525702, 522332, 519492, 517644, 516681, 516372, 516319, 515809, 514448, 512766, 511626, 511166, 510973, 511087, 511955, 513355, 514313, 514449, 514554, 515326, 516176, 516029, 514899, 513948, 514164, 515584, 517737, 520174, 522448, 524077, 524865, 525120, 525440, 526294, 527747, 529445, 530909, 532035, 533232, 534983, 537362, 540072, 542771, 545087, 546590]
60394E46590N13l3J87P96J230J358J386J418J483J686K044K287K144J695J160
60379E65944N75o8m77k99L70J046J406J538J690J926K019J578M70o92q57K81J679
60362E78129K071J484J017J219J488J237Q61J018J583J942J979K160K743L499
60348F02430M128M426M142L214K268K274L393M583M751M001L352L419L896M188
60334F54465M014L343K214R62J78L0j15r88k386l291l128k518k592l755n245n899
60318F35289n190l573j902n35P79K236L502M220M621N165N742N913N833O242P288
60303F75630Q150Q202P864P810P934P840P833Q571R882J0764J0539R315P373M840
60289G92547K072l54k233l819n236o308p080p801q277p910o732n666n358n339
$$ y = [546590, 547103, 547070, 547257, 548053, 549283, 550641, 552027, 553445, 554928, 556614, 558658, 560945, 563089, 564784, 565944, 566519, 566451, 565974, 565675, 566045, 567091, 568497, 570035, 571725, 573651, 575670, 577248, 577718, 577026, 576169, 576450, 578129, 580200, 581684, 582701, 583920, 585408, 586645, 587506, 588524, 590107, 592049, 594028, 596188, 598931, 602430, 606558, 610984, 615126, 618340, 620608, 622882, 626275, 630858, 635609, 639610, 642962, 646381, 650277, 654465, 658479, 661822, 664036, 664998, 665176, 665206, 665091, 664103, 661717, 658426, 655298, 652780, 650188, 646433, 641188, 635289, 630099, 626526, 624624, 624089, 624868, 627104, 630606, 634826, 639447, 644612, 650354, 656267, 662100, 668342, 675630, 683780, 691982, 699846, 707656, 715590, 723430, 731263, 739834, 749716, 760480, 771019, 780334, 787707, 792547, 794619, 794265, 792032, 788213, 782977, 776669, 769589, 761788, 753511, 745601, 738869, 733203, 727845, 722506]
60275G22506m868m094l715l869m082m100m170m521n074n696o320o801o954o762
60261F51480o323n668m819l952l273k782k357j985j730j633j661j643j226k71
60247F12157O78Q87N02N08J254J799J326M71L46Q50J082J059J642K772L241K650
60231F33224K265L161M639N351N196M978M871M437L847L860M561N212N527O022
60217F97151O779O901N892M727M721N781O721O952O952P085P023O622O499P065
60203G86871P651P282O065N071M961N359N541N128M014K292N02n70p96r24j589
60188H36858k486k924k867k855l152l562l998m612n293n570n151m261l306k582
60174G84239k330k672l205l110j967k98R60J367J168P90M60L16N01J001J559J860
$$ y = [722506, 717638, 713544, 709829, 705960, 701878, 697778, 693608, 689087, 684013, 678317, 671997, 665196, 658242, 651480, 645157, 639489, 634670, 630718, 627445, 624663, 622306, 620321, 618591, 616958, 615297, 613654, 612428, 612157, 612835, 613722, 614224, 614732, 615986, 617785, 619111, 619582, 619928, 620778, 621860, 622919, 624561, 627333, 630574, 633224, 635489, 638650, 643289, 648640, 653836, 658814, 663685, 668122, 671969, 675829, 680390, 685602, 691129, 697151, 703930, 710831, 716723, 721450, 726171, 731952, 738673, 745625, 752577, 759662, 766685, 773307, 779806, 786871, 794522, 801804, 807869, 812940, 817901, 823260, 828801, 833929, 837943, 840235, 840737, 840167, 839371, 838447, 836858, 834372, 831448, 828581, 825726, 822574, 819012, 815014, 810402, 805109, 799539, 794388, 790127, 786821, 784239, 781909, 779237, 776032, 772922, 770955, 770657, 771617, 772984, 774152, 774942, 775402, 775718, 776219, 777220, 778779, 780639]
60158G80639J833J684J667J863K183K528K843L091L261L404L556L680L845M357
60144H20434N389O538P084O931O786P217P854P963P401O608N912N428N427O100
60130I13072O990P260O637N558M388L148K092J777K119K079R21o90j489j236q70
60115I51756j124j691j906j746j719k100k620k957l193l649m379n034n270n067
60101I09301m607m011l449l245l600m200m467m151l362k210p66N87J288J255J034
60086H75397J123J467J774J939J993J909J747J617J434J005M60J23j56r80k419
60071H88433l673m207m631n750p270q261q570q845r225q977p697o007m727l999
60057G96594l545l213k784j855m39O24N68j83m18L73J467K005J965J844J825J838
$$ y = [780639, 782472, 784156, 785823, 787686, 789869, 792397, 795240, 798331, 801592, 804996, 808552, 812232, 816077, 820434, 825823, 832361, 839445, 846376, 853162, 860379, 868233, 876196, 883597, 890205, 896117, 901545, 906972, 913072, 920062, 927322, 933959, 939517, 943905, 947053, 949145, 950922, 953041, 955120, 956041, 955351, 953862, 952626, 951756, 950632, 948941, 947035, 945289, 943570, 941470, 938850, 935893, 932700, 929051, 924672, 919638, 914368, 909301, 904694, 900683, 897234, 893989, 890389, 886189, 881722, 877571, 874209, 871999, 871233, 871820, 873108, 874363, 875397, 876520, 877987, 879761, 881700, 883693, 885602, 887349, 888966, 890400, 891405, 891865, 891988, 891832, 890852, 888433, 884760, 880553, 875922, 870172, 862902, 854641, 846071, 837226, 828001, 819024, 811327, 805320, 800593, 796594, 793049, 789836, 787052, 785197, 784758, 785382, 785950, 785767, 785349, 785722, 787189, 789194, 791159, 793003, 794828, 796666]
60041G96666K066K730L418L322K400J659J865K453K345J436M36n60k212m441n949
60026H07634n932n501o324q322r783r726r127r481j0928j2270j2384j1185r478
60013F87193q228p817p764p320o331n323m613l847k641j339n99m23j98L47P46
59998F31843O86P40J698L347M530M563M029L800L787L271K277J715K092K807L100
59983F74285L017K886K483J503M23L2J41k21j302k192k261k202k991m437n475
59968F63689n569n094m451l534k189p22L09N96K40l31n16N5J101J835J693Q34
59952F47946j57q50j118q92j66P97J531J827J842J681J081j51j628k596k691k191
59936F44265j562j107j060j527k155k283j767j336j653k342k441j716q87n78o12
$$ y = [796666, 798732, 801462, 804880, 808202, 810602, 812261, 814126, 816579, 818924, 820360, 820796, 820236, 818024, 813583, 807634, 801702, 796201, 789877, 781555, 771772, 762046, 752919, 743438, 732510, 720240, 707856, 696671, 687193, 678965, 671148, 663384, 656064, 649733, 644410, 639797, 635950, 633309, 631970, 631371, 630948, 630750, 631097, 631843, 632529, 633269, 634967, 638314, 642844, 647407, 651436, 655236, 659023, 662294, 664571, 666286, 668378, 671185, 674285, 677302, 680188, 682671, 684174, 684597, 684629, 684770, 684549, 683247, 681055, 678794, 676592, 673601, 669164, 663689, 658120, 653026, 648575, 645041, 642852, 642130, 642439, 643035, 643275, 642944, 642428, 642483, 643584, 645419, 647112, 647946, 647789, 646939, 645821, 644929, 644763, 645560, 647091, 648918, 650760, 652441, 653522, 653371, 651743, 649147, 646456, 644265, 642703, 641596, 640536, 639009, 636854, 634571, 632804, 631468, 629815, 627473, 625032, 623316, 622429, 621851, 621239]
59921F21239n60m10l10n9O08J394J629J187P72J099K009K729K933L100L722M396
59905F45478M235L106K055K179L395M610M954M536M079M165M887N873O596O821
59891G06969O852P125P594P799P529P112O907O798O444N824N236M867M587M186
59877G95829L596K830J857O95m18j063j059q17j116k351m112n681o837p915r049
59862G64389r732r393q243p180o733o415n372l588k000j327j101k82J424L267
59848G07714M456M923N053N189N585O394P346P814P597P254P258P299O864O188
59834G96934N919O011N689M485K739J014l91j296j585j477j390j515j897k928
59820H10312n081q028j0597j1947j2286j2219j1956j1477j0957j0564j0169r635
$$ y = [621239, 620679, 620269, 619959, 619900, 620508, 621902, 623531, 624718, 625490, 626589, 628598, 631327, 634260, 637360, 641082, 645478, 649713, 652819, 654874, 657053, 660448, 665058, 670012, 674548, 678627, 682792, 687679, 693552, 700148, 706969, 713821, 720946, 728540, 736339, 743868, 750980, 757887, 764685, 771129, 776953, 782189, 787056, 791643, 795829, 799425, 802255, 804112, 804807, 804389, 803326, 802267, 801450, 800334, 797983, 793871, 788190, 781353, 773438, 764389, 754657, 745264, 737021, 729841, 723108, 716693, 711321, 707733, 705733, 704406, 703305, 703023, 704447, 707714, 712170, 717093, 722146, 727335, 732920, 739314, 746660, 754474, 762071, 769325, 776583, 783882, 790746, 796934, 802853, 808864, 814553, 819038, 821777, 822791, 822400, 821104, 819519, 818042, 816652, 815137, 813240, 810312, 805231, 797203, 786606, 774659, 762373, 750154, 738198, 726721, 715764, 705200, 695031, 685396]
59808F85396r077q438p245n251l066j602j060r39q83j027j519k098k392k337k180
59793F36282k153k245k238j991j571j137q00p50j280k287k950k455j094r6j59
59778F13076p06q45m67l1L05P18J217J593J772J846J910K160K841L799M364M063
59762F37615L237K566K282K194K244K515K854L047L181L491L850L914L629L255
59748F79874L029L109L641M421M716M054K997K578K986L418L225K610K140K071
59734G24869K351K735K838K441J932J860K013J524J78r57p22O74J888K032J540
59719G47196J409J962K496K189J125K73L81J208J919K054J709J086L79j3K24P55
59703G66352R07O53P35J471K072J593L01n61k71N77Q71K54o39j036q56n93n80
$$ y = [685396, 676319, 667881, 660636, 655385, 652319, 650717, 649657, 648718, 647835, 646808, 645289, 643191, 640799, 638462, 636282, 634129, 631884, 629646, 627655, 626084, 624947, 624147, 623397, 622117, 619830, 616880, 614425, 613331, 613235, 613076, 612370, 611525, 611058, 611027, 611332, 612050, 613267, 614860, 616632, 618478, 620388, 622548, 625389, 629188, 633552, 637615, 640852, 643418, 645700, 647894, 650138, 652653, 655507, 658554, 661735, 665226, 669076, 672990, 676619, 679874, 682903, 686012, 689653, 694074, 698790, 702844, 705841, 708419, 711405, 714823, 718048, 720658, 722798, 724869, 727220, 729955, 732793, 735234, 737166, 739026, 741039, 742563, 742741, 741784, 741062, 741736, 743624, 745656, 747196, 748605, 750567, 753063, 755252, 756377, 756650, 757031, 758239, 760158, 762212, 763921, 765007, 765386, 765373, 765597, 766352, 767259, 767912, 768647, 770118, 772190, 773783, 774084, 773523, 773252, 773829, 774700, 774954, 774315, 773279, 772423, 771830, 771250]
59686G71250o36m87k00m6j98p44j706k684k843j809m62j59j193k522l069k738
59670G49754k087j650j796k592l466l530k658j781j704k099k135j733j542j881
59656G19100k339k419k057j417o22J75P32R40R54J014J212J503J821K081K086
59641G22764J555L90j096k313k889k875k439j603n35J93J83j79j74J89K73r6k82
59624G11066J10N60N06K68N10J213J740J795J670J690J890K246K768L303L522
59609G34857L206K439J553R41P67Q06P77P85J142J630J519N34o85j445j821k247
59593G44758k807l358l940m462m505l956l425l391l422l049k776l225l716l081
59579F95645j643r86j546j998j444p70r59j337p22N93J310J061O51O31Q13J140
$$ y = [771250, 770614, 770127, 769927, 769881, 769683, 768939, 767233, 764549, 761706, 759897, 759435, 759276, 758083, 755561, 752492, 749754, 747667, 746017, 744221, 741629, 738163, 734633, 731975, 730194, 728490, 726391, 724256, 722523, 720981, 719100, 716761, 714342, 712285, 710868, 710246, 710421, 711153, 712093, 713047, 714061, 715273, 716776, 718597, 720678, 722764, 724319, 724709, 723613, 721300, 718411, 715536, 713097, 711494, 710959, 711152, 711335, 711156, 710982, 711171, 711444, 711348, 711066, 711176, 711736, 712242, 712510, 713020, 714233, 715973, 717768, 719438, 721128, 723018, 725264, 728032, 731335, 734857, 738063, 740502, 742055, 742996, 743763, 744569, 745346, 746131, 747273, 748903, 750422, 750956, 750271, 748826, 747005, 744758, 741951, 738593, 734653, 730191, 725686, 721730, 718305, 714914, 711492, 708443, 705667, 702442, 698726, 695645, 694002, 693016, 691470, 689472, 688028, 687258, 686299, 684962, 684240, 684833, 686143, 687204, 687855, 688486, 689299, 690439]
59563F90439J827K535K495J810J687K732L876L731K518J659J754J936J465J044
59549G21508J823L657N155N467N204N302N744N970O127O954Q582J0196J1159J1742
59535H14590J2455J3255J3864J4411J5164J5928J6207J5776J4645J2676R849O816
59523I75636M532L285K534J790J126O35mj109k472l786n208p075r127j0654j1457
59508I38646j2216j3578j5160j5879j5199j3702j2281j1124r779q049o348n096
59496H00235m147l076j799m93Q82K564M400N727O162O228O848Q295R923J0959
59482H52708J1259J1214J1243J1555J2187J3007J3666J3950J4090J4522J5235
59471I94636J5740J5794J5838J6367J7130J7320J6549J5221J3990J3168J2725
$$ y = [690439, 692266, 694801, 697296, 699106, 700793, 703525, 707401, 711132, 713650, 715309, 717063, 718999, 720464, 721508, 723331, 726988, 732143, 737610, 742814, 748116, 753860, 759830, 765957, 772911, 781493, 791689, 802848, 814590, 827045, 840300, 854164, 868575, 883739, 899667, 915874, 931650, 946295, 958971, 968820, 975636, 980168, 983453, 985987, 987777, 988903, 989538, 989534, 988425, 985953, 982167, 976959, 969884, 960757, 950103, 938646, 926430, 912852, 897692, 881813, 866614, 852912, 840631, 829507, 819728, 811679, 805331, 800235, 796088, 793012, 791213, 790720, 791602, 794166, 798566, 804293, 810455, 816683, 823531, 831826, 841749, 852708, 863967, 875181, 886424, 897979, 910166, 923173, 936839, 950789, 964879, 979401, 994636, 1010376, 1026170, 1042008, 1058375, 1075505, 1092825, 1109374, 1124595, 1138585, 1151753, 1164478]
59460A164478J2583J2708J3143J4002J5340J6993J8689K0236K1443K1987K1715
59449A353317K0947K0097J9040J7302J4839J2105R332O390L427Q12j845n747j1415
59436A458601j7815k3612k8485l2418l4503l3771l0822k7351k4082k0382j5985
59425A169375j1829q729o279l674p86K031M605O824Q508R741J0835J1653J1667
59412A203942J0922J0060R080P108M087J512M91J1j722n017r010j3477j8619k3444
59398A175924k6212k6685k6331k5872k4200k0430j5709j2068j0386j0426j2008
59387I65597j4967j8364k0769k1445k0721j9347j7838j6262j4281j1636q712o279
59375G74976m557l089j729r55q06l28J208L209M645N470O342P451Q579R925J1866
$$ y = [1164478, 1177061, 1189769, 1202912, 1216914, 1232254, 1249247, 1267936, 1288172, 1309615, 1331602, 1353317, 1374264, 1394361, 1413401, 1430703, 1445542, 1457647, 1466979, 1473369, 1476796, 1477608, 1475763, 1470016, 1458601, 1440786, 1417174, 1388689, 1356271, 1321768, 1287997, 1257175, 1229824, 1205742, 1185360, 1169375, 1157546, 1148817, 1142538, 1138864, 1138078, 1140109, 1144714, 1151538, 1160046, 1169787, 1180622, 1192275, 1203942, 1214864, 1224924, 1234004, 1241112, 1245199, 1246711, 1247202, 1247213, 1245491, 1240474, 1231464, 1217987, 1199368, 1175924, 1149712, 1123027, 1096696, 1070824, 1046624, 1026194, 1010485, 998417, 988031, 977605, 965597, 950630, 932266, 911497, 890052, 869331, 849984, 832146, 815884, 801603, 789967, 781255, 774976, 770419, 767330, 765601, 764646, 763840, 763512, 764720, 767929, 772574, 778044, 784386, 791837, 800416, 810341, 822207]
59360H22207J4076J5870J7280J8783K0167K0785K0929K1727K3377K4656K4693
59349A044550K4202K4189K4422K4042K3043K2136K1428K0213J8067J5366J2609
59338A274267R778O623L159l36l783p505j1915j6911k1642k5195k7438k8944l0063
59325A120095l0534l0167k9350k8566k7785k6732k5311k3398k0654j7141j3860
59314H46597j1916j1155j0314q552o284m332k943j876j028l98K53J239K466L463
59300G95220L969M235M656N300N974O618P360Q180Q704Q603Q137Q047Q792J0044
59286H93839J1061J1481J1565J1644J1433J0163P554M598K968L468N326P272Q959
59273A001331J0742J2394J2996J2328J1505J1611J2238J2072J0554Q252N790L229
$$ y = [822207, 836283, 852153, 869433, 888216, 908383, 929168, 950097, 971824, 995201, 1019857, 1044550, 1068752, 1092941, 1117363, 1141405, 1164448, 1186584, 1208012, 1228225, 1246292, 1261658, 1274267, 1284045, 1290668, 1293827, 1293491, 1289708, 1282203, 1270288, 1253377, 1231735, 1206540, 1179102, 1150158, 1120095, 1089561, 1059394, 1030044, 1001478, 973693, 946961, 921650, 898252, 877598, 860457, 846597, 834681, 823526, 813212, 804660, 798376, 794044, 791101, 789225, 788197, 787799, 788052, 789291, 791757, 795220, 799189, 803424, 808080, 813380, 819354, 825972, 833332, 841512, 850216, 858819, 866956, 875003, 883795, 893839, 904900, 916381, 927946, 939590, 951023, 961186, 968740, 973338, 976306, 979774, 985100, 992372, 1001331, 1012073, 1024467, 1037463, 1049791, 1061296, 1072907, 1085145, 1097217, 1107771, 1116023, 1121813, 1125042]
59261A125042N70j887m003o130q634j1333j3680j5274j6043j6124j5813j5390
59249A001301j4802j3562j1294q371n793m252l417k331o01J113J991K238K820
59236I45040M030M956M783L973L505L363K593Q57j031k320l397n153p767j0621
59222I42811j3081j4946j6277j7210j7842j8015j7275j5469j3266j1757j1356
59211G76317j1328j0560q733o613n254m939m960m427l157j730p35k18J16M64P78
59196G15021R72J089J325J895K751L425L427K854K399K588L300M188N292O812
59182G57338Q507R803J0552J1245J2285J3401J3991J3879J3388J2849J2322J1887
59170I01447J1866J2496J3439J3884J3294J2047J1086J0902J0901R993P777M925
$$ y = [1125042, 1125612, 1123725, 1119722, 1113592, 1104958, 1093625, 1079945, 1064671, 1048628, 1032504, 1016691, 1001301, 986499, 972937, 961643, 953272, 947479, 943227, 939810, 937479, 936878, 937991, 939982, 942220, 945040, 949070, 954026, 958809, 962782, 966287, 969650, 972243, 973100, 972069, 969749, 966352, 961199, 953432, 942811, 929730, 914784, 898507, 881297, 863455, 845440, 828165, 812696, 799430, 787673, 776317, 764989, 754429, 745696, 739083, 733829, 728890, 723930, 719503, 716346, 714616, 713881, 713663, 713779, 714243, 715021, 715993, 717082, 718407, 720302, 723053, 726478, 729905, 732759, 735158, 737746, 741046, 745234, 750526, 757338, 765845, 775648, 786200, 797445, 809730, 823131, 837122, 851001, 864389, 877238, 889560, 901447, 913313, 925809, 939248, 953132, 966426, 978473, 989559, 1000461, 1011362, 1021355, 1029132, 1034057]
59158A034057K338J51k166m891p603r765j1382j2852j4382j5840j7016j7766j7911
59145I04972j7409j6522j5615j4667j3393j1819j0370r242q141o895n922n614
59133G69363n554m899l461j898q10k5J017K478L929M803M980M942N330O274P300
59118G93769P967Q434R129J0055J0772J1025J0983J0957J1050J1080J0644R458
59106I15323P908P012P290P916P566O098M621L931L575K779J498J63j017k009
59092I72654k634k809k787k872l146l753m888o205o852o659o668p778r336j0020
59078H96247r750r697j0426j1149j1025j0341r895r935j0141j0201r898r026p680
59065G67083o413n700n386m939m083k987j992j346j061q56m45l2j72r58j629j437
$$ y = [1034057, 1036395, 1036546, 1034380, 1029489, 1021886, 1012121, 1000739, 987887, 973505, 957665, 940649, 922883, 904972, 887563, 871041, 855426, 840759, 827366, 815547, 805177, 795935, 787794, 780899, 774977, 769363, 763809, 758910, 755449, 753551, 752741, 752716, 753733, 756211, 760140, 764943, 769923, 774865, 780195, 786469, 793769, 801736, 810170, 819299, 829354, 840126, 851151, 862134, 873091, 884141, 895221, 905865, 915323, 923231, 930243, 937533, 945449, 953015, 959113, 963734, 967665, 971240, 974019, 975517, 975680, 974663, 972654, 970020, 967211, 964424, 961552, 958406, 954653, 949765, 943560, 936708, 930049, 923381, 915603, 906267, 896247, 886497, 876800, 866374, 855225, 844200, 833859, 823964, 814029, 803888, 793687, 783789, 774763, 767083, 760670, 754970, 749584, 744645, 740562, 737575, 735583, 734237, 733176, 732320, 731875, 731843, 731671, 730713, 729084, 727647]
59049G27647p30n66j279j942j591m67L78N64P52J455K111J931J195R98J699K564
59033G34719L126M011N738P465P909P151O548O905P755Q488R148R770R864R263
59019H37860Q716Q926R506R565Q926Q137P550P158P018P187P300O958O394O139
59005I47340O143O009O036P085R168J1053J1656J1205J0614J0314J0252J0382
58993A057257J0502J0047Q798P495P040P212O906N581L735J927J37j692l212m185
58979A117548m853n375n330m298k555o93J102K887M387N322O160P725R888J1454
58965A143369J1650J1143J1064J1494J1574J0833R686Q607P397N588L130L34k642
58952A243227n986r800j3721j7086j9479k1071k2319k3326k3668k2995k1619k0207
$$ y = [727647, 726917, 726351, 725072, 723130, 721539, 721072, 721450, 722014, 722766, 724221, 726332, 728263, 729458, 730456, 732155, 734719, 737845, 741856, 747594, 755059, 762968, 770119, 776667, 783572, 791327, 799815, 808963, 818733, 828597, 837860, 846576, 855502, 865008, 874573, 883499, 891636, 899186, 906344, 913362, 920549, 927849, 934807, 941201, 947340, 953483, 959492, 965528, 972613, 981781, 992834, 1004490, 1015695, 1026309, 1036623, 1046875, 1057257, 1067759, 1077806, 1086604, 1094099, 1101139, 1108351, 1115257, 1120838, 1124573, 1126500, 1126637, 1124945, 1121733, 1117548, 1112695, 1107320, 1101990, 1097692, 1095137, 1094444, 1095546, 1098433, 1102820, 1108142, 1114302, 1122027, 1131915, 1143369, 1155019, 1166162, 1177226, 1188720, 1200294, 1211127, 1220813, 1229420, 1236817, 1242405, 1245535, 1245869, 1243227, 1237241, 1227441, 1213720, 1196634, 1177155, 1156084, 1133765, 1110439, 1086771, 1063776, 1042157, 1021950]
58940A021950j8961j7509j5671j3924j2765j1875j0396q080n741m416m287m662
58928H93663m818m507l814k861j890j336j498k147k605k292j124N22K081L120
58914H70494L663M243N464P429R676J1655J3127J4144J4967J6035J7680J9671
58902A008248K1342K2403K3391K5082K7696L0840L3931L6294L7274L6801L5778
58891A339080L5289L5429L5367L4537L3156L1570K9758K7748K5870K4193K2123
58880A674120J9031J4932J0186M911r34p151j3439j9645k5505l0506l4463l7890
58868A553647m1197m3852m4984m4596m3405m1622l8854l5278l1958k9559k7600
58857A130742k5403k3097k1103j9310j7452j5787j4651j3680j2360j1077j0743
$$ y = [1021950, 1002989, 985480, 969809, 955885, 943120, 931245, 920849, 912769, 907028, 902612, 898325, 893663, 888845, 884338, 880524, 877663, 875773, 874437, 872939, 870792, 868187, 865895, 864771, 865293, 867374, 870494, 874157, 878400, 883864, 891293, 900969, 912624, 925751, 939895, 954862, 970897, 988577, 1008248, 1029590, 1051993, 1075384, 1100466, 1128162, 1159002, 1192933, 1229227, 1266501, 1303302, 1339080, 1374369, 1409798, 1445165, 1479702, 1512858, 1544428, 1574186, 1601934, 1627804, 1651997, 1674120, 1693151, 1708083, 1718269, 1723180, 1722246, 1715095, 1701656, 1682011, 1656506, 1626000, 1591537, 1553647, 1512450, 1468598, 1423614, 1379018, 1335613, 1293991, 1255137, 1219859, 1187901, 1158342, 1130742, 1105339, 1082242, 1061139, 1041829, 1024377, 1008590, 993939, 980259, 967899, 956822, 946079]
58846I46079j1392j2000j1839j1256j0836j0516r953r186q470p785o965o124n494
58833H24263n066m714m524m630m793m514l542k105o45M86J157J477J689J922K100
58818G98561K213K481L082L905M688N198N176M441L330K629K598K446J334k88
58804H41794j188j091j006j580k127j857j259j361k110k436j848j019o95p32o11
58789H20874k47R4L57P20J233J791K355K964L484L637L319K804K524K642K808
58774H51359K507J723J120J278J803J677N71o33r73o33n34r38j140o57J4K29K21
58757H56994O56J507K132K428L076M372N613O143O393P082P864P757O840O419
58743I25276P265Q594R296R348R333R262Q813Q313Q431Q983Q999Q153P329P430
$$ y = [946079, 934687, 922687, 910848, 899592, 888756, 878240, 868287, 859101, 850631, 842846, 835881, 829757, 824263, 819197, 814483, 809959, 805329, 800536, 796022, 792480, 790375, 789730, 790216, 791373, 792850, 794539, 796461, 798561, 800774, 803255, 806337, 810242, 814930, 820128, 825304, 829745, 833075, 835704, 838302, 840748, 842082, 841794, 840606, 839515, 838509, 836929, 834802, 832945, 831686, 830325, 828215, 825779, 823931, 822912, 822217, 821485, 820874, 820627, 820721, 821078, 821798, 823031, 824822, 827177, 830141, 833625, 837262, 840581, 843385, 845909, 848551, 851359, 853866, 855589, 856709, 857987, 859790, 861467, 862038, 861405, 860432, 859799, 859265, 858327, 857187, 856530, 856544, 856773, 856994, 857650, 859157, 861289, 863717, 866793, 871165, 876778, 882921, 889314, 896396, 904260, 912017, 918857, 925276, 932541, 941135, 950431, 959779, 969112, 978374, 987187, 995500, 1003931, 1012914, 1021913, 1030066, 1037395, 1044825]
58729A044825Q195Q716Q697Q691R211R964J0181R565Q780Q671R076Q879P505N783
58715A166739M736M082K783Q61n11p44p04j433k927m584o162p783r563j1600j3896
58700A119294j5962j7210j7936j9086k0729k1733k1565k1212k1548k1799k0799
58689H99715j8874j7119j5543j3417j1024r409q601p633o301n407n121m642l724
58676G72900k981k394j033J139K803L380M142O080Q091Q552P667O949P120P836
58662H30251Q760R633R851R247Q792R210R385P596M039O80j307k479l501m178
58648H95979m416m769n408n606m897l826l049k480j872j443j309r76k6J197K183
58633H59282L092M413O106P551Q137P662O525N677N959P166Q200Q329P797P120
$$ y = [1044825, 1053020, 1061736, 1070433, 1079124, 1088335, 1098299, 1108480, 1118045, 1126825, 1135496, 1144572, 1153451, 1160956, 1166739, 1171475, 1175557, 1178340, 1179201, 1178690, 1177946, 1177242, 1175809, 1172882, 1168298, 1162136, 1154353, 1144790, 1133190, 1119294, 1103332, 1086122, 1068186, 1049100, 1028371, 1006638, 985073, 963861, 942313, 920514, 899715, 880841, 863722, 848179, 834762, 823738, 814329, 805728, 798095, 791794, 786387, 781266, 776624, 772900, 769919, 767525, 766492, 767631, 770434, 773814, 777956, 784036, 792127, 800679, 808346, 815295, 822415, 830251, 839011, 848644, 858495, 867742, 876534, 885744, 895129, 902725, 906764, 907444, 906137, 903658, 900157, 895979, 891563, 886794, 881386, 875780, 870883, 867057, 864008, 861528, 859656, 858213, 856904, 855928, 855902, 857099, 859282, 862374, 866787, 872893, 880444, 888581, 896243, 902768, 908445, 914404, 921570, 929770, 938099, 945896, 953016]
58619I53016O504O270O976Q535R851J0145J0097J0844J2236J3001J2532J1566
58607A071573J0912J0189Q253M625J48l771o440q262r765j0593j0007q186o261
58594A042415m851l431j551J73R70J205J826K997M153N160O477Q279J0175J1895
58580A085892J3546J5171J6629J7959J9210J9957J9602J8320J7074J6538J6443
58569A276341J6184J5600J4940J4483J4333J4385J4401J4388J4759J5746J6817
58558A442377J7155J6625J5625J4091J1373P319K733j537n414r116j2372j4598
58546A484261j5650j6013j6348j6983j7668j7791j6990j5671j4691j4536j5049
58535A306871j5804j6364j6265j5273j3732j2238j0956r635q150o526m564k175
$$ y = [953016, 959520, 965790, 972766, 981301, 991152, 1001297, 1011394, 1022238, 1034474, 1047475, 1060007, 1071573, 1082485, 1092674, 1100927, 1105552, 1105700, 1101929, 1095489, 1087227, 1077462, 1066869, 1056862, 1048676, 1042415, 1037564, 1034133, 1032582, 1032755, 1033725, 1034930, 1036756, 1039753, 1043906, 1049066, 1055543, 1063822, 1073997, 1085892, 1099438, 1114609, 1131238, 1149197, 1168407, 1188364, 1207966, 1226286, 1243360, 1259898, 1276341, 1292525, 1308125, 1323065, 1337548, 1351881, 1366266, 1380667, 1395055, 1409814, 1425560, 1442377, 1459532, 1476157, 1491782, 1505873, 1517246, 1524565, 1527298, 1525761, 1520347, 1511231, 1498859, 1484261, 1468611, 1452598, 1436250, 1419267, 1401599, 1383808, 1366818, 1351147, 1336456, 1321920, 1306871, 1291067, 1274703, 1258438, 1243165, 1229433, 1217195, 1206239, 1196604, 1188454, 1181928, 1177364, 1175189]
58523A175189L6J351K152L537N531O741O273M990M239M165M118L887L578K927
58509A228714J737N94M5m96j969l946m950m541l938m253n113n575n551n566n679
58494A179513n426m637l707l046k661k319j824j018J69J538K574K861K602K544
58480A167163L193M206M864M989N049N305N439N258N140N331N183L780J108j919
58466A224089m505o530q041q854q867q370p771p229o671n989n084l814k089o7
58452A140208J782K837K811K118J532J372J236O75k30j201k297l653m889n319
58438A136982m766l758k785j638L05L238O417Q584R089Q542Q155Q464R028R399
58424A195256R713J0060R980R118P917P034O392N418L949K298N72j386l537n636
$$ y = [1175189, 1175225, 1176576, 1178728, 1182265, 1187796, 1194537, 1200810, 1205800, 1210039, 1214204, 1218322, 1222209, 1225787, 1228714, 1230451, 1231045, 1231090, 1230594, 1228625, 1224679, 1219729, 1215188, 1211250, 1206997, 1201884, 1196309, 1190758, 1185192, 1179513, 1174087, 1169450, 1165743, 1162697, 1160036, 1157717, 1155893, 1154875, 1155044, 1156582, 1159156, 1162017, 1164619, 1167163, 1170356, 1174562, 1179426, 1184415, 1189464, 1194769, 1200208, 1205466, 1210606, 1215937, 1221120, 1224900, 1226008, 1224089, 1219584, 1213054, 1205013, 1196159, 1187292, 1178922, 1171151, 1163922, 1157251, 1151262, 1146178, 1142364, 1140275, 1140208, 1141990, 1144827, 1147638, 1149756, 1151288, 1152660, 1153896, 1154571, 1154341, 1153140, 1150843, 1147190, 1142301, 1136982, 1132216, 1128458, 1125673, 1124035, 1124340, 1127578, 1133995, 1142579, 1151668, 1160210, 1168365, 1176829, 1185857, 1195256, 1204969, 1215029, 1225009, 1234127, 1242044, 1249078, 1255470, 1260888, 1264837, 1267135, 1267707, 1266321, 1262784, 1257148]
58410A257148p556r139r948r805r405r720j0834j1945j2434j2315j1782j0979
58398A131286j0225r761r280q305p001o006n486n058m558m168l727k847j738j054
58384A052072q57n61o1P7j48K53J870L959N554O774Q377J0511J2629J4203J4996
58369A129648J5008J4557J4178J4022J3773J3327J3046J3084J3060J2760J2482
58358A278945J2342J1970J1351J1130J1424J1203R708P704O326N377L850J762
58346A383092J94k19K75J505L526N769P185P604P974Q953J0087J0782J1235J1905
58332A469867J2749J3616J4770J6310J7461J7247J5756J4126J3126J2295J0726
58321A628049Q370O187N126N211N790O332O763P158P542Q094R203J1014J3099
$$ y = [1257148, 1249592, 1240453, 1230505, 1220700, 1211295, 1201575, 1190741, 1178796, 1166362, 1154047, 1142265, 1131286, 1121061, 1111300, 1102020, 1093715, 1086714, 1080708, 1075222, 1070164, 1065606, 1061438, 1057711, 1054864, 1053126, 1052072, 1051215, 1050654, 1050593, 1050670, 1050522, 1050775, 1052645, 1056604, 1062158, 1068932, 1077309, 1087820, 1100449, 1114652, 1129648, 1144656, 1159213, 1173391, 1187413, 1201186, 1214513, 1227559, 1240643, 1253703, 1266463, 1278945, 1291287, 1303257, 1314608, 1325738, 1337162, 1348365, 1358073, 1365777, 1372103, 1377480, 1381330, 1383092, 1383286, 1383067, 1383342, 1384847, 1388373, 1394142, 1401327, 1408931, 1416905, 1425858, 1435945, 1446727, 1457962, 1469867, 1482616, 1496232, 1511002, 1527312, 1544773, 1562020, 1577776, 1591902, 1605028, 1617323, 1628049, 1636419, 1642606, 1647732, 1652943, 1658733, 1665065, 1671828, 1678986, 1686528, 1694622, 1703825, 1714839, 1727938]
58308A727938J4755J5636J5936J6130J6591J7345J8060J8426J8555J8843J9404
58297A917619J9972K0372K0751K1214K1713K2434K3807K5725K7341K8015K8157
58286B177120K8592K9395L0056L0524L1402L3021L4915L6443L7591L8863M0569
58275B548491M2463M4073M5311M6645M8573N1015N3438N5568N7654O0028O2650
58264C115909O5189O7314O8921P0331P2209P4917P7990Q0680Q2997Q5552Q8457
58253C950466R1135R3340R5675R8737J02470J06613J11211J16354J22070J28725
58243E016796J36778J45924J55237J64475J74374J85367J97034K09317K23037
58234F608339K38563K55007K71681K89339L09070L30986L55050L82175M13281
$$ y = [1727938, 1742693, 1758329, 1774265, 1790395, 1806986, 1824331, 1842391, 1860817, 1879372, 1898215, 1917619, 1937591, 1957963, 1978714, 1999928, 2021641, 2044075, 2067882, 2093607, 2120948, 2148963, 2177120, 2205712, 2235107, 2265163, 2295687, 2327089, 2360110, 2395025, 2431468, 2469059, 2507922, 2548491, 2590954, 2635027, 2680338, 2726983, 2775556, 2826571, 2880009, 2935577, 2993231, 3053259, 3115909, 3181098, 3248412, 3317333, 3387664, 3459873, 3534790, 3612780, 3693460, 3776457, 3862009, 3950466, 4041601, 4134941, 4230616, 4329353, 4431823, 4538436, 4649647, 4766001, 4888071, 5016796, 5153574, 5299498, 5454735, 5619210, 5793584, 5978951, 6175985, 6385302, 6608339, 6846902, 7101909, 7373590, 7662929, 7971999, 8302985, 8658035, 9040210, 9453491]
58225I453491M48022M85802N27446N74602O28196O88745P57761Q37678R30927
58216A5332670J040344J170189J325823J513250J740642K020407K369156K805787
58208B9318268L349205M014595M807341N716979O714092P750570Q765181R697103
58200H0133334J0501891J1155895J1645687J1959788J2098750J2091543J1990387
58193A61577275J1839655J1648972J1400788J1087049J0738759J0419340J0188974
58186B38900812J0072348J0041174R978633R604838Q438267N931862J805333l641997
58178B91131270r533215j4790676j8615406k0729437k1293589k0677920j9281721
58171A66209306j7452311j5460052j3502997j1731890j0263608r156687q377084
$$ y = [9453491, 9901513, 10387315, 10914761, 11489363, 12117559, 12806304, 13564065, 14401743, 15332670, 16373014, 17543203, 18869026, 20382276, 22122918, 24143325, 26512481, 29318268, 32667473, 36682068, 41489409, 47206388, 53920480, 61671050, 70436231, 80133334, 90635225, 101791120, 113436807, 125396595, 137495345, 149586888, 161577275, 173416930, 185065902, 196466690, 207553739, 218292498, 228711838, 238900812, 248973160, 259014334, 268992967, 278597805, 287036072, 292967934, 294773267, 291131270, 281598055, 266807379, 248191973, 227462536, 206168947, 185491027, 166209306, 148756995, 133296943, 119793946, 108062056, 97798448, 88641761, 80264677]
58164H0264677p808335p313359o798175o232687n631468n024997m441395l900036
58156C3114225l411514k979454k602051k273933j989066j742809j531292j350051
58148A5234055j194532j061301r47514q49891p65313o91872o28285n72933n24431
58139G997983m82178m45159m11133l78434l47687l20265k95734k72445k49985
58130D794963k29322k10888j94240j79483j67353j57689j49270j41341j34165
58121C231212j27813j21636j15158j08660j02559r6959r1837q6935q1618p5651
58111B222386o9932o5533o2251n9034n5683n2859n0570m8022m5148m2907m1632
58100A628815m0333l8299l6285l5305l5030l4376l3028l1521l0160k8667k6865
$$ y = [80264677, 72456342, 65142983, 58344808, 52112121, 46480653, 41455656, 37014261, 33114225, 29702711, 26723257, 24121206, 21847273, 19858207, 18115398, 16584106, 15234055, 14039523, 12978222, 12030708, 11180817, 10415504, 9723632, 9095347, 8522414, 7997983, 7515805, 7070646, 6659513, 6281079, 5933392, 5613127, 5317393, 5044948, 4794963, 4565641, 4354753, 4160513, 3981030, 3813677, 3655988, 3506718, 3365377, 3231212, 3103399, 2981763, 2866605, 2757945, 2655386, 2558427, 2466590, 2379655, 2298037, 2222386, 2152454, 2086921, 2024670, 1965636, 1909953, 1857094, 1806524, 1758502, 1713354, 1670447, 1628815, 1588482, 1550183, 1513898, 1478593, 1443563, 1409187, 1376159, 1344638, 1314478, 1285811, 1258946]
58089A258946k5058k3659k2791k2241k1616k0605j9278j8055j7283j6963j6902
58078A034495j6928j6942j6971j7139j7395j7294j6461j5202j4281j3984j3819
58067H58079j3242j2276j1257j0400r848r737r883r669q666p261o352o367o837
58054G36284o980o588o165o216o595o760o611o615p009p317p043o412n944n595
58040F44434n001m491m921o375p743p958p140o115n344m881m899n662o997q292
58026E58615q977q772p733o400n649n813o098n503m250l571l909m229l532k311
58012D81868j682j673j354m39M19J049K228M103N298M572K751J807K361L260L565
57997E08133L602L798L735L035K223J887J751J440J484K557M091M760M201L216
$$ y = [1258946, 1233888, 1210229, 1187438, 1165197, 1143581, 1122976, 1103698, 1085643, 1068360, 1051397, 1034495, 1017567, 1000625, 983654, 966515, 949120, 931826, 915365, 900163, 885882, 871898, 858079, 844837, 832561, 821304, 810904, 801056, 791319, 781436, 771767, 763101, 755840, 749488, 743121, 736284, 729304, 722716, 716551, 710335, 703740, 696980, 690369, 683754, 676745, 669428, 662385, 655973, 650029, 644434, 639433, 634942, 630021, 623646, 615903, 607945, 600805, 594690, 589346, 584465, 579566, 573904, 566907, 558615, 549638, 540866, 533133, 526733, 521084, 515271, 509173, 503670, 499420, 495849, 491940, 487711, 484179, 481868, 480186, 478513, 477159, 476720, 477139, 478188, 480416, 484519, 489817, 494389, 497140, 498947, 501308, 504568, 508133, 511735, 515533, 519268, 522303, 524526, 526413, 528164, 529604, 531088, 533645, 537736, 542496, 546697, 549913]
57983E49913K331J284J54k43L76R36L33r97j714j499j438k439m005m963m885m352
57967E28792l984l772l431k988k710k584k310j791j351j307j615k039k404k486
57953D94020k029j139m10k65m41m78m37n52m81M04J980L334L877L883L753L529
57937E08548L401L934N168O090N778M690M086M434N117N521N544N014L608J671
57923E72604K95k6k01j382l402n122o008o618p478q360q866r095r315r461r403
57908D88162r367r570r714r353q656q203q066p669o723n755n404n564n623n288
57894C83207m804m418m056l518k788k018j358q78n96n25o24o66k65P45J953K624
57878C62015K361J423L99j95q2O39J338J250L43m87m12L91J113J404J628K099
$$ y = [549913, 552244, 553528, 553682, 553439, 553815, 554751, 555084, 554087, 552373, 550874, 549436, 546997, 542992, 538029, 533144, 528792, 524808, 521036, 517605, 514617, 511907, 509323, 507013, 505222, 503871, 502564, 500949, 498910, 496506, 494020, 491991, 490852, 490442, 490177, 489736, 489258, 488821, 488269, 487788, 488192, 490172, 493506, 497383, 501266, 505019, 508548, 511949, 515883, 521051, 527141, 532919, 537609, 541695, 546129, 551246, 556767, 562311, 567325, 570933, 572604, 572899, 572873, 572672, 571290, 567888, 562766, 556758, 550140, 542662, 534302, 525436, 516341, 507026, 497565, 488162, 478795, 469225, 459511, 450158, 441502, 433299, 425233, 417564, 410841, 405086, 399682, 394118, 388495, 383207, 378403, 373985, 369929, 366411, 363623, 361605, 360247, 359369, 358773, 358248, 357624, 356958, 356693, 357438, 359391, 362015, 364376, 365799, 366198, 366003, 365921, 366560, 367898, 369148, 369491, 369004, 368592, 368983, 370096, 371500, 373128, 375227]
57862C75227K550K529K055J656J854K631L457L842L844L909M176M276L916L381
57848D19303L191L465L870M014L704L026K361K123K206K076J539J055R28O66k69
57833D53258j514k298k586k902l259l190k815k873l391l362k182o40J33J18J05
57818D22602M56Q75J101J148R27K81n99j255j483j498j548j707k036k559l064
57803D11641l226l094l207m077n532o765p092o671o321o591p126p188o610n881
57789C32260n338m783l981l077k285j584r40n28l74j79K42O36Q39J256K264L417
57773C17845L794L132K108J480J358J417J379J159P99M48K02p0n78j285j930k368
57757C28890k676k939l173l445l847m232m277l875l374l211l494l842l634k502
$$ y = [375227, 377777, 380306, 382361, 384017, 385871, 388502, 391959, 395801, 399645, 403554, 407730, 412006, 415922, 419303, 422494, 425959, 429829, 433843, 437547, 440573, 442934, 445057, 447263, 449339, 450878, 451933, 452861, 453527, 453258, 451744, 449446, 446860, 443958, 440699, 437509, 434694, 431821, 428430, 425068, 422886, 422246, 422379, 422497, 422602, 423058, 423933, 425034, 426182, 427109, 427390, 426791, 425536, 424053, 422555, 421007, 419300, 417264, 414705, 411641, 408415, 405321, 402114, 398037, 392505, 385740, 378648, 371977, 365656, 359065, 351939, 344751, 338141, 332260, 326922, 322139, 318158, 315081, 312796, 311212, 310272, 309744, 309370, 309191, 309433, 310069, 310908, 312164, 314428, 317845, 321639, 324771, 326879, 328359, 329717, 331134, 332513, 333672, 334471, 334919, 335121, 335051, 334473, 333188, 331258, 328890, 326214, 323275, 320102, 316657, 312810, 308578, 304301, 300426, 297052, 293841, 290347, 286505, 282871, 280369]
57743B80369p85N52P79K22o5N25J495J944J573Q26K02k18o03r78j102o88K59J288
57725B85595J706J139m3r35q82r9O18P96O61O22N91J87n44j090j239j421k004
57708B83658k654k794k440k070j874j593j121p08n11l84k92m76r62j249q94j67
57692B63469K76L27O26J719L263M352M595M667N585P536R742J1582J3419J5918
57678C47076J8806K0922K1563K1182K0586K0037J9543J9399J9828K0365K0379
57667E69686K0125K0590K2176K4064K5003K4232K1380J6063Q050k362j4359k6654
57655G07994l7322m4257m6513m5102m1958l8238l4060k9587k5409k1804j8422
57644C25322j5052j2120r970q260o552n039m104l528k775j819j050n84l03m22
$$ y = [280369, 279584, 280136, 280915, 281137, 281072, 281597, 283092, 285036, 286609, 287435, 287637, 287419, 286816, 285838, 284736, 284048, 284307, 285595, 287301, 288440, 288397, 287462, 286580, 286481, 287099, 287895, 288556, 289178, 289769, 289956, 289412, 288322, 287083, 285662, 283658, 281004, 278210, 275770, 273700, 271826, 270233, 269112, 268404, 267893, 267509, 267217, 266741, 265779, 264530, 263636, 263469, 263745, 264072, 264698, 266417, 269680, 274032, 278627, 283294, 288879, 296415, 306157, 317739, 331158, 347076, 365882, 386804, 408367, 429549, 450135, 470172, 489715, 509114, 528942, 549307, 569686, 589811, 610401, 632577, 656641, 681644, 705876, 727256, 743319, 751369, 749007, 734648, 707994, 670672, 626415, 579902, 534800, 492842, 454604, 420544, 390957, 365548, 343744, 325322, 310270, 298150, 288180, 279920, 273368, 268329, 264225, 260697, 257922, 256103, 255053, 254469, 254166, 253744]
57630B53744j101j621r05Q19J841J042o21j423j079p68j321k312l000l179k918
57615B37198k168j125m60o74j414j853j629j112q10q18r12r48j016j192j305j119
57599B18643p53p14j255j922k065j796j943k899l941m146l603l225l458l756l430
57584A79737k569j790j483j634k069k514k564k091j623j881k831l600l468k621
57570A46999j755j290j239j504j876j971j545q38l19k05m16q19j167j042l74J97
57554A30836L4m88l88M74J137J001P21J077J729J887J674J835K293K098R82mJ47
57537A47045J084J710J582J091O14J43k62l37n3K13J80rq5p5j26j95j20J00L58
57518A52858O83J113J461J509J405J514J774J687J127O85Q13J028N40n23j155
$$ y = [253744, 252643, 251022, 250117, 250936, 252777, 253819, 253198, 251775, 250696, 249928, 248607, 246295, 243295, 240116, 237198, 235030, 233905, 233445, 232771, 231357, 229504, 227875, 226763, 225953, 225135, 224223, 223275, 222259, 221067, 219762, 218643, 217890, 217176, 215921, 213999, 211934, 210138, 208195, 205296, 201355, 197209, 193606, 190381, 186923, 183167, 179737, 177168, 175378, 173895, 172261, 170192, 167678, 165114, 163023, 161400, 159519, 156688, 153088, 149620, 146999, 145244, 143954, 142715, 141211, 139335, 137364, 135819, 134981, 134662, 134457, 134041, 133222, 132055, 131013, 130639, 130836, 130870, 130382, 129994, 130468, 131605, 132606, 133327, 134404, 136133, 138020, 139694, 141529, 143822, 145920, 146902, 146898, 147045, 148129, 149839, 151421, 152512, 153126, 153269, 153007, 152670, 152617, 152830, 153010, 153001, 152916, 152841, 152715, 152520, 152400, 152500, 152858, 153541, 154654, 156115, 157624, 159029, 160543, 162317, 164004, 165131, 165816, 166629, 167657, 168197, 167674, 166519]
57503A66519p23L19J075J053K91q90j961k451k451k576l148l683l534k755k022
57488A43063j820j999k067j676q47M9N61N05k2q63j898k775k968k220q78L58Q74
57471A25377M20o50j406j091k9O30L01l99o36m32k59j43K07O47O88K48k52m84
57453A22737n06m63m38m40k89K35Q88J004M66J78Q71J865J886Q73ro1J86R3j67
57434A28909j61O7K62L96M76L68J50J93O29J128J424J573J600J327Q23M53L08
57417A39925J06q5K55J122J565Q83l15q56m76R4K75J64Q3J61M32R42J637K356
57399A48268K908L071K730K125J773J868K017J805J326R55Q92J191J868K648K896
57384A78341K336J589J569K364L170L268K783K388K526K974L094K567J845J711
$$ y = [166519, 165796, 166115, 167190, 168243, 168534, 167644, 165683, 163232, 160781, 158205, 155057, 151374, 147840, 145085, 143063, 141243, 139244, 137177, 135501, 134654, 134703, 135264, 135769, 135747, 134884, 132986, 130211, 127243, 125023, 124145, 124503, 125377, 125797, 125147, 123741, 122650, 122621, 123251, 123552, 123153, 122517, 122085, 121826, 121683, 121890, 122537, 123225, 123473, 123221, 122737, 122231, 121768, 121330, 120890, 120601, 120836, 121724, 122728, 123194, 123372, 124243, 126108, 127994, 128867, 128858, 128797, 128983, 129076, 128909, 128748, 128815, 129077, 129473, 129949, 130317, 130467, 130660, 131289, 132417, 133841, 135414, 137014, 138341, 139164, 139617, 139925, 140031, 139946, 140201, 141323, 142888, 143771, 143456, 142600, 142124, 142218, 142493, 142657, 142740, 142901, 143333, 144275, 145912, 148268, 151176, 154247, 156977, 159102, 160875, 162743, 164760, 166565, 167891, 168846, 169738, 170929, 172797, 175445, 178341, 180677, 182266, 183835, 186199, 189369, 192637, 195420, 197808, 200334, 203308, 206402, 208969, 210814, 212525]
57370B12525K404L423M119M122L266J705K79N9J150K467L080L200L415L635L484
57355B52333L200L304L628L533K978K617K920L756M772N555N616M866M023L882
57341C06983M202M098L477L242L885M672M697M068L615L786M317M793N070N278
57327C66183N599O056O459O599O445O090N625N239N211N516N726N629N686O394
57313D48457P406P926P853P908Q609R683J0555J0855J0454R571Q881Q926R366
57300E66450R447R233R608J0849J2089J2559J2628J3012J3632J3979J4117J4574
57288G12177J5408J6123J6487J6849J7524J8298J8771J8982J9454K0544K1826
57277I12443K2412K2091K1830K2738K4685K6510K7494K7928K8182K8047K7429
$$ y = [212525, 214929, 218352, 222471, 226593, 229859, 231564, 231843, 231902, 233052, 235519, 238599, 241799, 245214, 248849, 252333, 255533, 258837, 262465, 265998, 268976, 271593, 274513, 278269, 283041, 288596, 294212, 299078, 303101, 306983, 311185, 315283, 318760, 322002, 325887, 330559, 335256, 339324, 342939, 346725, 351042, 355835, 360905, 366183, 371782, 377838, 384297, 390896, 397341, 403431, 409056, 414295, 419506, 425022, 430748, 436377, 442063, 448457, 455863, 463789, 471642, 479550, 488159, 497842, 508397, 519252, 529706, 539277, 548158, 557084, 566450, 575897, 585130, 594738, 605587, 617676, 630235, 642863, 655875, 669507, 683486, 697603, 712177, 727585, 743708, 760195, 777044, 794568, 812866, 831637, 850619, 870073, 890617, 912443, 934855, 956946, 978776, 1001514, 1026199, 1052709, 1080203, 1108131, 1136313, 1164360, 1191789]
57266A191789K6933K7184K8003K8787K9377L0055L1020L2337L4023L5700L6517
57255A531725L6043L4945L4232L3972L3425L2288L1198L0902L1447L2279L2761
57244A895217L2592L2023L1626L1589L1374L0523K9583K9624L0809L2084L2493
57233B239537L2294L2432L3340L4674L6009L7288L8591L9772M0569M1007M1499
57222B647012M2445M3758M4881M5289M4852M3756M2324M1051M0518M0915M1756
57211C118557M2273M2133M1671M1605M2666M5266M9218N3839N8523O3145O7726
57200C666622P1955P5315P7507P8397P7692P5176P1309O7053O2949N8661N3601
57189D436237M7675M1241L4624K8049K1923J6856J3379J1791J2164J4362J7969
$$ y = [1191789, 1218722, 1245906, 1273909, 1302696, 1332073, 1362128, 1393148, 1425485, 1459508, 1495208, 1531725, 1567768, 1602713, 1636945, 1670917, 1704342, 1736630, 1767828, 1798730, 1830177, 1862456, 1895217, 1927809, 1959832, 1991458, 2023047, 2054421, 2084944, 2114527, 2144151, 2174960, 2207044, 2239537, 2271831, 2304263, 2337603, 2372277, 2408286, 2445574, 2484165, 2523937, 2564506, 2605513, 2647012, 2689457, 2733215, 2778096, 2823385, 2868237, 2911993, 2954317, 2995368, 3035886, 3076801, 3118557, 3160830, 3202963, 3244634, 3286239, 3328905, 3374171, 3423389, 3477228, 3535751, 3598896, 3666622, 3738577, 3813892, 3891399, 3969796, 4047488, 4122664, 4193973, 4261026, 4323975, 4382636, 4436237, 4483912, 4525153, 4559777, 4587826, 4609749, 4626605, 4639984, 4651775, 4663939, 4678301, 4696270]
57178D696270K2473K7570L3143L8833M3788M7113M8643M9084M9258M9337M8962
57167E154474M7993M6927M6497M6935M7667M7739M6713M5141M4016M3669M3495
57156E661266M2963M2438M2561M3045M2710M0732L7376L3376K9112K4534J9547
57145F059660J4231Q779L297k532r357j7398k5952l4168m2080n0184n8008o4028
57133E782260o7245o8039o7008o3778n7598m8777l8885k9718k2305j6826j3307
57122E288774j2487j5701k3377l3817m4141n2283n7257n7895n2790m1771k6122
57111D871133o898J6159M4281P9915J27489J91697K73472L67382M60968N33067
57101F958665N52953M86182L04663q385m56936j021163j641072k223888B63811
$$ y = [4696270, 4718743, 4746313, 4779456, 4818289, 4862077, 4909190, 4957833, 5006917, 5056175, 5105512, 5154474, 5202467, 5249394, 5295891, 5342826, 5390493, 5438232, 5484945, 5530086, 5574102, 5617771, 5661266, 5704229, 5746667, 5789228, 5832273, 5874983, 5915715, 5953091, 5986467, 6015579, 6040113, 6059660, 6073891, 6082670, 6085967, 6083435, 6074078, 6056680, 6030728, 5996560, 5954480, 5904296, 5846288, 5782260, 5715015, 5646976, 5579968, 5516190, 5458592, 5409815, 5370930, 5341212, 5318907, 5302081, 5288774, 5276287, 5260586, 5237209, 5203392, 5159251, 5106968, 5049711, 4991816, 4939026, 4897255, 4871133, 4864235, 4880394, 4924675, 5004590, 5132079, 5323776, 5597248, 5964630, 6425598, 6958665, 7511618, 7997800, 8302463, 8294078, 7837142, 6815979, 5174907, 2951019, 263811]
57091b736612l179598l249739l232130l171413l148514l237611l445650l701679
57083b9102946l898306l928021l688501l095039k130706q95656M08273J562168
57075d4768734K420738K947907L192301L238902L170140L046622K903044K752671
57067b1096409K595613K427436K245221K049547J843544J631787J420355J216606
57059e666300J027570Q58307P11568N88058M86202M02542L33486K76704K30504
57050g51359J92639J60775J33789J11499e9421A8240O4017N2415M2722L4003K5546
57039B36943J7739J1355O437K457p65l007m360n490o919q357q925q060o065l752
57025B19231j700O6J629K724K900K093Q64K1P3R95K460M333O868J0224J3728J5876
$$ y = [-2736612, -5916210, -9165949, -12398079, -15569492, -18718006, -21955617, -25401267, -29102946, -33001252, -36929273, -40617774, -43712813, -45843519, -46739175, -46330902, -44768734, -42347996, -39400089, -36207788, -32968886, -29798746, -26752124, -23849080, -21096409, -18500796, -16073360, -13828139, -11778592, -9935048, -8303261, -6882906, -5666300, -4638730, -3780423, -3068855, -2480797, -1994595, -1592053, -1258567, -981863, -751359, -558720, -397945, -264156, -152657, -59421, 18240, 82257, 134672, 177394, 211397, 236943, 254682, 266037, 272474, 274931, 274166, 271159, 266799, 261309, 254390, 246033, 237108, 229048, 222983, 219231, 217531, 217597, 219226, 221950, 224850, 226943, 227807, 227828, 227901, 228896, 231356, 235689, 242557, 252781, 266509, 282385]
57009B82385J5322J1822O175m18o658j1244j3340j3099j1457r343p371o003n413
56996B31358n056m012k088j47R92J522K089K743L063L021K955K775K062J032O22
56981B42931J228K118K519K665L132L687L570K638J470M84k61m89J84J457K427
56966B69760K689K664K668K467K084K211L183M239M517M281M368M883N241N202
56952C20457M927M172K428n0k251l625m540n301n503m747l397k078r29J96J209
56937C00968K034K966M223N347N581M857L931L537L749M176M398M126L130J250
56923C54273j523m940q401j1123j2572j2729j1989j0873r883r287q813p821o062
56910B38257m209l243l368l789l643k780j575l59O88J287J218Q07Q41J781L235
$$ y = [282385, 297707, 309529, 315704, 315286, 308628, 297384, 284044, 270945, 259488, 250145, 242774, 236771, 231358, 226302, 222290, 220202, 220055, 221047, 222569, 224658, 227401, 230464, 233485, 236440, 239215, 241277, 242309, 242931, 244159, 246277, 248796, 251461, 254593, 258280, 261850, 264488, 265958, 266442, 266181, 265692, 265876, 267333, 269760, 272449, 275113, 277781, 280248, 282332, 284543, 287726, 291965, 296482, 300763, 305131, 310014, 315255, 320457, 325384, 329556, 331984, 331934, 329683, 326058, 321518, 316217, 310714, 305967, 302570, 300492, 299563, 299759, 300968, 303002, 305968, 310191, 315538, 321119, 325976, 329907, 333444, 337193, 341369, 345767, 349893, 353023, 354273, 352750, 347810, 339409, 328286, 315714, 302985, 290996, 280123, 270240, 260953, 252140, 244319, 238257, 234048, 230805, 227437, 223648, 220005, 217225, 215650, 215291, 215979, 217266, 218484, 219291, 220132, 221913, 225148]
56895B25148M480N329O079O780P062O860O701O935P103O654N930N745O186O542
56881C13534O510O578O973O983N961M435L572L782M466N006N379N766O096O269
56867C91310O465O993P897Q850R468R693R873J0363J1085J1679J2050J2418J2691
56854E20835J2164J0170O846K988o48l551n330n770m965l094k35L200O215Q075
56840E46900R294J1033J3491J5587J6494J6718J7239J8167J8852J8919J8498J7502
56828G38694J5243J0893M219m029j2238j8714k2693k4569k4947k3834k1133j7510
56816E99382j4031j1009p842m172n45K325M397O043P395Q407R312J0417J1521
56803F21600J1881J0744P693K616m166j1627j8248k2757k4737k4590k3122k1018
$$ y = [225148, 229628, 234957, 241036, 247816, 254878, 261738, 268439, 275374, 282477, 289131, 295061, 300806, 306992, 313534, 320044, 326622, 333595, 340578, 346539, 350974, 354546, 358328, 362794, 367800, 373179, 378945, 385041, 391310, 397775, 404768, 412665, 421515, 430983, 440676, 450549, 460912, 471997, 483676, 495726, 508144, 520835, 532999, 543169, 550015, 553003, 552355, 548804, 543474, 537704, 532739, 529645, 529410, 532610, 538825, 546900, 556194, 567227, 580718, 596305, 612799, 629517, 646756, 664923, 683775, 702694, 721192, 738694, 753937, 764830, 769049, 765020, 752782, 734068, 711375, 686806, 661859, 638025, 616892, 599382, 585351, 574342, 566500, 562328, 561783, 564108, 568505, 574548, 581943, 590350, 599662, 610079, 621600, 633481, 644225, 651918, 654534, 650368, 638741, 620493, 597736, 572999, 548409, 525287, 504269]
56791E04269j8484j5362j1760q448o268n187m289k900j319j96M13J076K144L279
56777D36968L780L120J157j946n811r964j3900j7111j9190k0022j9821j8895j7395
56764C00970j5376j3045j0803r051p957p308o644n666m590l928l829l884l629
56751B05260l041k335j641j067q32r66j102r57q24j128j614j576r58o17j202k165
56735A83235k374j469k67K34l0k51J83Q73R05P1p28n41N22J556J927J687J127
56718A86660N81N49J331K368K552J531J90l97j24L16M15K34M6j7l4j64m03n22
56700A95112m00k72l22j78N76J460J504O88J02K96M48k39j154j262p39n63q88
56683A94169r72n45j47n0P7L12J92l56o72l54J29K09J6qJ59K71L15M62P10R32
$$ y = [504269, 485785, 470423, 458663, 450215, 443947, 438760, 434471, 431571, 430252, 430056, 430469, 431545, 433689, 436968, 440748, 443868, 445025, 443079, 437268, 427304, 413404, 396293, 377103, 357081, 337260, 318365, 300970, 285594, 272549, 261746, 252695, 244738, 237430, 230786, 225120, 220530, 216602, 212773, 208889, 205260, 202219, 199884, 198243, 197176, 196344, 195378, 194276, 193319, 192495, 191367, 189753, 188177, 187219, 186602, 185400, 183235, 180861, 179392, 179125, 179359, 179329, 179078, 179261, 180134, 181039, 181110, 180382, 179841, 180363, 181919, 183846, 185533, 186660, 187241, 187790, 189121, 191489, 194041, 195572, 195762, 195365, 195241, 195557, 195972, 196206, 196252, 196235, 196201, 196037, 195634, 195112, 194712, 194440, 194118, 193940, 194516, 195976, 197480, 198168, 198270, 198566, 199014, 198775, 197621, 196359, 195620, 195057, 194169, 193197, 192652, 192505, 192455, 192532, 192844, 193036, 192680, 192008, 191654, 191783, 191992, 192008, 192000, 192159, 192430, 192745, 193207, 193917, 194849]
56663A94849J061J062R20P79Q38J014J071J115J507K137K316J667P09K42M63R56
56647B12706J234J034L74l87p99p89o14l16L09J057J245O55L9J60Q07J228J147
56630B19090Q31M36n8n14p19p15o09l43L7J33k39n60k46N05J081J392J720J910
56612B23132J536Q11M68O86R17Q80Q79R79P24O9k52J94P81P09J17l12l55k61r9
56593B31603K37O05P62P33N75Q2p40j200o77L75Q99O20K14J43J61J62N64J455
56575B36573K085J869J311J277J756K067K034K179K697L056K809K290K175K731
56561B66909L701M610M968M581L987M137N264O346O174M763L192K169J461P15
56547C22977J40K3J71K19R7k06q72j800k263j707o97m00j168k259k924l169l262
$$ y = [194849, 195910, 196972, 197892, 198671, 199509, 200523, 201594, 202709, 204216, 206353, 208669, 210336, 211045, 211287, 211750, 212706, 213940, 214974, 215348, 214961, 214162, 213373, 212759, 212443, 212752, 213809, 215054, 215709, 215748, 215908, 216715, 217943, 219090, 219921, 220357, 220299, 219785, 219066, 218351, 217742, 217399, 217436, 217569, 217330, 216770, 216524, 217029, 218110, 219502, 221222, 223132, 224668, 225479, 225947, 226633, 227550, 228430, 229309, 230288, 231012, 231081, 230829, 231023, 231804, 232513, 232630, 232318, 231963, 231702, 231603, 231840, 232445, 233207, 233940, 234515, 234597, 233857, 232657, 231980, 232355, 233254, 233874, 234088, 234231, 234392, 234554, 235118, 236573, 238658, 240527, 241838, 243115, 244871, 246938, 248972, 251151, 253848, 256904, 259713, 262003, 264178, 266909, 270610, 275220, 280188, 284769, 288756, 292893, 298157, 304503, 310677, 315440, 318632, 320801, 322262, 322977, 323117, 323140, 323311, 323530, 323627, 323421, 322549, 320749, 318486, 316779, 316082, 315682, 314514, 312255, 309331, 306162, 302900]
56530C02900l207l031l041l317l357k666j477m77l9j40p46j766k719k997k524
56515B71396j824j377j193j094j010r38q36p40p76r60j100r34l65M21R26O29m62
56498B59763j572j813j047M3P34P73K68m95j004q12r4M31L85J94L96P77O90N5
56480B57672m93m68j67k25q05j435j516q49K46J171J437R85K27k19J8P98J561
56463B57938J773J305M83j78l16M5N33P34N67K81R2K8R1L54O95P61M51J76K61
56444B66074M26L14J64L91P34O41L70O75J354J244J30n91J26J353J628J123J098
56427B77254J641J596O27j15K07R13R70M02j07k53o6M84J184J329N38n21q22j87
56409B85074O77J137J102P80N07O22J036J088L60n42o14J53P44N66K55O39J444
$$ y = [302900, 299693, 296662, 293621, 290304, 286947, 284281, 282804, 282327, 282288, 282148, 281402, 279636, 276917, 273920, 271396, 269572, 268195, 267002, 265908, 264898, 263960, 263124, 262384, 261608, 260648, 259548, 258614, 258249, 258670, 259596, 260225, 259763, 258191, 256378, 255331, 255374, 256108, 256881, 257149, 256654, 255650, 254838, 254744, 255175, 255560, 255754, 256150, 256927, 257617, 257672, 257179, 256711, 256544, 256319, 255514, 254079, 252563, 251714, 251960, 253131, 254568, 255553, 255780, 255561, 255579, 256377, 257938, 259711, 261016, 261499, 261321, 261005, 261050, 261583, 262317, 262884, 263165, 263257, 263285, 263376, 263730, 264425, 265186, 265637, 265813, 266074, 266500, 266814, 266978, 267369, 268103, 268744, 269114, 269789, 271143, 272387, 272517, 271926, 272052, 273405, 275033, 276156, 277254, 278895, 280491, 281118, 281003, 281210, 282123, 283093, 283495, 283388, 283135, 283069, 283553, 284737, 286066, 286604, 286083, 285261, 285074, 285751, 286888, 287990, 288770, 289277, 289899, 290935, 292023, 292383, 291841, 291227, 291380, 292124, 292690, 292945, 293584, 295028]
56392B95028J599P05l82n52L30J426J984K040K003J939J548Q22K98M79J218J886
56376C12371K066J886J652J393Q91J25m77m83j5L72M76O70J114J219M55o11q49
56359C22255j15N31L68k2L14J338K166K165J463N63n8j82M1L13O56J335K213K648
56341C37992K417K116K301K597K291J404N71J35K1K75J030J979K484K280J691
56326C61584J160R56J167J597J816J685J626J908K030J456O37M89J000J314J164
56311C81589J329K354L670M334M079L291K461J976J983K193K183K070K417L364
56297D19293M326M779M803M659M429M324M722N487N797N084L781K795K653L411
56283D80343M842O313P004O807O570O958P548P670P619Q244R536J0563J0837J1020
$$ y = [295028, 296627, 297332, 296950, 296398, 296728, 298154, 300138, 302178, 304181, 306120, 307668, 308490, 308788, 309267, 310485, 312371, 314437, 316323, 317975, 319368, 320259, 320384, 319907, 319424, 319409, 319781, 320257, 320927, 322041, 323260, 323715, 323104, 322255, 322140, 322671, 323039, 323017, 323331, 324669, 326835, 329000, 330463, 331026, 330968, 330786, 330827, 331140, 331796, 333131, 335344, 337992, 340409, 342525, 344826, 347423, 349714, 351118, 351689, 351824, 351845, 352120, 353150, 355129, 357613, 359893, 361584, 362744, 363700, 364867, 366464, 368280, 369965, 371591, 373499, 375529, 376985, 377622, 378111, 379111, 380425, 381589, 382918, 385272, 388942, 393276, 397355, 400646, 403107, 405083, 407066, 409259, 411442, 413512, 415929, 419293, 423619, 428398, 433201, 437860, 442289, 446613, 451335, 456822, 462619, 467703, 471484, 474279, 476932, 480343, 485185, 491498, 498502, 505309, 511879, 518837, 526385, 534055, 541674, 549918, 559454, 570017, 580854, 591874]
56269E91874J2023J3908J5988J7685J9034K0443K2176K4071K5830K7561K9807
56258H20400L2947L6808M0938M5004M8760N2051N5092N8423O2219O5961O9130
56247A387733P1877P4549P6913P8450P9189P9620P9771P9048P7084P4161P0574
56236B228969O6096O0323N3248M5143L6101K5995J4808K847r305k0974l1739m1699
56224B429813n1244o0349o8216p3939p7533q0069q2476q4439q4820q3178q0402
56213A603148p7561p4613p0775o5910o0849n6336n2363m8636m5091m1606l7843
56202I71565l3772k9993k6984k4429k1752j9046j6954j5763j5125j4553j3724
56191G39470j2416j0573q581p121o601o795p008o536n181l503k358k019j934j522
$$ y = [591874, 603897, 617805, 633793, 651478, 670512, 690955, 713131, 737202, 763032, 790593, 820400, 853347, 890155, 931093, 976097, 1024857, 1076908, 1132000, 1190423, 1252642, 1318603, 1387733, 1459610, 1534159, 1611072, 1689522, 1768711, 1848331, 1928102, 2007150, 2084234, 2158395, 2228969, 2295065, 2355388, 2408636, 2453779, 2489880, 2515875, 2530683, 2533530, 2524225, 2503251, 2471512, 2429813, 2378569, 2318220, 2250004, 2176065, 2098532, 2018463, 1935987, 1851548, 1766728, 1683550, 1603148, 1525587, 1450974, 1380199, 1314289, 1253440, 1197104, 1144741, 1096105, 1051014, 1009408, 971565, 937793, 907800, 880816, 856387, 834635, 815589, 798635, 782872, 767747, 753194, 739470, 727054, 716481, 707900, 700779, 694178, 687383, 680375, 673839, 668658, 665155, 662797, 660778, 658844, 657322]
56177F57322q47k49K15N66M90k30j059j080LJ656L231M390M958M951M861N338
56161F84516O368P171P178O777O864P838R332J0727J1718J2451J3244J4320J5775
56148H14279J7700K0242K3378K6860L0447L4154L8138M2358M6484N0126N3217
56137A197383N6212N9716O3732O7492P0386P2853P5768P9064Q1744Q3231Q3784
56126A991365Q3392Q1251P6939P1054O3987N5097M4137L2737K3036J5292Q225
56115B546512J349m691j0149j6696k5198l4183m1532m6787n0958n4740n7946o0421
56103B144560o2626o5212o8372p1546p3544p3307p0859o7185o2888n7428n0189
56092A421404m1923l4386k8579k4003j9700j5478j1781q833o303l751j097J369
$$ y = [657322, 656475, 656226, 656441, 657007, 657497, 657267, 656208, 655128, 655131, 656787, 660018, 664408, 669366, 674317, 679178, 684516, 690884, 698055, 705233, 712010, 718874, 726712, 736044, 746771, 758489, 770940, 784184, 798504, 814279, 831979, 852221, 875599, 902459, 932906, 967060, 1005198, 1047556, 1094040, 1144166, 1197383, 1253595, 1313311, 1377043, 1444535, 1514921, 1587774, 1663542, 1742606, 1824350, 1907581, 1991365, 2074757, 2156008, 2232947, 2304001, 2367988, 2423085, 2467222, 2499959, 2522995, 2538287, 2546512, 2547861, 2543170, 2533021, 2516325, 2491127, 2456944, 2415412, 2368625, 2317667, 2262927, 2204981, 2144560, 2081934, 2016722, 1948350, 1876804, 1803260, 1729953, 1659094, 1591909, 1529021, 1471593, 1421404, 1379481, 1345095, 1316516, 1292513, 1272813, 1257335, 1245554, 1236721, 1230418, 1226667, 1225570, 1226939]
56080A226939L290M568N513O592P832Q623Q448P823P975R368J1042J1892J2070
56067A331975J2487J3301J3914J4251J4956J6118J6919J6985J7025J7564J7979
56056A503474J7636J7060J7078J7464J7544J7538J8168J9341K0285K0846K1584
56045A708018K2720K4030K5623K7786K9976L1139L1160L1070L1625L2599L3773
56034B029519L5554L8090M0514M1849M2282M2978M4704M7109M9379N1359N3711
56023B517048N6867O0157O2568O4297O6635P0050P3351P5456P7099P9808Q3837
56012C287173Q8112R1840R5154R8571J02630J07779J13772J19686J25301J31779
56002D361797J39956J48752J56554J63544J71267J80399J90480K01468K13837
$$ y = [1226939, 1230229, 1234797, 1240310, 1246902, 1254734, 1263357, 1271805, 1279628, 1287603, 1296971, 1308013, 1319905, 1331975, 1344462, 1357763, 1371677, 1385928, 1400884, 1417002, 1433921, 1450906, 1467931, 1485495, 1503474, 1521110, 1538170, 1555248, 1572712, 1590256, 1607794, 1625962, 1645303, 1665588, 1686434, 1708018, 1730738, 1754768, 1780391, 1808177, 1838153, 1869292, 1900452, 1931522, 1963147, 1995746, 2029519, 2065073, 2103163, 2143677, 2185526, 2227808, 2270786, 2315490, 2362599, 2411978, 2463337, 2517048, 2573915, 2634072, 2696640, 2760937, 2827572, 2897622, 2970973, 3046429, 3123528, 3203336, 3287173, 3375285, 3467125, 3562279, 3660850, 3763480, 3871259, 3985031, 4104717, 4230018, 4361797, 4501753, 4650505, 4807059, 4970603, 5141870, 5322269, 5512749, 5714217, 5928054]
55993E928054K27392K41516K56605K73855K93645L15530L39573L66373L95995
55984H638538M28364M64479N05798N52822O05750O65991P35562Q15720R08326
55975A4321350J017901J150256J309909J501692J734916K023681K383297K828417
55967B8271419L373100M027736M792776N654207O582158P531866Q450999R293662
55959G7977923J0027762J0624788J1047487J1261938J1269763J1122931J0898483
55952A54231075J0655942J0416289J0174479R925970R680663R452587R238007
55945B23775012R004848Q686359Q136963P054459M987647J556335l197685q634882
55937B51369056j3744854j7637461j9910730k0660109k0242063j9049303j7414663
$$ y = [5928054, 6155446, 6396962, 6653567, 6927422, 7221067, 7536597, 7876170, 8242543, 8638538, 9066902, 9531381, 10037179, 10590001, 11195751, 11861742, 12597304, 13413024, 14321350, 15339251, 16489507, 17799416, 19301108, 21036024, 23059705, 25443002, 28271419, 31644519, 35672255, 40465031, 46119238, 52701396, 60233262, 68684261, 77977923, 88005685, 98630473, 109677960, 120939898, 132209661, 143332592, 154231075, 164887017, 175303306, 185477785, 195403755, 205084418, 214537005, 223775012, 232779860, 241466219, 249603182, 256657641, 261645288, 263201623, 260003938, 251369056, 237624202, 219986741, 200076011, 179415902, 159173839, 140124536, 122709873]
55930A22709873j5592670j3755516j2001627j0382232q924435p637839o518190
55923D7897364n556486m743033m062763l494322l017770k619273k286834k006737
55915B0110146j767044j560902j384012j231665j099817r86189q88410q03035
55907A0389072p27440o60730o02088n50059n03803m63002m26198l91420l58629
55898E705703l29412l03954k80506k58128k37646k19536k02940j87348j73202
55889C513031j60321j47703j35427j24823j16314j08747j01448r4994q9517q4120
55879B349617p8581p3866p0192o6405o2040n8234n5684n3265m9838m6103m3496
55868A691913m2291m1912m2190m3247m4633m5486m5286m4108m2433m0799l9227
$$ y = [122709873, 107117203, 93361687, 81360060, 70977828, 62053393, 54415554, 47897364, 42340878, 37597845, 33535082, 30040760, 27022990, 24403717, 22116883, 20110146, 18343102, 16782200, 15398188, 14166523, 13066706, 12080517, 11192107, 10389072, 9661632, 9000902, 8398814, 7848755, 7344952, 6881950, 6455752, 6064332, 5705703, 5376291, 5072337, 4791831, 4533703, 4296057, 4076521, 3873581, 3686233, 3513031, 3352710, 3205007, 3069580, 2944757, 2828443, 2719696, 2618248, 2523254, 2433737, 2349617, 2271036, 2197170, 2126978, 2060573, 1998533, 1940299, 1884615, 1831350, 1781512, 1735409, 1691913, 1649622, 1607710, 1565520, 1522273, 1477640, 1432154, 1386868, 1342760, 1300327, 1259528, 1220301]
55857A220301l7007l3702l0199k7820k6683k5827k4796k3851k2880k1431j9964
55846I26141j9515j9998k0111j9278j8247j7514j6541j5087j3949j3660j3629
55835G38612j3161j2429j1825j1349j1051j1198j1500j1129r942q738p983p289
55823F11018o481o027o052n952n480n103m901m366l639l623m291m273k942j472
55809E46416r28o17M58J678J736O82k65l53L24J541K890L485K811J590R43R82
55793E63373R54L34j008l184n945q340r594j0060j0518j0914j0578r457q275p535
55779D69253p033o315n166l797k858k936l718m181l883l457l375l047j879n09
55765D17099j5m45j015j419j995k883l915n136o605p854q312q128p897p760p443
$$ y = [1220301, 1183294, 1149592, 1119393, 1091573, 1064890, 1039063, 1014267, 990416, 967536, 946105, 926141, 906626, 886628, 866517, 847239, 828992, 811478, 794937, 779850, 765901, 752241, 738612, 725451, 713022, 701197, 689848, 678797, 667599, 656099, 644970, 635028, 626290, 618307, 611018, 604537, 598510, 592458, 586506, 581026, 575923, 571022, 566656, 563017, 559394, 555103, 550830, 547888, 546416, 545488, 544871, 545329, 547007, 548743, 549425, 549160, 548807, 549131, 550672, 553562, 557047, 559858, 561448, 562391, 563373, 564327, 564661, 563653, 560469, 554524, 546184, 536590, 526530, 516012, 505098, 494520, 485063, 476788, 469253, 462220, 455905, 450739, 446942, 444084, 441148, 437430, 433249, 429366, 425909, 422534, 419487, 417608, 417099, 417084, 416639, 415624, 414205, 412210, 409327, 405412, 400276, 393671, 385817, 377505, 369377, 361480, 353720, 346277]
55750C46277o956o509n981n213m589m595m927m901m563m559m910m909m233l419
55736B76013k962k703k312j780j192n67j45l44j140j917k142j967j964k474l227
55721B49177l528k884j552l69J52K30J81j07o74j022p94m62o27r67p00J35Q15
55704B37004J136J522J920J646N74m20o72o21r84j680k131k208k281k533k676
55689B27596k330j415k93N29R08J291K109L058L330K643J641J174J483K104K342
55674B46170J859J113J018J788K394J822O32L32J210J889J382N33O35J520J970
55659B66267J523Q63N67M63K61Q5J51L89N64M89Q3m78p71o63p05j538k946m071
55641B60533m584n041n821o402o063m964m013l803m130m419m311l846l329l006
$$ y = [346277, 339321, 332812, 326831, 321618, 317029, 312434, 307507, 302606, 298043, 293484, 288574, 283665, 279432, 276013, 273051, 270348, 268036, 266256, 265064, 264497, 264352, 264008, 262868, 260951, 258809, 256842, 254878, 252404, 249177, 245649, 242765, 241213, 240844, 240996, 241226, 241407, 241300, 240626, 239604, 238810, 238348, 237721, 236754, 236054, 236189, 237004, 238140, 239662, 241582, 243228, 243802, 243382, 242710, 242089, 241105, 239425, 237294, 235086, 232805, 230272, 227596, 225266, 223851, 223558, 224087, 224995, 226286, 228395, 231453, 234783, 237426, 239067, 240241, 241724, 243828, 246170, 248029, 249142, 250160, 251948, 254342, 256164, 256796, 257128, 258338, 260227, 261609, 262142, 262777, 264297, 266267, 267790, 268653, 269220, 269683, 269944, 270029, 270180, 270569, 271133, 271622, 271705, 271227, 270456, 269793, 269088, 267550, 264604, 260533, 255949, 250908, 245087, 238685, 232622, 227658, 223645, 219842, 215712, 211293, 206982, 203136, 199807, 196801]
55627A96801k757k233j464r96j130j382j128o33p32j513k079j813j219j117j524
55612A75081j785j488p04K91J089J148K93q52j419j174n93k40m64j343k421k748
55596A62671j889o54j86m79n82j79J11K3J76Q56J345J082O65Q26J138P29j52l48
55578A65153N50J651K089K034K117K382K286J579P74O63J411K358K755K609K526
55563A92937K784L045K962K622K158J458M68n48j357j996k446k545k417k477k725
55548A91923k612k021j675k057k504k133j157m79l63l89m29p24j099j037n97m77
55532A72170r47j400j188m05L19L87m12j636k302j793p49m67j314k268k263j438
55516A54294q00r66j617k036j930j599j364j022j98P82R64Kj203j535r61l08j42
$$ y = [196801, 194044, 191811, 190347, 189351, 188221, 186839, 185711, 185078, 184346, 182833, 180754, 178941, 177722, 176605, 175081, 173296, 171808, 171104, 171395, 172484, 173632, 173925, 173073, 171654, 170480, 169887, 169647, 169183, 167840, 165419, 162671, 160782, 160128, 159942, 159463, 158881, 158702, 158813, 158836, 159012, 159868, 161213, 162295, 162960, 163786, 164924, 165653, 165501, 165153, 165703, 167354, 169443, 171477, 173594, 175976, 178262, 179841, 180615, 181278, 182689, 185047, 187802, 190411, 192937, 195721, 198766, 201728, 204350, 206508, 207966, 208434, 207886, 206529, 204533, 202087, 199542, 197125, 194648, 191923, 189311, 187290, 185615, 183558, 181054, 178921, 177764, 177285, 176922, 176533, 176104, 175380, 174281, 173244, 172647, 172170, 171223, 169823, 168635, 168230, 168549, 168936, 168524, 166888, 164586, 162793, 162044, 161577, 160263, 157995, 155732, 154294, 153494, 152528, 150911, 148875, 146945, 145346, 143982, 142960, 142762, 143544, 144508, 144510, 143307, 141772, 140811, 140503, 140361]
55499A40361m45r52j233p77L37J186J086M76N4l01q84j091l25N31J08j217j702
55482A35212q90j48k72l21M78J311J266Q24P85Q94O73N91J133J633J293O60P06
55465A45828J088P05m06j131j058q51q96p93l48L6J91M55Q33P68k9j112j912k185
55447A39183j825q99M3L28L3j26J22L14J38m2J19M02M83L92K09j93p11q76n05
55428A36589j09j89m88m04J40O76Q52P74P09Q23J103J367J406J292J392J878K375
55411A50186K353J744R51L10j37m12m28j87M1k8l32n20m60m88r36j490j392m52
55393A48323M88M70l81j051r34m66k97m16m09k36j94l01j98K45O66O99M44K60
55375A46712K84L68L42J31k82p57r37n62J34O09O34M85M71N68O66P95Q92O97J95
$$ y = [140361, 139916, 138964, 137731, 136954, 137291, 138477, 139563, 140039, 140093, 139792, 138908, 137817, 137492, 138023, 138131, 136914, 135212, 134322, 134174, 133902, 133581, 134059, 135370, 136636, 137460, 138245, 139139, 139812, 140403, 141536, 143169, 144462, 145122, 145828, 146916, 147621, 147215, 146084, 145026, 144175, 143279, 142486, 142138, 142174, 142365, 142820, 143653, 144421, 144392, 143280, 141368, 139183, 137358, 136459, 136502, 136830, 136863, 136737, 136859, 137173, 137311, 137269, 137388, 137790, 138273, 138665, 138874, 138681, 137970, 137094, 136589, 136480, 136291, 135803, 135399, 135539, 136215, 137067, 137841, 138550, 139373, 140476, 141843, 143249, 144541, 145933, 147811, 150186, 152539, 154283, 155234, 155544, 155407, 154995, 154567, 154380, 154421, 154393, 154061, 153541, 153081, 152593, 151657, 150167, 148775, 148323, 148811, 149281, 148900, 147849, 146915, 146449, 146152, 145736, 145327, 145091, 144897, 144596, 144398, 144643, 145309, 146008, 146452, 146712, 146996, 147364, 147706, 147837, 147555, 146798, 145861, 145299, 145433, 146042, 146676, 147161, 147632, 148200, 148866, 149661, 150553, 151250, 151445]
55356A51445j69j32j47p38j548j710j081l48P7N10J080J235O09k51o53o67p10
55339A46802o74k50K52J93l96q58r19r18r98p76o4O42P64L35j56l32j62J64L85
55320A43034L83L26L74K96l01j253j756j239n5R17J154P68J73k79m21l45l04m17
55302A41055n15l59P7O27J139J457J318N15p34j775j980j305k68N90J131J460
55286A42433J512J074K70k75MR50J786J841J109J41m92p20r31j402j759j284J50
55269A44407J779K716K736K083R86k41r83q70l49j27j85K4M99N92R2l72l19r7
55251A52371j58l21k76k49n20p64n40j15kJ6N30J275J262K76o54o86k93l31o99
55232A50122o46KO59Q92Q09N41P0l62k64L90R85J010O24K22j13l90l77N1N00M90
$$ y = [151445, 151276, 151144, 150997, 150259, 148711, 147001, 145920, 145572, 145649, 146159, 147239, 148474, 149083, 148832, 148179, 147512, 146802, 146128, 145878, 146130, 146323, 145927, 145069, 144150, 143232, 142234, 141458, 141394, 142036, 142800, 143135, 142979, 142647, 142485, 142649, 143034, 143417, 143743, 144117, 144413, 144112, 142859, 141103, 139864, 139809, 140726, 141880, 142648, 142821, 142542, 142121, 141776, 141472, 141055, 140540, 140181, 140258, 140885, 142024, 143481, 144799, 145314, 144580, 142805, 140825, 139520, 139252, 139842, 140973, 142433, 143945, 145019, 145289, 145014, 145018, 145968, 147754, 149595, 150704, 150845, 150353, 149633, 148702, 147300, 145541, 144257, 144407, 146186, 148902, 151638, 153721, 154707, 154466, 153483, 152613, 152264, 152137, 151952, 151976, 152475, 153067, 153159, 152787, 152468, 152371, 152213, 151892, 151616, 151367, 150847, 150083, 149543, 149428, 149426, 149442, 149972, 151247, 152509, 152785, 152131, 151445, 151152, 150821, 150122, 149476, 149478, 150137, 151029, 151838, 152379, 152449, 152087, 151823, 152213, 153198, 154208, 154832, 155054, 154941, 154551, 154174, 154225, 154725, 155215]
55212A55215J36j08k65p63j546j850j153J11J103J487J517J459J286R04K98n07
55196A57324j460k370k887k660j613j39J053J516J439J221Q34L1q51r75j86N25
55180A50802K46n90p76M7J083J549J448J127P39M28M56P73Q74M88P3J88N76M51
55162A59982l43j006q11PO80R57J166J410J262N44r4P9P73R64K46o49r08o63n38
55143A63058o40n36r8K15ro17j053q69n1R29J386J033K75k41l33k95l40l33q0
55124A61401L90Q66J026N47m99j408j381m44N23P90N34L75N65Q56R99J017J009
55107A67166R81R24R29J111J415J535J170M13k66m94m00l06k12O9M36N00J82j03
55089A75050K1M12O46M91qo39j081j032n64j83k99p18q56m22K75O84N95L01K33
$$ y = [155215, 155351, 155243, 154978, 154215, 152669, 150819, 149666, 149777, 150880, 152367, 153884, 155343, 156629, 157533, 157831, 157324, 155864, 153494, 150607, 147947, 146334, 146195, 147248, 148764, 150203, 151424, 152258, 152289, 151438, 150463, 150277, 150802, 151048, 150458, 149682, 149729, 150812, 152361, 153809, 154936, 155675, 156103, 156559, 157332, 158206, 158694, 158767, 158955, 159531, 159982, 159639, 158633, 157822, 157829, 158509, 159466, 160632, 162042, 163304, 163848, 163754, 163833, 164606, 165570, 165816, 165167, 164259, 163596, 163058, 162418, 161882, 161784, 161999, 161990, 161373, 160320, 159451, 159400, 160329, 161715, 162748, 163023, 162782, 162449, 162154, 161814, 161481, 161401, 161791, 162657, 163683, 164230, 163731, 162323, 160942, 160498, 161021, 161811, 162345, 162720, 163285, 164141, 165140, 166157, 167166, 168147, 169071, 170000, 171111, 172526, 174061, 175231, 175644, 175378, 174884, 174484, 174178, 173966, 174035, 174471, 174971, 175153, 175050, 175071, 175483, 176129, 176620, 176612, 175973, 174892, 173860, 173296, 173113, 172814, 172096, 171240, 170818, 171093, 171777, 172372, 172673, 172906]
55070A72906M70O68N01P0k82m71p45j218j590j475q49n9N18P13N91L93L70O09
55052A71120R67J215J212R46N49K58K73M80N05O7o50j079p97LO08M76k25p56n71
55033A74601K08R76J166O41j35m20J3M38qr89j202j78Q94P71j24m25J45N85L07
55014A77264j92m19o71j233j662j457q82n67p24j052j102m33J049K623L121K285
54998A75948J230J063J500J398L52r17j534j285n13K24M62J90p1J37O43R64R65
54981A80756Q86Q22O55L82J60O9Q5K28M23M19J50l1J48L39K5o32r70p64m46l38
54961A82366k46K9L06M29O58J289K118K608K461J850J131N04m4n51q78p57j75
54944A93098M39N91K77mK08R09J687K065J856J379J260J779K541K932K837K654
$$ y = [172906, 173376, 174044, 174545, 174615, 174333, 173862, 173117, 171899, 170309, 168834, 167985, 167926, 168444, 169157, 169748, 170141, 170511, 171120, 172087, 173302, 174514, 175460, 176009, 176267, 176540, 177020, 177525, 177592, 176942, 175863, 175066, 175069, 175677, 176153, 175928, 175172, 174601, 174809, 175785, 176951, 177592, 177457, 177037, 177050, 177488, 177480, 176491, 175289, 175111, 176005, 176776, 176652, 176227, 176372, 176957, 177264, 177072, 176653, 175982, 174749, 173087, 171630, 170748, 170181, 169457, 168405, 167303, 166870, 167919, 170542, 173663, 175948, 177178, 178241, 179741, 181139, 181491, 180574, 179040, 177755, 177242, 177466, 177928, 178118, 178047, 178184, 178827, 179791, 180756, 181642, 182464, 183119, 183501, 183661, 183730, 183815, 184043, 184466, 184885, 185035, 185004, 185152, 185491, 185516, 184884, 183914, 183150, 182704, 182366, 182120, 182149, 182455, 182884, 183542, 184831, 186949, 189557, 192018, 193868, 194999, 195503, 195459, 194908, 194030, 193273, 193098, 193537, 194128, 194405, 194401, 194609, 195518, 197205, 199270, 201126, 202505, 203765, 205544, 208085, 211017, 213854, 216508]
54928B16508K668K837L146L672M207M219L551K838K828L421L791L449K770K293
54914B62198J900J128J00m49l34m64j755l749n039n022m500m431m736m759m266
54899B25822l477k563j693j270j447j633j210m83k37l43K59J957L639L995L134
54884B24450K300K283K722K894K674K453K420K297J815J224J083J629K511L277
54870B56032L736L749K971J159j340l707n246n710n320m689m464m694m731m142
54856B23604l416l275l547l440k776k200k107k068j609r00l68j87l68r06j459
54841A94978j460q59l42m55r03j074p51p0P86J397J172J68o50n70j42k81q36q92
54823A89216l18O7j22k35K55Q79R26M82J60K33N24R03J325J528J162L04m61n86
$$ y = [216508, 219176, 222013, 225159, 228831, 233038, 237257, 240808, 243646, 246474, 249895, 253686, 257135, 259905, 262198, 264098, 265226, 265326, 264877, 264543, 264079, 262324, 258575, 253536, 248514, 244014, 239583, 234847, 230088, 225822, 222345, 219782, 218089, 216819, 215372, 213739, 212529, 212046, 211809, 211466, 211725, 213682, 217321, 221316, 224450, 226750, 229033, 231755, 234649, 237323, 239776, 242196, 244493, 246308, 247532, 248615, 250244, 252755, 256032, 259768, 263517, 266488, 267647, 266307, 262600, 257354, 251644, 246324, 241635, 237171, 232477, 227746, 223604, 220188, 216913, 213366, 209926, 207150, 204950, 202843, 200775, 199166, 198266, 197898, 197711, 197343, 196437, 194978, 193518, 192659, 192317, 191862, 190959, 189885, 189134, 189064, 189850, 191247, 192419, 192587, 191937, 191367, 191225, 190944, 190108, 189216, 188898, 188965, 188843, 188608, 188863, 189742, 190668, 191150, 191310, 191543, 192067, 192970, 194295, 195823, 196985, 197289, 196828, 196242]
54805A96242k6P64J193J017N38K95L79L22k70j096j479j149m73R2M54P37R38Q87
54787A99365N08K6j03M65J536K445K616K159J716J767K255K910L594M155M290
54772B29704L866L283L137L521L946M102M257M760N273M980L576J823Q69J020
54758B78117J401R49l77j655k217k349k642l096l415l875n044o574p107n860l693
54743B32563k062j402j180j065j160j202n86N77J259Q40K7m7P55J657K121K360
54727B33455K747L275L703L904L873L592L024K228J457J106J361J772J466N6j781
54712B65238k977l233l153l309l575l543l167k731k465k455k725l072l062k553
54698B23218k086k272k837k838j939r58q31j435j879j625q22J63R83J237P81J21
$$ y = [196242, 196216, 196980, 198173, 199190, 199728, 200023, 200402, 200724, 200454, 199358, 197879, 196730, 196257, 196349, 196803, 197540, 198478, 199365, 199873, 199899, 199796, 200261, 201797, 204242, 206858, 209017, 210733, 212500, 214755, 217665, 221259, 225414, 229704, 233570, 236853, 239990, 243511, 247457, 251559, 255816, 260576, 265849, 270829, 274405, 276228, 277097, 278117, 279518, 280467, 280090, 278435, 276218, 273869, 271227, 268131, 264716, 260841, 255797, 249223, 242116, 236256, 232563, 230501, 229099, 227919, 226854, 225694, 224492, 223906, 224483, 225742, 226582, 226609, 226562, 227317, 228974, 231095, 233455, 236202, 239477, 243180, 247084, 250957, 254549, 257573, 259801, 261258, 262364, 263725, 265497, 266963, 267019, 265238, 262261, 259028, 255875, 252566, 248991, 245448, 242281, 239550, 237085, 234630, 231905, 228833, 225771, 223218, 221132, 218860, 216023, 213185, 211246, 210288, 209457, 208022, 206143, 204518, 203696, 203859, 204842, 206079, 206860, 206981]
54682B06981j9L67O10L66m7l94r30j680k028j536o42K0M59R17J066N18k16j81
54664B03631O18J149Q04J42j15p2k58o65p70l03L83P26N50K01Q6J04k00p87q77
54645B04347k3R96J020Q4o40m49J27K69j63p80j191j034k00P54R96M80K2K2j15
54626B04522q44j517j290m06J81J47j7O2K12J55r6l82n31m43k27j41k40l06k78
54607A98561l53m17M4J069J809J541O97K61N30J067J474J561J052m6j022j163
54591B06665p26m87n54m32j75l72r23q63J98J260J139n5j148j184j24J335K242
54574B05796J981P98l82q69p58m80k51j32l22r20j543j612j047m14k62l91o5R26
54556B00053J714J328J09n06K10J359J729J271O23j38j236k149k019j043l21k44
$$ y = [206981, 206962, 207329, 207939, 208305, 208258, 207864, 206934, 205254, 203226, 201690, 201048, 201068, 201527, 202444, 203510, 204028, 203812, 203631, 204249, 205398, 206202, 206344, 206229, 206157, 205899, 205234, 204464, 204161, 204544, 205270, 205820, 206021, 206107, 206211, 206011, 205224, 204347, 204324, 205320, 206340, 206424, 205784, 205335, 205462, 205731, 205568, 204788, 203597, 202563, 202363, 203117, 204113, 204593, 204615, 204637, 204522, 203678, 202161, 200871, 200465, 200646, 200793, 200776, 200838, 201050, 201205, 201109, 200727, 200196, 199753, 199526, 199385, 199145, 198839, 198561, 198208, 197791, 197835, 198904, 200713, 202254, 202951, 203212, 203742, 204809, 206283, 207844, 208896, 208850, 207828, 206665, 205939, 205452, 204898, 204466, 204291, 203919, 202996, 202133, 202331, 203591, 204730, 204675, 203527, 202343, 202219, 203554, 205796, 207777, 208575, 208193, 207324, 206566, 206086, 205835, 205703, 205381, 204461, 202918, 201306, 200259, 199845, 199583, 199192, 199127, 200053, 201767, 203095, 203204, 202698, 202908, 204267, 205996, 207267, 207890, 207752, 206516, 204367, 202348, 201305, 200984, 200740]
54540B00740n5P33J545J702J296O82%m28m0J043J827J659J020N82K64j23j21O25
54522B12951J424J304L34o17j088j221j044m15L99Q65Q79O98L67k55r77j436j611
54505B10557j673j465p89J7M44O10R50J262R12K0m77j28M74O72N63M63K74j38
54487B12548m64l98j90k75o07p75n40J6P10J225J091J26j140j789j348j51J086
54470B09125J869K169K185K005J527P46m2m97n75n14m47l30j39jm5l10o93q98
54452B15135n42L98J296J397O10m35j120j307j179r29o72m02M2P03J311J570J541
54435B17417J367Q43k25j302j458n51M64P13L60J63M93J119J543J291K48r89j526
54418B19970j171o33m27j46P38J812K149J506N01l17q99j264j204n80L81J229
$$ y = [200740, 200685, 201418, 202963, 204665, 205961, 206643, 206643, 206215, 206175, 207218, 209045, 210704, 211724, 212306, 212570, 212447, 212326, 212951, 214375, 215679, 216013, 215396, 214308, 213087, 212043, 211628, 212027, 212892, 213771, 214469, 214836, 214581, 213604, 212168, 210557, 208884, 207419, 206630, 206647, 207091, 207701, 208651, 209913, 210825, 210845, 210368, 210240, 210714, 211386, 211949, 212412, 212686, 212548, 212084, 211686, 211496, 211221, 210614, 209839, 209299, 209315, 210025, 211250, 212341, 212467, 211327, 209538, 208190, 208039, 209125, 210994, 213163, 215348, 217353, 218880, 219626, 219584, 219087, 218512, 217998, 217551, 217221, 217082, 217081, 217036, 216726, 216033, 215135, 214593, 214991, 216287, 217684, 218294, 217859, 216739, 215432, 214253, 213324, 212652, 212250, 212292, 212995, 214306, 215876, 217417, 218784, 219627, 219402, 218100, 216642, 216091, 216555, 217268, 217628, 217791, 218284, 219403, 220946, 222237, 222485, 221496, 219970, 218799, 218166, 217739, 217593, 218331, 220143, 222292, 223798, 224299, 223982, 223083, 221819, 220615, 220035, 220416, 221645]
54402B21645J564J288P49N36Q47J211J097O16K68K27K38P1l08q45j226q81L39
54385B27436J574J773J031M38N72Q61P00L61L33M23J50l10l11L09R81J145P69
54368B38235J46m74r75j301j426j278p44Q7P83R11N71L61P08J345J570J019J09
54351B39647l91k31N8j30o03o03J22Q41O87k92j233j430r47l36k7m5j04P9M47
54332B35509O19L27k61p07p38l91J33N69O77M16N9o3R6L09L61K27nk07k82k54
54312B36394k17p6M33J231J673J231K54l75l09N6M07Q88J458J556R53L98P25J618
54294B48298K026J692J422J720K025J721J226J349J972K202J741J346J724K599
54280B73063L192L173K726K051J306Q51R61J190O73p08j900j864r50n59j452k875
$$ y = [221645, 223209, 224497, 225246, 225782, 226629, 227840, 228937, 229553, 229821, 230048, 230286, 230357, 230049, 229204, 227978, 227097, 227436, 229010, 230783, 231814, 232252, 232824, 233685, 234385, 234746, 235079, 235502, 235652, 235342, 235031, 235340, 236321, 237466, 238235, 238381, 237907, 236932, 235631, 234205, 232927, 232183, 232270, 233053, 233964, 234535, 234896, 235604, 236949, 238519, 239538, 239647, 239256, 239025, 239083, 238953, 238350, 237747, 237869, 238710, 239397, 239105, 237872, 236442, 235495, 235159, 235132, 235087, 234983, 235062, 235509, 236128, 236455, 236194, 235487, 234749, 234358, 234491, 235060, 235737, 236153, 236212, 236149, 236245, 236554, 236915, 237142, 237137, 236930, 236648, 236394, 236177, 236101, 236534, 237765, 239438, 240669, 240923, 240548, 240239, 240295, 240702, 241590, 243048, 244604, 245557, 245955, 246680, 248298, 250324, 252016, 253438, 255158, 257183, 258904, 260130, 261479, 263451, 265653, 267394, 268740, 270464, 273063, 276255, 279428, 282154, 284205, 285511, 286362, 287323, 288513, 289186, 288478, 286578, 284714, 283764, 283205, 281753, 278878]
54264B78878l580l299k819k797k962k688j924j259j146j446j759j958k148k252
54250B46841j950j049K16J319J840J677J013J76m99p66o01k13P7J30P2Lk67q93
54232B47126j446j156N9J206J341P74N04O33K45r84j952j547k55M12j78j198j551
54215B42033r75J22J188J758J573Q68J90k24n89r95j052m18N95J312J357Q42M1
54198B47626p65j232j074l76L75O48K35o65j605k156k152j744j233q07l86K69
54182B34958J218K062K231J612P63L00K35K28J79J99J55j84n35k93M87R24M90
54165B45029k39m26j45p4l91o41o26p44j262j782j677p94L70J144J220Q74O27
54148B40463O85Q06P86P62Q10O21J4m98j99Q07J583J448O85J13K79J070J802J674
$$ y = [278878, 275298, 271999, 269180, 266383, 263421, 260733, 258809, 257550, 256404, 254958, 253199, 251241, 249093, 246841, 244891, 243842, 244058, 245377, 247217, 248894, 249907, 250083, 249584, 248818, 248217, 248004, 248081, 248211, 248283, 248286, 248019, 247126, 245680, 244524, 244583, 245789, 247130, 247904, 248408, 249041, 249286, 248302, 246350, 244803, 244548, 244960, 244782, 243584, 242033, 241058, 241180, 242368, 244126, 245699, 246567, 246757, 246533, 245944, 244949, 243897, 243479, 244074, 245386, 246743, 247585, 247626, 246861, 245629, 244555, 244179, 244554, 245202, 245437, 244772, 243167, 241011, 238859, 237115, 235882, 235075, 234689, 234958, 236176, 238238, 240469, 242081, 242844, 243144, 243379, 243607, 243786, 243985, 244140, 243956, 243421, 243128, 243615, 244539, 245029, 244790, 244364, 244219, 244145, 243754, 243113, 242487, 241743, 240481, 238699, 237022, 236228, 236598, 237742, 238962, 239836, 240463, 241148, 241954, 242740, 243502, 244312, 244933, 244947, 244449, 244250, 245057, 246640, 248088, 248773, 248886, 249165, 250235, 252037, 253711]
54130B53711O16m09l80N46J271J264J057J100R47J62o51n24M82J328J310P06J25
54113B62661j66j40K11P42J134J193J009P12K72l05p89r03n88n2L70L75j10p95
54095B64831j192j076o55k73o2O4J41M2l07o97p50l70J0j47p46j036n05M51J030
54076B58753J047R99J209J399J286J096J162J405J626J903K265K222J361K06k81
54061B77658j15l01j147j474k91J531K237J488N45L37N31P49J380K592L543L491
54045B92754K989L042L572L746L460L441L938M385M508M753N327N674N400N024
54031C52013N285O106O834P082O900O401N695M979M335L559K570J799J787K402
54017D17747K785K178P25o41j116r63j230k390l589l751l136k974l612m113l942
$$ y = [253711, 254327, 253918, 253538, 254084, 255355, 256619, 257676, 258776, 259723, 259885, 259234, 258710, 259192, 260520, 261830, 262536, 262661, 262495, 262355, 262566, 263308, 264442, 265635, 266644, 267356, 267628, 267323, 266534, 265631, 265043, 264991, 265361, 265736, 265626, 264831, 263639, 262563, 261908, 261635, 261573, 261637, 261778, 261820, 261513, 260816, 260066, 259696, 259706, 259559, 258813, 257777, 257272, 257723, 258753, 259800, 260799, 262008, 263407, 264693, 265789, 266951, 268356, 269982, 271885, 274150, 276372, 277733, 277939, 277658, 277543, 277242, 276095, 274621, 274330, 275861, 278098, 279586, 280131, 280468, 280999, 281748, 283128, 285720, 289263, 292754, 295743, 298785, 302357, 306103, 309563, 313004, 316942, 321327, 325835, 330588, 335915, 341589, 346989, 352013, 357298, 363404, 370238, 377320, 384220, 390621, 396316, 401295, 405630, 409189, 411759, 413558, 415345, 417747, 420532, 422710, 423435, 422794, 421678, 420715, 419485, 417095, 413506, 409755, 406619, 403645, 400033, 395920, 391978]
54002C91978l930m869o063o263n445m662m499m628m635m415l821k857k106k164
53988C31621k650k628j988j530j570j470p68P7M79M40J37n22j426k016j956j553
53972C12677j087m04M35P59K10n12n24J14P59J191J495J422P96K86P73K021K915
53955C23326L056L223M043N178O158P170Q391R277R298R003R509J1020J2542J3234
53941D34428J3396J3872J4829J5610J5669J5213J4804J4620J4420J4094J3834
53930E94789J3744J3649J3421J3108J2466J0737P354K735k057o258r586j1757
53918F52345j2417j1713j0340q885p538o448n755n061l648j551J89Q68J093J761
53904E82900K547K374J087l44j297k132l129l768l659l528m397o116p453p595
$$ y = [391978, 388048, 383179, 377116, 370853, 365408, 360746, 356247, 351619, 346984, 342569, 338748, 335891, 333785, 331621, 328971, 326343, 324355, 322825, 321255, 319785, 319017, 319094, 319573, 320013, 320150, 319628, 318202, 316186, 314230, 312677, 311590, 311186, 311621, 312380, 312590, 312078, 311554, 311668, 312427, 313618, 315113, 316535, 317331, 317617, 318390, 320411, 323326, 326382, 329605, 333648, 338826, 344984, 352154, 360545, 369822, 379120, 388123, 397632, 408652, 421194, 434428, 447824, 461696, 476525, 492135, 507804, 523017, 537821, 552441, 566861, 580955, 594789, 608533, 622182, 635603, 648711, 661177, 671914, 679268, 682003, 679946, 673688, 664102, 652345, 639928, 628215, 617875, 608990, 601452, 595004, 589249, 584188, 580540, 578989, 579178, 580046, 581139, 582900, 585447, 587821, 588908, 588564, 587267, 585135, 582006, 578238, 574579, 571051, 566654, 560538, 553085, 545490]
53890E45490p011o715p105p749q077q038q093q610r365r778r565q907p975o704
53876D31798n326m607n040o014o342n634m613m037l850l623l368l431l813m090
53862C68010l971l669l594l845m110m076l775l482l267k834j942q32o5L4m34j109
53846C27039j565j426p38j16j77p20r26m35K36N31N80P98J111J142Q51N39L32
53829C27056P7k85n56n42k10L13P46P30J89m67p71o56k92L01J088J686J712J397
53811C31516J407J990K772L397L925M409M564M172L582L476M183N334O152O126
53797C87005N573N370N905O450O010M656L456L084L162L143L103L231L171K553
53783D45872J679J125P97J42q63j600j787j941k589l545m268m558m553m262l560
$$ y = [545490, 538479, 531764, 524659, 516910, 508833, 500795, 492702, 484092, 474727, 464949, 455384, 446477, 438502, 431798, 426472, 421865, 416825, 410811, 404469, 398835, 394222, 390185, 386335, 382712, 379344, 375913, 372100, 368010, 364039, 360370, 356776, 352931, 348821, 344745, 340970, 337488, 334221, 331387, 329445, 328613, 328548, 328582, 328148, 327039, 325474, 324048, 323310, 323194, 323017, 322297, 321371, 320936, 321172, 321703, 322283, 323081, 324192, 325334, 326185, 326724, 327056, 327133, 326848, 326292, 325750, 325540, 325853, 326599, 327329, 327518, 327051, 326280, 325624, 325332, 325633, 326721, 328407, 330119, 331516, 332923, 334913, 337685, 341082, 345007, 349416, 353980, 358152, 361734, 365210, 369393, 374727, 380879, 387005, 392578, 397948, 403853, 410303, 416313, 420969, 424425, 427509, 430671, 433814, 436917, 440148, 443319, 445872, 447551, 448676, 449473, 449615, 448752, 447152, 445365, 443424, 440835, 437290, 433022, 428464, 423911, 419649, 416089]
53768D16089k681k202k362k593k107q94K11O16Q06J731L558N496O911Q045R297
53753D39921J0271J0152Q933P667P340P855Q457Q818R304J0166J0920J0834R909
53740E60547Q934Q491Q095O586L245j647p163j2374j6619j9582k1189k1402k0198
53727D75724j7913j5417j3525j2181j0670q643o535m917l863l144k555j851q08
53714C73702L05Q00N00J80N40J213J324P93L88O33J299J939K284K155J566J072
53698C90693J376K431L366L510L055K520K079J713J602J918K509K998L115K701
53684D25586J722N11k92l32J16O03J077J647K044J816J049M26M50R02J245J337
53668D39907J450J698J771J370P13L50N98J290K113K785K936K226R47J61O71K043
$$ y = [416089, 413408, 411206, 408844, 406251, 404144, 403250, 403461, 404077, 404883, 406614, 410172, 415668, 422579, 430624, 439921, 450192, 460344, 469277, 476944, 484284, 492139, 500596, 509414, 518718, 528884, 539804, 550638, 560547, 569481, 577972, 586067, 592653, 595898, 594251, 587088, 574714, 558095, 538513, 517324, 495922, 475724, 457811, 442394, 428869, 416688, 406018, 397375, 390840, 385923, 382060, 378916, 376361, 374510, 373702, 374007, 374807, 375307, 375487, 376027, 377240, 378564, 379357, 379745, 380378, 381677, 383616, 385900, 388055, 389621, 390693, 392069, 394500, 397866, 401376, 404431, 406951, 409030, 410743, 412345, 414263, 416772, 419770, 422885, 425586, 427308, 427819, 427527, 427195, 427311, 427914, 428991, 430638, 432682, 434498, 435547, 435973, 436423, 437325, 438570, 439907, 441357, 443055, 444826, 446196, 446909, 447259, 447857, 449147, 451260, 454045, 456981, 459207, 460154, 460315, 460986, 463029]
53652D63029L070L133K571J818Q72k44j169j696k102k625l102l414l806m326m494
53637D47515m038l515l497l548k866j691j114j386j493o90L77O41J30k12K09J175
53621D25997K209L049L580L763L724L588L400L332L720M563N223N105M451L965
53607D79669L774L407K743K307K437K830L159L494L729L252J855M86K64J060J796
53592E16262J998K105K210J552k35k153k831k146j208r51j298j598j406p77j71
53577E09353j93j098k412l259l179k549k150k335k672k477j699j145j546k506
53563D80133k832k033r40n12n62k05P62J610J728J276P23K88M3N8K10K25R0J29
53545D80191N13J007J475K223L503M959N869O015N918O174O695O843O335N846
$$ y = [463029, 466099, 469232, 471803, 473621, 474493, 474249, 473080, 471384, 469282, 466657, 463555, 460141, 456335, 452009, 447515, 443477, 439962, 436465, 432917, 430051, 428360, 427246, 425860, 424367, 423677, 424054, 424695, 424825, 424613, 424822, 425997, 428206, 431255, 434835, 438598, 442322, 445910, 449310, 452642, 456362, 460925, 466148, 471253, 475704, 479669, 483443, 486850, 489593, 491900, 494337, 497167, 500326, 503820, 507549, 510801, 512656, 513142, 513406, 514466, 516262, 518260, 520365, 522575, 524127, 523892, 521739, 518908, 516762, 515554, 514603, 513305, 511707, 510301, 509524, 509353, 509160, 508062, 505650, 502391, 499212, 496663, 494513, 492178, 489506, 487029, 485330, 484185, 482639, 480133, 477301, 475268, 474328, 473816, 473254, 473049, 473811, 475421, 477149, 478425, 479148, 479436, 479479, 479537, 479747, 479972, 480062, 480191, 480704, 481711, 483186, 485409, 488912, 493871, 499740, 505755, 511673, 517847, 524542, 531385, 537720, 543566]
53531E43566O400Q154J0137J1426J2077J2568J2850J2709J2695J3604J5083J5877
53519F87146J5735J5961J7485J9373K0237K0265K0726K1896K2743K2593K2041
53508I06201K1955K2485K3329K4295K5186K5715K5854K5989K6514K7488K8694
53497A183705K9611K9456K7895K5828K4782K5225K6061K6103K5452K4966K4951
53486A474035K4989K4745K4276K3664K2869K1922K0904J9782J8579J7533J6743
53475A710041J5818J4269J2163R983P881N546K828J7k605n146p792j0405j2648
53462A739950j4450j6114j7956j9889k1413k2074k2021k1890k2107k2446k2496
53451A517094k2236k1912k1576k1204k1061k1335k1470k0536j8509j6585j5836
$$ y = [543566, 549966, 558120, 568257, 579683, 591760, 604328, 617178, 629887, 642582, 656186, 671269, 687146, 702881, 718842, 736327, 755700, 775937, 796202, 816928, 838824, 861567, 884160, 906201, 928156, 950641, 973970, 998265, 1023451, 1049166, 1075020, 1101009, 1127523, 1155011, 1183705, 1213316, 1242772, 1270667, 1296495, 1321277, 1346502, 1372563, 1398666, 1424118, 1449084, 1474035, 1499024, 1523769, 1548045, 1571709, 1594578, 1616500, 1637404, 1657186, 1675765, 1693298, 1710041, 1725859, 1740128, 1752291, 1762274, 1770155, 1775701, 1778529, 1778546, 1775941, 1770795, 1763003, 1752598, 1739950, 1725500, 1709386, 1691430, 1671541, 1650128, 1628054, 1606033, 1584143, 1562036, 1539590, 1517094, 1494858, 1472946, 1451370, 1430166, 1409105, 1387770, 1366300, 1345764, 1327255, 1310670, 1294834]
53440A294834j5988j5924j5089j3836j2667j1549j0063p909n281k928j634j355
53428A180611j036L14K523M611O112P519R392J1541J3384J4695J5793J7157J9063
53415A301679K1376K3598K5329K6762K8469L0552L2439L3814L5265L7556M0467
53404A637306M2951M4394M5188M6120M7547M9356N1196N2593N3218N3362N3785
53393B177016N4829N5990N6738N7337N8308N9271N9089N7333N4995N3318N2389
53382B796613N1300M9366M6666M3494L9943L6094L2147K8173K4049J9801J5616
53371C183262J1383O638J261m121q848j3100j7510k2108k6284k9754l2990l6550
53359C011279m0412m4258m7914n1246n3992n5992n7362n8218n8516n8447n8490
$$ y = [1294834, 1278846, 1262922, 1247833, 1233997, 1221330, 1209781, 1199718, 1191809, 1186528, 1183600, 1181966, 1180611, 1179575, 1179889, 1182412, 1187023, 1193135, 1200654, 1210046, 1221587, 1234971, 1249666, 1265459, 1282616, 1301679, 1323055, 1346653, 1371982, 1398744, 1427213, 1457765, 1490204, 1524018, 1559283, 1596839, 1637306, 1680257, 1724651, 1769839, 1815959, 1863506, 1912862, 1964058, 2016651, 2069869, 2123231, 2177016, 2231845, 2287835, 2344573, 2401910, 2460218, 2519489, 2578578, 2635911, 2690906, 2744224, 2796613, 2847913, 2897279, 2943945, 2987439, 3027382, 3063476, 3095623, 3123796, 3147845, 3167646, 3183262, 3194645, 3201283, 3202544, 3198423, 3189575, 3176475, 3158965, 3136857, 3110573, 3080819, 3047829, 3011279, 2970867, 2926609, 2878695, 2827449, 2773457, 2717465, 2660103, 2601885, 2543369, 2484922, 2426432]
53348B426432n8701n8314n6631n4031n1524m9489m7564m5699m4401m3771m3122
53337A873185m1981m0833m0238l9751l8462l6280l3947l1863k9721k7354k5189
53326A487566k3521k1986k0196j8454j7235j6322j5054j3412j2140j1646j1346
53315A306254j0358q527o342m215k256o28M56J193K275M238O876R444J1338J2549
53301A322297J3506J4620J5937J7208J8272J9306K0605K2167K3692K4875K5586
53290A538071K5861K5925K6098K6398K6371K5575K4234K2941K1822K0524J9009
53279A802829J7644J6308J4180J0890P326M588K606M76k182m947p540j0168j2947
53266A839063j5592j7909j9953k1618k2606k3028k3557k4743k6495k8348k9968
$$ y = [2426432, 2367731, 2309417, 2252786, 2198755, 2147231, 2097742, 2050178, 2004479, 1960078, 1916307, 1873185, 1831204, 1790371, 1750133, 1710382, 1671920, 1635640, 1601693, 1569830, 1540109, 1512755, 1487566, 1464045, 1442059, 1421863, 1403409, 1386174, 1369852, 1354798, 1341386, 1329246, 1317600, 1306254, 1295896, 1287369, 1281027, 1276812, 1274556, 1273928, 1274384, 1275577, 1277852, 1282090, 1288966, 1298410, 1309748, 1322297, 1335803, 1350423, 1366360, 1383568, 1401840, 1421146, 1441751, 1463918, 1487610, 1512485, 1538071, 1563932, 1589857, 1615955, 1642353, 1668724, 1694299, 1718533, 1741474, 1763296, 1783820, 1802829, 1820473, 1836781, 1850961, 1861851, 1869177, 1873765, 1876371, 1876847, 1874665, 1869718, 1862178, 1852010, 1839063, 1823471, 1805562, 1785609, 1763991, 1741385, 1718357, 1694800, 1670057, 1643562, 1615214, 1585246]
53255A585246l1243l2187l2881l3305l3256l2693l2006l1582l1304l0897l0576
53244A233316l0630l0560k9522k7712k6310k5832k5438k4347k3001k2278k2280
53233I45406k2581k2954k3066k2190k0135j7983j6912j6647j6006j4715j3596
53222G38621j3106j2800j2349j2058j2039j1806j1140j0666j1031j1992j2727
53211F06907j2718j1978j0778r537q692q346q191p951p677p466p197o772o430
53198D93174o462o765o855o329n267m266l967m392m795m474l659l223l533l999
53184D25188l961l519l158k926k435j585r14j048j958k883l051k423j643j237
53170C92447j102r00o31m66k93J05N27N34J65n8J13L85N22O38P23N19J18J94J057
$$ y = [1585246, 1554003, 1521816, 1488935, 1455630, 1422374, 1389681, 1357675, 1326093, 1294789, 1263892, 1233316, 1202686, 1172126, 1142604, 1114892, 1088582, 1062750, 1037312, 1012965, 989964, 967686, 945406, 922825, 899871, 876805, 854615, 834480, 816497, 799585, 782938, 766932, 752217, 738621, 725515, 712715, 700366, 688308, 676269, 664463, 653323, 642657, 631626, 619634, 606907, 594189, 582211, 571433, 561896, 553204, 544858, 536667, 528716, 521039, 513573, 506376, 499604, 493174, 486712, 479947, 473092, 466763, 461496, 457230, 453263, 448871, 444076, 439602, 435943, 432720, 429187, 425188, 421227, 417708, 414550, 411624, 409189, 407604, 406690, 405642, 403684, 400801, 397750, 395327, 393684, 392447, 391345, 390445, 389814, 389348, 389055, 389160, 389687, 390221, 390386, 390328, 390441, 390826, 391348, 391986, 392709, 393228, 393346, 393540, 394597]
53151C94597J958J894Q84j11l82o7M05Q78J406J980K478K680K320J388L77l6L02
53134D12951Q88J201J251J368J593J594J123L50l31o48n29o6L96K76o99j947k480
53117D16291k036j442j514k004k137j813j585j641j582j289j254j709k086j789
53103C92410j039n24n51r62j519j955j924j452j178j627k372k453j625o60k77
53088C72292k92n6N24Q22L13o19r18k3J347J800Q20o30j258r27o22r89j501j210
53070C68873p1R30R26J71m04m06l90q70j431j299n32j4j91m84k06M69Q30N56j8
53051C66439l59j29O45J486J810J577J314J318J272R36O89R14J342J592J893K484
53035C85223K710J717Jq75k54P51Q76K82l7K01M25L48L75Q30J316J194M12m29
$$ y = [394597, 396555, 398449, 399333, 399222, 398840, 398773, 399178, 400056, 401462, 403442, 405920, 408600, 410920, 412308, 412685, 412649, 412951, 413839, 415040, 416291, 417659, 419252, 420846, 421969, 422319, 421988, 421340, 420811, 420745, 421141, 421417, 420718, 418771, 416291, 414255, 412813, 411299, 409295, 407158, 405345, 403760, 402119, 400537, 399248, 397994, 396285, 394199, 392410, 391371, 390847, 390296, 389334, 387815, 385860, 383936, 382484, 381306, 379679, 377307, 374854, 373229, 372569, 372292, 372000, 371944, 372468, 373290, 373603, 372984, 372066, 372043, 373390, 375190, 376010, 375380, 374122, 373195, 372573, 371584, 370083, 368873, 368802, 369732, 370658, 370829, 370425, 370019, 369629, 368759, 367328, 366029, 365497, 365483, 365292, 364808, 364602, 365071, 365901, 366457, 366439, 366080, 365951, 366596, 368082, 369892, 371469, 372783, 374101, 375373, 376309, 376998, 377912, 379254, 380846, 382739, 385223, 387933, 389650, 389651, 388776, 388522, 389273, 390149, 390431, 390394, 390595, 391020, 391368, 391743, 392573, 393889, 395083, 395495, 395066]
53017C95066p94q12r77j352j368n71O14J283J123P41P36Q71M34o67j584j468n40
53000C90735P9k77r67r28k09N8o83j495j249j90N28M97L65N60O51K38l16m47j18
52981C86832L42P76J164J406J494J612J856K014J860J397P24k6m54o2J056K051
52965D04042K265K001J933K096J948J305O11K90K69L00L33L66K42j58o18p65o03
52948D15857o48j391k640l604l683k989k040j160m79j97m73j017j314j306j458
52933C91458k016k563k571k023j280n83N2O52J182J487J233K15j137j867j425
52918C80814k71O72R40P10L13j20n65r09r36m90K00N39J61m51m34L77J251J572
52900C83373J432J062L57o54j429j576j342j054n41K16N26j30j065j166m16K53
$$ y = [395066, 394272, 393460, 392483, 391131, 389763, 389192, 389806, 391089, 392212, 392953, 393689, 394560, 394994, 394327, 392743, 391275, 390735, 390814, 390537, 389570, 388642, 388433, 388491, 387808, 386313, 385064, 384874, 385402, 385899, 386264, 386824, 387475, 387713, 387397, 386950, 386832, 387174, 387950, 389114, 390520, 392014, 393626, 395482, 397496, 399356, 400753, 401477, 401451, 400997, 400935, 401991, 404042, 406307, 408308, 410241, 412337, 414285, 415590, 416201, 416491, 416760, 417060, 417393, 417759, 418001, 417843, 417225, 416460, 415857, 415209, 413818, 411178, 407574, 403891, 400902, 398862, 397702, 397223, 397026, 396553, 395536, 394222, 392916, 391458, 389442, 386879, 384308, 382285, 381005, 380422, 380474, 381126, 382308, 383795, 385028, 385243, 384106, 382239, 380814, 380543, 381215, 382155, 382865, 383178, 383058, 382493, 381584, 380648, 380158, 380358, 380897, 381058, 380607, 380173, 380550, 381801, 383373, 384805, 385867, 386224, 385570, 384141, 382565, 381223, 380169, 379628, 379844, 380370, 380240, 379175, 378009, 377593, 377846]
52884C77846M06L99L12k34j105j465r96l88k60m09m73n04m39J85J327K008J492
52867C77702L64k49m5N59J260J762J394n1j386j108N40J666J153l6l93J43M91
52850C83766N1o89j036q13l57j32m21j106j754k062k126k101j885j403r76j047
52834C65909j555j960j874j356o33O9M32J40o26j090o15N60J554J732J205M92
52818C62384Mj07J45N85Q18N13j87o27k62O92J432J439J052R26J153J253R60O39
52800C72812P01R06O52k25j278k076k611l019l178k866k198j656j623j898j864
52785C50579j162j76L49K06q3jL04M24L74M55O09N41L53M43P23O06J4l37k4L79
52765C54576K09k01j09L82M84L7k14K47J003J371J227Q92O03M10L46M43O81J012
$$ y = [377846, 378252, 378651, 378963, 378729, 377624, 376159, 375163, 374775, 374515, 374106, 373633, 373129, 372690, 372875, 374202, 376210, 377702, 378066, 377817, 377772, 378331, 379591, 381353, 382747, 382696, 381310, 380202, 380742, 382408, 383561, 383525, 383132, 383275, 383766, 383817, 383128, 382092, 381279, 380922, 380790, 380369, 379263, 377509, 375447, 373321, 371220, 369335, 367932, 366956, 365909, 364354, 362394, 360520, 359164, 358531, 358600, 359032, 359172, 358546, 357456, 356841, 357401, 358955, 360687, 361892, 362384, 362388, 362281, 362426, 363011, 363829, 364342, 364155, 363528, 363266, 363958, 365390, 366829, 367881, 368807, 369960, 371213, 372173, 372812, 373513, 374419, 375071, 374846, 373568, 371492, 368881, 365862, 362684, 359818, 357620, 355964, 354341, 352443, 350579, 349417, 349241, 349590, 349796, 349713, 349712, 350016, 350440, 350814, 351269, 351878, 352419, 352772, 353215, 353938, 354544, 354558, 354221, 354197, 354576, 354785, 354584, 354475, 354857, 355341, 355378, 355164, 355411, 356414, 357785, 359012, 359904, 360507, 360917, 361263, 361706, 362387, 363399]
52747C63399J235R70P5r07j122l51Q05J629J841J441N76k82n68l37k81p24j085
52730C66314p33M1M74L63J56J28R1j60m69n26j45N87J244J289O89P3lK45K14j74
52710C69698m21k81n6j13m76r61j280r72K25J769K563K058Q18k44q19j099j130
52693C69279p35pO05P83O85P08R96J302J343J186J172J387J407Q11j51o71k43
52676C79857Q44J904K468K461K121J849J876J908J397L46m56l54L19O82M55J58
52660C97835K43M54L21r0k51R4N22M18k61q46p63k71j33m84m86M84J701J821P21
52641D01029j93J53R83P87m68j289q55j96n50j397j239N4R82O35m4J39P59O02
52623C99892k85o06K54J474K149K283K116J363o7j394j755j317r35r66j064q98
$$ y = [363399, 364634, 365604, 365679, 364772, 363650, 363299, 364104, 365733, 367574, 369015, 369591, 369309, 368741, 368404, 368123, 367399, 366314, 365581, 365622, 366096, 366459, 366615, 366743, 366834, 366674, 366205, 365679, 365534, 366121, 367365, 368654, 369343, 369416, 369413, 369658, 369872, 369698, 369277, 368996, 368940, 368827, 368351, 367390, 366110, 365138, 365363, 367132, 369695, 371753, 372571, 372327, 371508, 370409, 369279, 368544, 368537, 369142, 369925, 370610, 371318, 372314, 373616, 374959, 376145, 377317, 378704, 380111, 380922, 380771, 380100, 379857, 380701, 382605, 385073, 387534, 389655, 391504, 393380, 395288, 396685, 397031, 396575, 396221, 396540, 397222, 397677, 397835, 398078, 398532, 398853, 398763, 398512, 398606, 399128, 399546, 399285, 398439, 397676, 397405, 397272, 396788, 396302, 396786, 398487, 400308, 401029, 400836, 400989, 401972, 402759, 402291, 401002, 400147, 399951, 399401, 398004, 396765, 396819, 397801, 398436, 398392, 398531, 399290, 399892, 399607, 399001, 399255, 400729, 402878, 405161, 407277, 408640, 408573, 407179, 405424, 404107, 403172, 402206, 401142, 400244]
52607D00244m53J45O13M75l05r52p57j75k26r09j101j67J174J943K099K154K195
52590D05997J927J361Q88P27P62P97P62O72N94N80N90O07Q57J562K451K870K590
52573D26594K068J732J420P88q5q43j320j518j453j263j173j056m62N70J211R04
52557D26114J93j07j91q38j909k287j423j10N31K39n02j113j122k57J100J888
52541D20206J335j13j105p15O84J840J818Q35j64n57n31m76l75q4J88K01J63L98
52523D23548P64J018J400K157K755K485J707J439J773J848J505J658K508K825
52509D49390J809N66M84J169J211M20j48n0L2m13j114j817k592l171k993k211
52493D40572j745j988k279j991j393r43n23O5M25P0o72r38l08Q27J834K363K402
$$ y = [400244, 399791, 399936, 400549, 401024, 400719, 399767, 399010, 398835, 398609, 397700, 396599, 396432, 397606, 399549, 401648, 403802, 405997, 407924, 409285, 410173, 410900, 411662, 412459, 413221, 413893, 414487, 415067, 415657, 416264, 417121, 418683, 421134, 424004, 426594, 428662, 430394, 431814, 432602, 432517, 431674, 430354, 428836, 427383, 426120, 424947, 423891, 423429, 423999, 425210, 426114, 426307, 426200, 426009, 425171, 423262, 420975, 419552, 419442, 419973, 420212, 419710, 418597, 417475, 417218, 418318, 420206, 421541, 421428, 420323, 419608, 420292, 422132, 423950, 424785, 424621, 424064, 423533, 423057, 422682, 422598, 422786, 422987, 423150, 423548, 424312, 425330, 426730, 428887, 431642, 434127, 435834, 437273, 439046, 440894, 442399, 444057, 446565, 449390, 451199, 451765, 452249, 453418, 454629, 455049, 454901, 454851, 454883, 454470, 453356, 451539, 448947, 445776, 442783, 440572, 438827, 436839, 434560, 432569, 431176, 430233, 429710, 429775, 430200, 430270, 429598, 428660, 428352, 429179, 431013, 433376, 435778]
52476D35778K085J594J146J043J530K438L109K958K044Q72j67q18p56N8J015J499
52460D55428J744K328K986K845J881J018N62k99j878l084k994k374k511l283l571
52445D48798l034k285j555n81K62M3j149j920j335q1O61P60Q70J211J383J128
52429D43176O86L87L05L35M02O05J121J820K091J459L84lP76J996K740L003L345
52412D64628L935M490M873N134N080M413L345K582K477K697K867L108L591L966
52398E17186L750L170L024L581M008L212J080j439l376m517n130n367n181m674
52384E09327m154l780l409k895k331j899j511q11L93J760K595K510J886J560J979
52369E01220K797L245K859J802P31L91J069K205K702J955M52q05j297j204q40
$$ y = [435778, 437863, 439457, 440603, 441646, 443176, 445614, 448723, 451681, 453725, 454597, 454430, 453612, 452856, 452914, 453929, 455428, 457172, 459500, 462486, 465331, 467212, 468230, 468792, 468493, 466615, 463531, 460537, 458163, 455652, 452369, 448798, 445764, 443479, 441924, 441343, 441605, 441648, 440499, 438579, 437244, 437163, 437824, 438584, 439454, 440665, 442048, 443176, 443862, 444249, 444554, 444889, 445291, 445896, 447017, 448837, 450928, 452387, 452771, 452768, 453544, 455540, 458280, 461283, 464628, 468563, 473053, 477926, 483060, 488140, 492553, 495898, 498480, 500957, 503654, 506521, 509629, 513220, 517186, 520936, 524106, 527130, 530711, 534719, 537931, 539011, 537572, 534196, 529679, 524549, 519182, 514001, 509327, 505173, 501393, 497984, 495089, 492758, 490859, 489348, 488537, 488930, 490690, 493285, 495795, 497681, 499241, 501220, 504017, 507262, 510121, 511923, 512654, 513045, 514114, 516319, 519021, 520976, 521428, 520623, 519326, 518122, 517282]
52354E17282l30J97N85Q65J215J617J902K155K619L184L447L454L799M617N111
52339E51719M650L884M000N094O078O248O142O620P751R000R976J0537J0580J0239
52325F52518J0071J0500J1262J1785J2064J2591J3454J4056J3961J3466J3100
52314G88828J2957J2927J3151J3800J4564J4918J4874J4917J5180J5177J4573
52303I45866J3813J3585J3955J4338J4223J3502J2313J0898R662Q983Q760Q391
52291A088289P359N743M044K640J542N82k99r67j228j098q67q72j108j174o89
52276A101897K67J143J441J218J056J502K590L951N228O262O921P111P065P290
52262A154942P976Q708R087R473J0555J2205J3348J3224J2380J1940J2162J2274
$$ y = [517282, 516952, 517149, 517734, 518599, 519814, 521431, 523333, 525488, 528107, 531291, 534738, 538192, 541991, 546608, 551719, 556369, 560253, 564253, 569347, 575425, 581673, 587815, 594435, 602186, 611186, 621162, 631699, 642279, 652518, 662589, 673089, 684351, 696136, 708200, 720791, 734245, 748301, 762262, 775728, 788828, 801785, 814712, 827863, 841663, 856227, 871145, 886019, 900936, 916116, 931293, 945866, 959679, 973264, 987219, 1001557, 1015780, 1029282, 1041595, 1052493, 1062155, 1071138, 1079898, 1088289, 1095648, 1101391, 1105435, 1108075, 1109617, 1110199, 1109900, 1108933, 1107705, 1106607, 1105740, 1104868, 1103760, 1102586, 1101897, 1102164, 1103307, 1104748, 1105966, 1107022, 1108524, 1111114, 1115065, 1120293, 1126555, 1133476, 1140587, 1147652, 1154942, 1162918, 1171626, 1180713, 1190186, 1200741, 1212946, 1226294, 1239518, 1251898, 1263838, 1276000, 1288274]
52250A288274J1676J0808J0482J0788J1012J0533R346P710N809L952K718K357
52238A385465K294J761R24Q05J876L300L956L798L634L834L888L310K405J870
52224A423120K024K566K962K885K441K062K102K525L043L442L587L390L056L215
52210A462420M305N880P008P308P222P238P487Q088R210J0498J1110J0809J0389
52197A568972J0554J0823J0278R007P961P647P700P739P753P555O661N113L819
52184A671582L545L924L942L113J654k04k448m716o162o280n659n481o259p329
52170A643222p682p038n969n126m674m375l949l326k712k490k760l011k520j231
52156A586359Q2O77N99L51J51j92q15j598k302k707k698k395k055j681j067l90
$$ y = [1288274, 1299950, 1310758, 1321240, 1332028, 1343040, 1353573, 1362919, 1370629, 1376438, 1380390, 1383108, 1385465, 1387759, 1389520, 1390444, 1391249, 1393125, 1396425, 1400381, 1404179, 1407813, 1411647, 1415535, 1418845, 1421250, 1423120, 1425144, 1427710, 1430672, 1433557, 1435998, 1438060, 1440162, 1442687, 1445730, 1449172, 1452759, 1456149, 1459205, 1462420, 1466725, 1472605, 1479613, 1486921, 1494143, 1501381, 1508868, 1516956, 1526166, 1536664, 1547774, 1558583, 1568972, 1579526, 1590349, 1600627, 1609634, 1617595, 1625242, 1632942, 1640681, 1648434, 1655989, 1662650, 1667763, 1671582, 1675127, 1679051, 1682993, 1686106, 1687760, 1687556, 1685108, 1680392, 1674230, 1667950, 1662291, 1656810, 1650551, 1643222, 1635540, 1628502, 1622533, 1617407, 1612733, 1608358, 1604409, 1601083, 1598371, 1595881, 1593121, 1590110, 1587590, 1586359, 1586441, 1587118, 1587717, 1588068, 1588219, 1588027, 1587212, 1585614, 1583312, 1580605, 1577907, 1575512, 1573457, 1571776, 1570709, 1570319]
52140A570319k96r24j322n01J047J800J131O6j35N75J371J738J851K134K892M163
52124A585909N608O717P429Q295R812J1799J3705J5254J6410J7097J7337J7582
52112A732954J8370J9648K0746K1086K0699K0026J9424J8993J8664J8360J8039
52101A947009J7612J6900J5879J4967J4738J5241J5816J5782J5049J3830J2150
52090B114973R977P571N208K762N3k568m554o009p482q819q991p514n418m131
52076B085058l754l161j727j33P65J170J886L027L901M202M667O180Q537J0532
$$ y = [1570319, 1570023, 1569099, 1567777, 1567276, 1568323, 1570123, 1571254, 1571320, 1571185, 1571760, 1573131, 1574869, 1576720, 1578854, 1581746, 1585909, 1591517, 1598234, 1605663, 1613958, 1623770, 1635569, 1649274, 1664528, 1680938, 1698035, 1715372, 1732954, 1751324, 1770972, 1791718, 1812804, 1833503, 1853529, 1872953, 1891946, 1910610, 1928970, 1947009, 1964621, 1981521, 1997400, 2012367, 2027105, 2042346, 2058162, 2073944, 2088993, 2102823, 2114973, 2124950, 2132521, 2137729, 2140491, 2140544, 2137976, 2133422, 2127413, 2119931, 2111112, 2102121, 2094607, 2089189, 2085058, 2081304, 2078143, 2076416, 2076283, 2077048, 2078218, 2080104, 2083131, 2087032, 2091234, 2095901, 2102081, 2110618, 2121150]
$$ [...]
##END NTUPLES=NMR SPECTRUM
##END=
