##TITLE=AC1519_ROEFFECT0004_8202019_CSQISYQX1b
##JCAMPDX= 6.0         $$ Bruker NMR JCAMP-DX V2.0
##DATA TYPE= NMR SPECTRUM
##DATA CLASS= NTUPLES
##ORIGIN= BRUKER
##OWNER= Administrator
$$ 1.72 TOPSPIN		Version 2.1
$$ 2013-09-26 21:05:31.069 -0700  Administrator@X
$$ Compression mode = diff/dup
##.OBSERVE FREQUENCY= 400.02188249412
##.OBSERVE NUCLEUS= ^1H
##.ACQUISITION MODE= SIMULTANEOUS (DQD)
##.ACQUISITION SCHEME= undefined
##.AVERAGES= 8
##.DIGITISER RES= 22
##SPECTROMETER/DATA SYSTEM= spect
##.PULSE SEQUENCE= zg30
##.SOLVENT NAME= COFFEE_meoh
##.SHIFT REFERENCE= INTERNAL, COFFEE_meoh, 1, 14.98509
##AUDIT TRAIL= $$ (NUMBER, WHEN, WHO, WHERE, PROCESS, VERSION, WHAT)
$$ ##TITLE= Audit trail, TOPSPIN		Version 2.1
$$ ##JCAMPDX= 5.01
$$ ##ORIGIN= Bruker BioSpin GmbH
$$ ##OWNER= Administrator
$$ $$ E:\/data/COFFEE/nmr/AC1519_ROEFFECT0004_8202019_CSQISYQX1b/10/pdata/1/auditp.txt
$$ ##AUDIT TRAIL=  $$ (NUMBER, WHEN, WHO, WHERE, PROCESS, VERSION, WHAT)
(   1,<2013-09-26 21:05:23.865 -0700>,<Administrator>,<X>,<go>,<TOPSPIN 2.1>,
      <created by zg
	started at 2013-09-26 21:04:16.594 -0700,
	POWCHK enabled, PULCHK disabled,
       configuration hash MD5:
       C8 4E 4E 5D D3 5C D8 9E 9F 52 82 E0 59 8A DE 15
       data hash MD5: 64K
       BF 63 74 EF 12 CB 25 CE A3 B4 51 85 BD C7 A7 B8>)
(   2,<2013-09-26 21:05:26.954 -0700>,<Administrator>,<X>,<proc1d>,<TOPSPIN 2.1>,
      <Start of raw data processing
       efp LB = 0 FT_mod = 6 PKNL = 1 PHC0 = 0 PHC1 = 0 SI = 32K 
       data hash MD5: 32K
       44 F1 00 8C 0F F5 81 11 92 F7 B1 78 22 FA 9C AB>)
(   3,<2013-09-26 21:05:27.248 -0700>,<Administrator>,<X>,<proc1d>,<TOPSPIN 2.1>,
      <pk PHC0 = 92.97729 PHC1 = 0 
       data hash MD5: 32K
       84 65 D4 C9 8B 38 89 31 E3 FE 32 33 3D 27 C2 A0>)
(   4,<2013-09-26 21:05:27.449 -0700>,<Administrator>,<X>,<proc1d>,<TOPSPIN 2.1>,
      <abs ABSG = 1 
       data hash MD5: 32K
       7D 42 47 13 F4 C0 85 CE B0 0E 77 CC 4F 39 2E 8E>)
(   5,<2013-09-26 21:05:27.526 -0700>,<Administrator>,<X>,<proc1d>,<TOPSPIN 2.1>,
      <abs ABSG = 2 
       data hash MD5: 32K
       3B A6 3B 25 EA C0 4C 3F 8D 24 45 11 DB 49 96 84>)
(   6,<2013-09-26 21:05:27.588 -0700>,<Administrator>,<X>,<proc1d>,<TOPSPIN 2.1>,
      <abs ABSG = 3 
       data hash MD5: 32K
       D6 69 A9 08 9A 43 0D D0 84 0F A2 C5 E8 BC E3 5C>)
(   7,<2013-09-26 21:05:27.650 -0700>,<Administrator>,<X>,<proc1d>,<TOPSPIN 2.1>,
      <abs ABSG = 4 
       data hash MD5: 32K
       ED E8 FD 6E F0 91 B1 06 62 91 85 DB B4 E8 59 11>)
(   8,<2013-09-26 21:05:27.805 -0700>,<Administrator>,<X>,<proc1d>,<TOPSPIN 2.1>,
      <abs ABSG = 5 
       data hash MD5: 32K
       A4 71 96 1A 6B 36 57 35 EA F1 DE 9E 30 6C D6 DB>)
$$ ##END=
$$ 
$$ $$ hash MD5
$$ $$ 56 67 7B 45 FB A7 70 6E 34 9D FF BD 29 F1 BD 6C
##$RELAX= 
##$RELAX= 
##$RELAX= 
##$RELAX= 
##$RELAX= 
##$RELAX= 
##$RELAX= 
$$ Bruker specific parameters
$$ --------------------------
##$DU= <E:\>
##$EXPNO= 10
$$ [...]
150 150 150 150 150 150 150 150
##$TP07= 0
##$TPNAME0= <>
##$TPNAME1= <>
##$TPNAME2= <>
##$TPNAME3= <>
##$TPNAME4= <>
##$TPNAME5= <>
##$TPNAME6= <>
##$TPNAME7= <>
##$TPOAL= (0..7)
0.5 0.5 0.5 0.5 0.5 0.5 0.5 0.5
##$TPOFFS= (0..7)
0 0 0 0 0 0 0 0
##$TUNHIN= 0
##$TUNHOUT= 0
##$TUNXOUT= 0
##$USERA1= <user>
##$USERA2= <user>
##$USERA3= <user>
##$USERA4= <user>
##$USERA5= <user>
##$V9= 5
##$VALIST= <valist>
##$VCLIST= <CCCCCCCCCCCCCCC>
##$VD= 0
##$VDLIST= <DDDDDDDDDDDDDDD>
##$VPLIST= <PPPPPPPPPPPPPPP>
##$VTLIST= <TTTTTTTTTTTTTTT>
##$WBST= 1024
##$WBSW= 4
##$XGAIN= (0..3)
0 0 0 0
##$XL= 0
##$YL= 0
##$YMAX_a= 631281
##$YMIN_a= -537021
##$ZGOPTNS= <>
##$ZL1= 120
##$ZL2= 120
##$ZL3= 120
##$ZL4= 120
##$ABSF1= 14.98509
##$ABSF2= -5.573092
##$ABSG= 5
##$ABSL= 3
##$ALPHA= 0
##$AQORDER= 0
##$ASSFAC= 0
##$ASSFACI= 0
##$ASSFACX= 0
##$ASSWID= 0
##$AUNMP= <proc_prof1d_extract_pilot.lims>
##$AXLEFT= 0
##$AXNAME= <>
##$AXNUC= <1H>
##$AXRIGHT= 0
##$AXTYPE= 0
##$AXUNIT= <>
##$AZFE= 0.1
##$AZFW= 0.1
##$BCFW= 0
##$BC_mod= 0
##$BYTORDP= 0
##$COROFFS= 0
##$CY= 15
##$DATMOD= 1
##$DC= 0
##$DFILT= <>
##$DTYPP= 0
##$F1P= 0
##$F2P= 0
##$FCOR= 0.5
##$FTSIZE= 32768
##$FT_mod= 6
##$GAMMA= 0
##$GB= 0
##$INTBC= 1
##$INTSCL= 1
##$ISEN= 128
##$LB= 0
##$LEV0= 0
##$LPBIN= 0
##$MAXI= 10000
##$MC2= 0
##$MEAN= 0
##$ME_mod= 0
##$MI= 0
##$NCOEF= 0
##$NC_proc= -8
##$NLEV= 6
##$NOISF1= 0
##$NOISF2= 0
##$NSP= 0
##$NTH_PI= 0
##$NZP= 0
##$OFFSET= 14.98509
##$PC= 1
##$PHC0= 92.97729
##$PHC1= 0
##$PH_mod= 1
##$PKNL= yes
##$PPARMOD= 0
##$PPDIAG= 0
##$PPIPTYP= 0
##$PPMPNUM= 2147483647
##$PPRESOL= 1
##$PSCAL= 4
##$PSIGN= 0
##$PYNMP= <proc.py>
##$REVERSE= no
##$SF= 400.02
##$SI= 32768
##$SIGF1= 0
##$SIGF2= 0
##$SINO= 400
##$SIOLD= 32768
##$SPECTYP= <>
##$SREGLST= <1H.CDCl3>
##$SSB= 0
##$STSI= 32768
##$STSR= 0
##$SW_p= 8223.68421052631
##$SYMM= 0
##$S_DEV= 0
##$TDeff= 65536
##$TDoff= 0
##$TI= <>
##$TILT= no
##$TM1= 0
##$TM2= 0
##$TOPLEV= 0
##$USERP1= <user>
##$USERP2= <user>
##$USERP3= <user>
##$USERP4= <user>
##$USERP5= <user>
##$WDW= 1
##$XDIM= 32768
##$YMAX_p= 485590675
##$YMIN_p= -702195
##$CURPLOT= <Network HP LaserJet P1505>
##$CURPRIN= <$Network HP LaserJet P1505>
##$DFORMAT= <normdp>
##$LAYOUT= <+/1D_H.xwp>
##$LFORMAT= <normlp>
##$PFORMAT= <normpl>
##$SURQMSG= 1
$$ End of Bruker specific parameters
$$ ---------------------------------
##NTUPLES= NMR SPECTRUM
##VAR_NAME=  FREQUENCY,     SPECTRUM/REAL,   SPECTRUM/IMAG
##SYMBOL=    X,             R,               I
##VAR_TYPE=  INDEPENDENT,   DEPENDENT,       DEPENDENT
##VAR_FORM=  AFFN,          ASDF,            ASDF
##VAR_DIM=   32768,         32768,           32768
##UNITS=     HZ,            ARBITRARY UNITS, ARBITRARY UNITS
##FACTOR=    0.250966925370066, 1,           1
##FIRST=     8223.43324360094, -17014,       -267979
##LAST=      0,             -136311,         -165315
##MIN=       0,             -702195,         0
##MAX=       8223.43324360094, 485590675,    0
$$ Real data points
##PAGE= N=1
##DATA TABLE= (X++(R..R)), XYDATA
$$ [...]
$$ plain form
19562 -304126 -87791 -61460 294750 -78632 -127449 -82958 122722 78315 -401626 -126912 -306525
19551 -306525 104983 -190819 14375 -187271 323881 -84394 45390 104731 -188856 -148012
19541 -148012 120110 -114906 -58619 82777 -185496 -65074 -228446 127741 4318 84421 -30625
19529 -5371 -258622 122055 -4735 7633 -48554 83458 -139886 -97059 27128 -61994 -57199 -6175
19516 228955 252342 246664 -122128 -13503 -35773 -534188 -280706 -11017 -14776 88496 139518
19505 139518 -195240 -453102 -100138 143794 234987 -105996 17539 77136 -262056 -469633
19495 -469633 -294834 -87021 21299 -226304 107844 -106894 32543 26638 349632 24516 -198956
19483 185598 -60424 -154869 306176 125940 -9970 -34862 -318875 -15292 -50861 99417 -336718
$$ packed form
19562c04126h7791K6331B94750g8632m8817M4491A22722m4407d01626a26912j79613
19551c06525A04983a90819A4375a87271C23881h4394D5390N9341a88856M0844
19541a48012A20110a14906N6287H2777a85496f5074j63372A27741D318Q0103c0625
19529e371k53251A22055d735G633d8554H3458a39886M2827B7128f1994M795f175
19516B28955K3387n678a22128a3503k2270m98415K53482a1017l759H8496N1022
19505A39518a95240k57862a00138A43794R1193a05996A7539N9597b62056k07577
19495d69633J74799h7021B1299b26304A07844a06894C2543n905L22994B4516a98956
19483A85598f0424r4445C06176A25940i970k4892k84013a5292l5569I9417c36718
$$ plain form
19471 -315955 -75166 -37875 -15085 -46519 -319241 -109538 -118498 -176646 207966 -124869 -16811
19459 -153371 -189369 -213179 222491 -11108 -385011 20306 -267885 -161412 -216489 7904 -57521
19447 71856 47808 64694 229225 -51844 -375666 -50180 58444 -160088 55500 -85099 -389701
19436 -389701 -55042 -131264 -137472 125768 -62330 50778 -73701 -312897 -222573 -42862 -144579
19425 -144579 -302794 -98010 -21931 -345342 -348535 176354 166983 -246128 15725 -247447 -160139
19414 -160139 -53430 118756 -353645 -195973 100013 -128672 13908 -155796 287747 22307
19403 4365 -107271 48213 -80147 -30987 277324 -429256 108799 -245984 -236870 -134079 -321184
19392 -321184 251333 -95972 -528968 88465 -236098 -170881 -200329 -203734 -82341 -164650 -54311
$$ packed form
19471c15955g5166L7291a5085l1434k72722a09538q960n8148B07966a24869a6811
19459a53371l5998k3810B22491a1108l73903B0306b67885J06473n5077G904e7521
19447G1856k4048J6886J64531e1844l23822e0180E8444a60088E5500h5099l04602
19436c89701e5042p6222o208A25768f2330E0778g3701k39196R0324d2862j01717
19425a44579j58215i8010b1931l23411l193A76354r371b46128A5725b47447Q7308
19414a60139e3430A18756c53645J57672A00013a28672A3908a55796B87747B2307
19403D365a07271D8213h0147c0987B77324d29256A08799b45984R114J02791j87105
19392c21184B51333i5972m32996H8465b36098O5217k9448l405h2341q2309e4311
$$ plain form
19380 -101670 -207446 3223 -127146 59120 -130966 -93171 -263341 -161446 29213 21357 128900
19369 128900 -599 143207 14523 -185221 -91127 232775 -79428 145213 -48706 6225 12747
19358 12747 232497 25397 147203 -146248 -168591 55851 -108971 -101522 -138198 -31201 -159876
19347 -159876 -118849 -177972 -66358 -220689 224347 55861 -229721 64818 -174284 193479
19336 -78010 -255124 -217966 10078 -188229 -76471 -22488 51454 -63455 12778 -190445 152612
19324 -9205 279244 217737 -371021 129061 124878 109950 -393097 106543 -5452 57855 -13910
19312 -437848 -237819 283665 -292705 248824 -146358 -197948 121874 -93417 82812 15531
19301 -87523 68429 -102041 255716 -220138 48914 -32472 -243747 10679 -40874 -119436 -265290
$$ packed form
19380a01670j05776C223a27146E9120a30966L7795j70170J01895B9213p856J07543
19369A28900e99A43207A4523a85221i1127B32775g9428A45213d8706F225O522
19358A2747K19750B5397J21806a46248k2343E5851a08971P449l6676c1201j28675
19347a59876M1027n9123f6358j54331B24347E5861b29721F4818a74284A93479
19336g8010j77114L7158A0078a88229g6471b2488E1454f3455A2778a90445A52612
19324i205B79244o1507c71021A29061m183j4928c93097A06543e452E7855a3910
19312d37848K00029B83665b92705B48824a46358n1590A21874i3417H2812A5531
19301h7523F8429a02041B55716b20138D8914c2472k11275A0679d0874p8562j45854
$$ plain form
19290 -265290 233486 -28915 -126306 -218094 283928 -134572 -250578 -206444 30024 347057
19280 347057 -201618 241792 -569708 29886 83680 -174785 43337 -461195 183786 54448
19269 -160727 -149803 111490 115880 -109910 307024 -415966 140824 -117934 -130643 -70198
19259 -70198 -213017 -204141 -277958 236599 -136005 -260849 51002 -30936 -54773 49179 -225322
19247 -56476 188415 -43966 -119421 98084 -211460 -40865 -178908 11526 137201 -283035 -350241
19236 -350241 48185 207309 -227277 31971 -143827 -65063 -16927 -263809 55776 -62142 -185095
19225 -185095 76043 -104772 117283 -90344 -196605 194988 -302405 92249 -184218 -344375
19215 -344375 -128202 -146252 -75915 23430 -55248 188473 -37954 245845 48441 -21211 496613
$$ packed form
19290b65290B33486b8915r7391r1788B83928a34572j16006M4134C0024L17033
19280C47057b01618B41792e69708B9886N3794a74785D3337d61195A83786E4448
19269a60727J0924A11490M390a09910C07024d15966A40824a17934j2709O0445
19259g0198j42819Q876p3817B36599a36005j24844E1002c0936k3837D9179b25322
19247e6476A88415d3966p5455I8084b11460d0865j38043A1526J25675b83035o7206
19236c50241D8185J59124b27277C1971a43827f5063a6927k46882E5776f2142j22953
19225a85095G6043a04772A17283i0344j06261A94988c02405I2249a84218j60157
19215c44375a28202j8050P0337B3430e5248A88473c7954B45845D8441b1211D96613
$$ plain form
19203 -314753 -154076 4940 322442 113387 -125761 110305 -208361 -3692 -11512 -638043 171066
19191 -157389 -37822 -84245 237975 95768 -48816 89950 -205629 -68758 70557 -43512 -302123
19180 -302123 110204 332900 -507354 -97470 111172 -226942 -2143 -250369 7132 47485 -187860
19168 -110856 -152711 123890 -479472 -25676 107338 1651 -127166 -230202 -216339 100255
19157 273586 -106281 -201022 -338394 -155436 142117 -67548 -81674 -61671 -316242 -119981
19146 -235559 25272 -123769 61502 -109993 -128812 -132354 -34545 59880 -359509 29496 -130708
19134 12412 -68632 -10354 -93271 4125 51881 88365 -51178 40989 100295 10239 -11226 62384
19121 94428 -99513 -142768 -115536 160762 -160511 -208866 -10108 147987 -152418 -33675 -155023
$$ packed form
19203c14753a54076D940L17502A13387a25761A10305b08361c692p820o26531A71066
19191a57389c7822m6423B37975I5768d8816H9950b05629f8758G0557d3512k58611
19180c02123A10204K22696e07354i7470A11172b26942b143k48226G132M0353a87860
19168a10856m1855A23890d79472b5676A07338A651a27166j03036J3863A00255
19157B73586a06281r4741j37372a55436A42117f7548j4126K0003k54571a19981
19146b35559B5272a23769F1502a09993j8819l542c4545E9880c59509B9496a30708
19134A2412f8632a0354q2917D125M7756L6484e1178D0989N9306A0239a1226F2384
19121I4428i9513m3255K7232A60762a60511m8355a0108A47987a52418c3675j21348
$$ plain form
19110 -155023 -131926 -312690 -24874 -196632 14196 -91398 -83515 5480 -23567 193545 -93554
19098 -83352 37310 -411747 -285435 -237333 -124852 -63523 19453 99179 -81812 125000 81331
19087 81331 -47036 -146902 -91193 120149 783 -28285 -42963 195668 241839 -84707 -39278 -249744
19075 -249744 72495 -323939 183805 -295902 -63821 -540998 -56798 -120477 -83247 -16472 18271
19063 -8832 85576 75100 97810 -138784 -33033 63249 111892 -313890 157019 -546088 -176620
19051 -378836 -188158 17735 22742 -128684 -141000 -107492 -167014 -213796 136302 -273694 -61303
19039 93291 108386 25498 42593 -202328 -257204 41530 -59786 116361 -437781 -224310 26245
19027 -67282 255249 332144 44651 76354 16490 -39494 -164343 -97368 388433 26941 -341243
$$ packed form
19110a55023K3097j80764b4874j71758A4196i1398P883E480b3567A93545i3554
19098h3352C7310d11747J26312M8102J12481O1329A9453P9726h1812A25000m3669
19087H1331d7036r9866N5709A20149G83b8285j4678A95668M6171h4707c9278k10466
19075b49744G2495c23939A83805b95902f3821m77177e6798o3679L7230a6472A8271
19063h832H5576j0476K2710a38784c3033F3249M8643c13890A57019e46088a76620
19051c78836a88158A7735N007a28684j2316L3508n9522m6782A36302b73694f1303
19039I3291J5095B5498J7095b02328n4876D1530e9786A16361d37781K13471B6245
19027f7282B55249P6895D4651L1703A6490c9494j24849O6975C88433B6941c41243
$$ plain form
19015 368987 -185434 -52466 -39299 -211753 -94000 -109233 -335196 -122698 131304 -307941
19004 -103319 3756 40391 -101859 -316270 -65131 -443418 60245 -320809 -75425 -231787 -135983
18993 -135983 425375 242714 -121378 71201 38673 -18309 -286087 -241288 380565 84708
18982 -150043 16109 32865 -26639 -168766 316303 188168 -38760 -37566 -262871 55430 -165579
18970 -187635 -11676 -165657 169181 126591 -118589 215467 -190061 -44947 12583 166655
18960 166655 -117965 -4313 135198 -320921 -474922 -201888 -261888 151242 -27954 131219
18949 -163479 -229236 -294419 53474 -96746 146780 -199761 102240 -290917 -57450 67032 -360099
18937 -378188 -4243 -87106 -126033 37001 196347 427210 -67834 220804 -71001 54629 24331
$$ packed form
19015C68987a85434e2466J3167j72454i4000j5233k25963a22698A31304c07941
19004a03319C756L6635a01859k14411f5131l78287F0245c20809g5425j56362R5804
18993a35983D25375j82661a21378G1201l2528a8309k67778M4799C80565H4708
18982a50043A6109J6756b6639j42127C16303j28135c8760J194k25305E5430a65579
18970a87635a1676j53981A69181m2590a18589B15467a90061d4947A2583J54072
18960A66655a17965d313A35198c20921j54001b01888o0000A51242b7954A31219
18949a63479o5757o5183E3474i6746A46780a99761A02240b90917e7450F7032c60099
18937c78188d243q2863l8927C7001J59346K30863f7834B20804g1001E4629B4331
$$ plain form
18925 63292 -220874 -213233 -182568 108867 87453 62313 -287276 32603 49746 18695 -260390
18913 105623 -279438 372953 -189280 -159964 59868 -50847 -43947 69287 -109021 260722 -264036
18901 -48867 119338 -220523 -148005 62398 -227634 63063 -284006 -200117 -75191 -38097 12067
18889 65487 -44287 -33793 -168744 11522 86946 -100953 148016 -188339 -123834 390566 -115362
18877 23088 -126434 -165338 129617 -338571 -29589 -7507 178904 253696 -198301 -78498 174115
18865 -100780 100418 146314 -452990 276346 120686 -126286 23815 -39149 192810 -251029
18854 -291013 107046 -60197 -159315 173751 65470 -159210 97453 -309891 370332 -186898
18843 88416 21917 29617 4582 -9793 334120 -303560 56235 137227 -58846 -250049 61935 123053
$$ packed form
18925F3292b20874P641L0665A08867k1414k5140b87276C2603J7143A8695b60390
18913A05623b79438C72953a89280K9316E9868e0847O900F9287a09021B60722b64036
18901d8867A19338b20523P2518F2398b27634F3063b84006Q3889g5191L7094A2067
18889F5487d4287J0494j34951A1522P5424a00953A48016a88339O4505C90566a15362
18877B3088a26434l8904A29617c38571b9589g507A78904P4792a98301g8498A74115
18865a00780A00418M5896d52990B76346A20686a26286B3815c9149A92810b51029
18854b91013A07046f0197r9118A73751F5470a59210I7453c09891C70332a86898
18843H8416B1917P700D582i793C34120c03560E6235Q0992e8846j91203F1935O1118
$$ plain form
18831 123053 -156604 -245662 -129875 -189932 -124190 -234537 -211839 -169602 20154 254716 105646
18819 225877 468976 -123477 36173 142767 -202502 15190 255313 171395 -184796 154070
18808 154895 50118 -47730 82071 8944 -106019 266767 -93729 284845 79436 75018 14603
18796 -244715 104663 -26222 -399889 -93936 -97813 168580 -241734 -281404 -55801 81444 -274973
18784 -328599 -148225 -56500 -117029 -335395 305357 140702 -183606 -154769 -229414 66313
18773 -70451 -383307 21500 166436 245582 -187587 -35085 51125 -9778 -557607 165799 266264
18762 266264 -562829 -103868 -169403 -28950 -27758 -317026 199562 13156 -50060 -2795 -113652
18751 -113652 -187292 -240111 16633 23139 41140 22360 -10941 -330198 -113417 -32789 -256976
$$ packed form
18831A23053a56604q9058J15787o0057O5742j10347K2698M2237B0154K34562A05646
18819B25877K43099a23477C6173J06594b02502A5190K40123q3918a84796A54070
18808A54895E0118d7730H2071H944a06019B66767i3729B84845G9436m418A4603
18796b44715A04663b6222l73667i3936l877A68580b41734l9670e5801H1444b74973
18784c28599a48225e6500o0529k18366C05357A40702a83606K8837p4645F6313
18773g0451l12856B1500J44936P9146a87587c5085E1125i778n47829A65799J00465
18762B66264e62829a03868o5535b8950J192k89268A99562A3156e0060b795j10857
18751a13652p3640n2819A6633O506J8001j8780a0941l19257a13417c2789k24187
$$ plain form
18740 -256976 -153749 -21483 -147751 68901 -163047 -234413 -461720 73067 74094 147216 225531
18729 225531 94976 -280329 -544244 -92290 -452481 41781 -29446 21271 197790 -263267
18718 14715 -178085 -248822 -299598 175597 -133961 31212 -55309 25245 -79668 64540 -86142
18706 165053 -313910 -255131 31510 32127 -216062 11701 343905 -57764 242449 22811 -26656
18694 -65750 -58915 -238245 -23442 -35228 -85802 -310887 -289231 36976 232105 -112062 -339212
18683 -339212 13420 -83323 -207584 -43586 -220458 -357726 -319323 -210554 8712 155033 35597
18671 45511 45205 -52412 403477 -122204 -272278 64758 -37159 -72186 -176542 146664 -250275
18659 -137981 -214587 185691 -70871 96628 -136455 -256636 -1025 -165870 -73751 146942 129246
$$ packed form
18740b56976J03227b1483j26268F8901a63047p1366k27307G3067J027P3122P8315
18729B25531I4976b80329k63915i2290l60191D1781b9446B1271J76519b63267
18718A4715a78085p0737n0776A75597a33961C1212e5309B5245g9668F4540h6142
18706A65053c13910N8779C1510O17b16062A1701L32204e7764B42449B2811b6656
18694f5750O835j79330b3442j1786n0574k25085K1656C6976J95129a12062k27150
18683c39212A3420h3323j24261d3586j76872j37268L8403J08769H712J46321C5597
18671D5511l06e2412D03477a22204j50074F4758c7159l5027j04356A46664b50275
18659a37981p6606A85691g0871I6628a36455j20181a025j64845g3751A46942j7696
$$ plain form
18648 129246 123696 -479295 201204 129118 -179849 44010 -39342 -45075 -75608 -228590 47226
18636 -82431 222489 -143709 -447673 312503 -427432 -58162 369022 -240444 124008 -182527
18625 -46334 -338057 -103292 -173670 243108 -46197 148556 -15123 47405 -215989 216661
18614 85904 28196 -291836 117153 126170 304178 -189437 38636 91438 253569 -82265 3088
18602 58701 -9296 -210487 62985 -82275 -142922 -311821 -45660 -148480 -189262 -34844 99018
18590 -97402 -106808 -144024 30589 87210 -84430 -114339 75075 10832 313809 -74527 39792 53444
18578 53444 -46527 98600 -95729 132420 -244111 -199970 -117179 -132869 -153200 -163275 -59769
18566 32942 -37029 -13458 -329412 -408854 -27474 110373 -276690 192166 -137561 -78927 -126173
$$ packed form
18648A29246n550d79295B01204p2086a79849D4010c9342n733l0533j52982D7226
18636h2431B22489a43709l03964C12503d27432e8162C69022b40444A24008a82527
18625d6334k91723a03292p0378B43108d6197A48556a5123D7405b15989B16661
18614H5904B8196b91836A17153R017J78008a89437C8636N2802J62131h2265C088
18602E8701i296k01191F2985h2275o0647j68899d5660j02820m0782c4844I9018
18590i7402r406l7216C0589N6621h4430k9909G5075A0832L02977g4527C9792J3652
18578E3444d6527I8600i5729A32420b44111M4141Q2791j5690k0331j0075e9769
18566C2942c7029a3458l15954p9442b7474A10373b76690A92166a37561N8634m7246
$$ plain form
18555 -126173 -83526 -387807 97063 -247051 31204 -102015 -64331 -78237 61770 173916 6082
18543 220850 -162459 76963 160402 26488 43321 -209966 -346022 68134 161456 -198091 87339
18531 -329970 -199255 69541 196722 -212997 98631 65943 25638 171155 -151988 142762
18520 -303309 -182986 -248317 -237501 73347 131181 157893 -42728 292747 319380 -387927 -291409
18509 -291409 20859 97971 26047 -121596 -97924 60174 -13711 -38694 99413 -107760 -260565
18498 -260565 105270 68156 -61381 146277 -151023 41954 -66243 -116550 -22845 194259 -43686
18486 -226162 23802 -24744 660 37263 -117280 33697 -354406 5838 -310404 -390508 62275
18474 238003 -37499 205781 113738 82970 46610 -143734 -261010 35075 188957 272281 -263840
$$ packed form
18555a26173M2647l04281I7063b47051C1204a02015L7684j3906F1770J12146F082
18543B20850a62459G6963Q3439B6488J6833b09966j36056F8134R3322a98091H7339
18531c29970J30715F9541J27181b12997I8631l2688B5638J45517a51988A42762
18520c03309J20323o5331J0816G3347N7834K6712d2728B92747K6633c87927R6518
18509b91409B0859P7112B6047a21596K3672F0174a3711k4983I9413a07760j52805
18498b60565A05270l7114f1381A46277a51023D1954f6243n0307b2845A94259d3686
18486b26162B3802b4744F60L6603a17280C3697c54406E838c10404q0104F2275
18474B38003c7499B05781r2043l0768l6360a43734j17276C5075J53882Q3324b63840
$$ plain form
18462 94481 -104077 175495 107727 -111338 -109527 87763 -182385 105260 -57398 7704 159247
18451 159247 -260981 -175504 -151306 151158 111517 45542 62406 234931 -29675 -114399 245235
18439 15513 185893 -307241 -4602 -85154 363198 -446080 -370370 -207831 109279 187669 -336123
18427 -6302 -146398 -8550 183865 -130955 -268336 -28486 -374029 -254451 -173909 -85506 -70523
18416 -70523 -79025 222925 -297588 -44770 122395 -382367 -36388 -39731 -17794 -5515 124145
18404 -84673 -92354 -12220 73430 58800 -135357 49020 -104325 -13992 -391561 -397123 -172973
18392 -269673 334671 81202 -81729 130283 -14481 -114052 -160945 -623983 -285456 -8660 20873
18380 173701 102778 106051 60614 -217552 220486 174239 289238 -86819 -146117 459522 -190733
$$ packed form
18462I4481a04077A75495o7768a11338J811H7763a82385A05260e7398G704J51543
18451A59247b60981Q5477K4198A51158l9641D5542J6864J72525b9675q4724B45235
18439A5513J70380c07241d602q0552C63198d46080P5710J62539A09279P8390c36123
18427f302j40096h550A83865a30955j37381b8486l45543J19578Q0542h5506J4983
18416g0523q502B22925b97588d4770A22395c82367c6388l343a7794e515A24145
18404h4673p681a2220G3430j4630a35357D9020a04325a3992l77569n562a72973
18392b69673C34671H1202h1729A30283a4481r9571m6893m63038b85456h660B0873
18380A73701p0923L273m5437b17552B20486m6247J14999h6819n9298D59522a90733
$$ plain form
18368 -140487 22423 5947 -54251 238909 24868 75972 -253815 -143736 -545739 -200936 114076
18356 -112674 -363154 11966 -90637 112566 -46001 81960 -48193 -35323 221137 -86302 -28751
18344 -330523 -120358 -319627 -360904 155794 -51763 -75569 -309875 -9439 225697 -148473
18333 -122657 34906 -262373 -246395 176904 -25459 -128473 -9399 31998 -246265 -2567 -24443
18322 -24443 -325202 45537 -242822 -160140 -128131 297172 -12515 39327 -19983 223639 -43061
18310 35488 122888 -49725 -199401 55916 -112675 72762 -295868 29859 116372 -259260 -253777
18299 -253777 276857 139644 -2216 -23564 154230 117294 196757 194428 55713 41454 28810
18288 28810 163674 70931 378254 -243110 61504 -43653 113354 -28132 41295 -42986 -36469
$$ packed form
18368a40487B2423E947e4251B38909B4868N1104b53815J10079m02003b00936A14076
18356a12674k50480A1966i0637A12566d6001H1960d8193J2870B21137h6302b8751
18344c30523a20358j99269m1277A55794e1763k3806k34306i439B25697a48473
18333a22657C4906b62373J5978A76904b5459j03014i399C1998b46265b567k1876
18322b4443l00759D5537b42822Q2682L2009B97172a2515C9327a9983B23639d3061
18310C5488Q7400d9725j49676E5916a12675G2762b95868B9859Q6513b59260N483
18299b53777B76857j37213b216k1348A54230l6936P9463k329E5713j4259j2644
18288B8810J34864G0931L07323b43110F1504d3653A13354b8132D1295d2986O517
$$ plain form
18277 -36469 151201 35057 -304042 -308570 243219 -255289 -244219 -38366 -235397 331717 -169789
18265 226815 -124601 -66080 -80139 99041 -130926 47912 9708 -134783 -420850 136198 22629
18253 107775 50792 58188 40408 36036 231271 16489 49945 -248807 61793 461086 -305138
18241 138121 -117245 129743 126418 56428 -38395 -92702 45658 -65509 -77026 -79209 62723
18229 -254410 187845 31066 -178485 -297984 -102979 303630 59172 217833 -270197 -130455
18218 377503 -125156 7971 -88189 -75291 191061 202686 144451 136181 101256 -52100 99163
18206 -138680 -272581 111399 -63813 -299607 25491 364561 197164 -74879 -211358 -272682
18196 -272682 -70250 -131095 -68529 13069 -326032 -365672 -383219 78858 -87551 -69162 -110873
$$ packed form
18277c6469A51201C5057c04042m528B43219b55289J1070c8366j97031C31717a69789
18265B26815a24601N8521j4059I9041a30926D7912I708a34783k86067A36198B2629
18253A07775E0792P396j7780m372J95235A6489L3456b48807F1793L99293c05138
18241A38121a17245A29743l325E6428c8395n4307D5658f5509j1517k183F2723
18229b54410A87845C1066a78485j19499a02979C03630E9172J58661b70197a30455
18218C77503a25156G971h8189J2898A91061J1625n8235q270l4925e2100I9163
18206a38680j33901A11399f3813k35794B5491L39070j67397g4879j36479o1324
18196b72682g0250o0845O2566A3069c26032l9640j7547G8858h7551J8389m1711
$$ plain form
18185 -110873 -173843 -50454 -107045 -6960 -259164 -161052 -31360 -32123 25144 -73177 -16254 -57340
18173 -57340 417439 161734 -320588 96724 -75609 177408 -92835 100054 -67479 31458 -113789
18161 328065 141108 134907 127711 -90055 147391 -113532 -218086 -217221 -458318 112159 -407384
18149 216260 247867 -210893 150168 198712 79503 -1432 60398 125378 72936 157721 -164068
18137 -209716 -309472 -357662 -451843 87864 -226757 133924 -139706 -137837 -155828 -5122 -243159
18126 -243159 145668 -260567 60995 -22012 124645 91487 -184477 -296679 -5562 -176021
18116 -176021 9820 -160997 -199202 -57048 -88621 -269954 -84926 -343921 5163 -99653 -258098
18105 -258098 7930 56521 81437 104817 -150660 -75128 -24483 30900 -224832 -71968 -95319
$$ packed form
18185a10873o2970e0454n6591f960k52204R8112c1360p63B5144g3177a6254m1086
18173e7340D17439A61734c20588I6724g5609A77408i2835A00054f7479C1458a13789
18161C28065A41108o201p196i0055A47391a13532j04554Q65k41097A12159d07384
18149B16260L1607b10893A50168M8544G9503a432F0398O4980n2442Q4785a64068
18137b09716r9756m8190r4181H7864b26757A33924a39706J869j7991e122k38037
18126b43159A45668b60567F0995b2012A24645l3158a84477j12202e562j70459
18116a76021I820a60997l8205e7048l1573j81333h4926k58995E163i9653j58445
18105b58098G930M8591K4916K3380a50660g5128b4483C0900b24832g1968k3351
$$ plain form
18094 -95319 -108766 12560 -202610 -169044 -178558 30078 330309 128341 -123688 -29496 91678
18082 -110862 -2348 123414 56779 -1601 -291997 100520 -54332 -9228 11549 -244724 -159972
18071 -159972 15238 177744 -205615 -95949 77254 192086 -219705 -121171 -46779 179259
18060 -176471 6549 102872 118043 52954 -123141 3014 -214937 -391350 -211557 -94774 261398
18048 109585 189880 -103383 -38448 -128477 139135 40865 -45187 128309 -283644 97957 -4852
18036 41648 71769 10405 154515 182969 -84944 -240840 -73766 -163478 -70118 -108438 347837
18024 169987 -142031 -145913 57337 -38386 -99863 -153402 340979 25955 -242799 -83416 -341995
18013 -341995 -130238 15594 -1985 -33309 96536 42151 5452 26698 51065 -116684 -52291
$$ packed form
18094i5319j3447A2560b02610L3566r514C0078L00231A28341a23688b9496I1678
18082a10862b348A23414E6779a601k90396A00520e4332i228A1549b44724Q4752
18071a59972A5238J62506b05615i5949G7254J14832b19705R8534d6779A79259
18060a76471F549R6323J5171E2954a23141C014b14937j76413J79793i4774B61398
18048A09585Q0295a03383c8448r0029A39135D0865d5187A28309b83644I7957d852
18036D1648L0121A0405J44110K8454h4944j55896g3766q9712g0118l8320C47837
18024A69987a42031l882E7337c8386o1477n3539C40979B5955b42799h3416k58579
18013c41995a30238A5594a985l1324I6536D2151E452K1246K4367a16684e2291
$$ plain form
18001 190679 194498 -8810 -260556 -56883 -180891 284269 -57605 41720 78846 125537 256929
17990 256929 19501 -141252 120098 -126357 357425 97975 41292 -70702 -98949 -16574 189741
17978 -7814 -18402 69590 -178461 -243762 15559 -17019 -192327 43760 79518 -119067 -67371
17967 -67371 -44085 -225229 -15543 -135832 -46288 206667 -22203 -307843 -24215 -178653 -408100
17956 -408100 25088 102944 -48991 -207201 -42014 199502 -233571 6658 54252 72047 -100785
17944 -101926 -44869 -39391 -30760 -98916 -9953 78465 -105506 -68867 -144155 17972 61424 -153007
17931 -147984 137926 60910 -218307 279632 265176 25525 -413789 34028 -179948 83856
17920 -36141 273881 127023 27186 -356854 -280941 124205 16454 74738 -100784 227992
$$ packed form
18001A90679L819h810k51746e6883j24008B84269e7605D1720L7126M6691J31392
17990B56929A9501a41252A20098a26357C57425I7975D1292g0702k8247a6574A89741
17978g814j0588F9590a78461o5301A5559a7019j75308D3760L5758a19067N1696
17967f7371K3286j81144a5543j20289d6288B06667b2203k85640b4215j54438k29447
17956d08100B5088P7856d8991j58210d2014A99502b33571F658M7594J7795a00785
17944a01926d4869N478Q631o8156i953G8465a05506L6639p5288A7972M3452a53007
17931a47984A37926F0910b18307B79632j4456B5525d13789C4028a79948H3856
17920c6141B73881A27023B7186c56854P5913A24205A6454N8284a00784B27992
$$ plain form
17909 -189281 254895 -203163 427761 -208428 -138624 -138750 48800 11843 -42312 96884 241822
17898 241822 -115815 -199183 -329981 -226371 -250892 -48590 -157658 223323 35774 385913
17888 385913 -52558 72823 -35020 -268592 -44506 369386 -8498 -73000 263700 329166 -181537
17876 -65734 -128842 240525 45215 137033 18362 -58001 -173041 25541 -92228 -12277 25769
17864 -249284 -20242 167272 -111260 113379 28630 261727 -28477 -172748 269000 25851
17853 91734 228783 44508 -43406 -169266 337957 139081 -215767 40278 34492 -87120 -133846
17842 -133846 -52555 6686 -389937 -349680 176100 -44989 -384338 294415 -208641 41260 52155
17831 52155 141013 24319 153146 -1904 -213817 -247256 -43491 -101956 -266496 -105811 224358
$$ packed form
17909a89281B54895b03163D27761b08428O9804j26D8800A1843d2312I6884J44938
17898B41822a15815q3368j30798J03610k4521d8590j09068B23323C5774L50139
17888C85913e2558G2823c5020k33572d4506C69386h498o4502B63700O5466a81537
17876f5734o3108B40525D5215R1818A8362e8001j15040B5541i2228a2277B5769
17864b49284b0242A67272a11260A13379B8630K33097b8477j44271B69000B5851
17853I1734J37049D4508d3406j25860C37957A39081b15767D0278n786h7120m6726
17842a33846e2555F686c89937M0257A76100d4989l39349B94415b08641D1260J0895
17831E2155Q8858B4319J28827a904k11913l3439d3491n8465j64540a05811B24358
$$ plain form
17819 -10360 42906 163126 39957 -77664 -32121 239690 159808 -36000 -42243 -165755 4103
17807 232500 -144415 -274238 -159771 111841 341344 4111 97207 -12577 161008 -42821
17796 -259864 28496 -27982 -74051 17756 400132 -126021 178286 207835 167811 -139046 -96263
17785 -96263 341339 -86851 -208274 104759 -114525 -114868 101649 -127624 -430574 7515 61244
17774 61244 -116702 362401 107946 -21890 -175310 -234912 -202828 273297 -128449 -135134 -40084
17762 -74613 334741 -116817 38304 -14134 7720 -205824 -118202 -11269 -95741 -166773 -266672
17751 -266672 -313167 447227 -86818 -40623 15398 164825 32662 17293 446111 12115 271383
17740 271383 213223 -87121 -130741 -164475 77513 -100930 -93681 311205 -1250 -123643 16842
$$ packed form
17819a0360D2906J20220C9957g7664c2121B39690p9882c6000o243j23512D103
17807B32500a44415j29823J14467A11841K29503D111R3096a2577A61008d2821
17796b59864B8496b7982m6069A7756L82376a26021A78286K9549m0024a39046M2783
17785i6263C41339h6851j21423A04759a14525l43A01649a27624l02950G515N3729
17774F1244a16702C62401A07946b1890j53420n9602L2084B73297a28449o685d0084
17762g4613C34741a16817C8304a4134G720b05824Q7622a1269q4472p1032r9899
17751b66672m6495D47227h6818d0623A5398J49427C2662j5369M28818A2115K59268
17740B71383n8160h7121m3620l3734G7513a00930P249C11205a250j22393A6842
$$ plain form
17728 13696 244106 -12728 49098 -194006 -126556 -30558 219015 -114340 -224958 59239 29657
17717 29657 70182 34620 327618 -321399 35904 -39439 -205457 -79443 115894 458022 24676
17705 143422 224749 20891 -106742 168746 -231629 186239 145278 42260 -103558 -80874
17695 -80874 -35138 93374 -47143 132797 17977 -373799 209099 -7863 -72253 -246609 -155742
17684 -155742 146918 -205516 -112738 -184540 -59034 -33736 -10806 39085 -77414 99299 55579
17673 55579 40013 -130946 219020 234904 90013 -32063 -51857 140994 -8394 269951 192521
17662 192521 -109147 -197544 85354 -196026 -206767 -198283 -209413 -275653 -384406 60826 -2763
17650 81490 12796 -135109 -20985 391227 43387 -151354 -275111 145920 210340 -310640
$$ packed form
17728A3696K30410a2728D9098a94006O7450c0558B19015a14340j10618E9239k9582
17717B9657M0525C4620K92998c21399C5904c9439j66018g9443A15894L42128B4676
17705A43422Q1327B0891a06742A68746b31629A86239m0961D2260a03558K2684
17695h0874c5138I3374d7143A32797A7977c73799B09099g863o4390j74356R0867
17684a55742A46918b05516R2778p1802e9034K5298a0806C9085g7414I9299m3720
17673E5579j5566a30946B19020J5884I0013c2063j9794A40994h394B69951p7430
17662A92521a09147q8397H5354a96026j0741Q484j1130o6240j08753F0826b763
17650H1490A2796a35109b0985C91227D3387a51354j23757A45920O4420c10640
$$ plain form
17639 22308 -103604 -263158 29026 329036 -42711 -330479 65776 34888 -93753 -47328 -114531
17628 -114531 199649 -79291 94654 11367 41533 289225 224570 -78046 183905 84426 -64020
17616 122803 40762 135641 -248629 -58282 -29448 -153120 -260331 152527 228541 85646 -127800
17604 14446 227449 36747 267912 43959 151387 -216630 246255 -9311 19910 -103932 307332
17592 -149526 -79582 140355 83036 74817 -32303 45570 321849 168414 -26558 -85421 -198086
17581 -198086 93254 -304948 46220 11002 81894 -188431 2582 -181847 -3885 302801 164536
17570 164536 245210 -177725 184687 241802 -37016 -176823 -121203 67414 -121215 -94029 191509
17558 -39583 -17688 -78804 297593 -22023 -9854 -10238 -256076 80107 254877 -3010 -480498 158893
$$ packed form
17639B2308a03604j59554B9026L00010d2711k87768F5776l0888i3753M6425o7203
17628a14531A99649g9291I4654A1367L0166K47692o4655g8046A83905H4426f4020
17616A22803D0762R4879b48629e8282K8834j23672j07211A52527P6014H5646a27800
17604A4446K13003C6747K31165D3959J07428b16630B46255i311A9910a03932C07332
17592a49526O9944A40355n7319q219c2303D5570K76279j53435b6558n8863j12665
17581a98086I3254c04948D6220A1002P0892a88431B582a81847c885C02801j38265
17570A64536Q0674a77725A84687N7115c7016j39807N5620F7414a21215K7186A91509
17558c9583a7688o1116B97593b2023i854l84k45838H0107J74770c010m77488A58893
$$ plain form
17545 -217859 -119364 -222955 146863 223606 77343 93768 -111930 181210 -108029 -264624
17535 -264624 52774 163530 82442 99288 295129 225945 164442 137458 112825 -47038 34200
17523 26255 58068 218359 -92930 -10866 -13212 132370 -124438 128927 -6254 193798 -100176
17511 295418 -13779 407888 54768 136272 59398 159770 -74438 -34731 2968 133586 175858
17500 175858 458161 -127739 299646 151420 23212 26810 41054 -398558 378601 55675
17489 183589 74427 149195 -1875 31836 -366167 -94590 11233 -145109 -35633 36142 -110454
17477 391977 -113997 -266971 109449 206132 80278 290926 -155103 179128 128535 -137306
17466 249923 491239 97482 32217 40618 314157 -16038 65056 -33294 67567 87636 4151
$$ packed form
17545b17859R8495j03591A46863P6743G7343J6425a11930A81210a08029j56595
17535b64624E2774J10756q1088J6846J95841o9184o1503k6984k4633d7038C4200
17523B6255L1813J60291i2930a0866k346A32370a24438A28927f254A93798a00176
17511B95418a3779D07888E4768Q1504E9398J00372g4438c4731B968J30618M2272
17500A75858K82303a27739B99646j48226B3212L598J4244c98558C78601E5675
17489A83589G4427P4768a875C1836c66167i4590A1233a45109c5633C6142a10454
17477C91977a13997j52974A09449R6683H0278K10648a55103A79128n0593a37306
17466B49923K41316I7482C2217Q401K73539a6038F5056c3294F7567K0069D151
$$ plain form
17454 -300981 30593 -102754 113050 179018 -55170 229657 339611 443518 97962 353523
17444 353523 334846 95366 244273 438555 227058 300592 650531 623514 513493 212461
17433 478243 386987 415765 113150 25200 366785 49708 -124477 584164 207275 180178
17423 180178 316221 565094 132354 181015 158614 268466 -154538 152711 480074 370549
17413 370549 128661 448855 324386 554398 447631 333322 15780 311286 99816 -13422
17402 144730 132961 197544 482551 -68928 52034 241290 6249 223277 -124051 158364 484740
17391 484740 55752 178805 10731 292911 58228 226987 206887 266381 182183 108994 192142
17380 192142 243970 -121026 364930 265451 -22756 337346 82615 -70281 256209 83384 159773
$$ packed form
17454c00981C0593a02754A13050O5968e5170B29657J09954J03907I7962K55561
17444C53523j8677I5366J48907J94282k11497P3534L49939k7017j10021B12461
17433D78243r1256K8778A13150B5200L41585D9708a24477E84164B07275k7097
17423A80178J36043K48873A32354M8661k2401J09852a54538A52711L27363j09525
17413C70549A28661L20194j24469K30012j06767j14309A5780K95506I9816a3422
17402A44730j1769O4583K85007f8928E2034J89256F249K17028a24051A58364L26376
17391D84740E5752J23053A0731K82180E8228J68759k0100N9494q4198p3189Q3148
17380A92142N1828a21026C64930r9479b2756C37346H2615g0281B56209H3384P6389
$$ plain form
17369 159773 327497 189179 81564 167096 -202014 78094 10276 11774 567695 22502 -99437
17357 146345 -7907 130511 -79366 267421 72126 13651 429829 182423 131671 365816 190410
17346 190410 -43597 233556 8783 160662 -22133 165235 5351 415921 400858 52070 224606
17335 224606 197127 -14695 8770 94491 16949 373948 17191 212015 182378 -58761 19546
17323 257515 334876 5624 -211014 -6843 296957 207549 647913 77357 305491 291696 -43013
17311 -8406 301011 123267 -11504 -253994 -187925 275752 43274 150042 243458 447706 300201
17300 300201 401648 156224 87925 193726 66186 21181 39994 103281 5883 187789 256250
17289 256250 67046 -76704 -203388 169983 236593 288082 -20689 334633 182400 -139350
$$ packed form
17369A59773J67724j38318H1564Q5532b02014G8094A0276J498N55921B2502i9437
17357A46345g907A30511g9366B67421G2126A3651M16178A82423n0752K34145j75406
17346A90410d3597B33556H783J51879b2133A65235E351M10570j5063E2070J72536
17335B24606k7479a4695H770Q5721A6949L56999A7191J94824k9637e8761A9546
17323B57515P7361E624b11014f843B96957q9408M40364G7357K28134j3795d3013
17311h406C01011A23267a1504k42490O6069B75752D3274J06768R3416K04248j47505
17300C00201J01447A56224o8299J05801F6186B1181J8813O3287E883J81906O8461
17289B56250F7046g6704j26684A69983O6610N1489b0689C34633j52233a39350
$$ plain form
17278 -35551 216632 193726 373788 -158520 363930 -130175 165835 340230 -105046 224652
17267 169188 21384 202244 537372 298481 181803 79042 718557 39102 -27562 328813
17256 116158 203518 309584 341279 158093 376211 38236 240074 181505 44903 278557
17246 278557 -124237 388985 361797 283742 -163940 310467 398936 444991 357438 79210 573705
17235 573705 37881 -61385 472752 456609 157422 -299026 291945 48989 105173 22267 218335
17224 218335 114321 87604 356350 -72640 75193 249889 67773 -67313 -295201 281200
17213 -61973 89079 437805 32986 32606 79209 14177 152924 242631 64317 -188279 388088
17201 186344 442694 249996 513606 144411 377012 160981 439858 148097 304039 66323
$$ packed form
17278c5551B16632k2906J80062a58520C63930a30175A65835J74395a05046B24652
17267A69188B1384J80860L35128k38891j16678G9042O39515C9102b7562C28813
17256A16158Q7360J06066L1695A58093K18118C8236K01838n8569D4903K33654
17246B78557a24237C88985k7188p8055a63940C10467Q8469M6055q7553G9210M94495
17235E73705C7881f1385D72752j6143A57422b99026B91945D8989N6184B2267J96068
17224B18335j04014k6717K68746g2640G5193J74696F7773f7313k27888B81200
17213f1973H9079L48726C2986l80M6603A4177J38747Q9707F4317a88279C88088
17201A86344K56350j92698K63610A44411K32601A60981K78877A48097J55942F6323
$$ plain form
17190 119868 373577 293010 -65134 265759 39887 10006 153554 410574 154635 723499
17180 723499 16799 72912 30590 480427 236611 309499 363180 324878 -200172 127679 17066
17168 589646 308075 204024 271173 -24785 -115422 20192 150484 98635 -226669 204251
17157 458395 280777 254390 205124 421907 195688 149419 553678 315139 83865 148262
17147 148262 312169 215724 700762 275609 191850 -41604 359941 145398 369550 858589
17137 858589 374593 361065 250880 572550 343728 590657 349290 441138 146991 -52631
17126 71555 587533 339102 179532 63662 567118 133609 519970 342702 427155 274599
17116 274599 281312 641885 243089 162490 574400 382261 340925 193893 312576 273765
$$ packed form
17190A19868K53709q0567f5134B65759C9887A0006J43548K57020A54635N68864
17180G23499A6799N6113C0590M49837B36611P2888N3681l8302b00172A27679A7066
17168E89646k81571j04051O7149b4785r0637B0192J30292n1849b26669B04251
17157D58395j77618k6387m9266K16783A95688m6269M04259k38539H3865O4397
17147A48262J63907r6445M85038B75609q3759d1604C59941A45398K24152M89039
17137H58589C74593j3528j10185L21670k28822K46929k41367R1848A46991e2631
17126G1555N15978k48431j59570F3662N03456A33609L86361j77268Q4453j52556
17116B74599O713L60573B43089q0599M11910j92139m1336j47032J18683l8811
$$ plain form
17106 273765 171121 182826 270230 185643 389363 379245 199592 434141 498034 426712 510289
17095 510289 184683 785177 251208 219627 511811 416739 525875 350852 390790 512776
17085 512776 409422 171553 261756 591240 244314 228591 598444 379836 509818 267363
17075 267363 317886 200112 419753 311581 373515 570252 499458 334429 677923 302290
17064 319869 486840 529443 560129 271566 355247 550533 471056 670730 482203 396453
17054 396453 849704 466222 677920 649748 377839 575606 869251 383176 287877 431404
17044 431404 498975 423821 722059 602518 443901 449476 666882 809715 382114 480788
17034 480788 438127 733392 458360 682837 411299 357492 742731 373067 613117 791244
$$ packed form
17106B73765j02644J1705Q7404q4587K03720j0118j79653K34549O3893p1322Q3577
17095E10289A84683O00494B51208l1581K92184r5072J09136j75023L9938J21986
17085E12776j03354A71553R0203L29484B44314j5723L69853k18608J29982k42455
17075B67363N0523j17774K19641j08172O1934J96737p0794j65029L43494C02290
17064C19869J66971M2603L0686B71566Q3681J95286p9477J99674j88527q5750
17054C96453M53251l83482K11698k8172k71909J97767K93645C83176r5299J43527
17044D31404O7571p5154K98238j19541j58617N575K17406J42833C82114R8674
17034D80788m2661K95265k75032K24477k71538n3807L85239l69664K40050J78127
$$ plain form
17024 791244 550399 714652 391847 419332 649188 230820 600307 346486 479475 638256
17014 638256 556890 537467 741408 837261 808293 718638 945248 700004 371853 534096
17004 534096 1046289 632632 717470 812181 879867 605778 853019 693341 778822 493767
16994 493767 777428 966851 805374 983535 559279 278104 627450 995530 834979 718664
16984 718664 673288 994208 497753 831001 633110 836526 984395 853518 751670 812369
16974 812369 952008 741071 732462 918605 948681 617855 799886 930815 898993 845275
16964 845275 877868 916477 768906 990555 950849 925708 1113870 1122533 870474 1002197 988907
16953 988907 804404 845652 1174781 900261 717281 833135 1144458 1148556 775831 1258609
$$ packed form
17024G91244k40845J64253l22805K7485K29856B30820L69487k53821J32989J58781
17014F38256q1366j9423K03941R5853k8968q9655K26610k45244l28151J62243
17004E34096N12193m13657Q4838R4711O7686k74089K47241j59678Q5481k85055
16994D93767K83661J89423j61477J78161m24256B78104L49346L68080j60551j16315
16984G18664m5376L20920m96455L33248j97891K03416J47869j30877j01848O0699
16974H12369J39639k10937q609J86143L0076l30826J82031J30929l1822n3718
16964H45275L2593L8609j47571K21649l9706k5141J88162Q663k52059J31723j3290
16953I88907j84503M1248L29129k74520j82980J15854L11323M098l72725M82778
$$ plain form
16943 1258609 1079774 911606 1148917 1084726 962397 1084413 1046260 980496 1020873 1171866
16933 1171866 1018228 1045378 865822 1033776 1003380 1293409 1180096 1170234 1056809 1324014
16923 1324014 1419707 1298343 1103746 1009220 1378806 1207899 1133850 1426911 1154555 1309589
16913 1309589 1281668 1598060 1568737 1464849 1339902 1455235 1470883 1777717 1688682 1541789
16903 1541789 1652868 1674602 1411218 1644013 1266601 1701338 1592909 1739792 1691727 1654444
16893 1654444 1966064 1487923 1571815 1511804 1383414 2014409 1686550 1770706 2139908 1955194
16883 1955194 2075867 1893874 1916050 2107804 1832312 1938296 2263829 2223371 2070004 2291733
16873 2291733 2077014 2477625 2071136 2275418 2308205 2929963 2453134 2549507 2401996 2320482
$$ packed form
16943A258609j78835j68168K37311o4191j22329J22016l8153o5764M0377J50993
16933A171866j53638K7150j79556J67954l0396K90029j13313r862j13425K67205
16923A324014R5693j21364j94597r4526L69586j70907p4049K93061k72356J55034
16913A309589k7921L16392k9323j03888j24947J15333J5648L06834q9035j46893
16903A541789J11079K1734k63384K32795l77412M34737j08429J46883m8065l7283
16893A654444L11620m78141Q3892o0011j28390O30995l27859Q4156L69202j84714
16883A955194J20673j81993K2176J91754k75492J05984L25533m0458j53367K21729
16873B291733k14719M00611m06489K04282L2787O21758m76829R6373j47511q1514
$$ plain form
16863 2320482 2592681 2513264 2592277 2576950 2653622 2810337 2620910 2742513 2511546 2827625
16853 2827625 2771377 2709314 2840696 3371427 3446477 3205108 3619681 3178092 3268466 3152047
16843 3152047 3330587 3290145 3486770 3752919 3457849 3524885 3580348 3803179 3916549 3537410
16833 3537410 3916678 3851189 4051872 4147956 4090375 4136472 4268347 4250343 4648387 4719604
16823 4719604 4484221 4830950 4747320 4694698 5536316 5128115 5446868 5409286 5499469 5625409
16813 5625409 5756070 5482179 6004972 6248805 6342411 6518906 6030152 6528577 6724602 6554398
16803 6554398 7084079 7325341 7271605 7769939 7591803 7991745 8085664 8315534 8596065 8665096
16793 8665096 9156086 9087118 9472061 9439522 9647139 10211828 10079684 10835881 11167924 11289017
$$ packed form
16863B320482K72199p9417P9013j5327P6672J56715j89427J21603k30967L16079
16853B827625n6248o2063J31382N30731P5050k41369M14573m41589R0374j16419
16843C152047J78540m0442J96625K66149k95070O7036N5463K22831J13370l79139
16833C537410L79268o5489K00683R6084n7581M6097J31875j8004L98044P1217
16823D719604k35383L46729q3630n2622Q41618m08201L18753l7582R0183J25940
16813E625409J30661k73891N22793K43833R3606J76495m88754M98425J96025j70204
16803F554398N29681K41262n3736M98334j78136L99942R3919K29870K80531O9031
16793H665096M90990o8968L84943l2539K07617N64689j32144P56197L32043J21093
$$ plain form
16783 11289017 11653399 11988395 11964594 12800299 13270741 13425943 13954095 14251224 14657326
16774 14657326 15018386 15560994 16369329 16964661 17366106 17838402 18777361 19437887 20134467
16765 20134467 21143489 21729864 22338749 23119175 24806836 25234068 26566170 27533477 29038785
16756 29038785 30238062 31614237 33294792 34106453 35949051 38042668 39765849 41956756
16748 41956756 43875332 46157682 48692263 51366678 54162897 57460045 60695598 64144323
16740 64144323 68115560 72140740 76754333 81870837 86687305 92072808 97955620 104055537
16732 104055537 110746215 117669752 124736516 132513751 140038128 148297551 155993379 163699235
16724 163699235 170893598 177811501 183883190 188982816 193003792 196050913 197928665 197897309
$$ packed form
16783A1289017L64382L34996k3801Q35705M70442J55202N28152K97129M06102
16774A4657326L61060N42608Q08335N95332M01445M72296R38959O60526O96580
16765B0134467J009022N86375O08885P80426J687661M27232J332102R67307J505308
16756B9038785J199277J376175J680555Q11661J842598K093617J723181K190907
16748D1956756J918576K282350K534581K674415K796219L297148L235553L448725
16740F4144323L971237M025180M613593N116504M816468N385503N882812O099917
16732A04055537O690678O923537P066764P777235P524377Q259423P695828P705856
16724A63699235P194363O917903O071689N099626M020976L047121J877752l1356
$$ plain form
16716 197897309 196772808 194297054 190629031 186033360 179991256 173466128 165912761 159064874
16708 159064874 150787361 142956201 135181931 127312914 119908014 112531752 105785794 99379502
16700 99379502 93042568 87593958 82054948 77038802 72498935 67850988 64314945 60717896
16692 60717896 57225346 53854556 50898418 47844140 45567762 42916179 40914411 39059384
16684 39059384 36839705 35255398 33326440 31980829 30276035 28874957 27636466 26751558
16676 26751558 25198162 24399766 23248638 22373694 21102969 20606490 19791136 19136407 18512830
16667 18512830 17437274 16976128 16544093 15834155 15150486 14588687 14385897 13552314 13344321
16658 13344321 13221856 12439376 12027688 11650913 11476112 11275722 10861976 10103976 10147178
$$ packed form
16716A97897309j124501k475754l668023m595671o042104o525128p553367o847887
16708A59064874q277513p831160p774270p869017p404900p376262o745958o406292
16700I9379502o336934n448610n539010n016146m539867m647947l536043l597049
16692F0717896l492550l370790k956138l054278k276378k651583k001768j855027
16684C9059384k219679j584307j928958j345611j704794j401078j238491q84908
16676B6751558j553396p98396j151128q74944j270725m96479q15354o54729o23577
16667A8512830j075556m61146m32035p09938o83669n61799k02790q33583k07993
16658A3344321j22465p82480m11688l76775j74801k00390m13746p58000M3202
$$ plain form
16649 10147178 9904567 9790785 9284930 9186771 8609620 8331512 8431458 8179448 7813714 7892950
16639 7892950 7142489 7599073 6839936 6523774 7025186 6536148 6465604 6066584 5891389 5827722
16629 5827722 6140464 5627678 5565340 5456621 5630954 5176824 4809894 5117403 4855112 5007343
16619 5007343 4485827 4742417 4257356 4756339 4147242 4538571 3846162 4336474 4341448 3678812
16609 3678812 4017672 3546975 3372117 3506230 3536950 3865930 3378522 3375720 3396748 2894511
16599 2894511 3205529 3067412 2905168 2973438 3143325 2525701 2888782 2806779 2876761 2846447
16589 2846447 2845437 2471850 2669737 2448182 2862261 2350082 2383971 2574917 2263552 2714777
16579 2714777 2094158 2258253 2528604 2043734 1926544 2234854 2015787 1994697 1741003 2272653
$$ packed form
16649A0147178k42611j13782n05855r8159n77151k78108R9946k52010l65734P9236
16639G892950p50461M56584p59137l16162N01412m89038p0544l99020j75195o3667
16629E827722L12742n12786o2338j08719J74333m54130l66930L07509k62291J52231
16619E007343n21516K56590m85061M98983o09097L91329o92409M90312M974o62636
16609C678812L38860m70697j74858J34113L0720L28980m87408k802K1028n02237
16599B894511L11018j38117j62244O8270J69887o17624L63081q2003O9982l0314
16589B846447j010l73587J97887k21555M14079n12179L3889J90946l11365M51225
16579B714777o20619J64095K70351m84870j17190L08310k19067k1090k53694N31650
$$ plain form
16569 2272653 2132028 2050748 1863437 1727387 1956950 1715368 1673992 1669521 1645602 1454819
16559 1454819 1930616 1864208 1656433 1550917 1436370 1464594 1656955 1739967 1498692 1675932
16549 1675932 1525559 1266572 1652123 1453182 1547721 1567178 1418071 1412000 1631730 1259268
16539 1259268 1359040 1567826 853256 1067384 1203610 1229218 1006553 1068794 1341523 1507727
16529 1507727 1321033 1063428 1470571 1010555 1045257 964883 825422 1025410 1113000 1287088
16519 1287088 740045 1017827 427102 982600 1383417 1105973 1224598 1095647 949661
16510 949661 1183928 1135519 791597 1145532 835931 1350568 1023870 660828 568877 780526
16500 780526 714733 929712 554366 732412 913091 818052 877061 821090 778287 808428 900769
$$ packed form
16569B272653j40625q1280j87311j36050K29563k41582m1376m471k3919j90783
16559A454819M75797o6408k07775j05516j14547K8224J92361Q3012k41275J77240
16549A675932j50373k58987L85551j98941R4539J9457j49107o071K19730l72462
16539A259268R9772K08786p14570K14128J36226K5608k22665O2241K72729J66204
16529A507727j86694k57605M07143m60016L4702q0374j39461J99988Q7590J74088
16519A287088n47043K77782D27102N55498M00817k77444J18625j28951j45986
16510I49661K34267m8409l43922L53935l09601N14637l26698l63042r1951K11649
16500G80526o5793K14979l75346J78046J80679r5039N9009n5971m2803L0141R2341
$$ plain form
16489 900769 778363 754214 966685 1078904 973792 615890 649598 858385 561524 516860
16479 516860 655113 516850 544499 921127 751040 789657 534312 470969 794173 613670
16469 613670 737007 342431 897305 536657 597247 606249 389892 665189 770299 870307
16459 870307 431010 363315 920144 383299 549581 521861 652929 596264 600432 357095
16449 357095 671670 485338 624949 523600 712620 807026 778210 493078 579064 562187
16439 562187 142718 147283 634721 732831 443778 440383 482325 667561 238604 407071 549056
16428 549056 475544 500180 645287 227683 480812 275557 426117 117912 345654 398746
16418 398746 459750 344872 353165 379844 635565 509859 255224 636701 -103075 595252
$$ packed form
16489I00769j22406k4149K12471J12219j05112l57902L3708K08787k96861m4664
16479E16860J38253j38263K7649L76628j70087L8617k55345o3343L23204j80503
16469F13670J23337C42431N54874l60648O0590R002k16357K75297J05110J00008
16459H70307D31010o7695N56829C83299J66282k7720J31068n6665M168k43337
16449C57095L14575j86332J39611j01349J89020R4406k8816k85132Q5986j6877
16439E62187A42718M565M87438R8110k89053l395M1942J85236B38604J68467J41985
16428E49056p3512K4636J45107B27683K53129k05255J50560A17912K27742N3092
16418C98746O1004j14878Q293K6679K55721j25706k54635L81477a03075E95252
$$ plain form
16407 402647 358852 520971 307537 295672 265064 285377 18308 243912 85115 324472 72564
16395 185140 245107 499507 449156 284478 133431 642741 297862 259802 462678 317912
16385 317912 95623 180974 11876 48854 40174 478807 80429 118864 252268 386235 299504
16374 299504 119300 319145 559980 496531 492217 214010 442919 255808 336619 230635
16364 230635 230620 336834 199137 510692 81471 405681 535053 299340 63757 497442 52514
16352 186251 122082 380453 107196 656651 76197 596901 -29249 74024 66878 166353 327155
16341 327155 239979 170615 283104 236074 145614 68129 105699 149824 161679 338561 194718
16330 194718 79407 145445 -4489 526818 54029 372344 68662 207604 137553 -187858 310177
$$ packed form
16407D02647m3795J62119k13434j1865l0608K0313A8308K25604H5115K39357G2564
16395A85140N9967K54400n0351j64678A33431N09310B97862l8060K02876j44766
16385C17912I5623Q5351A1876L6978q680M38633H0429L8435J33404J33967q6731
16374B99504A19300J99845K40835o3449m314B14010K28909j87111Q0811j05984
16364B30635j5J06214j37697L11555H1471L24210J29372k35713F3757M33685E2514
16352A86251o4169K58371A07196N49455G6197N20704b9249G4024p146R9475J60802
16341C27155q7176o9364J12489m7030r0460F8129L7570M4125J1855J76882j43843
16330A94718G9407O6038d489E26818E4029L18315F8662J38942p0051a87858C10177
$$ plain form
16318 315886 154555 35367 88311 347954 463753 341503 365478 86751 87623 537236 174914
16306 110626 272943 421321 140791 428647 474064 349072 443008 234551 -181078 315246
16295 174945 344145 17605 239109 282536 157639 105022 21207 525641 -165098 38759
16284 380950 -158948 158579 299741 190138 51217 272839 74281 261168 428031 -351275
16273 323972 -102050 148464 -532496 75278 95410 123627 321347 -8931 54103 16244 183254
16262 183254 -19809 -59402 135063 32388 128022 -60889 621277 172792 -4229 333236 13362
16250 174772 307575 336649 31084 -181390 191371 -215567 104138 76709 89591 105152
16240 105152 387711 91053 82046 75475 3459 291221 379774 234941 134112 85673 -21891
$$ packed form
16318C15886A54555C5367N2944K59643J15799j22250K3975H6751Q72M49613A74914
16306A10626J62317J48378A40791K87856M5417j24992R3936k08457a81078C15246
16295A74945J69200A7605K21504M3427j24897n2617B1207N04434a65098C8759
16284C80950a58948A58579J41162j09603E1217K21622G4281J86887J66863c51275
16273C23972a02050A48464e32496G5278K0132K8217J97720h931E4103A6244J67010
16262A83254a9809l9593A35063C2388R5634f0889F21277A72792d229C33236A3362
16250A74772J32803K9074C1084a81390A91371b15567A04138k7429J2882J5561
16240A05152K82559I1053r007o571C459K87762Q8553j44833j00829m8439b1891
$$ plain form
16228 -84314 262432 -200996 133273 70950 298905 27068 11726 -41577 88330 119853 -125083
16216 74992 -19107 269615 -129187 -179786 -152576 161740 7794 41552 35335 -52459 126833
16204 19441 108611 -41123 50248 49184 169357 -134370 24940 91915 53022 -76364 74656
16192 -44659 15036 95329 299584 464116 -135754 -72532 310362 562700 -79198 -147777 -8394
16180 48679 95803 45760 -66246 156698 75826 38293 86692 170233 43384 63979 -229541
16168 1708 116639 -51688 -193601 36484 -67520 30482 97769 -13375 90093 312761 117534
16156 27223 -266344 -139848 -80713 -224070 185978 30416 138071 -195856 -196237 -211418 38971
16144 22641 62749 260100 -283405 -73635 -12923 -78442 -195976 76380 -118020 84548 158294
$$ packed form
16228h4314B62432b00996A33273o2323K27955B7068A1726d1577H8330L1523a25083
16216G4992a9107B69615a29187n0599K7210A61740G794L3758o217e2459A26833
16204A9441Q9170d1123E0248j064J20173a34370B4940O6975l8893g6364G4656
16192d4659A5036Q0293K04255J64532a35754O3222C10362K52338g9198o8579h394
16180D8679M7124D5760f6246A56698G5826l7533M8399Q3541D3384K0595b29541
16168A708J14931e1688j41913C6484f7520C0482O7287a3375I0093K22668A17534
16156B7223b66344J26496N9135j43357A85978C0416J07655a95856l81j5181C8971
16144B2641M0108J97351b83405g3635a2923o5519j17534G6380a18020H4548P3746
$$ plain form
16133 158294 -9865 -94927 -72314 200391 401749 -332888 156444 400931 -285974 9944 137485
16122 137485 118128 -260118 -224369 -339969 -108772 -232986 137826 -49814 -36094 75721
16111 62808 167697 -47533 -207600 -133788 -321310 254182 -170139 174990 355312 -193114
16100 366300 188135 306853 23450 175310 -38047 52285 403287 267498 -65362 -214233
16090 -214233 -225703 -35355 331763 224629 -71920 -88207 -118393 -254484 6174 185875 -73936
16078 -63353 54901 -239792 164015 253523 -385949 180902 47876 -98258 -44430 -74422 329758
16066 283903 -72386 219178 -147416 -5394 -44270 189530 -189759 -108688 -149467 -215841 322533
16054 71194 169371 -15202 135499 -29823 -26951 -88588 314023 -34536 -14015 -12602 51144 62467
$$ packed form
16133A58294i865q5062K2613B00391K01358c32888A56444K44487b85974I944J27541
16122A37485j9357b60118L5749j15600a08772j24214A37826d9814J3720G5721
16111F2808J04889d7533j60067P3812j87522B54182a70139A74990J80322a93114
16100C66300j78165J18718B3450J51860c8047E2285L51002j35789f5362j48871
16090b14233j1470c5355C31763j07134g1920j6287l0186j36091F174J79701g3936
16078f3353E4901b39792A64015Q9508c85949A80902D7876i8258d4430k9992C29758
16066B83903g2386B19178a47416e394l8876A89530a89759Q1071m0779o6374C22533
16054G1194R8177a5202A35499b9823K872o1637C14023c4536a4015J413E1144J1323
$$ plain form
16042 62467 -104179 121626 6302 -86821 90791 22030 -160136 77850 59061 -307909 165412
16030 31444 -156527 -21814 -24205 198165 -132632 41319 159906 -145856 -53930 263242 -177930
16018 -67557 -26414 -226782 214538 244252 447893 -344686 150634 -48792 408970 234526
16008 234526 152302 -104428 126808 77320 -159870 -51418 501853 -167075 -233313 81832
15997 126551 275260 56264 142555 -61450 249255 23163 -123725 -110974 -104326 -17479 133220
15985 -90999 -208996 -165479 72494 -64329 146608 83133 297493 126605 107217 96341 121230
15974 121230 351501 -125297 6975 -186840 -39002 115262 72853 172343 40224 -123999 176408
15962 354242 260367 5211 304198 -72340 181446 -126481 -294205 15431 -135884 -28658 26587
$$ packed form
16042F2467a04179A21626F302h6821I0791B2030a60136G7850j8789c07909A65412
16030C1444a56527b1814k391A98165a32632D1319J18587a45856e3930B63242a77930
16018f7557b6414k00368B14538K9714K03641c44686A50634d8792D08970j74444
16008B34526q2224a04428A26808m9488a59870e1418E01853a67075o6238H1832
15997A26551J48709E6264Q6291f1450B49255B3163a23725J2751O648a7479A33220
15985i0999j17997M3517G2494f4329A46608o3475K14360A26605j9388j0876K4889
15974A21230K30271a25297F975a86840c9002A15262m2409R9490D0224a23999A76408
15962C54242r3875E211K98987g2340A81446a26481j67724A5431a35884b8658B6587
$$ plain form
15950 -132607 23322 93651 -28951 219600 -278873 28380 -258640 8931 -210473 188044 -255914
15938 -225730 259116 -90057 48568 -73976 -279208 167551 65664 -52365 320195 38303 89612
15927 89612 -202931 -23334 -19279 -136089 268598 -17417 22693 -267701 474988 -113018 -470135
15916 -470135 176016 -202017 -275151 -116942 -145971 -150837 23059 26387 -353261 68416 -211837
15904 -297663 -186993 47099 -49660 -66593 148948 -443049 130138 -145708 49987 5472 -149322
15892 -82857 96382 127231 -155856 -27632 -255330 -151407 -31401 252497 -174630 -52456 -43227
15881 -43227 -300402 102389 -220021 108818 -97718 72788 -4552 -210660 -199068 945 -136787
15869 7715 -91901 -79849 39583 4101 -303784 -149677 -238306 51528 -321731 -301954 -261286
$$ packed form
15950a32607B3322P0329b8951B19600b78873B8380b58640H931b10473A88044b55914
15938b25730B59116i0057D8568g3976k05232A67551F5664e2365C20195C8303N1309
15927H9612b02931b3334M055j16810B68598a7417B2693b67701D74988a13018l57117
15916d70135A76016b02017p3134a16942k9029m866B3059L328c53261F8416b11837
15904b97663J10670D7099d9660j6933A48948d43049A30138a45708D9987E472a49322
15892h2857I6382L0849a55856b7632k27698J03923c1401B52497a74630e2456R229
15881d3227k57175A02389b20021A08818i7718G2788d552k06108J1592I45a36787
15869G715i1901J2052C9583D101c03784a49677q8629E1528c21731J9777M0668
$$ plain form
15858 -261286 -97585 -174156 124806 168992 -64958 -250617 36605 -32656 382669 50698 -119809
15846 -43837 214935 -168735 -38270 66848 183559 29379 -218447 104952 102624 79858 -51049
15834 -63200 10858 -41138 127231 241749 -65435 14797 -116521 24736 -118433 51826 254856
15823 254856 -33348 -83043 151945 166901 -13362 260469 -142635 -94757 -192479 208525 246765
15812 246765 56599 -201045 69357 -234968 -74065 -21959 78766 -402192 -164581 19435 -192865
15800 -144904 33123 134985 98092 21499 -232503 -148421 -200331 -271650 53413 -108316 -146735
15789 -146735 -41961 200787 -112746 67654 -126635 -25222 -660986 110130 -102229 -159133
15779 -159133 7347 -250658 -31619 29677 -527686 -68891 121566 -46991 -79046 108432 127473
$$ packed form
15858b61286i7585p6571A24806M4186f4958j85659C6605c2656C82669E0698a19809
15846d3837B14935a68735c8270F6848J16711B9379b18447A04952k328k2766e1049
15834f3200A0858d1138A27231J14518f5435A4797a16521B4736a18433E1826K03030
15823B54856c3348m9695A51945J4956a3362B60469a42635M7878r7722B08525L8240
15812B46765E6599b01045F9357b34968g4065b1959G8766d02192a64581A9435a92865
15800a44904C3123J01862l6893B1499b32503Q4082n1910p1319E3413a08316l8419
15789a46735d1961B00787a12746F7654a26635b5222o35764A10130a02229n6904
15779a59133G347b50658c1619B9677e27686f8891A21566d6991l2055A08432J9041
$$ plain form
15768 127473 -219631 279579 -33894 -230725 60333 -68548 -234945 -3229 -235700 259528
15757 -7002 -18077 94631 252512 -61074 -180198 115473 447180 -216799 290172 588096
15747 588096 -126699 141331 153327 292968 269528 236495 -29017 48426 -56196 -261289 -30569
15735 -48501 52575 -52537 -211709 -58186 -316761 -66262 144769 190004 194649 -158850 6045
15723 -289686 -140082 -231030 -114270 -213222 -344429 -289438 200124 -164458 67100 -404865
15712 72908 -125035 11040 -109673 -114704 86979 -569493 -338811 -87339 -3431 153943 474959
15701 474959 -268192 41161 187329 -210162 341736 -229774 373762 -280122 133725 -195222
15690 229307 -349 129199 124494 -245555 154635 63730 -49959 -38703 355941 -195812 -411799
$$ packed form
15768A27473b19631B79579c3894j96831F0333f8548j66397c229k32471B59528
15757g002j1075I4631J57881f1074j19124A15473L31707b16799B90172K97924
15747E88096a26699A41331J1996J39641k3440l3033b9017D8426e6196k05093c0569
15735d8501E2575e2537j59172e8186k58575f6262A44769M5235M645a58850F045
15723b89686a40082r0948a14270r8952j31207N4991B00124a64458F7100d04865
15712G2908a25035A1040a09673n031H6979e69493K30682h7339c431A53943L21016
15701D74959b68192D1161J46168b10162C41736b29774C73762b80122A33725a95222
15690B29307c49A29199m705b45555A54635F3730d9959J1256C55941a95812k15987
$$ plain form
15679 -411799 35113 -105831 278564 237768 -38947 8124 160586 19914 206430 272821 184289
15668 184289 250355 265217 -157566 76275 -74587 -242697 177237 -244016 -25970 -63865 -24204
15656 -70692 -208942 252195 132684 -241267 91949 -304556 -30665 44572 -77784 -84466 -291822
15645 -291822 -169646 -9036 -51132 -2981 -459179 119518 303879 286373 196481 -398217 223393
15633 -46248 -220195 44152 -16659 45698 -180461 -83693 -399808 -28312 172404 194040 89458
15621 -299810 212339 -27535 296424 -316381 -209697 118090 57489 -12390 -377259 -224049
15611 -224049 96423 -170622 -268602 -327562 -62569 -149570 -119317 124798 -309321 58439 -217008
15599 -343235 -98320 -110455 -37429 -70988 -31232 -61049 -381565 -282882 152658 -84001 66205
$$ packed form
15679d11799C5113a05831B78564m0796c8947H124J52462A9914J86516O6391q8532
15668A84289O6066J4862a57566G6275g4587j68110A77237b44016b5970l7895b4204
15656g0692j38250B52195j19511b41267I1949c04556c0665D4572g7784o682k07356
15645b91822J22176i036m2096b981m56198A19518J84361j7506q9892c98217B23393
15633d6248j73947D4152a6659D5698a80461h3693l16115b8312A72404K1636H9458
15621b99810B12339b7535B96424c16381J06684A18090E7489a2390l64869J53210
15611b24049I6423a70622r7980n8960f2569q7001L0253A24798c09321E8439b17008
15599c43235i8320j2135c7429l3559c1232k9817l20516R8683A52658h4001F6205
$$ plain form
15587 145675 -99954 -276495 -31222 -83074 164658 -176939 -13084 -370336 -272373 -126639
15576 -22600 -71112 270768 -134287 -127376 -60922 53961 176809 48506 216053 -55327 -77052
15565 -77052 -80065 -6122 -239191 -124280 236141 -43731 9540 39695 -78005 295239 -457626
15553 80673 102529 76646 422287 79661 119264 -135988 -77347 -258671 83399 -97248 77538
15541 55371 -65331 -225948 -167931 174981 43205 129670 103314 -38116 24441 86423 -193157
15529 141209 274472 -56861 -348858 -177217 178696 85410 -127406 -3837 -22694 -33070 66717
15517 -85735 814 290309 166990 86689 334382 -211485 159977 -330934 205693 33666 -409110
15505 287294 15278 -207277 2527 170726 -145563 60126 -81507 390644 206178 -70409 366313
$$ packed form
15587A45675i9954j76541c1222n1852A64658a76939a3084l57252R7963a26639
15576b2600m8512B70768a34287O911f0922E3961J22848D8506J67547e5327k1725
15565g7052l013f122k33069J14911B36141d3731I540L0155g8005B95239d57626
15553H0673K1856k5883L45641G9661L9603a35988N8641j81324H3399i7248G7538
15541E5371f5331j60617N8017A74981D3205Q6465k6356c8116B4441O1982a93157
15529A41209J33263e6861k91997J71641A78696H5410a27406c837j8857j0376F6717
15517h5735H14K89495j23319q0301K47693b11485A59977c30934B05693C3666d09110
15505B87294A5278b07277B527J68199a45563F0126h1507C90644j84466g0409C66313
$$ plain form
15493 22912 -27670 315917 82518 238680 -266691 -37745 83366 128279 -225754 -184312 -132530
15482 -132530 -125496 115774 -102363 162786 288903 31549 18954 -142671 -336087 -166702
15471 397681 -123731 -120167 109187 -185793 -150880 224381 -12179 -223949 -292176 101096
15460 -4319 19029 185148 159912 192243 184693 -77154 332248 -67965 224881 127282 -18558
15448 -7708 96749 -174221 68720 139165 234173 -62014 -209977 -224349 78814 -99537 5394 170992
15436 170992 -72216 -61492 118774 73599 393913 201729 102519 75255 267761 11954 99106
15425 99106 -65690 -18742 159238 -295207 -221929 -30854 -189427 123612 -93255 -48993 -365711
15414 -365711 15668 95477 -232930 -19834 222678 -189333 -55238 -404214 38052 41394 -115485
$$ packed form
15493B2912b7670C15917H2518J56162b66691c7745H3366M4913b25754M1442N1782
15482a32530P034A15774a02363A62786J26117C1549j2595a42671j93416a66702
15471C97681a23731L564A09187a85793L4913B24381a2179k11770o8227A01096
15460d319A9029J66119k5236L2331p550g7154C32248f7965B24881r7599a8558
15448g708I6749a74221F8720P0445R5008f2014j47963j4372G8814i9537E394J65598
15436A70992g2216J0724A18774m5175L20314j92184r9210k7264J92506A1954Q7152
15425I9106f5690a8742A59238b95207P3278c0854j58573A23612i3255M4262l16718
15414c65711A5668P9809b32930a9834B22678a89333e5238l48976C8052L342a15485
$$ plain form
15402 167776 -10293 -63883 101502 174929 -10098 -272268 -86265 286256 183956 -185934
15391 79924 -276057 41448 122644 81176 -113779 -171882 51015 -149902 -205434 147066 -59024
15379 -113836 102697 179739 -286848 -284229 -434968 143450 -46353 -363823 19049 -185896
15368 66422 11934 -76362 -276819 -244905 -216486 112288 332195 196484 170323 -73939 354152
15356 344950 -17215 92647 78350 29436 -228669 -199579 222988 -92459 -267720 176251 108109
15345 108109 -365027 228753 101187 -65778 -107680 -96033 41953 -267327 288661 -86366
15334 42146 -94744 130183 -124525 -896 169465 177870 193312 -61932 -160272 35870 121661 77144
15322 77144 -90372 -42309 -129884 -326323 190514 -279778 -167301 -207864 251622 150045
$$ packed form
15402A67776a0293n3590A01502P3427a0098k62170h6265B86256j02300a85934
15391G9924b76057D1448Q1196m1468a13779n8103E1015a49902n5532A47066e9024
15379a13836A02697P7042b86848K619j50739A43450d6353l17470A9049a85896
15368F6422A1934g6362k00457L1914K8419A12288K19907j35711k6161g3939C54152
15356C44950a7215I2647j4297B9436b28669K9090B22988i2459j75261A76251o8142
15345A08109c65027B28753A01187f5778m1902J1647D1953b67327B88661h6366
15334D2146i4744A30183a24525h96A69465Q405J5442f1932r8340C5870Q5791m4517
15322G7144i0372d2309q7575j96439A90514b79778J12477m0563B51622j01577
$$ plain form
15312 150045 198668 -115970 112176 -126724 -196640 217444 -165984 244640 283710 292100
15302 292100 236965 -171706 63801 11376 79656 286079 -207579 273606 305304 335400 60994
15290 204913 205399 -84440 33099 -310445 86239 202107 232888 71726 142979 -100643 85684
15278 105773 -12486 317430 -402586 -227620 -30325 226233 -128778 17979 29423 98130
15268 98130 -13230 93638 -281428 -99380 157165 432504 134822 104733 -92409 -303241 142072
15256 236702 53436 253830 110962 32013 172363 66672 269830 309492 627344 950464
15246 950464 1448845 1411910 1357668 1415921 568511 -103596 23716 -43174 -182637 58591 -31565
15234 -186300 235563 -37566 314043 92254 -38967 13333 -425370 -63279 179227 -117883
$$ packed form
15312A50045M8623a15970A12176a26724o9916B17444a65984B44640L9070Q390
15302B92100n5135a71706F3801A1376O8280K06423b07579B73606L1698L0096F0994
15290B04913M86h4440C3099c10445H6239J15868L0781G1726P1253a00643H5684
15278A05773a2486C17430d02586J74966c0325B26233a28778A7979J1444O8707
15268I8130a3230I3638b81428i9380A57165K75339A34822l0089i2409k10832A42072
15256B36702E3436K00394A10962C2013J40350F6672K03158L9662L17852L23120
15246I50464M98381l6935n4242N8253E68511a03596B3716d3174j39463E8591c1565
15234a86300B35563c7566C14043I2254c8967A3333d25370f3279A79227a17883
$$ plain form
15223 206670 248098 -46940 -168131 73716 434047 191384 52119 -300049 29888 -111341
15212 -189751 85160 197671 -131 -142372 -44399 153807 256985 -143484 76489 402456 123769
15200 -461466 488921 191659 57157 -427360 20453 81220 -76241 15950 95773 173009 248857
15189 248857 315110 -127650 156292 107151 -36321 73148 171375 297826 406047 129229
15178 179474 253012 254345 29243 335169 113568 34596 304416 -43476 -209579 561051 5794
15166 63029 227798 124910 174381 123139 122376 -66318 275624 -188253 271375 250732 30049
15154 3633 217413 -122873 199399 159831 233200 -194244 -70031 171368 178522 110138 178637
15143 178637 149473 -158830 350844 331260 219469 217594 93964 -144547 199094 -73617 -52705
$$ packed form
15223B06670M1428d6940j21191G3716L60331A91384E2119c00049B9888a11341
15212a89751H5160J12511a31j42241d4399A53807J03178a43484G6489L25967A23769
15200d61466D88921A91659E7157d27360B0453O0767g6241A5950P9823P7236P5848
15189B48857O6253a27650A56292m9141c6321G3148R8227J26451J08221A29229
15178A79474P3538J333B9243L05926A13568C4596K69820d3476j66103E61051E794
15166F3029J64769j02888M9471n1242p63f6318B75624a88253B71375k0643C0049
15154C633K13780a22873A99399l9568P3369a94244g0031A71368P154o8384O8499
15143A78637k9164a58830C50844j9584j11791j875I3964a44547A99094g3617K0912
$$ plain form
15132 -52705 140335 125425 214431 -110959 195856 -340919 135527 290497 -32210 200034
15121 161419 137951 412115 109057 -257266 -50373 -146932 104362 -22446 488228 310634
15111 310634 281152 143320 231214 111309 -62604 233770 -30420 147118 54381 320872
15101 320872 91538 277459 -36821 -264217 -145549 99201 -113796 -168698 244550 -27816
15090 19208 425977 668540 15265 128065 171052 325625 161674 246413 -7106 157765 -11136
15078 41910 336106 484403 364157 -94843 252686 166279 74195 340722 287836 71981 88382
15067 88382 262677 -76731 -92601 -170000 276862 87810 281900 146129 13208 433826 -3984
15055 203187 257933 142386 69553 53765 226562 147673 339309 19942 -193160 -34398 296786
$$ packed form
15132e2705A40335j4910Q9006a10959A95856c40919A35527J54970c2210B00034
15121A61419k3468K74164A09057b57266e0373r6559A04362b2446D88228j77594
15111C10634k9482j37832Q7894A11309f2604B33770c0420A47118E4381K66491
15101C20872I1538J85921c6821k27396J18668I9201a13796n4902B44550b7816
15090A9208M06769K42563A5265J12800M2987J54573A61674Q4739g106A57765a1136
15078D1910K94196J48297j20246i4843B52686q6407G4195K66527n2886G1981J6401
15067H8382J74295g6731j5870p7399B76862H7810J94090j35771A3208M20618c984
15055B03187N4746j15547F9553j5788J72797p8889J91636A9942a93160c4398B96786
$$ plain form
15043 334071 189515 -301864 3005 -2385 298401 186629 34910 251045 143364 430173
15033 430173 150325 -154229 224792 370634 180752 7291 203881 -79783 58414 279837
15023 279837 8196 -69300 36094 167638 639148 37872 121832 220291 210578 307585 345007
15012 345007 328685 356763 165856 -175412 -78314 145239 284380 6551 416779 369407 265171
15001 265171 324894 523769 195161 141203 410486 3058 192996 15762 253429 -102503
14990 13847 14261 271188 253617 442341 189864 367848 336732 72381 179599 432111 -74305
14978 95209 114240 164729 450518 129505 209823 170359 63462 -54782 393638 6768 210763
14967 210763 531437 48622 279583 134953 198937 21354 213504 155785 -61997 419978
$$ packed form
15043C34071j44556c01864C005b385B98401j11772C4910K16135j07681K86809
15033D30173A50325a54229B24792J45842A80752G291J96590g9783E8414K21423
15023B79837H196f9300C6094J31544M71510C7872Q3960R8459r713R7007L7422
15012C45007j6322K8078A65856a75412g8314A45239J39141F551M10228m7372j04236
15001B65171N9723J98875A95161n3958K69283C058J89938A5762K37667a02503
14990A3847M14K56927j7571J88724A89864J77984l1116G2381J07218K52512g4305
14978I5209J9031N0489K85789A29505Q0318l9464F3462e4782C93638F768K03995
14967B10763L20674D8622K30961A34953O3984B1354J92150n7719f1997D19978
$$ plain form
14956 177212 -269881 153403 295705 246955 378747 55122 530153 -29734 206043 113633
14946 113633 88696 -104512 255950 351364 -186374 432309 199235 567768 57987 -48804
14935 245789 345676 285296 90360 438623 464157 -49213 160773 337563 323284 -29194 453282
14923 472913 112088 232434 73152 300424 362870 492115 716503 679777 201634 65665
14912 607973 271230 318081 373712 396627 220131 721079 351875 205954 276539 11744
14901 298007 290386 216626 199105 408332 854693 404482 23701 291116 365608 185485 622381
14890 622381 322344 495377 397477 202160 148906 174436 271056 307793 114769 290682
14880 290682 492320 392005 249195 -36413 632947 246438 320754 362651 323930 572665
$$ packed form
14956A77212b69881A53403J42302m8750J31792E5122M75031b9734B06043r2410
14946A13633k4937a04512B55950R5414a86374D32309A99235L68533E7987d8804
14935B45789R9887o0380I0360L48263K5534d9213A60773J76790j4279b9194D53282
14923D72913A12088J20346G3152K27272O2446J29245K24388l6726B01634F5665
14912F07973B71230M6851N5631K2915j76496N00948C51875j45921P0585A1744
14901B98007p621p3760j7521K09227M46361D04482B3701K67415P4492j80123M36896
14890F22381l00037J73033r7900j95317n3254K5530R6620L6737A14769J75913
14880B90682K01638j00315j42810c6413F32947B46438P4316M1897l8721K48735
$$ plain form
14870 572665 438814 527038 600247 728596 552848 472784 485005 491061 154377 191415 519073
14859 519073 459899 70556 454358 392853 301290 204865 323122 302487 127118 252287 435113
14848 435113 514406 428294 634607 233698 73492 223406 535678 614924 616362 321842 289036
14837 289036 469665 535287 504722 664968 159521 200882 428388 248002 367665 450480
14827 450480 279981 441448 439179 368333 555006 324982 640948 662390 593698 281065
14816 234890 245036 327727 523423 198531 526254 642990 406420 286986 560470 479921
14806 479921 328029 321438 662372 466816 550340 449351 403589 826977 647657 365000
14796 365000 444189 588202 352028 603003 456212 474965 488213 677935 736478 278467
$$ packed form
14870E72665j33851Q8224P3209J28349j75748q0064J2221O056A54377L7038L27658
14859E19073n9174G0556L83802o1505r1563r6425J18257k0635A27118J25169J82826
14848D35113P9293q6112K06313B33698G3492J49914L12272P9246J438k94520l2806
14837B89036J80629O5622l0565J60246A59521M1361K27506j80386J19663Q2815
14827D50480j70499J61467k269p0846J86673k30024L15966K1442o8692B81065
14816B34890J0146Q2691J95696A98531L27723J16736k36570j19434K73484q0549
14806D79921j51892o591L40934j95556Q3524j00989m5762M23388j79320k82657
14796C65000P9189J44013k36174K50975j46791J8753J3248J89722N8543B78467
$$ plain form
14785 689843 661434 346021 442954 405031 618775 634467 641824 825410 448699 155299 278622
14774 278622 682604 477404 528576 185682 263079 386359 330056 600661 538277 324812
14764 324812 575397 638929 385581 663037 312250 298545 636284 687567 651199 389066
14754 389066 977842 548882 371432 411603 648225 543876 684883 593341 550365 404347
14744 404347 1139943 662079 822585 375955 328263 811369 843319 569723 614095 708235
14734 708235 1142562 746649 403441 435320 494908 594991 699094 701351 721479 910457
14724 910457 797758 814490 648252 1126998 586609 644546 894179 773853 819984 659420
14714 659420 524359 541710 655511 255572 618532 664713 574701 871371 897003 533079
$$ packed form
14785F89843k8409l15413R6933l7923K13744J5692P357J83586l76711A55299J23323
14774B78622M03982k05200N1172A85682P7397J23280n6303K70605o2384k13465
14764C24812K50585O3532k53348K77456C12250j3705L37739N1283l6368k62133
14754C89066N88776m28960j77450M0171K36622j04349J41007r1542m2976j46018
14744D04347P35596m77864J60506C75955m7692M83106L1950k73596M4372R4140
14734G08235M34327l95913l43208L1879N9588J00083J04103K257K0128J88978
14724I10457j12699J6732j66238M78746n40389N7937K49633j20326M6131j60564
14714F59420j35061J7351J13801B55572L62960M6181r0012K96670K5632l63924
$$ plain form
14704 533079 912680 877251 1015571 735992 758097 1239707 1060988 784925 731851 847682
14694 847682 736139 818645 540901 735095 830730 904050 621297 931930 974147 915782
14684 915782 1044037 1236340 1057302 844911 1020214 1197808 984827 899975 898806 695526
14674 695526 620463 725350 836376 888719 866714 677048 1064554 920319 1148518 1199401
14664 1199401 710851 1236006 1094011 910471 836791 1103882 901422 1118992 1015676 1057620
14654 1057620 879883 1363888 1212666 920114 1297286 1256692 1333384 1227306 972267 1339178
14644 1339178 1219670 1085249 1104012 1133396 1268976 1201824 1120881 1244070 1361973 1015904
14634 1015904 1242339 1541636 651423 1170446 1002086 1183492 1287220 1061145 1253321
$$ packed form
14704E33079L79601l5429J38320k79579K2105M81610j78719k76063n3074J15831
14694H47682j11543Q2506k77744J94194R5635P3320k82753L10633M2217n8365
14684I15782J28255J92303j79038k12391J75303J77594k12981q4852j169k03280
14674F95526p5063J04887J11026N2343k2005j89666L87506j44235K28199N0883
14664A199401m88550N25155j41995j83540p3680K67091k02460K17570j03316M1944
14654A057620j77737M84005j51222k92552L77172m0594P6692j06078k55039L66911
14644A339178j19508j34421J8763K9384J35580o7152q0943J23189J17903l46069
14634A015904K26435K99297F51423N19023j68360J81406J03728k26075J92176
$$ plain form
14625 1253321 1231041 1301471 1277600 1206986 1175962 1428038 1299149 1282394 1278890 1259824 1433046
14614 1433046 1405337 1322435 1482215 1555306 1515534 1461072 1505474 1426322 1491859 1472479 1408925
14603 1408925 1670607 1632491 1684864 1373559 1329157 1366242 1849000 1290312 1534980 1480348
14593 1480348 1506530 1668113 1387210 1665834 1668956 1533302 1603553 1663399 1689816 1702602 1489774
14582 1489774 2186210 1640110 1698004 1757727 1978780 2065925 1875363 2091091 1983337 2238380
14572 2238380 1711538 2116140 1924506 2116723 2190954 2367798 2092240 2288286 1924461 2097284
14562 2097284 2452943 2306055 2525604 3032235 2648390 3000459 2737798 3066001 3397672
14553 3397672 3595558 3878147 4864750 7051991 11097545 15361974 20652395 31061198
$$ packed form
14625A253321k2280P0430k3871p0614l1024K52076j28889j6755l504j9066J73222
14614A433046k7709q2902J59780P3091l9772n4462M4402p9152O5537j9380o3554
14603A408925K61682l8116N2373l11305m4402L7085M82758n58688K44668n4632
14593A480348K6182J61583k80903K78624L122j35654P0251N9846K6417J2786k12828
14582A489774O96436n46100N7894N9723K21053Q7145j90562K15728j07754K55043
14572B238380n26842M04602j91634J92217P4231J76844k75558J96046l63825J72823
14562B097284L55659j46888K19549N06631l83845L52069k62661L28203L31671
14553C397672J97886K82589R86603K187241M045554M264429N290421J0408803
$$ plain form
14545 31061198 37205321 21377331 11084731 7513921 4409108 2845449 2110435 1989856
14537 1989856 2073934 1754115 1959715 1844207 1612038 1951356 1692305 1774513 1894177 1918653
14527 1918653 2410916 2189318 2259999 2246271 2538248 2293338 2426454 2268274 2335257 2085086
14517 2085086 2245330 2495632 2464976 2539839 2517932 2495177 2405067 2592797 2259854 2676453
14507 2676453 2350069 2429696 2819369 2682744 2656000 2735673 2833301 2591445 2902387 2706603
14497 2706603 3166398 3193734 3046691 3001825 2750782 3014469 3230419 3214923 3336876 3704545
14487 3704545 3144111 3123580 3161204 3189057 3524215 3413275 3384772 3475338 3486364 3537715 3532515
14476 3532515 3745153 3790186 3714253 3667624 4206919 3947741 4100279 3784637 4082717 3777561
$$ packed form
14545C1061198O144123j5827990j0292600l570810l104813j563659p35014j20579
14537A989856Q4078l19819K05600j15508k32169L39318k59051Q2208J19664K4476
14527A918653M92263k21598P0681j3728K91977k44910J33116j58180O6983k50171
14517B085086J60244K50302l0656P4863k1907k2755r0110J87730l32943M16599
14507B676453l26384P9627L89673j36625k6744P9673R7628k41856L10942j95784
14497B706603M59795K7336j47043m4866k51043K63687K15950j5496J21953L67669
14487C704545n60434k0531L7624K7853L35158j10940k8503R0566J1026N1351n200
14476C532515K12638M5033p5933m6629N39295k59178J52538l15642K98080l05156
$$ plain form
14466 3777561 4057797 3979733 3912175 4550069 4420010 4180424 4431001 4453539 4648377 4784505
14456 4784505 4579186 4539157 4815856 4876639 4748852 4827509 4996860 4908528 5451134 5097516
14446 5097516 5568499 4996491 5469376 5679622 5607471 5706118 5609837 5746848 5622966 5529683
14436 5529683 5978321 5888344 5751575 5898045 6073456 6216679 6384871 6390720 6793100 6602496
14426 6602496 6912381 6980116 6778058 7155981 6915065 7455551 7505808 7034566 7336660 7892698
14416 7892698 7690510 7840397 7938048 7684643 8289144 8255857 8422516 8494678 8750227 8727674
14406 8727674 8763546 9290267 9334643 9122890 9556831 9868942 9956260 9980626 10365507 10513369
14396 10513369 10661580 10832018 10624166 11257563 11331294 11217767 11502519 11722145 11965523
$$ packed form
14466C777561K80236p8064o7558O37894j30059k39586K50577K2538J94838J36128
14456D784505k05319m0029K76699O0783j27787P8657J69351q8332N42606l53618
14446E097516M70983n72008M72885K10246p2151R8647r6281J37011j23882r3283
14436E529683M48638q9977j36769J46470J75411J43223J68192N849M02380j90604
14426F602496L09885O7735k02058L77923k40916N40486N0257m71242L02094N56038
14416G892698k02188J49887R7651k53405O04501l3287J66659P2162K55549k2553
14406H727674L5872N26721M4376k11753M33941L12111Q7318K4366L84881J47862
14396A0513369J48211J70438k07852O33397P3731j13527K84752K19626K43378
$$ plain form
14387 11965523 12040462 12482747 12399775 13215302 12736426 13059376 13390852 13804538 13937201 14090715
14377 14090715 14271657 14748426 14935878 15628258 15836340 16058427 16043068 16744720 17162349
14368 17162349 16885909 17551863 17846219 18613993 18558842 19018859 19666432 19976480 20583086
14359 20583086 20964957 21420396 21797816 22104108 22930525 23516002 23771997 24673430 25098194
14350 25098194 25726789 26089264 27062207 27523184 28486802 29090110 30104831 30808139 31796066
14341 31796066 32218669 33564431 34420086 35072621 36443262 37052183 38455809 38998914 40710440
14332 40710440 41948908 43697674 44715747 45954256 47959499 49158379 50895071 52270779
14324 52270779 54577260 56571958 58207895 60429585 62830008 64957806 67706778 70137513
$$ packed form
14387A1965523P4939M42285q2972Q15527m78876L22950L31476M13686J32663J53514
14377A4090715J80942M76769J87452O92380K08082K22087j5359P01652M17629
14368A7162349k76440O65954K94356P67774n5151M60017O47573L10048O06606
14359B0583086L81871M55439L77420L06292Q26417N85477K55995R01433M24764
14350B5098194O28595L62475R72943M60977R63618O03308J014721P03308R87927
14341C1796066M22603J345762Q55655O52535J370641O08921J403626N43105J711526
14332D0710440J238468J748766J018073J238509K005243J198880J736692J375708
14324E2270779K306481J994698J635937K221690K400423K127798K748972K430735
$$ plain form
14316 70137513 72884788 75534607 78906397 82116058 85440000 89010357 93053874 97020049
14308 97020049 101231054 105806214 110579185 115568977 121561629 127258646 133760095 140138676
14300 140138676 147245280 154840413 163026339 171342225 180708447 190599643 200771433 212006651
14292 212006651 224277126 236498827 249708153 263571652 278137874 293526855 309467990
14285 309467990 326059933 343100296 360809742 377949448 395751252 413007647 430042944
14278 430042944 445925260 461121607 474255439 484397200 485590675 479372399 474678537
14271 474678537 475620973 479739469 480073205 474532409 470230301 462638685 450920261 436293119
14263 436293119 420520006 404086010 387029334 369520033 352325734 334838639 317770844
$$ packed form
14316G0137513K747275K649819L371790L209661L323942L570357M043517L966175
14308I7020049M211005M575160M772971M989792N992652N697017O501449O378581
14300A40138676P106604P595133Q185926Q315886R366222R891196J0171790J1235218
14292B12006651J2270475J2221701J3209326J3863499J4566222J5388981J5941135
14285C09467990J6591943J7040363J7709446J7139706J7801804J7256395J7035297
14278D30042944J5882316J5196347J3133832J0141761J193475o218276m693862
14271D74678537R42436M118496L33736n540796m302108p591616j1718424j4627142
14263D36293119j5773113j6433996j7056676j7509301j7194299j7487095j7067795
$$ plain form
14256 317770844 301098373 285155953 269548206 255337487 241463575 228813612 216423289
14249 216423289 204844593 193882479 183464090 174055676 165383582 157124577 149222398
14242 149222398 142045498 134849935 128523875 122591767 117105184 112051568 107051100 102059139
14234 102059139 97529050 93436995 89703467 85982089 82958346 79422882 76039842 73083909
14226 73083909 70488497 67714852 65113600 62607183 60873796 58292362 56397547 54773453
14218 54773453 52970687 51009880 49510111 47830245 46456770 45043163 43625435 42350494
14210 42350494 41271299 39670817 38886511 37925853 36649888 35837387 34537561 33628393 32761601
14201 32761601 32146762 31315745 30422805 29377748 28667040 28097442 27368697 26603496 26343963
$$ packed form
14256C17770844j6672471j5942420j5607747j4210719j3873912j2649963j2390323
14249B16423289j1578696j0962114j0418389r408414q672094q259005p902179
14242A49222398p176900p195563o326060n932108n486583n053616n000468m991961
14234A02059139m530089m092055l733528l721378l023743l535464l383040k955933
14226G3083909k595412k773645k601252k506417j733387k581434j894815j624094
14218E4773453j802766j960807j499769j679866j373475j413607j417728j274941
14210D2350494j079195j600482p84306r60658j275965q12501j299826r09168q66792
14201C2761601o14839q31017q92940j045057p10708n69598p28745p65201k59533
$$ plain form
14192 26343963 25168415 24605165 24336363 23479728 23010764 22631411 22221974 21232009 20872044
14183 20872044 20893524 19819238 19680531 19268683 18813788 18593286 17791136 17581570 17188524
14174 17188524 17103159 16542508 16109468 15909277 15496272 15431588 15088968 15156585 14834554 14130637
14164 14130637 13868047 13431051 13436478 13177514 12709352 12822070 12578425 12054137 12032609 11907217
14154 11907217 11684117 11263205 11470178 10789806 11071104 10831256 10750955 10186089 10078461
14145 10078461 9964933 9851727 9519607 9346052 9354363 9468708 8990990 9035303 8786824 8899128
14135 8899128 8453931 8458244 8559314 8043044 8353975 8143624 8091430 7714291 7664720 7708627
14125 7708627 7666942 7727583 7329229 7287228 7213366 6940548 6991529 7082352 7230580 6421737
$$ packed form
14192B6343963j175548n63250k68802q56635m68964l79353m09437r89965l59965
14183B0872044K1480j074286j38707m11848m54895k20502q02150k09566l93046
14174A7188524q5365n60651m33040k00191m13005o4684l42620O7617l22031p03917
14164A4130637k62590m36996N427k58964m68162J12718k43645n24288k1528j25392
14154A1907217k23100m20912K06973o80372K81298k39848q0301n64866j07628
14145A0078461j13528j13206l32120j73555Q311J14345m77718M4313k48479J12304
14135H899128m45197M313J01070n16270L10931k10351n2194l77139m9571M3907
14125G708627m1685O0641l98354m2001p3862k72818N0981R0823J48228q08843
$$ plain form
14115 6421737 6427111 6321304 6484951 6235734 6347716 6137934 6268081 6053237 5998547 5639683
14105 5639683 5681923 5763085 5482042 5641606 5623571 5623913 5407306 5423476 5295883 5392944 5040694
14094 5040694 5104535 4653324 4950392 5012058 4593380 4926321 4852667 4513346 4359284 4776304
14084 4776304 4424968 4335157 4614346 4279609 4264737 4146043 4206436 4362705 4182551 4241669
14074 4241669 4169175 4053270 3932970 3921004 4071564 3544057 4072753 3909929 3767318 3706396
14064 3706396 3683116 3604268 3807346 3249608 3828027 3597428 3825909 3646120 3289004 3290857
14054 3290857 3390342 3401016 3547494 3528711 3280921 3360226 3027836 3044800 3048870 3034132 2965362
14043 2965362 3008884 2952112 2813891 2700776 3007634 2974023 3084638 2689003 2719165 2920325
$$ packed form
14115F421737N374j05807J63647k49217J11982k09782J30147k14844n4690l58864
14105E639683M2240Q1162k81043J59564j8035L42k16607J6170j27593R7061l52250
14094E040694O3841m51211K97068O1666m18678L32941p3654l39321j54062M17020
14084D776304l51336q9811K79189l34737j4872j18694O0393J56269j80154N9118
14074D241669p2494j15905j20300j1966J50560n27507N28696j62824j42611o0922
14064C706396k3280p8848K03078n57738N78419k30599K28481j79789l57116J853
14054C290857R9485J0674J46478j8783k47790P9305l32390J6964M070j4738o8770
14043B965362M3522n6772j38221j13115L06858l3611J10615l95635L0162K01160
$$ plain form
14033 2920325 2563783 2665996 2524805 2841549 2728275 3026389 2944533 3102414 2571968 2637221
14023 2637221 2625234 2547918 2510267 2447306 2516567 2462768 2330176 2540921 2187242 1876821
14013 1876821 2371185 2389490 2152046 2471424 2355349 2248513 2188802 2311959 2082659 2005846
14003 2005846 2126682 1703505 2054644 1924204 2336947 1713501 1795687 1914293 1592531 1857523
13993 1857523 1893998 1993693 2104564 3879928 7515421 10950246 16091937 26249569 37891967
13984 37891967 25227657 14232654 8258891 5606411 4023741 3873167 3671220 3063445
13976 3063445 2921360 2929960 2753221 2073892 2519299 2410568 2266463 1883637 2199558 2197333
13966 2197333 2058263 2229787 2131015 1918715 2096829 1730687 2227167 2035962 1809191 2074333
$$ packed form
14033B920325l56542J02213j41191L16744j13274K98114q1856J57881n30446O5253
14023B637221j1987p7316l7651o2961O9261n3799j32592K10745l53679l10421
14013A876821M94364J8305k37444L19378j16075j06836n9711J23157k29300p6813
14003B005846J20836m23177L51139j30440M12743o23446Q2186J18606l21762K64992
13993A857523L6475R9695J10871J775364L635493L434825N141691J0157632J1642398
13984C7891967j2664310j0995003n973763k652480j582670j50574k01947o07775
13976C063445j42085Q600j76739o79329M45407j08731j44105l82826L15921k225
13966B197333j39070J71524r8772k12300J78114l66142M96480j91205k26771K65142
$$ plain form
13956 2074333 1641934 2050106 1872994 1756474 1661970 1864918 1558220 1751084 1365369 1902404
13946 1902404 1709839 1377223 1889278 1631991 1840175 1641634 1702484 1370215 1713883 1404290
13936 1404290 1384703 1589935 1460517 1352785 1374480 1859486 1579317 1678428 1253413 1396962
13926 1396962 1439321 1316707 1511614 1299138 1625586 1604243 1434121 1477759 1729307 1293120
13916 1293120 1141470 1527643 1506787 1485234 1073742 1311528 973491 1401219 1479758 1354837
13906 1354837 1127469 1371956 1066595 1206923 1337631 1240578 1274985 1170289 1161260 1233609
13896 1233609 1308345 945661 1281168 1242052 998692 1073062 1216397 1056769 970076 1034073
13886 1034073 1146834 1073362 1103456 959661 1173901 1057244 989652 908440 1278882 1015949
$$ packed form
13956B074333m32399M08172j77112j16520r4504K02948l06698J92864l85715N37035
13946A902404j92565l32616N12055k57287K08184j98541O0850l32269L43668l09593
13936A404290j9587K05232j29418j07732K1695M85006k80169R9111m25015J43549
13926A396962M2359j22614J94907k12476L26448k1343j70122M3638K51548m36187
13916A293120j51650L86173k0856k1553m11492K37786l38037M27728P8539j24921
13906A354837k27368K44487l05361J40328J30708r7053L4407j04696r029P2349
13896A233609P4736l62684L35507l9116k43360P4370J43335j59628q6693O3997
13886A034073J12761p3472L0094j43795K14240j16657o7592q1212L70442k62933
$$ plain form
13876 1015949 687663 837982 933113 1191950 1288136 811615 1346548 1082610 1071648 945131
13866 945131 791949 975253 803166 1123198 1089392 826143 816836 1120170 1010315 771348
13856 771348 723777 838518 1138163 959321 926626 852990 1017971 1116438 931861 1117594
13846 1117594 534539 1326114 924413 845497 925541 854700 991473 587748 910770 947861
13836 947861 929361 760557 920655 825803 1174733 902750 843433 913880 1025705 968604
13826 968604 749286 797601 1051590 988170 1016259 667775 597447 723098 899003 695975
13816 695975 1070266 732683 468177 833043 680025 915730 554576 540106 930461 702441
13806 702441 608791 741840 396994 964025 732807 767448 385971 667837 750469 695892
$$ packed form
13876A015949l28286J50319R5131K58837R6186m76521N34933k63938j0962j26517
13866I45131j53182J83304j72087L20032l3806k63249r307L03334j09855k38967
13856G71348m7571J14741K99645j78842l2695p3636J64981R8467j84577J85733
13846A117594E34539P91575m01701p8916Q0044p0841J36773m03725L23022L7091
13836I47861j8500j68804J60098r4852L48930k71983n9317P0447J11825n7101
13826I68604k19318M8315K53989o3420K8089l48484p0328J25651J75905k03028
13816F95975L74291l37583k64506L64866j53018K35705l61154j4470L90355k28020
13806G02441r3650J33049l44846N67031k31218L4641l81477K81866Q2632n4577
$$ plain form
13796 695892 726822 613673 765260 406969 612222 606645 917884 764071 1004666 953393
13786 953393 776502 544346 625549 525407 667402 787675 598320 555608 602123 593696
13776 593696 680173 704095 591108 720693 802325 874347 437676 537780 763800 561975
13766 561975 687927 782781 517682 308811 384454 768864 754693 941965 736736 527264
13756 527264 769701 349789 601063 503485 547156 536174 506008 766803 319753 207938
13746 207938 610646 493221 691133 509626 481544 523750 466511 746620 296032 645024
13736 645024 377122 399980 469074 474382 498851 594717 273675 734833 609797 308013 379937
13725 379937 674449 438700 280592 748033 383694 263607 472590 628223 224032 895171
$$ packed form
13796F95892L0930j13149J51587l58291K05253n577L11239j53813K40595n1273
13786I53393j76891k32156Q1203j00142J41995J20273j89355m2712M6515q427
13776E93696Q6477K3922j12987J29585Q1632P2022m36671J00104K26020k01825
13766E61975J25952R4854k65099k08871P5643L84410j4171J87272k05229k09472
13756E27264K42437C49789K51274r7578M3671j0982l0166K60795C19753j11815
13746B07938M02708j17425J97912j81507k8082M2206n7239K80109B96032L48992
13736F45024k67902K2858O9094N308K4469R5866B73675M61158j25036l01784P1924
13725C79937K94512k35749j58108M67441l64339j20087K08983J55633B24032O71139
$$ plain form
13715 895171 305701 484999 119725 444383 443026 438907 648197 534442 389643 231990
13705 231990 448860 353763 542131 336548 562684 582684 569053 476205 284702 96846
13694 249585 34326 581004 320388 50473 784299 154660 372883 555380 595800 477015
13684 477015 398331 897070 282400 628520 615317 623920 373944 99606 353616 467805
13674 467805 312656 706051 478220 328154 408801 507796 477741 455741 655690 293412
13663 30198 200638 546036 524210 266978 139319 577563 340413 447878 287558 419956
13653 419956 15606 362077 548704 176912 191016 230628 436302 362004 267026 83003 426166
13642 426166 220841 795325 458541 468239 573917 216983 210783 76396 248275 275666 246046
$$ packed form
13715H95171C05701J79298A19725L24658j357m119K09290j13755j44799j57653
13705B31990K16870r5097J88368k05583K26136K0000j3631r2848j91503I6846
13694B49585C4326N46678k60616E0473P33826A54660K18223J82497M0420j18785
13684D77015p8684M98739B82400L46120j3203Q603k49976I9606K54010J14189
13674D67805j55149L93395k27831j50066Q0647R8995l0055k2000J99949B93412
13663C0198J70440L45398k1826k57232j27659M38244k37150J07465j60320J32398
13653D19956A5606L46471J86627A76912J4104L9612K05674p4298r4978H3003L43163
13642D26166k05325N74484l36784R698J05678B16983o200G6396J71879K7391k9620
$$ plain form
13631 246046 163876 271713 14232 193910 157750 329171 318403 529169 512177 168441
13620 290044 87066 309789 174144 235975 309942 108470 277124 -88114 458245 610860
13610 610860 561394 496243 343563 349263 460562 191641 343203 630862 259083 166725
13600 166725 476045 -52479 212306 557427 234449 360642 289434 297358 313430 459315
13590 459315 619616 365925 598001 187497 364694 232130 409945 261601 491649 659671
13580 659671 330825 458022 179713 175783 212918 136234 181179 187268 285973 288078 32590
13568 228759 155458 340662 466719 261593 308728 292353 298504 156750 251050 467657 390963
13557 390963 426743 -180605 -167228 388018 446382 285961 299682 199342 339729 203556
$$ packed form
13631B46046q2170J07837A4232J79678l6160J71421j0768K10766j6992A68441
13620B90044H7066K22723j35645O1831P3967A08470J68654h8114D58245J52615
13610F10860m9466o5151j52680N700J11299A91641J51562K87659B59083r2358
13600A66725L09320e2479B12306L45121B34449J26193p1208P924J6072J45885
13590D59315J60301k53691K32076A87497J77197j32564J77815j48344K30048J68022
13580F59671l28846J27197A79713l930L7135p6684M4945O089R8705K105C2590
13568B28759p3301J85204J26057k05126M7135j6375O151j41754R4300K16607p6694
13557C90963L5780a80605J3377C88018N8364j60421J3721j00340J40387j36173
$$ plain form
13547 203556 249847 360532 190572 337966 421807 354318 229557 301922 523976 -39703
13536 186254 221863 24729 132019 157957 -250094 66239 56364 163671 388123 -105159 354440
13524 26132 619070 81046 292222 516553 309868 254732 419266 130002 36576 391943
13514 391943 134102 94277 -50267 374556 410616 253247 322952 16078 632398 235759
13503 51911 230201 115815 401673 187526 287392 122832 -51683 349926 161005 499992
13493 499992 409005 319241 19368 236896 165844 -65044 -106641 445570 304837 354326 164064
13481 153269 198859 37032 165388 196461 71390 99085 -69250 144339 210190 249054 21025
13469 -13617 255372 82077 428044 535518 447720 -171298 296526 202575 492912 155554
$$ packed form
13547B03556M6291J10685j69960J47394Q3841o7489j24761P2365K22054c9703
13536A86254L5609B4729J07290K5938b50094F6239r875J07307K24452a05159C54440
13524B6132N92938H1046K11176K24331k06685n5136J64534A30002C6576L55367
13514C91943A34102l9825e0267C74556L6060j57369O9705A6078O16320B35759
13503E1911J78290j14386K85858A87526R9866A22832e1683C49926A61005L38987
13493D99992r0987q9764A9368K17528p1052f5044m1597D45570j40733M9489A64064
13481A53269M5590C7032J28356L1073G1390K7695f9250A44339O5851L8864B1025
13469a3617B55372H2077L45967J07474q7798a71298B96526r3951K90337A55554
$$ plain form
13458 123235 114308 214046 318475 389667 91523 -126904 131213 646143 435940 318446
13448 318446 70753 76928 280979 135333 146006 22797 204426 125211 158016 127638 30486
13436 75905 -136531 -73457 -2258 -150889 -126176 97388 86457 -119574 308523 -70647 36045
13424 658943 272619 86123 375844 289565 345296 151455 364616 -263687 151721 413709
13414 413709 20746 187126 110168 254087 -19190 355546 45298 83310 121181 307658 102784
13402 374147 314372 326951 310125 -4648 -132865 46934 143760 -35380 270563 207756 431888
13391 431888 -59257 192750 67362 -44752 274094 324986 336699 189203 243732 312399 216983
13380 216983 -152859 215928 364838 185072 613914 601017 81570 457897 436841 230444
$$ packed form
13458A23235q927R9738J04429P1192I1523a26904A31213N14930k10203j17494
13448C18446G0753O175K04051A35333J0673B2797J81629p9215L2805l0378C0486
13436G5905a36531O3074b258j48631K4713I7388j0931a19574C08523g0647C6045
13424F58943B72619H6123K89721q6279N5731A51455K13161b63687A51721K61988
13414D13709B0746J66380p6958J43919a9190C55546D5298L8012L7871J86477A02784
13402C74147n9775J2579j6826d648j28217D6934R6826c5380B70563o2807K24132
13391D31888e9257A92750F7362d4752B74094N0892J1713j47496N4529O8667r5416
13380B16983a52859B15928J48910j79766M28842j2897H1570L76327k1056k06397
$$ plain form
13370 230444 121087 225120 337083 56414 280617 80108 36017 315563 230883 195975
13360 195975 126471 186095 35370 -111092 -91792 210518 405510 68763 483577 -254914
13349 -155985 266177 515094 271161 -14718 606411 157189 -38506 -60706 374073 82589
13338 441257 99624 375974 464456 262612 -43416 -98019 251985 -77416 177243 75169 91626
13327 91626 -108634 251700 134516 473645 155945 40352 191675 108666 46490 -103252
13316 230500 296267 507074 311977 100281 147515 -30395 231987 204621 -86037 66650 103987
13305 103987 234132 116020 152596 174102 -152080 315220 104218 -260661 359953 4001
13294 228597 -131844 328932 5388 234360 -201555 128081 -278754 -4978 -48713 102854
$$ packed form
13370B30444j09357J04033J11963E6414K24203H0108C6017K79546q4680l4908
13360A95975o9504N9624C5370a11092J9300B10518J94992F8763M14814b54914
13349a55985B66177K48917k43933a4718F06411A57189c8506k2200C74073H2589
13338D41257I9624K76350Q8482k01844d3416n4603B51985g7416A77243G5169J6457
13327I1626a08634B51700j17184L39129A55945D0352J51323q3009D6490a03252
13316B30500O5767K10807j95097A00281M7234c0395B31987k7366h6037F6650L7337
13305A03987J30145A16020L6576K1506a52080C15220A04218b60661C59953D001
13294B28597a31844C28932E388K28972b01555A28081b78754d978m3735A02854
$$ plain form
13283 172032 -49736 -109695 90228 216801 315357 -16286 -126097 -19166 267545 305487 10419
13271 -86 132468 -66888 -71114 310316 253870 200459 460154 193145 343647 -71078 244430
13259 58326 87497 156402 27699 -195574 144524 -23241 -173073 249971 -111322 40718 323478
13248 323478 -9922 104718 168701 -37561 111656 -101750 69626 404250 13336 -98245 366902
13236 -205130 35169 -68745 96484 -71092 -107731 155622 20040 36041 115350 -203364 -33499
13224 100561 488063 84704 163497 45640 -12383 206784 -175671 319649 254098 271629 116131
13212 -10399 226709 -4306 -4426 214114 232785 182157 54991 59656 438139 157026 -26345 98488
13199 135182 -288241 207196 19952 -95511 258801 247068 239294 -13947 90688 44730 -151127
$$ packed form
13283A72032d9736n9959I0228J26573R8556a6286j09811a9166B67545L7942A0419
13271h6A32468f6888m226C10316n6446n3411K59695A93145J50502g1078B44430
13259E8326K9171O8905B7699a95574A44524b3241j49832B49971a11322D0718K82760
13248C23478i922A04718O3983c7561A11656a01750F9626L34624A3336i8245C66902
13236b05130C5169f8745I6484g1092l6639A55622B0040J6001P9309b03364c3499
13224A00561L87502H4704P8793D5640a2383B06784a75671C19649o5551J7531A16131
13212a0399B26709d306j20B14114J8671n0628E4991M665L78483A57026b6345I8488
13199A35182b88241B07196A9952i5511B58801j1733p774a3947I0688D4730a51127
$$ plain form
13187 234606 80589 279644 261744 249441 98572 137936 73931 296041 -285333 189096 103014
13176 103014 -7506 208368 45692 -42883 84642 -123889 290218 176787 264238 54714 49645
13165 49645 160676 56768 70349 -78435 47217 315425 125873 447122 213293 -88365 175045
13153 199447 20134 457573 -187688 211402 -146686 141119 103436 78945 -10481 305144
13142 292 -125066 112724 -124361 177188 -282319 82309 89886 139068 36669 180497 202658
13131 202658 -206575 -172272 115465 398174 196082 -114062 -62409 -203550 88703 155815
13121 155815 195951 273798 -28053 -4122 289691 -184907 75761 165741 462297 282581 73149
13109 -177938 280791 140604 9034 1054 -59896 22200 27895 69110 6003 4932 239961 56469
$$ packed form
13187B34606H0589J99055j7900j2303I8572L9364o4005K22110b85333A89096q6082
13176A03014g506B08368D5692d2883H4642a23889B90218j13431Q7451E4714n069
13165D9645J11031E6768J3581g8435D7217K68208A25873L21249B13293h8365A75045
13153A99447B0134M37439a87688B11402a46686A41119l7683k4491a0481C05144
13142B92a25066A12724a24361A77188b82319H2309P577M9182C6669J43828K2161
13131B02658b06575L4303A15465K82709A96082a14062N1653j41141H8703O7112
13121A55815M0136P7847b8053d122B89691a84907G5761Q9980K96556j79716G3149
13109a77938B80791j40187I034A054e9896B2200N695M1215F003j071K35029E6469
$$ plain form
13096 6855 -193723 153650 -152536 321353 7845 340595 96132 177987 -198271 184725 58406
13084 173713 76111 -115870 -199357 -69640 -10645 258887 64303 -178809 -95534 -164285 144109
13072 -36237 -65328 14064 -202290 40819 112431 -85276 389086 405589 95908 116141 81827
13061 81827 135186 132535 75624 135007 252186 219856 153498 106546 121685 -265159 -76358
13049 -37762 -40003 -52631 -34074 25530 207730 177608 121516 179353 -2851 -26333 27914 368597
13037 368597 319018 17482 -8285 -112090 181224 123305 -21662 167765 -54074 121596 366230
13026 366230 218386 16451 221457 471498 46939 296954 -121758 208660 -217282 -25262
13015 -26458 7758 105260 155821 -21913 -129332 -367566 35566 25408 247285 82194 -16041
$$ packed form
13096F855a93723A53650a52536C21353G845L32750I6132Q1855a98271A84725E8406
13084A73713G6111a15870q3487f9640a0645B58887F4303a78809Q3275o8751A44109
13072c6237k9091A4064b02290D0819P1612h5276C89086J6503I5908K0233l4314
13061H1827N3359k651n6911N9383J17179l2330o6358m6952J5139b65159g6358
13049c7762k241j2628J8557B5530J82200l0122n6092N7837b851k3482B7914L40683
13037C68597m9579A7482h285j03805A81224n7919b1662A67765e4074A21596K44634
13026C66230j47844A6451K05006K50041D6939K50015a21758B08660b17282b5262
13015b6458G758R7502N0561b1913j07419k38234C5566j0158K21877H2194a6041
$$ plain form
13003 174222 207102 7253 57621 294339 39366 -946 -31337 136475 308547 61325 168003
12992 168003 135374 217858 -36753 50090 368274 51689 -197403 -136489 -181597 -7712 142712
12980 176162 274745 93049 -231872 202647 95796 51914 176015 -14961 228310 -181111
12969 -60227 35613 -218341 22518 66790 162548 -422115 10457 264074 -85287 118127 -127893
12957 341922 19636 -96343 88081 265738 76931 -145139 -8229 -178642 -49216 -358460 101813
12945 -45882 -187220 140465 239596 -274652 -29967 120081 27449 -189168 -51608 -69411 152510
12933 -175570 -60712 87795 -127233 114274 372190 133565 131711 -77297 75471 -87906 31388
12921 356140 336222 91218 -163586 274868 290331 82347 68366 -69843 -186258 64049 174062
$$ packed form
13003A74222L2880G253N0368K36718C9366i46l0391A36475J72072F1325J06678
12992A68003l2629Q2484c6753E0090L18184E1689a97403O0914m5108g712A42712
12980A76162R8583I3049b31872B02647I5796m3882J24101a4961B28310a81111
12969f0227C5613b18341B2518M4272R5758d22115A0457K53617h5287A18127a27893
12957C41922A9636i6343H8081J77657G6931a45139h229j70413d9216l09244A01813
12945d5882j41338A40465R9131b74652b9967A20081B7449a89168e1608j7803A52510
12933a75570f0712H7795a27233A14274K57916A33565j854g7297G5471h7906C1388
12921C56140j9918I1218a63586B74868J5463H2347j3981f9843j16415F4049J10013
$$ plain form
12910 174062 -38392 -40517 61124 -161369 205011 26025 264223 412920 335626 84539 -192041
12898 -23551 60048 -119839 169454 -85706 -57175 -185437 77182 -218836 134443 101257 -173076
12886 -80234 -326338 36318 -3448 -176258 -263827 -17727 149145 -46573 11962 -123119 -324549
12875 -324549 182017 265617 -86013 -171572 -218921 267470 -122458 -54000 241582 -8676 -270184
12864 -270184 -58235 179326 -33432 227997 -137937 35631 -158900 -23145 110007 81371
12854 81371 -239574 -8339 434141 -8139 -8543 -237215 159236 -321561 106663 -22827 290051
12842 116168 40888 118110 27586 262727 317718 52240 -124665 210975 158178 201928 103154
12831 103154 -44584 -86949 -286713 50845 6569 -198058 -6535 -23692 -247585 -48096 -118660
$$ packed form
12910A74062c8392k125F1124a61369B05011B6025K38198J48697p7294H4539a92041
12898b3551F0048a19839A69454h5706K8531j28262G7182b18836A34443l3186a73076
12886h0234k46104C6318c448j72810q7569a7727A49145d6573A1962a23119k01430
12875c24549A82017Q3600h6013q5559m7349B67470a22458e4000B41582h676k61508
12864b70184e8235A79326c3432B27997a37937C5631a58900b3145A10007k8636
12854H1371b39574h339D34141h139m04k28672A59236c21561A06663b2827B90051
12842A16168D0888P7222B7586K35141N4991E2240a24665B10975n2797M3750r8774
12831A03154d4584m2365j99764E0845F569a98058f535j7157k23893d8096p0564
$$ plain form
12820 -118660 187949 106068 9920 -140135 -153759 264990 -197380 433131 -217082 319470
12809 -99532 216759 -68072 186943 -265348 -47138 35146 26131 31751 -96434 -246896 492980
12797 67032 172455 393125 -110592 -100160 -7824 120144 -16380 -97851 -27451 88726 17780
12785 194637 -287398 -71240 223129 247414 -25066 -181324 -187532 195158 -23714 380100 52773
12773 26724 160497 -158036 121624 20375 -109811 -289497 -77830 31268 96156 452196
12763 452196 59981 16885 151437 89106 186615 -19870 -16426 -325925 -120660 117178 120132
12752 120132 250312 150534 -254339 62524 438648 -21849 17401 -34799 188252 368937
12742 368937 -136387 138699 -385329 -364274 -263203 313458 -137176 -293779 245099 10147
$$ packed form
12820a18660A87949q1881I920a40135j3624B64990a97380D33131b17082C19470
12809i9532B16759f8072A86943b65348d7138C5146r015N620i6434j50462D92980
12797F7032J05423K20670a10592J0432g824A20144a6380q1471b7451H8726A7780
12785A94637b87398g1240B23129K4285b5066j56258o208A95158b3714C80100E2773
12773B6724J33773a58036A21624B0375a09811j79686g7830C1268O4888L56040
12763D52196E9981A6885J34552o2331R7509a9870L444l09499a20660A17178K954
12752A20132J30180r9778b54339F2524L76124b1849A7401c4799A88252J80685
12742C68937a36387A38699c85329K1055J01071C13458a37176j56603B45099A0147
$$ plain form
12731 -32130 137920 -299787 -194233 135430 273163 -190145 334516 144752 -49755 -203070
12721 -203070 21623 115288 62317 53313 -62364 7884 -124795 -59640 177114 6051 -35717 -286586
12709 -286586 189473 206152 93422 16960 579085 89635 309488 -58309 180214 99021 -17621
12697 -42638 194871 -31412 -29801 -89596 -468121 81991 -108414 289142 -109606 53358 251218
12686 251218 -22701 77977 -81854 -25110 -17903 105320 130026 70411 156979 607262 -68664
12674 -21630 455621 340916 304448 173381 192033 -78455 -17914 148176 290349 90834 -185531
12662 -147819 23660 -94140 113063 299006 140606 233195 174391 32376 158695 180369 158453
12651 158453 49027 134190 195534 192543 189704 243792 210810 215173 -51902 24686 226277 207994
$$ packed form
12731c2130A37920b99787J05554A35430J37733a90145C34516A44752d9755j53315
12721b03070B1623R3665n2971r004f2364G884a24795e9640A77114F051c5717k50869
12709b86586A89473J6679I3422A6960N62125H9635K19853e8309A80214q1193a7621
12697d2638A94871c1412J611n9795l78525H1991a08414B89142a09606E3358J97860
12686B51218b2701G7977h1854b5110P207A05320K4706n9615Q6568M50283f8664
12674b1630D55621j14705l6468j31067J8652g8455a7914A48176J42173I0834a85531
12662a47819B3660i4140A13063J85943A40606R2589n8804C2376J26319K1674k1916
12651A58453D9027Q5163O1344k991k839N4088l2982M363e1902B4686K01591j8283
$$ plain form
12639 207994 133250 126512 -6777 -90418 304299 26026 36413 -22654 122244 100173 21809
12627 360409 289128 95548 32071 -5274 180690 -318965 153603 135208 -22539 -57905 172086
12615 71312 135586 239363 124439 512653 -375622 -93053 124691 -154348 -100563 -60392
12605 -60392 -260795 23612 -110166 259592 84209 102964 16649 191863 -11698 250747 114052
12593 368551 340156 -347 59005 -46783 -115851 28815 -154030 2496 149520 393216 -188969
12581 59547 -73546 -12959 -98227 -435527 271608 -183133 11391 41820 -159353 311057 227073
12570 227073 562203 58557 -139071 -297456 97242 232012 148780 365489 80491 -44527
12559 26015 -10043 139864 50464 121475 24075 58933 -39751 -112234 361819 16074 241370
$$ packed form
12639B07994p4744o738f777q3641C04299B6026J0387b2654A22244k2071B1809
12627C60409p1281I5548C2071e274A80690c18965A53603j8395b2539l5366A72086
12615G1312O4274J03777j14924L88214c75622i3053A24691a54348N3785M0171
12605f0392k00403B3612a10166B59592H4209J8755A6649J75214a1698B50747A14052
12593C68551k8395c47E9005d6783o9068B8815a54030B496J47024K43696a88969
12581E9547g3546a2959q5268l37300B71608a83133A1391L0429a59353C11057q3984
12570B27073L35130E8557a39071j58385I7242J34770q3232K16709H0491d4527
12559B6015a0043A39864E0464P1011B4075L4858c9751p2483C61819A6074K25296
$$ plain form
12548 241370 190278 23809 126062 -179669 -179588 -362614 162585 -51713 77179 122482 153928
12537 153928 216917 -160042 50217 112506 219206 -139982 -164097 222237 206795 177132 -18072
12525 -223385 224156 218418 -249347 -211794 -145377 -236039 -290623 -3376 -409161 -256376 -9170
12513 44382 70766 323871 117762 281455 426239 -67799 104149 61440 76180 -84039 -203742
12502 -203742 100180 191530 128677 -237043 -195590 -135465 -310710 36920 2477 -203792 143759
12490 -205040 -150061 -203119 -104234 -38333 143043 -188034 41625 -14225 66611 162546 -97167
12478 58681 -28119 36097 99029 -231188 9030 -74985 85317 170311 -15391 192973 -8602 9143
12465 63569 54786 285873 284193 41456 16006 -33379 -156320 68743 -279955 -222278 -111584
$$ packed form
12548B41370n1092B3809J02253a79669Q1j83026A62585e1713G7179M5303L1446
12537A53928O2989a60042E0217O2289J06700a39982k4115B22237j5442k9663a8072
12525b23385B24156n738b49347L7553O6417r0662n4584c376m05785J52785i170
12513D4382K6384K53105A17762J63693J44784f7799A04149m2709J4740h4039j19703
12502b03742A00180R1350o2853b37043M1453O0125j75245C6920B477b03792A43759
12490b05040N4979n3058R8885c8333A43043a88034D1625a4225F6611R5935i7167
12478E8681b8119C6097O2932b31188I030g4985H5317Q4994a5391A92973h602I143
12465F3569q783K31087j680D1456A6006c3379j22941F8743b79955N7677J10694
$$ plain form
12454 -111584 2345 151671 155957 277408 154245 -27541 -61214 -56388 180067 100444 -30815
12442 23122 -155364 79693 -270890 249743 -191897 190238 -241943 -85968 144856 -251348
12431 95319 136089 -10955 71527 -60397 -171080 138405 -172038 -116953 221801 -148125 51932
12419 225334 -296710 248186 -22853 40513 -84977 -59993 -298994 -103865 392148 -244542
12408 -168601 285624 30317 -195973 -75489 24366 -41480 -349360 11182 31194 -148948 -224749
12397 -224749 218 28008 96620 -243410 -33300 -164131 110691 -86385 109045 215633 -109926
12385 88888 -8953 -153770 93562 -169270 -70416 -60011 -67177 -61154 -114095 239951 319245 50220
12372 143852 -199583 -9479 -87493 -337174 178784 -205293 169325 -148889 -136445 143766
$$ packed form
12454a11584B345J49326M286J21451j23163b7541l3673M826A80067p9623c0815
12442B3122a55364G9693b70890B49743a91897A90238b41943h5968A44856b51348
12431I5319M0770a0955G1527f0397j10683A38405a72038N5085B21801a48125E1932
12419B25334b96710B48186b2853D0513h4977K4984k39001a03865C92148b44542
12408a68601B85624C0317a95973g5489B4366d1480l07880A1182K0012a48948p5801
12397b24749B18K7790O8612b43410c3300j30831A10691h6385A09045J06588a09926
12385H8888h953j44817I3562a69270g0416J0405p166O023n2941B39951P9294E0220
12372A43852a99583i479p8014k49681A78784b05293A69325a48889J2444A43766
$$ plain form
12361 115423 -233320 -162752 -108602 -236252 -67890 120343 -102787 -11637 353519 -17664
12350 -184523 62292 110364 -372560 101807 273060 234879 457163 377772 262931 -233007
12339 -85570 241624 -82893 17149 -72776 -364667 59797 13847 -157880 -55714 -106052 -166516
12328 -166516 -234725 -52224 -44264 172521 -210398 -93617 -32348 190766 -458960 -38625 -190862
12317 -190862 -178347 -166158 -332492 291840 -68007 145781 137083 -37894 41244 59161 133446
12306 133446 260891 -288376 -153109 139836 218143 -234321 -50455 -34389 -281278 30025
12295 -367485 235861 -102009 28342 161039 102812 223658 199504 -398507 88739 67016
12285 67016 97520 -312266 -238560 -60944 -5673 106029 118936 127535 195359 50935 306517
$$ packed form
12361A15423b33320P0568N4150j27650f7890A20343a02787a1637C53519a7664
12350a84523F2292M8072c72560A01807J71253l8181K22284p9391j14841b33007
12339h5570B41624h2893A7149g2776k91891E9797A3847a57880e5714n0338o0464
12328a66516o8209e2224P960A72521b10398i3617c2348A90766d58960c8625j52237
12317a90862J2515J2189j66334B91840f8007A45781q698c7894D1244J7917P4285
12306A33446J27445b88376J35267A39836P8307b34321e0455J6066k46889C0025
12295c67485B35861a02009B8342J32697n8227J20846k4154c98507H8739k1723
12285F7016L0504c12266P3706f0944e673A06029J2907Q599O7824E0935K55582
$$ plain form
12274 306517 215361 -83430 255924 22091 117116 -90533 302208 15851 -217349 -39414 137999
12262 -249556 183878 112064 -12997 352267 -102460 -47877 213591 133335 90712 261953
12252 261953 215005 128319 -28177 131670 -26063 12294 -174836 87983 -6039 131783 -252821
12240 -215913 74187 3895 391018 233861 251544 98868 335167 473561 184185 248710 -153484
12228 270300 194328 86135 -151718 228127 150803 -38746 577845 206800 -35499 -36982 587475
12216 -3636 7023 56787 156838 495341 383698 -195171 418753 366337 -144063 108875 -65165
12204 142831 194798 -89138 -25353 429239 293441 348394 126069 377649 157705 507708
12194 507708 225931 376943 294794 75720 254328 224454 34223 -308284 374966 709 -2773
$$ packed form
12274C06517r1156h3430B55924B2091R5025i0533C02208A5851b17349c9414A37999
12262b49556A83878p1814a2997C52267a02460d7877B13591q0256m2623J71241
12252B61953m6948q6686b8177A31670b6063A2294a74836H7983f039A31783b52821
12240b15913G4187C895L87123j57157J7683I8868K36299J38394A84185O4525a53484
12228B70300p5972H6135a51718B28127p7324c8746E77845B06800c5499j483E87475
12216c636G023M9764J00051L38503j11643a95171D18753n2416a44063A08875f5165
12204A42831N1967h9138b5353D29239j35798N4953A26069K51580A57705L50003
12194E07708B25931J51012q2149G5720J78608k9874C4223c08284C74966G09b773
$$ plain form
12182 179154 281190 364053 14748 90669 60997 102981 190853 -174493 -29200 325144 62751
12170 10244 253262 198847 49170 -9576 78691 39318 101829 -3702 167256 42884 310687
12159 310687 53210 26277 -363315 4567 -92137 58616 137328 64914 -281015 58367 82970
12148 82970 274554 333346 -118934 53010 -127117 312643 56928 -13277 392847 -195181
12137 -28057 119816 211042 -170322 8708 -217176 -253486 91163 122878 23247 -281046 -4122
12125 31018 -3735 47341 -166682 -3439 -76779 310499 38315 -37634 -98795 -67578 121847
12113 -102257 -82924 335681 371082 -35551 -237115 41221 237676 6301 87915 174003 -124460
12101 28970 14292 -49023 -257589 61274 95776 350766 129262 -204542 156966 60250 -108861
$$ packed form
12182A79154J02036Q2863A4748P5921k9672M1984Q7872a74493b9200C25144F2751
12170A0244K43018n4415D9170i576G8691C9318O2511c702A67256D2884K67803
12159C10687E3210B6277c63315D567i2137E8616P8712F4914b81015E8367K4603
12148H2970J91584N8792a18934E3010a27117C12643E6928a3277C92847a95181
12137b8057A19816R1226a70322H708b17176l6310I1163L1715B3247b81046d122
12125C1018c735D7341a66682c439p3340C10499C8315c7634o1161L1217A21847
12113a02257J9333C35681L5401c5551k01564D1221J96455F301Q1614Q6088a24460
12101B8970A4292d9023k08566F1274L4502K54990A29262b04542A56966F0250a08861
$$ plain form
12089 -118934 -226196 -31443 49986 130742 99910 -43191 -217983 99002 43564 97261 94073
12078 94073 14391 -198258 55508 234031 155106 -99691 -458277 156585 -190988 92589 252311
12067 252311 -153402 -377250 -230205 394565 -162577 -261219 -2481 -68822 -43447 417391
12056 375578 17880 75465 73131 369915 620993 853186 1255353 1144937 567072 -145990
12045 12829 147815 124835 -179989 45743 -295117 109695 -259914 41086 203436 -174071
12034 7852 18218 41807 162484 -111883 -37155 -46249 314610 142836 -31508 -82238 452712
12022 -29274 118489 331408 166339 85363 -35462 168423 -184067 156676 288965 -36115
12011 211209 214158 -132141 160683 388333 81718 -67480 60621 -322728 -268243 15666 -183843
$$ packed form
12089a18934j07262c1443D9986Q0756l0832d3191j74792I9002D3564N3697l188
12078I4073A4391a98258E5508J78523p8925i9691l58586A56585a90988I2589J59722
12067B52311a53402k23848J47045C94565a62577r8642b481o6341K5375D17391
12056C75578A7880N7585k334K96784K51078K32193M02167j10416E67072a45990
12045A2829J34986k2980a79989D5743b95117A09695b59914D1086J62350a74071
12034G852J0366K3589J20677a11883c7155r094C14610A42836c1508n0730D52712
12022b9274A18489K12919j65069q0976c5462A68423a84067A56676J32289c6115
12011B11209K949a32141A60683K27650H1718f7480F0621c22728N4485A5666a83843
$$ plain form
11999 -83171 136877 -111537 -195146 142735 -301206 -71500 -579790 -428876 -110358 -401330
11989 -401330 -220864 -76041 -124679 -63941 -48328 30699 -36961 -117050 115813 -55150 10494
11977 -135833 78731 113359 -120985 69188 -187096 135332 -42168 40111 -282305 50302 -206120
11965 182211 -27330 75445 144362 231675 211420 -49543 134214 -80200 -155760 -49091 -159502
11954 -159502 -158588 -41799 126191 133816 -162604 174284 456610 145908 276554 84922 -333564
11942 -12853 -196310 239526 -293186 246238 -98854 6179 535 -214558 -92343 -382537 -105505
11930 -250807 -32530 55282 -366325 166265 -78368 83794 66753 236468 233134 4578 -127267
11918 -157441 -410647 127752 106133 -117754 -245903 -161418 -9928 37717 -55553 -18340 -94016
$$ packed form
11999h3171A36877a11537q3609A42735c01206g1500n08290J50914a10358k90972
11989d01330J80466g6041m8638O0738J5613C0699c6961q0089A15813e5150A0494
11977a35833G8731L4628a20985F9188a87096A35332d2168D0111b82305E0302b06120
11965A82211b7330G5445O8917Q7313k0255d9543A34214h0200p5560d9091j10411
11954a59502R14d1799A26191P625a62604A74284K82326A45908J30646H4922c33564
11942a2853j83457B39526b93186B46238i8854F179E35b14558i2343k90194a05505
11930b50807c2530E5282c66325A66265g8368H3794j7041J69715l334D578a27267
11918a57441k53206A27752k1619a17754j28149Q4485i928C7717e5553a8340p5676
$$ plain form
11907 -94016 -139095 -92837 78192 136051 52232 -53867 -5534 72082 -107123 199953 -184451
11895 -1202 88471 163938 -267199 -17450 45994 -92912 108539 49824 188240 -219874 -99870
11883 -247093 238592 -81804 -302405 336893 -84290 -47764 104620 -73672 59616 186914
11873 186914 -101390 -73064 69818 225479 -4586 165951 141051 -166591 13323 112483 -55632
11861 -178312 -223919 215000 -243679 -77258 -48135 -85172 81885 -384530 -88098 -157222 -177298
11850 -177298 -146969 -41627 -81023 158743 -125664 -148798 -338187 -93276 -315089 71006 304500
11839 304500 -199406 -30584 101693 -7613 86461 -18080 -133643 -405620 -533023 235240
11828 -297961 163681 31848 -205253 263620 -361496 -269118 -167652 -4804 19876 34037 274093
$$ packed form
11907i4016m5079M6258G8192N7859E2232e3867e534G2082a07123A99953a84451
11895a202H8471P5467b67199a7450D5994i2912A08539D9824J38416b19874i9870
11883b47093B38592h1804k20601C36893h4290L6526A04620g3672E9616J27298
11873A86914a01390K8326F9818J55661d586A65951k4900a66591A3323R9160e5632
11861a78312m5607B15000b43679g7258K9123l7037H1885c84530h8098o9124k0076
11850a77298L0329d1627l9396A58743a25664k3134j89389i3276k21813G1006K33494
11839C04500a99406c0584A01693g613H6461a8080j15563k71977j27403B35240
11828b97961A63681C1848b05253B63620c61496R2378J01466d804A9876J4161K40056
$$ plain form
11817 274093 -47867 192604 -130564 -195685 -23560 -263274 -130560 -382184 -348721 136652
11806 196741 2868 120841 -284545 327759 -11914 -36515 102273 150644 -159037 -30321 -158346
11795 -158346 -363581 -98690 -281111 42286 -29495 -212037 -54143 72310 75566 -89830 3865
11783 250375 -37851 129712 37890 141297 -213867 -211947 -23297 67552 -147548 77384 -190587
11771 -3028 -351670 -24412 -106640 -96015 49327 36134 -41013 -146802 -217264 -129647 107308
11759 -40112 207 59170 10359 223535 -233690 -235834 -11292 -46410 -88989 156348 4292 -535352
11746 -215273 106589 -52506 -14502 -66657 578 40520 -21064 277644 -50653 -215797 -365747
11735 -365747 -188060 -190147 -18195 -24167 16782 238899 8609 -165391 -116508 187008 60144
$$ packed form
11817B74093d7867A92604a30564o5121b3560k39714a30560k51624L3463A36652
11806A96741B868J17973b84545C27759a1914k4601A02273M8371a59037c0321j28025
11795a58346k05235i8690j82421D2286b9495j82542e4143G2310L256h9830C865
11783B50375c7851A29712C7890J03407b13867J920b3297F7552a47548G7384a90587
11771c028l48642b4412q2228J0625D9327j3193d1013j05789p0462Q7617A07308
11759d0112B07N8963A0359K13176b33690k144a1292l5118m2579A56348D292e35352
11746b15273A06589e2506a4502n2155E78L9942b1064B77644e0653j65144j49950
11735c65747J77687k087a8195n972A6782K22117H609a65391M8883A87008F0144
$$ plain form
11723 52260 981 126216 219236 -277472 -99821 -281060 64331 81983 26428 -358298 118627
11711 312270 360526 -327799 -106051 -230945 -32778 71324 99185 -74778 61964 -24348 124274
11699 284361 301943 -134099 264337 55205 38522 248020 197981 199297 150083 146522 450081
11688 450081 97316 -125577 20771 145355 51001 -62345 87202 95554 -80005 -104110 -202589
11677 -202589 -45295 -131152 452891 198999 -198257 -215121 -62745 -293472 -9142 169641 86830
11666 86830 188392 -105897 -10923 -155881 135544 -99397 372934 -126932 -189172 -246762
11656 -246762 40373 -253591 123901 45656 123605 13069 -3255 22618 200690 -341377 -25023
11644 98661 -164461 18140 126337 -26240 29883 24171 335002 59843 -13226 3824 -243922
$$ packed form
11723E2260I81J25235R3020b77472i9821j81239F4331J7652B6428c58298A18627
11711C12270M8256c27799a06051j24894c2778G1324K7861g4778F1964b4348A24274
11699B84361J7582a34099B64337E5205j6683K09498n0039J316m9214l561L03559
11688D50081I7316a25577B0771J24584E1001f2345H7202Q352h0005k4105r8479
11677b02589d5295q5857D52891A98999a98257j6864f2745k30727i142A69641q2811
11666H6830J01562a05897a0923j44958A35544i9397C72934a26932o2240n7590
11656b46762D0373b53591A23901D5656P7949A3069c255B2618J78072c41377b5023
11644I8661a64461A8140J08197b6240B9883n712L10831E9843a3226C824b43922
$$ plain form
11632 92868 275704 167032 88987 185890 -137497 426194 205486 116446 94297 -57468 116393
11620 -154898 -172725 -312697 -201827 -160986 134801 -185286 298019 -167109 24234 46925
11610 46925 114791 59846 33701 -45591 174307 380182 -132099 49907 179153 -33024 96677
11598 58265 -165814 -243586 47962 -27529 322784 -278096 194974 59439 212805 -31907 195346
11586 -72384 21541 346396 105243 -122880 -83374 556675 119538 259206 321105 34276
11575 -33278 -82578 294144 -162355 -304565 199942 235735 205176 -60411 -135867 -205034 76106
11563 6836 -16646 371363 69427 210987 81064 246742 -4661 222235 189553 -146993 499750
11551 -340357 -308567 311099 -190913 -102740 -56747 -36272 111744 7956 399028 270234 -13343
$$ packed form
11632I2868J82836j08672p8045R6903a37497D26194B05486q9040k2149e7468A16393
11620a54898j7827j39972J10870M0841A34801a85286B98019a67109B4234K2691
11610D6925O7866n4945k6145d5591A74307K05875a32099D9907J29246c3024I6677
11598E8265a65814p7772D7962b7529C22784b78096A94974E9439J53366c1907A95346
11586g2384B1541L24855A05243a22880L9506E56675A19538J39668O1899C4276
11575c3278m9300B94144a62355j42210A99942L5793l0559f0411p5456o9167G6106
11563F836a6646C71363F9427J41560H1064J65678d661B22235l2682a46993D99750
11551c40357L1790C11099a90913Q8173M5993K0475A11744G956L91072j28794a3343
$$ plain form
11539 -209751 22763 43012 55067 72850 -86228 85208 375825 -187887 131635 109239 57211
11528 57211 67225 58690 -2018 175484 222048 -41763 35497 109803 151576 -232508 230402
11516 247319 116189 423992 -143671 394095 182533 299237 12355 -157008 17796 235640
11506 235640 129696 283634 53226 166372 78858 48057 307508 -24472 236317 96690
11495 244222 87928 71638 -130143 254666 -63628 281474 437250 -295767 257996 280979
11485 280979 196155 123246 135409 326062 83320 526109 69987 139498 136516 -64962 294926
11473 149719 274685 251211 84220 89402 130873 267703 66216 346871 470454 23090 -190987
11461 251229 378198 -156128 -19472 41994 94377 439499 587277 -36231 222322 306029
$$ packed form
11539b09751B2763K0249J2055J7783h6228H5208K90617a87887A31635k2396n2028
11528E7211J0014q535b018A75484M6564d1763C5497P4306M1773b32508B30402
11516B47319A16189L07803a43671C94095A82533J16704A2355a57008A7796K17844
11506B35640j05944J53938E3226J13146G8858l0801K59451b4472B36317I6690
11495B44222H7928j6290a30143B54666f3628B81474J55776b95767B57996K2983
11485B80979q4824p2909J2163J90653H3320M42789F9987O9511k982f4962B94926
11473A49719J24966k3474H4220N182M1471J36830F6216K80655J23583B3090a90987
11461B51229J26969a56128a9472D1994N2383L45122J47778c6231B22322Q3707
$$ plain form
11451 306029 44535 145253 326309 77518 442602 162047 15471 132318 -193391 116318
11440 300683 168430 -126353 -548119 78451 158844 219309 103026 211919 378479 197738
11430 197738 -41816 -55942 -221695 -155922 11469 -83571 349442 -119967 -120142 208679 89706
11418 141226 90383 -14182 254970 155459 222726 -50310 -450825 12028 13487 -153534 51484
11406 -18028 -29183 -1597 34877 165219 158707 -93054 79859 -148276 74886 -59005 134874
11394 50398 109113 -208699 -317325 -182246 -149215 85541 118030 46990 150395 -110782 -145086
11383 -145086 -47145 -46848 364483 -201013 3310 -156291 -153933 -56814 -61045 128688 46071 -38517
11370 -106518 171781 5390 -124155 324549 148346 48895 127581 12553 -43246 -74922 -231046
$$ packed form
11451C06029D4535J00718J81056G7518L65084A62047A5471J16847a93391A16318
11440C00683j32253a26353m21766G8451Q0393O0465A03026J08893J66560j80741
11430A97738d1816j4126j65753O5773A1469h3571C49442a19967j75B08679H9706
11418A41226n0843a4182B54970r9511O7267e0310m00515A2028J459a53534E1484
11406a8028j1155a597C4877J30342o512i3054G9859a48276G4886e9005A34874
11394E0398N8715b08699j08626J35079L3031H5541L2489D6990J03405a10782l4304
11383a45086d7145K97C64483b01013C310a56291K358e6814m231A28688D6071c8517
11370a06518A71781E390a24155C24549A48346D8895P8686A2553d3246l1676j56124
$$ plain form
11359 -231046 144138 -287165 -182520 67003 -286964 135857 18462 20165 -235066 544834
11348 -208483 -248208 -694 1340 -69235 -307971 445173 -24409 -507989 211549 -293120 192836
11336 -215004 -269238 84215 -115430 -438419 -222374 245049 1938 -68991 307484 -198827
11325 310362 73624 -119660 44399 72989 117537 60676 -142955 183610 92463 -1573 152799
11313 -64 -75628 116936 56474 -26265 34083 28367 7654 -218054 -143730 -106325 -20802 -112448
11301 -112448 -95826 -124401 -47946 82879 7686 72755 -87452 241905 -26395 -151399 -76373
11290 -76373 -218520 -63487 43220 -60032 -424 176270 -198423 -113408 66063 -273993 -113138
11278 104817 -127718 -323455 -2341 -215505 -234738 -199882 -20716 44087 -251337 -338534 -13929
$$ packed form
11359b31046A44138b87165J04645F7003b86964A35857A8462J703b35066E44834
11348b08483l9725f94A340f9235k38736D45173b4409m83580B11549b93120A92836
11336b15004n4234H4215a15430l22989K16045B45049A938f8991C07484a98827
11325C10362G3624a19660D4399K8590M4548n6861a42955A83610r1147a573A52799
11313f4p5564A16936E6474b6265C4083n716G654b18054P4324L7405b0802r1646
11301a12448J6622k8575d7946H2879G686O5069h7452B41905b6395j25004P5026
11290g6373j42147f3487D3220f0032d24A76270a98423Q5015F6063b73993a13138
11278A04817a27718j95737b341k13164j9233L4856b0716D4087b51337q7197a3929
$$ plain form
11266 91516 -113636 36172 -30761 -202599 50767 -176295 82853 60456 13882 -121321 160048
11254 26891 -29825 215586 -117339 -241336 74031 -150856 48818 159220 26280 146384
11244 146384 -215936 -148350 -147128 -195203 -58404 144428 -93890 -224707 105295 -65113 -153910
11233 -153910 81394 -36888 168926 65491 82534 -310533 217620 84175 -333075 -122961
11222 100538 -287819 16169 -179907 348950 58257 -27507 177528 -65326 136342 -365006
11211 -342068 -69362 -46643 429739 -132231 -72281 -64149 -338030 42883 -52170 144328 168596
11200 168596 -235642 -533377 34147 -119926 -339226 21548 -82851 -92931 -191089 -442930
11190 -442930 -11991 146375 -244746 -106674 -203234 -219776 -28789 -166356 -589 -213033 294515
$$ packed form
11266I1516a13636C6172c0761j71838E0767a76295H2853k2397A3882a21321A60048
11254B6891b9825B15586a17339j23997G4031a50856D8818J10402B6280J20104
11244A46384b15936O7586J222m8075e8404A44428i3890j30817A05295f5113q8797
11233a53910H1394c6888A68926F5491J7043c10533B17620H4175c33075a22961
11222A00538b87819A6169a79907C48950E8257b7507A77528f5326A36342c65006
11211c42068f9362K2719D29739a32231N9950Q132k73881D2883e2170A44328K4268
11200A68596b35642k97735C4147a19926k19300B1548h2851j0080r8158k51841
11190d42930a1991A46375b44746a06674r6560j6542b8789j37567e89k12444B94515
$$ plain form
11178 59769 126861 -119665 -22694 -20798 -233673 14499 -56725 -208743 17183 78476 -599470
11166 -100645 -109412 -49265 166571 -213952 -4902 -43037 -70898 71526 -28878 -17219 10147
11154 -170515 174879 107583 -370393 367808 -127488 283165 44721 243684 188801 -83311
11143 162569 -379280 -288060 127651 -31322 -119344 127913 -166086 -4661 3716 446251 305566
11132 305566 220061 74256 -66277 22878 -234607 -150970 399398 40969 48519 212585 -572
11120 290059 44708 172259 -220560 556005 -73970 -74589 223907 84874 -101542 -143721 -214427
11109 -214427 19855 181710 214038 207541 91464 253396 88113 45433 254055 232879 -48439
11097 -198474 -131297 68683 294583 269658 -71859 365001 -116169 -59419 160877 -68510 40774
$$ packed form
11178E9769O7092a19665b2694J896k12875A4499e6725j52018A7183O1293e99470
11166a00645q767d9265A66571b13952d902l8135k7861G1526b8878J1659A0147
11154a70515A74879o7296c70393C67808a27488B83165D4721J98963n4883h3311
11143A62569c79280R1220A27651c1322q8022A27913a66086d661C716M42535j40685
11132C05566q5505G4256f6277B2878b34607Q3637C99398D0969P550J64066e72
11120B90059D4708J27551b20560E56005g3970o19B23907H4874a01542m2179p0706
11109b14427A9855J61855L2328o497I1464J61932H8113m2680K08622k1176d8439
11097a98474O7177F8683K25900k4925g1859C65001a16169N6750A60877f8510D0774
$$ plain form
11085 286018 309487 714995 178338 569121 408242 335390 266978 66194 130880 294392
11075 294392 117901 287290 386173 81608 36179 169134 263657 -116177 535214 363813
11065 363813 491838 83593 316417 535032 338429 446273 207237 823650 478555 1118492
11055 1118492 760531 842370 664631 776857 662418 439004 443731 887665 584346 821687
11045 821687 999594 693692 656191 745182 911247 754960 744355 739117 284147 817677
11035 817677 682153 753927 618333 633705 541932 380004 964330 662059 806583 963375
11025 963375 416856 936094 692623 946190 382280 761568 537008 660078 414594 630840
11015 630840 474032 588312 343211 419880 520614 977393 611420 579930 696736 666966
$$ packed form
11085B86018K3469M05508A78338L90783j60879p2852o8412F6194O4686J63512
11075B94392A17901J69389R8883H1608C6179J32955R4523a16177E35214j71401
11065C63813J28025H3593K32824K18615j96603J07844B07237O16413l45095O39937
11055A118492l57961Q1839j77739J12226j14439k23414M727M43934l03319K37341
11045H21687J77907l05902l7501Q8991J66065j56287j0605n238B84147N33530
11035H17677j35524P1774j35594J5372r1773j61928N84326l02271J44524J56792
11025I63375D16856N19238k43471K53567C82280L79288k24560J23070k45484K16246
11015F30840j56808J14280k45101P6669J00734M56779l65973l1490J16806k9770
$$ plain form
11005 666966 644865 546927 760809 725720 585871 641558 762611 691402 594596 633322 714304
10994 714304 1022774 883056 957014 681039 896977 551287 869533 547807 1095071 800311
10984 800311 1074462 1182429 1383220 843931 955223 1223191 1521064 1793075 1891555 2030594
10974 2030594 2103935 2269477 2876448 3075933 3199739 3046736 3144735 2637022 2721379 2956958
10964 2956958 2267188 2226381 1577303 2209193 1981179 1652106 1771027 2014769 1595720 1791091
10954 1791091 1492484 1133744 1448186 598016 864265 660476 591947 398195 580419 361025
10944 361025 293432 268928 114293 -10126 180966 315804 64550 -4864 298475 228756 140805
10933 140805 347304 -109133 -69433 258340 56023 183872 89669 -67885 174747 -90485
$$ packed form
11005F66966k2101r7938K13882l5089j39849N5687J21053p1209r6806L8726Q0982
10994G14304L08470j39718P3958k75975K15938l45690L18246l21726N47264k94760
10984H00311K74151J07967K00791n39289J11292K67968K97873K72011R8480J39039
10974B030594P3341J65542O06971J99485J23806j53003R7999n07713Q4357K35579
10964B956958o89770m0807o49078O31890k28014l29073J18921K43742m19049J95371
10954A791091k98607l58740L14442E98016K66249k03789o8529j93752J82224k19394
10944C61025o7593k4504A14293a0126A80966J34838F4550d864B98475o9719q7951
10933A40805K06499a09133L9700B58340E6023J27849H9669f7885A74747i0485
$$ plain form
10922 436155 332262 10742 -131708 156708 -267255 -43746 419250 -247522 -176749 166756
10911 82239 -63293 21263 15883 -79200 -353457 -39641 259090 52121 57293 -276316 -80202
10899 420710 5083 210127 57725 -69479 -24798 252442 326250 -80765 170180 -32490 56325
10887 -157527 -192805 -187575 144677 223222 -23904 -258025 365404 111027 178034 227139 17636
10875 -13611 125609 59911 133444 -292120 -90199 77014 -202708 141000 -229339 256089
10864 59060 -335068 451751 -234818 -111745 -14563 -413440 -118616 100849 154804 -85272
10853 -19123 230121 -225376 101279 31876 -35453 29010 -198403 -128443 -64673 27666 40597
10842 40597 263258 -82481 73691 72924 278007 163438 -77893 -78157 229734 168466 -15946 -116286
$$ packed form
10922D36155j03893A0742a31708A56708b67255d3746D19250b47522P0773A66756
10911H2239f3293B1263n380g9200k74257c9641B59090E2121N172b76316h0202
10899D20710E083K05044E7725f9479b4798B52442P3808h0765A70180c2490E6325
10887a57527l5278N230A44677P8545b3904k34121C65404A11027O7007M9105A7636
10875a3611A25609E9911P3533b92120i0199G7014b02708A41000b29339B56089
10864E9060c35068D51751b34818a11745a4563l98877a18616A00849N3955h5272
10853a9123B30121b25376A01279C1876c5453B9010a98403O9960O3770B7666J2931
10842D0597K22661h2481G3691p67K05083j14569g7893k64B29734o1268a5946j00340
$$ plain form
10830 -116286 -102075 105870 41076 -157516 -184385 -54754 25756 57333 116092 -253276 -19762
10818 -137207 -60553 -268105 -137087 63375 -451061 82638 198614 -283254 -69122 -368593
10808 -368593 -519803 101213 -51091 137326 219751 -100634 79080 -259024 -233978 235509
10797 -243185 177852 -246454 -133554 -247532 -149625 -102601 77582 28796 224321 -49348
10786 108981 -490561 -73364 155912 -410892 176248 -4096 11118 -37178 15577 -62017 116374
10774 -69984 34585 -333170 277401 16447 100930 -19223 -114030 -36112 38599 347206 -118946
10762 13708 -148735 156794 27425 22637 439589 -338272 -65427 65752 -177902 -158501 -378110
10751 -378110 -237979 -119800 -102894 221787 -117975 150255 -36138 -66640 -43859 319341
$$ packed form
10830a16286J4211A05870D1076a57516k6869e4754B5756L1577N8759b53276a9762
10818a37207f0553k07552J31018F3375d51061H2638J15976b83254f9122k99471
10808c68593j51210A01213e1091A37326Q2425a00634G9080b59024K5046B35509
10797b43185A77852b46454J12900j13978R7907M7024G7582B8796J95525d9348
10786A08981d90561g3364A55912d10892A76248d096A1118c7178A5577f2017A16374
10774f9984C4585c33170B77401A6447Q4483a9223r4807c6112C8599L08607a18946
10762A3708a48735A56794B7425m788M16952c38272f5427F5752a77902J9401k19609
10751c78110J40131J18179J6906B21787a17975A50255c6138l0502K2781C19341
$$ plain form
10740 23736 215871 28237 -109104 352385 -257954 148978 -304015 -47173 -530276 367220
10729 150611 112532 -263907 46755 -265886 -232824 29530 -109131 -51861 116142 -27540 14451
10717 69744 215359 -251319 113196 -235296 144692 -258940 -43238 110397 200144 -151035
10706 -148220 204614 98263 -185144 -171439 133063 64751 -154631 53054 -8202 30813 -191426
10694 -200941 -275357 92455 34153 237908 -186654 94268 23102 92491 10723 -493699 -304793
10683 -304793 206225 -1948 -208891 189940 86315 -139368 -69873 101194 -272379 -112868
10672 -105385 87799 -46242 -208366 -98165 -62643 10655 -228166 -245685 361673 195674 90383
10660 -7245 26786 -129449 -20301 -419545 -234576 -29437 24494 22987 32034 259449 -113156
$$ packed form
10740B3736J92135B8237a09104C52385b57954A48978c04015d7173m83103C67220
10729A50611l8079b63907D6755b65886L3062B9530a09131e1861A16142b7540A4451
10717F9744J45615b51319A13196b35296A44692b58940d3238A10397Q9747a51035
10706a48220B04614I8263a85144J3705A33063F4751a54631E3054h202C0813a91426
10694b00941p4416I2455C4153K03755a86654I4268B3102O9389A0723d93699J88906
10683c04793B06225a948k06943A89940H6315a39368O9495A01194b72379a12868
10672a05385H7799d6242j62124i8165L5522A0655b28166j7519C61673j65999I0383
10660g245B6786a29449b0301l99244J84969b9437B4494j507R047K27415a13156
$$ plain form
10648 18000 -115023 351734 13703 -154989 -267854 98624 -186789 -124449 -117203 -68003 -91001
10637 -91001 226424 -46361 -97298 49012 -66379 -404580 -201276 -43900 -75986 206891 -15085
10625 52762 360387 138730 297047 271144 -242512 96405 -249215 26462 -167409 -40621
10614 -158045 -122810 -94375 110382 -124825 -446414 -9857 -139958 -164890 -407541 -105868
10603 5205 -50833 160987 -1645 -104444 -104587 -294039 -1300 -252437 -44374 -100950 15239 -481317
10590 126775 271173 76988 51081 207805 138019 -81561 102283 380662 -69240 -9143 -121459
10579 -121459 -24583 -212602 349788 228080 -207856 -203391 -137778 -13666 8960 -86737 -112991
10568 -112991 -118950 -68146 83152 -218791 112292 520082 -96196 -28842 -43646 -161411 154032
$$ packed form
10648A8000a15023C51734A3703a54989j12865I8624a86789O2340P246M9200k2998
10637i1001B26424d6361n0937D9012f6379l38201b01276d3900l2086B06891a5085
10625E2762L07625A38730J58317k5903b42512I6405b49215B6462a67409d0621
10614a58045L5235K8435A10382a24825l21589i857j30101k4932k42651a05868
10603E205e0833A60987a645j02799j43j89452a300k51137d4374n6576A5239d81317
10590A26775J44398G6988k5907J56724o9786h1561A02283K78379f9240i143j12316
10579a21459b4583j88019C49788j21708b07856M465O5613a3666H960h6737k6254
10568a12991n959N0804H3152b18791A12292M07790i6196b8842j4804j17765A54032
$$ plain form
10556 11304 136530 393488 -144693 -207543 -114390 -2584 218024 -119714 -153174 -262707 -203518
10545 -203518 57101 -100144 187052 -256994 -558710 -234591 -31603 89038 316142 344259
10535 344259 -13355 -99392 10409 -69185 -448313 130483 274556 72507 -283411 -22665 -65397
10524 -65397 333815 -122642 14275 -105359 86132 -21423 -136272 323098 104853 -85580
10513 318670 40474 -54331 276668 -114038 222677 151525 -68146 -159366 141255 -562889
10502 260878 -35201 -223830 8180 -399555 -409316 -104369 144418 -69001 157442 309989 -217690
10490 -146705 167149 437127 1798 -194769 5140 -135863 -29414 132910 211807 294241 199196
10479 199196 155738 -92195 278163 -143409 -6682 930 382678 46023 -420774 138708 116692
$$ packed form
10556A1304J25226K56958a44693o2850R3153b584B18024a19714l3460j09533N9189
10545b03518E7101a00144A87052b56994l01716b34591c1603H9038K27104K8117
10535C44259a3355q6037A0409f9185l79128A30483J44073G2507b83411b2665m2732
10524f5397C33815a22642A4275a05359H6132b1423j14849C23098A04853h5580
10513C18670D0474e4331B76668a14038B22677p1152f8146r1220A41255e62889
10502B60878c5201j88629H180c99555r761a04369A44418f9001A57442J52547b17690
10490a46705A67149K69978A798a94769E140a35863b9414A32910P8897Q2434r5045
10479A99196m3458i2195B78163a43409f682I30L81748D6023d20774A38708k2016
$$ plain form
10468 116692 -387151 -45992 -268399 -104086 -51465 -171153 -93947 -56113 -73274 -96057 -251557
10457 -251557 28342 -208871 274030 127743 -34709 -296579 -102630 -177025 37356 -35976
10446 42847 -118615 -104457 85674 -181218 51614 41220 40488 -83422 -65206 176589 -14778
10434 -160312 -295909 43666 -16818 -148669 -33076 -271362 89602 234326 -244558 307325
10423 -86151 14822 -342821 89570 -93870 263238 123993 -71727 178755 -53639 -107174 110908
10411 146305 -172434 -88287 -211252 -3275 134077 200708 -140590 90970 54417 34682 87534
10400 87534 -189547 100458 -187239 279559 339493 101534 67228 357853 -87555 339806
10389 304286 38267 106956 126973 102900 82020 62130 201466 -91986 325707 -47194 -321994
$$ packed form
10468A16692c87151d5992k22407a04086e1465j19688P7206L7834j7161k2783j55500
10457b51557B8342b08871B74030A27743c4709k61870a02630p4395C7356c5976
10446D2847a18615J4158H5674a81218E1614j0394p32h3422J8216A76589a4778
10434a60312j35597D3666a6818j31851c3076k38286H9602J44724b44558C07325
10423h6151A4822c42821H9570i3870B63238A23993g1727A78755e3639n3535A10908
10411A46305a72434Q4147j22965c275A34077O6631a40590I0970l6553j9735N2852
10400H7534a89547A00458a87239B79559N9934A01534l4306K90625h7555C39806
10389C04286C8267O8689K0017k4073k0880j9890J39336i1986C25707d7194k74800
$$ plain form
10378 -321994 327335 108568 305703 88695 260746 -235604 169599 322741 356439 668396
10368 668396 398236 524192 555389 360467 336342 258516 559562 73383 438657 423595
10358 423595 319163 476554 212801 -19001 551136 471645 361234 274971 465849 445815
10348 445815 399067 457961 229418 -141692 760360 313629 537224 134837 36935 520687
10338 520687 570412 482949 346461 117057 -66532 239366 175788 -47298 233664 7603 -55821
10326 374791 60272 493085 535863 100306 451493 216816 -33749 -186801 309283 383884
10316 383884 520879 -76771 -146855 -10471 370382 172193 12181 83996 8173 126416 -26418
10304 -132301 33690 -259356 30418 239996 -105765 117746 149002 195271 283028 484238
$$ packed form
10378c21994C27335A08568J97135H8695J72051b35604A69599J53142L3698L11957
10368F68396k70160J25956L1197j94922k4125p7826L01046G3383L65274j5062
10358D23595j04432J57391B12801a9001E51136p9491j10411q6263J90878k0034
10348D45815m6748N8894k28543a41692G60360C13629K23595A34837C6935M83752
10338E20687M9725q7463j36488A17057f6532B39366o3578d7298B33664G603e5821
10326C74791F0272M32813M2778A00306L51187B16816c3749j53052C09283P4601
10316C83884J36995g6771p0084a0471C70382A72193A2181P1815H173J18243b6418
10304a32301C3690b59356C0418K09578a05765A17746L1256M6269Q7757K01210
$$ plain form
10294 484238 203633 5969 -86604 -57078 -102024 -22097 -305475 -23600 251918 -168270 -305882
10283 -305882 203530 -74742 -96539 -267941 -276243 197249 82005 -238861 -69620 259633 -174101
10271 -381366 47250 9906 -353832 -104526 3172 163998 -125299 -46570 269501 -79422 186890
10259 289169 289449 82435 344051 518735 174981 199509 264554 7171 125708 181380 33532
10247 -422041 44212 -183 17284 -207602 349419 120399 -93576 15025 -97299 -253374 15794
10235 -177320 165643 -116974 -4760 117657 100940 -397091 -56391 -108577 -84920 -88341 -210103
10224 -210103 -150453 -62402 62583 -379678 -99150 130495 60947 173635 -204911 -135480 -243028
10213 -243028 -10986 114773 116007 155815 -524165 -16391 332897 -28836 116392 126684 189003
$$ packed form
10294D84238B03633E969h6604K9526m4946b2097k83378b3600B51918a68270j37612
10283c05882B03530g4742k1797j71402q302A97249H2005b38861f9620B59633a74101
10271c81366D7250I906c53832a04526C172J60826a25299d6570B69501g9422A86890
10259B89169K80H2435K61616J74684A74981K4528O5045G171J18537N5672C3532
10247d22041D4212a83A7284b07602C49419A20399i3576A5025i7299j56075A5794
10235a77320A65643a16974d760A17657j6717c97091e6391n2186K3657l421j21762
10224b10103N9650f2402F2583c79678i9150A30495F0947J12688b04911O9431j07548
10213b43028a0986A14773J234L9808e24165a6391C32897b8836A16392J0292O2319
$$ plain form
10202 189003 -315751 112430 141702 183921 -45382 -407821 -121172 328963 -175992 -133781
10192 -133781 -450785 -4765 85040 5275 -172374 227696 305693 -165370 -300735 185412 -292289
10180 -100290 -74070 -297775 -387493 45432 132962 -192761 39522 101437 -164251 80535 46422
10169 46422 -60524 -118127 54463 43728 -101710 -226697 -165808 104669 -60605 -184223 -34867
10157 80961 -75032 -21369 -128018 -159170 -242916 -501275 86169 53735 -269165 183915 56743
10145 111802 110086 -329784 -121504 110577 -16710 -182041 -318192 -197710 -118334 -8367 18052
10133 40691 278881 -48060 -216255 -48387 -206624 -121118 -106354 29812 -19825 -14850 -218530
10122 -218530 -10898 -110784 -108327 -216850 -185324 -71804 -83348 -135524 121466 -24696 -18006
$$ packed form
10202A89003c15751A12430K9272M2219d5382l62439a21172C28963a75992M2211
10192a33781l17004d765H5040E275a72374B27696P7997a65370j35365A85412b92289
10180a00290K6220k23705q9718D5432Q7530a92761C9522O1915a64251H0535l4113
10169D6422f0524n7603E4463j0735a01710j24987O0889A04669f0605j23618c4867
10157H0961g5032b1369j06649l1152q3746k58359H6169l2434b69165A83915E6743
10145A11802j716c29784a21504A10577a6710j65331j36151J20482P9376h367A8052
10133D0691K38190d8060j68195d8387j58237Q5506J4764B9812a9825M975k03680
10122b18530a0898r9886K457j08523L1526g1804j1544n2176A21466b4696O690
$$ plain form
10111 -18006 325084 -172968 -157331 -144832 -63942 -97739 -32654 23397 -141856 -217305 -26060
10099 274729 -33542 34848 -149671 -56061 390305 -238341 237253 -178207 -108540 38983
10088 128055 -104614 62555 -79201 9488 -28154 -292305 -286973 -91877 -304542 -412634 429
10076 -99322 20812 270898 -84455 -36230 -10941 -471977 -253254 -2476 -197794 -102098 67962
10064 -40380 -52028 -79889 148934 87132 -370334 81751 58668 -189184 33972 -73172 -118831
10053 -118831 54365 -263731 43101 -261313 126425 217450 -265014 95954 -227683 -211381
10043 -211381 -91961 -391 -188835 19191 29743 60538 -200068 -155625 -201091 -131943 -48478
10031 -270048 100647 139286 48647 78096 -65393 -372081 189673 -18519 -40 -222031 -102233
$$ packed form
10111a8006C25084a72968J5637J2499f3942l3797c2654B3397a41856p5449b6060
10099B74729c3542C4848a49671e6061C90305b38341B37253a78207O9667C8983
10088A28055a04614F2555g9201I488b8154k64151N332i1877k12665j08092D29
10076i9322B0812K50086h4455c6230a0941m61036K18723b476j95318R5696F7962
10064d0380j1648k7861A48934o1802c70334H1751k3083a89184C3972g3172m5659
10053a18831E4365b63731D3101b61313A26425R1025b65014I5954b27683J6302
10043b11381i1961c91j88444A9191J0552L0795b00068M4443m5466O9148d8478
10031b70048A00647L8639D8647K9449f5393l06688A89673a8519d0k21991a02233
$$ plain form
10019 -47678 -362196 87861 -194607 -57519 -241748 -317797 -135758 -440579 -132519 -95902
10009 -95902 -133135 -150724 -223129 -300389 -190651 210 -133993 -325485 -25799 -75117 -422118
9998 -422118 -11231 88299 -62228 128600 -251304 -222984 42836 -150486 306411 124402 -41951
9986 131262 208147 156520 -150803 9161 26081 316331 -270087 -70478 -188244 -167509 42371
9974 11630 80645 -256768 -200306 -235625 122566 -61844 84309 -227983 -455985 238912 -241280
9962 99568 -34496 -367698 -250062 -16768 234642 -353180 199427 -211374 -209915 -198904 -73123
9950 -182299 279027 -46403 -169243 -74160 -295930 -123443 -62349 -40908 -182243 -163294 -379420
9939 -379420 29986 -57827 245478 14032 21908 -71522 -67050 110288 -166061 -120780 39423
$$ packed form
10019d7678l14518H7861a94607e7519j84229p6049a35758l04821a32519L6617
10009i5902l7233j7589p2405p7260J09738B10a33993j91492b5799m9318l47001
9998d22118a1231H8299f2228A28600b51304K8320D2836a50486C06411A24402d1951
9986A31262P6885n1627a50803I161J6920K90250b70087g0478j17766K0735D2371
9974A1630O9015b56768N6462l5319A22566f1844H4309b27983k28002B38912b41280
9962I9568c4496l33202J17636a6768B34642c53180A99427b11374J459J1011g3123
9950a82299B79027d6403j22840g4160k21770a23443O1094K1441j41335J8949k16126
9939c79420B9986e7827B45478A4032P876g1522M472A10288a66061M5281C9423
$$ plain form
9927 -200122 -84936 209017 -20716 156811 -567752 -199921 24695 132209 -18718 -142462
9917 -142462 -344735 293715 -346646 -104497 -346251 72535 -38725 -22587 -70823 -206831
9907 -206831 -239881 320483 389750 -24129 -105976 272820 214241 -210225 -157007 38420 74050
9896 74050 -212380 -172132 -125655 144858 30532 -307471 178790 258424 -250901 -379961 249709
9884 -27218 135687 5189 -164000 -417621 -198405 78767 242386 -279871 -247393 13994 109225
9873 109225 19516 81742 -134149 -9735 -112974 -347425 -131317 -93491 -48824 -245292 -85314
9861 55317 -90585 -201134 -24218 58566 -79682 -93509 -222059 -31741 -128269 114516 303931
9850 303931 418197 96316 -138277 -161193 53386 79254 -329263 130100 -250217 -318330 -281197
$$ packed form
9927b00122h4936B09017b0716A56811e67752a99921B4695J07514a8718j23744
9917a42462k02273B93715c46646a04497k41754G2535c8725J6138m8236j36008
9907b06831l3050C20483O9267b4129q1847B72820n8579b10225N3218C8420L5630
9896G4050b12380M0248M6477A44858C0532c07471A78790P9634b50901j29060B49709
9884b7218A35687E189a64000k53621a98405G8767J63619b79871L2478A3994R5231
9873A09225A9516O2226a34149i735j03239k34451a31317L7826M4667j96468h5314
9861E5317i0585j10549b4218E8566g9682j3827j28550c1741r6528A14516J89415
9850C03931J14266I6316a38277k2916E3386K5868c29263A30100b50217o8113L7133
$$ plain form
9839 -281197 -212297 14173 -164475 -31425 46571 -136207 -78138 26308 -173455 147442 100495
9828 100495 -428225 -159395 -224025 -215945 -13334 157066 2105 -87699 -274970 -243251 -155048
9817 -155048 -1564 112757 130366 179521 107750 -204245 -16270 -232091 -88354 32981 134226
9806 134226 -112490 -259302 11596 -215591 -72734 -82450 31993 -93243 -64018 187115 -378935
9794 -222239 10712 -213899 -212143 -93374 20610 -283192 -197646 -176558 -243561 -345653 -19742
9782 -38659 -156296 -63528 180889 227208 106420 392635 67850 170704 -200139 -273308 -53892
9770 87424 -5772 -40738 -261470 227193 -187304 -321893 111667 205902 -449064 81242 256416
9759 256416 -199381 -13231 -246315 23711 172310 14892 16515 21610 193530 -61160 145467
$$ packed form
9839b81197O8900A4173a64475c1425D6571a36207N8069B6308a73455A47442m6947
9828A00495d28225a59395o4630Q080a3334A57066B105h7699j87271L1719Q8203
9817a55048a564A12757J7609M9155p1771b04245a6270k15821h8354C2981J01245
9806A34226a12490j46812A1596b15591g2734r716C1993i3243K9225A87115c78935
9794b22239A0712b13899J756i3374B0610b83192Q5546K1088o7003j02092a9742
9782c8659j17637f3528A80889M6319A06420K86215F7850J02854b00139p3169e3892
9770H7424e772l4966k20732B27193a87304j34589A11667R4235d49064H1242J75174
9759B56416a99381a3231k33084B3711J48599A4892J623N095J71920f1160A45467
$$ plain form
9747 -83038 -224735 -219695 161705 -194013 -17981 3287 -39841 -391050 -61313 -392433 -208403
9736 -208403 -166843 -153559 137643 -144810 -91120 59461 -192140 -209402 -29129 69824 -146729
9724 -80025 -258571 -186323 -518018 87775 -74323 -20439 -351169 6497 60734 49697 56310 162743
9712 162743 -119188 -3896 -47449 -98133 -248340 41101 11745 404747 -119405 170721 -10394
9700 -70031 -159388 -211431 115627 -61161 38857 -78780 -32436 116628 -280783 -84749 98624
9688 -224810 8375 -310602 105297 -159641 -110315 55212 -37904 19559 -92750 -192275 -18866
9676 38503 -70720 -120785 -110039 -123247 -25657 -282996 23097 -255585 -231729 25085 24357 -79948
9663 34369 108481 -377530 9334 -64166 198865 334990 -13542 -96417 28650 -350747 -312887
$$ packed form
9747h3038j41697N040A61705a94013a7981C287c9841l51209f1313l31120J84030
9736b08403M1560J3284A37643a44810N3690E9461a92140j7262b9129F9824a46729
9724h0025j78546P2248l31695H7775g4323b0439l30730F497N4237j1037O613J06433
9712A62743a19188c896m3553n0684j50207D1101A1745L93002a19405A70721a0394
9700g0031q9357n2043A15627f1161C8857g8780c2436A16628b80783h4749I8624
9688b24810H375c10602A05297a59641M9326E5212c7904A9559i2750r9525a8866
9676C8503g0720n0065J0746j3208b5657k57339B3097b55585K3856B5085p28g9948
9663C4369P4112c77530I334f4166A98865J36125a3542q2875B8650c50747L7860
$$ plain form
9652 -312887 165301 -447149 -122058 -51736 -398900 -201565 -384255 -240319 -83552 -138351
9642 -138351 -145713 -62628 42809 -313080 37314 -396194 -142271 -166765 -82788 146888 -132891
9630 -121961 545 36923 9827 -333250 -390243 -108160 -70294 247031 -5012 -469775 37524 202699
9618 202699 -167853 -292164 -64277 264167 245897 -65951 -200751 -8710 155706 -199209 -54168
9606 198100 63598 22852 -28272 46180 -136701 -272952 -83528 -162546 -136283 151619 197588
9595 197588 150832 -284475 74243 77268 -46417 218808 39730 46925 -141150 -173019 -174470 14244
9582 296535 198240 -45528 -53454 52872 -413387 -114017 66208 -47200 -59642 -290563 -125205
9570 -223922 -57858 243544 116565 -37062 13304 -100614 -236481 -192293 -19646 -73215 -344014
$$ packed form
9652c12887A65301d47149a22058e1736l47164J97335j82690J43936h3552n4799
9642a38351p362f2628D2809c13080C7314c96194a42271k4494h2788A46888a32891
9630a21961E45L6378I827c33250n6993a08160L7866B47031e012m64763C7524J65175
9618B02699a67853j24311f4277B64167j8270f5951j34800h710A55706a99209e4168
9606A98100F3598B2852b8272D6180a36701j36251h3528p9018K6263A51619M5969
9595A97588m6756b84475G4243L025d6417B18808C9730P195a41150l1869j451A4244
9582B96535r8295d5528p926E2872d13387a14017F6208d7200j2442k30921a25205
9570b23922e7858B43544A16565c7062A3304a00614j35867M4188a9646n3569k70799
$$ plain form
9559 -344014 -296134 160462 2955 38727 109895 130507 -183571 121453 -264465 -89598 -153017
9548 -153017 10824 -93648 -12619 89504 190125 -276954 -234551 -200615 -82876 88092 -354133
9536 105736 -296312 -263604 27236 -49459 297940 -117498 6840 212573 -21798 187054 -427849
9524 -80126 43862 124689 -135514 367779 144333 264841 -264064 41287 -11349 -136669 -3353
9512 165883 -185419 -286122 -205269 95121 165938 -74570 306080 -140864 -276225 224991
9501 443372 -144781 342427 -116524 4378 156724 -145210 -29411 -386621 -62022 -323653
9491 -323653 96166 241834 -362691 -209389 114546 -253333 -194747 -19026 -210950 65451
9480 -58428 -15774 300835 114890 -34631 -210039 252669 -365693 -134043 -397681 -277041
$$ packed form
9559c44014M7880A60462B955L5772P1168K0612a83571A21453b64465h9598o3419
9548a53017A0824i3648a2619H9504J00621b76954M2403L3936h2876H8092c54133
9536A05736b96312L2708B7236d9459B97940a17498F840K05733b1798A87054d27849
9524h0126D3862Q0827a35514C67779A44333J20508b64064D1287a1349j25320c353
9512A65883a85419j00703Q0853I5121P0817g4570C06080a40864j35361B24991
9501D43372a44781C42427a16524D378J52346a45210b9411l57210f2022k61631
9491c23653I6166J45668c62691J53302A14546b53333N8586a9026j91924F5451
9480e8428a5774C00835A14890c4631j75408B52669c65693a34043k63638J20640
$$ plain form
9470 -277041 84320 -353739 -132128 278882 23353 -299965 -79938 -48736 -167180 -432835
9460 -432835 27421 -61594 116256 -144486 -491266 -255020 -199915 -43758 -102848 -99323 -83123
9449 -83123 68828 54306 -125341 -8976 -95207 -227034 -152333 -292037 150115 143885 -226294
9437 -164919 -150063 -372441 363754 -253117 -169957 -67275 209511 -112493 -78789 -27025 -12324
9425 -322504 147120 59507 96628 -139191 -287588 127305 -90911 -87434 -152113 -48176 -49286
9414 -49286 -164510 74069 -354668 141769 -263037 -20854 72188 -138099 91935 -1884 -125921
9403 -125921 -290845 -291649 -112341 -280294 -88756 -126114 -77016 -260394 -185846 -231812 -18562
9391 -254925 8189 28457 263774 -141618 -187077 -20264 65279 155617 -241231 -483576 -107098
$$ packed form
9470b77041H4320c53739a32128B78882B3353b99965g9938L1202j18444k65655
9460d32835B7421f1594A16256a44486l46780K36246N5105d3758n9090L525J6200
9449h3123F8828j4522a25341h976q6231j31827P4701j39704A50115o230b26294
9437a64919J4856k22378C63754b53117Q3160f7275B09511a12493L3704b7025a2324
9425c22504A47120E9507L7121a39191j48397A27305i0911L477o4679d8176j110
9414d9286j15224G4069c54668A41769b63037b0854G2188a38099I1935a884j24037
9403a25921j64924q04a12341j67953h8756l7358M9098j83378P4548m5966a8562
9391b54925H189K0268K35317a41618m5459b0264F5279R0338b41231k42345a07098
$$ plain form
9379 -98008 -348005 -271970 114650 136921 -154615 14920 -75805 -289579 -262987 -52464 130701
9367 -36828 73636 68510 153477 -384647 -180468 30449 128416 51535 243043 -59644 -121341
9356 -121341 172778 7320 70653 -89613 -64357 21988 -401280 -145404 -258379 -136814 41173
9344 -3819 -146040 -40531 -205596 -403632 277557 166742 -318210 56664 67254 -290680 -385673
9333 -385673 -144608 36482 283114 -222113 -50916 71794 -34360 -119733 -126290 -22019 -114228
9322 -114228 8972 249915 -413263 22419 -61210 -268914 5432 -52601 131451 -10317 96710
9310 -165880 -409479 99511 -75568 -58879 88393 35834 32273 -131286 -308058 -256366 -92475
9298 -343697 27822 -135831 -88062 -261215 -286773 180056 227075 309166 -41446 160252 -244613
$$ packed form
9379i8008k49997P6035A14650K2271a54615A4920g5805k13774K6592e2464A30701
9367c6828G3636n126Q4967c84647a80468C0449R7967E1535J91508e9644o1697
9356a21341A72778G320O3333h9613K5256B1988d01280a45404j12975J21565D1173
9344c819j42221d0531j65065j98036B77557j10815c18210E6664J0590b90680r4993
9333c85673a44608C6482K46632b22113e0916G1794c4360q5373o557b2019r2209
9322a14228H972K40943d13263B2419f1210k07704E432e2601A31451a0317I6710
9310a65880k43599I9511g5568J6689H8393C5834l561a31286j76772N1692i2475
9298c43697B7822a35831M7769j73153k5558A80056M7019Q2091d1446A60252b44613
$$ plain form
9286 -34353 111679 -74135 256033 -256155 434599 -168574 -204580 -202248 -303012 -54939 21099
9274 69939 -57501 196681 -68713 170433 -374206 -80906 112781 17204 -160942 -1523 -103577
9263 -103577 -168764 78658 -846 -200714 172392 -325368 14275 63777 -185141 85091 242049
9252 242049 35047 -178773 -122264 -2183 278626 -285477 -157454 -35947 -307511 -147283 69107
9240 52001 20944 71832 131540 76827 35196 152741 -33062 -5745 -235123 113003 -236520
9228 41081 262264 43035 -370968 -77741 -46824 -134088 185133 -449037 -112886 -56911 -2433
9216 -200894 -264833 176088 358566 -30651 203062 94461 -167658 -129345 -31491 51618 -116139
9204 -100639 -128463 153 -341553 -27388 -67714 -236473 -131206 -257534 -231223 -185868 -156840
$$ packed form
9286c4353A11679g4135B56033b56155D34599a68574l6006K332j00764e4939B1099
9274F9939e7501A96681f8713A70433c74206h0906A12781A7204a60942a523j02054
9263a03577o5187G8658h46j99868A72392c25368A4275M9502a85141H5091J56958
9252B42049C5047a78773N6509b183B78626b85477J28023c5947k71564a47283F9107
9240E2001B0944N0888N9708n4713C5196J17545c3062e745k29378A13003b36520
9228D1081K21183D3035c70968g7741L0917q7264A85133d49037a12886N5975b433
9216b00894o3939A76088J82478c0651B03062I4461a67658L8313c1491E1618a16139
9204a00639k7824A53c41553b7388m0326j68759J05267j26328K6311M5355K9028
$$ plain form
9193 -156840 -37034 132235 -131509 318445 -263132 -243284 -7857 -34617 -84162 -168823 110313
9181 501478 -109257 -174747 1273 -248981 15523 172735 -95585 157581 -296504 2143 228156
9170 228156 81722 -20887 40225 -3152 16571 174158 9903 -272751 -158351 35089 -58841
9158 95744 -226669 -98784 -221645 134535 86840 18918 -80738 -143229 33379 -355898 13498
9146 -297647 -273209 -30034 177071 -18716 -12421 38765 238494 -17240 270679 -7227 -78150
9135 -78150 -55561 146460 -35158 -128547 67049 252673 54177 -459930 84028 131084 -157394
9123 -286605 -5949 -227018 67187 369 -132369 53091 -7358 -116776 225822 -268337 78533
9111 229948 -29878 243383 -28612 82683 -316793 -162850 -348453 -62764 122923 -69026 -181503
$$ packed form
9193a56840c7034A32235a31509C18445b63132J9848g857k6760m9545q4661A10313
9181E01478a09257o5490A273b48981A5523J57212i5585A57581b96504B143K26013
9170B28156H1722b0887D0225c152A6571J57587I903b72751J14400C5089e8841
9158I5744b26669i8784j22861A34535m7695A8918h0738o2491C3379c55898A3498
9146b97647K4438c0034A77071a8716O295C8765J99729a7240B70679g227p0923
9135g8150K2589A46460c5158r3389F7049J85624E4177d59930H4028M7056a57394
9123b86605e949k21069F7187C69a32369E3091g358j09418B25822b68337G8533
9111B29948b9878B43383b8612H2683c16793J53943j85603f2764A22923f9026j12477
$$ plain form
9100 -181503 -258993 -104703 -296510 -702195 2417 -126072 -183313 -1292 34995 -18405 -157737
9089 -157737 -298085 -167682 33055 -331712 -206421 -347383 -37230 166375 -206446 -263440
9079 -263440 -97057 -118524 88112 142783 -260772 79689 100391 -145751 -46511 -232428 -143635
9068 -143635 -280218 30693 142695 -39678 -97998 -102489 14426 -22638 -36038 -367740 -55891
9056 -189729 -177520 58226 85523 -177183 -236307 -21063 -146451 -318848 155798 26057 29614
9045 29614 -34415 18784 9413 -178944 -120904 -516458 74611 -18250 -165434 330556 -139399
9033 -253038 -383231 434604 304474 -54107 -386511 -46130 -79835 -38473 17172 -21199 129351
9021 -434328 -170896 146960 -21388 -134527 -165571 -33841 -306116 31215 -273899 -101160
$$ packed form
9100a81503p7490a04703j91807m05685B417a26072n7241a292C4995a8405j39332
9089a57737j40348J30403C3055c31712J25291j40962c7230A66375b06446n6994
9079b63440i7057k1467H8112N4671b60772G9689K0702a45751d6511j85917Q8793
9068a43635j36583C0693J12002c9678n8320m491A4426b2638j3400l31702e5891
9056a89729J2209E8226K7297a77183n9124b1063j25388j72397A55798B6057L557
9045B9614c4415A8784r371a78944N8040l95554G4611a8250j47184C30556a39399
9033b53038j30193D34604j30130e4107l32404d6130l3705c8473A7172b1199A29351
9021d34328a70896A46960b1388j13139l1044c3841k72275C1215b73899a01160
$$ plain form
9010 -514080 205913 -485608 -135240 5374 17260 -85175 -91199 -157757 -191470 68068 19422
8998 -202651 -47484 -46787 48132 -605568 -18555 -274322 -10045 22264 -116112 146836 -152389
8986 -357719 -75991 -92076 38599 -192925 -248174 154899 301310 60927 -171697 -294699 -23742
8974 -496825 -338195 -158 157889 -193557 -44004 87490 -131493 -123520 -192820 -79711 -265945
8963 -265945 -54742 3229 -250082 -24832 -229074 -141468 37761 -198639 -204004 270583 -107898
8951 38247 -87371 -163446 -47320 -100149 -190420 -118980 14733 -114928 -60567 -217041 102991
8939 81429 -162476 206544 189186 -123163 185957 695581 266689 383049 62605 -168368
8928 44642 244693 186654 818866 1843796 3075405 4366207 8591253 12702468 5566432
$$ packed form
9010e14080B05913d85608a35240E374J1886h5175o024o6558l3713F8068A9422
8998b02651d7484O97D8132f05568a8555k55767a0045B2264a16112A46836a52389
8986c57719g5991j6085C8599a92925n5249A54899J46411F0927a71697j23002b3742
8974d96825J58630a58A57889a93557d4004H7490a31493P973o9300g9711j86234
8963b65945e4742C229b50082b4832k04242Q7606C7761a98639n365B70583a07898
8951C8247h7371p6075d7320n2829r0271P1440A4733a14928N4361j56474A02991
8939H1429a62476B06544j7358a23163A85957N09624B66689J16360F2605a68368
8928D4642K00051n8039O32212J024930J231609J290802M225046M111215E566432
$$ plain form
8918 2070800 841899 533327 -151942 133758 278544 18366 -84540 296359 230812 385431
8908 385431 249287 -10467 140623 194115 -422776 -306071 136611 114707 -141085 -117173
8898 -117173 -167826 -357099 -76347 -56160 -139453 60979 200124 -49725 228889 193444 160575
8887 160575 -152975 -250550 -85085 15740 135926 -50670 114182 63061 36624 -60870 63983
8875 -89065 -120751 -197571 261969 220573 -2198 -68511 167987 206838 -226140 24653 67301
$$ packed form
8918B070800H41899l08572a51942A33758J44786A8366h4540B96359o5547J54619
8908C85431j36144a0467A40623N3492d22776J16705A36611k1904a41085K3912
8898a17173n0653j89273g6347K0187q3293F0979J39145d9725B28889l5445l2869
8887A60575a52975r7575h5085A5740J20186e0670A14182n1121k6437f0870F3983
8875h9065l1686p6820B61969m1396b198o6313A67987L8851b26140B4653M2648
$$ [...]
##END NTUPLES=NMR SPECTRUM
##END=
