##TITLE=AC1519_ROEFFECT0004_8202019_CSQISYQX1b
##JCAMPDX= 6.0         $$ Bruker NMR JCAMP-DX V2.0
##DATA TYPE= NMR SPECTRUM
##DATA CLASS= NTUPLES
##ORIGIN= BRUKER
##OWNER= Administrator
$$ 1.72 TOPSPIN		Version 2.1
$$ 2013-09-26 21:18:29.774 -0700  Administrator@X
$$ Compression mode = diff/dup
##.OBSERVE FREQUENCY= 400.02188249412
##.OBSERVE NUCLEUS= ^1H
##.ACQUISITION MODE= SIMULTANEOUS (DQD)
##.ACQUISITION SCHEME= undefined
##.AVERAGES= 64
##.DIGITISER RES= 22
##SPECTROMETER/DATA SYSTEM= spect
##.PULSE SEQUENCE= noesygpps1d.comp
##.SOLVENT NAME= COFFEE_meoh
##.SHIFT REFERENCE= INTERNAL, COFFEE_meoh, 1, 14.961
##AUDIT TRAIL= $$ (NUMBER, WHEN, WHO, WHERE, PROCESS, VERSION, WHAT)
$$ ##TITLE= Audit trail, TOPSPIN		Version 2.1
$$ ##JCAMPDX= 5.01
$$ ##ORIGIN= Bruker BioSpin GmbH
$$ ##OWNER= Administrator
$$ $$ E:\/data/COFFEE/nmr/AC1519_ROEFFECT0004_8202019_CSQISYQX1b/12/pdata/1/auditp.txt
$$ ##AUDIT TRAIL=  $$ (NUMBER, WHEN, WHO, WHERE, PROCESS, VERSION, WHAT)
(   1,<2013-09-26 21:18:24.641 -0700>,<Administrator>,<X>,<go>,<TOPSPIN 2.1>,
      <created by zg
	started at 2013-09-26 21:06:54.502 -0700,
	POWCHK enabled, PULCHK disabled,
       configuration hash MD5:
       C8 4E 4E 5D D3 5C D8 9E 9F 52 82 E0 59 8A DE 15
       data hash MD5: 64K
       F8 07 A7 30 50 4E 5C 96 D5 89 A1 AC F0 A9 94 70>)
(   2,<2013-09-26 21:18:27.665 -0700>,<Administrator>,<X>,<proc1d>,<TOPSPIN 2.1>,
      <Start of raw data processing
       efp LB = 0.3 FT_mod = 6 PKNL = 1 PHC0 = 0 PHC1 = 0 SI = 128K 
       data hash MD5: 128K
       B5 60 5D 3A 22 78 9D A3 BF C0 3B 72 A2 32 BC 11>)
(   3,<2013-09-26 21:18:28.665 -0700>,<Administrator>,<X>,<proc1d>,<TOPSPIN 2.1>,
      <pk PHC0 = -84.23767 PHC1 = 0 
       data hash MD5: 128K
       BA 11 1F 57 04 8B ED 21 E6 24 22 04 0C C6 48 C8>)
(   4,<2013-09-26 21:18:29.196 -0700>,<Administrator>,<X>,<proc1d>,<TOPSPIN 2.1>,
      <abs ABSG = 1 
       data hash MD5: 128K
       D3 27 C3 AF 54 42 44 B0 1F 78 82 4E 26 B9 21 35>)
(   5,<2013-09-26 21:18:29.305 -0700>,<Administrator>,<X>,<proc1d>,<TOPSPIN 2.1>,
      <abs ABSG = 2 
       data hash MD5: 128K
       92 27 76 49 E2 24 4B 63 F3 43 40 91 78 B9 6E 45>)
(   6,<2013-09-26 21:18:29.383 -0700>,<Administrator>,<X>,<proc1d>,<TOPSPIN 2.1>,
      <abs ABSG = 3 
       data hash MD5: 128K
       E4 40 F9 E3 A3 43 DD 52 01 C6 03 E3 7A 72 EB 70>)
(   7,<2013-09-26 21:18:29.477 -0700>,<Administrator>,<X>,<proc1d>,<TOPSPIN 2.1>,
      <abs ABSG = 4 
       data hash MD5: 128K
       C3 D0 82 08 C5 0D 9C 16 6F 8D 77 54 43 20 1D 25>)
(   8,<2013-09-26 21:18:29.571 -0700>,<Administrator>,<X>,<proc1d>,<TOPSPIN 2.1>,
      <abs ABSG = 5 
       data hash MD5: 128K
       AB 39 40 1B 63 FC 99 50 43 1C F6 94 E1 49 6D 78>)
$$ ##END=
$$ 
$$ $$ hash MD5
$$ $$ 35 65 AC 69 27 1E 1B 2E D9 28 53 A6 9F A1 5A 53
##$RELAX= 
##$RELAX= 
##$RELAX= 
##$RELAX= 
##$RELAX= 
##$RELAX= 
##$RELAX= 
##$RELAX= 
$$ Bruker specific parameters
$$ --------------------------
##$DU= <E:\>
##$EXPNO= 12
$$ [...]
150 150 150 150 150 150 150 150
##$TP07= 0
##$TPNAME0= <>
##$TPNAME1= <>
##$TPNAME2= <>
##$TPNAME3= <>
##$TPNAME4= <>
##$TPNAME5= <>
##$TPNAME6= <>
##$TPNAME7= <>
##$TPOAL= (0..7)
0.5 0.5 0.5 0.5 0.5 0.5 0.5 0.5
##$TPOFFS= (0..7)
0 0 0 0 0 0 0 0
##$TUNHIN= 0
##$TUNHOUT= 0
##$TUNXOUT= 0
##$USERA1= <user>
##$USERA2= <user>
##$USERA3= <user>
##$USERA4= <user>
##$USERA5= <user>
##$V9= 5
##$VALIST= <valist>
##$VCLIST= <CCCCCCCCCCCCCCC>
##$VD= 0
##$VDLIST= <DDDDDDDDDDDDDDD>
##$VPLIST= <PPPPPPPPPPPPPPP>
##$VTLIST= <TTTTTTTTTTTTTTT>
##$WBST= 1024
##$WBSW= 4
##$XGAIN= (0..3)
0 0 0 0
##$XL= 0
##$YL= 0
##$YMAX_a= 6611483
##$YMIN_a= -13588519
##$ZGOPTNS= <>
##$ZL1= 120
##$ZL2= 120
##$ZL3= 120
##$ZL4= 120
##$ABSF1= 14.961
##$ABSF2= -5.597181
##$ABSG= 5
##$ABSL= 3
##$ALPHA= 0
##$AQORDER= 0
##$ASSFAC= 0
##$ASSFACI= 0
##$ASSFACX= 0
##$ASSWID= 0
##$AUNMP= <proc_prof1d_extract.lims>
##$AXLEFT= 0
##$AXNAME= <>
##$AXNUC= <1H>
##$AXRIGHT= 0
##$AXTYPE= 0
##$AXUNIT= <>
##$AZFE= 0.1
##$AZFW= 0.1
##$BCFW= 0
##$BC_mod= 0
##$BYTORDP= 0
##$COROFFS= 0
##$CY= 15
##$DATMOD= 1
##$DC= 0
##$DFILT= <>
##$DTYPP= 0
##$F1P= 0
##$F2P= 0
##$FCOR= 0.5
##$FTSIZE= 131072
##$FT_mod= 6
##$GAMMA= 0
##$GB= 0
##$INTBC= 1
##$INTSCL= 1
##$ISEN= 128
##$LB= 0.3
##$LEV0= 0
##$LPBIN= 0
##$MAXI= 10000
##$MC2= 0
##$MEAN= 0
##$ME_mod= 0
##$MI= 0
##$NCOEF= 0
##$NC_proc= -2
##$NLEV= 6
##$NOISF1= 0
##$NOISF2= 0
##$NSP= 0
##$NTH_PI= 0
##$NZP= 0
##$OFFSET= 14.961
##$PC= 1
##$PHC0= -84.23767
##$PHC1= 0
##$PH_mod= 1
##$PKNL= yes
##$PPARMOD= 0
##$PPDIAG= 0
##$PPIPTYP= 0
##$PPMPNUM= 2147483647
##$PPRESOL= 1
##$PSCAL= 4
##$PSIGN= 0
##$PYNMP= <proc.py>
##$REVERSE= no
##$SF= 400.020009637224
##$SI= 131072
##$SIGF1= 0
##$SIGF2= 0
##$SINO= 400
##$SIOLD= 131072
##$SPECTYP= <>
##$SREGLST= <1H.CDCl3>
##$SSB= 0
##$STSI= 131072
##$STSR= 0
##$SW_p= 8223.68421052631
##$SYMM= 0
##$S_DEV= 0
##$TDeff= 65536
##$TDoff= 0
##$TI= <>
##$TILT= no
##$TM1= 0
##$TM2= 0
##$TOPLEV= 0
##$USERP1= <user>
##$USERP2= <user>
##$USERP3= <user>
##$USERP4= <user>
##$USERP5= <user>
##$WDW= 1
##$XDIM= 131072
##$YMAX_p= 360263330
##$YMIN_p= -13032
##$CURPLOT= <Network HP LaserJet P1505>
##$CURPRIN= <$Network HP LaserJet P1505>
##$DFORMAT= <normdp>
##$LAYOUT= <+/1D_H.xwp>
##$LFORMAT= <normlp>
##$PFORMAT= <normpl>
##$SURQMSG= 1
$$ End of Bruker specific parameters
$$ ---------------------------------
##NTUPLES= NMR SPECTRUM
##VAR_NAME=  FREQUENCY,     SPECTRUM/REAL,   SPECTRUM/IMAG
##SYMBOL=    X,             R,               I
##VAR_TYPE=  INDEPENDENT,   DEPENDENT,       DEPENDENT
##VAR_FORM=  AFFN,          ASDF,            ASDF
##VAR_DIM=   131072,        131072,          131072
##UNITS=     HZ,            ARBITRARY UNITS, ARBITRARY UNITS
##FACTOR=    0.0627417313425164, 1,          1
##FIRST=     8223.62146879497, 748,          -70231
##LAST=      0,             2646,            -70782
##MIN=       0,             -13032,          0
##MAX=       8223.62146879497, 360263330,    0
$$ Real data points
##PAGE= N=1
##DATA TABLE= (X++(R..R)), XYDATA
$$ [...]
61548C81185J84K63O91J098R71O53J007K044K779K600K044J939K412K995L169
$$ 381185 381369 381632 382323 383421 384392 385045 386052 388096 390875 393475 395519 397458 399870 402865 406034
61533D06034K622J520O54O92J177R70j18r88q72m57p92j881l002l780m147l756
$$ 406034 408656 410176 410830 411522 412699 413669 413551 412563 411691 411234 410442 408561 405559 401779 397632 393876
61517C93876k411q50j98o04j144j067n40j53k33p66j490j908j688j169j054j472
$$ 393876 391465 390615 390417 389813 388669 387602 387062 386909 386676 385910 384420 382512 380824 379655 378601 377129
61501C77129j761j404q17q30j621k525k789k275j374n00J77N97P04N06J65j42
$$ 377129 375368 373964 373147 372317 370696 368171 365382 363107 361733 361233 361410 362007 362711 363217 363382 363240
61485C63240l41l89j83K48O01O15M91O43J052J239R84O46N68O33O28P21J046J249
$$ 363240 362899 362510 362327 362575 363176 363791 364282 364925 365977 367216 368200 368846 369414 370047 370675 371396 372442 373691
61467C73691Q31l6o27n24JM58O47N97M03K41K75M30M67L42L00M41M75J11l84l32
$$ 373691 374522 374486 373859 373335 373336 373794 374441 375038 375441 375682 375957 376387 376854 377196 377496 377937 378412 378523 378139 377807
61447C77807O22J993K776K314R23l30n15M04J660K467K649K558K532K556K488
$$ 377807 378429 380422 383198 385512 386435 386105 385590 385994 387654 390121 392770 395328 397860 400416 402904
61432D02904K396K473K671K619K095J396J036J169J456J490J153O32L14O32J675
$$ 402904 405300 407773 410444 413063 415158 416554 417590 418759 420215 421705 422858 423490 423804 424436 426111
61417D26111K912L569L433K982K685K485K179J888J765J548Q18l34j395k118k773
$$ 426111 429023 432592 436025 439007 441692 444177 446356 448244 450009 451557 452375 452041 450646 448528 445755
61402D45755l580m322m630m461m070l666l300k949k590k222k022k302l114l905
$$ 445755 442175 437853 433223 428762 424692 421026 417726 414777 412187 409965 407943 405641 402527 398622
61388C98622l845k633r13L13O24M47M47P99J134J102Q31Q20J340K003K066J307
$$ 398622 394777 392144 391231 391544 392168 392615 393062 393861 394995 396097 396928 397748 399088 401091 403157 404464
61372D04464M28L04R38J520J562J453J682K028K000J760J893K433K754K555K313
$$ 404464 404892 405196 406134 407654 409216 410669 412351 414379 416379 418139 420032 422465 425219 427774 430087
61357D30087K544L072L417L611M164N323O622P280P012O421O553P889R908J1729
$$ 430087 432631 435703 439120 442731 446895 452218 458840 466120 473132 479553 486106 493995 503903 515632
61343E15632J2982J3731J3826J3002J1521J0020Q596O815M835L671L752L958K940
$$ 515632 528614 542345 556171 569173 580694 590714 599310 606125 610960 614631 618383 622341 625281
61330F25281R12p67j551k225l448m762n383n218m633l833k945k339k243k225j595
$$ 625281 626193 625426 623875 621650 618202 613440 608057 602839 598206 594373 591428 589089 586846 584621 583026
61315E83026k71J103J893K047J941J981K426L339M572N879P051P931Q360Q342
$$ 583026 582755 583858 585751 587798 589739 591720 594146 597485 602057 607936 614987 622918 631278 639620
61301F39620Q223Q436R045R716J0183J0436J0261R077O604L494P18j524l790o279
$$ 639620 647843 656279 665324 675040 685223 695659 705920 714997 721601 725095 725813 724289 720499 714220
61287G14220q314r236r225q946q764q651q469p939o671m733k889j796j193m67
$$ 714220 705906 696670 687445 678499 669735 661084 652615 644676 638005 633272 630383 628587 627394 626927
61273F26927L52Q53J247K235L768M919N173N151N602O357O789O763O677O845P376
$$ 626927 627279 628132 629379 631614 635382 640301 645474 650625 656227 662584 669373 676136 682813 689658 697034
61258F97034Q325R555J0673J1440J2086J2902J3742J4206J4057J3191J1469Q955
$$ 697034 705359 714914 725587 737027 749113 762015 775757 789963 804020 817211 828680 837635
61246H37635O051L132K32k646n144o854p785q250q533q857r345r690r195p609
$$ 837635 843686 846818 847050 844404 839260 832406 824621 816371 807838 798981 789636 779946 770751 763142
61232G63142n613m087l139k324j481p47L9J256K844M342N608O911Q172Q788Q451
$$ 763142 757529 753442 750303 747979 746498 745751 745790 747046 749890 754232 759840 766751 774923 783711 792162
61217G92162P721P417P775Q371Q662Q338P452O508O193O738P566P775P056N958
$$ 792162 799883 807300 815075 823446 832108 840446 847898 854406 860599 867337 874903 882678 889734 895692
61203H95692N352N642O579P664Q693R848J1367J3222J5236J7374J9762K2386K4848
$$ 895692 901044 906686 913265 920929 929622 939470 950837 964059 979295 996669 1016431 1038817 1063665
61190A063665K6593K7477K8053K9026L0342L1062L0362K8418K5978K3375K0452
$$ 1063665 1090258 1117735 1145788 1174814 1205156 1236218 1266580 1294998 1320976 1344351 1364803
61179A364803J7249J4072J0919P509M051J251p52k702n172p818j0261j2945j6448
$$ 1364803 1382052 1396124 1407043 1414552 1418603 1419854 1419102 1416400 1411228 1403410 1393149 1380204 1363756
61166A363756k0360k3605k5699k7042k8142k9202l0266l1235l1746l1534l0716
$$ 1363756 1343396 1319791 1294092 1267050 1238908 1209706 1179440 1148205 1116459 1084925 1054209
61155A054209k9421k7426k4669k1773j9408j7370j5090j2761j1168j0356r296
$$ 1054209 1024788 997362 972693 950920 931512 914142 899052 886291 875123 864767 855471
61144H55471p145m260j656O3J061J857K671L084K504J151K09N26J594K509L493
$$ 855471 848326 844066 842410 842473 843534 845391 848062 851146 853650 854801 855010 855536 857130 859639 863132
61129H63132N470Q343J0876J2521J4266J7189K1033K4837K8286L1741L5331L8679
$$ 863132 868602 876945 887821 900342 914608 931797 952830 977667 1005953 1037694 1073025 1111704
61117A111704M1393M3417M4989M6464M8006M9353N0064N0002M9331M8081M6139
$$ 1111704 1153097 1196514 1241503 1287967 1335973 1385326 1435390 1485392 1534723 1582804 1628943
61106A628943M3646M0861L7593L3340K8126K2621J7243J1716N835L7n153r865
$$ 1628943 1672589 1713450 1751043 1784383 1812509 1835130 1852373 1864089 1869924 1869961 1864808 1854943
61094A854943j4739k0301k6695l3513l9731m4321m7206m9254n1119n2579n3214
$$ 1854943 1840204 1819903 1793208 1759695 1719964 1675643 1628437 1579183 1528064 1475485 1422271
61083A422271n3083n2300n0586m7857m4797m2197m0006l7511l4370l0920k7678
$$ 1422271 1369188 1316888 1266302 1218445 1173648 1131451 1091445 1053934 1019564 988644 960966
61072I60966k4913k2600k0426j7930j4932j1810r158p287o058n021l662j857j14
$$ 960966 936053 913453 893027 875097 860165 848355 839197 831910 825852 820831 817169 815312 815198
61059H15198R87J644K596M022N344O297P440R224J1265J3149J5187J7764K0410
$$ 815198 816185 817829 820425 824447 829791 836088 843528 852752 864017 877166 892353 910117 930527
61046I30527K2434K4043K6014K8426L0584L2101L3285L4370L5091L5318L5537
$$ 930527 952961 977004 1003018 1031444 1062028 1094129 1127414 1161784 1196875 1232193 1267730
61035A267730L6306L7435L8030L7419L5902L4503L3855L3565L2857L1691L0731
$$ 1267730 1304036 1341471 1379501 1416920 1452822 1487325 1521180 1554745 1587602 1619293 1650024
61024A650024L0337L0174K9931K9765K9832L0051L0539L1606L3114L4689L6861
$$ 1650024 1680361 1710535 1740466 1770231 1800063 1830114 1860653 1892259 1925373 1960062 1996923
61013A996923M1039M7816N6331O6086P8361R4913J16121J41739J72671K10704
$$ 1996923 2037962 2085778 2142109 2208195 2286556 2381469 2497590 2639329 2812000 3022704
61003C022704K56719L10241L70131M34747N02044N70843O41427P13979P88175
$$ 3022704 3279423 3589664 3959795 4394542 4896586 5467429 6108856 6822835 7611010
60994G611010Q66405R55698J063414J193158J349229J539372J755168J937856
$$ 7611010 8477415 9433113 10496527 11689685 13038914 14578286 16333454 18271310
60986A8271310J976547J771208J319974P44205K16558j42216l03944k97392j67738
$$ 18271310 20247857 22019065 23339039 24083244 24299802 24157586 23853642 23556250 23388512
60977B3388512J5288J36343O8581k41482p22244j219329j594566j792765j835271
$$ 23388512 23403800 23540143 23608724 23367242 22644998 21425669 19831103 18038338 16203067
60968A6203067j774157j657049j516287j369205j221381j073630r29089p93665
$$ 16203067 14428910 12771861 11255574 9886369 8664988 7591358 6662269 5868604
60960E868604o71555n63538m69561l90319l25750k73941k32411j99223j72640
$$ 5868604 5197049 4633511 4163950 3773631 3447881 3173940 2941529 2742306 2569666
60951B569666j50878j32811j18089j06241r6338q7612p9762p2542o5811o0001
$$ 2569666 2418788 2285977 2167888 2061647 1965309 1877697 1797935 1725393 1659582 1599581
60941A599581n5874n3627n2715n2462n2306n1598m9883m7372m4607m1790l8987
$$ 1599581 1543707 1490080 1437365 1384903 1332597 1280999 1231116 1183744 1139137 1097347 1058360
60930A058360l6618l4975l3428l1102k8141k5452k3297k1143j8900j7138j5911
$$ 1058360 1021742 986767 953339 922237 894096 868644 845347 824204 805304 788166 772255
60919G72255j4522j2790j1441j0770r961q395o669n537m685l448k125j545j742
$$ 772255 757733 744943 733502 722732 712771 704376 697707 692170 687485 684037 681912 680367 678625
60906F78625j975j844j587j440j399j562k002k343k100j412j000j401k573m078
$$ 678625 676650 674806 673219 671779 670380 668818 666816 664473 662373 660961 659961 658560 655987 651909
60892F51909n195n213m188l231l381m317m886m743m559m652m496l912l746m617
$$ 651909 646714 641501 637313 634082 630701 626384 621498 616755 612196 607544 603048 599136 595390 590773
60878E90773n731n812m758l552k785k174j539j368j992k836k995k277j286o36
$$ 590773 585042 579230 574472 570920 568135 565961 564422 563054 561062 558226 555231 552954 551668 551032
60864E51032m15l76k91k6M63J070J599J961K308K825L508M207M845N354N412M602
$$ 551032 550617 550241 549950 549924 550387 551457 553056 555017 557325 560150 563658 567865 572710 578064 583476 588078
60848E88078L061J741J579K432L218L268L084L438M055L755J921p09k846l869
$$ 588078 591139 592880 594459 596891 600109 603377 606461 609899 613954 617709 619630 618921 616075 612206
60834F12206l978l524k735j958j614j718j821j614j318j211j084n94O8L19K1l27
$$ 612206 608228 604704 601969 600011 598397 596679 594858 593244 591926 590715 589631 589037 589105 589424 589445 589118
60818E89118m05o01j362k332k644k015j159r73j580k329k576k300j963j895j957
$$ 589118 588713 588112 586750 584418 581774 579759 578600 577627 576047 573718 571142 568842 566879 564984 563027
60803E63027j878j708j682j738j570j264j366j967k232j423r2M90k5p33q18m60
$$ 563027 561149 559441 557759 556021 554451 553187 551821 549854 547622 546199 546107 546597 546572 545839 545021 544561
60787E44561j12L12R86J459J189M69J77O27J229J375J202J365K265L592M484M274
$$ 544561 544449 544761 545747 547206 548395 548864 549041 549668 550897 552272 553474 554839 557104 560696 565180 569454
60771E69454L241K423K541L258L760L770L611L568L699M111M827N441N516N293
$$ 569454 572695 575118 577659 580917 584677 588447 592058 595626 599325 603436 608263 613704 619220 624513
60757F24513N380N695N436M333L264L126L626L822L424K990K937L012K778K218
$$ 624513 629893 635588 641024 645357 648621 651747 655373 659195 662619 665609 668546 671558 674336 676554
60743F76554J679J478J589J666J322N03m46j149j479j492j230p94m03k22k11k41
$$ 676554 678233 679711 681300 682966 684288 684791 684345 683196 681717 680225 678995 678201 677798 677576 677365 677124
60727F77124j76K00R84J794K008J616J391J868K524K672K698L593N321O639O821
$$ 677124 676948 677148 678132 679926 681934 683550 684941 686809 689333 692005 694703 698296 703617 710256 717077
60712G17077O682P307Q455R003Q601P999P858Q040Q214Q472R004R614R992J0153
$$ 717077 723759 731066 739521 748524 757125 765124 772982 781022 789236 797708 806712 816326 826318 836471
60698H36471J0264J0279J0117R944R866R602Q907Q200Q092Q368Q096O953N741
$$ 836471 846735 857014 867131 877075 886941 896543 905450 913650 921742 930110 938206 945159 950900
60685I50900N215N007M350L357K819K921K981K449J541O82p4q36j537k087k585
$$ 950900 956115 961122 965472 968829 971648 974569 977550 979999 981540 982222 982148 981312 979775 977688 975103
60670I75103l208m110n430p078q467q959q646q245q149q040p667p351p369p439
$$ 975103 971895 967785 962355 955277 946810 937851 929205 920960 912811 904771 897104 889753 882384 874945
60656H74945p249p072p273p619p672p540p626p774p376o312n181m557m408m403
$$ 874945 867696 860624 853351 845732 838060 830520 822894 815120 807744 801432 796251 791694 787286 782883
60642G82883m411m530m886n436n876n848n416n123n296n503n132m265l502l005
$$ 782883 778472 773942 769056 763620 757744 751896 746480 741357 736061 730558 725426 721161 717659 714654
60628G14654k367j445p35p09j182j599j706j735k064k738l250l004k206j951k895
$$ 714654 712287 710842 710107 709398 708216 706617 704911 703176 701112 698374 695124 692120 689914 687963 685068
60613F85068m203m488l659k969l226l892m224m326m492m389l712l037l149l868
$$ 685068 680865 676377 672718 669749 666523 662631 658407 654081 649589 645200 641488 638451 635302 631434
60599F31434m372m473m693n195n442n023m148l195k403k097k501l168l184k288
$$ 631434 627062 622589 617896 612701 607259 602236 598088 594893 592490 590393 587892 584724 581540 579252
60585E79252j258q33q25p71q41j450k311k632k196j556j174r79q72r90j255j160
$$ 579252 577994 577161 576336 575565 574724 573274 570963 568331 566135 564579 563405 562426 561554 560564 559309 558149
60569E58149m10O20J470K256L318M493N329N920O902Q460R871J0270R554Q235
$$ 558149 557739 558359 559829 562085 565403 569896 575225 581145 588047 596507 606378 616648 626202 634437
60555F34437O662M802K705Q10m29j107j824k973m209m847m747m416m109l298j506
$$ 634437 641099 645901 648606 649416 648987 647880 646056 643083 638874 634027 629280 624864 620755 617457 615951
60540F15951O43J929K037J893K329L172L889M459N014N154M383K974J710Q45m4
$$ 615951 616594 618523 620560 622453 624782 627954 631843 636302 641316 646470 650853 653827 655537 656382 656338
60525F56338j163k083k373k154j806j476j122p94n82l83Q2R47J901K285J744Q72
$$ 656338 655175 653092 650719 648565 646759 645283 644161 643367 642785 642402 642484 643431 645332 647617 649361 650233
60509F50233Q23K006L432L829L165K583K865L696M438M961N447N943O616P967
$$ 650233 651056 653062 656494 660323 663488 666071 668936 672632 677070 682031 687478 693421 700037 708004
60495G08004J0291J3137J5763J7943J9902K1717K3217K4444K5540K6026K4760
$$ 708004 718295 731432 747195 765138 785040 806757 829974 854418 879958 905984 930744
60484I30744K1000J5235Q599J677n638j3229k0243k5740k9483l1758l2683l2171
$$ 930744 951744 966979 975578 977255 971617 958388 938145 912405 882922 851164 818481 786310
60472G86310l0459k8197k5907k3685k1487j9351j7187j4785j2253j0083q558p471
$$ 786310 755851 727654 701747 678062 656575 637224 620037 605252 592999 582916 574358 566887
60460E66887o680o512p140p926p938o962n486l956k599j868k183l171l792l523
$$ 566887 560207 553695 546555 538629 530691 523729 518243 514287 511688 509820 507637 504466 500674 497151
60446D97151k848k397k100j629j173j243j896k554k650k128j399r17q02q04o33
$$ 497151 494303 491906 489806 488177 487004 485761 483865 481311 478661 476533 475134 474217 473415 472611 471978
60431D71978k98l6O6J29K42L84N99R17J119Q71K08m53q71j204j509j428o63M83
$$ 471978 471680 471644 471710 471839 472081 472465 473064 473981 475100 475971 476179 475726 474855 473651 472142 470714 470051 470534
60413D70534J416J931K271K583K668K296J576R03O16P48J021J141R95O56K43l1
$$ 470534 471950 473881 476152 478735 481403 483699 485275 486178 486794 487542 488563 489704 490699 491355 491598 491567
60397D91567Q7O61J306J523J273J016J151J598K037K266K291K190K006J713J279
$$ 491567 491654 492315 493621 495144 496417 497433 498584 500182 502219 504485 506776 508966 510972 512685 513964
60382E13964Q15O27Q60J266J458J365J157Q92N61M05P37J411J806J494O41k19
$$ 513964 514779 515406 516266 517532 518990 520355 521512 522404 522965 523370 524107 525518 527324 528818 529459 529240
60366E29240n98k95M11Q62P24M88Q21J499J632J001M64P46J461J805J606J259
$$ 529240 528642 528347 528758 529620 530344 530832 531653 533152 534784 535785 536249 536995 538456 540261 541867 543126
60350E43126R67P07P14J407K762M114M721M502M185M583N643O406O224N749O059
$$ 543126 544093 544800 545514 546921 549683 553797 558518 563020 567205 571788 577431 583837 590061 595810 601869
60335F01869O990P176N889M002K649J788P19o60j901l002m394o120p602q243p829
$$ 601869 608859 616035 621924 625926 628575 630363 631082 630422 628521 625519 621125 615005 607403 599160 591331
60320E91331o520m863l671l352l401k964j788k97J109K325L294L962M492N100
$$ 591331 584811 579948 576277 572925 569524 566560 564772 564475 565584 567909 571203 575165 579657 584757
60306E84757N796O581P664R066J0229J0714J1119J2541J4957J6909J7166J6053
$$ 584757 590553 597134 604798 613864 624093 634807 645926 658467 673424 690333 707499 723552
60294G23552J4605J2812R528M197k007p161j0360j2042j2760j2346j0615q224
$$ 723552 738157 750969 760497 764694 762687 755526 745166 733124 720364 708018 697403 689179
60282F89179o204m861l808k912k335j721l56J436K056M58k439m912o386p438q307
$$ 689179 682975 678114 674306 671394 669059 667338 666982 668418 670474 670932 668493 663581 657195 649757 641450
60267F41450q573q149p584p234o859o256n642n216m892m636m524m299l455j973
$$ 641450 632877 624728 617144 609910 603051 596795 591153 585937 581045 576409 571885 567586 564131 562158
60253E62158n77Q4R8j16m70j007j368j012K1R94J286J115J157J553J633Q17m67
$$ 562158 561581 561665 561763 561647 561177 560170 558802 557790 557811 558805 560091 561206 562363 563916 565549 566366 565899
60236E65899j130o96K57R51J309J745K477L373M287N112N669N779N468M910M329
$$ 565899 564769 564073 564330 565281 566590 568335 570812 574185 578472 583584 589253 595032 600500 605410 609739
60221F09739M001M112M427M445M078L839M146M808N458O087O759P243P391P548
$$ 609739 613740 617852 622279 626724 630802 634641 638787 643595 649053 655140 661899 669142 676533 684081
60207F84081Q068Q746R142R219R104Q583P424N989M947M443M140L850L634L338
$$ 684081 692149 700895 710037 719256 728360 736943 744367 750356 755303 759746 763886 767736 771370 774708
60193G74708K597J313k31j666k622k811k411k127k412k985l448l902m456m709
$$ 774708 777305 778618 778387 776721 774099 771288 768877 766750 764338 761353 757905 754003 749547 744838
60179G44838m503m552n406o259n881m470l321k912k563j922j522j575j518r99
$$ 744838 740335 735783 730377 724118 718237 713767 710446 707534 704971 703049 701527 699952 698434 697435
60165F97435k58P18K205L616L684K359J289J633K545K718K365K512L148L357K874
$$ 697435 697177 697895 700100 703716 707400 709759 711048 712681 715226 717944 720309 722821 725969 729326 732200
60150G32200K358K279K505K890L428L930M193M458N102N927O356O247O047O198
$$ 732200 734558 736837 739342 742232 745660 749590 753783 758241 763343 769270 775626 781873 787920 794118
60136G94118O835P914R188J0079J0063R185P942O759N851N297M868L940K061l79
$$ 794118 800953 808867 818055 828134 838197 847382 855324 862083 867934 873231 878099 882039 884100 883721
60122H83721k421l413l408k775j840r05k96j41j98L6Q02J612J529K63j250j913
$$ 883721 881300 877887 874479 871704 869864 868959 868663 868522 868324 868360 869162 870774 872303 872566 871316 869403
60106H69403k019k881m882o774p376p081p056p565p909p573o662n447m238l530
$$ 869403 867384 864503 859621 852847 845471 838390 831334 823769 815860 808287 801625 796178 791940 788410
60092G88410l528l614k876j157R33K886M541N627N800N245M744M839N304N530
$$ 788410 784882 781268 778392 777235 778168 781054 785595 791222 797022 802267 807011 811850 817154 822684
60078H22684N157M270L245K397J592L19j612l690n377o840q522j0140j0896j0541
$$ 822684 827841 832111 835356 837753 839345 839664 838052 834362 828985 822145 813623 803483 792587 782046
60064G82046r654q775p908p028o406o081n597m642l572k953k839k875k776k409
$$ 782046 772392 763617 755709 748681 742275 736194 730597 725955 722383 719430 716591 713716 710940 708531
60050G08531j642n78K55M34L16P20J865L021L486L531M024N223O464P110P315
$$ 708531 706889 706311 706566 707000 707316 708036 709901 712922 716408 719939 723963 729186 735650 742760 750075
60035G50075P498P421O416M404K140K24j486l218m608n264n647o657q389j0036
$$ 750075 757573 764994 771410 775814 777954 778178 776692 773474 768866 763602 757955 751298 742909 732873
60021G32873j1101j1982j3040j3792j3573j2664j1937j1572j0869r470q020p224
$$ 732873 721772 709790 696750 682958 669385 656721 644784 633212 622343 612873 604853 597629
60009E97629o831o111m984m002l396k851k223j755j401o70N35J542J879K053K758
$$ 597629 590798 584687 579703 575701 572305 569454 567231 565476 564075 563405 563940 565482 567361 569414 572172
59994E72172L746M228M120M138M723N523O001O000N646N157M823M723M541M028
$$ 572172 575918 580146 584266 588404 593127 598650 604651 610651 616297 621454 626277 631000 635541 639569
59980F39569L439K991K144J68k631n049o359o770o590n818m791m247m305m224
$$ 639569 643008 645999 648143 648311 645680 640631 634272 627502 620912 615094 610303 606056 601751 597527
59966E97527l536k672k047j393n47j10n05j070q71J8Q37J248J466J531J341J124
$$ 597527 593991 591319 589272 587879 587332 587222 586717 585647 584776 584794 585631 586879 588345 589876 591217 592341
59950E92341J226J526J654J632J776K074K211K072J745J179K63q96k137l403m462
$$ 592341 593567 595093 596747 598379 600155 602229 604440 606512 608257 609436 609699 608803 606666 603263 598801
59935E98801m812m381l885l976m346m280l745l249k862k220j326o53m30m49n30
$$ 598801 593989 589608 585723 581747 577401 573121 569376 566127 563265 561045 559719 559066 558636 558187 557657
59920E57657o27m75J68J008J477J556J721K054K077J647J365J806K773L649M080
$$ 557657 557030 556555 556723 557731 559208 560764 562485 564539 566616 568263 569628 571434 574207 577856 581936
59905E81936M110L848L355K748K271K223K731L569M330M837N234N585N674N446
$$ 581936 586046 589894 593249 595997 598268 600491 603222 606791 611121 615958 621192 626777 632451 637897
59891F37897N298N657O540P676Q756R338R048Q182P570P466P100N914M587M103
$$ 637897 643195 648852 655392 663068 671824 681162 690210 698392 705962 713428 720528 726442 731029 735132
59877G35132M428M862N199N468N086L423J070p51k031l972o951r675j0853j0751
$$ 735132 739560 744422 749621 755089 760175 763598 764668 763917 761886 757914 750963 741288 730435 719684
59863G19684j0452j0437j0470j0247r579q321o676n204m225l463k589j657p83
$$ 719684 709232 698795 688325 678078 668499 660178 653502 648298 644073 640610 638021 636364 635581
59850F35581J83J335K410L149L686M297N068N964O999Q116R155J0059J0802J1091
$$ 635581 635764 637099 639509 642658 646344 650641 655709 661673 668672 676788 685943 696002 706804 717895
59836G17895J0468Q879O839M945L549K860K936L490M110M672N161N062L548M48
$$ 717895 728363 737242 744081 749026 752575 755435 758371 761861 765971 770643 775804 780866 784414 784862
59822G84862l437p125j0158j2484j4199j5500j6420j6483j5174j2869j0683r164
$$ 784862 781425 774300 764142 751658 737459 721959 705539 689056 673882 661013 650330 641166
59810F41166p876o409n092m222l400k257j284j169j659j842j415r42r29j200j362
$$ 641166 633290 626881 621789 617567 614167 611910 610626 609457 607798 605956 604541 603599 602670 601470 600108
59795F00108j415j681k363l324m145m434m129l604l290l242l096k553j840j491
$$ 600108 598693 597012 594649 591325 587180 582746 578617 575013 571723 568481 565385 562832 560992 559501
59781E59501j551j225J84K044K767J781M34K90J091J377P10J26L88R76J222J328
$$ 559501 557950 556725 556909 558953 561720 563501 563935 564225 565316 566693 567403 567529 567917 568893 570115 571443
59765E71443J666J933J748J521J881K643L067K936K750K905L249L444L411L273
$$ 571443 573109 575042 576790 578311 580192 582835 585902 588838 591588 594493 597742 601186 604597 607870
59751F07870L185L197L250L291L459L946M616M938M558L729L027K758K766K720
$$ 607870 611055 614252 617502 620793 624252 628198 632814 637752 642310 646039 649066 651824 654590 657310
59737F57310K450K052J658J185M66l09n65l3Q37J387J479J378J292J432K074K966
$$ 657310 659760 661812 663470 664655 665121 664812 664247 664214 665051 666438 667917 669295 670587 672019 674093 677059
59721F77059L107K013Q14J070K571L487K826J591J170J675K352K720K627J942
$$ 677059 680166 682179 682993 684063 686634 690121 692947 694538 695708 697383 699735 702455 705082 707024
59707G07024R03K12K10M48M63M88Q10J080P39j74j155j730j569o34M77R43P98
$$ 707024 707927 708139 708349 708797 709260 709748 710558 711638 712377 712203 711048 709318 707749 707115 707592 708535 709333
59690G09333Q78J353J196k45k038k823k479j737q37L19J134P07q08k185k587k313
$$ 709333 710211 711564 712760 712515 710477 707654 705175 703438 702601 702920 704054 704761 703953 701768 699181 696868
59674F96868k068k203k704l302l460k744j416l29k63j401l236m701m884l978l199
$$ 696868 694800 692597 689893 686591 683131 680387 678971 678642 678379 676978 673742 669041 664157 660179 656980
59659F56980l361l914l862l036j858m75J006J884J565P55Q84K294L901M752M891
$$ 656980 653619 649705 645843 642807 640949 640474 641480 643364 644929 645684 646568 648862 652763 657515 662406
59644F62406M533L348J226j046k507l022l002k572j688q33q40j797k692k463j205
$$ 662406 666939 670287 671513 670467 667960 664938 661936 659364 657676 656843 656003 654206 651514 649051 647846
59629F47846N2O36Q36J126J298Q50q1p47p26k39M48J384K457L181L256K881K307
$$ 647846 647898 648534 649370 650496 651794 652644 652563 651816 651090 650851 651299 652683 655140 658321 661577 664458 666765
59612F66765J426J74j045j610j107M78K618M329M996N082N358N471M337K019P0
$$ 666765 668191 668365 667320 665710 664603 665081 667699 672028 677024 682106 687464 692935 697272 699291 699361
59597F99361n73q18j829l297m243m570m762m790m454m151m228m149l424k746k960
$$ 699361 698788 697970 696141 692844 688601 684031 679269 674479 670025 665874 661646 657497 654073 651327 648367
59582F48367l510l239k337j967k251k173j489j181j770k511k626k178j409l00
$$ 648367 644857 641618 639281 637314 635063 632890 631401 630220 628450 625939 623313 621135 619726 619426
59568F19426Q68J586J926K409K857K490J424Q56J377K193K460K323K099J653J211
$$ 619426 620294 621880 623806 626215 629072 631562 632986 633842 635219 637412 639872 642195 644294 645947 647158
59553F47158J612K864L504K464P58J55Q64J653J884K093K690L265L463L755M896
$$ 647158 648770 651634 655138 657602 658360 658515 659379 661032 662916 665009 667699 670964 674427 678182 683078
59538F83078P022R553J1818J3672J5673J8413K1512K3359K2348J8436J3358R289
$$ 683078 690100 699653 711471 725143 740816 759229 780741 804100 826448 844884 858242 867531
59526H67531P286O879O948O939P149P855Q550Q384P136N201K828n6l252o222q757
$$ 867531 874817 881696 888644 895583 902732 910587 919137 927521 934657 939858 942686 942630 939378 933156 924399
59511I24399j1133j3430j5315j6637j7623j8201j7805j6281j4373j2851j1665
$$ 924399 913266 899836 884521 867884 850261 832060 814255 797974 783601 770750 759085
59500G59085j0360q883p416n905m336l079k385j760m88J334K833L455L532L769
$$ 759085 748725 739842 732426 726521 722185 719106 716721 714961 714473 715807 718640 722095 725627 729396
59486G29396M547N760P030Q017Q674R269J0115J1341J2928J4763J6529J7811J8490
$$ 729396 733943 739703 746733 754750 763424 772693 782808 794149 807077 821840 838369 856180 874670
59473H74670J8894J9355J9828J9955J9320J7562J4581J0790O976L750J394K64
$$ 874670 893564 912919 932747 952702 972022 989584 1004165 1014955 1021931 1025681 1027075 1027339
59461A027339Q46L112O213R248J2169J5527J9569K3862K7712L0584L2181L2438
$$ 1027339 1028185 1031297 1037510 1046758 1058927 1074454 1094023 1117885 1145597 1176181 1208362 1240800
59449A240800L1550K9966K8365K7558K7974K8953K8708K5291J7744O465p191k1348
$$ 1240800 1272350 1302316 1330681 1358239 1386213 1415166 1443874 1469165 1486909 1493374 1486183 1464835
59437A464835l3965m3244m8144m8712m6076m1921l7648l3831l0464k7469k4706
$$ 1464835 1430870 1387626 1339482 1290770 1244694 1202773 1165125 1131294 1100830 1073361 1048655
59426A048655k1755j8237j4348j0529o596j803M007R849J4509J7648J9678K1057
$$ 1048655 1026900 1008663 994315 983786 977190 975387 979394 989243 1003752 1021400 1041078 1062135
59414A062135K1951K2197K1305J9011J6289J5050J5950J6756J3879N747n857j7643
$$ 1062135 1084086 1106283 1127588 1146599 1162888 1177938 1193888 1210644 1224523 1230270 1224413 1206770
59402A206770k7120l3082l5095l3570k9894k5346j9874j2797n097j04j012p764
$$ 1206770 1179650 1146568 1111473 1077903 1048009 1022663 1002789 989992 984895 984791 983779 976015
59390I76015j6946k4731k9333l0878l0015k7421k4048k0837j8056j5410j2781
$$ 976015 959069 934338 905005 874127 844112 816691 792643 771806 753750 738340 725559
59379G25559j0407q446o789n435m519l902l113j907n77M71J204J891K713L554
$$ 725559 715152 706706 699917 694482 689963 686061 682948 681041 680464 680935 682139 684030 686743 690297
59365F90297M123M313M566N637P703R944J1391J2147J3199J5041J7062J8460J9305
$$ 690297 694420 698733 703299 708936 716639 726583 737974 750121 763320 778361 795423 813883 833188
59352H33188K0324K2005K4191K6441K8417K9998L1159L1839L1983L1648L0873
$$ 833188 853512 875517 899708 926149 954566 984564 1015723 1047562 1079545 1111193 1142066
59341A142066K9377K6693K2834J8483J4175R549L903k702r401j5460k0729k5274
$$ 1142066 1171443 1198136 1220970 1239453 1253628 1263177 1267080 1264378 1254977 1239517 1218788 1193514
59329A193514k9101l2256l4697l6079l6079l4963l3410l1769k9876k7546k4866
$$ 1193514 1164413 1132157 1097460 1061381 1025302 990339 956929 925160 895284 867738 842872
59318H42872k2071j9483j7399j5683j3761j1460r465q305p378n802l886k672k265
$$ 842872 820801 801318 783919 768236 754475 743015 733550 725245 717867 712065 708179 705507 703242
59305G03242j736p01K38P92J521K745L922M561M914N396O124P265R006J0914J2353
$$ 703242 701506 700805 701043 701835 703356 706101 710023 714584 719498 724894 731018 738283 747289 758203 770556
59290G70556J3678J5779J8016J8037J4515Q968L944M05k085l638l881k934j317
$$ 770556 784234 800013 818029 836066 850581 859549 863493 863898 861813 858175 854294 851360 850043
59277H50043R40M083P789J1330J4323J6703J8306J9204J9995K0978K1388K0274
$$ 850043 850983 855066 862855 874185 888508 905211 923517 942721 962716 983694 1005082 1025356
59265A025356J7842J5124J2507R398N212M6n470j0491j4301j6884j8946k0987
$$ 1025356 1043198 1058322 1070829 1080227 1085439 1085485 1080015 1069524 1055223 1038339 1019393 998406
59253I98406k2636k3253k2684k1039j8401j5311j2818j1226r493o765l792j776
$$ 998406 975770 952517 929833 908794 890393 875082 862264 851038 841545 834780 830988 829212
59241H29212l65J781M822P506R055R959J0778J1390J1701J1917J1675R956O440
$$ 829212 828847 830628 835450 842956 852011 861970 872748 884138 895839 907756 919431 929387 935827
59228I35827K248j254l861o355r391j2930j6360j8859j9983k0115k0055k0082
$$ 935827 938075 936821 932960 926605 917214 904284 887924 869065 849082 828967 808912 788830
59216G88830j9730j8625j7053j5508j4010j2131r619o888m863m152m324m328l770
$$ 788830 769100 750475 733422 717914 703904 691773 682154 675266 670403 666251 661927 657599 653829
59203F53829l265l189k808j374N02J520J531J614K379L203L376L019K547K043
$$ 653829 650564 647375 644567 643193 643695 645215 646746 648360 650739 653942 657318 660337 662884 664927
59189F64927J584J529J994K515K728K928L592M644N641O366O911P346P730Q309
$$ 664927 666511 668040 670034 672549 675277 678205 681797 686441 692082 698448 705359 712705 720435 728744
59175G28744R402J0989J2612J3775J4435J5070J6109J7317J8002J7917J7550J7304
$$ 728744 738146 749135 761747 775522 789957 805027 821136 838453 856455 874372 891922 909226
59163I09226J6781J5437J3522J1717R957P447L857j75l930p365j0705j3827j6420
$$ 909226 926007 941444 954966 966683 976640 984087 987944 987769 983839 976474 965769 951942 935522
59150I35522j8378j9618j9885j9153j8033j7244j6771j5962j4501j2903j1788
$$ 935522 917144 897526 877641 858488 840455 823211 806440 790478 775977 763074 751286
59139G51286j1047j0087q800p753p305p024o343n380m620m047l186j948p24M11
$$ 751286 740239 730152 721352 713599 706294 699270 692927 687547 682927 678880 675694 673746 673022 673433
59125F73433J829L570N009N732O143O852P838Q590Q818Q763R036J0140J1787J2786
$$ 673433 675262 678832 683841 689573 695716 702568 710406 718996 727814 736577 745613 755753 767540 780326
59111G80326J2287J1030J0554J1101J1383J0600R465Q709P846O340M935M605M941
$$ 780326 792613 803643 814197 825298 836681 847281 856746 865455 873301 879641 884576 889181 894122
59098H94122M698L467J786R9j387k205k080j594j527j874k246k797l788m758n170
$$ 894122 898820 902287 904073 904172 902785 900580 898500 896906 895379 893505 891259 888462 884674 879916 874746
59083H74746n442o261p260p615p622q411j0135j1689j2296j2258j2024j1548j0760
$$ 874746 869304 863043 855783 848168 840546 832135 822000 810311 798015 785757 773733 762185 751425
59070G51425r856q979q266q004q081p644o220m767m443m714m049k343j113j174
$$ 751425 741569 732590 724324 716320 708239 700595 694375 689608 685165 680451 676402 674059 672946 671772
59056F71772j601j377p49m24n98j268k447l585l718k731j624j117q34k90K24K71
$$ 671772 670171 668794 668045 667621 667023 665755 663308 659723 656005 653274 651650 650533 649699 649409 649633 649904
59040F49904M6m7J2J35M44R70J491J931K471L161L912M836N969O870P282P966
$$ 649904 649950 649903 649915 650050 650494 651464 652955 654886 657357 660518 664430 669266 675235 682105 689387 697353
59024F97353R812J2152J3261J2733J2042J2355J2975J2606J1142R404P935O706
$$ 697353 707165 719317 732578 745311 757353 769708 782683 795289 806431 815835 823770 830476
59012H30476N538M230K690J270N23N04Q18J369K351L623M863O283Q237J0189J1261
$$ 830476 836014 840244 842934 844204 844727 845231 846049 847418 849769 853392 858255 864538 872775 882964 894225
58997H94225J1769J2892J4731J6105J6490J6572J6493J5302J2869J0696R675Q453
$$ 894225 905994 918886 933617 949722 966212 982784 999277 1014579 1027448 1038144 1047819 1056272
58985A056272N326O70l785p220r986j2286j3789j4138j2997j0187o461l458j955
$$ 1056272 1061598 1062268 1058483 1051263 1041277 1028991 1015202 1001064 988067 977880 971419 967961 966006
58972I66006r31R36L585O262Q978J2108J5238J7596J9185K0450K1234K1087K0206
$$ 966006 965075 966011 969596 975858 984836 996944 1012182 1029778 1048963 1069413 1090647 1111734 1131940
58959A131940J9114J7670J5332J2033Q049L307k274q116j3464j8187k2396k5691
$$ 1131940 1151054 1168724 1184056 1196089 1204138 1207445 1205171 1197055 1183591 1165404 1143008 1117317
58947A117317k7589k8326k8421k7790k6138k3847k1574j9317j6729j4027j1691
$$ 1117317 1089728 1061402 1032981 1005191 979053 955206 933632 914315 897586 883559 871868
58936H71868r516o959m346k768k722l603m556n247n667n824n789n739n829o121
$$ 871868 862352 855393 851047 848279 845557 841954 837398 832151 826484 820660 814871 809132 803303 797182
58922G97182o400o034m496k238m63L09P85J649K625L318M171N658P208P901P838
$$ 797182 790782 784748 780252 778014 777551 777860 778645 780294 782919 786237 790408 796066 803274 811175 819013
58907H19013P997Q943J0508J2284J3817J4735J5446J7228K0749K4882K7913K9510
$$ 819013 827010 835953 846461 858745 872562 887297 902743 919971 940720 965602 993515 1023025
58895A023025L0598L1652L2282L2357L2502L3292L4761L6767L9194M1763M4145
$$ 1023025 1053623 1085275 1117557 1149914 1182416 1215708 1250469 1287236 1326430 1368193 1412338
58884A412338M6149M7267M6316M2322L5716K7967K0144J2356M414l691j2024k0723
$$ 1412338 1458487 1505754 1552070 1594392 1630108 1658075 1678219 1690575 1694989 1691298 1679274 1658551
58872A658551k9561l7866m4903n0113n3171n4086n3074n0244m5768m0564l6084
$$ 1658551 1628990 1591124 1546221 1496108 1442937 1388851 1335777 1285533 1239765 1199201 1163117
58861A163117l2986l0528k7860k5262k3407k1996k0092j7588j5449j4522j4668
$$ 1163117 1130131 1099603 1071743 1046481 1023074 1001078 980986 963398 947949 933427 918759
58850I18759j5000j4629j3289j1575j0347r734r175q476q060p971p555o688o263
$$ 918759 903759 889130 875841 864266 853919 844185 835010 826534 818474 810503 802948 796260 789997
58837G89997o745p315p172o838p019p188o507n385m798m641m090l159k530k109
$$ 789997 783252 775937 768765 761927 754908 747720 741213 735828 731030 726389 722299 719140 716610 714501
58823G14501j119N41K171L370M259M827N089N581O641P424O863N327M170L814
$$ 714501 713382 713923 716094 719464 723723 728550 733639 739220 745861 753285 760148 765475 769645 773459
58809G73459L480K662J655O46n12j558j996k029k297k709k648k294k505l309l753
$$ 773459 776939 779601 781256 781902 781390 779832 777836 775807 773510 770801 768153 765859 763354 760045 756292
58794G56292l456l174l443l768l527k774j715k66J473K965L839M212M295M255
$$ 756292 752836 749662 746219 742451 738924 736150 734435 734169 735642 738607 742446 746658 750953 755208
58780G55208M465N192N969N949N024L960L362L141K919K349J103p77k563l511
$$ 755208 759673 764865 770834 776783 781807 785767 789129 792270 795189 797538 798641 797864 795301 791790
58766G91790l722l706l444k702j925j763j877j324j08P62Q71J054K148L957N717
$$ 791790 788068 784362 780918 778216 776291 774528 772651 771327 771219 771981 772852 773906 776054 780011 785728
58751G85728O927P488P555P334O840N988N249N558O992Q236Q233P637P627Q013
$$ 785728 792655 800143 807698 815032 821872 827860 833109 838667 845659 853895 862128 869765 877392 885405
58737H85405P795O985O372N932N146M566N311P033Q134Q216Q579J0001J1607J2461
$$ 885405 893200 900185 906557 912489 917635 922201 927512 934545 942679 950895 959474 969475 981082 993543
58723I93543J2809J3046J2730J1365R277P187N631N048N529O318O459O034N753
$$ 993543 1006352 1019398 1032128 1043493 1052770 1059957 1065588 1070636 1076165 1082483 1088942 1094976 1100729
58710A100729N445M144J711r06l149n302p390r024j0530j2782j5657j8110k0008
$$ 1100729 1106174 1110318 1112029 1111123 1107974 1102672 1095282 1086258 1075728 1062946 1047289 1029179 1009171
58697A009171k2274k4831k6115k5413k4006k3082k2006j9776j6896j4599j3098
$$ 1009171 986897 962066 935951 910538 886532 863450 841444 821668 804772 790173 777075
58686G77075j1780j0477r541r110r022r066q913q320p539o947o174m564k466r47
$$ 777075 765295 754818 745277 736167 727145 718079 709166 700846 693307 686360 680186 675622 673156 672209
58672F72209q4J099K818M203N130O764R525J2053J3214J3793J5114J7041J8367
$$ 672209 672125 673224 676042 680245 685375 692139 701664 713717 726931 740724 755838 772879 791246
58659G91246J8295J6550J2972Q050L159n95l226n050o013o347o867p783q183p520
$$ 791246 809541 826091 839063 847113 850272 849677 846451 841401 835388 829041 822174 814391 806208 798688
58645G98688o679o617o897o469n148l437j570L20J839K873L954N346O435O734
$$ 798688 792009 785392 778495 772026 766878 763441 761871 762191 764030 766903 770857 776203 782638 789372
58631G89372O653O581N994M403K501J423J336J577J774K157L037M518O391Q091
$$ 789372 796025 802606 808600 813003 815504 816927 818263 819840 821614 823771 826808 831326 837717 845808
58617H45808R263J0451J2488J5137J7264J8571J9932K1575K2223K0607J6798J1479
$$ 845808 855071 865522 878010 893147 910411 928982 948914 970489 992712 1013319 1030117 1041596
58605A041596N095j484o675r610j1099j2343j3469j3960j3755j3143j2218j1077
$$ 1041596 1046691 1045207 1038532 1028922 1017823 1005480 992011 978051 964296 951153 938935 927858
58593I27858r904q455o292l769j810l68J672M684P613R681J1449J3584J5779J7576
$$ 927858 917954 909499 903207 899438 897628 897260 898932 903616 911229 920910 932359 945943 961722 979298
58579I79298J8962J9557J8621J6576J5025J4498J3686J1775R971R610J0331J1225
$$ 979298 998260 1017817 1036438 1053014 1068039 1082537 1096223 1107998 1117969 1127579 1137910 1149135
58567A149135J2305J3596J4354J4553J5709J8650K1900K3743K4530K5282K5297
$$ 1149135 1161440 1175036 1189390 1203943 1219652 1238302 1260202 1283945 1308475 1333757 1359054
58556A359054K3156J9094J4477R662M197j498o405j0345j3634j5802j6104j4953
$$ 1359054 1382210 1401304 1415781 1425443 1429640 1428142 1421737 1411392 1397758 1381956 1365852 1350899
58544A350899j3544j2543j2200j2990j4941j7015j8374j9510k1028k2256k2328
$$ 1350899 1337355 1324812 1312612 1299622 1284681 1267666 1249292 1229782 1208754 1186498 1164170
58533A164170k1700k1152k0193j7992j5000j2197r511o468l624j704r0K304N202
$$ 1164170 1142470 1121318 1101125 1083133 1068133 1055936 1046425 1039957 1036333 1034629 1034539 1036843 1042045
58520A042045P513R012J0049J0383R743Q873Q457P772N899L423J498P1j343k109
$$ 1042045 1049558 1058570 1068619 1079002 1088745 1097618 1106075 1113847 1119746 1123169 1124667 1124738 1123395 1121286
58506A121286j548p08j085k262k746k524k804l775m620n350o617q046q612q439
$$ 1121286 1119738 1119030 1117945 1115683 1112937 1110413 1107609 1103834 1099214 1093864 1087247 1079201 1070589 1062150
58492A062150q393q265p192n505m217l048j040J187J933J242J099K673N200P760
$$ 1062150 1053757 1045492 1038300 1032795 1028578 1025530 1024490 1025677 1027610 1028852 1029951 1032624 1037824 1045584
58478A045584J0310J2660J4118J4527J4306J3346J1163Q083M853J287l206p935
$$ 1045584 1055894 1068554 1082672 1097199 1111505 1124851 1136014 1144097 1148950 1150237 1147031 1139096
58466A139096j1351j3059j3852j3966j3033j1563j0601r857q014m994k247n29
$$ 1139096 1127745 1114686 1100834 1086868 1073835 1062272 1051671 1041814 1033800 1028806 1026559 1026030
58454A026030R61L000N341P517R241R800Q432N484K031j470n038p960r335r600
$$ 1026030 1026991 1029991 1035332 1042849 1052090 1061890 1070322 1075806 1077837 1076367 1071329 1063369 1054034 1044434
58440A044434r942j0291r492p390n100l155r64J689M116N891P270Q349Q989R563
$$ 1044434 1034492 1024201 1014709 1007319 1002219 999064 998100 999789 1003905 1009796 1017066 1025415 1034404 1043967
58426A043967J0583J1762J2560J3323J4574J5595J5157J3316J1075Q636N462J773
$$ 1043967 1054550 1066312 1078872 1092195 1106769 1122364 1137521 1150837 1161912 1170548 1176010 1177783
58414A177783j520m045n874o749o796p308r232j1643j3242j4399j5893j6770j5733
$$ 1177783 1176263 1172218 1166344 1159595 1152799 1145491 1136259 1124616 1111374 1096975 1081082 1064312 1048579
58401A048579j3776j2874j2723j1416q848o778n679m271k176n64N9L23K59o51
$$ 1048579 1034803 1021929 1009206 997790 988942 982164 976485 972214 970038 969474 969533 969856 970115 969464
58387I69464j703j592p49p42j471j410n29k61n17L68K359L268K231J076J387K576
$$ 969464 967761 966169 965420 964678 963207 961797 961268 961007 960490 960858 963217 966485 968716 969792 971179 973755
58371I73755L654M789O216P432Q244R088R949J0527J1347J3087J5023J5997J6445
$$ 973755 977409 982198 988414 995846 1004090 1013178 1023127 1033654 1045001 1058088 1073111 1089108 1105553
58358A105553J7327J7749J6196J3510J1701J0258O915K026j293j845j847l065
$$ 1105553 1122880 1140629 1156825 1170335 1182036 1192294 1199209 1201235 1199942 1198097 1196250 1193185
58346A193185m513m848m245k937o11K041L599M362O044Q721J0662J1555J2979
$$ 1193185 1188672 1183824 1179579 1176642 1176031 1178072 1181671 1186033 1192077 1200798 1211460 1223015 1235994
58333A235994J5243J6689J6724J6674J7016J6652J5459J4639J3960J1699Q000
$$ 1235994 1251237 1267926 1284650 1301324 1318340 1334992 1350451 1365090 1379050 1390749 1398749
58322A398749N195M062K884R50r4N78J597K132L130M863O103O556P435Q879R652
$$ 1398749 1403944 1408006 1410890 1411840 1411746 1412324 1413921 1416053 1419183 1424046 1430149 1436705 1444140 1453019 1462671
58307A462671R879J1150J3431J4889J5159J5623J6245J5609J4334J4742J6704
$$ 1462671 1472550 1483700 1497131 1512020 1527179 1542802 1559047 1574656 1588990 1603732 1620436
58296A620436J7613J6910J6701J7385J6903J5109J4650J6491J8614K0011K1835
$$ 1620436 1638049 1654959 1671660 1689045 1705948 1721057 1735707 1752198 1770812 1790823 1812658
58285A812658K3798K3883K2552K2868K5427K7496K8049K8986L0673L1190L0906
$$ 1812658 1836456 1860339 1882891 1905759 1931186 1958682 1986731 2015717 2046390 2077580 2108486
58274B108486L2616L6092L7831L7378L8275M1553M4130M5128M7565N1923N4417
$$ 2108486 2141102 2177194 2215025 2252403 2290678 2332231 2376361 2421489 2469054 2520977 2575394
58263B575394N3963N4553N8142O1343O1936O2519O4759O6092O5142O4576O5612
$$ 2575394 2629357 2683910 2742052 2803395 2865331 2927850 2992609 3058701 3123843 3188419 3254031
58252C254031O5613O3914O3972O7002O9719P1038P4421Q1005Q7313R2427R9957
$$ 3254031 3319644 3383558 3447530 3514532 3584251 3655289 3729710 3810715 3898028 3990455 4090412
58241D090412J10159J18036J22476J28897J39429J49097J55578J63717J76116
$$ 4090412 4200571 4318607 4441083 4569980 4709409 4858506 5014084 5177801 5353917
58232E353917J88517J99067K12583K30702K47726K61494K78243L01175L24806
$$ 5353917 5542434 5741501 5954084 6184786 6432512 6694006 6972249 7273424 7598230
58223G598230L46520L72587M06254M41598M76106N17451N70286O28775O90121
$$ 7598230 7944750 8317337 8723591 9165189 9641295 10158746 10729032 11357807 12047928
58214A2047928P62457Q51161R51328J062948J198940J368779J570507J810445
$$ 12047928 12810385 13661546 14612874 15675822 16874762 18243541 19814048 21624493
58206B1624493K114932K511435L015699L648409M440597N401372O494404P660574
$$ 21624493 23739425 26250860 29266559 32914968 37355565 42756937 49251341 56911915
58198E6911915Q847606J0009579J1107412J2131066J3101096J4041707J4989780
$$ 56911915 65759521 75769100 86876512 99007578 112108674 126150381 141140161
58191A41140161J6040572J7335335J8994375K1118634K3790004K6771764K8969883
$$ 141140161 157180733 174516068 193510443 214629077 238419081 265190845 294160728
58184B94160728K8399620K3253585J3428559J020838j0840360j9777751k5058716
$$ 294160728 322560348 345813933 359242492 360263330 349422970 329645219 304586503
58177C04586503k7223949k7240124k5941301k3868968k1333701j8595883j6020717
$$ 304586503 277362554 250122430 224181129 200312161 178978460 160382577 144361860
58170A44361860j4002740j2701175j1913224j1265132j0502117r583134q581822
$$ 144361860 130359120 117657945 105744721 94479589 83977472 74394338 65812516
58163F5812516p583531o654373n828690n099345m441897l849651l330244k880563
$$ 65812516 58228985 51574612 45745922 40646577 36204680 32355029 29024785 26144222
58155B6144222k488241k150009j867616j631633j427456j251940j108519r91628
$$ 26144222 23655981 21505972 19638356 18006723 16579267 15327327 14218808 13227180
58147A3227180q90440q02510p30454o70277o15102n65318n23978m87219m49509
$$ 13227180 12336740 11534230 10803776 10133499 9518397 8953079 8429101 7941882 7492373
58138G492373m13088l82489l55030l26053k98156k75943k56815k35969k15773
$$ 7492373 7079285 6696796 6341766 6015713 5717557 5441614 5184799 4948830 4733057
58129D733057k01383j91570j82096j73538j67873j61762j51354j39741j32019
$$ 4733057 4531674 4340104 4158008 3984470 3816597 3654835 3503481 3363740 3231721
58120C231721j26734j19514j11187j05093r9991r2778q5004p9951p6363p1345
$$ 3231721 3104987 2985473 2874286 2769193 2669202 2576424 2491420 2411469 2335106 2263761
58110B263761o6251o3592o1407n6780n1699m9516m8780m6388m3626m3153m3221
$$ 2263761 2197510 2133918 2072511 2015731 1964032 1914516 1865736 1819348 1775722 1732569 1689348
58099A689348m0781l7425l6422l6654l5211l3174l3014l3032l0180k6034k4186
$$ 1689348 1648567 1611142 1574720 1538066 1502855 1469681 1436667 1403635 1373455 1347421 1323235
58088A323235k3862k1844j8665j7292j7452j6622j5185j5471j7070j7878j8305
$$ 1323235 1299373 1277529 1258864 1241572 1224120 1207498 1192313 1176842 1159772 1141894 1123589
58077A123589j9796k0878j9315j6673j6116j7148j6982j5560j4810j4449j2985
$$ 1123589 1103793 1082915 1063600 1046927 1030811 1013663 996681 981121 966311 951862 938877
58066I38877j1479j1906j3103j2586j1018j0648j0771r146o620n946p073p733
$$ 938877 927398 915492 902389 889803 878785 868137 857366 848220 841600 835654 828581 820848
58054H20848p662q156q558p363n803o213p752p736o317n779o072n244l644l583
$$ 820848 813186 805030 796472 789109 783306 777093 769341 761605 755288 749509 743437 738193 734549 730966
58040G30966n080n831n229m821n045m937m840o014p756q112p193o915p757q594
$$ 730966 725886 720055 714826 710005 704960 700023 695183 689169 681413 673301 666108 659193 651436 642842
58026F42842r186j0003j0295r160p752p612p779o485m626m256m745l918k196j970
$$ 642842 633656 623653 613358 604198 596446 588834 581055 574570 569944 565688 560943 557025 554829 552859
58012E52859l334m011l186k078j012P97K702L055K125J677J892J544Q51J118J990
$$ 552859 549525 545514 542328 540250 539238 540035 542737 545792 547917 549594 551486 553030 553881 554999 556989
57997E56989K050J741K655M263M559L609L251L576K921J359P82J454J666J051
$$ 556989 559039 560780 563435 567698 572257 575866 579117 582693 585614 586973 587755 589209 590875 591926
57983E91926J130K195K660J949J255J016L33p95j216r93j480k781l564l539l650
$$ 591926 593056 595251 597911 599860 601115 602131 602464 601669 600453 599460 597980 595199 591635 588096 584446
57968E84446l787k922j611j689l167m058l557k918k844k568j846j482j540j337
$$ 584446 580659 577737 576126 574437 571270 567212 563655 560737 557893 555325 553479 551997 550457 549120
57954E49120j354k682m545m876l564k537k481k166j245q89j143m21J680L607M503
$$ 549120 547766 545084 540539 535663 532099 529562 527081 524915 523670 522781 521638 521217 522897 526504 531007
57939E31007N138N721N368M425M741O740Q618R221R391R722R370Q027O798O111
$$ 531007 536145 541866 547234 551659 556400 563140 571758 580979 590370 600092 609462 617489 624287 630398
57925F30398M897K733P67l87j600l281m538n124o157p964r282r502r764j0769
$$ 630398 635295 638028 638795 638408 636808 633527 628989 623865 617708 609744 600462 590960 581196 570427
57911E70427j1465j0982j0071r546q909p632o333n739n763o246p242q097p837
$$ 570427 558962 547980 537909 528363 519454 511822 505489 499750 493987 487741 480499 472402 464565
57898D64565o876o622p092o768n345m403m664m699l383j664p29k11O43J586K224
$$ 464565 457689 451067 443975 437207 431862 427459 422795 418096 414713 413049 412320 412109 412752 414338 416562
57883D16562K824L301K867J541O12P68J177J117J002J079O75m65j579k340l308
$$ 416562 419386 422687 425554 427095 427707 428475 429652 430769 431771 432850 433525 433060 431481 429141 425833
57868D25833m280l963k134m38o1k02K13R10J385K021L010L592L453L482M098M331
$$ 425833 421553 417590 415456 415018 414957 414755 414968 415878 417263 419284 422294 425886 429339 432821 436919 441250
57852D41250L685L397M601O438P344P087O418N687M901M304L887L069J632J86
$$ 441250 444935 448332 452933 459371 466715 473802 480220 485907 490808 495112 498999 502068 503700 503886
57838E03886q18j597k162k089j600j627k291k688k600k903l758m023l224k432
$$ 503886 503068 501471 499309 497220 495620 493993 491702 489014 486414 483511 479753 475730 472506 470074
57824D70074k402k368j649q39m55M1Q70J172O98O81J793K746K299J296J162J654
$$ 470074 467672 465304 463655 462816 462361 462402 463272 464444 465142 465823 467616 470362 472661 473957 475119 476773
57808D76773J604R21L36j08j069k830n190p706r430r298p584n943n455n594n727
$$ 476773 478377 479298 479634 479526 478457 475627 470437 462731 453301 444003 436419 430476 425021 419427 413700
57793D13700o167o946p123o295n457n276m937l847k991l197l450k501r56j52L9
$$ 413700 407533 400587 393464 387169 381712 376436 371499 367652 364661 361464 358014 355513 354557 354405 354444
57778C54444O58J733K500K894L398L858L811L508L510L742L867M046M390M347
$$ 354444 355102 356835 359335 362229 365627 369485 373296 376804 380314 384056 387923 391969 396359 400706
57764D00706L445K021N08j202k907l771l639l600m229m499l621k713l225m665
$$ 400706 404151 406172 406680 405478 402571 398800 395161 391561 387332 382833 379212 376499 373274 368609
57750C68609n397m901l821k524r92L42R24Q76N77J1o19o09k9j95j680k968k455
$$ 368609 363212 358311 354490 351966 350974 351316 352240 353116 353693 353704 353085 352476 352447 352252 350572 347604 345149
57733C45149q16J08l1k02n1j09l97l94j41p2K1O04J329J494J271J338J659J678
$$ 345149 344333 344441 344410 344208 344157 344048 343651 343257 343116 343044 343065 343669 344998 346492 347763 349101 350760 352438
57715C52438J303P21k75j675k566k261j519j463j854j744j263j322j939k288k178
$$ 352438 353741 354462 354187 352512 349946 347685 346166 344703 342849 341105 339842 338520 336581 334293 332115
57700C32115k113k093j644r43o25n35J00J316K243K324J743P62m62j435j587r51
$$ 332115 330002 327909 326265 325322 324697 324162 324262 325578 327821 330145 331888 332650 332188 330753 329166 328215
57684C28215Q0J396K971M461N748P438R985J2881J5559J8452K2096K5794K8355
$$ 328215 328295 329691 332662 337123 342871 350309 360294 373175 388734 407186 429282 455076 483431
57671D83431K9828L1338L3616L6842M1487M7876N4631N8504N5974M4969K5907
$$ 483431 513259 544597 578213 615055 656542 704418 759049 817553 873527 918496 944403
57660I44403K170k0997l9303n1355n7714n9090n6435n1710m6813m2016l6623l0809
$$ 944403 946573 925576 886273 834918 777204 718114 661679 609969 563156 521140 484517 453708
57648D53708k5544k1170j7348j4144j1865j0087q089o103m837m025k765j141k73
$$ 453708 428164 406994 389646 375502 363637 353550 345461 339358 334521 330496 327731 326590 326317
57635C26317o14j387j731j494q80k59j34n14n28L52J186P50o06j507j637j827
$$ 326317 325703 324316 322585 321091 320211 319952 319818 319304 318776 319128 320314 321064 320458 318951 317314 315487
57619C15487k258k181j516j278j997k854k906k279j741j743k185k585k439j800
$$ 315487 313229 311048 309532 308254 306257 303403 300497 298218 296477 294734 292549 289964 287525 285725
57605B85725j345j474j669j354q83q84j234j491j830k521k991k540j590j115j269
$$ 285725 284380 282906 281237 279883 279000 278116 276882 275391 273561 271040 268049 265509 263919 262804 261535
57590B61535j631k329l619m733m579l351k231j697j369j227j583k036j834j246
$$ 261535 259904 257575 253956 249223 244644 241293 239062 237365 235996 234769 233186 231150 229316 228070
57576B28070j218j734j924j721j974k781l154k605j760j125m74K11L28l30j097
$$ 228070 226852 225118 223194 221473 219499 216718 213564 210959 209199 208074 207600 207811 208139 207809 206712
57561B06712j381j313j250j275j257q66K71J782K370J397M5j90L62L65j01L76
$$ 206712 205331 204018 202768 201493 200236 199370 199641 201423 203793 205190 205235 205045 205407 205772 205671 206047
57545B06047K065L428L221J822K32r62j396r41j80J92M60J297K198J959O95r8
$$ 206047 208112 211540 214761 216583 216815 215853 214457 213516 213336 213528 213988 215285 217483 219442 220137 220039
57529B20039K90J012J274J277J253R72N74O02Q23L33p87j239l96Q08J291J075
$$ 220039 220329 221341 222615 223892 225145 226117 226691 227293 228116 228449 227662 226423 226027 226835 228126 229201
57513B29201P88R16J821L365M407L822K118Q34L32k64j045r98p3L73k73r73j022
$$ 229201 229989 230905 232726 236091 240498 244320 246438 247272 247604 247340 246295 245297 245224 245597 245324 244351 243329
57496B43329j174j993k715k746k769l260l303k165q03n32j126j402r91m77m33
$$ 243329 242155 240162 237447 234701 231932 228672 225369 223204 222401 221869 220743 219341 218350 217873 217440
57481B17440j093k327l322l095j837q71p92p16k3M70o6r99j272r44o96n56j68
$$ 217440 216347 214020 210698 207603 205766 204895 204103 203387 203364 203834 203768 202769 201497 200553 199857 199301 199133
57464A99133K78L25o5p23j578k216j926p54L16P62J183J949K332J763R30O16L98
$$ 199133 199411 199736 199671 198948 197370 195154 193228 192474 192790 193552 194735 196684 199016 200779 201709 202325 202723
57447B02723l92j241j156k54M39L94q7n71p46l66M38J096J332J423J440J004J88
$$ 202723 202331 201090 199934 199680 200119 200513 200426 199855 199109 198743 199181 200277 201609 203032 204472 205476 205664
57430B05664k12Q8L66K13K91R16J016k71j899k130r15K90O65P47J110J496J419
$$ 205664 205452 205540 205906 206119 206410 207326 208342 208071 206172 204042 203127 203417 204082 204829 205939 207435 208854
57413B08854Q72K63L8L18O62M53k68p02l73K41M58J86l48j033j572j411m48O75
$$ 208854 209726 209989 210027 210345 211007 211460 211192 210490 210117 210358 210816 211002 210654 209621 208049 206638 206190 206865
57395B06865J432J940K362K494K360K440K811K816K097J165N38Q7k31Q5J197K336
$$ 206865 208297 210237 212599 215093 217453 219893 222704 225520 227617 228782 229320 229407 229176 229261 230458 232794
57379B32794K782K633K154J230P9m48o3M13L82L65P91R60K59n11k41P37J178P02
$$ 232794 235576 238209 240363 241593 241672 241224 241161 241574 241956 242321 243112 244072 244331 243820 243579 244316 245494 246196
57361B46196J9k51k5N63J175J280Q74P10J260J968K108J723J143L91k57n9J055
$$ 246196 246215 245964 245939 246502 247677 248957 249831 250541 251801 253769 255877 257600 258743 259134 258877 258818 259873
57344B59873J990J978J745K190K832K620J597O01K5j24M72J802K802K433J123
$$ 259873 261863 263841 265586 267776 270608 273228 274825 275426 275451 275327 275799 277601 280403 282836 283959
57329B83959J19j52j12R7O48J281J593J705J918K037J862J757J863J454O1j348
$$ 283959 284078 283926 283814 283911 284559 285840 287433 289138 291056 293093 294955 296712 298575 300029 300090 298742
57313B98742j462l94P98J744K676L227K834K064K133L091L723L384K795K808L303
$$ 298742 297280 296886 297684 299428 302104 305331 308165 310229 312362 315453 319176 322560 325355 328163 331466
57298C31466L675L670L539L646M045M274L868L223L311M263N004M820M371M460
$$ 331466 335141 338811 342350 345996 350041 354315 358183 361406 364717 368980 373984 378804 383175 387635
57284C87635M807M921N181N955O525O221N860O616Q054Q675Q062P083O296N563
$$ 387635 392442 397363 402544 408499 415024 421245 427105 433721 441775 450450 458512 465595 471891 477454
57270D77454N014N038N267M814L531K139J141N28L53O21Q27N23K09O89J776K573
$$ 477454 482468 487506 492773 497587 501118 503257 504398 504926 505279 505900 506727 507250 507459 508148 509924 512497
57254E12497K853L180L920M951O131P231P674P211O515O327O482O574O919P869
$$ 512497 515350 518530 522450 527401 533532 540763 548437 555648 562163 568490 574972 581546 588465 596334
57240E96334Q840R157R249R777J0254R865R108R125R826J0252J0422J1154J2245
$$ 596334 605174 614331 623580 633357 643611 653476 662584 671709 681535 691787 702209 713363 725608
57227G25608J2545J1946J1635J2208J2984J3434J3987J4966J5953J6568J6958
$$ 725608 738153 750099 761734 773942 786926 800360 814347 829313 845266 861834 878792
57216H78792J7254J7451J7849J8755J9689J9899J9661K0044K1302K2490K2781
$$ 878792 896046 913497 931346 950101 969790 989689 1009350 1029394 1050696 1073186 1095967
57205A095967K2293K1640K1460K2288K3996K5496K5849K5509K5637K6515K7557
$$ 1095967 1118260 1139900 1161360 1183648 1207644 1233140 1258989 1284498 1310135 1336650 1364207
57194A364207K8502K9488L0268L0565L0898L1913L3116L3537L3307L3304L3423
$$ 1364207 1392709 1422197 1452465 1483030 1513928 1545841 1578957 1612494 1645801 1679105 1712528
57183A712528L2599L0542K8158K6213K4787K3915K3677K3731K3770K4249K5504
$$ 1712528 1745127 1775669 1803827 1830040 1854827 1878742 1902419 1926150 1949920 1974169 1999673
57172A999673K6647K6660K6200K6859K8891L1208L3367L5828L8348L9902M0351
$$ 1999673 2026320 2052980 2079180 2106039 2134930 2166138 2199505 2235333 2273681 2313583 2353934
57161B353934M0660M1216M1459M1329M1503M1902M1389L9365L6484L3564L0881
$$ 2353934 2394594 2435810 2477269 2518598 2560101 2602003 2643392 2682757 2719241 2752805 2783686
57150B783686K8563K6473K3724J9578J4754J0558O939K830j779n887r474j3482
$$ 2783686 2812249 2838722 2862446 2882024 2896778 2907336 2914275 2917105 2915326 2909439 2899965 2886483
57138B886483j7567j9680j8502j4809r880l976L147J1377K0476L0098L9258M6644
$$ 2886483 2868916 2849236 2830734 2815925 2806045 2802069 2805216 2816593 2837069 2867167 2906425 2953069
57126B953069N1623N4200N4234N1678M7304M2200L6924L2098K9106K9005L1555
$$ 2953069 3004692 3058892 3113126 3164804 3212108 3254308 3291232 3323330 3352436 3381441 3412996
57115C412996L6681M5858O0284P8690R8655J18942J38593J55355J67895J79048
$$ 3412996 3449677 3495535 3555819 3634509 3733164 3852106 3990699 4146054 4313949 4492997
57105D492997J94485K19104K56873L12276L88292M83970N97486P30680Q86818
$$ 4492997 4687482 4906586 5163459 5475735 5864027 6347997 6945483 7676163 8562981
57096H562981J064561J257585J458972J662360J861017K051225K235434K416919
$$ 8562981 9627542 10885127 12344099 14006459 15867476 17918701 20154135 22571054
57088B2571054K592571K755071K895918K995824L018956K939219K780538K612425
$$ 22571054 25163625 27918696 30814614 33810438 36829394 39768613 42549151 45161576
57080D5161576K485920K376495K200251J882747J406036Q03318J32692n40765
$$ 45161576 47647496 50023991 52224242 54106989 55513025 56316343 56449035 55908270
57072E5908270j160183j695204k147434k533732k864768l138006l342204l462482
$$ 55908270 54748087 53052883 50905449 48371717 45506949 42368943 39026739 35564257
57064C5564257l485607l407751l238673k997806k708265k394849k082186j789376
$$ 35564257 32078650 28670899 25432226 22434420 19726155 17331306 15249120 13459744
57056A3459744j526165j295467j097753r31641p93096o77311n81072n02042m37054
$$ 13459744 11933579 10638112 9540359 8608718 7815622 7138311 6557239 6055197 5618143
57047E618143l82841l37601l00611k70901k47176k28141k12264j98013j84847
$$ 5618143 5235302 4897701 4597090 4326189 4079013 3850872 3638608 3440595 3255748
57038C255748j73101j62634j52643j42946j34126j26120j18019j09559j01486
$$ 3255748 3082647 2920013 2767370 2624424 2490298 2364178 2246159 2136600 2035114
57029B035114r4120q6833p9291p1929o4981n8171n1467m4961l8018k9710j9561
$$ 2035114 1940994 1854161 1774870 1702941 1637960 1579789 1528322 1483361 1445343 1415633 1396072
57018A396072o622J0780L1175M5968M3476J9385j8225n5425q2582r7749j03387
$$ 1396072 1389450 1400230 1431405 1477373 1520849 1540234 1522009 1466584 1384002 1286253 1182866
57007A182866j02767r8612r2443q4558p5203o5475n6607m9044m2696l7416l2705
$$ 1182866 1080099 981487 889044 804486 729283 663808 607201 558157 515461 478045 445340
56996D45340k7790k2559j7752j3880j0724q178o585n828n084l899k604j209J010
$$ 445340 417550 394991 377239 363359 352635 344457 337872 332044 326960 323061 320457 319248 320258
56983C20258M246P349Q896Q264N367L66n770j1342j5147j7071j7264j5756j3216
$$ 320258 324504 331853 340749 349013 354380 354746 348976 337634 322487 305416 288152 272396 259180
56970B59180j0908r275p488m932k212p7J750L868O166Q159R823J1506J3489J5963
$$ 259180 248272 238997 231509 226577 224365 224288 226038 229906 236072 244231 254054 265560 279049 295012
56956B95012J8763K0711J9881J5180P314j859j0419j6809k0260k1299k1141k0186
$$ 295012 313775 334486 354367 369547 376861 375002 364583 347774 327514 306215 285074 264888
56944B64888j7809j3800r192n240k275K9K007M041O574R565J2480J5124J8020
$$ 264888 247079 233279 224087 218847 216572 216601 218608 222649 229223 238788 251268 266392 284412
56931B84412K1574K5283K7766K7273K2270J2526j12j2613k2595k9049l1738l1003
$$ 284412 305986 331269 359035 386308 408578 421104 420992 408379 385784 356735 324997 293994
56919B93994k8226k5339k3416k2226k1073j9401j6811j3481j0549r027q355p130
$$ 293994 265768 240429 217013 194787 173714 154313 137502 124021 113472 104445 96090 88960
56907H8960n175l709l329l217k502j239K92K001L406L971M315N805Q422J0437
$$ 88960 83785 80076 76747 73530 71028 69789 70081 72082 75488 79459 83774 89579 98001 108438
56893A08438J0849J0786J1723J3467J4936J5888J6948J8583K0765K2918K3586
$$ 108438 119287 130073 141796 155263 170199 186087 203035 221618 242383 265301 288887
56882B88887K1013J4876O903o72o585j0231j1134r643p262n301l631j389J710
$$ 288887 309900 324776 331679 331007 324422 314191 303057 293414 286152 280851 277220 275831 277541
56869B77541N330R088J2529J5168J7246J9867K3753K8397L2937L7314M1800M5672
$$ 277541 282871 291959 304488 319656 336902 356769 380522 408919 441856 479170 520970 566642
56857E66642M6857M2801L2031J5737j926j6131k4671k8638k9918k9046k5783k0482
$$ 566642 613499 656300 688331 704068 702142 686011 661340 632702 602784 573738 547955 527473
56845E27473j3957o773O25P660J4129K0383K6530L2133L7085M2140M8093N5085
$$ 527473 513516 506743 507368 515028 529157 549540 576070 608203 645288 687428 735521 790606
56833G90606O2838P0264P4213O9865N4037K8285j662k9296n0251o3188o9019o9351
$$ 790606 853444 923708 997921 1067786 1121823 1150108 1148446 1119150 1068899 1005711 936692 867341
56821H67341o5321n7964m9091m0631l2880k4591j5172n767K302R036J5137K0965
$$ 867341 802020 744056 694965 654334 621454 596863 581691 575924 578226 587262 602399 623364
56809F23364K6919L3718M1320M8004N1192M8631L8751K1318j166k3708m1638n3104
$$ 623364 650283 684001 725321 773325 824517 873148 911899 933217 932051 908343 866705 813601
56797H13601n8648n9531n7135n2821m7226m0198l2112k4399j8051j2549p128k129
$$ 813601 754953 695422 638287 585466 538240 498042 465930 441531 423480 410931 403803 401674
56785D01674J895N465R476J3902J8233K2310K5457K5514K0246R705l636j6710
$$ 401674 403569 409034 418510 432412 450645 472955 498412 523926 544172 553877 550241 533531
56773E33531k7125l3470l5786l5634l4729l3545l1738k9334k6668k3738k0524
$$ 533531 506406 472936 437150 401516 366787 333242 301504 272170 245502 221764 201240
56762B01240j7544j5173j2929j0305p822o325n672n136m597m312l946k981j799
$$ 201240 183696 168523 155594 145289 137467 131142 125470 120334 115737 111425 107479 104498 102699
56749A02699j271j415j505j277j051q10k56K72L7p95j112l56P11J091Q00N60O84
$$ 102699 101428 100013 98508 97231 96180 95370 95114 95386 95423 94628 93516 93160 93871 94962 95762 96322 97006
56732I7006O48j59j492k249j707n33K1k16k78K52O02K53n7M07J101J145Q51J161
$$ 97006 97654 97495 96003 93754 92047 91514 91535 91319 91041 91293 91895 92148 92091 92498 93599 94744 95595 96756
56714I6756K072K665K481J976J638J485J333J066O75L67L88O04N62K09r9l78j033
$$ 96756 98828 101493 103974 105950 107588 109073 110406 111472 112147 112514 112902 113506 114068 114277 114178 113800 112767
56697A12767j814j789q23J2M0l8M68R92Q13K93K0k79q27q32K73J472J497O98K56
$$ 112767 110953 109164 108341 108353 108393 108355 108823 109815 110628 110921 110941 110662 109835 109003 109276 110748 112245 112943 113199
56678A13199J77l29j081j081k57M41N04J91l41j014j198m15O03P29Q8k77o6K09
$$ 113199 113376 113047 111966 110885 110628 111069 111573 111764 111423 110409 109211 108796 109399 110128 110216 109939 109873 110082
56660A10082M81J037J463J120M99O83J525J823J330J039J349J443Q70L79O35J220
$$ 110082 110563 111600 113063 114183 114682 115365 116890 118713 120043 121082 122431 123874 124744 125123 125758 126978
56644A26978J395J048N12J77M58J376K135J969J301J139J519J583J140Q21O98
$$ 126978 128373 129421 129933 130110 130568 131944 134079 136048 137349 138488 140007 141590 142730 143551 144249
56629A44249R9r65j493j040l95k66l56k19m2k9Q3M48P64Q61R09P95J89n73n72
$$ 144249 144348 143383 141890 140850 140455 140189 139833 139614 139572 139543 139626 140074 140838 141699 142608 143403 143592 143019 142447
56610A42447K97J013R32O57R05J367J354Q92N00M25O43J115J543J386N85j55k96
$$ 142447 142744 143757 144689 145346 146251 147618 148972 149864 150364 150789 151432 152547 154090 155476 156061 155906 155610
56593A55610j88m93j233j837j842j125J44J388J770J002j32m33M49J623J917J109
$$ 155610 155422 154929 153696 151859 150017 148892 149036 150424 152194 153196 153064 152631 153080 154703 156620 157729
56577A57729J20qQ26J896K574K695K183J026j74m30M71J656K407K962L656M137
$$ 157729 157849 157841 158667 160563 163137 165832 168015 169041 168867 168437 168908 170564 172971 175933 179589 183726
56561A83726M133M231M991N985O613P147P856P839O060L181J016L68N71R17J253
$$ 183726 187859 192090 197081 203066 209679 216826 224682 232521 238581 241762 242778 243146 243717 244634 245887
56546B45887J316P95J22kJ41l48j388j938j731j682k316l000l178l189l411l521
$$ 245887 247203 247998 248120 248118 248259 247911 246523 244585 242854 241172 238856 235856 232678 229489 226078 222557
56530B22557l187k642k138j568j101j377k549l716l848k929j801j202j253j626
$$ 222557 219370 216728 214590 213022 211921 210544 207995 204279 200431 197502 195701 194499 193246 191620
56516A91620j954k093k105j930j438r09r28j505j831j379o31j74J97P82J107P08
$$ 191620 189666 187573 185468 183538 182100 181191 180263 178758 176927 175548 174917 174743 174940 175722 176829 177537
56500A77537O9k25n70j489k369k308j655j312j052o0J239J538P18k9r9o5k73l08
$$ 177537 177606 177381 176811 175322 172953 170645 168990 167678 166626 166566 167805 169343 170061 170032 169933 169868 169595 169287
56482A69287k8J54J54K36J52n20j301j250m07M19J034J720K065J568J030J662
$$ 169287 169259 169413 169567 169803 169955 169435 168134 166884 166477 166896 167930 169650 171715 173283 174313 175975
56466A75975K884K993J876J068J011N23p18j414j069q86j437j519m33N55L12k90
$$ 175975 178859 181852 183728 184796 185807 186330 185612 184198 183129 182243 180806 179287 178854 179409 179721 179431
56450A79431k1P29R90R36J170J396J151Q83J084J227O91n5k54j03j86m50o21q69
$$ 179431 179410 180139 181129 182065 183235 184631 185782 186665 187749 188976 189667 189612 189358 189255 189069 188619 187998 187129
56432A87129j142o78Q75K445K685J609L66j24K83J196J853J594O30j60m78q55
$$ 187129 185987 185309 186184 188629 191314 192923 193289 193165 193448 194644 196497 198091 198721 198561 198083 197228
56416A97228j481j741j266n08J04N91P73L08l27j06R26J596J494J483J823J468
$$ 197228 195747 194006 192740 192232 192336 192927 193700 194008 193681 193575 194501 196097 197591 199074 200897 202365
56400B02365M3j125r73k61MK49J191K222K358J863J590J500J029L15q8q6K70J180
$$ 202365 202408 201283 200310 200049 200053 200302 201493 203715 206073 207936 209526 211026 212055 212370 212282 212196 212466 213646
56382B13646K366K780J993J060J049J590J795J773K095K545K503J996J401O90
$$ 213646 216012 218792 220785 221845 222894 224484 226279 228052 230147 232692 235195 237191 238592 239282
56368B39282j21m13K21J134J426J071N82K15O7L49R14J255J364J727K142J686
$$ 239282 239161 238748 238969 240103 241529 242600 243182 243397 243464 243813 244727 245982 247346 249073 251215 252901
56352B52901M11l04J58O44J60n43m38J12L47N95J403K218K323K145K351K519K064
$$ 252901 253312 253008 253166 253810 253970 253427 252989 253101 253448 254043 255446 257664 259987 262132 264483 267002 269066
56335B69066J526J652K030J969J883K383K905K684K327K810L556L154J625L69
$$ 269066 270592 272244 274274 276243 278126 280509 283414 286098 288425 291235 294791 297945 299570 299939
56321B99939R6K66M45Q66J565K029J856J035k17j291j253J57J897K700K398J727
$$ 299939 300035 300301 300746 301612 303177 305206 307062 308097 307880 306589 305336 305493 307390 310090 312488 314215
56305C14215J347J644K752M055M404L516K531K508L163L655L793L748L450L002
$$ 314215 315562 317206 319958 324013 328417 331933 334464 336972 340135 343790 347583 351331 354781 357783
56291C57783K803K669J902P84P76K443M450N460N685N729N393M788N036O537P920
$$ 357783 360586 363255 365157 365941 366717 369160 373610 379070 384755 390484 395877 400665 405701 412238 420158
56276D20158Q078P893Q553R604J0240J1047J2611J3783J3323J2245J2465J4041
$$ 420158 428236 436129 444682 454286 464526 475573 488184 501967 515290 527535 540000 554041
56264E54041J5652J6970J8520K0003K0923K2302K5622L0324L4288L6724L8902
$$ 554041 569693 586663 605183 625186 646109 668411 694033 724357 758645 795369 834271
56253H34271M2127M6541N1788N7486O3107O8534P4438Q1097Q7485R2506R6480
$$ 834271 876398 922939 974727 1032213 1095320 1163854 1238292 1319389 1406874 1499380 1595860
56242A595860J00171J03234J04842J04993J03827J00629R4889Q7430P8963O8546
$$ 1595860 1696031 1799265 1904107 2009100 2112927 2213556 2308445 2395875 2474838 2543384
56232B543384N4980L8883K1783M217j3641l0590m5489n8817p1297q1926q9263
$$ 2543384 2598364 2637247 2659030 2663247 2649606 2619016 2573527 2514710 2443413 2361487 2272224
56221B272224r3809r7115r9370r9868r8939r7302r4350q9210q2892p7201p2255
$$ 2272224 2178415 2081300 1981930 1882062 1783123 1685821 1591471 1502261 1419369 1342168 1269913
56210A269913o7068o1849n7436n3231m8129m2841l9020l6410l3350k9604k6374
$$ 1269913 1202845 1140996 1083560 1030329 982200 939359 900339 863929 830579 800975 774601
56199G74601k3847k1101j8232j6258j5082j3700j2191j1345j0704r192p397o858
$$ 774601 750754 729653 711421 695163 680081 666381 654190 642845 632141 622949 615552 608694
56187F08694p319o995n441l933l180k816k940l862m613l935k521k045k347j862
$$ 608694 601375 594380 588939 585006 581826 579010 576070 572208 567595 563660 561139 559094 556747 554885
56173E54885m88M91R72J967L204L419K859K924L447L087K227K599M103M887M733
$$ 554885 554397 554888 555860 557827 561031 564450 567309 570233 573680 576767 578994 581593 585696 590583 595316
56158E95316N348O974P817P357P348Q758J0447J1613J3002J4860J6224J7064J8780
$$ 595316 600664 607638 615455 622812 630160 638918 649365 660978 673980 688840 705064 722128 740908
56145G40908K1773K4757K7183L0176L4287L8526M2249M6006M9934N3435N6939
$$ 740908 762681 787438 814621 844797 879084 917610 959859 1005865 1055799 1109234 1166173
56134A166173O2003O9094P7156Q5515R4180J02082J07237J08794J06930J00920
$$ 1166173 1228176 1297270 1374426 1459941 1554121 1656203 1763440 1872234 1979164 2080084
56124B080084R0062P6562O4710N6642N1113M6407M1658L5210K4906J0955l864
$$ 2080084 2170146 2246708 2311418 2368060 2419173 2465580 2507238 2542448 2567354 2578309 2574445
56113B574445j7322k8722l6922m0589m1156m2747m8174n7142o8378q0684r1624
$$ 2574445 2557123 2528401 2491479 2450890 2409734 2366987 2318813 2261671 2193293 2112609 2020985
56102B020985r8334j00498j00017r7471r1671q2945p3548o4406n4582m4503l6341
$$ 2020985 1922651 1822153 1722136 1624665 1532994 1450049 1376501 1312095 1257513 1213010 1176669
56091A176669l0456k4806j8748j4150j1806j0009p721n979n119l733j502lL78
$$ 1176669 1146213 1121407 1102659 1088509 1076703 1066694 1058973 1052994 1047875 1044142 1042640 1042637 1043015
56078A043015J365L586N423N960O207O617O424O098P321R798J1319J1545J2340
$$ 1043015 1044380 1047966 1053389 1059349 1065556 1072173 1078597 1084695 1092016 1101814 1113133 1124678 1137018
56065A137018J3929J4479J4026J4798J6839J7529J6296J5642J6372J6165J4239
$$ 1137018 1150947 1165426 1179452 1194250 1211089 1228618 1244914 1260556 1276928 1293093 1307332
56054A307332J3019J3635J4020J3131J2870J4093J4914J4688J5472J7777J9116
$$ 1307332 1320351 1333986 1348006 1361137 1374007 1388100 1403014 1417702 1433174 1450951 1470067
56043A470067J8598J8771K0998K3225K4189K5616K8314L0299L0716L1434L3127
$$ 1470067 1488665 1507436 1528434 1551659 1575848 1601464 1629778 1660077 1690793 1722227 1755354
56032A755354L3994L3892L5146L7827L9154L8939M0373M3883M5858M5306M5810
$$ 1755354 1789348 1823240 1858386 1896213 1935367 1974306 2014679 2058562 2104420 2149726 2195536
56021B195536M8809N1063N1202N2473N6247N9157N9719O1365O5702O9214P0147
$$ 2195536 2244345 2295408 2346610 2399083 2455330 2514487 2574206 2635571 2701273 2770487 2840634
56010B840634P2161P7477Q2829Q6015Q9862R5872J00647J02789J06531J14214
$$ 2840634 2912795 2990272 3073101 3159116 3248978 3344850 3445497 3548286 3654817 3769031
56000C769031J21934J27005J32770J41552J50043J56363J64339J76009J87398
$$ 3769031 3890965 4017970 4150740 4292292 4442335 4598698 4763037 4939046 5126444
55991E126444J96615K08277K24898K41931K56613K73272K94681L17041L38811
$$ 5126444 5323059 5531336 5756234 5998165 6254778 6528050 6822731 7139772 7478583
55982G478583L65060L97483M30391M62584N02135N52959O08506O66048P34509
$$ 7478583 7843643 8241126 8671517 9134101 9636236 10189195 10797701 11463749 12198258
55973A2198258Q20126R17881J026214J156424J317834J509166J736310K024126
$$ 12198258 13018384 13936265 14962479 16118903 17436737 18945903 20682213 22706339
55965B2706339K399344K878048L480890M238832N163563O225328P372997Q559280
$$ 22706339 25105683 27983731 31464621 35703453 40867016 47092344 54465341 63024621
55957F3024621R737559J0863537J1921070J2924900J3889473J4835798J5846516
$$ 63024621 72762180 83625717 95546787 108471687 122361160 137196958 153043474
55950A53043474J7065823J8629128K0655467K3269181K6341174K8921866K9061583
$$ 153043474 170109297 188738425 209393892 232663073 259004247 287926113 316987696
55943C16987696K4736881J5439816K949678r597252j9532917k5799488k8767082
$$ 316987696 341724577 357164393 360114071 350516819 330983902 305184414 276417332
55936B76417332k9386263k8549456k6883910k4758546k2360839j9815127j7262568
$$ 276417332 247031069 218481613 191597703 166839157 144478318 124663191 107400623
55929A07400623j4840071j2628513j0659570q951685p509414o307421n307289
$$ 107400623 92560552 79932039 69272469 60320784 52811370 46503949 41196660
55922D1196660m483309l815118l270542k816974k439463k130850j874778j653783
$$ 41196660 36713351 32898233 29627691 26810717 24371254 22240404 20365626 18711843
55914A8711843j463850j305894j171653j051209r45544q58556p84460p14971o51557
$$ 18711843 17247993 15942099 14770446 13719237 12773693 11915137 11130677 10415706 9764149
55905I764149n99131n54340n10801m69638m34812m03785l72265l42670l19021
$$ 9764149 9165018 8610678 8099877 7630239 7195427 6791642 6419377 6076707 5757686
55896E757686k98650k77119k56344k39915k25506k09540j94457j83923j75347
$$ 5757686 5459036 5181917 4925573 4685658 4460152 4250612 4056155 3872232 3696885
55887C696885j64288j52019j41942j32839j22172j11967j05026r9168r1282q3184
$$ 3696885 3532597 3380578 3238636 3105797 2983625 2871658 2766632 2667464 2576182 2492998
55877B492998p7671p2671o5183n7318n2816n1070m9854n0202n3363n6571n7107
$$ 2492998 2415327 2342656 2277473 2220155 2167339 2116269 2066415 2016213 1962850 1906279 1849172
55866A849172n6955n8368n8690n4939m9737m7168m6133m3423m0019l8661l8098
$$ 1849172 1792217 1733849 1675159 1620220 1570483 1523315 1477182 1433759 1393740 1355079 1316981
55855A316981l5490l1972l0328k9480k6624k2752k0865k0694k0051j9505k0795
$$ 1316981 1281491 1249519 1219191 1189711 1163087 1140335 1119470 1098776 1078725 1059220 1038425
55844A038425k2461k1798j9680j8852j9079j8239j6702j6304j6454j5438j4055
$$ 1038425 1015964 994166 974486 955634 936555 918316 901614 885310 868856 853418 839363
55833H39363j4035j4341j3018j1172j1115j2044j1556j0038r571r823q914p287
$$ 839363 825328 810987 797969 786797 775682 763638 752082 742044 732473 722650 713736 706449
55821G06449o870p490p684p956r579j1287j0832q880p865p843o948n073l752l086
$$ 706449 699579 692089 684405 676449 666870 655583 644751 635871 628006 620163 613215 608142 604390 601304
55807F01304j943m78M65J522L530N183M968M201N098O984P540O618N652M397J644
$$ 601304 599361 598883 599348 600870 604400 609583 614551 618752 623850 630834 638374 644992 650644 655041 656685
55792F56685j812m168n826q404j1392j2891j2946j3049j3099j1937j0125r078
$$ 656685 654873 650705 644879 636475 625083 612192 599246 586197 573098 561161 551036 541958
55780E41958q223o169l966l935n782p089p179p248p240n853l507k038j513l29
$$ 541958 533735 527566 523600 519665 513883 506794 499615 492367 485127 479274 475767 473729 472216 471887
55766D71887J560K443J796O10j054l966p230q783q476q138q528q854r085j0006
$$ 471887 473447 475890 477686 478296 477242 473276 466046 457263 448787 440649 432121 423267 414182 404176
55752D04176j1025j0698r427q962r204q327o222m883n049n254m689m328m543m146
$$ 404176 393151 382453 373026 364064 354860 346533 340311 335428 330379 325125 320436 316108 311565 307419
55738C07419k617j076l79j73l48j332k505k362q03N36O75J58o03j929l482m212
$$ 307419 304802 303726 303347 303174 302826 301494 298989 296627 295824 296360 297035 297193 296590 294661 291179 286967
55722B86967m062l994m097l555k568k305k749k620j730j268j383o39J477L470
$$ 286967 282905 278911 274814 271259 268691 266386 263637 261017 259287 258019 256636 255997 257474 260944
55708B60944M036L600L030K371J582J015O07j82j258j942k283k928l671l661l127
$$ 260944 264980 268580 271610 273981 275563 276578 277185 277003 275745 273803 271520 268592 264921 261260 258133
55693B58133l170l768l687k610j633j376j233q21n46l92K35J150J443J226J735
$$ 258133 254963 251195 247508 244898 243265 241889 240656 239835 239289 238897 239132 240282 241725 242951 244686
55678B44686L352M970N613N311M253K563J016M38L01n24j661j673m93M53O22Q07
$$ 244686 248038 253008 258621 263932 268185 270748 271764 272202 272503 271979 270318 268645 268152 268605 269227 270034
55662B70034J057L82j053j619p36L33Q48J665L149M077L716L146L415L880L522
$$ 270034 271091 271473 270420 268801 268065 268398 269246 270911 274060 278137 281853 284999 288414 292294 295816
55647B95816K422R96r10l187m981n897o500p040p047o656o770p241o635m676l138
$$ 295816 298238 299234 298324 295137 290156 284259 277759 270719 263672 257016 250246 243005 236370 231694 228556
55632B28556l252l927l711l022k924l146k805k102j791j771j460q79l48K10P91
$$ 228556 225304 221377 217666 214644 211720 208574 205769 203667 201876 200105 198645 197766 197418 197628 198419
55617A98419Q54K59k25j27o7n96j190j334j484j977k020r46L79O03k95j309j890
$$ 198419 199273 199532 199307 199180 199113 198517 197327 195993 194509 192532 190512 189566 189945 190548 190253 188944 187054
55600A87054k053j723j006o18j016j601j625j403j629k083k077j686j546j648
$$ 187054 185001 183278 182272 181654 180638 179037 177412 176009 174380 172297 170220 168534 166988 165340
55586A65340j410p57k22l6J03M16P94J162J586K086K601L010L039K515J943K246
$$ 165340 163930 163173 162951 162915 163018 163434 164228 165390 166976 169062 171663 174673 177712 180227 182170 184416
55570A84416L567M896N351N270N428N716N302L930K362J537J629J931J492L6j708
$$ 184416 187983 192879 198230 203500 208928 214644 219946 223876 226238 227775 229404 231335 232827 232863 231155
55555B31155k796l167l500m121m592m551m255m085m015l827l413k733j957j554
$$ 231155 228359 225192 221692 217571 212979 208428 204173 200088 196073 192246 188833 186100 184143 182589
55541A82589j730j860j187r8K27m69j092p75K2M36L52J33j60o47j194j494j358
$$ 182589 180859 178999 177812 177714 177941 177472 176380 175605 175627 176063 176415 176548 176388 175741 174547 173053 171695
55524A71695p39J44O97M95j41o25r85j536k010j943j726k069k521j934n01J94
$$ 171695 170956 171100 171797 172292 172151 171526 170541 169005 166995 165052 163326 161257 158736 156802 156301 156495
55508A56495m77j277j143p12r54j606j926j927j912j669j077o60o81n44J35O75
$$ 156495 156018 154741 153598 152886 151932 150326 148400 146473 144561 142892 141815 141155 140474 139930 140065 140740
55492A40740M97K10N37R50N57l28p14n39n46q46q18l05J52K49K32K02p3n42p12
$$ 140740 141237 141447 141984 142934 143491 143163 142449 141910 141364 140518 139700 139395 139547 139796 140028 140230 140157 139615 138903
55473A38903l00M19R47R98N75p9o04p73o22l01K1J31Nn6J83M06K04j31LM51M84
$$ 138903 138603 139022 139969 140967 141542 141463 140859 140086 139464 139163 139184 139315 139320 139264 139447 139853 140057 139926 139929 140380 140864
55452A40864M5j89q0k85q81r49j46M31j53j147j172j50P13N60l33j131j182m53
$$ 140864 140909 140720 140640 140355 139474 138525 138379 138810 138657 137510 136338 136188 136901 137461 137128 135997 134815 134362
55434A34362M05P10O62J027J769J905J061K10K21N78L54l23o72m87j24K87P45
$$ 134362 134767 135477 136139 137166 138935 140840 141901 142111 142332 142910 143264 142941 142269 141782 141658 141945 142690
55417A42690R82Q96R83J608K324K501K265K090J955J615J210Q90K86q84k050k437
$$ 142690 143672 144568 145551 147159 149483 151984 154249 156339 158294 159909 161119 162009 162295 161411 159361 156924
55401A56924k123j759j580j401j309j566k027k286k282k121j612n42P00J401J297
$$ 156924 154801 153042 151462 150061 148752 147186 145159 142873 140591 138470 136858 136316 137016 138417 139714
55386A39714O84j00q58j384j491j148m78J95L80p2m96j21P52J087O61L03L80L01
$$ 139714 140398 140298 139440 138056 136565 135417 134939 135134 135514 135442 134946 134825 135577 136664 137325 137628 138008 138309
55368A38309r0J17J328K429K272J205J73p28j724k264j805r35n80n48j09N94Q89
$$ 138309 138219 138336 139664 142093 144365 145570 145743 145015 143291 141027 139222 138287 137707 137159 137050 137644 138533
55351A38533Q48R70R76K06r31j250m96L23L86q4m48l77R7O12O51J57k68k30j42
$$ 138533 139381 140351 141327 141533 140602 139352 138856 139179 139565 139481 139033 138656 138753 139365 140016 140173 139905 139675 139533
55332A39533l47l89Q7M26r0r53j235j053j061j018k40Q91J273Q30M87N52M78J79
$$ 139533 139186 138797 138884 139310 139220 138267 137032 135979 134918 133900 133660 134551 135824 136654 137141 137693 138171 138350
55314A38350J77L35j75j314j931j410m84J5J69K78J45m01j038j431j574j434q70
$$ 138350 138527 138862 138687 137373 135442 134032 133548 133563 133732 134010 134155 133754 132716 131285 129711 128277 127407
55297A27407q7M72P86J144J368J028M03K95P50R56O54N25R08J146P15N9l49p68
$$ 127407 127320 127792 128578 129722 131090 132118 132521 132816 133566 134522 135176 135701 136609 137755 138470 138529 138180 137412
55279A37412j370j470m81Q80J332O17l84r47j211j577k011k104j550l87J068K388
$$ 137412 136042 134572 134091 134971 136303 136920 136536 135589 134378 132801 130790 128686 127136 126749 127817 130205
55263A30205L193L255K637J769J202J118J207J087O84J32l19k51N61J541J648
$$ 130205 133398 136653 139290 141059 142261 143379 144586 145673 146357 146489 146170 145919 146480 148021 149669
55248A49669P12k60n21n43r50j280p88J06L51j76p07r17j113j294j103o37l05
$$ 149669 150381 150121 149600 149057 148107 146827 146039 146145 146496 146320 145613 144696 143583 142289 141186 140549 140244
55231A40244j0N13Q15L02m31k03Q25J278P23K72O05Q99M51rM01J107R13k28j214
$$ 140244 140234 140747 141562 141864 141433 141230 142055 143333 144056 144328 144933 145832 146283 146274 146675 147782 148695 148467 147253
55212A47253j235m93L22O37M04J52L96Q62Q01J65k37K7M33N18O21J025J181N33
$$ 147253 146018 145525 145847 146484 146888 147040 147436 148298 149099 149264 149027 149054 149487 150005 150626 151651 152832 153365
55194A53365m94j082j199j367j591j296k83Q45J338R72J25n94p95o33n79q47j174
$$ 153365 152871 151789 150590 149223 147632 146336 146053 146898 148236 149208 149333 148739 147944 147311 146732 145885 144711
55177A44711j234j010o31j28M79J052J437J561J445J242J156J206J188J054J002
$$ 144711 143477 142467 141836 141708 142187 143239 144676 146237 147682 148924 150080 151286 152474 153528 154530
55162A54530R64M56n87j365j201n40j64M2N92J060N78m98q57k70%p35j458r98
$$ 154530 155494 155950 155363 153998 152797 152257 152093 152135 152727 153787 154365 153867 153010 152740 152740 152005 150547 149549
55144A49549L57J504J939J789J192L41l95r34j468j770j249o3P48P07N56Q78J097
$$ 149549 149906 151410 153349 155138 156330 156671 156276 155342 153874 152104 150855 150792 151540 152247 152803 153681 154778
55127A54778O06o3j52N7q2l11j9M22J06q99j612j625j456j340p56N40J810K212
$$ 154778 155384 155321 155169 155226 155144 154833 154814 155236 155342 154443 152831 151206 149750 148410 147654 148194 150004 152216
55109A52216J895J775K291K831K524J429N53N69R16O86K3k48r8l47j050j132j13
$$ 152216 154111 155886 158177 161008 163532 164961 165514 166083 166999 167685 167708 167460 167362 167015 165965 164833 164720
55092A64720R15Q59K18J03M56L85j44k05O21J636J972J502P44L63N96R04M67o35
$$ 164720 165635 166494 166712 166815 167271 167656 167512 167307 167928 169564 171536 173038 173782 174145 174741 175645 176112 175477
55074A75477j256p26J24J57m40p11n00l82l75m7K90k36j490k215j854j287j294
$$ 175477 174221 173495 173619 173776 173336 172625 172125 171743 171368 171321 171611 171375 169885 167670 165816 164529 163235
55057A63235j372p60K32P89Q85J034J171P52j37o24k63K89J40o31j098p04L3J96
$$ 163235 161863 161103 161335 162124 163009 164043 165214 165966 165829 165205 164942 165231 165371 164740 163642 162938 162971 163167
55039A63167l59p96l13R18J999K275J815J005J04o71r59n86L4J80l42r26r00l59
$$ 163167 162808 162012 161699 162617 164616 166891 168706 169711 169815 169144 168185 167599 167633 167813 167471 166545 165645 165286
55021A65286R2K26L21M25J20o25j042n25L63O30K41QJ88J54l91p64l11O08J159
$$ 165286 165378 165604 165925 166350 166470 165845 164803 164278 164641 165271 165512 165520 165708 165862 165471 164707 164396 165004 166163
55002A66163J076O81K29k35n60n03o0M28N91L81J57L15P38Q62N09L02P61J359
$$ 166163 167239 167920 168149 167914 167354 166851 166791 167219 167810 168191 168348 168663 169401 170263 170772 171074 171835 173194
54984A73194J228N31K04M55N29P4k92j56k4m00r68j199j006m22N25J247Q35n22
$$ 173194 174422 174953 175157 175612 176141 176215 175923 175767 175743 175343 174375 173176 172170 171748 172273 173520 174355 173833
54966A73833j362q34J43M06K21M70J025J143Q38O35N09J77N7O44J379J331P79
$$ 173833 172471 171637 171780 172186 172407 172877 173902 175045 175883 176518 177027 177204 177261 177905 179284 180615 181394
54949A81394P72J290J195J76o50m17L28O20K92k89q95j358j344p54J00R65J849
$$ 181394 182166 183456 184651 184827 184177 183760 184088 184708 185000 184711 183816 182458 181114 180360 180460 181425 183274
54932A83274K577K724K271J856K098K912L727M050L745L116K838L433M701N905
$$ 183274 185851 188575 190846 192702 194800 197712 201439 205489 209234 212350 215188 218621 223322 229227
54918B29227O533O570O135N283M203L129J964L75j612l515m904n729o153o305
$$ 229227 235760 242330 248465 253748 257951 261080 263044 263419 261807 258292 253388 247659 241506 235201
54904B35201o233n864n128m348m186m751n101m293k769j897k179k607j996l53
$$ 235201 228968 223104 217976 213628 209442 204691 199590 195297 192528 190631 188452 185845 183849 183496
54890A83496J365K322K394K075K023K513L202L626L802M087M510M733M618M426
$$ 183496 184861 187183 189577 191652 193675 196188 199390 203016 206818 210905 215415 220148 224766 229192
54876B29192M445M778N385N948N779M466K525R39Nq63k162l704n029n896o166
$$ 229192 233637 238415 243800 249748 255527 259993 262518 263457 263462 262599 260437 256733 251704 245808 239642
54861B39642n769m957m290m111m268m370m120l485k792k499k636k641k185j723
$$ 239642 233873 228916 224626 220515 216247 211877 207757 204272 201480 198981 196345 193704 191519 189796
54847A89796j756j927j589r98r97j607j966j674j265j144r97o12m10o27p27j93
$$ 189796 188040 186113 184524 183526 182529 180922 178956 177282 176017 174873 173876 173264 172854 172227 171500 171307
54831A71307O60J188J195P96%r88j524j125j06Q30J359J580J608J495J355J177
$$ 171307 171967 173155 174350 175146 175146 174158 172634 171509 171403 172233 173592 175172 176780 178275 179630 180807
54815A80807P66J29l29k89J8J21q5l14l20q7K12L66K39q1m15p20r54q45k00N94
$$ 180807 181573 181702 181373 181084 181102 181223 181138 180824 180504 180417 180629 180995 181234 181153 180738 180018 179064 178219 178019 178613
54795A78613Q94O79N86Q97J112P73J39l02n16o29l94M44J454J767J086R8k26M32
$$ 178613 179507 180186 180772 181669 182781 183554 183693 183391 182875 182246 181852 182296 183750 185517 186603 186701 186475 186907
54777A86907J482K088K096K250L214M570N181M596L624L382M200N654P163Q189
$$ 186907 188389 190477 192573 194823 198037 202607 207788 212384 216008 219390 223590 229244 236407 244596
54763B44596Q300P507O355N374M564L677K666J585K07j763m192o445p896q353
$$ 244596 252896 260403 266758 272132 276696 280373 283039 284624 284831 283068 278876 272431 264535 256182
54749B56182q036p292o324n181m035l279l132l259l129k733k495k467k071q75
$$ 256182 248146 240854 234530 229349 225314 222035 218903 215644 212515 209782 207287 204820 202749 201874
54735B01874P15J858K146J920J778J937K093J874J483J571K388L344L829M094
$$ 201874 202589 204447 206593 208513 210291 212228 214321 216195 217678 219249 221637 224981 228810 232904
54721B32904M743N603N845N159M026K791J296l83j657k228k554l195m208n390
$$ 232904 237647 243250 249095 254254 258280 261071 262367 261984 260327 258099 255545 252350 248142 242752
54707B42752o477o881o048m404l200k977k913k282j628j711k072j743r38p99j588
$$ 242752 236275 229394 223346 218942 215742 212765 209852 207570 205942 204231 202159 200416 199478 198679 197091
54692A97091k186j711p19l71q87j356r51O7O70K66o04r96o90k04J56N66R49Q01
$$ 197091 194905 193194 192475 192104 191217 189861 188910 188977 189647 189913 189309 188313 187623 187419 187575 188141 189090 189891
54674A89891J25k42J73N96N1j220k115k058j317k64P98J306Q34j60p41p07o93
$$ 189891 190016 189774 189947 190543 190594 189374 187259 185201 183884 183620 184418 185724 186558 186398 185657 184950 184257
54657A84257j001j121o19J92Q07J198J565J794J667J280R24O12J26m98q15m67
$$ 184257 183256 182135 181516 181708 182515 183713 185278 187072 188739 190019 190943 191555 191681 191183 190368 189901
54641A89901K83P51O03K53K82O00N66n5p42r62q24p23o98n67l45j31J44M43L62
$$ 189901 190184 190935 191538 191791 192073 192673 193239 193184 192442 191480 190656 189933 189235 188668 188323 188192 188336 188779 189141
54622A89141l63j253j536j096n36l12l26l59l86l82j18N38J388K036K153J633
$$ 189141 188778 187525 185989 184893 184357 184045 183719 183360 182974 182592 182474 183012 184400 186436 188589 190222
54606A90222O48l82j023j088o53J9N85P95P16O09N38L28n9m38p56j081j143n18
$$ 190222 190870 190488 189465 188377 187724 187743 188328 189123 189839 190448 190986 191314 191255 190817 190061 188980 187837 187319
54588A87319N15R32L15m28l05L28M20j06l92j32N6j53k17K58P76P04K20n9j2n9
$$ 187319 187834 188766 189081 188653 188348 188676 189096 188990 188598 188466 188522 188369 188152 188410 189186 189890 190110 190051 190039 189980
54568A89980l89o23l18M05Q73N74k18o38j96O66J112P82l9q12j029m54M82Q33
$$ 189980 189591 188968 188650 189055 189928 190502 190284 189646 189450 190116 191228 192010 191971 191159 190130 189676 190158 190991
54550A90991J65q02j109p89n67n89k89N37J317J518J119K20j005j847j415J39
$$ 190991 191156 190354 189245 188456 187889 187300 187011 187548 188865 190383 191502 191722 190717 188870 187455 187594
54534A87594J511J802J498J405J380Q68J03j55K04N13L53l9l52n63o23m14r2R
$$ 187594 189105 190907 192405 193810 195190 196058 196161 196006 196210 196723 197076 197037 196685 196122 195499 195085 194993 195002
54516A95002M2O19J791K592K113P86q7J4K24l72j394j695r53p0M5m82r23q93n53
$$ 195002 195044 195663 197454 200046 202159 202945 202858 202872 203096 202724 201330 199635 198682 198612 198657 198175 197252 196359 195806
54497A95806j63M9j33o30q85m41M02R27R20Q09Q64Q95P79P60R93J160Q95K97k48
$$ 195806 195643 195692 195559 194929 194044 193603 194005 194932 195852 196661 197525 198420 199199 199959 200952 202112 203007 203304 203056
54478B03056n53p01q16r31r32o16L2O03O52L51L70Q82J203P31j28m99k06J04m7
$$ 203056 202503 201802 200986 200055 199123 198507 198539 199142 199794 200145 200515 201397 202600 203331 203203 202704 202498 202602 202555
54459B02555m36o26n16k21K41Q40J302J251N76m52j360j754j505q06n6M11M88
$$ 202555 202119 201493 200977 200756 200997 201837 203139 204390 204966 204514 203154 201400 199895 199089 199033 199444 199932
54442A99932K70n4k09M9O64J208J280J019R65J267J294L42j304k392j964m13R25
$$ 199932 200202 200148 199939 199988 200652 201860 203140 204159 205124 206391 207685 208027 206723 204331 202367 201954 202879
54425B02879J191P64M94N43K92m97j024m54O80R21j17j038n41P37J184N00q9J35
$$ 202879 204070 204834 205328 205871 206163 205666 204642 204188 204868 205789 205672 204634 204093 204830 206014 206514 206425 206560
54407B06560M50R6n05n74j65K06M35N98M63%j30N60J409J350M29l00k03M16J059
$$ 206560 207010 207106 206601 206027 205862 206068 206503 207101 207564 207564 207434 207994 209403 210753 211182 210882 210679 211095 212154
54388B12154J455J310N67j15J1O26O69j5m08N3N89M29N6K80P38L65r45k036j951
$$ 212154 213609 214919 215486 215371 215382 216008 216677 216662 216254 216307 216896 217325 217381 217661 218399 218764 217819 215783 213832
54369B13832r71l9L80N50Q98J442J859J886J555J034M34k1L8O94J373J379P58
$$ 213832 212861 212822 213202 213752 214650 216092 217951 219837 221392 222426 222860 222839 222877 223571 224944 226323 227081
54352B27081J93K5p7l86n71l00J17O6n53j199j292p90j98j21o51j164r93k94J52
$$ 227081 227274 227299 227222 226836 226265 225965 226082 226148 225595 224396 223104 222314 222116 221995 221344 220180 219187 218893 219045
54333B19045j9l43l31j70l02o81q67o88l47n8J31K08J67O4l6r8l0K72O92R10Q03
$$ 219045 219026 218683 218352 218182 217880 217199 216332 215644 215297 215239 215370 215578 215745 215809 215773 215675 215645 215917 216609 217519 218322
54312B18322O44O52O05Q3q98j750j793q43O32J891K510K556K200J462N69K04P85
$$ 218322 218966 219618 220223 220306 219408 217658 215865 215022 215654 217545 220055 222611 224811 226273 226842 227046 227831
54295B27831J665J717Q01J0K23J125J978K675L448M052L997L445L108L311L654
$$ 227831 229496 231213 232014 232024 232247 233372 235350 238025 241473 245525 249522 252967 256075 259386 263040
54280B63040L629L208K696K315J976J338J26j412k605l096l269l679m174m065
$$ 263040 266669 269877 272573 274888 276864 278202 278328 276916 274311 271215 267946 264267 260093 256028
54266B56028l155k143j829k169k417k088j515j358j658j731j107k44P9j88l98
$$ 256028 252873 250730 248901 246732 244315 242227 240712 239354 237696 235965 234858 234614 234693 234505 234107
54251B34107l24n28j417k450k769k272j565j075o56m8O64J136J124O91J78q0q
$$ 234107 233783 233255 231838 229388 226619 224347 222782 221707 221051 221003 221667 222803 223927 224618 224796 224716 224708
54234B24708K83P39J257J446R16j36j004j285j146p38O6J041J436R45L46N10J175
$$ 224708 224991 225730 226987 228433 229349 229213 228209 226924 225778 225040 225106 226147 227583 228528 228874 229384 230559
54217B30559J366P62p2o20q76q99o62m19o39j310j764j371k04J065J668J224N9
$$ 230559 231925 232687 232615 231995 231119 230220 229558 229139 228500 227190 225426 224055 223851 224916 226584 227808 227867
54200B27867r43j194r84r44j076q19J0R07J360J321R22L16j24J6N62Q40O06L60
$$ 227867 226924 225730 224746 223802 222726 221907 221917 222824 224184 225505 226427 226743 226619 226635 227197 228037 228643 229003
54182B29003M02K41n73j512j656q99M1O42Q95P09j74j417k051j607q34o57q65
$$ 229003 229405 229646 229073 227561 225905 225006 225047 225689 226584 227293 227119 225702 223651 222044 221210 220553 219688
54165B19688n32L98Q83L46l56j23P51R85J41q03q77k65K39L89N07P59R80J094
$$ 219688 219156 219554 220437 220783 220427 220304 221055 222040 222181 221378 220501 220236 220475 220864 221371 222130 223110 224204
54147B24204J146R96M44l13o93l55M56J187J433J129N49J25Q0K24L06M10P21J061
$$ 224204 225350 226346 226790 226477 225784 225429 225885 227072 228505 229634 230183 230308 230388 230612 230918 231328 232049 233110
54129B33110J074Q90J046J626J924J376M84K84J011J731J441K20q85r35O7J339
$$ 233110 234184 235074 236120 237746 239670 241046 241530 241814 242825 244556 245997 246217 245332 244397 244464 245803
54113B45803K057J943J268M82j34n22p13p16n70m31m32n13m88l18j68j02N1L74
$$ 245803 247860 249803 251071 251553 251419 250897 250184 249468 248898 248467 248035 247522 247034 246716 246548 246446 246497 246871
54095B46871O02M10j46p45j247j671j850j529q54l39k57l74m22l83k56Q2N36P47
$$ 246871 247473 247883 247737 246992 245745 244074 242224 240695 239841 239502 239245 238871 238449 238066 237810 237892 238428 239175
54077B39175O60P05J097J361J060N47M84P93P61J57l95k59M07R66J037P53M62
$$ 239175 239835 240540 241637 242998 244058 244605 245089 245882 246643 246800 246405 246146 246553 247519 248556 249309 249771
54060B49771L95N07N91N29M22L96M31M53M74N19N47O46J046J779K457K706K712
$$ 249771 250166 250673 251264 251793 252215 252611 253042 253495 253969 254488 255035 255681 256727 258506 260963 263669 266381
54043B66381L000L700M393M682M680M817N317N969O296N976N170M441M343N106
$$ 266381 269381 273081 277474 282156 286836 291653 296970 302939 309235 315211 320381 324822 329165 334271
54029C34271O533Q038Q846Q535P457O375N620M967M305L863L575K922J756P34
$$ 334271 340804 348842 357688 366223 373680 380055 385675 390642 394947 398810 402385 405307 407063 407797
54015D07797L60J47o55j902k844l303l740m367m925n348n837o277o256n791n405
$$ 407797 408157 408304 407649 405747 402903 399600 395860 391493 386568 381220 375383 369106 362850 357059 351654
54000C51654n308n147m707m327m296m307l866k948j992j454j474j803j997j840
$$ 351654 346346 341199 336492 332165 327869 323562 319696 316748 314756 313302 311828 310025 308028 306188
53986C06188j583j509j508j362j232j377j608j548j357j450j677j492r59p51j001
$$ 306188 304605 303096 301588 300226 298994 297617 296009 294461 293104 291654 289977 288485 287526 286775 285774
53971B85774j001l85L22P00J139J888K210J340j49r21n88l5lj59K58J388K725
$$ 285774 284773 284388 284710 285410 286549 288437 290647 291987 291838 290917 290329 290294 290291 290132 290390 291778 294503
53954B94503L856M879O032P089P387O672N736N829P328R414J1131J2338J3408
$$ 294503 298359 303238 309270 316359 323746 330418 336154 341983 349311 358725 369856 382194 395602
53941C95602J4469J5413J6340J7508J8913K0429K2274K4918K8226L0863L0794
$$ 395602 410071 425484 441824 459332 478245 498674 520948 545866 574092 604955 635749
53930F35749K6592J8503Q270j987j0695j6815j9735j9780j8452j7287j6322j4429
$$ 635749 662341 680844 689114 687127 676432 659617 639882 620102 601650 584363 568041 553612
53918E53612j1253p982n850m715l624k156n34J062K520L496L816L935M376M914
$$ 553612 542359 534377 528527 523812 520188 518032 517498 518560 521080 524576 528392 532327 536703 541617
53904E41617M971M579M207L756K543M56j677l052l748m285m852n302n628o072
$$ 541617 546588 551167 555374 559130 561673 562129 560452 557400 553652 549367 544515 539213 533585 527513
53890E27513o809p712q376q452q105q024q700r721j0131r553q594q069q150q348
$$ 527513 520704 512992 504616 496164 488059 480035 471335 461614 451483 441930 433336 425267 417117 408769
53876D08769q050p008n553m479m373m934n220m767m106l883l944l713l246l190
$$ 408769 400719 393711 388158 383679 379306 374372 369152 364385 360279 356396 352452 348739 345493 342303
53862C42303l732m185l948l316k895k620k064j488j758k892l517k391j16J402
$$ 342303 338571 334386 330438 327122 324227 321607 319543 318055 316297 313405 309888 307497 307381 308783
53848C08783J130j38r99j027q33r52j257j338j130r54r67q17j00Q60J155L97p01
$$ 308783 309913 309775 308776 307749 306916 305964 304707 303369 302239 301285 300318 299501 299401 300261 301416 301813 301112
53831C01112j288j471j798k018j319J82J225J033K69o6P5J87K49N31Q33P19L56
$$ 301112 299824 298353 296555 294537 293218 293400 294625 295658 295927 295861 295936 296123 296372 296903 297736 298455 298811
53814B98811L70R55J699K280K793L347L752L724L188K439K092K676L967N087N502
$$ 298811 299181 300136 301835 304115 306908 310255 314007 317731 320919 323358 325450 328126 332093 337180 342682
53799C42682N627O068O667O863O603O299O061N698N307N179N162M695L657K559
$$ 342682 348309 354377 361044 367907 374510 380809 386870 392568 397875 403054 408216 412911 416568 419127
53785D19127J874J602J540J460J036J20r03j519j848k418l191l556l434l571m405
$$ 419127 421001 422603 424143 425603 426639 426759 425856 424337 422489 420071 416880 413324 409890 406319 401914
53770D01914n296n386m726m006l552l096k311j134K99J750K957L861M665N534
$$ 401914 396618 391232 386506 382500 378948 375852 373541 372407 372706 374456 377413 381274 385939 391473
53756C91473O453P417Q495R670J0865J2220J3946J5873J7661J9648K2706K6618
$$ 391473 397926 405343 413838 423508 434373 446593 460539 476412 494073 513721 536427 563045
53744E63045K9079K7063J9310P334n730j6839k4184k7555k8043k7111k5696k4032
$$ 563045 592124 619187 638497 645831 640101 623262 599078 571523 543480 516369 490673 466641
53732D66641k1986j9381j6295j3317j1169r875q661p102n825n477n464m603k814
$$ 466641 444655 425274 408979 395662 384493 374618 365957 358855 353030 347553 342089 337486 334672
53719C34672j183l92oM67Q58J013J285J754J779J085N80J168K279K575J881J316
$$ 334672 333489 333097 333091 333558 334416 335429 336714 338468 340247 341332 341912 343080 345359 347934 349815 351131
53703C51131J554K071K276K382K708K966K823K505K283J894J265J190K421M277
$$ 351131 352685 354756 357032 359414 362122 365088 367911 370416 372699 374593 375858 377048 379469 383746
53689C83746N130M322K855J962J762J602J195Q59R69J499K048K081J394M36n4
$$ 383746 388876 393198 396053 398015 399777 401379 402574 403433 404402 405901 407949 410030 411424 411860 411806
53674D11806J03L69K37k27p53j260j496p55J362M059N845O054N418N035N168N295
$$ 411806 411909 412278 412515 412288 411535 410275 408779 408024 409386 413445 419290 425344 430762 435797 440965 446260
53658D46260N007M418L789L027J737k00k274l758m515n120o082p090p369o696
$$ 446260 451267 455685 459474 462501 464238 464038 461764 458006 453491 448371 442289 435199 427830 421134
53644D21134n701n144n118n127m698l792k736j896j400j046n21K53R56J132O97
$$ 421134 415433 410289 405171 400044 395346 391554 388818 386922 385522 384476 383955 384208 385164 386296 386993
53629C86993J46J69R45J912K357K151J749J591J797K351L203M021M306L945L398
$$ 386993 387139 387308 388253 390165 392522 394673 396422 398013 399810 402161 405364 409385 413691 417636 421034
53614D21034L116L056K992K972L122L326L509L960M845N612N499M554L585L042
$$ 421034 424150 427206 430198 433170 436292 439618 443127 447087 451932 457544 463043 467597 471182 474224
53600D74224K653K231K094K369K493K003J384J418J899J774O49n41p59k27m4p07
$$ 474224 476877 479108 481202 483571 486064 488067 489451 490869 492768 494542 495191 494650 493891 493664 493620 492913
53584D92913j567j839j566j301j272j285j261j367j644j925k111k244k293k238
$$ 492913 491346 489507 487941 486640 485368 484083 482822 481455 479811 477886 475775 473531 471238 469000
53570D69000k332k795l245l014k204j757k111k483k025j116p35r68j030o28l31
$$ 469000 466668 463873 460628 457614 455410 453653 451542 449059 447034 445918 445183 444215 443185 442557 442226
53555D42226m97o88m35J3J21j44k92J34J165K344L015K916K548K627L217L714
$$ 442226 441729 441041 440606 440619 440740 440596 440304 440438 441603 443947 446962 449878 452426 455053 458270 461984
53539D61984L696L385L253L586M507N951P465Q457Q776Q757Q627Q345Q108Q438
$$ 461984 465680 469065 472318 475904 480411 486362 493827 502284 511060 519817 528444 536789 544897 553335
53525E53335R534J0968J2276J3422J4431J5116J5480J5875J6434J6764J6724J6923
$$ 553335 562869 573837 586113 599535 613966 629082 644562 660437 676871 693635 710359 727282
53513G27282J7926J9292K0169K0520K1096K2258K3587K4655K5557K6473K7210
$$ 727282 745208 764500 784669 805189 826285 848543 872130 896785 922342 948815 976025
53502I76025K7493K7341K6925K6333K5709K5328K5319K5389K5100K4360K3568
$$ 976025 1003518 1030859 1057784 1084117 1109826 1135154 1160473 1185862 1210962 1235322 1258890
53491A258890K3229K3525K4201K4832K5189K5359K5533K5770K5976K6043K5952
$$ 1258890 1282119 1305644 1329845 1354677 1379866 1405225 1430758 1456528 1482504 1508547 1534499
53480A534499K5740K5380K4630K3113K0661J7604J4468J1372P922L897k12l544
$$ 1534499 1560239 1585619 1610249 1633362 1654023 1671627 1686095 1697467 1705389 1709286 1709074 1705530
53468A705530n670o884p854r125j0930j3219j5716j7993j9570k0179k0032j9758
$$ 1705530 1699860 1692976 1685122 1675997 1665067 1651848 1636132 1618139 1598569 1578390 1558358 1538600
53456A538600j9822k0031j9864j9299j8977j9447k0515k1605k2485k3409k4506
$$ 1538600 1518778 1498747 1478883 1459584 1440607 1421160 1400645 1379040 1356555 1333146 1308640
53445A308640k5282k4865k2872k0068j7956j7335j7431j6814j5125j3268j1890
$$ 1308640 1283358 1258493 1235621 1215553 1197597 1180262 1162831 1146017 1130892 1117624 1105734
53434A105734j0475q349n827l759k358j261l41L73J371L325N896P816Q487Q830
$$ 1105734 1095259 1086910 1081083 1077324 1074966 1073705 1073364 1073737 1075108 1078433 1084329 1092145 1100632 1109462
53420A109462J0078J2267J4479J6173J7623J9195K0901K2730K4866K7275K9480
$$ 1109462 1119540 1131807 1146286 1162459 1180082 1199277 1220178 1242908 1267774 1295049 1324529
53409A324529L1038L2102L3234L4752L6572L8486M0361M2027M3350M4534M6001
$$ 1324529 1355567 1387669 1420903 1455655 1492227 1530713 1571074 1613101 1656451 1700985 1746986
53398A746986M7827M9558N0895N2259N4253N6743N8884O0081O0507O0668O0839
$$ 1746986 1794813 1844371 1895266 1947525 2001778 2058521 2117405 2177486 2237993 2298661 2359500
53387B359500O1000O0932O0310N8921N6932N4663N2109M9142M6084M3513M1300
$$ 2359500 2420500 2481432 2541742 2600663 2657595 2712258 2764367 2813509 2859593 2903106 2944406
53376B944406L8469L4324K9260K4030J8792J3376P993K982j793o622j1254j5303
$$ 2944406 2982875 3017199 3046459 3070489 3089281 3102657 3110650 3113632 3111839 3105217 3093963 3078660
53364C078660j9251k4211l0484l7034m2672m7191n1086n4636n7713o0080o1515
$$ 3078660 3059409 3035198 3004714 2967680 2925008 2877817 2826731 2772095 2714382 2654302 2592787
53353B592787o1816o1072n9794n8480n7155n5584n3855n2416n1513n0843m9932
$$ 2592787 2530971 2469899 2410105 2351625 2294470 2238886 2185031 2132615 2081102 2030259 1980327
53342A980327m8689m7443m6436m5519m4382m2929m1239l9283l7001l4693l2968
$$ 1980327 1931638 1884195 1837759 1792240 1747858 1704929 1663690 1624407 1587406 1552713 1519745
53331A519745l2027l1211k9544k6751k3480k0637j8602j7127j5852j4807j4394
$$ 1519745 1487718 1456507 1426963 1400212 1376732 1356095 1337493 1320366 1304514 1289707 1275313
53320A275313j4727j5199j4883j3492j1594r844q348o951n703m652l476j770L98
$$ 1275313 1260586 1245387 1230504 1217012 1205418 1195574 1187226 1180275 1174572 1169920 1166444 1164674 1165072
53307A165072K624M643O380P707Q637R676J1453J3909J6269J7894J8890J9830
$$ 1165072 1167696 1172339 1178719 1186426 1195063 1204739 1216192 1230101 1246370 1264264 1283154 1302984
53295A302984K1172K2981K4969K6707K7966K8890K9723L0504L1160L1666L1753
$$ 1302984 1324156 1347137 1372106 1398813 1426779 1455669 1485392 1515896 1547056 1578722 1610475
53284A610475L0771K8327K4985K1852J9480J7616J5937J4393J2746J0402P109
$$ 1610475 1641246 1669573 1694558 1716410 1735890 1753506 1769443 1783836 1796582 1806984 1814093
53273A814093L391m1l022n849q702j1443j3844j5917j7970k0349k2925k5043k6294
$$ 1814093 1817484 1817443 1814421 1808572 1799870 1788427 1774583 1758666 1740696 1720347 1697422 1672379 1646085
53260A646085k7113k8211k9505l0301l0448l0573l0962l1131l0759l0342l0357
$$ 1646085 1618972 1590761 1561256 1530955 1500507 1469934 1438972 1407841 1377082 1346740 1316383
53249A316383l0438l0113k9719k9851l0221k9946k8811k7517k6687k6337k6233
$$ 1316383 1285945 1255832 1226113 1196262 1166041 1136095 1107284 1079767 1053080 1026743 1000510
53238A000510k6142k5644k4447k2972k2014k1632k1027j9758j8457j7825j7487
$$ 1000510 974368 948724 924277 901305 879291 857659 836632 816874 798417 780592 763105
53227G63105j6467j4614j2853j2035j2023j2034j1598j0916j0523j0748j1471
$$ 763105 746638 732024 719171 707136 695113 683079 671481 660565 650042 639294 627823
53216F27823j2267j2764j2885j2777j2595j2420j2258j2013j1512j0639r496q355
$$ 627823 615556 602792 589907 577130 564535 552115 539857 527844 516332 505693 496197 487842
53204D87842p459o911o664o459n954n040m164l973m585n375n652n378n016m838
$$ 487842 480383 473472 466808 460349 454395 449355 445191 441218 436633 431258 425606 420228 415212 410374
53190D10374m692m413m102l846l566l274l209l412l444k874j965j433j578j970
$$ 410374 405682 401269 397167 393321 389755 386481 383272 379860 376416 373542 371577 370144 368566 366596
53176C66596k051j718j163n07J69O09N02j43r36j401j309q21l70l23o32p96l42
$$ 366596 364545 362827 361664 361157 361326 361935 362437 362294 361358 359957 358648 357827 357457 357134 356502 355706 355364
53159C55364O86J684J988J409L99l19k67M63J335J804J715J368J193J325J522
$$ 355364 356050 357734 359722 361131 361530 361211 360944 361407 362742 364546 366261 367629 368822 370147 371669
53144C71669J535J475J640K042K322K210J825J409R92N32J26j56m46q29j034o95
$$ 371669 373204 374679 376319 378361 380683 382893 384718 386127 387119 387651 387777 387621 387175 386346 385312 384617
53128C84617J36J039J652J738J016n37k215k950k451j502r67q81p89n79m89m79
$$ 384617 384753 385792 387444 389182 390198 389661 387446 384496 382045 380543 379576 378695 377906 377327 376838 376359
53112C76359j76M62Q29K45j217k636l066k417j500j128j272j237o53M7K05l01
$$ 376359 376183 376645 377474 377719 376502 373866 370800 368383 366883 365755 364483 363246 362593 362640 362845 362544
53096C62544j068j715k096k069j446l50O52J006P30K96k8m75j233j923j926j263
$$ 362544 361476 359761 357665 355596 354150 353800 354452 355458 356188 356484 356456 355981 354748 352825 350899 349636
53080C49636o12l79k25J92M38j11j188j796j460p45l35j84J53O97R69N50m82j593
$$ 349636 349024 348645 348420 348612 349050 348939 347751 345955 344495 343750 343415 343231 343384 344081 345050 345600 345118 343525
53062C43525k189k160j966k028k102j596m61P21J493J889J904J314L00l71k07
$$ 343525 341336 339176 337210 335182 333080 331484 331023 331744 333237 335126 337030 338344 338644 338273 338066
53047C38066L99R00J417K224K883K663J704R53R41J246J306J153J104J186J114
$$ 338066 338465 339365 340782 343006 345889 348552 350256 351209 352150 353396 354702 355855 356959 358145 359259
53032C59259O83L0l63O4J304K491K638J727O52J22L7L9P6N9l93j350k052j699
$$ 359259 359942 359972 359609 359673 360977 363468 366106 367833 368485 368607 368644 368683 368759 368818 368425 367075 365023 363324
53014C63324n85K12K55J92N63Q80M15n56j009n28K50O53P63Q90R35O75L80M15
$$ 363324 362739 362951 363206 363398 363961 364841 365256 364700 363691 363163 363413 364066 364829 365719 366654 367329 367709 368124
52996C68124M60k31j724l134l622l202k369j383l17O27J180J284J025N16J07L32
$$ 368124 368584 368353 366629 363495 359873 356671 354302 352919 352602 353229 354409 355693 356718 357234 357341 357673
52980C57673J344K516L061K829K199J428N30k81o48o12n38m59O4J154K177K457
$$ 357673 359017 361533 364594 367423 369622 371050 371580 371299 370651 370039 369501 369042 369106 370260 372437 374894
52964C74894K156J978K167K231J708P97N4l34o09r05r69n61M2J93m26j439k198
$$ 374894 377050 379028 381195 383426 385134 385931 385985 385651 385042 384137 383168 382607 382649 382842 382416 380977 378779
52947C78779k428k318k107j745j084k22M25M80n4q40j517j912j975j709j208o28
$$ 378779 376351 374033 371926 370181 369097 368875 369300 369780 369726 368886 367369 365457 363482 361773 360565 359937
52931C59937k6N66Q84N12n47j627k095k075k115k260j967r82J99R16R90O92L93
$$ 359937 359911 360477 361361 361873 361326 359699 357604 355529 353414 351154 349187 348205 348404 349320 350310 351002 351395
52914C51395L64N97P19M15k5qM49O88L96O2J29L31K69J28K39L94J82l00o22o91
$$ 351395 351759 352356 353075 353490 353465 353457 353906 354594 354990 355052 355181 355512 355781 355909 356148 356542 356724 356424 355802 355111
52894C55111p28q03q51r42j047q57k63K33J99M5L95R10N75p81k089k322j616q46
$$ 355111 354383 353580 352729 351787 350740 349883 349620 349853 350052 350097 350492 351402 351977 351196 349107 346785 345169 344323
52876C44323o02p78p89p9J245K227J920M66r84j448q50K63J217J536J320J311
$$ 344323 343721 342943 342154 342075 343320 345547 347467 347933 346949 345501 344651 344914 346131 347667 348987 350298
52860C50298K029K910K961K161J428J189Q91K33k08k9J29m68j464j932j693j400
$$ 350298 352327 355237 358198 360359 361787 362976 363867 364100 363892 363863 363992 363524 362060 360128 358435 357035
52844C57035j502j809j924j718j398j466k287l438l753k559o37M94R7j211k225
$$ 357035 355533 353724 351800 350082 348684 347218 344931 341493 337740 335181 334544 335038 335135 333924 331699
52829C31699k133r89L16P74K80k82j70L42N98O21Q42J153R48R2q31j199p98L01
$$ 331699 329566 328577 328893 329667 329947 329665 329495 329837 330435 331056 331898 333051 333999 334091 333260 332061 331263 331564
52811C31564J709K630K492J738J375J695K134K433L083M192M735L703J490n48
$$ 331564 333273 335903 338395 340133 341508 343203 345337 347770 350853 355045 359780 363483 364973 364425
52797C64425j730k501l420m312m612m157l350k722k435k186j665j055q95j284
$$ 364425 362695 360194 356774 352462 347850 343693 340343 337621 335186 333000 331335 330280 329385 328101
52783C28101j539j003O2P80P74M57K56O8k61n48n90n84o93n78J37J083J429R86
$$ 328101 326562 325559 325621 326401 327175 327632 327888 327956 327695 327147 326557 325973 325280 324702 324839 325922 327351 328337
52765C28337M60M57P35P26L67N3mJ37M91J103J659J594P46l47r68r00n25l26m13
$$ 328337 328797 329254 329989 330715 331082 331135 331131 331268 331759 332862 334521 336115 336861 336514 335546 334646 334121 333795 333382
52746C33382m66j80L02M90J50l69n37k15L35P54P50K07n20p14q5P19R17O87Q48
$$ 333382 332916 332736 333038 333528 333678 333309 332772 332557 332892 333646 334396 334603 334083 333369 333284 334003 334920 335607 336455
52727C36455J502J797J205L28M5M20R00J131J004L83o53j500j605j220j052j267
$$ 336455 337957 339754 340959 341287 341332 341752 342652 343783 344787 345170 344517 343017 341412 340192 339140 337873
52711C37873j331q96k80K7o6l52o19o70l52J75M62K70o9oN69J191J369J113Q17
$$ 337873 336542 335646 335366 335393 335327 334975 334356 333686 333334 333509 333971 334241 334172 334166 334735 335926 337295 338408 339225
52692C39225P40P54O57N73P87J236J418R73K07j36L46J301J968J922J392R25P57
$$ 339225 339965 340719 341376 341949 342736 343972 345390 346363 346570 346434 346780 348081 350049 351971 353363 354288 355045
52675C55045P05O18O51Q38Q31M15J36O83J782K313J774R31P02J014J245J244J251
$$ 355045 355750 356368 357019 357857 358688 359103 359239 359922 361704 364017 365791 366722 367424 368438 369683 370927 372178
52658C72178J173O63j30n47k34M71J005J075P24L02K62O50Q85M04n15j106j183
$$ 372178 373351 374014 373884 373337 373103 373574 374579 375654 376378 376680 376942 377592 378477 378881 378366 377260 376077
52641C76077j337j925k448k263j486q09o28p15o98n44m77n86n92q8J031K404L484
$$ 376077 374740 372815 370367 368104 366618 365809 365181 364466 363768 363224 362747 362161 361569 361481 362512 364916 368400
52624C68400L859L358K106O34l68o70p09r87j416j557j267q08m90m87q18j135
$$ 368400 372259 375617 377723 378357 377989 377319 376610 375623 374207 372650 371383 370575 370085 369598 368780 367645
52608C67645q70J6P35O84L82O19J013N01p46j234l81M44l7r30m40J409K715K368
$$ 367645 366775 366791 367526 368210 368592 369211 370224 370725 369979 368745 368364 368808 368771 367841 367401 368810 371525 373893
52590C73893J369J116J454J229J86o37l61O44J293J050L36n2K76J154K140K841
$$ 373893 375262 376378 377832 379061 379247 378610 378249 378893 380186 381236 381572 381520 381796 382950 385090 387931
52574C87931L076K930K610K166J414L28o41q86l27M85R76R79N71j76j071j774
$$ 387931 391007 393937 396547 398713 400127 400455 399814 398928 398601 399086 400062 401041 401612 401436 400365 398591
52558C98591k137k370k623k641k114j219m63o0J67L65M38L16Q8k16p02j278j435
$$ 398591 396454 394084 391461 388820 386706 385487 385024 384964 385131 385496 385934 386250 386338 386122 385420 384142 382707
52541C82707o96P83K190K737K252J154L3o47n92J66J099J439R08Q5k37O9M40M90
$$ 382707 382011 382794 384984 387721 389973 391127 391160 390513 389921 390087 391186 392625 393533 393618 393381 393450 393890 394380
52523C94380M50O95J225J736J963J822J399R91R14J130J354J609K243L225L893
$$ 394380 394830 395525 396750 398486 400449 402271 403670 404661 405575 406705 408059 409668 411911 415136 419029
52508D19029L824L507L548L564K631P46r79j810k271l191m420n106m925m390m068
$$ 419029 422853 426360 429908 433472 436103 436849 435870 434060 431789 428598 424178 419072 414147 409757 405689
52493D05689l952l718l143k197j034m5M05M51O86J372J921J586N79RN40J564K022
$$ 405689 401737 398019 394876 392679 391645 391600 392005 392456 393142 394514 396435 398021 398600 398609 399149 400713 402735
52476D02735J752J483J698K081K156J905J574J327J348J850K625K971K563K048
$$ 402735 404487 405970 407668 409749 411905 413810 415384 416711 418059 419909 422534 425505 428068 430116
52462D30116K221K900L176K698J981J445Q74l5j172k375l688m910n377m699l423
$$ 430116 432337 435237 438413 441111 443092 444537 445411 445376 444204 441829 438141 433231 427854 423155 419732
52447D19732k478k202k284k380k284j739o71L69N83p8o95m18N99J435J482J025
$$ 419732 417254 415052 412768 410388 408104 406365 405694 406063 406646 406568 405873 405455 406054 407489 408971 409996
52431D09996P93J076J400J193O45N81J402K504K985K595J693N91m84j130j071
$$ 409996 410789 411865 413265 414458 415103 415684 417086 419590 422575 425170 426863 427454 426970 425840 424769
52416D24769o74n12m98o9O89R93O84P66K059L934N058N013M554M526N159O312
$$ 424769 424095 423583 423085 423016 423705 424698 425382 426148 428207 432141 437199 442212 446766 451292 456451 462763
52400D62763P792R369J0743J1461J0758Q001L618q69m312o961r440j1216j1176
$$ 462763 470555 479924 490667 502128 512886 520887 524505 523636 519324 512363 502923 491707 480531
52387D80531r424p440o274n639m931m081l053j547J61J064P60L01Q23K045K941
$$ 480531 471107 463667 457393 451754 446823 442742 439689 438142 438303 439367 440127 440428 441251 443296 446237
52372D46237L369L994M958N624N669N444N185M639L646K445J189k49j766k832
$$ 446237 449606 453600 458558 464182 469851 475295 480480 485119 488765 491210 492399 492150 490384 487552
52358D87552l077k728k223j742j206n44K27R26J284J268J288J754K456K827K734
$$ 487552 484475 481747 479524 477782 476576 476032 476259 477185 478469 479737 481025 482779 485235 488062 490796
52343D90796K530K350J919J239Q93J357K382L380M108M708N322N952O550P160
$$ 490796 493326 495676 497595 498834 499727 501084 503466 506846 510954 515662 520984 526936 533486 540646
52329E40646P935R068J0437J1543J2134J2800J4265J6139J7097J6534J5272J4285
$$ 540646 548581 557649 568086 579629 591763 604563 618828 634967 652064 668598 683870 698155
52317F98155J3489J2358J1098J0332J0028R650R201R340J0361J1786J3031J3953
$$ 698155 711644 724002 735100 745432 755460 765110 774311 783651 794012 805798 818829 832782
52305H32782J4621J5082J5500J6072J6636J6789J6496J6174J5985J5476J4217
$$ 832782 847403 862485 877985 894057 910693 927482 943978 960152 976137 991613 1005830
52294A005830J2357J0303Q056N389K514J24j302j934k160j987j201q6M29l26j839
$$ 1005830 1018187 1028490 1036546 1041935 1044449 1044573 1043271 1041337 1039177 1037190 1035989 1035903 1036332 1036006 1034167
52279A034167k834k634j813j302j265j206q46k98M49J650L233M585N144N018M879
$$ 1034167 1031333 1028699 1026886 1025584 1024319 1023113 1022267 1021969 1022418 1024068 1027301 1031886 1037030 1042048 1046927
52264A046927N404O861Q963J1016J2442J3208J3596J3661J3279J2674J2367J2492
$$ 1046927 1052331 1059192 1068155 1079171 1091613 1104821 1118417 1132078 1145357 1158031 1170398 1182890
52252A182890J2629J2563J2594J2820J2600J1330R389P633O266M868L388K290
$$ 1182890 1195519 1208082 1220676 1233496 1246096 1257426 1266815 1274448 1280714 1285582 1288970 1291260
52240A291260J664J014K31L0R31K338L286L672M089M635M668L783K494J642J554
$$ 1291260 1292924 1293938 1294169 1294199 1295130 1297468 1300754 1304426 1308515 1313150 1317818 1321601 1324095 1325737 1327291
52225A327291J933K304K334J997J603J561J911K220K105J691J462J717K341L038
$$ 1327291 1329224 1331528 1333862 1335859 1337462 1339023 1340934 1343154 1345259 1346950 1348412 1350129 1352470 1355508
52211A355508L621M119M649N240N802O290O780P299P687P919Q335R252J0326J0824
$$ 1355508 1359129 1363248 1367897 1373137 1378939 1385229 1392009 1399308 1406995 1414914 1423249 1432501 1442827 1453651
52197A453651J0588J0250J0307J0532J0614J0765J1197J1419J0861R864R298R215
$$ 1453651 1464239 1474489 1484796 1495328 1505942 1516707 1527904 1539323 1550184 1560048 1569346 1578561
52185A578561Q722P232N184L204J267r35l326n519p241q372q885r082r470j0054
$$ 1578561 1587283 1594515 1599699 1602903 1604170 1603235 1599909 1594390 1587149 1578777 1569892 1560810 1551340 1541286
52171A541286j0140r235p819o719o063n353m449l771l508l226k446j164L72J988
$$ 1541286 1531146 1521911 1514092 1507373 1501310 1495957 1491508 1487737 1484229 1481003 1478557 1477393 1477765 1479753
52157A479753L407M067L504J826m04k585m173m597l591j766m31m42j322j843j438
$$ 1479753 1483160 1487227 1490731 1492557 1492153 1489568 1485395 1480798 1477207 1475441 1475010 1474568 1473246 1471403 1469965
52142A469965o70l18m66p47r92j143r35l63k96j715m225o050n903m218k184k13
$$ 1469965 1469295 1468977 1468511 1467764 1466772 1465629 1464694 1464331 1464035 1462320 1458095 1452045 1446142 1441924 1439740 1439527
52126A439527J890L927N364O290P439R224J1324J3351J5265J7027J8359J9137
$$ 1439527 1441417 1445344 1450708 1456998 1464437 1473661 1484985 1498336 1513601 1530628 1548987 1568124
52114A568124J9584J9905K0072K0126K0216K0154J9458J8167J7139J7077J7623
$$ 1568124 1587708 1607613 1627685 1647811 1668027 1688181 1707639 1725806 1742945 1760022 1777645
52103A777645J7945J7953J8270J9092J9818K0041K0200K0832K1539K1298J9654
$$ 1777645 1795590 1813543 1831813 1850905 1870723 1890764 1910964 1931796 1953335 1974633 1994287
52092A994287J7072J4074J0595O342J474l449p824j1096j2776j2830j1947j0938
$$ 1994287 2011359 2025433 2036028 2042370 2043844 2040395 2032571 2021475 2008699 1995869 1983922 1972984
52080A972984r881q292o114l971k372j282o59p90j537j865q10J308L389N005O647
$$ 1972984 1963103 1954811 1948697 1944726 1942354 1941072 1940413 1939623 1938086 1936221 1935411 1936719 1940108 1945113 1951760
52065A951760Q450R621R502Q621Q121Q447R048R217Q837Q313Q079Q280Q707Q957
$$ 1951760 1960210 1969831 1979333 1987954 1996075 2004522 2013570 2022787 2031624 2039937 2048016 2056296 2065003 2073960
52051B073960Q619P430N441L141J254P6r37k662n266p973r880j0715j0774j0435
$$ 2073960 2082579 2090009 2095450 2098591 2099845 2099921 2098984 2096322 2091056 2083083 2073203 2062488 2051714 2041279
52037B041279j0009r753r613r222q450p802p884q565r019q709p932p290o973o820
$$ 2041279 2031270 2021517 2011904 2002682 1994232 1986430 1978546 1969981 1960962 1952253 1944321 1937031 1930058 1923238
52023A923238o812p136p774q362q541q279p791p281o874o641o553o417o063n532
$$ 1923238 1916426 1909290 1901516 1893154 1884613 1876334 1868543 1861262 1854388 1847747 1841194 1834777 1828714 1823182
52009A823182n047m796m883n416o488q029r809j1705j3923j6860k0633k4732k8169
$$ 1823182 1818135 1813339 1808456 1803040 1796552 1788523 1778714 1767009 1753086 1736226 1715593 1690861 1662692
51996A662692l0150l0664l0323k9595k8482k6980k5420k4014k2427k0440j8759
$$ 1662692 1632542 1601878 1571555 1541960 1513478 1486498 1461078 1437064 1414637 1394197 1375438
51985A375438j8450j9479k0618k0962k0799k0668k0366j9562j8736j8606j8951
$$ 1375438 1356988 1337509 1316891 1295929 1275130 1254462 1234096 1214534 1195798 1177192 1158241
51974A158241j8865j8089j7296j6986j6831j6253j5012j3014j0080o400k740N8
$$ 1158241 1139376 1121287 1103991 1087005 1070174 1053921 1038909 1025895 1015815 1009415 1006675 1006733
51962A006733J837L073M294N606O651O920O146M405J843j498n391r175j2073j3691
$$ 1006733 1008570 1011643 1015937 1021543 1028194 1035114 1041260 1045665 1047508 1046010 1040619 1031444 1019371 1005680
51948A005680j3986j3010j1072q919p135n413k991J53L102N104O265O931O930
$$ 1005680 991694 978684 967612 958693 951558 946145 943154 943307 946409 951513 957778 964709 971639
51935I71639N933M191K484J369P25j05j796m490p546j0054j1669j2810j3978j5195
$$ 971639 977572 981763 984247 985616 986341 986236 984440 979950 972404 962350 950681 937871 923893 908698
51921I08698j6106j6422j6104j5350j4472j3579j2401j0664q589o619m772k782
$$ 908698 892592 876170 860066 844716 830244 816665 804264 793600 785011 778392 773620 770838
51909G70838q65L43Q05J411K904N021P148R246J1535J3648J4772J4596J3510J1963
$$ 770838 769973 770316 771121 772532 775436 780457 787605 796851 808386 822034 836806 851402 864912 876875
51895H76875R956P225L523j167o402j1284j5004j7402j8788j9271j8529j6301
$$ 876875 886831 894056 897579 896412 890010 878726 863722 846320 827532 808261 789732 773431
51883G73431j2874q992n328k061J044M143O944R062J0635J2351J4732J7610K0233
$$ 773431 760557 751565 746237 744176 745220 749363 756307 765369 776004 788355 803087 820697 840930
51870H40930K1750K1569J9556J5893J0682L932l645j0240j4174j5516j5715j5651
$$ 840930 862680 884249 903805 919698 930380 934312 930667 920427 906253 890737 875022 859371
51858H59371j4962j3436j1821j0651r341p295n064l399j914J12K186L174L116
$$ 859371 844409 830973 819152 808501 799160 791865 786801 783402 781488 781600 783786 786960 790076
51845G90076L121L450L130J692P1p68r98j133r27P4J446K291K495K860L980N465
$$ 790076 793197 796647 799777 801469 801540 800772 799774 798641 797714 797788 799234 801525 804020 806880 810860 816325
51829H16325O424O426N811N099M180K359o81m193p066q981j0401j1529j1915j1233
$$ 816325 822749 829175 834986 840085 844265 846624 845943 841750 834684 825703 815302 803773 791858 780625
51815G80625r828q210o512m686k835j049O52J885J858K36k266m576o379q059r686
$$ 780625 770797 762587 756075 751389 748554 747505 748157 750042 751900 752136 749870 745294 738915 730856 721170
51800G21170j0654j0461r501q684q396q018o656m261j896p04p71j185j108n27
$$ 721170 710516 700055 690554 681870 673474 665456 658800 654539 652643 651939 651168 649983 648875 648348
51786F48348K5J73K5K7N84J612K438K388J496L56o24j470k057j863o01J244K906
$$ 648348 648373 648546 648571 648598 649182 650794 653232 655620 657116 657472 656848 655378 653321 651458 650857 652101 655007
51769F55007M164N355O761Q349R939J1326J2219J2367J1751J0475Q488N587J750
$$ 655007 659171 664526 671287 679636 689575 700901 713120 725487 737238 747713 756201 761788 763538
51756G63538k605o724r862j1718j2588j2998j3070j2483j1152r635q534p698o428
$$ 763538 760933 754209 744347 732629 720041 707043 693973 681490 670338 660703 652169 644471 638043
51743F38043m449k235l26J326L039M754O101P038P998R279J0552J1227J1082J0349
$$ 638043 633594 631359 631033 632359 635398 640152 646253 653291 661289 670568 681120 692347 703429 713778
51729G13778R235P709N716L365P40k113m843o648o818n413l273j419n85j085k714
$$ 713778 723013 730722 736438 739803 740543 738430 733587 726939 720121 714708 711435 710016 709431 708346 705632
51714G05632m626n657n098l235j065N10J216J278J008O83O48J185K199L345M775
$$ 705632 701006 695349 690251 687016 685951 686461 687677 688955 689963 690646 691294 692479 694678 698023 702798
51699G02798P276J1037J4485J5246J2560Q141M297J778N2j052q61J030L937O498
$$ 702798 710074 721111 735596 750842 763402 771543 775840 777618 777670 776618 775757 776787 780724 787222
51685G87222P512O375L202j206n703r158j0754j0406r062q019p502o458m204j709
$$ 787222 794734 801109 804311 803105 797402 788244 777490 767084 758022 750003 742501 736043 731839 730130
51671G30130m82p41j600k627m011n350n566m263k213j53J891L867N288N951O187
$$ 730130 729648 728907 727307 724680 720669 715319 709753 705490 703277 703124 705015 708882 714170 720121 726308
51656G26308N939M585K216J65m66r4L02P56J943L813N495O373O395N485L412K19
$$ 726308 732247 736832 739048 739213 738747 738653 738955 739711 741654 745467 750962 757335 763730 769215 772627 772846
51640G72846l735q104j2440j5920j7752j7873j6872j5374j3837j2631j1817j0973
$$ 772846 769111 761007 748567 732647 714895 697022 680150 664776 650939 638308 626491 615518
51628F15518r699q176o884n981n247m432l303j708O2J255J490J214R19L95o40
$$ 615518 605819 597643 590759 584778 579531 575099 571796 570088 570150 571405 572895 574109 575028 575423 574783
51613E74783j647j824j315r83j170j474j658j873j989j538n17M42R12J027J030
$$ 574783 573136 571312 569997 569014 567844 566370 564712 562839 560850 559312 558795 559237 560149 561176 562206
51598E62206J054J435K528M013N172N970P189R238J1587J3641J5375J6618J6542
$$ 562206 563260 564695 567223 571236 576408 582378 589567 598805 610392 624033 639408 656026 672568
51585F72568J4528J1089P383M325K569K711M666P300R566J1768J4956J9279K3888
$$ 672568 687096 698185 705568 709893 712462 715173 719839 727139 736705 748473 763429 782708 806596
51572H06596K8421L3567L9722M5892N0549N3328N5396N8368O3040O8828P3871
$$ 806596 835017 868584 908306 954198 1004747 1058075 1113471 1171839 1234879 1303707 1377578
51561A377578P5980P4249P0057O6246O4867O5727O7014O7046O5135O1034N4059
$$ 1377578 1453558 1527807 1597864 1664110 1728977 1794704 1861718 1928764 1993899 2054933 2108992
51550B108992M3124K7615Q193j3216l4235n2990o8521q0487q8821r3727r5723
$$ 2108992 2152116 2179731 2187924 2174708 2140473 2087483 2018962 1938475 1849654 1755927 1660204
51539A660204r5323r2719q8065q2002p5448o8833o1957n4737m7668m1315l5729
$$ 1660204 1564881 1472162 1384097 1302095 1226647 1157814 1095857 1041120 993452 952137 916408
51528I16408l0701k6275k2620j9683j7296j5418j3947j2536j0977r569q658q029
$$ 916408 885707 859432 836812 817129 799833 784415 770468 757932 746955 737386 728728 720699
51516G20699p176o069n171m829m997n439n759n428m359l350l362m335n320n831
$$ 720699 713523 707454 702283 697454 692457 687018 681259 675831 671472 668122 664760 660425 655105 649274
51502F49274o315p127p734p433o379n373m868m556l899k772j551p15l17O9P79
$$ 649274 642959 635832 628098 620665 614286 608913 604045 599489 595590 592818 591267 590552 590235 590304 591083
51487E91083J563J937J886J824J852J546O36n36j468k104k745l585m438m903m725
$$ 591083 592646 594583 596469 598293 600145 601691 602327 601791 600323 598219 595474 591889 587451 582548 577823
51472E77823m162l877m163m431l867k519j280p70p77q76j040j394j837k165k229
$$ 577823 573661 569784 565621 561190 557323 554804 553524 552754 551977 551101 550061 548667 546830 544665 542436
51457E42436j772n27J333L215M781O197P574Q661R282R705J0216J0797J1490J2643
$$ 542436 540664 540137 541470 544685 549466 555663 563237 571898 581180 590885 601101 611898 623388 636031
51443F36031J4486J6808J9288K1780K4055K5710K6559K6493K4752K0106J2499
$$ 636031 650517 667325 686613 708393 732448 758158 784717 811210 835962 856068 868567
51432H68567L973k708o148o699n477l866l504n587r891j4924j9037k1201k1064
$$ 868567 872540 869832 863684 856985 851508 847642 844138 838551 828660 813736 794699 773498 752434
51419G52434j9056j6266j3572j0971q207n734m242l494k558j187m4O59J704L615
$$ 752434 733378 717112 703540 692569 684362 678628 674386 670892 668334 667147 667103 667762 669466 673081
51405F73081N616O557O365N946N886N903N547N022N107O316Q303J0235J1849J3855
$$ 673081 678697 685254 691619 697565 703451 709354 714901 719923 725030 731346 739649 749884 761733 775588
51391G75588J7014K1074K5045K8446L1745L5605M0216M5471N1212N7213O3386
$$ 775588 792602 813676 838721 867167 898912 934517 974733 1020204 1071416 1128629 1192015
51380A192015P0040P7403Q4796R0977R5448R8737J01043J01440R9055R4107Q6831
$$ 1192015 1262055 1339458 1424254 1515231 1610679 1709416 1810459 1911899 2010954 2105061 2191892
51369B191892P5899N9247L6674J0712j5372l9700o1693q0722r5776j06293j12648
$$ 2191892 2267791 2327038 2363712 2374424 2359052 2319352 2257659 2176937 2081161 1974868 1862220
51358A862220j15603j15580j12622j06918r9120r0115q0594p0931o1459n2631
$$ 1862220 1746617 1631037 1518415 1411497 1312377 1222262 1141668 1070737 1009278 956647
51348I56647m4816l8061l2268k7503k3928k1383j9307j7167j4910j2888j1485
$$ 956647 911831 873770 841502 813999 790071 768688 749381 732214 717304 704416 692931
51337F92931j0843j0848j1091j0953r972q306o656n589n069m732m463m384m466
$$ 692931 682088 671240 660149 649196 639224 630918 624262 618673 613604 608872 604409 600025 595559
51324E95559m459m246l874l261k293j259p60q75r39n23j34l31n81K30K184M050
$$ 595559 591100 586854 582980 579719 577426 576167 575407 574532 573593 573070 572936 572605 572024 572254 574438 578488
51308E78488M779M620M466M730N222N699O015N925N264M206L066J869L78j472
$$ 578488 583267 587887 592353 597083 602305 608004 614019 619944 625208 629414 632480 634349 634727 633255
51294F33255l362m777n366n176m640m178l815l330k716k168j560m72J004J900
$$ 633255 629893 625116 619750 614574 609934 605756 601941 598611 595895 593727 592167 591695 592699 594599
51280E94599J319l82j767j691k36J588K764K899K239J283L77l77q37q14l94K1
$$ 594599 595918 595536 593769 592078 591842 593430 596194 599093 601332 602615 602992 602615 601778 600964 600570 600591
51264F00591J86L36P32J218J570K026K917L845L855K635J048K10L30Q02J173J577
$$ 600591 600777 601113 601845 603063 604633 606659 609576 613421 617276 619911 620959 621169 621499 622301 623474 625051
51248F25051K185K646K318J021o34j819k320k628l294m340n378o001n950n220
$$ 625051 627236 629882 632200 633221 632587 630768 628448 625820 622526 618186 612808 606807 600857 595637
51234E95637m252l769m045m494m343l598k870k379j723p27N9R0l87o64m18J06
$$ 595637 591385 587616 583571 579077 574734 571136 568266 565887 564164 563437 563496 563586 563199 562535 562117 562223
51218E62223N94Q99R09N93K48L79J163K141K580K193J520J495K488L790M342M025
$$ 562223 562817 563716 564625 565218 565466 565845 567008 569149 571729 573922 575442 576937 579425 583215 587557 591582
51202E91582L842M526N430N309M046K884K892L780M530M650M341L801L002K108
$$ 591582 595424 599950 605380 610689 614735 617619 620511 624291 628821 633471 637812 641613 644615 646723
51188F46723J570J677K287L043L618L653K949J809Q62K89m65j844l362m185m326
$$ 646723 648293 649970 652257 655300 658918 662571 665520 667329 668191 668480 668015 666171 662809 658624 654298
51173F54298m635n498o217o026n180m504m196l701k713j698j311j659k276k508
$$ 654298 649663 644165 637948 631922 626742 622238 618042 614341 611628 609930 608619 606960 604684 602176
51159F02176j863m07J069J646J260P84R44J560K044K179J980J241j08j450j961
$$ 602176 600313 599906 600975 602621 603881 604665 605609 607169 609213 611392 613372 614613 614505 613055 611094
51144F11094j676j467j898k653l249l709m237m708m853m585l903k766j425m93
$$ 611094 609418 607951 606053 603400 600151 596442 592205 587497 582644 578059 574156 571390 569965 569472
51130E69472k96l50M2Q44J440J536J498J751K291K881L332L578L733M127M969
$$ 569472 569176 568826 568868 569712 571152 572688 574186 575937 578228 581109 584441 588019 591752 595879 600848
51115F00848N879O170N659M852M179L471K459J366O35K91k5m59q36j056j236j357
$$ 600848 606727 612897 618556 623408 627587 631058 633517 634883 635518 635809 635784 635325 634489 633433 632197 630840
51099F30840j118l80N59J308J874K518L228L643L513K979K267J404M14m14q29
$$ 630840 629722 629342 629901 631209 633083 635601 638829 642472 645985 648964 651231 652635 653049 652635 651806
51084F51806j041j487k181k710k974l373m053m407l834k596j469p28j19L70L85
$$ 651806 650765 649278 647097 644387 641413 638040 633987 629580 625746 623150 621681 620953 620834 621204 621589
51069F21589L7J22J256L119M890O037O496O422O124O010O329P041Q104R582J1267
$$ 621589 621626 621748 623004 626123 631013 637050 643546 649968 656092 662102 668431 675472 683576 693158 704425
51054G04425J2476J2519J1248R034O506M482L710M368N881P455Q560Q930Q584
$$ 704425 716901 729420 740668 749702 756208 760690 764400 768768 774649 782104 790664 799594 808178
51041H08178Q199Q756J0331J1617J1358R883Q564P982P463O351M875L514K138
$$ 808178 816377 825133 835464 847081 858439 868322 876886 884868 892331 898682 903557 907071 909209
51028I09209J57k839o792j1103j4779j7004j7768j7650j6984j5691j3859j1974
$$ 909209 909366 906527 899735 888632 873853 856849 839081 821431 804447 788756 774897 762923
51016G62923j0291q474o132l379o49J732L641N086O298P534Q712R484R786R932
$$ 762923 752632 744158 738026 734647 733998 735730 739371 744457 750755 758289 767001 776485 786271 796203
51002G96203J0084J0070R828R547R216Q482P288O108N283M598L873L454L639M210
$$ 796203 806287 816357 826185 835732 844948 853430 860718 866826 872109 876707 880580 884034 887673 891883
50988H91883M990O305Q282J0202J1438J2605J4794J7842K0390K1728K2593K3781
$$ 891883 896873 903178 911460 921662 933100 945705 960499 978341 998731 1020459 1043052 1066833
50976A066833K4938K5287K4916K4670K4988K5448K5277K3996K1735J9238J7503
$$ 1066833 1091771 1117058 1141974 1166644 1191632 1217080 1242357 1266353 1288088 1307326 1324829
50965A324829J7142J8015J9563K1334K3078K4659K6097K7593K9342L1366L3595
$$ 1324829 1341971 1359986 1379549 1400883 1423961 1448620 1474717 1502310 1531652 1563018 1596613
50954A596613L5936L8147L9774M0484M0286L9378L7919L6156L4528L3328L2330
$$ 1596613 1632549 1670696 1710470 1750954 1791240 1830618 1868537 1904693 1939221 1972549 2004879
50943B004879L1032K9379K8006K7762K9069L1614L4283L5338L3121K7239J9174
$$ 2004879 2035911 2065290 2093296 2121058 2150127 2181741 2216024 2251362 2284483 2311722 2330896
50932B330896J1315N107J63m721j0026j5278k0074k4707k9592l4597l9250m3369
$$ 2330896 2342211 2347318 2347481 2342760 2332734 2317456 2297382 2272675 2243083 2208486 2169236 2125867
50920B125867m7169n0937n4842n8853o2452o4668o4770o2943o0063n6907n3832
$$ 2125867 2078698 2027761 1972919 1914066 1851614 1786946 1722176 1659233 1599170 1542263 1488431
50909A488431n0851m7675m3811l9242l4873l1706k9571k7290k4146k0601j7429
$$ 1488431 1437580 1389905 1346094 1306852 1271979 1240273 1210702 1183412 1159266 1138665 1121236
50898A121236j4830j2693j1137j0225r596q852q006p160o102m700l406k835k952
$$ 1121236 1106406 1093713 1082576 1072351 1062755 1053903 1045897 1038737 1032635 1027935 1024529 1021694 1018742
50885A018742l129k891k218j310m27J62M98J018J923K755K983K867L092L807M638
$$ 1018742 1015613 1012722 1010504 1009194 1008767 1008929 1009427 1010445 1012368 1015123 1018106 1020973 1024065 1027872 1032510
50870A032510N556O893Q429R355R405R386J0138J1565J3117J4695J6584J8872
$$ 1032510 1038066 1044959 1053388 1062743 1072148 1081534 1091672 1103237 1116354 1131049 1147633 1166505
50858A166505K1464K4312K7234K9796L1913L4352L8056M3111M8824N4629O0422
$$ 1166505 1187969 1212281 1239515 1269311 1301224 1335576 1373632 1416743 1465567 1520196 1580618
50847A580618O6132P1552P6673Q1682Q6501R0769R4369R7580J00582J03202J05278
$$ 1580618 1646750 1718302 1794975 1876657 1963158 2053927 2148296 2245876 2346458 2449660 2554938
50836B554938J06809J07547J06747J03760R8680R2145Q4708P6663O8363O0372
$$ 2554938 2661747 2769294 2876041 2979801 3078481 3170626 3255334 3331997 3400360 3460732
50826C460732N3207M7038M1727L7205L3882L2528L3456L5800L8014L9266M0025
$$ 3460732 3513939 3560977 3602704 3639909 3673791 3706319 3739775 3775575 3813589 3852855 3892880
50815C892880M0895M1086L8586L1855K1026P311q259k5218m3075o0969p8073r3990
$$ 3892880 3933775 3974861 4013447 4045302 4066328 4073639 4065380 4040162 3997087 3936118 3858045 3764055
50803C764055j08516j21201j31468j39023j43765j45329j43201j37500j29269
$$ 3764055 3655539 3534338 3402870 3263847 3120082 2974753 2831552 2694052 2564783
50794B564783j19642j09093r7850q6621p6166o6343n6276m5794l5967k8020k2124
$$ 2564783 2445141 2336048 2238198 2151577 2075411 2009068 1952792 1906998 1871031 1843011 1820887
50783A820887j7592j3733j0157o700l644j772j614k786m375n916p551r442j1454
$$ 1820887 1803295 1789562 1779405 1772705 1769061 1767289 1765675 1762889 1758514 1752598 1745047 1735605 1724151
50770A724151j3396j5131j6449j7298j8101j9458k1408k3321k4625k5302k5657
$$ 1724151 1710755 1695624 1679175 1661877 1643776 1624318 1602910 1579589 1554964 1529662 1504005
50759A504005k5902k6096k6175k5924k5088k3647k1789j9596j6997j4055j1083
$$ 1504005 1478103 1452007 1425832 1399908 1374820 1351173 1329384 1309788 1292791 1278736 1267653
50748A267653q385o041l883j556J311M687Q014J0819J3304J6016J9076K2274K5758
$$ 1267653 1259268 1253227 1249344 1247788 1249099 1253786 1261800 1272619 1285923 1301939 1321015 1343289 1369047
50735A369047K9861L4230L7906M0611M3233M6554N0144N3044N4992N6275N6838
$$ 1369047 1398908 1433138 1471044 1511655 1554888 1601442 1651586 1704630 1759622 1815897 1872735
50724A872735N6366N5136N4009N3480N3245N2767N1796N0335M8400M5937M2705
$$ 1872735 1929101 1984237 2038246 2091726 2144971 2197738 2249534 2299869 2348269 2394206 2436911
50713B436911L8410L3160K7617K2285J7004J1675P174M684M166M329M405N055
$$ 2436911 2475321 2508481 2536098 2558383 2575387 2587062 2594236 2598920 2603086 2607415 2611820 2616875
50701B616875P073R934J2349J3796J4672J5138J4498J1790O470j556j1985k3906
$$ 2616875 2623948 2633882 2646231 2660027 2674699 2689837 2704335 2716125 2722595 2721039 2709054 2685148
50689B685148l5925m6921n6600o5129p2253p7012p8419p6338p1718o5955n9939
$$ 2685148 2649223 2602302 2545702 2480573 2408320 2331308 2252889 2176551 2104833 2038878 1978939
50678A978939n3621m6324l7643k8062j8719j0429k988M376J1932J9095K5161L0061
$$ 1978939 1925318 1878994 1841351 1813289 1794570 1784141 1781153 1785529 1797461 1816556 1841717 1871778
50666A871778L4092L7254L9240L9897L9255L7214L3719K9322K5056K1514J8522
$$ 1871778 1905870 1943124 1982364 2022261 2061516 2098730 2132449 2161771 2186827 2208341 2226863
50655B226863J5886J4019J3351J3556J3778J3531J2944J2250J1571J1184J1567
$$ 2226863 2242749 2256768 2270119 2283675 2297453 2310984 2323928 2336178 2347749 2358933 2370500
50644B370500J2981J5267J8103K1287K4770K8635L3119L8302M3713M8425N1735
$$ 2370500 2383481 2398748 2416851 2438138 2462908 2491543 2524662 2562964 2606677 2655102 2706837
50633B706837N3581N4358N4597N4808N5170N5136N3858N1348M8735M6671M3559
$$ 2706837 2760418 2814776 2869373 2924181 2979351 3034487 3088345 3139693 3188428 3235099 3278658
50622C278658L6258K2876M664j4984l2780m6730n5964o0463o1122n9389n6421
$$ 3278658 3314916 3337792 3342456 3327472 3294692 3247962 3191998 3131535 3070413 3011024 2954603
50611B954603n2624m7970m2538l6637l0697k5173k0389j6467j3545j2071j2630
$$ 2954603 2901979 2854009 2811471 2774834 2744137 2718964 2698575 2682108 2668563 2656492 2643862
50600B643862j5429k0182k6537l4293m2966n1462n8589o3787o7172o9072o9816
$$ 2643862 2628433 2608251 2581714 2547421 2504455 2452993 2394404 2330617 2263445 2194373 2124557
50589B124557o9786o9190o7713o4877o0837n6457n2352m8189m3271l7664l2308
$$ 2124557 2054771 1985581 1917868 1852991 1792154 1735697 1683345 1635156 1591885 1554221 1521913
50578A521913k8022k4689k1493j7706j3180q305l672L50L911P450J1100J4429
$$ 1521913 1493891 1469202 1447709 1430003 1416823 1408518 1404846 1405196 1409107 1416557 1427657 1442086
50566A442086J6957J8784K0472K2295K3936K4870K4805K3764K2122K0677K0197
$$ 1442086 1459043 1477827 1498299 1520594 1544530 1569400 1594205 1617969 1640091 1660768 1680965
50555A680965K0645K1257K1702K2716K5090K8371L1299L3320L4850L6040L6275
$$ 1680965 1701610 1722867 1744569 1767285 1792375 1820746 1852045 1885365 1920215 1956255 1992530
50544A992530L5189L3448L1966L0909L0054K9632L0201L1920L4574L8053M2370
$$ 1992530 2027719 2061167 2093133 2124042 2154096 2183728 2213929 2245849 2280423 2318476 2360846
50533B360846M7229N2227N7347O2823O8618P4487Q0468Q6767R3160R9058J04284
$$ 2360846 2408075 2460302 2517649 2580472 2649090 2723577 2804045 2890812 2983972 3083030 3187314
50522C187314J09198J13940J17916J20260J20449J18302J13829J07256R8903Q8740
$$ 3187314 3296512 3410452 3528368 3648628 3769077 3887379 4001208 4108464 4207367 4296107
50512D296107P6405O1824M5568K8345J0500p648k5258m1288n5292o7495p7956
$$ 4296107 4372512 4434336 4479904 4508249 4518749 4511101 4485843 4444555 4389263 4321768 4243812
50501D243812q6056r1051r2882r2077q8896q2979p4014o2506m9524l5831k1768
$$ 4243812 4157756 4066705 3973823 3881746 3792850 3709871 3635857 3573351 3523827 3487996 3466228
50490C466228p946M472J4500K1855K6365K7189K3226J4170P50j6018l5205n5584
$$ 3466228 3458282 3462754 3477254 3499109 3525474 3552663 3575889 3590059 3590809 3574791 3539586 3484002
50478C484002p5423r2900j06692j16269j21935j24547j24776j22681j18243j12069
$$ 3484002 3408579 3315679 3208987 3092718 2970783 2846236 2721460 2598779 2480536 2368467
50468B368467j04990r7111q8035p8126o8783o1119n5015m9857m5557m2220l9379
$$ 2368467 2263477 2166366 2078331 2000205 1931422 1870303 1815288 1765431 1719874 1677654 1638275
50457A638275l6278l2743k9099k5420k1491j7561j4448j2623j1579j0383q597
$$ 1638275 1601997 1569254 1540155 1514735 1493244 1475683 1461235 1448612 1437033 1426650 1418053
50446A418053o433m203j984J85K064L408M332N205O169O934P261P329P414P392
$$ 1418053 1411620 1407417 1405433 1405618 1407682 1411090 1415422 1420627 1426796 1433730 1440991 1448320 1455734 1463126
50432A463126O982O388O224O839Q025R429J0706J1419J1337J1075J1713J3465
$$ 1463126 1470108 1476496 1482720 1489559 1497584 1507013 1517719 1529138 1540475 1551550 1563263 1576728
50420A576728J5338J6569J7877K0583K4798K9232L2720L5405L8311M2201M7052
$$ 1576728 1592066 1608635 1626512 1647095 1671893 1701125 1733845 1769250 1807561 1849762 1896814
50409A896814N2255N7186O1561O5393O8614P0946P2184P2373P1502O9252O5266
$$ 1896814 1949069 2006255 2067816 2133209 2201823 2272769 2344953 2417326 2488828 2558080 2623346
50398B623346N9628N2933M5908L9023L2188K4766J6106O248m105j4389k4556l4572
$$ 2623346 2682974 2735907 2781815 2820838 2853026 2877792 2893898 2900146 2896041 2881652 2857096 2822524
50386B822524m3909n1863n8103o2595o5187o5626o3754n9570n3318m5732l7816
$$ 2822524 2778615 2726752 2668649 2606054 2540867 2475241 2411487 2351917 2298599 2252867 2215051
50375B215051l0147k2672j5432r072m245r99P91P68j524n882j1614j8276k5669
$$ 2215051 2184904 2162232 2146800 2137728 2133483 2132484 2133275 2134043 2132519 2126637 2115023 2096747 2071078
50362B071078l3339m0607m7012n2286n6063n8159n8934n8839n7789n5565n2596
$$ 2071078 2037739 1997132 1950120 1897834 1841771 1783612 1724678 1665839 1608050 1552485 1499889
50351A499889m9676m6924m3807m0220l6762l3805l0905k7470k3548j9695j6427
$$ 1499889 1450213 1403289 1359482 1319262 1282500 1248695 1217790 1190320 1166772 1147077 1130650
50340A130650j3895j1776r458o777m462l326l044k423j069K1j31j088j616j227
$$ 1130650 1116755 1104979 1095521 1088744 1084282 1080956 1077912 1075489 1074420 1074441 1074310 1073222 1071606 1070379
50326A070379n52k95l76k05M36J114J373J523K327L819M945M951M563N101O586
$$ 1070379 1069827 1069532 1069156 1068951 1069387 1070501 1071874 1073397 1075724 1079543 1084488 1089439 1094002 1099103 1105689
50311A105689P661P406O378N621N519N895O532P111P212O832O425O169N714M958
$$ 1105689 1113350 1120756 1127134 1132755 1138274 1144169 1150701 1157812 1165024 1171856 1178281 1184450 1190164 1195122
50297A195122M456M583M913M915M723M724M824M702M396L915K736L77k624m987
$$ 1195122 1199578 1204161 1209074 1213989 1218712 1223436 1228260 1232962 1237358 1241273 1244009 1244386 1241762 1236775
50283A236775n894n598m954m740n207n875n875m865l340j788O6K587N337P528
$$ 1236775 1230881 1225283 1220329 1215589 1210382 1204507 1198632 1193767 1190427 1188639 1188705 1191292 1196629 1204157
50269A204157R159J0818J2645J4228J5582J7144J8670J9023J7650J5533J4109
$$ 1204157 1213316 1224134 1236779 1251007 1266589 1283733 1302403 1321426 1339076 1354609 1368718
50258A368718J3751J3830J3874J3901J3764J2972J1201Q413M351j358q169j4242
$$ 1368718 1382469 1396299 1410173 1424074 1437838 1450810 1462011 1470424 1474775 1473417 1465248 1451006
50246A451006j7824j8924j8999j9003j8488j6785j4263j1753r320o429l054J40
$$ 1451006 1433182 1414258 1395259 1376256 1357768 1340983 1326720 1314967 1305647 1299218 1296164 1296304
50234A296304K574L995M122K978J570J132J450J041n88k013k019j575k513m971
$$ 1296304 1298878 1302873 1306995 1309973 1311543 1312675 1314125 1315166 1314578 1312565 1310546 1308971 1306458 1301487
50220A301487p377q679r289r872j0417j0736j0943j1107j1107j1128j1604j2490
$$ 1301487 1294110 1285431 1276142 1266270 1255853 1245117 1234174 1223067 1211960 1200832 1189228 1176738
50208A176738j3183j3357j3314j3192j2576j1317j0103r669r722r259p780n783
$$ 1176738 1163555 1150198 1136884 1123692 1111116 1099799 1089696 1080027 1070305 1061046 1053266 1047483
50196A047483m099l121k673k329j806j072j33J136K765M402N578O316P211Q712
$$ 1047483 1043384 1040263 1037590 1035261 1033455 1032383 1032250 1033386 1036151 1040553 1046131 1052447 1059658 1068370
50182A068370J0587J2257J3637J5344J8019K1397K4292K5826K6618K8216L1175
$$ 1068370 1078957 1091214 1104851 1120195 1138214 1159611 1183903 1209729 1236347 1264563 1295738
50171A295738L4266L6101L6919L7914L9216L9669L8679L7134L6056L5302L4212
$$ 1295738 1330004 1366105 1403024 1440938 1480154 1519823 1558502 1595636 1631692 1666994 1701206
50160A701206L2807L1516L0180K8179K5337K1993J8130J3094O376j648r856j7174
$$ 1701206 1734013 1765529 1795709 1823888 1849225 1871218 1889348 1902442 1908818 1907170 1897314 1880140
50148A880140k3175k8129l2457l6153l8852m0378m0921m0588l9262l7074l4584
$$ 1880140 1856965 1828836 1796379 1760226 1721374 1680996 1640075 1599487 1560225 1523151 1488567
50137A488567l2105k9254k5596k1470j7624j4386j1771j0188j0226j1625j3202
$$ 1488567 1456462 1427208 1401612 1380142 1362518 1348132 1336361 1326173 1315947 1304322 1291120
50126A291120j4124j4725j5733j7052j7759j7132j5313j3089j1267j0209r746
$$ 1291120 1276996 1262271 1246538 1229486 1211727 1194595 1179282 1166193 1154926 1144717 1134971
50115A134971r511r391r488r603r104p611n683m290l654l050j920p21k57m63l70
$$ 1134971 1125460 1116069 1106581 1096978 1087874 1080263 1074580 1070290 1066636 1063586 1061666 1060945 1060688 1060225 1059855
50100A059855O48K146L204L457L280L197L438L876M153L953L467L421M344N876
$$ 1059855 1060503 1062649 1065853 1069310 1072590 1075787 1079225 1083101 1087254 1091207 1094674 1098095 1102439 1108315
50086A108315P167P920Q629R758J1143J2353J3211J3658J3562J3028J2687J3195
$$ 1108315 1115482 1123402 1132031 1141789 1152932 1165285 1178496 1192154 1205716 1218744 1231431 1244626
50074A244626J4540J6197J7837J9527K1285K2882K4196K5426K6803K8277K9675
$$ 1244626 1259166 1275363 1293200 1312727 1334012 1356894 1381090 1406516 1433319 1461596 1491271
50063A491271L0940L2110L3198L4290L5643L7492L9812M2356M4889M7300M9503
$$ 1491271 1522211 1554321 1587519 1621809 1657452 1694944 1734756 1777112 1822001 1869301 1918804
50052A918804N1424N3074N4548N5886N6956N7562N7665N7467N7261N7144N6938
$$ 1918804 1970228 2023302 2077850 2133736 2190692 2248254 2305919 2363386 2420647 2477791 2534729
50041B534729N6384N5309N3516N0504M5555L8182K8491J7032M467q367k0299l0194
$$ 2534729 2591113 2646422 2699938 2750442 2795997 2834179 2862670 2879702 2884169 2875802 2855503 2825309
50029B825309l7755m3661m8646n2602n4900n5449n4989n4336n3740n3046n2039
$$ 2825309 2787554 2743893 2695247 2642645 2587745 2532296 2477307 2422971 2369231 2316185 2264146
50018B264146n0369m7602m3766l9641l6234l4099l3410l4321l6616l9196m0562
$$ 2264146 2213777 2166175 2122409 2082768 2046534 2012435 1979025 1944704 1908088 1868892 1828330
50007A828330m0028l8066l5438l2503k9572k7229k5718k4312k1876j8074j3614
$$ 1828330 1788302 1750236 1714798 1682295 1652723 1625494 1599776 1575464 1553588 1535514 1521900
49996A521900r318n393j689J713M389N844N707L841O27k867n349o265o296o812
$$ 1521900 1512582 1507189 1505500 1507213 1511602 1517446 1523153 1526994 1527621 1524754 1519405 1513140 1506844 1500032
49982A500032q706j1785j5131j7823j9318j9390j8121j5936j3462j1129q966o811
$$ 1500032 1491326 1479541 1464410 1446587 1427269 1407879 1389758 1373822 1360360 1349231 1340265 1333454
49970A333454m640k654j038L26J830L709N687P238Q227R079J0163J1281J2077
$$ 1333454 1328814 1326160 1325122 1325448 1327278 1330987 1336674 1343912 1352139 1361218 1371381 1382662 1394739
49957A394739J2794J4136J6445J9255K1899K4182K6342K8477L0264L1233L1257
$$ 1394739 1407533 1421669 1438114 1457369 1479268 1503450 1529792 1558269 1588533 1619766 1651023
$$ [...]
##END NTUPLES=NMR SPECTRUM
##END=
