##TITLE=AC1520_ROEFFECT0004_8213724_yqawQJwKAI
##JCAMPDX= 6.0         $$ Bruker NMR JCAMP-DX V2.0
##DATA TYPE= NMR SPECTRUM
##DATA CLASS= NTUPLES
##ORIGIN= BRUKER
##OWNER= Administrator
$$ 1.72 TOPSPIN		Version 2.1
$$ 2013-10-04 17:44:25.690 -0700  Administrator@X
$$ Compression mode = diff/dup
##.OBSERVE FREQUENCY= 400.02188249412
##.OBSERVE NUCLEUS= ^1H
##.ACQUISITION MODE= SIMULTANEOUS (DQD)
##.ACQUISITION SCHEME= undefined
##.AVERAGES= 8
##.DIGITISER RES= 22
##SPECTROMETER/DATA SYSTEM= spect
##.PULSE SEQUENCE= zg30
##.SOLVENT NAME= COFFEE_meoh
##.SHIFT REFERENCE= INTERNAL, COFFEE_meoh, 1, 14.98509
##AUDIT TRAIL= $$ (NUMBER, WHEN, WHO, WHERE, PROCESS, VERSION, WHAT)
$$ ##TITLE= Audit trail, TOPSPIN		Version 2.1
$$ ##JCAMPDX= 5.01
$$ ##ORIGIN= Bruker BioSpin GmbH
$$ ##OWNER= Administrator
$$ $$ E:\/data/COFFEE/nmr/AC1520_ROEFFECT0004_8213724_yqawQJwKAI/10/pdata/1/auditp.txt
$$ ##AUDIT TRAIL=  $$ (NUMBER, WHEN, WHO, WHERE, PROCESS, VERSION, WHAT)
(   1,<2013-10-04 17:44:19.206 -0700>,<Administrator>,<X>,<go>,<TOPSPIN 2.1>,
      <created by zg
	started at 2013-10-04 17:43:13.550 -0700,
	POWCHK enabled, PULCHK disabled,
       configuration hash MD5:
       C8 4E 4E 5D D3 5C D8 9E 9F 52 82 E0 59 8A DE 15
       data hash MD5: 64K
       E3 DC 76 99 82 B7 F3 D4 F7 13 0F 6E 9D 86 CF 8D>)
(   2,<2013-10-04 17:44:22.128 -0700>,<Administrator>,<X>,<proc1d>,<TOPSPIN 2.1>,
      <Start of raw data processing
       efp LB = 0 FT_mod = 6 PKNL = 1 PHC0 = 0 PHC1 = 0 SI = 32K 
       data hash MD5: 32K
       08 58 70 11 B2 69 12 C2 4E 81 E4 B5 3C A9 C1 05>)
(   3,<2013-10-04 17:44:22.487 -0700>,<Administrator>,<X>,<proc1d>,<TOPSPIN 2.1>,
      <pk PHC0 = 98.12439 PHC1 = 0 
       data hash MD5: 32K
       0C E5 50 FC DB 83 C9 A4 FA 38 86 88 95 0E 69 1D>)
(   4,<2013-10-04 17:44:22.581 -0700>,<Administrator>,<X>,<proc1d>,<TOPSPIN 2.1>,
      <abs ABSG = 1 
       data hash MD5: 32K
       C2 B9 6C 47 EF 27 85 10 B7 5E 1F D3 9F 5E 3C 43>)
(   5,<2013-10-04 17:44:22.628 -0700>,<Administrator>,<X>,<proc1d>,<TOPSPIN 2.1>,
      <abs ABSG = 2 
       data hash MD5: 32K
       2F B8 30 B2 6E 07 1D 22 34 8D EC F9 A0 FF 65 10>)
(   6,<2013-10-04 17:44:22.690 -0700>,<Administrator>,<X>,<proc1d>,<TOPSPIN 2.1>,
      <abs ABSG = 3 
       data hash MD5: 32K
       A2 DA 08 80 01 F7 5F CF 32 7C EE 5B 46 9F AC 04>)
(   7,<2013-10-04 17:44:22.753 -0700>,<Administrator>,<X>,<proc1d>,<TOPSPIN 2.1>,
      <abs ABSG = 4 
       data hash MD5: 32K
       9B 88 10 70 22 65 24 24 6B 84 C7 66 04 D6 76 61>)
(   8,<2013-10-04 17:44:22.800 -0700>,<Administrator>,<X>,<proc1d>,<TOPSPIN 2.1>,
      <abs ABSG = 5 
       data hash MD5: 32K
       00 94 AF 39 D0 87 42 40 B7 69 1C B5 BC 23 E3 D9>)
$$ ##END=
$$ 
$$ $$ hash MD5
$$ $$ F6 ED 82 73 3D DD 50 B1 8B 8F A0 F4 48 9F 22 9C
##$RELAX= 
##$RELAX= 
##$RELAX= 
##$RELAX= 
##$RELAX= 
##$RELAX= 
##$RELAX= 
$$ Bruker specific parameters
$$ --------------------------
##$DU= <E:\>
##$EXPNO= 10
$$ [...]
150 150 150 150 150 150 150 150
##$TP07= 0
##$TPNAME0= <>
##$TPNAME1= <>
##$TPNAME2= <>
##$TPNAME3= <>
##$TPNAME4= <>
##$TPNAME5= <>
##$TPNAME6= <>
##$TPNAME7= <>
##$TPOAL= (0..7)
0.5 0.5 0.5 0.5 0.5 0.5 0.5 0.5
##$TPOFFS= (0..7)
0 0 0 0 0 0 0 0
##$TUNHIN= 0
##$TUNHOUT= 0
##$TUNXOUT= 0
##$USERA1= <user>
##$USERA2= <user>
##$USERA3= <user>
##$USERA4= <user>
##$USERA5= <user>
##$V9= 5
##$VALIST= <valist>
##$VCLIST= <CCCCCCCCCCCCCCC>
##$VD= 0
##$VDLIST= <DDDDDDDDDDDDDDD>
##$VPLIST= <PPPPPPPPPPPPPPP>
##$VTLIST= <TTTTTTTTTTTTTTT>
##$WBST= 2048
##$WBSW= 25
##$XGAIN= (0..3)
0 0 0 0
##$XL= 0
##$YL= 0
##$YMAX_a= 641981
##$YMIN_a= -546417
##$ZGOPTNS= <>
##$ZL1= 120
##$ZL2= 120
##$ZL3= 120
##$ZL4= 120
##$ABSF1= 14.98509
##$ABSF2= -5.573092
##$ABSG= 5
##$ABSL= 3
##$ALPHA= 0
##$AQORDER= 0
##$ASSFAC= 0
##$ASSFACI= 0
##$ASSFACX= 0
##$ASSWID= 0
##$AUNMP= <proc_prof1d_extract_pilot.lims>
##$AXLEFT= 0
##$AXNAME= <>
##$AXNUC= <1H>
##$AXRIGHT= 0
##$AXTYPE= 0
##$AXUNIT= <>
##$AZFE= 0.1
##$AZFW= 0.1
##$BCFW= 0
##$BC_mod= 0
##$BYTORDP= 0
##$COROFFS= 0
##$CY= 15
##$DATMOD= 1
##$DC= 0
##$DFILT= <>
##$DTYPP= 0
##$F1P= 0
##$F2P= 0
##$FCOR= 0.5
##$FTSIZE= 32768
##$FT_mod= 6
##$GAMMA= 0
##$GB= 0
##$INTBC= 1
##$INTSCL= 1
##$ISEN= 128
##$LB= 0
##$LEV0= 0
##$LPBIN= 0
##$MAXI= 10000
##$MC2= 0
##$MEAN= 0
##$ME_mod= 0
##$MI= 0
##$NCOEF= 0
##$NC_proc= -8
##$NLEV= 6
##$NOISF1= 0
##$NOISF2= 0
##$NSP= 0
##$NTH_PI= 0
##$NZP= 0
##$OFFSET= 14.98509
##$PC= 1
##$PHC0= 98.12439
##$PHC1= 0
##$PH_mod= 1
##$PKNL= yes
##$PPARMOD= 0
##$PPDIAG= 0
##$PPIPTYP= 0
##$PPMPNUM= 2147483647
##$PPRESOL= 1
##$PSCAL= 4
##$PSIGN= 0
##$PYNMP= <proc.py>
##$REVERSE= no
##$SF= 400.02
##$SI= 32768
##$SIGF1= 0
##$SIGF2= 0
##$SINO= 400
##$SIOLD= 32768
##$SPECTYP= <>
##$SREGLST= <1H.CDCl3>
##$SSB= 0
##$STSI= 32768
##$STSR= 0
##$SW_p= 8223.68421052631
##$SYMM= 0
##$S_DEV= 0
##$TDeff= 65536
##$TDoff= 0
##$TI= <>
##$TILT= no
##$TM1= 0
##$TM2= 0
##$TOPLEV= 0
##$USERP1= <user>
##$USERP2= <user>
##$USERP3= <user>
##$USERP4= <user>
##$USERP5= <user>
##$WDW= 1
##$XDIM= 32768
##$YMAX_p= 450611124
##$YMIN_p= -689501
##$CURPLOT= <Network HP LaserJet P1505>
##$CURPRIN= <$Network HP LaserJet P1505>
##$DFORMAT= <normdp>
##$LAYOUT= <+/1D_H.xwp>
##$LFORMAT= <normlp>
##$PFORMAT= <normpl>
##$SURQMSG= 1
$$ End of Bruker specific parameters
$$ ---------------------------------
##NTUPLES= NMR SPECTRUM
##VAR_NAME=  FREQUENCY,     SPECTRUM/REAL,   SPECTRUM/IMAG
##SYMBOL=    X,             R,               I
##VAR_TYPE=  INDEPENDENT,   DEPENDENT,       DEPENDENT
##VAR_FORM=  AFFN,          ASDF,            ASDF
##VAR_DIM=   32768,         32768,           32768
##UNITS=     HZ,            ARBITRARY UNITS, ARBITRARY UNITS
##FACTOR=    0.250966925370066, 1,           1
##FIRST=     8223.43324360094, -63111,       -114079
##LAST=      0,             -137967,         13492
##MIN=       0,             -689501,         0
##MAX=       8223.43324360094, 450611124,    0
$$ Real data points
##PAGE= N=1
##DATA TABLE= (X++(R..R)), XYDATA
$$ [...]
$$ plain form
19560 -269022 58731 -41253 -148923 22389 -295732 239388 164273 -116713 -126735 7803 37073
19549 37073 10771 -46400 -22810 -123798 54381 -221101 -70118 -98630 4722 -60327 -15840
19537 -62121 -213304 298822 -407513 42340 283435 -150367 126251 -295437 -43850 323887
19526 -85917 -217363 -128388 -251162 -171186 -254896 -62192 111661 -434531 123245 -227563
19515 237241 -11915 -209268 -140999 62508 -153515 139978 -190181 236677 -30210 -116361
19505 -116361 -78606 -200995 -367426 69954 -281391 -172573 268586 -176084 -32025 -109005
19495 -109005 -263953 31393 93291 -148729 -66783 103315 131646 25999 -145933 -31398 239353
19483 10635 -11181 37006 -18767 84630 -330188 218462 -34426 -13279 25315 -192639 -135065
$$ packed form
19560b69022E8731d1253j07670B2389b95732B39388p5115a16713j0022G803K9270
19549C7073A0771d6400b2810j00988E4381b21101g0118k8512D722f0327a5840
19537f2121j51183B98822d07513D2340K41095a50367A26251b95437d3850C23887
19526h5917j31446Q8975j22774P9976q3710f2192A11661d34531A23245b27563
19515B37241a1915j97353O8269F2508a53515A39978a90181B36677c0210q6151
19505a16361L7755j22389j66431F9954b81391J08818B68586a76084c2025p6980
19495a09005j54948C1393O1898a48729f6783A03315K8331B5999a45933c1398B39353
19483A0635a1181C7006a8767H4630c30188B18462c4426a3279B5315a92639N7574
$$ plain form
19472 -135065 -182040 334591 -157726 189579 -52594 5523 -58626 1658 -1961 -223974 -332335
19461 -332335 -218169 -241465 -485331 -130185 -208126 -32015 -129791 -245071 13354 -228409
19450 198108 -33538 -36970 -68434 -168960 -256436 -172334 -121795 -211591 -71533 -370318 336398
19438 -57392 -118017 -11558 104926 -122276 123705 -243816 240580 -8528 -4829 -115852 37536
19426 37286 -93057 61096 -349616 -251666 -14355 125986 163670 134170 -234809 -375808 -71528
19414 -2093 255881 -114491 60149 33682 167837 -154223 -181284 -261609 -274210 -286065 -179478
19403 -179478 -310670 -157542 -30812 -120549 37217 -97099 95950 823 138139 -304595 8403
19391 -393232 -252586 -442388 -158808 -400431 35964 -266342 -377777 -23792 -345454 86771
$$ packed form
19472a35065m6975C34591a57726A89579e2594E523e8626A658a961k22013j08361
19461c32335J14166k3296k43866a30185p7941c2015r7776j15280A3354b28409
19450A98108c3538l432l1464j00526q7476Q4102N0539q9796g1533k98785C36398
19438e7392o0625a1558A04926a22276A23705b43816B40580h528L699j11023C7536
19426C7286i3057F1096c49616R7950a4355A25986L7684k9500b34809j40999g1528
19414b093B55881a14491F0149k6467J34155a54223k7061q0325j2601j1855J06587
19403a79478j31192J53128c0812q9737C7217i7099I5950H23J37316c04595H403
19391c93232J40646j89802a58808k41623C5964b66342j11435b3792l21662H6771
$$ plain form
19380 -94307 78534 -255406 -173520 162752 -48838 -208969 -17123 -192024 -106394 5046 -7673
19368 171551 94031 -288401 130206 -304366 -67613 -169635 -42183 24747 55275 479391
19358 479391 110501 -68784 111186 244257 -241052 45798 -134084 -33220 97120 -23369
19347 -344542 -126251 131556 46278 -138130 -89624 -38172 86190 -80013 -265816 77687 -170333
19335 259596 -84871 -190780 -160340 -308 101740 -86488 -176186 -47659 319874 3972 99515
19324 99515 -82865 -159245 135698 51414 79483 133975 94034 -97979 -42094 -280969 35142
19312 -202906 209685 120684 -63578 230136 -96673 -79141 59354 -46365 -22537 -127255 -221625
19301 -221625 -73534 67302 -281189 -306122 25143 -33328 -240321 -294815 -323081 -289788 -239512
$$ packed form
19380i4307G8534b55406Q1886A62752d8838j60131a7123j74901Q5630E046g673
19368A71551p7520b88401A30206c04366f7613j02022d2183B4747L0528M24116
19358D79391A10501f8784A11186J33071b41052D5798a34084c3220I7120b3369
19347c44542a26251A31556D6278a38130M8506c8172H6190h0013j85803G7687a70333
19335B59596h4871j05909L0440c08A01740h6488q9698d7659C19874C972R5543
19324I9515h2865p6380A35698E1414K8069N4492l9941i7979d2094k38875C5142
19312b02906B09685q9001f3578B30136i6673J7532E9354d6365b2537j04718r4370
19301b21625g3534F7302b81189k4933B5143c3328k06993n4494k8266L3293N0276
$$ plain form
19290 -239512 355848 2280 11704 368132 237540 8616 -135214 189157 -9203 -62833 -192674
19279 -192674 -169997 -106645 -267597 -58913 -121147 -15462 -60767 -247009 -36197 -20177 25657
19267 -25865 49279 379382 -292016 -247847 7038 -18522 19721 -200543 -7960 46220 -106735
19255 64507 52915 -74083 -91891 115777 -228697 -179299 -10628 -173554 -38806 -54433 -276887
19244 -276887 149996 -144820 81390 -127942 -302933 46150 -169492 -1177 -137556 -16156
19233 -142493 -186031 -93442 -125789 -119374 -8739 152686 60491 46087 -180338 -70512 -259300
19222 -259300 116507 -181641 -158130 -213246 -152201 -217663 91339 186793 -129092 -282807 6608
19210 -6527 -274256 85457 120357 74222 87148 -77186 68365 -207159 42232 230500 291888
$$ packed form
19290b39512C55848B280R424L56428j30592H616a35214A89157i203n3630j29841
19279a92674K2677O3352j60952e8913o2234a5462m5305j86242c6197J6020B5657
19267b5865D9279L30103b92016M4169G038a8522A9721b00543g960D6220a06735
19255F4507j1592g4083j7808A15777b28697M9398a0628j62926c8806j5627k22454
19244b76887A49996a44820H1390a27942j74991D6150a69492a177j36379a6156
19233a42493m3538R2589l2347O415h739A52686F0491j4404a80338g0512j88788
19222b59300A16507a81641K3511n5116O1045o5462I1339R5454a29092j53715F608
19210f527k67729H5457L4900m6135J2926g7186F8365b07159D2232J88268O1388
$$ plain form
19199 291888 -191134 -561085 190647 -115011 -127405 141202 -277677 -46330 163548 -611902
19188 -8723 -24946 49953 -117417 -183015 -434346 -51857 -94206 264312 81764 -122680 -35732
19176 -7453 17264 90699 83212 -80945 67765 -169564 6648 -54299 -77137 224660 -258188 -162000
19164 -162000 168341 -237693 -183963 -34388 -108662 -77875 -429550 85907 -289918 259993
19153 -27897 -285657 -333447 28767 -108639 183607 112865 86984 -107032 -269660 -247587 8806
19141 -51262 415632 -103472 -57763 104480 -168205 -75542 68827 -231916 148831 64611
19130 58803 -334479 -59547 -108927 89822 -423542 60701 13431 -16189 -21029 -222291 -184683
19119 -184683 347025 454919 210120 -211016 188278 -83494 -76228 -185236 -192894 -295150
$$ packed form
19199B91888a91134l69951A90647a15011j2394A41202b77677d6330A63548f11902
19188h723j6223D9953a17417o5598k51331e1857m2349B64312H1764a22680c5732
19176g453A7264P3435p487h0945F7765a69564F648e4299k2838B24660b58188R6188
19164a62000A68341b37693N3730c4388p4274L0787l51675H5907b89918B59993
19153b7897k57760m7790B8767a08639A83607p0742k5881a07032j62628K2073H806
19141e1262D15632a03472M5709A04480a68205g5542F8827b31916A48831F4611
19130E8803c34479e9547m9380H9822d23542F0701A3431a6189m840k01262L7608
19119a84683C47025J07894B10120b11016A88278h3494P266j09008p658j02256
$$ plain form
19109 -295150 -31938 -75548 -289513 -115323 -176120 50333 104464 153959 129150 159621 87381
19098 87381 -148172 214398 113725 -247221 -212881 111153 90205 56139 -403395 57315
19087 -201742 -41536 -44058 32332 -88228 -176213 -86600 -359433 -86781 -183768 48551 -145264
19075 28326 -30991 65936 113834 -124967 -218262 42969 -27738 42156 -102485 72530 -14156
19063 -236614 -255206 105861 -69802 44075 146636 -258300 138342 29383 91883 -11538 9285
19051 -223963 -99181 -410249 -254201 -97599 -55519 134445 -134192 44004 32658 -255225
19040 -233664 -127020 -139936 3918 11892 214054 170004 233289 317053 31875 -97671 114013
19028 424183 -7533 -179893 91630 -87206 24521 -178775 -241000 84125 199794 212983 164465
$$ packed form
19109b95150c1938m3610k13965a15323o0797E0333N4131M9495k4809L0471p2240
19098H7381a48172B14398j00673b47221L4340A11153k0948l4066d03395E7315
19087b01742d1536k522C2332h8228q7985h6600k72833h6781r6987D8551a45264
19075B8326c0991F5936M7898a24967r3295D2969b7738D2156a02485G2530a4156
19063b36614j8592A05861f9802D4075J02561b58300A38342B9383O2500a1538I285
19051b23963i9181l11068J56048i7599M2080A34445a34192D4004j1346b55225
19040b33664J06644j2916C918P974K02162m4050O3285Q3764C1875i7671A14013
19028D24183g533j72360I1630h7206B4521a78775o2225H4125J15669J3189m8518
$$ plain form
19017 164465 294703 78775 -128967 -73085 -1989 47353 -89999 44651 119476 252578 -174583
19005 -65419 176228 -309050 111334 38001 -46330 15560 24377 114563 126391 -125407 119639
18993 257235 -93174 -6657 -174426 -36976 23192 60576 -232719 -235722 110070 15235 -8307
18981 -149277 133795 -306576 -71024 72509 -216937 -215383 217833 34224 -31008 13898 76053
18970 76053 -207046 -216094 -41235 184312 51799 132903 198347 -194946 87306 -58601 -282616
18959 -282616 36295 -126638 10137 -89187 -108284 316803 -138450 -4684 -122506 -72783 -96181
18948 -96181 179382 50550 35366 203656 -337329 247857 -32501 62091 -262325 -140230
18938 -140230 155713 190929 -157935 -519181 -250373 255044 -385489 -8204 -195232 -131294
$$ packed form
19017A64465J30238G8775a28967N5882a989D7353h9999D4651P4825J33102a74583
19005f5419A76228c09050A11334C8001d6330A5560Q817R0186J1828a25407A19639
18993B57235i3174f657j67769c6976B3192L7384b32719l003A10070A5235h307
18981a49277A33795c06576g1024G2509b16937J554B17833C4224c1008A3898O2155
18970G6053b07046r048d1235A84312E1799Q1104O5444a94946H7306e8601k24015
18959b82616C6295a26638A0137h9187j9097C16803a38450d684j17822M9723k3398
18948i6181A79382E0550j5184J68290c37329B47857c2501F2091b62325J22095
18938a40230A55713L5216a57935l61246b50373B55044c85489h204j87028O3938
$$ plain form
18928 -131294 113944 -68340 -120096 -113724 88421 -59062 126531 -63660 -364151 -229545 200213
18916 79433 87923 -244582 22260 200262 -260972 -317425 -195958 187520 20912 132817 -297808
18904 -418181 144512 74993 36896 -190095 165969 -207845 -96232 171176 -192737 -118319
18894 -118319 -86086 -282324 108186 70921 -349453 -219533 -47623 1959 108141 59353 182833
18883 182833 319731 -270293 60927 -301711 242903 -404453 108266 -340807 113849 35209
18872 315715 -212701 -227279 208961 -77841 68698 93258 -96792 -159240 -60417 -172912 -140538
18861 -140538 -66409 -97705 134233 -42590 129411 -112154 -178939 89876 -292573 -186226
18851 -186226 -164620 -80714 243841 56347 -98034 107997 69822 -160891 -69053 -121987 -99957
$$ packed form
18928a31294A13944f8340n1756O372H8421e9062A26531f3660l00491J34606B00213
18916G9433Q490b44582B2260J78002b60972n6453J21467A87520B0912J11905b97808
18904d18181A44512o9519C6896a90095A65969b07845i6232A71176a92737P4418
18894a18319L2233j96238A08186l7265c49453J29920d7623A959J06182m8788J23480
18883A82833J36898b70293F0927c01711B42903d04453A08266c40807A13849C5209
18872C15715b12701j4578B08961g7841F8698K4560i6792o2448f0417j12495L2374
18861a40538f6409l1296A34233d2590A29411a12154o6785H9876b92573J06347
18851a86226K1606h0714B43841E6347i8034A07997l8175a60891f9053n2934K2030
$$ plain form
18840 -99957 -225492 -191758 -231601 -197731 35363 -13111 74987 38604 198342 94131 -402207
18828 55462 -392025 81787 -4238 -533749 152555 -263131 -80190 81983 -62661 10107 -116553
18816 390870 100566 306867 -315696 -67311 16811 190009 126208 249947 34614 80262
18806 80262 50887 5971 -104856 349018 172778 -49109 -163776 -236082 -130276 310178 -288502
18794 -114644 -58658 -255444 132076 -28614 -75385 75757 -50888 127700 -40162 -52757 -15483
18782 -77729 73296 26394 217678 -167746 122262 -84603 180798 205913 -170962 -160802 -170549
18771 -170549 -44737 -168033 -171451 -110170 -146758 -390970 -148616 56666 -70443 -354350 -126493
18759 -31155 169410 1872 334610 -43437 -140134 -97893 -164364 192300 -210863 -265752 53940
$$ packed form
18840i9957j25535L3734l9843L3870C5363a3111G4987l6383J59738I4131d02207
18828E5462c92025H1787d238n29511A52555b63131h0190H1983f2661A0107a16553
18816C90870A00566K06301c15696f7311A6811J73198o3801J23739C4614M5648
18806H0262k9375E971a04856C49018A72778d9109j14667p2306J05806C10178b88502
18794a14644N5986j96786A32076b8614m6771G5757e0888A27700d0162j2595a5483
18782g7729G3296B6394J91284a67746A22262h4603A80798K5115a70962J0160r747
18771a70549d4737j23296l418O1281l6588k44212a48616E6666g0443k83907a26493
18759c1155A69410A872L32738d3437r6697M2241o6471A92300b10863n4889E3940
$$ plain form
18747 1241 -174065 -4214 115988 -75685 37421 253159 -32116 -70119 313314 -345152 -170927
18735 -142956 105499 -221292 -113389 -228167 -97735 -168609 -200585 -216186 -404470 -341736
18725 -341736 -179614 -341240 114465 -198844 -141610 138939 74336 -305878 -348211 8010
18714 -161889 -93091 51705 -258542 -171191 -159822 -296968 353311 -233224 -25575 -92224 480497
18702 -185769 -102016 75102 391865 86980 4707 63198 -32755 -18938 50265 -155646 113946
18690 -90021 35703 -352773 12185 -188043 165449 7980 -3491 -178392 -15879 46948 -155169
18678 -73924 -92608 123802 -183242 31974 -43946 -44312 214690 -204252 -174389 -220123 -36355
18666 -322294 -141276 32383 5318 -232947 74583 -167394 58599 351211 -250812 -291688 -52874
$$ packed form
18747A241a74065d214A15988g5685C7421K15738c2116l8003C13314c45152a70927
18735a42956A05499b21292J07903j14778i7735p0874l1976j5601j88284O2734
18725c41736J62122j61626A14465a98844N7234A38939o4603c05878m2333H010
18714a61889O8798E1705b58542Q7351J1369j37146C53311b33224b5575o6649D80497
18702a85769Q3753G5102L16763H6980D707N8491c2755J3817E0265a55646A13946
18690i0021C5703c52773A2185a88043A65449G980c491j74901a5879D6948a55169
18678g3924j8684A23802a83242C1974d3946l66B14690b04252K9863m5734c6355
18666c22294a41276C2383E318b32947G4583a67394E8599K92612b50812m0876e2874
$$ plain form
18654 -168239 -127494 -124439 -75152 -60212 -266879 -26438 -159127 -145900 -246871 201226 152093
18643 152093 -25114 21241 -202435 -268041 154990 -148919 67 -92666 -123870 -280934 26750
18631 -221824 262760 -24464 85726 31531 -309112 147385 -113305 -781 31043 -340398 -381238
18620 -381238 -273960 -4076 89390 -183979 50534 -162931 20144 93679 81069 200393 -31430
18608 -21438 -105664 243074 -199761 -71467 83417 278265 -172739 -404098 -51838 -352935
18598 -352935 -199586 -120190 131053 -136809 233867 61892 169302 22119 -41904 30687
18587 -79626 72890 -41094 -263623 -100704 -203881 244739 15432 191191 -198788 -163470
18577 -163470 -124002 -190437 -306455 -52358 210709 -6052 -156465 10200 14397 -19233 -10402
$$ packed form
18654a68239M0745L055M9287J4940k06667b6438j32689J3227j00971B01226m9133
18643A52093b5114B1241b02435o5606A54990a48919F7i2666l1204j57064B6750
18631b21824B62760b4464H5726C1531c09112A47385a13305g81C1043c40398m0840
18620c81238J07278d076H9390a83979E0534a62931B0144P3535j2610J19324c1430
18608b1438q4226B43074a99761g1467H3417J94848a72739k31359e1838l01097
18598c52935J53349P9396A31053a36809B33867F1892J07410B2119d1904C0687
18587g9626G2890d1094k22529a00704j03177B44739A5432J75759a98788L5318
18577a63470L9468o6435j16018e2358B10709f052j50413A0200M197a9233Q831
$$ plain form
18566 -10402 16819 210016 6595 -36018 -281126 -514178 -285565 -132262 -325832 -163667
18556 -163667 -253298 -527171 247956 -34278 -166544 -233039 -38582 108303 -192223 23905
18545 -135009 134785 -174188 -299924 -394380 186562 9807 51371 -231127 -200425 -257064 -53848
18533 -155401 -227649 46339 -98289 -12422 149329 72451 -104601 -95555 68010 -75201 36830
18521 106858 -158504 -67122 -227753 56192 66849 -54186 -78615 -91803 161439 55289 155110
18510 155110 258094 -340447 -84798 -46263 -71414 -28038 380744 -40569 -144134 -171469 -286916
18499 -286916 30294 -221736 -274643 6457 -184363 72483 57349 -69791 119254 -168170 188754
18487 -210856 -133372 176692 -401004 76120 19220 55907 30865 449942 -118928 -91488 -265967
$$ packed form
18566a0402A6819J93197F595c6018k45108k33052K28613a32262j93570J62165
18556a63667q9631k73873B47956c4278j32266o6495c8582A08303a92223B3905
18545a35009A34785a74188j25736r4456A86562I807M1564b31127L0702n6639e3848
18533a55401p2248D6339i8289a2422A49329G2451a04601R046F8010g5201C6830
18521A06858a58504f7122j60631E6192J0657e4186k4429j3188A61439E5289R9821
18510A55110J02984c40447h4798L8535k5151b8038C80744d0569j03565k7335j15447
18499b86916C0294b21736n2907F457a84363G2483j5134f9791A19254a68170A88754
18487b10856P7484A76692d01004G6120A9220L6687k5042M19077a18928K7440j74479
$$ plain form
18476 -265967 -174543 -216030 -271222 -80475 205162 -90422 -99681 119197 -71697 52789 -273752
18464 56128 -6875 -13064 -327274 -190012 -443890 -447563 -147049 -353610 91582 31972 -204572
18452 -202478 118235 43025 14465 41604 -399643 108489 176992 -211598 -239194 100440
18441 -156529 -16365 15072 300312 94877 -145468 -74719 -34827 110175 132631 82465 -151676
18429 147651 2169 92591 102267 -42969 -54426 2406 100623 -137462 -94121 -148560 -125015 -154201
18417 -154201 17717 380477 7013 -166779 -94155 -76612 -232419 33018 102507 108976 95144
18406 95144 88912 -82352 98416 -41181 -130897 185153 -250359 -150817 55693 -173422 256393
18394 -30047 -201205 -376461 56142 -334851 -190203 -55361 -173834 -124742 -62039 -73171 -96172
$$ packed form
18476b65967R1424m1487n5192h0475B05162i0422r259A19197g1697E2789b73752
18464E6128f875o189l14210J37262k53878l673a47049k06561I1582C1972b04572
18452b02478A18235D3025A4465K7139c99643A08489O8503b11598k7596A00440
18441a56529a6365A5072K85240I4877a45468P0749c4827A10175K2456n0166a51676
18429A47651B169R0422R676d2969j1457B406R8217a37462M3341n4439K3545k9186
18417a54201A7717L62760G013a66779P2624J7543j55807C3018O9489O469j3832
18406I5144o232h2352I8416d1181q9716A85153b50359R9542E5693a73422B56393
18394c0047j71158j75256E6142c34851J44648e5361j18473M9092f2039j1132k3001
$$ plain form
18383 -96172 -202450 -279309 -378246 84887 -67619 71168 175896 -115622 -173183 -202974 -169514
18372 -169514 141377 196082 -387380 -148085 -136816 -110150 16315 -13385 42547 75612 147310
18361 147310 92015 -118480 -14361 -354581 -232598 -44227 -2430 -296857 247216 -141185
18350 215816 -214960 -49060 -111732 76351 177940 166561 -154155 28001 -132163 -148368 -28201
18338 36685 -133591 122621 -412358 -90366 -99766 -90863 274291 61073 -308266 -181996 -84240
18326 84608 -103019 -75531 23808 10155 107378 70006 -376160 126507 -154427 -88550 -107082
18315 -107082 61943 115131 -4270 -19210 -46218 137157 111216 -127966 -247928 -40283 56107
18303 -295900 67902 -150939 -170772 -335026 113762 -141404 -124687 -131709 23425 140409 47581
$$ packed form
18383i6172j06278p6859r8937H4887f7619G1168J04728a15622n7561k9791L3460
18372a69514A41377N4705c87380a48085J1269K6666A6315a3385D2547L3065P1698
18361A47310n5295a18480a4361l40220J21983d4227b430k94427B47216a41185
18350B15816b14960d9060o2672G6351J01589j1379a54155B8001a32163j6205b8201
18338C6685a33591A22621d12358i0366r400Q903B74291F1073c08266J26270h4240
18326H4608a03019K7488B3808A0155R7223l7372c76160A26507a54427O5877j8532
18315a07082F1943N3188d270j4940k7008A37157k5941a27966j19962d0283E6107
18303b95900F7902a50939j9833j64254A13762a41404J6717p022B3425J16984D7581
$$ plain form
18291 75002 30334 -222166 -44611 37346 -108262 312335 -240088 -31941 -137780 53101 -284112
18279 -141589 -31542 -100567 186126 130567 31007 -54867 -77082 -177596 -44799 62088 -77679
18267 142869 -7381 -92641 39993 -181235 -418908 -9676 57858 150457 -85835 99927 10286
18255 5156 24513 93632 127318 2443 -86401 -146062 146926 183251 126676 61528 -267789 40779
18242 -33653 -170480 -97655 194942 112281 87396 -99086 218878 -21671 223898 3595 314739
18231 314739 -120297 -404203 -5138 77039 202000 -174876 -234503 -288183 -32604 87203 -122793
18219 -252900 32248 109564 -106726 -33964 -128738 -257984 -6237 15590 -285514 -189106 -186400
18208 -186400 -13484 -24114 -203484 -125746 -115974 79352 9657 -29299 -262701 -49700 -120461
$$ packed form
18291G5002C0334b22166d4611C7346a08262C12335b40088c1941j05839E3101b84112
18279a41589c1542o9025A86126n5559C1007e4867k2215j00514d4799F2088g7679
18267A42869g381q5260C9993a81235k37673i676E7858R2599h5835I9927A0286
18255E156J9357O9119L3686B443h6401n9661A46926L6325n6575F1528b67789D0779
18242c3653j36827P2825A94942q2661k4885i9086B18878b1671B23898C595L11144
18231C14739a20297k83906e138G7039J24961a74876n9627n3680c2604H7203a22793
18219b52900C2248P7316a06726c3964r4774j29246f237A5590b85514R6408K706
18208a86400a3484j0630j79370P7738R772G9352I657b9299k33402d9700p0761
$$ plain form
18197 -120461 -190782 -54339 62718 -68023 -325258 202836 111725 64440 -240036 28093 79052
18186 79052 -148555 -66779 284345 -200789 -172301 -178574 73472 -164188 100919 19667 23083
18175 23083 32427 81975 -25311 168109 -191698 -86684 -206840 -66897 -234548 -43923 132322
18163 -383083 -220815 -179561 -231 -168247 150023 312403 -259751 -103525 -43327 -318749
18153 -318749 152415 -296830 -154716 -119652 -227322 47248 -213419 156616 127656 252922
18143 252922 113532 150002 -87110 169998 262394 -332809 19388 -196436 -85661 162228
18132 -88561 -354632 35714 -117995 277080 -28354 48565 321840 165628 128576 23086 -114232
18120 -124260 -274208 76136 45453 -245249 -46087 41588 -215188 -49169 -331237 14247 -36140
$$ packed form
18197a20461p0321e4339F2718f8023k57235B02836r1111m7285b40036B8093N0959
18186G9052a48555f6779B84345b00789K8488o273G3472a64188A00919A9667L416
18175B3083R344M9548b5311A68109a91698h6684j20156f6897j67651d3923A32322
18163c83083J62268M1254b31j68016A50023J62380b59751a03525d3327k75422
18153c18749A52415b96830J42114L5064j07670D7248b13419A56616k8960J25266
18143B52922A13532L6470h7110A69998R2396c32809A9388a96436h5661A62228
18132h8561k66071C5714a17995B77080b8354D8565K73275j56212l7052B3086a14232
18120a24260j49948G6136l0683b45249d6087D1588b15188d9169k82068A4247c6140
$$ plain form
18108 103280 113063 -436 -181665 -383253 -360439 173665 -229592 175355 -88389 -177158 -205110
18097 -205110 10308 18781 165465 -165456 -47798 -134989 214952 -87123 -89862 11981 -257939
18085 -145556 320132 -127737 53924 208588 80996 -4446 -20714 82657 -150354 -77783 62369
18073 107504 -7713 -72581 -115848 202155 -384158 281244 -142288 -171910 -121539 112526 -305549
18061 -338044 -52498 -94769 119288 -276639 -362238 -304856 73645 204209 -297539 38357 -56783
18049 -36469 -54660 14084 -88323 -53879 240747 131277 249222 12030 -257941 56413 25543
18037 -639 70370 -147966 -34000 -55254 79465 -15050 -45060 54176 -150962 -165340 25 26700
18025 26700 -31618 -149612 -96212 -195042 42883 66550 -257908 -284265 29819 -93608 105269
$$ packed form
18108A03280R783d36j81229k01588K2814A73665b29592A75355h8389q8769k7952
18097b05110A0308Q473J46684a65456d7798q7191B14952h7123k739A1981b57939
18085a45556C20132a27737E3924J54664H0996d446j6268H2657a50354P2571F2369
18073A07504g713o4868m3267B02155c84158B81244a42288k9622N0371A12526c05549
18061c38044e2498m2271A19288b76639q5599N7382G3645J30564b97539C8357e6783
18049c6469j8191A4084h8323L4444B40747j09470J17945A2030b57941E6413B5543
18037f39G0370a47966c4000k1254G9465a5050l0010E4176a50962j4378B5K6675
18025B6700c1618j17994N3400r8830D2883K3667b57908k6357B9819i3608A05269
$$ plain form
18013 -73218 259793 -268771 -68646 -404484 3680 64088 -73509 -19625 -76674 -32901 -335180
18002 -335180 -164454 137447 515122 -162196 -158745 67821 -19700 -57485 -48749 207129 -144596
17990 60207 -148867 -436239 -292492 -158154 352815 -196951 -208119 4483 183444 -30112
17979 48324 231790 -103927 94441 -394110 -103394 -50579 -120476 -93050 70756 29555 193563
17968 193563 -13214 152596 -72741 -76533 -170129 -104808 -23053 -168275 -202942 -146605 251947
17956 -268469 288478 -224495 166460 -222328 -42710 -68647 275696 -108596 71491 -151134
17945 98766 28039 -198996 20644 -38655 -40693 -271919 122449 -471653 -108091 -208024 -346608
17934 -346608 166570 -32697 172785 499916 217475 116830 802 -22929 -15704 -225282 -183132
$$ packed form
18013g3218B59793b68771f8646l35838C680O0408g3509a9625n7049c2901l02279
18002c35180a64454A37447L77675a62196L451F7821a9700l7785Q736B07129a44596
17990F0207a48867k87372J43747J34338C52815a96951j1168D483J78961c0112
17979D8324J83466a03927I4441c94110a03394e0579o9897K7426G0756B9555J64008
17968A93563a3214A52596g2741l792r3596O5321b3053j45222l4667N6337B51947
17956b68469B88478b24495A66460b22328d2710k5937B75696a08596G1491a51134
17945I8766B8039a98996B0644c8655k038k31226A22449d71653a08091r9933j38584
17934c46608A66570c2697A72785L27131B17475j00645H02b2929P225k09578M2150
$$ plain form
17923 -183132 48937 198521 -98943 113119 34442 -400288 -63496 380226 -2083 -92814 67732
17911 74574 -164596 -237690 983 32366 239685 99737 48081 147499 -166506 -39419 -212945
17900 -212945 -169227 17080 -65076 -176332 -142655 37358 3285 10423 -105467 -346664 167769
17888 -15948 44215 -57473 75259 326200 318067 -24175 146650 46154 -64666 -149291 -4840 -138873
17876 -138873 429341 149822 300024 23635 -132531 205157 259535 247993 122043 -198977
17865 -259662 -127417 -150388 -15746 -154736 -362062 29616 71028 42559 122983 67419 55928
17854 55928 -181305 15320 103642 -2265 296795 -70416 279996 55994 137224 48795 -218275
17842 24757 -5033 150596 65273 -189351 382315 92213 -182934 105167 -3481 282096 -228
$$ packed form
17923a83132D8937J49584i8943A13119C4442d00288f3496C80226b083r0731F7732
17911G4574a64596p3094I83L1383K07319I9737D8081R9418a66506c9419j73526
17900b12945M3718A7080f5076j11256L3677C7358C285P138a05467k41197A67769
17888a5948D4215e7473G5259K50941q133b4175A46650D6154f4666q4625d840j34033
17876a38873D29341A49822J50202B3635a32531B05157N4378j1542A22043a98977
17865b59662a27417k2971a5746j38990k07326B9616M1412k8469Q0424n5564j1491
17854E5928a81305A5320Q8322b265B96795g0416B79996E5994Q1230D8795b18275
17842B4757e033A50596F5273a89351C82315I2213a82934A05167c481B82096b28
$$ plain form
17830 -264332 -126916 -192922 -44068 -50877 266115 -139736 -234059 -331225 78467 146923 -98385
17818 135429 -138847 192838 257479 114711 421785 164406 60399 15082 -238131 -111001
17807 118274 -49420 -107913 -59983 162355 275793 -97983 165561 107458 -82018 106801 2886
17795 -171306 123017 148072 -93182 241521 -10285 -341674 -136689 -121870 38432 4398 16862
17784 16862 -203210 191287 32339 -66350 -31495 -163313 252798 -101515 188588 -64877
17773 -152990 -63985 -56145 -4470 -21028 53414 -81426 200049 -10834 141507 307908 -124546
17761 63171 -23414 -53051 19935 -123312 -235076 221840 -164213 -264748 -838 -25275 113288
17749 60207 22310 313442 -311898 59535 145839 100634 -41431 -263422 -300183 -31588 154299
$$ packed form
17830b64332a26916o6006d4068o809B66115a39736r4323r7166G8467O8456i8385
17818A35429a38847A92838O4641A14711L07074A64406F0399A5082b38131a11001
17807A18274d9420n8493M7930A62355J13438i7983A65561n8103h2018A06801B886
17795a71306A23017K5055i3182B41521a0285l31389a36689J4819C8432D398J2464
17784A6862b03210A91287C2339f6350c1495j31818B52798a01515A88588f4877
17773a52990f3985P840d470j6558E3414h1426B00049a0834A41507J66401a24546
17761F3171b3414k9637A9935a23312j11764B21840a64213j00535h38k4437A13288
17749F0207B2310K91132c11898E9535Q6304m5205d1431k21991l6761c1588A54299
$$ plain form
17737 142547 -416593 -88826 -97934 -187730 148945 162002 -18901 -74485 -121140 227479 66648
17725 121235 120598 -34390 44659 459903 -93909 -137674 -39751 19663 -291618 96000 -44052
17713 -59203 8439 -271275 113696 250168 -159769 67968 75675 169127 -186950 -43636 243536
17701 86779 87847 197354 64201 -58903 -85141 153488 111895 -150690 125982 -205272 74986
17689 14093 95269 -207693 -23465 -343368 -71544 -10149 87406 53237 -105385 98167 419340
17678 419340 -116537 176998 -198316 -175995 -162010 93380 -162050 187597 -60764 71486
17667 -98460 -228399 -210264 29606 -248910 -19572 20113 62892 -96201 -278326 362940 -158415
17655 105820 -83115 70559 -185077 -307980 37366 224215 -175695 74754 109389 125673 114606
$$ packed form
17737A42547d16593h8826r108q9796A48945J3057a8901n5584m6655B27479F6648
17725A21235o37c4390D4659M15244i3909m3765c9751A9663b91618I6000d4052
17713e9203H439b71275A13696J36472a59769F7968P707R3452a86950d3636B43536
17701H6779J068J09507F4201e8903k6238A53488m1593a50690A25982b05272G4986
17689A4093Q1176b07693b3465l19903g1544a0149H7406l4169a05385I8167L21173
17678D19340a16537A76998a98316K2321J3985I3380a62050A87597f0764G1486
17667i8460j29939J8135B9606b48910a9572B0113M2779i6201j82125C62940a58415
17655A05820h3115G0559a85077j22903C7366J86849a75695G4754L4635J6284j1067
$$ plain form
17644 114606 -231608 -99807 -121058 -58057 96535 379021 -379907 -238787 214129 243832
17634 243832 -187431 429234 86671 -23937 -218039 273500 35506 -76989 113309 -21314
17623 -136296 -194193 255071 90640 213656 272222 -215677 -437964 42913 28040 -10192 93401
17611 154229 183671 438929 -128660 -164946 -222811 -101789 252540 -281690 92640 -295628
17600 243535 -55522 -32922 132685 -112618 -444158 -56941 173008 119183 -174361 68342
17589 113480 -239918 -158264 217216 396929 -16153 111443 -104895 252616 359159 285362
17579 285362 -156541 -52351 4658 75689 -64923 -157321 -16634 43246 -46552 259239 80332
17567 77609 101780 115006 -241384 -32926 -11159 128879 -126647 -176351 -158319 -133925 309741
$$ packed form
17644A14606b31608i9807k1251e8057I6535K82486c79907J41120B14129K9703
17634B43832a87431D29234H6671b3937j94102B73500C5506g6989A13309b1314
17623a36296n7897B55071I0640J23016N8566b15677k22287D2913j4873a0192I3401
17611A54229K9442K55258a28660l6286n7865a01789B52540b81690I2640b95628
17600B43535e5522K2600A32685a12618l31540e6941A73008n3825a74361F8342
17589A13480b39918Q1654B17216J79713a6153A11443a04895B52616J06543p3797
17579B85362a56541e2351D658P1031f4923r2398a6634D3246d6552B59239H0332
17567G7609K4171J3226b41384c2926a1159A28879a26647m9704J8032K4394C09741
$$ plain form
17555 -52872 -217746 -133207 223746 -105464 -74784 -184553 249506 -195594 -321213 135171
17544 86525 202894 91307 159215 318329 137756 -231568 -151986 358262 104407 -44539
17533 75304 441301 -119744 -40859 157649 75758 162225 16243 -167204 181713 -286469
17522 251107 280336 -228495 306047 158168 -217511 78566 128863 -69858 37907 -76212 238427
17510 42716 54172 293882 270822 -6764 -99240 -10346 44688 141353 185621 297416 103885
17498 102978 -152310 95497 147489 275950 44099 109364 228190 175897 -135257 -10210 66947
17486 215083 97555 63996 -60420 -77011 -134869 72612 -54702 362927 -180577 13985 -667
17474 174606 280540 40665 202517 369642 356935 286180 -151264 178790 158809 105591
$$ packed form
17555e2872j64874Q4539B23746a05464L0680j09769B49506a95594j25619A35171
17544H6525J16369I1307O7908J59114A37756b31568P9582C58262A04407d4539
17533G5304L65997a19744d0859A57649G5758Q6467A6243a67204A81713b86469
17522B51107K9229b28495C06047j47879b17511G8566N0297f9858C7907g6212B38427
17510D2716J1456K39710k3060f764r2476a0346D4688R6665M4268J11795A03885
17498A02978a52310I5497N1992J28461D4099O5265J18826n2293a35257a0210F6947
17486B15083I7555l3559f0420j6591n7858G2612e4702C62927a80577A3985f67
17474A74606J05934D0665J61852J67125j2707p0755a51264A78790j9981n3218
$$ plain form
17464 105591 93280 -59555 -40904 -267117 61488 35975 -173684 317208 67022 144715 23985
17452 377740 49664 122703 306056 261861 107742 268151 120144 430869 -79406 316053
17441 239857 57257 120028 67437 281102 303789 210722 259295 -61232 -31094 108786 121161
17430 121161 1223 288092 315703 390658 404635 213716 695054 371786 453788 15935 238048
17419 238048 304412 204963 255668 547632 285632 192449 242428 227176 134625 -32475 126816
17407 584913 -205658 538044 452451 61092 86605 211915 61421 335728 -336922 123287
17396 344262 43596 -24393 203637 280751 304627 313595 92526 -52493 345496 -32170 154781
17384 284520 -43320 150083 -45761 143944 334794 -52511 239244 -31092 -29209 53293 105120
$$ packed form
17464A05591j2311e9555J8651k26213F1488k5513a73684C17208F7022P7693B3985
17452C77740D9664P3039J83353m4195A07742J60409A20144L10725g9406C16053
17441B39857E7257O2771n2591K13665K2687r3067M8573f1232L0138A08786J2375
17430A21161A223K86869K7611P4955J3977j90919M81338l23268Q2002A5935K22113
17419B38048O6364r9449N0705K91964k62000r3183M9979j5252r2551c2475A26816
17407E84913b05658E38044q5593F1092K5513J25310F1421K74307c36922A23287
17396C44262D3596b4393B03637P7114K3876Q968I2526e2493C45496c2170A54781
17384B84520d3320A50083d5761A43944J90850e2511B39244c1092J883E3293N1827
$$ plain form
17373 105120 229167 201415 28434 87887 -15230 171740 493526 467 244013 89968 -13007
17361 41613 154291 176419 34344 -93975 503313 186914 -58683 151745 -25313 -67801 128797
17349 300697 378730 96700 168726 302442 137951 157654 284394 253402 5753 200514 -51010
17337 98893 120558 339408 127857 -159499 38521 169571 174620 223824 116724 203686 155103
17326 155103 169313 518705 146807 86306 201265 -201333 380845 313670 154597 275190
17316 275190 238792 141562 134782 -94100 125973 289907 303140 231895 208431 264208 99698
17304 328497 -88325 236916 -149222 25876 135483 245930 239566 280806 416219 287042
17294 287042 353928 17953 -108683 44023 172980 29235 -235067 323073 69151 85018 388518
$$ packed form
17373A05120J24047k7752B8434N9453a5230A71740L21786D67K43546H9968a3007
17361D1613J12678K2128C4344i3975E03313A86914e8683A51745b5313m2488A28797
17349C00697P8033I6700P2026J33716A37951J9703J26740l0992E753J94761e1010
17337I8893K1665K18850A27857a59499C8521J31050N049M9204j07100Q6962m8583
17326A55103J4210L49392A46807o0501J14959b01333C80845o7175A54597J20593
17316B75190l6398r7230o780i4100A25973J63934J3233p1245k3464N5777I9698
17304C28497h8325B36916a49222B5876J09607J10447o364M1240J35413j29177
17294B87042O6886A7953a08683D4023J28957B9235b35067C23073F9151J5867L03500
$$ plain form
17283 388518 -20268 -33930 228136 141211 5764 -50070 -2011 -47863 260178 207168 107728
17272 107728 467426 378336 64980 466695 257621 155514 296323 -319186 -74398 2168
17261 81657 386460 282907 380436 272290 236000 521686 326282 98432 87256 -72040 -21739
17249 238039 -125864 -237571 -28846 18809 181082 202173 110504 -144741 309799 382989
17239 382989 321026 214318 147360 276704 272326 188901 181628 7238 152970 92789 229900
17228 229900 101522 213402 192582 -16048 308345 214795 108492 295292 354316 28958
17217 182098 154290 53639 178931 50995 196246 -19836 252788 290449 293662 492505 375086
17206 375086 365541 336651 32496 289305 300958 -13697 464262 474205 345593 101689 -33472
$$ packed form
17283C88518b0268j3662B28136q6925E764e0070b011m5852B60178n3010r9440
17272A07728L59698q9090F4980M01715k09074j02107J40809c19186g4398B168
17261H1657L04803j03553R7529j08146l6290K85686j95404I8432j1176g2040b1739
17249B38039a25864j11707b8846A8809J62273K1091r1669a44741C09799P3190
17239C82989o1963j06708o6958J29344m378q3425p273G238J45732o0181J37111
17228B29900A01522J11880k0820a6048C08345r3550j06303J86800N9024B8958
17217A82098k7808E3639J25292E0995J45251a9836B52788L7661L213J98843j17419
17206C75086r545k8890C2496K56809J1653a3697D64262R943j28612A01689c3472
$$ plain form
17194 301821 283103 469040 309390 97905 248250 7800 -51095 74122 83452 304650 311595
17183 311595 245621 35796 18514 463267 204209 61001 477037 381931 307864 23556 294958
17172 294958 304316 293556 -153086 469844 78991 231306 434229 227531 260210 543423
17162 543423 381350 99242 351711 544250 420869 83636 262456 519459 358479 293041
17152 293041 498143 103502 244994 246123 246155 297033 365072 -48573 202261 267377 165341
17141 165341 561528 190786 466225 166297 505321 133016 12277 49930 605558 240500
17130 466928 176262 -121526 419870 402017 355073 336362 433242 -5929 453516 184301 479943
17119 479943 712030 694021 95938 73035 258489 280368 255569 305569 206554 545498 493491
$$ packed form
17194C01821j8718J85937j59650I7905J50345G800e1095G4122R330K21198O945
17183C11595o5974C5796j7282M44753B04209F1001M16036r5106p4067B3556K71402
17172B94958R358j0760a53086D69844G8991J52315K02923k06698L2679K83213
17162E43423j62073I9242K52469J92539j23381H3636J78820K57003j60980o5438
17152B93041K05102A03502J41492J129L2N0878O8039d8573B02261O5116j02036
17141A65341L96187A90786K75439A66297L39024A33016A2277L7653N55628B40500
17130D66928A76262a21526D19870j7853m6944j8711R6880e929D53516A84301K95642
17119D79943K32087j8009I5938k2903J85454K1879k4799N0000r9015L38944n2007
$$ plain form
17108 493491 339458 410163 127611 284693 399604 208525 247921 362741 -120819 -97605
17098 -97605 389563 200760 438944 256693 288147 487491 181538 256889 203252 419288
17088 419288 596265 354879 369164 306880 669894 278578 535116 437783 375584 467593
17078 467593 392987 679150 319238 720519 261482 299357 361650 344249 629374 704636
17068 704636 548694 432369 545406 399501 490297 507358 488026 502444 224752 818425
17058 818425 276869 436596 168695 401700 547943 643264 424881 655945 595505 430615
17048 430615 887371 490751 467346 542569 592998 593455 613946 658816 712568 397893 500639
17037 500639 422627 378461 696405 768967 485984 450252 507787 360700 586288 615005 370509
$$ packed form
17108D93491j54033P0705A27611J57082J14911j91079L9396J14820a20819K3214
17098i7605C89563j88803K38184j82251L1454J99344A81538P5351n3637K16036
17088D19288J76977k41386J4285o2284L63014B78578K56538r7333o2199R2009
17078D67593p4606K86163C19238M01281B61482L7875O2293j7401K85125P5262
17068G04636j55942j16325J13037j45905R0796J7061j9332J4418B24752N93673
17058H18425B76869J59727A68695K33005J46243R5321k18383K31064o0440j64890
17048D30615M56756l96620k3405P5223N0429M57K0491M4870N3752l14675J02746
17037E00639p8012m4166L17944P2562k82983l5732N7535j47087K25588K8717k44496
$$ plain form
17026 370509 552034 619149 802999 303102 776082 708913 568791 430966 615208 415626
17016 415626 613720 430708 682060 438092 464099 556395 866492 560735 550853 638769
17006 638769 530785 494137 547676 833189 564745 770820 679726 392891 563250 323498
16996 323498 812229 360135 629037 671550 827918 635167 523956 819606 706091 685808
16986 685808 653185 1049059 539160 670326 874412 843198 879245 1014605 917828 678839
16976 678839 602037 870071 965917 726893 527268 839594 717324 1235820 963190 715706
16966 715706 707660 932733 882951 873812 717401 891751 843448 1039089 1117416 934741 1253286
16955 1253286 589959 817475 900018 921104 1340063 774754 1227559 755451 1010391 1132693
$$ packed form
17026C70509J81525O7115J83850C03102M72980o7169j40122j37825J84242j99582
17016D15626J98094j83012K51352k43968K6007R2296L10097l05757r882Q7916
17006F38769j07984l6648N3539K85513k68444K06075r1094k86835J70359k39752
16996C23498M88731C60135K68902M2513J56368j92751j11211K95650j13515k0283
16986F85808l2623L95874n09899J31166K04086l1214L6047J35360r6777k38989
16976F78839p6802K68034R5846k39024j99625L12326j22270N18496k72630k47484
16966G15706q046K25073m9782r139j56411J74350m8303J95641P8327j82675L18545
16955A253286E89959K27516Q2543K1086M18959n65309M52805m72108K54940J22302
$$ plain form
16945 1132693 1163139 1015391 1027070 881751 919427 1124279 1501885 1214951 1032607 1208435
16935 1208435 1051974 1128834 1403947 1040672 1389084 963531 1300721 1071464 1487236 1331329
16925 1331329 1511293 1073959 1470369 1495912 1255278 1447652 1119900 1413618 1425686 1359756
16915 1359756 1287107 1370501 1395675 1646561 1431119 1498025 1556139 1608811 1659211 1197207 1391558
16904 1391558 1638948 1451704 1243750 1471178 1444324 1637810 1636891 1721357 1705777 1732625 1838500
16893 1838500 2101858 1968253 1722259 1411168 1955001 1874281 1965350 2042363 1872397 1914809
16883 1914809 2109516 1851762 1685043 2113515 2225805 2134250 2098816 2456116 2509946 1731471
16873 1731471 2393296 2156965 2142637 2165014 2406587 2481442 2813009 2318893 2412650 2727982
$$ packed form
16945A132693L0446j47748J1679j45319L7676K04852L77606k86934j82344J75828
16935A208435j56461P6860K75113l63275L48412m25553L37190k29257M15772j55907
16925A331329J79964m37334L96410K5543k40634J92374l27752K93718J2068o5930
16915A359756p2649Q3394K5174K50886k15442O6906N8114N2672N0400m62004J94351
16904A391558K47390j87244k07954K27428k6854J93486r19Q4466j5580K6848J05875
16893A838500K63358j33605k45994l11091N43833q0720R1069P7013j69966M2412
16883A914809J94707k57754j66719M28472J12290r1555l5434L57300N3830p78475
16873A731471O61825k36331j4328K2377K41573P4855L31567m94116R3757L15332
$$ plain form
16863 2727982 2654615 2476001 2308439 2538849 2350639 2573712 2630791 2860830 2439543 3036005
16853 3036005 2915272 2844812 3367992 2870040 2938084 2951638 3022210 3300796 3497433 3423105
16843 3423105 3596900 3337302 3592983 3715039 3537324 3566331 3689751 3921125 3660293 4084634
16833 4084634 3918578 3848595 4027783 4207369 4255494 4383897 4260559 4410953 4372831 4644958
16823 4644958 4572171 4833562 4836730 5031282 4770559 5233732 5256605 5463464 5563670 5449683
16813 5449683 5584989 5523997 6220633 5761614 6117196 6711799 6379217 6758826 6869889 6649195
16803 6649195 6901775 6966966 7302576 7572779 7580504 7993521 7963286 8318725 8336036 8803475
16793 8803475 8903272 8948707 9286976 9599353 9882274 10029263 10470197 10654324 11022486 11241442
$$ packed form
16863B727982p3367j78614j67562K30410j88210K23073N7079K30039m21287N96462
16853C036005j20733p0460N23180m97952O8044J3554P0572K78586J96637p4328
16843C423105J73795k59598K55681J22056j77715K9007J23420K31374k60832M24341
16833D084634j66056o9983J79188J79586M8125J28403j23338J50394l8122K72127
16823D644958p2787K61391L168J94552k60723M63173K2873K06859J00206j13987
16813E449683J35306o0992O96636m59019L55582N94603l32582L79609J11063k20694
16803F649195K52580O5191L35610K70203P725M13017l0235L55439J7311M67439
16793H803475R9797M5435L38269L12377K82921J46989M40934J84127L68162K18956
$$ plain form
16783 11241442 11345834 11958677 12379155 12326077 13227951 13655060 13906144 14772902 14598237
16774 14598237 15222533 16218262 15881252 17195319 17636807 18070397 18961364 19525529 20413953
16765 20413953 21238494 21397320 22777379 23879681 24408311 25548734 26663393 27602368 28677680
16756 28677680 30120405 31699572 33013453 34561625 36013108 37629858 39680845 41507250
16748 41507250 43821268 46222082 48390580 51062354 53628099 56467710 59994831 63444868
16740 63444868 67174336 70892286 75437322 80123694 84541301 90072060 95225246 101121293
16732 101121293 107185728 113880078 120892457 127852686 135435824 142998769 150494418 158357235
16724 158357235 165243095 172606709 178762691 184271961 189008394 192455120 194510852 195646659
$$ packed form
16783A1241442J04392O12843M20478n3078R01874M27109K51084Q66758j74665
16774A4598237O24296R95729l37010J314067M41488M33590Q90967N64165Q88424
16765B0413953Q24541J58826J380059J102302N28630J140423J114659R38975J075312
16756B8677680J442725J579167J313881J548172J451483J616750K050987J826405
16748D1507250K314018K400814K168498K671774K565745K839611L527121L450037
16740F3444868L729468L717950M545036M686372M417607N530759N153186N896047
16732A01121293O064435O694350P012379O960229P583138P562945P495649P862817
16724A58357235O885860P363614O155982N509270M736433L446726K055732J135807
$$ plain form
16716 195646659 194912328 193012882 189872236 185342099 180295444 174285036 167300178 159666802
16708 159666802 152454194 144463049 136605529 129229105 121558636 114526520 107758321 101060097
16700 101060097 95083304 89253260 84136760 79086556 74470833 69972082 65768048 62040985
16692 62040985 58514929 55013231 52421282 49929613 46710925 44629042 42104839 39910050
16684 39910050 37983944 35912841 34203221 32767217 31080800 29909084 28466522 27645657
16676 27645657 26397301 24989380 23798051 22911489 22391646 21205603 20404876 19647831 19170050
16667 19170050 18387565 17734212 17216975 16429325 15596369 15115084 15090219 14363437 13960228
16658 13960228 13636790 13061839 12723398 12260866 12027411 11381697 10678578 10851397 10429469
$$ packed form
16716A95646659p34331j899446l140646m530137n046655o010408o984858p633376
16708A59666802p212608p991145p857520p376424p670469p032116o768199o698224
16700A01060097n976793n830044n116500n050204m615723m498751m204034l727063
16692F2040985l526056l501698k591949k491669l218688k081883k524203k194789
16684C9910050j926106k071103j709620j436004j686417j171716j442562q20865
16676B7645657j248356j407921j191329q86562n19843j186043q00727p57045m77781
16667A9170050p82485o53353n17237p87650q32956m81285k4865p26782m03209
16658A3960228l23438n74951l38441m62532k33455o45714p03119J72819m21928
$$ plain form
16649 10429469 10405092 10423506 9875314 9474043 9170417 8931223 8440605 8641455 8232340 8150146
16639 8150146 7767522 7593459 7298099 7364131 7118412 6814994 6737193 6640382 6274332 6248055
16629 6248055 6299112 5912253 6096277 5638430 5858727 5269937 5310167 5340309 5111834 4960482
16619 4960482 4947013 4695717 4554108 4773671 4532041 4347873 4426328 4521827 4390860 4189758
16609 4189758 3875067 4339840 4079601 3715607 3780747 3972104 3644531 3705765 3839648 3416788
16599 3416788 3651021 3631722 3414043 2978293 2983858 3406671 3160126 2989934 2808059 2748002
16589 2748002 2593208 2693595 2955211 2713156 2768379 2702289 2397173 2527734 2337661 2204364
16579 2204364 2511618 2551477 2292592 2294965 2410642 2448550 2188193 2416526 2281822 1924687
$$ packed form
16649A0429469k4377J8414n48192m01271l03626k39194m90618K00850m09115q2194
16639H150146l82624j74063k95360O6032k45719l03418p7801r6811l66050k6277
16629F248055N1057l86859J84024m57847K20297n88790M0230L0142k28475j51352
16619D960482j3469k51296j41609K19563k41630j84168P8455R5499j30967k01102
16609D189758l14691M64773k60239l63994O5140J91357l27573O1234J33883m22860
16599C416788K34233j9299k17679m35750N565M22813k46545j70192j81875o0057
16589B748002j54794J00387K61616k42055N5223o6090l05116J30561j90073j33297
16579B204364L07254L9859k58885K373J15677L7908k60357K28333j34704l57135
$$ plain form
16569 1924687 2124453 2295948 2089274 1886529 2369148 1759907 1887514 1850069 1956658 1934654
16559 1934654 1806383 1462301 1419343 1590410 1744828 1705641 1596452 1489085 1868652 1698659
16549 1698659 1690888 1408446 1719531 1354874 1480986 1544186 1839270 1437190 1657570 1507076
16539 1507076 1418283 1506865 1308820 1298740 1558573 1391235 1113103 853271 1573278 1327210
16529 1327210 1530067 1340906 1306793 1451664 1386861 811255 1072164 1025944 1290500 1013991
16519 1013991 1051633 1230701 1073324 1343420 1262336 1072309 1253908 1099888 1013807 1328594
16509 1328594 1394310 780725 882752 793916 983361 958130 1018199 952557 1059681 711756
16499 711756 953278 983019 633088 465487 1029840 792560 1019224 866915 943320 808428
$$ packed form
16569A924687J99766J71495k06674k02745M82619o09241J27607l7445J06589k2004
16559A934654j28271l44082m2958J71067J54418l9187j09189j07367L79567j69993
16549A698659p771k82442L11085l64657J26112O3200K95084m02080K20380j50494
16539A507076q8793Q8582j98045j0080K59833j67338k78132k59832P20007k46068
16529A327210K02857j89161l4113J44871o4803n75606K60909m6220K64556k76509
16519A013991L7642J79068j57377K70096q1084j90027J81599j54020q6081L14787
16509A328594O5716o13585J02027q8836J89445k5231O0069o5642J07124l47925
16499G11756K41522K9741l49931j67601N64353k37280K26664j52309P6405j34892
$$ plain form
16489 808428 829017 1017437 762904 577692 671601 877663 1035452 917445 901245 770476
16479 770476 665872 735095 711064 746742 1033444 762160 801460 692193 897460 531693
16469 531693 778015 621365 775861 573518 607276 739189 550135 840219 685778 751734
16459 751734 551022 785227 635890 684868 660589 551706 763625 674631 472878 606716
16449 606716 760147 426903 679019 510334 149268 722469 427786 701861 781071 636339
16439 636339 268455 315441 655479 649463 259316 627198 917989 405306 343075 369608
16429 369608 552610 701147 587882 716755 373143 665551 431284 452084 367444 324534
16419 324534 224362 623575 765168 374281 719190 16423 365844 388746 846605 521647
$$ packed form
16489H08428K0589J88420k54533j85212R3909K06062J57789j18007j6200j30769
16479G70476j04604O9223k4031L5678K86702k71284L9300j09267K05267l65767
16469E31693K46322j56650J54496k02343L3758J31913j89054K90084j54441O5956
16459G51734k00712K34205j49337M8978k4279j08883K11919q8994k01753J33838
16449F06716J53431l33244K52116j68685A49268N73201k94683K74075P9210j44732
16439F36339B68455M6986L40038o016B59316L67882K90791D05306o2231K6533
16429C69608J83002J48537j13265J28873l43612K92408k34267K0800q4640m2910
16419C24534j00172L99213J41593C74281L44909A6423L49421K2902M57859l24958
$$ plain form
16409 521647 422778 522573 383139 156463 601704 293132 500063 421982 366540 369118 512535
16398 512535 493299 269703 486656 462635 -11582 381631 387044 230790 505133 302558
16388 302558 600116 436324 569440 481640 326752 528232 294163 378364 430774 545056
16378 545056 671702 436375 157356 458390 325291 441991 562542 486781 316522 191638
16368 191638 253788 236793 -33821 272796 267901 221785 538573 435442 541821 330562 135626
16356 107416 102394 211778 61045 -39520 318509 332712 202904 353863 320609 504050 250667
16344 484789 219103 484282 415773 104558 476318 315916 125907 412181 330330 510439
16334 510439 509483 325411 446740 18939 348590 486496 153734 103444 274163 474454
$$ packed form
16409E21647r8869R9795j39434A56463M45241B93132K06931p8081n5442K578J43417
16398E12535j9236k23596K16953k4021a1582C81631N413j56254K74343k02575
16388C02558K97558j63792J33116q7800j54888K01480k34069Q4201N2410J14282
16378E45056J26646k35327A57356L01034j33099J16700J20551p5761j70259j24884
16368A91638O2150j6995c3821B72796m895m6116L16788j03131J06379k11259A35626
16356A07416n022J09384F1045c9520C18509J4203j29808J50959l3254J83441B50667
16344D84789B19103K65179o8509A04558L71760j60402A25907K86274q1851J80109
16334E10439r56j84072J21329A8939L29651J37906A53734n0290J70719K00291
$$ plain form
16324 474454 265419 324758 -40254 270016 274796 417333 160600 -23166 221349 128309 88800
16313 88800 90200 358452 193209 353993 -35655 -40286 5443 228759 149896 242731 193439
16302 193439 300232 25646 501199 132475 12154 -171658 138328 295202 306135 35268
16291 272207 271673 254739 340314 119020 77172 317578 65200 280764 301844 438566 226284
16280 226284 85792 216915 290057 262473 320880 54037 -139297 -47130 272254 430573 130576
16268 -3677 321343 -148330 452651 74461 375540 -34649 321626 138000 -18863 42045 493607
16257 493607 134334 235441 204090 27838 53072 268241 261912 204086 148648 495324 162089
16245 19936 184417 109544 112823 369896 110184 164872 -61469 11118 248263 -34659 -93682
$$ packed form
16324D74454k09035N9339d0254B70016M780J42537A60600b3166B21349r3040l9509
16313H8800J400K68252j65243J60784c5655m631E443K23316p8863R2835m9292
16302A93439J06793B5646M75553A32475A2154a71658A38328J56874J0933C5268
16291B72207n34j6934Q5575A19020m1848K40406F5200K15564K1080J36722k12282
16280B26284H5792J31123P3142k7584N8407E4037a39297d7130B72254J58319A30576
16268c677C21343a48330D52651G4461L01079c4649C21626A38000a8863D2045M51562
16257D93607A34334J01107l1351B7838K5234K15169o329n7826n5438L46676A62089
16245A9936J64481p4873L279K57073A10184N4688f1469A1118K37145c4659n9023
$$ plain form
16234 -93682 266112 110676 274182 57361 193293 26715 157677 136186 -86743 202433
16223 357933 191585 185844 29708 73141 -206189 43602 -152822 231316 -43641 170306 101787
16212 101787 314374 109739 255992 -59721 316434 -19257 172649 -154272 -75768 181151
16201 -290865 78087 99115 -7448 245129 221982 119240 -3027 224394 195058 -161720 97911
16189 306718 -38577 82201 90463 373163 55259 115137 292163 170123 -170173 75573 268146
16178 268146 -30493 289306 -21595 -71156 201569 162720 20372 -10943 87669 8333 288396
16167 288396 -37184 316511 -98254 6543 104328 -3429 80754 113895 85121 219953 29088
16155 66332 37884 262648 83751 -28246 348590 194644 316764 134253 -74918 402079
$$ packed form
16234i3682B66112A10676J63506E7361J35932B6715J30962k1491h6743B02433
16223C57933j66348n741B9708M3433b06189D3602a52822B31316d3641A70306o8519
16212A01787K12587A09739J46253e9721C16434a9257A72649a54272g5768A81151
16201b90865G8087K1028g448B45129k3147j02742c027B24394k9336a61720I7911
16189C06718c8577H2201Q262K82700E5259N9878J77026j22040a70173G5573J92573
16178B68146c0493B89306b1595m9561B01569l8849B0372a0943H7669H333K80063
16167B88396c7184C16511i8254F543R7785c429H0754L3141k8774J34832B9088
16155F6332k8448K24764H3751b8246C48590j53946J22120A34253g4918D02079
$$ plain form
16144 112384 17755 51660 -199670 321254 41981 348190 86327 78617 254256 -57637 128833
16132 84816 -87318 92578 -78622 144654 230148 -34508 -306758 174491 8870 4760 206185
16121 206185 -120259 -258520 -42786 -72051 120625 228618 110911 279005 195203 193923
16111 193923 69947 80650 -161659 -23986 124400 199585 -198235 228796 -40823 409532
16100 207054 -129812 -129402 281356 -236722 112578 134513 45627 -33421 -489177 17442 233027
16089 233027 222135 90464 -109524 -164515 -199854 -311151 -142060 -216406 133675 196711 -266369
16077 28611 94387 67524 286808 -88000 99751 -49214 -340166 -132893 -91069 264413 -263462
16065 -20725 62460 -227779 73080 64368 -414704 -132915 157810 -181880 264685 -214368
$$ packed form
16144A12384A7755L3905a99670C21254D1981L06209H6327p710J75639e7637A28833
16132H4816h7318I2578g8622A44654Q5494c4508k72250A74491H870m110K01425
16121B06185a20259j38261d2786k9265A20625J07993A10911J68094q3802j280
16111A93923F9947J0703a61659b3986A24400P5185a98235B28796d0823D09532
16100B07054a29812M10B81356b36722A12578K1935D5627c3421m55756A7442K15585
16089B33027j0892I0464a09524n4991l5339j11297a42060p4346A33675O3036b66369
16077B8611O5776k6863K19284h8000I9751d9214k90952a32893M1824B64413b63462
16065b0725F2460b27779G3080q712d14704a32915A57810a81880B64685b14368
$$ plain form
16054 167590 259967 81829 89552 -145739 -92527 -85804 166187 -213405 -35052 -179675 114908
16042 -106872 96753 -374946 175328 139400 -96345 65505 16112 192515 -119090 -203026 183372
16030 -49057 -236414 -64156 72067 -288444 266681 9612 362312 -68881 37493 -64147 261013
16018 39025 86020 -143324 -67229 -13588 194183 -252434 -73517 141828 73266 95954 -104102
16006 99869 -90048 122524 -121245 -175296 -249520 68675 -104143 63407 133690 -184665 44320
15994 51123 19359 -135646 -257041 111660 21462 120865 -62648 -80595 59767 -9613 -201247
15983 -201247 292894 -44201 232855 14258 46033 -300431 48065 454623 48633 180093
15973 180093 -43099 -88402 -218411 -87627 112998 103401 145514 -210937 -141380 45368 75872
$$ packed form
16054A67590R2377H1829P723a45739N3212O723A66187b13405c5052j44623A14908
16042a06872I6753c74946A75328l5928i6345F5505A6112J76403a19090q3936A83372
16030d9057j87357f4156G2067b88444B66681I612L52700f8881C7493f4147B61013
16018C9025M6995a43324f7229a3588A94183b52434g3517A41828o8562K2688a04102
16006I9869i0048A22524a21245n4051p4224F8675a04143F3407P0283a84665D4320
15994E1123A9359a35646j21395A11660B1462R9403f2648j7947E9767i613j91634
15983b01247B92894d4201B32855A4258L1775c00431D8065M06558D8633J31460
15973A80093d3099m5303j30009h7627A12998r597M2113b10937O9557D5368L0504
$$ plain form
15962 75872 183786 -36681 30650 -120291 153169 -253048 -306261 -168113 -278803 -55893
15951 281534 -72812 -23504 229949 -197175 161731 16841 -47376 -85363 9518 -233284 -254536
15940 -254536 -408592 83878 -371477 -107123 -249493 -176195 153384 47032 -113907 -100603
15930 -100603 -236428 305631 -40850 -68861 -93013 -10333 -130758 96328 -77102 21980 -128855
15918 -54116 -130507 -85149 -113698 -346289 -63400 94811 -85206 387568 -196305 -78523 -95262
15907 -95262 23716 -40675 -21895 -32071 119954 -221614 118686 -34861 24521 312637 -321005
15895 -161091 14053 -142209 -233575 -206730 -2711 -21964 43565 -222445 -5967 -76250 119273
15883 -76523 68355 334486 -338832 71144 -134583 -43164 -206524 197728 -80670 150631
$$ packed form
15962G5872J07914c6681C0650a20291A53169b53048n3213J38148j10690e5893
15951B81534g2812b3504B29949a97175A61731A6841d7376l7987I518b33284k1252
15940b54536j54056H3878c71477a07123j42370P3298A53384D7032a13907J3304
15930a00603j35825C05631d0850k8011k4152a0333j20425I6328g7102B1980a28855
15918e4116p6391M5358k8549k32591f3400I4811h5206C87568a96305g8523j6739
15907i5262B3716d0675J8780j0176A19954b21614A18686c4861B4521K88116c21005
15895a61091A4053a42209r1366K6845b711j9253D3565b22445e967p0283A19273
15883g6523F8355K66131c38832G1144a34583d3164j63360A97728h0670A50631
$$ plain form
15872 14105 -194847 -57014 -120744 -36167 64580 -217174 15379 67137 78492 -248775 -9183
15860 251291 216841 -43171 20162 -244253 6376 216826 256751 -198336 227240 38074 -68090
15848 184259 -35574 9415 -43630 -419237 -60604 -321055 -3899 16737 218840 -99173 62698
15836 353321 314232 -27051 -128697 -157371 120947 -196789 -142264 70831 -270141 -591622
15826 -591622 73642 -60068 -115681 89751 -303665 167747 -15226 -216149 47988 -110408 118887
15814 50216 73045 -333137 323364 -101041 -127340 -148203 48849 164208 -266428 68592 -131133
15802 -31832 299306 -641227 -197509 -66593 -126211 -48176 123479 -242983 -57552 5953 -68269
15790 -120892 -184358 125808 -187705 194773 378758 -179858 -70351 117595 -36763 241135
$$ packed form
15872A4105a94847e7014o3730c6167F4580b17174A5379N1758J1355b48775i183
15860B51291l4450d3171B0162b44253F376K10450L9925a98336B27240C8074f8090
15848A84259c5574I415d3630l75607f0604k60451c899A6737K02103i9173F2698
15836C53321l9089b7051j01646k8674A20947a96789N4525G0831b70141l21481
15826e91622G3642f0068n5613H9751c03665A67747a5226k00923D7988a10408A18887
15814E0216K2829c33137C23364a01041k6299k0863D8849J15359b66428F8592a31133
15802c1832B99306f41227a97509f6593n9618d8176A23479b42983e7552E953f8269
15790a20892o3466A25808a87705A94773J83985a79858g0351A17595c6763B41135
$$ plain form
15779 -116316 122269 139055 -335723 75240 290308 -105424 71614 -144621 -12573 -118878
15769 -118878 -258183 69935 30917 126654 -293569 -38574 148191 -18798 -337032 -286428 -176881
15758 -176881 172228 -120325 274100 -147551 -71762 -48784 65425 190087 -81638 -9116 -122096
15747 -122096 350881 -38095 77721 153877 176407 73616 -56878 14770 -93702 17740 101713
15736 101713 164424 -299545 -26765 -54674 -157545 224192 -144314 -286325 -111423 -40195
15725 -297280 -277861 -94382 282061 -37545 50629 -146128 -147779 -26693 -106258 -339021 -184179
15714 -184179 -22819 260138 -304016 -350558 20560 -141105 -186299 357800 -10345 66650 -234815
15702 -266586 -274645 -103417 -159350 -106475 45669 -5956 71582 -220126 -44884 -336889 62461
$$ packed form
15779a16316A22269J6786c35723G5240K15068a05424G1614a44621a2573j06305
15769a18878j39305F9935C0917R5737b93569c8574A48191a8798l18234N0604J09547
15758a76881A72228a20325B74100a47551g1762K2978F5425J24662h1638i116j12980
15747a22096C50881c8095G7721P6156K2530G3616e6878A4770i3702A7740Q3973
15736A01713O2711b99545b6765k7909j02871B24192a44314j42011a11423d0195
15725b97280J9419i4382B82061c7545E0629a46128j651b6693p9565k32763J54842
15714a84179b2819B60138c04016m6542B0560a41105m5194C57800a0345F6650b34815
15702b66586q059a03417n5933N2875D5669e956G1582b20126d4884k92005F2461
$$ plain form
15690 4063 157233 8575 -112736 131617 218116 51850 44295 -141503 313633 -328765 -70166
15678 -44866 -180521 70049 -162120 -289832 -10281 -118473 -105725 164603 -9256 38517 171743
15667 171743 383505 74877 234078 164169 -130003 90586 -127233 70662 -22568 -227674
15657 -227674 209960 -152166 42660 73152 -218715 53952 63067 -134167 -152616 74029 136297
15646 136297 279662 75257 259152 56502 -469612 -7532 -78115 -144379 112397 65044 192979
15635 192979 283742 -143909 106473 -44943 -92880 16384 367926 163991 206193 246029 345568
15624 345568 168174 -86234 134903 4 -27689 -172391 -209275 -76943 -124081 79306 37806 -117817
15611 117405 -167695 18657 20998 80055 -283266 -377907 -133261 -148309 -48968 53950 55859
$$ packed form
15690D063J53170H575a12736A31617Q6499E1850p555a41503C13633c28765g0166
15678d4866j35655G0049a62120j27712a0281j08192J2748A64603i256C8517J33226
15667A71743K11762G4877J59201o9909a30003I0586a27233G0662b2568k05106
15657b27674B09960a52166D2660L0492b18715E3952R115a34167j8449G4029O2268
15646A36297J43365G5257J83895E6502d69612g532p0583o6264A12397m7353J27935
15635A92979R0763a43909A06473d4943m7937A6384L51542A63991M2202L9836R9539
15624C45568A68174h6234A34903Db7689j44702l6884g6943m7138G9306C7806a17817
15611A17405a67695A8657K341N9057b83266r4641a33261j5048d8968E3950J909
$$ plain form
15600 55859 59667 85248 55084 -185071 -98745 -423478 47700 -95569 211594 2775 95210
15589 95210 80388 -84879 22480 -152440 -104069 773 148690 103000 -130695 -32177 -153266
15578 -153266 75444 1183 -140679 -135975 70728 -193747 -145579 95324 -214011 392 202870
15567 202870 -53980 94296 3591 -85384 276561 208297 -221647 45950 16511 8478 -144569
15555 -156624 -95387 -165071 192291 201965 -50393 7687 -229119 -164182 77019 303716 -225420
15543 -53320 -184877 126433 119983 -94981 -117673 34650 237676 -254584 8224 144361 -141783
15531 -92211 212434 46869 -1501 25398 -164794 -317710 -189094 129827 333358 -80933 -1288
15519 -11124 497248 267656 254964 -44439 302964 61747 -308745 -39330 151697 -163106
$$ packed form
15600E5859L808K5581l0164a85071Q6326l24733D7700i5569B11594B775R2435
15589I5210j4822h4879B2480a52440M8371G73J47917m5690a30695c2177j21089
15578a53266G5444A183a40679M704G0728a93747M8168I5324b14011C92K02478
15567B02870e3980I4296C591h5384B76561o8264b21647D5950A6511q033a44569
15555a56624O1237o9684A92291R674e0393G687b29119O4937G7019K26697b25420
15543e3320j31557A26433o450i4981k2692C4650K03026b54584H224J36137a41783
15531i2211B12434D6869a501B5398a64794j52916J28616A29827K03531h0933a288
15519a1124D97248k29592j2692d4439C02964F1747c08745c9330A51697a63106
$$ plain form
15508 -42300 43809 -45436 20902 -10127 146404 -203866 236347 -24226 128939 108003 98592
15497 98592 -198300 312272 75503 62710 166114 -182175 -57589 -38502 196112 -22754 -212731
15486 -212731 -458657 -325890 131357 38226 -118264 59313 -170103 -280535 -227211 350848
15475 60526 308794 -12369 24653 -364538 108043 83786 -90831 36074 90216 118496 -115686
15463 134778 -143420 -310932 88120 90522 16553 462636 -27999 103037 167371 -126028 172902
15451 -276859 -113102 29638 318276 312536 -216371 123414 -94361 -47581 -100731 -87305 -44999
15440 -44999 -79835 -92426 151654 -361800 71939 168469 -168131 21021 80455 -371061 -114609
15428 272463 -119379 -274770 -160360 149114 236938 -27891 -42528 33806 -172647 183656
$$ packed form
15508d2300D3809d5436B0902a0127A46404b03866B36347b4226A28939k0936r411
15497I8592a98300C12272G5503j2793J03404a82175e7589J9087A96112b2754j89977
15486b12731k45926J32767A31357C8226a18264E9313a70103j10432N3324C50848
15475F0526K48268a2369B4653c64538A08043k4257i0831C6074N4142K8280a15686
15463A34778a43420j67512H8120K402A6553M46083b7999A03037O4334a26028A72902
15451b76859a13102B9638K88638n740b16371A23414i4361M6780n3150J3426M2306
15440d4999l4836j2591A51654c61800G1939R6530a68131B1021N9434c71061a14609
15428B72463a19379j55391J14410A49114Q7824b7891j4637C3806a72647A83656
$$ plain form
15417 -201128 397699 110765 -59085 16560 16634 -20667 233320 88054 -90286 -19994 -106763
15406 -106763 139617 -158439 -202793 -284305 -35217 -36790 186813 376557 98029 -68306 161786
15394 -82399 -122482 63013 -127467 -260935 242201 -38159 -31417 -324655 127104 -176488 -39127
15382 -191627 169680 9880 -75848 -63543 -72323 398180 148793 -68782 -285338 -169025 53791
15370 70781 -76265 31188 -116062 -210751 33007 82417 -147359 97464 -223594 -42012 30298
15358 15912 -170186 -366904 -61610 70705 -127244 8533 216038 74643 -40463 -93060 258747
15346 -335106 -23594 -239992 235254 63429 206957 38335 81624 13186 -247015 75969 293935
15335 293935 51303 -11567 -134978 -29558 -8870 55235 -243370 -32916 -75579 -260061 273164
$$ packed form
15417b01128C97699A10765e9085A6560P4b0667B33320H8054i0286a9994q6769
15406a06763A39617a58439m4354q1512c5217j573A86813J89744I8029f8306A61786
15394h2399m0083F3013a27467j33468B42201c8159O742k93238A27104a76488c9127
15382a91627A69680I880g5848J2305q780C98180A48793f8782k16556J16313E3791
15370G0781g6265C1188a16062r4689C3007M9410a47359I7464b23594d2012C0298
15358A5912a70186j96718f1610G0705a27244H533K07505G4643d0463n2597B58747
15346c35106b3594k16398B35254F3429J43528C8335M3289A3186b47015G5969K17966
15335B93935E1303a1567j23411b9558h870E5235b43370c2916m2663j84482B73164
$$ plain form
15323 193418 328446 87820 290905 57700 -237777 31611 -43908 -11665 -108154 -52908 160809
15311 47522 345108 257140 -101250 242883 189229 207597 326631 36639 -34345 72857 243460
15300 243460 -62720 135509 -35509 185480 7746 -59696 -48570 -162048 233060 -22904 14097
15288 49476 89275 85996 -348083 -81974 -208201 7937 -119239 -24771 176960 126558 72862
15277 72862 344749 281776 36178 173701 -19166 127780 432433 60010 234807 59835 -152485
15265 104274 -66577 257630 174332 86951 170001 212849 59961 363308 -65909 -106047 -270853
15254 -270853 178570 -4002 233063 50596 432569 465076 916962 1568776 1242442 1319763
15244 1319763 1151193 524509 354165 161113 215725 201055 -144090 -241281 174799 32371
$$ packed form
15323A93418J35028H7820K03085E7700b37777C1611d3908a1665r6489e2908A60809
15311D7522K97586q7968a01250B42883n3654J8368J19034C6639c4345G2857J70603
15300B43460f2720A35509c5509A85480G746e9696J1126j13478B33060b2904A4097
15288D9476L9799l279c48083h1974j26227G937a19239b4771A76960n0402n3696
15277G2862K71887o2973C6178J37523a9166A27780L04653F0010J74797E9835a52485
15265A04274f6577B57630q3298H6951Q3050M2848E9961L03347f5909m0138j64806
15254b70853A78570d002B33063E0596L81973L2507M51886O51814l26334P7321
15244A319763j68570E24509j70344A61113N4612j4670a44090r7191A74799C2371
$$ plain form
15233 61444 301141 104314 149071 94457 -32656 -84611 -3018 183968 5646 -19031 -165900
15222 -165900 -80706 -79360 -181026 -36320 47033 -63642 -26896 -135379 -26246 -98205 160018
15210 -37904 48511 -107519 81420 30646 -87067 206448 67054 125502 -35715 52815 -187400
15198 278366 -44352 173858 161153 100911 -47474 -195342 -42249 -218021 25127 -153556 94188
15186 -6757 86901 -70479 247 229936 241523 138770 155475 -265903 132049 396790 317997
15175 317997 204205 89646 -269519 65215 468882 293636 -82479 -1511 6840 208154 83521
15163 334586 225983 207933 28804 -9121 -190252 -116538 50880 42174 160078 149131 185777
15152 185777 124040 137685 623592 84514 257894 203698 -4832 323113 310046 -125172 -136795
$$ packed form
15233F1444K39697A04314M4757n4614c2656n1955c018A83968E646a9031j46869
15222a65900h0706J346j01666c6320D7033f3642b6896j08483b6246p1959A60018
15210c7904D8511a07519H1420C0646h7067B06448F7054N8448c5715E2815a87400
15198B78366d4352A73858j2705o0242d7474j47868d2249j75772B5127a53556I4188
15186f757H6901g0479B47K29689J1587j02753J6705b65903A32049K64741p8793
15175C17997j13792H9646b69519F5215M03667j75246h2479a511F840K01314H3521
15163C34586j08603j8050B8804i121j81131P3714E0880q706J17904j0947L6646
15152A85777o1737J3645M85907H4514J73380n4196d832C23113j3067a25172j1623
$$ plain form
15141 -136795 -194485 197675 109842 45516 87029 211934 181337 -96500 -68717 84758 70897
15130 70897 -50379 304659 -49959 506030 93954 139667 127153 -33486 259427 135585 9317
15118 155368 426373 -87069 -178202 185726 -111522 280870 -23303 -190280 -99325 61094
15107 60090 -137712 105695 276817 333742 287736 323014 -134303 281487 -12633 -282799
15097 -282799 344641 -7338 -53474 237153 342297 95846 179911 132468 275350 -157419 364714
15085 119997 288995 46676 33801 142943 -89030 162805 217919 -3082 -56657 86334 62909
15074 62909 277350 285361 82524 92505 148149 -75033 224878 -174615 163793 -248642 427908
15062 131436 233158 -84338 404088 25240 -121648 319663 39249 122985 143546 461160
$$ packed form
15141a36795n7690A97675q7833D5516M1513J24905l0597i6500K7783H4758j3861
15130G0897e0379C04659d9959E06030I3954M5713j2514c3486B59427j23842I317
15118A55368K71005h7069r1133A85726a11522B80870b3303j66977R0955F1094
15107F0090a37712A05695J71122N6925m6006L5278a34303B81487a2633k70166
15097b82799C44641g338m6136B37153J05144I5846Q4065m7443J42882a57419C64714
15085A19997J68998D6676j2875J09142h9030A62805N5114c082n3575H6334k3425
15074F2909K14441Q011H2524R981N5644g5033B24878a74615A63793b48642D27908
15062A31436J01722h4338D04088B5240a21648C19663C9249Q3736K0561L17614
$$ plain form
15052 461160 131477 302346 379036 56483 98508 -293705 431504 -148133 39965 100528
15042 100528 540 232989 38327 273981 286158 50798 246952 378660 184037 120282 187487
15031 187487 175675 181163 -236832 165562 190518 185130 176600 191739 70220 201976 267089
15020 267089 243274 46606 128770 155129 262070 240296 174118 334527 90774 330441 74708
15008 -112387 178531 337305 245540 467047 277840 76719 349493 362433 401242 335552
14998 335552 146067 -35294 313814 397227 155708 4957 368041 165728 315181 -162604
14987 265490 182189 94650 236351 562095 30382 334457 423033 313262 -321878 421943
14976 108685 254894 254934 37702 112584 139148 469315 103028 462750 100611 389267 141856
$$ packed form
15052D61160A31477J70869P6690E6483M2025b93705D31504a48133C9965O0563
15042A00528E40K32449C8327K35654J2177E0798J96154J31708A84037o3755O7205
15031A87487j1812N488b36832A65562K4956n388q530J5139G0220J31756O5113
15020B67089k3815D6606Q2164K6359J06941k1774o6178J60409I0774K39667G4708
15008a12387A78531J58774r1765K21507j89207G6719K72774J2940L8809o5690
14998C35552A46067c5294C13814Q3413A55708D957L63084A65728J49453a62604
14987B65490q3301q7539J41701L25744C0382L04075Q8576j09771c21878D21943
14976A08685J46209M0C7702P4882K6564L30167A03028L59722A00611K88656A41856
$$ plain form
14964 242956 322732 316645 206652 118381 197985 324167 133367 213083 232477 -62522 41495
14952 107562 147675 516456 -92430 170853 312177 552348 63782 551975 248756 389088
14942 389088 449515 118706 126531 -65851 -46191 368460 478393 2490 229638 317670 12669
14930 267313 274411 508443 322642 260705 286343 128626 279683 204279 113361 497770 171088
14918 63060 430685 423359 393762 386457 190251 407839 261558 9573 301776 315026 456322
14907 456322 420457 524383 331309 431306 331362 301153 -175438 347513 -33709 182548
14896 400297 239081 397574 191536 519152 -93840 101517 306672 225388 -154804 43240
14885 486216 473953 248209 227758 400302 231912 484491 333900 290601 270094 586641
$$ packed form
14964B42956P9776o087j09993q8271P9604J26182A33367P9716J9394f2522D1495
14952A07562M0113L68781i2430A70853J41324K40171F3782M88193B48756J40332
14942C89088O0427A18706P825f5851J9660C68460J09933B490K27148Q8032A2669
14930B67313P098K34032j85801o1937K5638A28626J51057p5404r0918L84409A71088
14918F3060L67625p326k9597p305A90251K17588j46281I573K92203J3250J41296
14907D56322l5865J03926j93074R9997r9944l0209a75438C47513c3709A82548
14896D00297j61216J58493A91536L27616i3840A01517K05155q1284a54804D3240
14885D86216j2263k25744k0451J72544j68390K52579j50591m3299k0507L16547
$$ plain form
14875 586641 136680 81297 283145 437191 529376 399026 389823 278047 246759 652614
14865 652614 393636 256528 448831 402316 161163 419467 527291 494265 316132 163998
14855 163998 176701 510038 148364 504361 496552 534371 336863 513903 599879 696535 359301
14844 359301 438560 288281 339719 293891 251966 126273 560567 447427 395346 293483
14834 293483 219497 359701 591053 567285 557664 318504 444419 420003 329793 533530 481149
14823 481149 520036 520787 653782 341301 375476 408348 452671 334811 484052 507163 731109
14812 731109 490538 342542 406967 348313 613478 317567 408396 629236 388270 598477
14802 598477 744767 502591 620244 613707 623922 537374 571983 592791 234875 427300 510983
$$ packed form
14875E86641A36680n5383K01848J54046R2185j30350r203j11776l1288M05855
14865F52614k58978j37108J92303m6515A61163K58304J07824l3026j78133j52134
14855A63998J2703L33337A48364L55997p809L7819j97508J77040Q5976R6656l37234
14844C59301P9259j50279N1438m5828m1925j25693M34294j13140n2081j01863
14834B93483p3986J40204K31352k3768r621k39160J25915k4416r0210K03737n2381
14823D81149L8887P51J32995l12481L4175L2872M4323j17860J49241K3111K23946
14812G31109k40571j47996O4425n8654K65165k95911R0829K20840k40966K10207
14802E98477J46290k42176J17653o537J0215q6548L4609K0808B34875J92425Q3683
$$ plain form
14791 510983 486394 390289 302653 684867 411264 670585 506790 1045233 281029 554234
14781 554234 671988 509301 498721 309793 797445 780609 755835 809720 780698 595953
14771 595953 972211 657234 590651 590511 421119 534265 205689 840514 718475 813385
14761 813385 818341 827618 575581 497106 694888 444604 793421 734641 694308 1046184 429355
14749 440583 800914 804978 630468 622083 713776 841420 789680 603584 678187 691824 796365
14738 796365 605807 763450 576508 610410 592939 585080 994921 704627 969546 611123
14728 611123 872525 919591 515052 609329 802944 763698 567947 677124 685244 1169089
14718 1169089 581045 710389 903212 799145 884684 994911 713735 858655 827623 706241
$$ packed form
14791E10983k4589r6105q7636L82214k73603K59321j63795N38443B81029K73205
14781E54234J17754j62687j0580j88928M87652j6836k4774N3885k9022j84745
14771E95953L76258l14977o6583j40j69392J13146B05689O34825j22039R4910
14761H13385M956R277k52037p8475J97782k50284L48817n8780m0333L51876D29355
14749D40583L60331M064j74510q385R1693J27644n1740j86096P4603J3637J04541
14738G96365j90558J57643j86942L3902j7471p859M09841k90294K64919l58423
14728F11123K61402M7066m04539R4277J93615l9246j95751J09177Q120M83845
14718A169089E81045J29344J92823j04067Q5539J10227k81176J44920l1032j21382
$$ plain form
14708 706241 1094127 750329 738981 943965 1044115 666893 770122 607983 695427 999483
14698 999483 812252 757315 804179 857210 675469 862510 833524 906108 929942 826899 870689
14687 870689 765260 1021333 1076200 950718 889388 1035995 740798 1277399 1021799 838696
14677 838696 734139 778977 892779 835231 771263 985054 1329048 1067938 1122663 1132555 1180250
14666 1180250 1070877 954768 1145986 1082315 1123665 944902 1171049 975298 1040688 880358
14656 880358 1095432 1178935 1034360 1183849 1137917 1278407 1049391 926447 1159516 1293309
14646 1293309 1087003 1016406 1132456 1156037 1417510 1309537 1335664 1215933 1252380 1342733
14636 1342733 1323946 1440212 1242692 1648610 1167142 1590731 1484621 1148995 1365339 1430795
$$ packed form
14708G06241L87886l43798j1348K04984J00150l77222J03229j62139Q7444L04056
14698I99483j87231n4937M6864N3031j81741J87041k8986P2584K3834j03043M3790
14687H70689j05429K56073N4867j25482o1330J46607k95197N36601k55600j83103
14677H38696j04557M4838J13802n7548o3968K13791L43994k61110N4725R892M7695
14666A180250j09373j16109J91218o3671M1350j78763K26147j95751O5390j60330
14656H80358K15074Q3503j44575J49489m5932J40490k29016j22944K33069J33793
14646A293309k06306p0597J16050K3581K61473j07973K6127j19731L6447R0353
14636A342733j8787J16266j97520M05918m81468M23589j06110l35626K16344O5456
$$ plain form
14626 1430795 1341958 1402990 1441440 1423600 1414237 1071801 1339629 1477413 1551845 1504552 1457848
14615 1457848 1473152 1698630 1437140 1357132 1506976 1220668 1431052 1649930 1654573 1505956
14605 1505956 1690117 1745057 1682783 1893559 1513772 1188486 1556077 1656232 1553040 1423902
14595 1423902 1715659 1664819 1729629 1844395 1681823 1376212 1718167 1965852 1999973 1798898
14585 1798898 1820206 1800612 1810770 2227339 2070198 2131534 2130165 2008652 1712087 2083828
14575 2083828 2193097 2060906 2185559 2145816 1879812 2121190 2019999 2043656 2303574 2270050
14565 2270050 2193449 2590085 2656669 2270622 2786559 2621123 2942206 3090330 3031681 3021439
14555 3021439 3122328 3481907 3777421 4126977 4660798 5499032 6882368 10584026 18731014
$$ packed form
14626A430795q8837O1032L8450j7840r363l42436K67828J37784P4432m7293m6704
14615A457848J5304K25478k61490q0008J49844k86308K10384K18878M643j48617
14605A505956J84161N4940o2274K10776l79787l25286L67591J00155j03192j29138
14595A423902K91757n0840O4810J14766j62572l05611L41955K47685L4121k01075
14585A798898K1308j9594J0158M16569j57141O1336j369j21513k96565L71741
14575B083828J09269j32191J24653l9743k66004K41378j01191K3657K59918l3524
14565B270050p6601L96636O6584l86047N15937j65436L21083J48124n8649j0242
14555C021439J00889L59579K95514L49556N33821Q38234J383336L701658Q146988
$$ plain form
14546 18731014 38551565 44101003 23218756 11248276 5650749 3383894 2896551 2706280
14538 2706280 2432171 2082230 1930481 1947570 2008086 2049919 2120412 2163008 1964475 2409086
14528 2409086 2387474 2287184 2195125 2048578 2237706 2264737 2167970 2345656 2588788 2207808
14518 2207808 2525743 2582281 2686321 2630476 2596113 2906975 3037273 2693397 2881249 2769588
14508 2769588 2579587 2822675 2828257 2816315 2856575 2863575 2765294 2979224 3134091 2894403 2858518
14497 2858518 2994035 3149175 3391010 3347265 3496556 3126606 3781745 3702421 3147738 3527632
14487 3527632 3821274 3635730 3613857 3779578 3625605 3664774 3548372 4174624 3812766 3773644
14477 3773644 4116422 4019668 3885586 4143157 4256543 4192424 4101461 4434108 4306438 4154448
$$ packed form
14546A8731014J9820551N549438k0882247A1248276n597527k266855m87343j90271
14538B706280k74109l49941j51749J7089O0516M1833P0493M2596j98533M44611
14528B409086k1612j00290r2059j46547J89128K7031r6767J77686K43132l80980
14518B207808L17935N6538J04040n5845l4363L10862J30298l43876J87852j11661
14508B769588j90001K43088N582j1942M0260P000r8281K13930J54867k39688l5885
14497B858518J35517J55140K41835m3745J49291l69950O55139p9324n54683L79894
14487C527632K93642j85544k1873J65721j53973L9169j16402O26252l61858l9122
14477C773644L42778r6754j34082K57571J13386o4119r0963L32647j27670j51990
$$ plain form
14467 4154448 4618521 4425524 4456861 4378831 4288442 4889539 5011525 4826531 4483428 4567133
14457 4567133 5112981 4892205 4859671 5188534 5102343 5379392 5120861 5175455 5341064 5118751
14447 5118751 5682292 5566903 5666529 5643312 5728149 5939838 6411665 6009706 6258437 6211681
14437 6211681 6352159 6485455 6265163 6838119 6846811 6846513 7100228 6921677 6929132 6789915 6751352
14426 6751352 6891094 7767239 7648951 7398180 7286517 8134452 7921141 7767720 8205479
14417 8205479 8036481 8537566 8386662 8645673 8699477 8689120 8720178 8858620 9216316 9377746
14407 9377746 9191296 9561363 9853228 10017904 9784461 10032556 10247191 10458048 10789259
14398 10789259 10767130 10937353 10999605 11346769 11406997 11475045 11889504 12098307 12232436 12338499
$$ packed form
14467D154448M64073j92997L1337p8030r0389O01097J21986j84994l43103Q3705
14457D567133N45848k20776l2534L28863q6191K77049k58531N4594J65609k22313
14447E118751N63541j15389R9626k3217Q4837K11689M71827m01959K48731m6756
14437F211681J40478J33296k20292N72956Q692k98K53715j78551P455j39217l8563
14426F751352J39742Q76145j18288k50771j11663Q47935k13311j53421M37759
14417H205479j68998N01085j50904K59011N3804j0357L1058J38442L57696J61430
14407I377746j86450L70067K91865J64676k33443K48095K14635K10857L31211
14398A0789259k2129J70223O2252L47164O0228O8048M14459K08803J34129J06063
$$ plain form
14388 12338499 12728268 12748355 13244474 13130295 13197168 13614326 13864035 14447850 14640604 14736262
14378 14736262 14872116 15194241 15420551 16119032 16131964 16462429 16646066 17161048 17119126 17955153
14368 17955153 18322902 18614828 19008682 19646563 20161861 20310638 20749140 21306916 21726807
14359 21726807 21911348 22416607 22833654 23631683 23924137 24379362 25353944 25661898 26475929
14350 26475929 26987333 27422402 28258576 28988998 30023793 30609793 31383561 31966988 33039317
14341 33039317 34147984 35046633 35847262 36833526 37701586 38619347 39877997 41132520 42135591
14332 42135591 43924973 45209574 46488919 48055382 49444192 50933948 52788521 54203832
14324 54203832 55766281 58133650 60095956 61741434 64219136 66216498 69162597 71560465
$$ packed form
14388A2338499L89769K0087M96119j14179O6873M17158K49709N83815J92754R5658
14378A4736262J35854L22125K26310O98481J2932L30465J83637N14982m1922Q36027
14368A7955153L67749K91926L93854O37881N15298J48777M38502N57776M19891
14359B1726807J84541N05259M17047P98029K92454M55225R74582L07954Q14031
14350B6475929N11404M35069Q36174P30422J034795N86000P73768N83427J072329
14341C3039317J108667Q98649Q00629R86264Q68060R17761J258650J254523J003071
14332D2135591J789382J284601J279345J566463J388810J489756J854573J415311
14324E4203832J562449K367369J962306J645478K477702J997362K946099K397868
$$ plain form
14316 71560465 74357780 77035959 79621796 83067796 86239788 89701210 93159963 96971369
14308 96971369 101384870 105278503 110195363 114743040 119836346 125281466 130977630 137132251
14300 137132251 143368794 150242968 157209381 165082109 172931173 181419820 190303974 199923300
14292 199923300 209863431 220337665 231477411 242795067 255261291 267720383 280603748
14285 280603748 294460217 308562043 322363289 336886335 351270415 365499676 379538456
14278 379538456 392903269 405860405 417702032 428618826 437866344 444845425 448811585
14271 448811585 450179484 450611124 449660494 445806416 443050208 438280630 431114458 423003409
14263 423003409 412774415 401516573 388142737 374259091 359599123 344850536 329650625
$$ packed form
14316G1560465K797315K678179K585837L446000L171992L461422L458753L811406
14308I6971369M413501L893633M916860M547677N093306N445120N696164O154621
14300A37132251O236543O874174O966413P872728P849064Q488647Q884154R619326
14292A99923300R940131J0474234J1139746J1317656J2466224J2459092J2883365
14285B80603748J3856469J4101826J3801246J4523046J4384080J4229261J4038780
14278C79538456J3364813J2957136J1841627J0916794R247518O979081L966160
14271D48811585J367899M31640r50630l854078k756208m769578p166172q111049
14263D23003409j0228994j1257842j3373836j3883646j4659968j4748587j5199911
$$ plain form
14256 329650625 314237237 299752444 286346856 272735098 259612428 246669259 234704087
14249 234704087 223068730 212295478 201944182 192201050 182614588 174227099 166114910
14242 166114910 158325351 150685639 143834253 137417599 131322717 125675962 120280210 114895822
14234 114895822 110600275 105430825 101260475 97831091 93702266 89851117 86160716 83143629
14226 83143629 80013033 76806841 74099927 71328354 68911146 66433271 64512447 62136568
14218 62136568 60340055 58205902 56079236 54249418 52748028 51491401 49715826 47983051
14210 47983051 46687166 45476017 44021201 43397412 42290408 40778673 39567220 38252502
14202 38252502 37609307 36547013 35597743 35100507 33648125 32735069 31913413 31461778 30880486
$$ packed form
14256C29650625j5413388j4484793j3405588j3611758j3122670j2943169j1965172
14249B34704087j1635357j0773252j0351296r743132r586462q387489q112189
14242A66114910p789559p639712o851386o416654o094882n646755n395752n384388
14234A14895822m295547n169450m170350l429384m128825l851149l690401l017087
14226H3143629l130596l206192k706914k771573k417208k477875j920824k375879
14218F2136568j796513k134153k126666j829818j501390j256627j775575j732775
14210D7983051j295885j211149j454816o23789j107004j511735j211453j314718
14202C8252502o43195j062294r49270m97236j452382r13056q21656m51635n81292
$$ plain form
14193 30880486 30016633 29282800 28186872 27660625 27057318 26390582 25703813 24980442 24644207
14184 24644207 24115184 23319937 22882101 22370741 21647256 21669002 21070601 20592251 19915417
14175 19915417 19918046 19692361 18615802 18651795 18256257 17954565 17637067 17478164 16679850 16433626
14165 16433626 16393963 15931781 15852473 15320763 15296749 14729315 14586737 14588608 14003591 13668042
14155 13668042 13693912 13619910 13293410 13008529 12924201 12734403 12230539 12097030 12143547 11886773
14145 11886773 11612223 11102300 10979740 11013389 10921992 10726236 10793539 10394075 10345229 10148038
14135 10148038 9702249 9989914 9607136 9321253 9785971 8778816 9004739 8922535 8881769
14126 8881769 8754386 8784374 8412217 8440413 8409947 8239736 8090744 8014825 7856169 7611917
$$ packed form
14193C0880486q63853p33833j095928n26247o03307o66736o86769p23371l36235
14184B4644207n29023p95247m37836n11360p23485K1746n98401m78350o76834
14175A9915417K629k25685j076559L5993l95538l01692l17498j58903p98314k46224
14165A6433626l9663m62182p9308n31710k4014n67434j42578J871n85017l35549
14155A3668042K5870p4002l26500k84881q4328j89798n03864j33509M6517k56774
14145A1886773k74550n09923j22560L3649r1397j95756O7303l99464m8846j97191
14135A0148038m45789K87665l82778k85883M64718j007155K25923q2204m0766
14126H881769j27383K9988l72157K8196l0466j70211j48992p5919j58656k44252
$$ plain form
14116 7611917 7699798 7472296 7262777 7389269 7291336 7455597 7173858 6930313 6919342 7058185
14106 7058185 6817730 6553140 6859719 6594613 6538719 6037628 6381187 6271443 6153772 6251189
14096 6251189 6192447 5887710 5743401 5839596 5377138 5664580 5582343 5489881 5651625 5407833
14086 5407833 5276400 5293597 4874142 5352233 5074710 4966438 4794078 4937962 4808310 5004686
14076 5004686 4775900 4442741 4947450 4673732 4469600 4763333 4595576 4431293 4579055
14067 4579055 4571087 4414901 4242298 4391899 4284263 3982496 3922494 3842915 4011377 4047202
14057 4047202 4318055 3842673 3920548 3633974 3926285 3908899 3626084 3690220 3688927 3653257
14047 3653257 3390163 3624626 3633626 3334133 3485255 3440095 3642759 3172434 3196740 3225219
$$ packed form
14116G611917Q7881k27502k09519J26492r7933J64261k81739k43545j0971J38843
14106G058185k40455k64590L06579k65106n5894n01091L43559j09744j17671R7417
14096F251189n8742l04737j44309R6195m62458K87442q2237r2462J61744k43792
14086E407833j31433J7197m19455M78091k77523j08272j72360J43884j29652J96376
14076E004686k28786l33159N04709k73718k04132K93733j67757j64283J47762
14067D579055p968j56186j72603J49601j07636l01767o0002p9579J68462L5825
14057D047202K70853m75382P7875k86574K92311j7386k82815O4136j293l5670
14047C653257k63094K34463R000k99493J51122m5160K02664m70325K4306K8479
$$ plain form
14037 3225219 3097973 3194226 3038737 2821819 2907906 2921197 3115878 3013673 2927546 3066271
14027 3066271 3252457 2962077 3233118 2665305 2694095 2931368 2988275 3032920 2759347 2754565
14017 2754565 2672793 2864705 2598945 2697999 2515166 2818910 2805630 2594233 2724566 2370748
14007 2370748 2338542 2419148 2334130 2309274 2085124 2098421 2063225 2213223 2242261 2386756 2255055
13996 2255055 1995622 1817482 2270057 2516318 2301091 2264941 2343549 3522855 5922452
13987 5922452 12146134 31067584 45790252 27304376 14242823 9312793 6543111 5547293
13979 5547293 4339547 4050517 3789927 3188368 2667763 3010940 2952413 2782645 2760502 2680456
13969 2680456 2724418 2404879 2515956 2218049 2394480 2082209 1907755 2224628 2181447 2120931
$$ packed form
14037C225219j27246R6253j55489k16918Q6087J3291J94681j02205q6127J38725
14027C066271J86186k90380K71041n67813K8790K37273N6907M4645k73573m782
14017B754565q1772J91912k65760R9054j82833L03744j3280k11397J30333l53818
14007B370748l2206Q0606q5018k4856k24150J3297l5196J49998K9038J44495j31701
13996B255055k59433j78140M52575K46261k15227l6150P8608J179306K399597
13987E922452O223682J8921450J4722668j8485876j3061553m930030k769682r95818
13979E547293j207746k89030k60590o01559n20605L43177n8527j69768k2143q0046
13969B680456M3962l19539J11077k97907J76431l12271j74454L16873m3181o0516
$$ plain form
13959 2120931 2057251 1987081 2287965 1796870 2151813 1829369 1935701 1982082 1813822 2005788
13949 2005788 1740586 1756530 2002648 1754869 1769516 1777870 1685308 1713842 1661512 1837618 1869374
13938 1869374 1964499 2125305 1870098 1547360 1427088 1601365 1874660 1616260 1698080 1631465
13928 1631465 1803561 1421195 1586262 1762935 1868594 1864179 1625777 1525511 1756382 1544706
13918 1544706 1892571 1497019 1387134 1461686 1512147 1391863 1466593 1502780 1921427 1544785
13908 1544785 1333238 1676178 1448954 1689250 1525832 1755955 1604489 1235407 1493577
13899 1493577 1513182 1306261 1251895 1601316 1076221 1107291 1338364 1169663 1356411 1126433
13889 1126433 1175635 1124322 923705 1231330 1333142 1284734 1529655 811911 1757919 1025997
$$ packed form
13959B120931o3680p0170L00884m91095L54943l22444J06332M6381j68260J91966
13949B005788k65202J5944K46118k47779J4647Q354r2562K8534n2330J76106L1756
13938A869374R5125J60806k55207l22738j20272J74277K73295k58400Q1820o6615
13928A631465J72096l82366J65067J76673J05659m415k38402j00266K30871k11676
13918A544706L47865l95552j09885P4552N0461j20284P4730L6187M18647l76642
13908A544785k11547L42940k27224K40296j63418K30123j51466l69082K58170
13899A493577J9605k06921n4366L49421n25095L1070K31073j68701J86748k29978
13889A126433M9202n1313k00617L07625J01812m8408K44921p17744R46008p31922
$$ plain form
13879 1025997 1230316 1353702 970449 1237193 1275262 1228807 1209117 1055661 904418 1241014
13869 1241014 1371802 1087486 1246706 1258296 1076849 1000567 1292041 720631 1227926 1043954
13859 1043954 1216756 921509 1016333 1257622 1024707 1038438 1082365 1053317 1213167 857628
13849 857628 920809 1154972 1150914 673544 862280 1011773 799259 934531 874976 802533
13839 802533 1060199 970432 1201810 929253 1019119 833769 711173 887024 980017 1104703
13829 1104703 703229 734581 1237784 800208 971417 1092207 946741 814992 884358 1038932
13819 1038932 626353 839351 882307 789275 1048502 1014152 880614 749844 831620 809900
13809 809900 778233 726850 912827 840641 963047 943220 1051697 792300 707138 565124
$$ packed form
13879A025997K04319J23386l83253K66744L8069m6455j9690j53456j51243L36596
13869A241014J30788k84316J59220J1590j81447p6282K91474n71410N07295j83972
13859A043954J72802k95247R4824K41289k32915J3731M3927k9048J59850l55539
13849H57628O3181K34163m058m77370J88736J49493k12514J35272n9555p2443
13839H02533K57666q9767K31378k72557Q9866j85350j22596J75851R2993J24686
13829A104703m01474L1352N03203m37576J71209J20790j45466j31749O9366J54574
13819A038932m12579K12998M2956r3032K59227l4350j33538j30770Q1776k1720
13809H09900l1667n1383J85977p2186J22406j9827J08477k59397q5162j42014
$$ plain form
13799 565124 659030 797023 885025 937904 1053341 895085 746610 1015862 761174 559248
13789 559248 1207977 962820 525155 1024769 694145 793336 924615 911533 910856 787392
13779 787392 734969 628068 682563 459093 860862 536783 558968 585594 770185 773522 589166
13768 589166 845413 715822 952799 843575 880873 597302 1016511 547194 855612 866798
13758 866798 636814 748469 665927 332536 882325 638897 517039 786071 586655 797939
13748 797939 932077 622249 764921 666569 753864 714327 527192 528390 890036 374680
13737 367596 683800 492710 898402 612162 766735 592917 319699 508731 497659 589421
13727 589421 321252 519823 416525 687288 600063 593497 930005 619734 371804 158245
$$ packed form
13799E65124R3906J37993Q8002N2879J15437j58256j48475K69252k54688k01926
13789E59248O48729k45157m37665M99614l30624R9191J31279j3082o77j23464
13779G87392n2423j06901N4495k23470M01769l24079K2185K6626J84591L337j84356
13768E89166K56247j29591K36977j09224L7298k83571M19209m69317L08418J1186
13758H66798k29984J11655q2542C32536N49789k43428j21858K69032j99416K11284
13748G97939J34138l09828J42672r8352Q7295l9537j87135J198L61646C74680
13737C67596L16204j91090M05692k86240J54573j73818k73218J89032j1072R1762
13727E89421k68169J98571j03298K70763q7225o566L36508l10271k47930A58245
$$ plain form
13716 240781 633141 585451 595074 678003 522206 324090 493717 655914 538034 273256
13706 273256 353858 156901 353727 346718 334456 337979 556708 583645 722195 494954 347738
13695 347738 854044 584659 615488 664554 551713 386165 500443 308137 670470 600092
13685 600092 545530 824291 640538 677105 354690 486240 461573 534258 670170 767586
13675 767586 357800 423239 522399 449814 520528 367907 355838 302958 249989 115705 331923
13664 331923 757762 669559 536123 384260 228904 98324 655051 498627 529798 266290
13654 266290 354478 552467 697831 428926 521527 590914 571901 386575 449720 497391 684516
13643 684516 550504 332412 388083 223535 713447 762481 622119 604117 270532 142865
$$ packed form
13716B40781L92360m7690R623Q2929j55797j98116J69627J62197j17880k64778
13706B73256Q0602A56901J96826p009j2262L523K18729K6937J38550k27241j47216
13695C47738N06306k69385L0829M9066j12841j65548J14278j92306L62333p0378
13685F00092n4562K78761j83753L6567l22415J31550k4667P2685J35912R7416
13675G67586C57800O5439R9160p2585P0714j52621j2069n2880n2969A15705K16218
13664C31923M25839q8203j33436j51863j55356I8324N56727j56424L1171k63508
13654B66290Q8188J97989J45364k68905R2601O9387j9013j85326O3145M7671J87125
13643F84516j34012k18092N5671j64548M89912M9034j40362j8002B70532j27667
$$ plain form
13633 142865 477849 -112104 196850 243758 644548 705020 534509 499574 204701 278541
13623 278541 615603 603931 310430 372328 585035 222860 261969 296659 434901 285693
13613 285693 365432 682173 705173 270292 93520 316694 446882 282910 335538 264133
13603 264133 440957 418300 235458 164107 281525 -19323 268091 279318 424483 325941
13593 325941 148235 505246 293692 518666 297647 396936 217838 584757 229018 573814
13583 573814 375616 285388 286145 336867 328135 640370 304580 90790 121614 423087 382322
13572 382322 351261 532190 418209 444972 397478 267490 360632 662300 109060 144437
13562 144437 280156 -166635 142996 490368 -134101 225310 377776 360662 -22374 445577
$$ packed form
13633A42865L34984a12104A96850M6908M00790O0472j70511l4935B04701P3840
13623B78541L37062j1672k93501O1898K12707B22860L9109L4690J38242j49208
13613B85693P9739L16741K3000B70292I3520K23174J30188j63972N2628p1405
13603B64133J76824k2657j82842p1351J17418a9323B68091J1227J45165r8542
13593C25941A48235L57011k11554K24974k21019R9289j79098L66919B29018L44796
13583E73814j98198r0228P57N0722q732L12235C04580I0790L0824L01473m0765
13572C82322l1061J80929j13981K6763m7494j29988R3142L01668A09060L5377
13562A44437J35719a66635A42996L47372a34101B25310J52466j7114b2374D45577
$$ plain form
13551 241514 149285 283041 153583 178563 616191 231028 281643 391325 193189 486160
13541 486160 185067 243555 315236 440865 365601 364052 76117 294695 90075 522319 246507
13529 513785 244012 497099 251434 126931 193332 171725 171391 263306 450468 313024 102161
13517 422398 72653 337014 351216 306330 199498 87028 346491 93612 320446 637892
13507 637892 248279 405298 531174 185820 259640 416279 24141 81711 219873 386255
13497 386255 447483 100134 445250 126993 504385 193984 299759 237695 509309 48172
13486 189823 288429 265618 211313 132706 281985 245814 538598 352605 459078 -227624
13475 494594 26990 578947 -43868 178347 -68221 395152 169526 187430 23539 451613
$$ packed form
13551B41514r2229J33756j29458K4980M37628B31028N0615J09682A93189K92971
13541D86160A85067N8488P1681J25629p5264j549G6117K18578I0075M32244B46507
13529E13785B44012K53087k45665j24503O6401k1607l34R1915J87162j37444A02161
13517D22398G2653K64361J4202m4886j06832H7028K59463I3612K26834L17446
13507F37892B48279J57019J25876A85820P3820J56639B4141N7570J38162J66382
13497C86255O1228A00134L45116A26993L77392A93984J05775o2064K71614D8172
13486A89823R8606k2811n4305p8607J49279l6171K92784j85993J06473b27624
13475D94594B6990N51957d3868A78347f8221C95152A69526J7904B3539M28074
$$ plain form
13465 451613 131301 251607 169252 334326 236426 225075 413591 343499 154633 597679
13455 597679 90013 114704 76736 674681 80401 89527 278548 -89503 173883 317002 116041
13443 264354 828793 307326 325147 183179 249202 250776 189286 237593 89862 346826 302555
13432 302555 232206 149735 398107 470918 253281 234671 187434 345304 230838 -151012
13421 240968 -43636 155448 464555 162269 476321 268975 254481 183691 235471 125903
13411 125903 -158643 153914 117709 225046 179397 123488 287988 61421 -236 293247 368785
13400 368785 30097 173929 185705 206840 298631 280099 284102 450664 459260 423794 188092
13388 137920 147166 393386 459697 -31524 351735 68406 314423 287063 176008 252957 164210
$$ packed form
13465D51613A31301J20306q2355J65074r7900j1351J88516p0092A54633M43046
13455E97679I0013K4691l7968N97945H0401R126J89021h9503A73883J43119A16041
13443B64354N64439C07326J7821j41968O6023J574o1490M8307H9862K56964m4271
13432C02555p0349q2471K48372P2811k17637j8610m7237J57870j14466a51012
13421B40968d3636A55448L09107A62269L14052k07346j4494p0790N1780j09568
13411A25903a58643A53914l6205J07337m5649n5909J64500F1421b36B93247P5538
13400C68785C0097J43832J1776K1135R1791j8532M003J66562Q596l5466A88092
13388A37920R246K46220O6311c1524C51735F8406K46017k7360j11055P6949q8747
$$ plain form
13377 164210 87095 339524 139695 264425 -33894 233725 359008 56847 367030 420264
13367 420264 142735 52037 77486 186796 20515 260614 109271 213373 -29463 390196
13356 107552 107978 440001 220807 38877 143037 150382 419870 641828 -93227 -101358 492187
13344 208533 283494 330999 324977 362892 623094 116216 362359 -51286 84850 7338 -4294
13332 -52868 164249 541449 172811 3172 398019 284733 -201510 74154 398817 139739
13321 179215 379156 257220 119280 227205 -89540 205802 146658 231816 169397 272311
13311 272311 -35851 99420 459651 361936 -16282 232565 143829 250581 241017 162541 -211911
13299 195244 47521 -38670 -51788 145498 464596 242205 73505 325433 412372 344855 268215
$$ packed form
13377A64210p7115K52429A39695J24730c3894B33725J25283E6847L10183N3234
13367D20264A42735E2037K5449J09310B0515K40099A09271J04102b9463C90196
13356A07552M26L32023k19194C8877J04160P345K69488K21958i3227q131D92187
13344B08533P4961M7505o022L7915K60202A16216K46143e1286H4850G338d294
13332e2868A64249L77200A72811C172L94847j13286b01510G4154L24663A39739
13321A79215J99941j21936A19280J07925h9540B05802n9144Q5158o2419J02914
13311B72311c5851I9420L60231r7715a6282B32565q8736J06752r564p8476b11911
13299A95244D7521c8670j3118A45498L19098k22391G3505K51928Q6939o7517p6640
$$ plain form
13288 268215 50504 -250159 -89762 -5222 -142313 57498 510212 -172208 107858 -12584 178202
13276 371145 414933 -63803 74140 205664 405066 -16929 -119273 -11559 13924 53785 137774
13265 137774 178228 54008 291916 -953 368115 33348 -4096 353898 9138 115653 256703
13254 256703 297390 102904 116660 369284 230921 55286 161723 42300 -117807 333134
13243 85229 178409 -69609 224235 39830 120110 414929 191298 -116200 110459 192430 2941
13231 157966 -4811 309470 330454 -38844 203083 172317 -15057 91197 225520 298342 358628
13220 358628 260622 -147192 393994 -146847 185707 173290 221699 116051 -64938 -100964
13210 -100964 -136345 91560 130140 -140187 -86608 -75063 331201 297085 137050 99950 532515
$$ packed form
13288B68215E0504b50159h9762e222j37091E7498M52714a72208A07858a2584A78202
13276C71145M3788f3803G4140J31524J99402a6929j02344a1559A3924L9861Q3989
13265A37774M0454E4008K37908i53C68115C3348d096C53898I138J06515J41050
13254B56703M0687A02904J3756K52624j38363E5286J06437D2300a17807C33134
13243H5229R3180f9609B24235C9830Q0280K94819A91298a16200A10459Q1971B941
13231A57966d811C09470K0984c8844B03083l0766a5057I1197J34323P2822O0286
13220C58628r8006a47192C93994a46847A85707j2417M8409j05648f4938l6026
13210a00964l5381I1560L8580a40187N3579J1545C31201l4116A37050l7100M32565
$$ plain form
13199 532515 263124 -155624 314393 257485 127877 147073 185466 151190 11940 -287172
13188 278148 120921 -15395 -354688 -56010 76908 169488 -132402 -124395 -25636 38848 112778
13177 112778 233694 229638 -160251 64619 116606 193868 180429 -218447 33388 168850 199780
13166 199780 -141687 35073 -29200 -81042 94473 164080 189332 228907 24961 127212 157536
13155 157536 -23099 1829 424818 120993 275435 41021 131695 299459 125699 249114
13145 249114 -183284 62321 239262 75032 108484 153191 -371936 274972 36830 34451 266432
13134 266432 58801 254618 194885 -46659 -103348 47279 -12705 5186 -158829 11732 187678
13123 187678 -87864 -155188 289788 170035 65350 147667 108057 -209660 242962 331424 -18755
$$ packed form
13199E32515B63124a55624C14393n6908A27877J9196L8393l4276A1940b87172
13188B78148A20921a5395l39293e6010G6908R2580a32402Q007b5636C8848P3930
13177A12778J20916m056a60251F4619N1987P7262j3439b18447C3388J35462L0930
13166A99780a41687C5073b9200n1842I4473O9607K5252L9575B4961J02251L0324
13155A57536b3099A829M22989A20993J54442D1021R0674J67764A25699J23415
13145B49114a83284F2321J76941G5032L3452M4707c71936B74972C6830k379K31981
13134B66432E8801J95817n9733d6659n6689D7279a2705E186a58829A1732J75946
13123A87678h7864o7324B89788j19753F5350Q2317l9610b09660B42962Q8462a8755
$$ plain form
13111 157208 -30916 108855 -29409 359141 121147 248303 88140 -81949 -197139 80392
13100 45270 -40263 205953 50498 -24064 -18831 59007 -93953 -46136 84597 217071 228913
13089 228913 332300 291256 -132382 71550 49738 130826 122714 -58832 376925 20995 204252
13078 204252 447552 -33500 37127 205770 105700 -80161 128596 388383 35189 -45430
13067 101564 -175645 94171 -96433 46070 -271434 299541 -51078 -139522 50346 41292 443704
13056 443704 320288 136008 36178 61206 119884 75252 237009 406478 33629 122958 -90152
13044 12609 19260 78198 302335 42103 384396 317391 -143843 -110529 -44541 -266234 -35607
13032 -102610 95710 437752 -64374 161778 -65353 69002 174781 -63803 190184 271009 184462
$$ packed form
13111A57208c0916A08855b9409C59141A21147J27156H8140h1949j15190H0392
13100D5270d0263B05953E0498b4064N233E9007i3953d6136H4597J32474J1842
13089B28913J03387m1044a32382G1550k1812Q1088q112e8832C76925B0995J83257
13078B04252K43300c3500C7127J68643j00070h0161A28596K59787C5189d5430
13067A01564a75645I4171i6433D6070b71434B99541e1078q8444E0346r054M02412
13056D43704j23416A36008C6178K5028N8678m4632J61757J69469C3629Q9329i0152
13044A2609O651N8938K24137D2103L42293o7005a43843L3314d4541k21693c5607
13032a02610I5710L42042f4374A61778f5353F9002J05779f3803A90184Q0825q6547
$$ plain form
13021 184462 207893 353011 184982 -123030 74013 204398 468607 -84332 90501 65502
13011 65502 -56473 175483 415635 157494 320095 -33540 296405 188370 75757 486435
13001 486435 -340681 14634 29660 -226610 287813 120753 74785 -371048 160356 103413
12991 103413 -57244 56336 227163 61285 208379 160546 207355 89476 17449 318569 -118934
12979 26790 -9083 -160552 112166 281241 -31840 -100031 64053 106931 4957 212440 341635
12968 341635 110947 36373 -309131 183059 -269269 -28020 129136 89015 192993 -220729
12957 -3528 -31303 -154403 -260255 86218 214851 311182 -4695 100487 199472 297404 -138570
12945 -33840 86825 205883 -37935 83949 -391047 71061 -10330 81137 17643 49048 184173
$$ packed form
13021A84462K3431J45118j68029a23030G4013J30385K64209h4332I0501k4999
13011F5502e6473A75483K40152A57494J62601c3540B96405j08035G5757M10678
13001D86435c40681A4634J5026b26610B87813A20753m5968c71048A60356n6943
12991A03413e7244E6336J70827F1285J47094m7833M6809H9476A7449L01120a18934
12979B6790i083j51469A12166J69075c1840o8191F4053M2878D957K07483J29195
12968C41635A10947C6373c09131A83059b69269b8020A29136m0121J03978b20729
12957c528k7775j23100j05852H6218J28633R6331d695A00487R8985R7932a38570
12945c3840H6825J19058c7935H3949c91047G1061a0330H1137A7643L1405J35125
$$ plain form
12934 184173 33093 -101047 38801 -156559 -125390 88226 148183 458145 -26871 -14336 39853
12922 320889 -75046 -163024 -25939 24846 62248 208032 20218 -119051 -54590 -148267 -4343
12910 -16973 25767 38783 104571 30518 322723 210241 124144 -81398 249051 121715 145283
12899 145283 99871 309744 -180120 70096 -190800 16224 -356954 -133687 103116 177334
12889 177334 124731 123895 -39871 288246 -28528 18415 1477 -66207 -11860 192258 444335
12878 444335 248008 173819 -201140 -241278 -139954 -78166 -15747 182672 -19514 -108955 209152
12866 77806 -51520 -638 -240201 64311 -287514 125301 -200428 154699 80899 211740 -203330
12854 -176542 388655 -99190 63493 368479 84038 -68957 170016 123007 -45098 144664 19070
$$ packed form
12934A84173C3093a01047C8801a56559L1169H8226N9957L09962b6871J2535C9853
12922C20889g5046q7978b5939B4846L7402J45784B0218a19051e4590r3677d343
12910a6973B5767J3016O5788C0518K92205j12482q6097h1398B49051A21715K3568
12899A45283m5412K09873a80120G0096a90800A6224c56954a33687A03116P4218
12889A77334n2603q36c9871B88246b8528A8415A477f6207a1860A92258K52077
12878D44335j96327p4189b01140m0138J01324O1788a5747A82672a9514q9441B09152
12866G7806e1520f38k39563F4311b87514A25301b00428A54699p3800J30841b03330
12854a76542C88655i9190F3493L04986H4038f8957A70016m7009d5098A44664A9070
$$ plain form
12842 -71426 -56137 294310 -100511 -365363 37150 114370 39947 -97488 338255 -388439 305121
12830 67689 199600 171488 1994 193925 -81788 -76909 -174347 -75746 132294 9718 41174 86248
12818 86248 -252510 -115577 53425 -153495 -4417 139871 213267 -288103 32740 175162 216596
12807 216596 223179 -107128 -172145 -48684 -43966 59466 282549 129041 37427 154426 -84358
12795 -175622 87665 -83595 73259 -164834 236798 124044 169859 96688 47680 182874 270735
12784 270735 38714 -344165 43463 -56169 -311283 126812 92640 99039 119212 245330 139696
12773 139696 223857 68640 -89864 135136 176116 155132 197361 182083 -57948 72021 -220463
12761 153313 -44866 -265860 215230 119327 115758 -15183 -173259 39044 -33543 -33154 -149213
$$ packed form
12842g1426J5289B94310a00511k64852C7150P7220C9947i7488C38255c88439C05121
12830F7689J31911k8112A994J91931h1788M879r7438g5746A32294I718L1456M5074
12818H6248b52510a15577E3425a53495d417A39871P3396b88103C2740J42422M1434
12807B16596O583a07128o5017d8684M718E9466K23083A29041C7427J16999h4358
12795a75622H7665h3595G3259a64834B36798j12754M5815p3171D7680J35194Q7861
12784B70735C8714c44165D3463e6169k55114A26812l4172O399K0173J26118j05634
12773A39696Q4161F8640h9864A35136M0980k0984M2229j5278e7948G2021b20463
12761A53313d4866k20994B15230r5903l569a5183j58076C9044c3543L89j16059
$$ plain form
12750 -149213 -53894 84021 -188830 -39341 83741 -102186 95334 157623 12099 -33890 -73310
12739 -73310 45439 -149841 86276 53960 92916 82322 144597 97290 17681 -689501 -50880
12727 163648 151564 -164102 1687 27745 -36098 192863 -19207 174761 86611 -211791 315739
12715 130106 245867 232696 169269 -59872 -104952 174477 171047 86179 -163192 247179 49464
12703 -65194 324605 137749 -24675 -39254 103095 -83036 353218 197510 -80705 -46998 233777
12691 243650 149403 -29339 -53810 -221503 -118039 -23453 49299 239973 174863 32191 -32775
12679 -99369 -176055 424713 27018 -76369 8630 230436 299670 49087 -73564 -171000 -26283
12667 -3825 -148923 60811 93752 103190 10975 306869 -54156 -138530 181213 -157023 25179
$$ packed form
12750a49213e3894H4021a88830c9341H3741a02186I5334O2289A2099c3890l9420
12739g3310D5439a49841H6276l2316L8956j0594O2275m7307A7681f89501e0880
12727A63648j2084a64102A687K6058c6098A92863a9207A74761H6611b11791C15739
12715A30106J15761j3171o3427e9872m5080A74477l430q4868a63192B47179D9464
12703f5194C24605A37749b4675j4579A03095h3036C53218j55708h0705L3707B33777
12691B43650r4247b9339k4471j67693J03464b3453D9299J90674o5110C2191c2775
12679i9369p6686D24713B7018g6369H630K21806O9234D9087g3564r7436b6283
12667c825j45098F0811L2941R438A0975K95894e4156q4374A81213a57023B5179
$$ plain form
12655 292473 -5165 185956 93078 -183521 -141230 197859 21166 -16462 -48234 -47904 150850
12643 99588 15005 87675 162695 101041 -86917 -33905 -64853 66088 239163 155691 -195191
12631 120808 -37951 180531 214519 234297 456043 79445 466993 78208 304753 67665 170685
12620 170685 287105 246128 -112892 -42515 144940 398002 -43212 178136 -54288 -1733 503025
12608 343537 29626 9365 -156640 388049 493649 62514 185090 142306 -12967 16688 101439
12597 101439 501212 343674 279028 157030 -125615 215566 24411 59269 142720 -316839
12586 -60541 231392 -184780 -32642 52936 124584 -209541 -122085 1483 41520 79540 -76984
12574 8568 -161601 285484 88997 15172 77815 77857 91336 -226628 116322 296431 -159028
$$ packed form
12655B92473e165A85956r2878a83521M2291A97859B1166a6462l1772L30A50850
12643I9588A5005P2670P5020o1654h6917c3905l0948F6088J73075q3472a95191
12631A20808c7951A80531L3988J9778K21746G9445L87548G8208K26545F7665J03020
12620A70685J16420m0977a12892d2515A44940K53062d3212A78136e4288a733E03025
12608C43537B9626I365a56640C88049J05600F2514J22576m2784a2967A6688Q4751
12597A01439L99773j57538o4646j21998a25615B15566B4411L4858Q3451c16839
12586f0541B31392a84780c2642E2936P1648b09541Q7456A483M0037L8020g6984
12574H568a61601B85484H8997A5172O2643M2J3479b26628A16322J80109a59028
$$ plain form
12562 147759 16016 342571 -149938 -94889 92141 89816 -139802 -209542 -9392 24561 -276375
12550 -54413 -22109 8732 77409 156815 8561 -21712 -224342 95143 293768 -35156 -107250 -212378
12538 -212378 99576 44598 74807 -158341 28546 -130786 25362 228394 -294106 -13410 -74680
12527 -74680 -58632 124826 23907 219684 -56409 74493 -137585 134256 41845 12322 9136
12516 9136 -12647 -116858 147961 -77432 12906 187936 37670 416836 -314937 177310 77975
12504 -28351 -289723 143387 -35898 -85685 -118179 -178886 87262 52261 -63570 -67116 91214
12492 -129237 184832 159742 149937 -99686 -91431 66751 78015 30718 -29830 -218866 -157081
12481 -157081 375369 -144542 239627 -28426 424058 8321 -130297 -19987 161849 239470
$$ packed form
12562A47759A6016L26555a49938N5049I2141k325a39802o9740i392B4561b76375
12550e4413b2109H732O8677P9406H561b1712k02630I5143J98625c5156p2094j05128
12538b12378I9576D4598L0209a58341B8546a30786B5362K03032b94106a3410o1270
12527g4680J6048A24826B3907J95777e6409G4493a37585A34256D1845A2322l186
12516I136a2647j04211A47961g7432A2906J75030C7670L79166c14937A77310G7975
12504b8351k61372A43387c5898m9787l2494o0707H7262l5001f3570l546I1214
12492a29237A84832k5090r805i9686Q255F6751J1264C0718b9830j89036O1785
12481a57081C75369a44542B39627b8426D24058H321a30297a9987A61849P7621
$$ plain form
12471 239470 36093 43297 -55900 -270050 6750 6865 -231652 -113643 -184367 371997 -117696
12459 -26318 167799 -1643 -175856 4436 -276175 5475 171073 -19643 18275 -198762 280562
12447 -102366 124911 89446 -50803 -130870 300199 -16223 26576 -49331 118805 -120015 -164123
12436 -164123 -56747 -66196 -240646 25817 40423 -134089 18561 -20117 2458 62925 42503
12425 42503 -111577 348575 -184149 72336 330427 -144566 273227 166065 -168002 123789
12414 88871 -49425 85826 -186699 -59952 9011 5078 142858 15402 370880 -176562 480621
12402 39491 553775 234238 -360017 254916 127139 -265016 227105 266143 350336 25884
12391 -227458 -18644 189358 -239321 -33731 229373 76090 137454 57826 48744 -232324 -9687
$$ packed form
12471B39470C6093P204e5900k14150F750J15b31652a13643p0724C71997a17696
12459b6318A67799a643j74213D436b76175E475J65598a9643A8275a98762B80562
12447a02366A24911l5465e0803q0067C00199a6223B6576d9331A18805a20015m4108
12436a64123e6747r449j74450B5817J4606a34089A8561b0117B458O0467k0422
12425D2503a11577C48575a84149G2336K58091a44566B73227j07162a68002A23789
12414H8871d9425H5826a86699e9952I011l933J37780A5402L55478a76562D80621
12402C9491N14284B34238c60017B54916A27139b65016B27105L9038Q4193B5884
12391b27458a8644A89358b39321c3731B29373G6090O1364E7826r082b32324i687
$$ plain form
12379 -267685 -419882 -77677 -54738 166928 81807 281890 -276547 -55193 -162050 176671
12368 108463 -73966 -247077 18708 -332240 44681 174914 -262738 -15321 16870 7751 93784
12357 93784 339803 242457 183188 -55071 31703 -112800 197206 93946 -251480 -163471 27643
12345 17873 400194 345969 144010 -23289 24111 41517 184907 -191465 200862 33824 -153605
12333 66230 319718 53835 271210 -4103 -177683 124502 -53125 -220481 -25635 140599 226868
12322 226868 103474 90415 273509 -55987 -94724 -304775 -160613 -1662 -98627 77205 -61048
12310 47549 200464 125100 -135321 -25540 -72933 147423 -125875 -222931 112058 -311913
12299 14042 -96389 -261330 -250812 -126039 135098 248382 152177 257231 -111474 -22733
$$ packed form
12379b67685j52197g7677K2939A66928H1807K00083b76547e5193j06857A76671
12368A08463g3966j73111A8708c32240D4681J30233b62738a5321A6870G751Q6033
12357I3784K46019r7346n9269e5071C1703a12800A97206I3946b51480Q8009B7643
12345A7873L82321n4225A44010b3289B4111J7406J43390a91465B00862C3824a53605
12333F6230K53488E3835K17375d103j73580A24502e3125j67356b5635A40599Q6269
12322B26868A03474j3059J83094e5987l8737k10051J44162a662r6965G7205f1048
12310D7549J52915p5364a35321b5540m7393A47423a25875r7056A12058c11913
12299A4042i6389j64941J0518J24773A35098J13284r6205J05054a11474b2733
$$ plain form
12288 31608 -35998 -318994 18158 -23686 73066 -83927 40855 -125341 -98423 140045 24245
12276 92169 249465 59321 -176235 388824 -18873 219418 48135 -202332 356283 -360159
12265 110109 302990 297825 271924 383799 165745 -226447 352197 204273 134319 105071
12255 105071 112511 412835 109384 172852 2876 330417 179729 -190782 -13822 226268 134573
12244 134573 107931 139419 -195398 32696 -120403 -171084 52884 -48790 360707 161024 -109255
12232 264831 152125 31221 379815 267100 225141 399936 201358 192018 -121727 39190
12221 311128 599648 51686 -74929 147170 123056 246189 134830 -38185 353696 187764
12211 187764 -269968 113905 550390 171910 130584 41367 349489 371670 333330 -375819
$$ packed form
12288C1608c5998k82996A8158b3686G3066h3927D0855a25341K6918A40045B4245
12276I2169J57296E9321a76235C88824a8873B19418D8135b02332C56283c60159
12265A10109J92881n165k5901J11875A65745b26447C52197j47924o9954k9248
12255A05071P440L00324A09384O3468B876L27541j50688a90782a3822B26268r1695
12244A34573k6642L1488a95398C2696a20403n0681E2884d8790C60707A61024a09255
12232B64831j12706C1221L48594j12715m1959J74795j98578r340a21727C9190
12221C11128K88520E1686g4929A47170k4114J23133j11359c8185C53696j65932
12211A87764b69968A13905M36485A71910m1326D1367L08122K2181l8340c75819
$$ plain form
12200 114666 17373 -62297 212912 297458 263064 93615 63829 66004 85429 287987 291489
12189 291489 81007 520975 269789 132132 -168895 -26075 130977 122247 235663 259795
12179 259795 56752 282293 95806 -30295 -132541 27332 -137085 339825 214307 505465
12169 505465 8726 236751 316592 81617 306311 197329 296618 9205 558955 65007 79649
12158 79649 112301 349522 -85045 287207 110230 176147 423803 132773 51551 -100657
12147 62046 -136526 -88095 -79408 181174 296347 -101165 6986 171336 126632 -66828 -111592
12136 -111592 42802 76494 144459 -2134 -909 41178 -199105 281188 153698 41868 161176
12125 161176 -23762 316189 362965 314618 -18615 -77272 -324661 18432 41234 82697 -520023
$$ packed form
12200A14666A7373f2297B12912Q4546l4394I3615k9786K175J9425K02558L502
12189B91489H1007M39968k51186A32132a68895b6075A30977q730J13416K4132
12179B59795E6752K25541I5806c0295j02246B7332a37085C39825j25518K91158
12169E05465H726K28025P9841H1617K24694j08982R9289I205N49750F5007J4642
12158G9649L2652K37221h5045B87207A10230O5917K47656A32773E1551a00657
12147F2046a36526M8431Q687A81174J15173a01165F986J64350m4704f6828m4764
12136a11592D2802L3692O7965b134i09D1178a99105B81188j27490D1868J19308
12125A61176b3762C16189M6776m8347a8615n8657k47389A8432K2802M1463e20023
$$ plain form
12113 33427 -70860 317849 -147338 289787 -124396 79159 57031 -55367 -252663 119620
12102 -8285 -61144 -257263 -27721 -229284 383602 -10484 -26471 -55892 171707 -328738 36668
12090 -70416 -163590 69973 -227867 -69993 63517 23462 -105751 -195496 149885 -75910 40304
12078 -92198 -74379 -47770 -141798 333191 -102756 -226785 201024 -124438 -312645 -65896
12067 -79105 -82228 -5447 101377 -206744 -329080 137885 -120167 -202400 -109675 94123 208345
12056 208345 84660 330735 -18653 -90806 -18906 149702 527478 1726736 1059847 577115
12046 577115 359742 244104 -121133 116593 -7471 132281 -220821 -232051 -53734 130447
12035 99127 -228063 -61136 -85064 34544 78820 98099 146362 165611 -222752 -163398 -393928
$$ packed form
12113C3427g0860C17849a47338B89787a24396G9159k2128e5367j97296A19620
12102h285n2859j96119b7721k01563C83602a0484j5987k9421A71707c28738C6668
12090g0416r3174F9973b27867f9993F3517B3462a05751q9745A49885g5910D0304
12078i2198J7819K6609r4028C33191a02756j24029B01024a24438j88207f5896
12067g9105l123e447A01377b06744j22336A37885a20167q2233R2725I4123J14222
12056B08345H4660K46075a8653p2153a8906A49702L77776J199258o66889m82732
12046E77115k17373j15638a21133A16593g471A32281b20821j1230e3734A30447
12035I9127b28063f1136k3928C4544M4276J9279M8263J9249b22752N9354k30530
$$ plain form
12024 -393928 412368 -22686 -271277 -207344 22207 253163 187493 47209 -51169 -28852 25922
12012 -140928 -202035 -69960 147244 -129455 77603 -187868 -313885 -87779 -65587 147541
12001 6635 4923 54798 -14037 -210164 -206707 -29407 -206091 82592 -115394 -107609 59880 -293346
11988 77293 148715 -94093 28420 24582 139536 -118597 141898 177607 36140 -258812 -73112
11976 -244940 335371 -121718 -155118 -53907 -175265 146432 -189130 -177959 21561 47495
11966 47495 21639 116601 120994 293143 95424 -108479 -89960 -217713 185596 -281576 -54056
11954 -16937 403106 -537097 -16662 -89860 -62625 129985 171855 -137862 319819 -131843
11943 53781 23192 121925 -211588 -350141 42279 -51581 -117027 126347 -108376 61978 -187246
$$ packed form
12024c93928D12368b2686k48591O3933B2207K30956o5670D7209e1169K2317B5922
12012a40928o1107f9960A47244a29455G7603a87868j26017h7779K2192A47541
12001F635j712M9875a4037j96127L457b9407j76684H2592a15394P785E9880b93346
11988G7293P1422i4093B8420l838J14954a18597A41898L5709C6140b58812g3112
11976b44940C35371a21718l3400e3907j21358A46432a89130J1171B1561K5934
11966D7495B1639R4962M393J72149I5424a08479J8519j27753A85596b81576e4056
11954a6937D03106e37097a6662p3198K7235A29985M1870a37862C19819a31843
11943E3781B3192R8733b11588j38553D2279e1581o5446A26347a08376F1978a87246
$$ plain form
11931 144017 150175 90925 -4992 46471 380670 -300037 334969 19185 -195113 -309724 -388833
11920 -388833 36006 146053 128714 17325 281375 127613 -89486 -102263 -243860 27278 13072
11908 58905 -194828 47948 -33947 -14885 -120471 1091 128732 167027 -170633 159225 -68750
11896 -18461 61802 -114315 -27853 64308 345656 -179007 132248 -216665 -347879 -64541
11885 145040 -91900 30529 -129467 283838 -329562 -66711 -147302 -217653 -22478 283382 -249271
11873 135245 210283 72820 149715 -34019 162413 215950 -92461 -11780 -358883 -184649 -8841
11861 -193316 168605 188168 -64132 4138 -299783 9815 -117432 115449 -159481 -122800 117814
11849 90769 6942 -73733 -20492 -65260 -310791 -95881 8790 -32979 35912 -214470 -249972 -83281
$$ packed form
11931A44017O158n9250d992D6471L34199c00037C34969A9185a95113j14611p9109
11920c88833C6006J10047j7339A7325K64050A27613h9486j2777j41597B7278A3072
11908E8905a94828D7948c3947a4885j05586A091J27641L8295a70633A59225f8750
11896a8461F1802a14315b7853F4308K81348a79007A32248b16665j31214f4541
11885A45040i1900C0529a29467B83838c29562f6711q0591p0351b2478B83382b49271
11873A35245P5038G2820P6895c4019A62413N3537i2461a1780l47103J74234h841
11861a93316A68605J9563f4132D138b99783I815a17432A15449a59481L6681A17814
11849I0769F942g3733b0492m4768k45531i5881H790c2979C5912b14470l5502h3281
$$ plain form
11836 -265128 93545 -86828 186448 -267474 198638 -45364 -79706 -253677 -124501 109257
11825 165324 30197 -99183 -403387 -122222 133576 -166748 30537 208310 -57824 24044
11814 99242 -199946 -165074 -9671 -148516 188982 12032 -44679 -289344 67825 36049 59586
11803 59586 -434443 -208842 136177 -439622 -312451 89874 12117 134685 170087 115025
11793 115025 -81696 67963 169993 230030 243672 87326 -251995 -229548 -19184 150066 19027
11781 11137 -400663 -577 31317 95639 345704 -66048 434655 205798 300618 -178470 100771
11769 4016 126038 -40982 -41421 -184689 54589 194422 129349 123097 5701 -103784 -80490 29820
11756 195690 -51492 11188 -174610 -202160 22054 41369 -355455 110167 -93120 21498 440069
$$ packed form
11836b65128I3545h6828A86448b67474A98638d5364l4342j73971a24501A09257
11825A65324C0197i9183l04204a22222A33576a66748C0537J77773e7824B4044
11814I9242a99946L4872i671j38845A88982A2032d4679k44665F7825l1776K3537
11803E9586d34443b08842A36177d39622J27171H9874A2117J22568L5402n5062
11793A15025h1696F7963J02030O0037J3642H7326b51995K2447a9184A50066A9027
11781A1137d00663e77C1317O4322K50065f6048D34655B05798R4820a78470A00771
11769D016J22022d0982m39j43268E4589J39833o5073o252E701a03784K3294B9820
11756A95690e1492A1188a74610k7550B2054J9315c55455A10167i3120B1498M18571
$$ plain form
11745 440069 -207115 221917 168594 8221 -204112 304303 -120809 52313 -192078 68524
11734 106287 -33150 -15863 90258 90575 -201532 -49357 -172866 -225828 271907 74290 23384
11722 -241793 67293 -275812 16839 -340483 -109147 -402240 -104684 131559 -38516 350868
11711 338191 113123 -94106 435127 -159367 31754 1965 -18996 -155987 24633 -216812 248007
11699 -141976 136431 101635 357599 51862 -21401 97005 -123973 176347 257223 52094 237573
11688 237573 551043 -35798 88786 60309 202467 -360405 308998 80286 -6379 195172 -29972
11676 279474 88004 421777 -107052 -122892 26082 -6699 -108433 -68562 276017 108597 13563
11664 178662 158875 -280275 283672 131040 -23165 59110 -25152 -114272 407222 -259928
$$ packed form
11745D40069b07115B21917n3323H221b04112C04303a20809E2313a92078F8524
11734A06287c3150a5863I0258L17b01532d9357j23509n2962B71907G4290B3384
11722b41793F7293b75812A6839c40483a09147k93093a04684A31559c8516C50868
11711C38191A13123i4106D35127a59367C1754A965a8996j36991B4633b16812B48007
11699a41976A36431l4796K55964E1862b1401I7005a23973A76347Q0876E2094J85479
11688B37573L13470c5798H8786k8477J42158c60405C08998H0286f379A95172b9972
11676B79474H8004L33773a07052j5840B6082f699j01734L9871B76017A08597A3563
11664A78662j9787b80275B83672A31040b3165E9110b5152q9120D07222b59928
$$ plain form
11653 -291878 -167059 -1110 72525 121049 -82590 43412 -57915 149776 -203545 -42177 33316
11641 -262555 -44438 158735 216713 229345 -174012 -285274 5026 -60521 -222492 -45092 176762
11629 -126487 3633 235805 -23547 218149 72811 -92947 -28106 65248 153511 255145 291245
11618 291245 179328 -5295 186421 -388817 -11791 28757 -174952 -209727 210987 57106 90875
11607 90875 -7739 -57487 172726 -356782 -101807 377015 574696 -38344 148635 280414
11597 280414 82883 103768 -251793 210143 94290 -56166 -102613 54063 294322 12654 61245
11586 61245 -197722 5694 -95901 137812 43905 -157438 -57592 -114501 -169725 403771 3567
11574 7492 -255926 68094 19906 -140787 89941 149608 -202859 -154607 -169324 152265 -211151
$$ packed form
11653b91878J24819a110G2525M8524h2590D3412e7915A49776b03545d2177C3316
11641b62555d4438A58735N7978J2632a74012j11262E026f0521j61971d5092A76762
11629a26487C633K32172b3547B18149G2811i2947b8106F5248Q8263J01634L6100
11618B91245j11917e295A86421c88817a1791B8757a74952l4775B10987E7106L3769
11607I0875g739m9748A72726c56782a01807C77015J97681c8344A48635J31779
11597B80414H2883K0885b51793B10143I4290e6166m6447E4063K40259A2654M8591
11586F1245a97722E694i5901A37812D3905a57438e7592n6909n5224D03771C567
11574G492b55926F8094A9906a40787H9941N9667b02859M8252j4717A52265b11151
$$ plain form
11562 86005 84211 112136 101714 290402 -136816 85790 -202471 32587 146741 -135646 246667
11550 198460 95966 212201 466921 159558 20065 -5797 152288 -42197 81642 -198869 -146407
11539 -146407 13217 201535 228858 -15772 -46711 -53969 7881 -4507 44271 156109 104037 211992
11527 211992 83036 225930 307758 326890 17525 236088 103491 -78227 -23797 80005 110576
11516 110576 132906 114144 290676 61670 -234546 91182 -18627 132577 51810 109717 -170070
11504 -50735 173225 124608 295782 263102 67796 136859 111928 -271145 -141500 45247 302761
11493 302761 317306 375373 260967 -39826 343042 65893 676633 -2825 313117 235568 -28034
11481 358 -68849 57923 104509 53486 332783 295850 38948 158613 140767 -61851 -224486
$$ packed form
11562H6005j794K7925j0422J88688a36816H5790b02471C2587J14154a35646B46667
11550A98460I5966J16235K54720A59558B0065e797A52288d2197H1642a98869N2462
11539a46407A3217J88318K7323a5772l0939p258G881d507D4271J11838n2072J07955
11527B11992H3036J42894Q1828J9132A7525K18563A03491g8227b3797H0005L0571
11516A10576K2330j8762J76532F1670b34546I1182a8627A32577E1810N7907a70070
11504e0735A73225m8617J71174l2680F7796O9063k4931b71145J29645D5247K57514
11493C02761J4545N8067j14406c9826C43042F5893O10740b825C13117p7549b8034
11481C58f8849E7923M6586n1023K79297l6933C8948J19665j7846f1851j62635
$$ plain form
11470 -224486 258391 -86920 -15015 -45451 280252 -126128 285699 362424 170594 231973
11460 231973 363715 191773 -87754 -35496 -52399 437368 100412 191087 168465 -70496 108267
11448 -372608 -129157 -70322 -13151 139223 -39333 -160995 109495 33706 79327 -155828
11437 -243872 394711 90253 187419 -4720 132948 -51620 42544 155335 -55916 -49554 -166665
11426 -166665 95106 -21821 -247934 41187 -35676 230740 323715 109288 -14210 337453 229653
11415 229653 68790 215644 -263359 78970 -117842 332383 -48423 -88391 28868 182489
11405 182489 -104273 227851 351006 34774 -111228 62657 53341 -38446 5134 231596 236142
11394 236142 69579 199798 309922 137442 -203542 311023 -52471 -84134 -45816 -136771
$$ packed form
11470b24486B58391h6920a5015l0436B80252a26128B85699P6725A70594O1379
11460B31973J31742j71942h7754c5496j6903D37368A00412R0675k2622g0496A08267
11448c72608a29157N8835a3151A39223c9333j21662A09495C3706M5621a55828
11437b43872C94711I0253R7166d720A32948e1620D2544J12791e5916O362j17111
11426a66665I5106b1821k26113D1187c5676B30740R2975A09288a4210C37453j07800
11415B29653F8790J46854b63359G8970a17842C32383d8423l9968B8868J53621
11405A82489a04273B27851J23155C4774a11228F2657r316c8446E134K26462M546
11394B36142F9579J30219J10124A37442b03542C11023e2471l1663L8318r0955
$$ plain form
11384 -136771 -126730 293731 -260917 -107517 453140 247623 296878 34017 -188811 -84701
11373 -256318 156880 230609 -362542 168616 130824 282956 -90835 -125023 -44663 -14086 -274447
11362 -274447 79724 318907 155391 16922 -265701 117375 -38570 65931 -29612 -27177 12464
11350 -78167 -387089 68168 145388 -128944 -160466 -126808 -82953 299162 107077 195113 -240737
11338 -114124 264385 -52460 46106 130753 95756 44124 322869 14130 24186 168091 202940
11327 202940 -41147 86440 -238943 81443 73413 187715 -117814 -83189 116167 -421541 32761
11315 -26873 124636 -200826 181846 -418559 -276103 -14108 -39754 -178202 34501 -94892
11304 24626 -33507 -176895 77248 -317210 -113928 98664 133510 -197920 -325763 134899
$$ packed form
11384a36771J0041B93731b60917a07517D53140k05517M9255C4017a88811h4701
11373b56318A56880P3729c62542A68616l7792J52132i0835l4188d4663a4086k60361
11362b74447G9724K39183A55391A6922b65701A17375c8570F5931b9612K435A2464
11350g8167l08922F8168P7220a28944l1522L3658M3855B99162A07077Q8036b40737
11338a14124B64385e2460D6106Q4647l4997D4124K78745A4130J0056J43905L4849
11327B02940d1147H6440b38943H1443q030J14302a17814L4625A16167d21541C2761
11315b6873A24636b00826A81846d18559J42456a4108k5646j38448C4501i4892
11304B4626c3507j43388G7248c17210a13928I8664L4846a97920j27843A34899
$$ plain form
11293 -12044 -298690 110094 -30665 -225925 248692 -159363 80660 18846 15178 -91200 -96349
11282 -96349 -247524 -10575 37617 -54084 156492 -63373 301513 67717 -260226 -107817 -20684
11270 -41252 -129829 77401 -95807 -179815 117925 -394061 -305023 183875 -54463 136823 295142
11259 295142 242296 -25508 -32017 -40336 -156657 -123571 -168352 323665 211729 115342 81333
11248 81333 -189899 -83764 253022 -171921 -112900 61224 -105077 312767 31123 -61786 -76526
11237 -76526 -115304 -391954 -27365 -62208 148677 -72542 -103595 -287908 -308877 -408218 -24305
11225 48542 2365 74707 -246880 -37444 130748 -22355 -363774 -54189 206457 174213 -62771
11213 -365467 -111388 25891 -111153 47581 -50488 76144 104901 76423 84029 -178012 -36278
$$ packed form
11293a2044k86646A10094c0665j95260B48692a59363H0660A8846l668i1200n149
11282i6349j51175a0575C7617e4084A56492f3373C01513F7717b60226a07817b0684
11270d1252q8577G7401i5807q4008A17925c94061Q9038A83875e4463A36823J58319
11259B95142n2846b5508o509q319j16321L3086m4781C23665j11936r6387l4009
11248H1333a89899h3764B53022a71921N9021F1224a05077C12767C1123f1786j4740
11237g6526l8778k76650b7365l4843A48677g2542l1053j84313k0969r9341b4305
11225D8542B365P2342b46880c7444A30748b2355l41419e4189B06457l2244f2771
11213c65467a11388B5891a11153D7581e0488G6144K8757k8478P606a78012c6278
$$ plain form
11201 87942 -288643 -109697 -207421 -48604 115261 -174548 9950 56213 281331 -54748 29234
11189 -63316 -169158 25934 -412559 -359685 -284390 275647 -192042 136773 -131858 -29954
11178 -307605 -315938 160955 -351622 172075 -302817 56396 -23941 52055 -292605 204742
11167 158977 76676 130208 195576 -246004 22013 -58330 18387 -92290 -7950 172244 322979
11156 322979 129292 2387 -144199 156686 -267378 -220583 430684 -149443 -87578 86088
11145 46056 -112004 111621 131119 -189769 -181876 156632 170126 76268 169986 -172861 25184
11133 -46718 -32388 -143953 50324 -119365 128871 273665 -159287 106438 93854 226244
11123 226244 -67230 -115701 -100531 194806 3813 -135945 93686 -119916 -18779 -120408 255139
$$ packed form
11201H7942b88643a09697r7724d8604A15261a74548I950M6263K25118e4748B9234
11189f3316j05842B5934d12559N2874P5295B75647a92042A36773a31858b9954
11178c07605q333A60955c51622A72075c02817E6396b3941E2055b92605B04742
11167A58977G6676N3532O5368b46004B2013e8330A8387i2290g950A72244J50735
11156C22979A29292B387a44199A56686b67378M6795D30684a49443O1865H6088
11145D6056a12004A11621J9498a89769P893A56632J3494G6268R3718a72861B5184
11133d6718J4330j11565E0324a19365A28871J44794a59287A06438j2584J32390
11123B26244f7230m8471J5170A94806C813a35945I3686a19916a8779j01629B55139
$$ plain form
11111 -324948 295091 1206 40532 126215 287355 120875 -51744 13575 359676 -59505 157974
11099 -303568 -188568 311411 -493795 100749 371652 52318 120338 372173 66558 530400
11089 530400 115081 204989 -327826 136354 52691 337503 -84783 461157 166605 473386
11079 473386 -134447 368443 233604 311804 388492 432267 680238 212288 603069 168802
11068 285996 453735 413240 185625 228012 416239 580480 358234 363652 670237 501920
11058 501920 455046 359649 754459 327202 903443 719059 452442 639315 557931 906606
11048 906606 520430 759081 641166 295976 916158 786785 360931 488777 322123 536781
11038 536781 654016 875473 804177 746041 549873 1011381 507883 757089 839927 879926
$$ packed form
11111c24948B95091A206L9326Q5683J61140A20875e1744A3575L46101e9505A57974
11099c03568J15000C11411d93795A00749K70903E2318O8020K51835F6558M63842
11089E30400A15081Q9908c27826A36354E2691K84812h4783D61157A66605L06781
11079D73386a34447C68443j34839P8200P6688M3775K47971B12288L90781A68802
11068B85996J67739m0495A85625M2387J88227J64241k22246N418L06585j68317
11058E01920m6874r5397L94810C27202N76241j84384k66617J86873q1384L48675
11048I06606l86176K38651j17915B95976O20182j29373C60931J27846j66654K14658
11038E36781J17235K21457p1296n8136j96168M61508n03498K49206Q2838L9999
$$ plain form
11028 879926 860050 508279 607884 875902 843961 539106 1016213 513834 816144 534214
11018 534214 482898 436323 869455 666182 423374 526654 738775 672370 415810 591448
11008 591448 342291 494374 875915 462459 436831 821836 532622 826151 482857 699919
10998 699919 747582 802627 798352 625162 791539 707145 826553 888198 643435 824619 751343
10987 751343 733880 904388 644967 933474 888030 1002941 1343676 1578473 1525685 1182651
10977 1182651 1706692 2000597 2009841 2214037 2457531 3011764 3004049 2931628 3242054 2865385
10967 2865385 2591662 2576571 2248553 1904467 1778701 1968665 2002880 2158237 1663576 1946215
10957 1946215 1888895 1795150 1606814 1638145 1481251 944806 511930 839300 922438 480094
$$ packed form
11028H79926j9876l51771R9605K68018l1941l04855M77107n02379L02310k81930
11018E34214n1316m6575M33132k03273k42808J03280K12121o6405k56560J75638
11008E91448k49157J52083L81541m13456k5628L85005k89214K93529l43294K17062
10998F99919M7663N5045m275j73190J66377q4394J19408O1645k44763J81184p3276
10987G51343j7463J70508k59421K88507m5444J14911L40735K34797n2788l43034
10977A182651N24041K93905R244K04196K43494N54233p715p2421L10426l76669
10967B865385k73723j5091l28018l44086j25766J89964L4215J55357m94661K82639
10957A946215n7320r3745j88336L1331j56894n36445m32876L27370Q3138m42344
$$ plain form
10947 480094 274083 293893 158824 303517 120889 280257 144568 320253 113010 270145
10937 270145 62029 65828 85650 457526 -226964 115034 229201 63419 86646 351579 -154118
10925 111647 132508 24447 257456 -56481 240763 -39254 7888 467386 201529 -150018 32269
10913 263347 108848 -23129 -58191 -139155 -178387 68537 -141847 -172640 -170873 166151 -342997
10901 -253870 105464 -68875 -162670 299441 -315370 52159 -150551 -48655 31561 300586
10891 300586 -186314 15965 -28002 -48298 -92195 -262529 -232714 -183640 -113753 -56961 -418179
10880 -418179 -252035 -132128 -24035 -59456 13531 -27274 201964 169290 144772 136822 -222493
10868 -87056 -147627 -8064 346668 -273837 162805 28033 -151209 122730 -232517 104271
$$ packed form
10947D80094k06011J9810j35069J44693A20889J59368j35689J75685A13010J57135
10937B70145F2029L799J9822L71876b26964A15034J14167F3419K3227K64933a54118
10925A11647K0861B4447K33009e6481B40763c9254G888M59498B01529a50018C2269
10913B63347A08848b3129l5062q0964l9232F8537a41847l0793J767A66151c42997
10901b53870A05464f8875r3795B99441c15370E2159a50551d8655C1561K69025
10891C00586a86314A5965b8002k0296m3897j70334K9815M9074O9887N6792l61218
10880d18179J66144J19907b4035l5421A3531b7274B01964l2674k4518p950b22493
10868h7056o0571h064C46668b73837A62805B8033a51209A22730b32517A04271
$$ plain form
10857 -287355 52937 32200 -77627 -331524 270838 63604 20797 -53770 180756 -17727 26455
10845 -96360 -344385 105224 -308142 133392 -189875 229001 119699 -12617 -405986 -162995
10834 -151934 -219647 41316 -288023 28796 -212690 -22508 171337 152239 -220535 130079
10823 110306 -25000 -72322 -89277 -47822 -108694 80404 -137439 33558 181433 -268977 144550
10811 294747 -109862 -100640 -189711 17721 -101991 17687 -155229 97673 255165 -236425 -40624
10799 31745 143009 33265 -96125 -107543 92356 89605 85096 -188405 -197489 164442 5274 -162156
10786 -77325 -94924 -119305 -114065 -224112 -183056 340979 243664 344711 340997 59691 -541 222249
10773 176316 -22846 -247819 11020 -85625 355235 -17984 208924 -362561 -360619 -363980 -109874
$$ packed form
10857b87355E2937k0737g7627k53897B70838F3604B0797e3770A80756a7727B6455
10845i6360k48025A05224c08142A33392a89875B29001j09302a2617l93369a62995
10834a51934o7713D1316b88023B8796b12690b2508A71337j9098b20535A30079
10823A10306b5000m7322j6955M1455o0872H0404a37439C3558J47875b68977A44550
10811B94747a09862R222q9071A7721a01991A7687a55229I7673J57492b36425d0624
10799C1745J11264C3265i6125j1418I2356k751m509a88405r084A64442E274a62156
10786g7325j7599k4381N240j10047M1056C40979r7315J01047l714E9691e41B22249
10773A76316b2846k24973A1020h5625C55235a7984B08924c62561J942l361a09874
$$ plain form
10761 15819 -163664 15865 -288542 126946 -30304 51369 28086 23570 28245 -55825 -263022
10750 -263022 -163367 -69564 212488 -154818 287593 -78326 50818 -212368 -52523 -48846 12075
10738 -194896 -76677 172691 241917 140132 53227 -470557 -8328 208658 -83691 -84595 89773
10726 -159763 -7539 -3563 59141 798 40941 130531 -317910 165315 -62171 -40879 28179 16166
10714 16166 -156216 -116384 -16983 -69134 145979 45384 -121713 -11963 -101172 -361300 -171168
10702 -25168 -174934 -217170 -80914 -447266 -116065 -54664 85573 -261724 -185587 -145999 -256855
10691 -256855 -135096 104102 168903 -121025 -7437 -192561 -253815 136046 -203324 60153
10680 -317560 142897 -77242 841 -140502 21089 -36381 247570 -22108 -99764 62547 -108319
$$ packed form
10761A5819a63664A5865b88542A26946c0304E1369k3283m516M675e5825k07197
10750b63022R9655f9564B12488a54818B87593g8326E0818b12368e2523L677A2075
10738a94896g6677A72691O9226j01785E3227d70557h328B08658h3691r04H9773
10726a59763g539c563E9141G98M0143Q9590c17910A65315f2171K1292B8179j2013
10714A6166a56216L9832a6983n2151A45979D5384a21713a1963q9209k60128a71168
10702b5168j49766m2236h0914l66352a16065e4664H5573b61724P6137L9588j10856
10691b56855J21759A04102O4801a21025g437j85124o1254A36046b03324F0153
10680c17560A42897g7242H41a40502B1089c6381B47570b2108p7656F2547a08319
$$ plain form
10668 110272 -81020 -204576 -387442 -245787 -40672 -31058 -129844 -83200 -121197 46313 -164389
10656 -314376 -9301 -17079 16172 88495 50993 -385959 -231304 307145 -200899 81872 303152
10645 303152 -102062 -82939 -144646 321062 -68781 82103 -34259 -118549 -374966 -128857 401537
10633 -134907 -54859 -10252 214603 313027 -89652 -276647 98455 239811 126427 180021 -77022
10621 40075 -185332 -163361 44698 -105695 -181600 -60540 29519 -104382 26227 -554634 -255931
10609 323209 -48804 97831 253945 21151 -161552 106871 -35148 -248976 -79854 9650 -94846
10597 -307168 44646 2786 -274531 242464 -314439 119195 120261 -142796 212241 70277 135770
10586 135770 207630 -40042 -88500 2897 -3254 -208898 -204376 149378 185541 47715 11504 -90366
$$ packed form
10668A10272h1020j23556j82866J41655d0672R614r8786M6644l7997D6313a64389
10656c14376i301p778A6172P2323l7502c85959J54655C07145b00899H1872K21280
10645C03152a02062J9123o1707C21062f8781H2103c4259q4290k56417a28857D01537
10633a34907e4859a0252B14603R8424h9652j86995I8455J41356j13384N3594g7022
10621D0075a85332K1971D4698a05695p5905f0540B9519a04382B6227e54634b55931
10609C23209d8804I7831J56114B1151a61552A06871c5148k13828g9854I650i4846
10597c07168D4646B786b74531B42464c14439A19195J066a42796B12241G0277O5493
10586A35770P1860d0042m8458B897c254k05644M522A49378L6163D7715A1504i0366
$$ plain form
10573 -3855 -292118 -10722 -85189 -240719 35614 224017 64408 -195101 216665 139779 -118526
10561 -198545 7831 -193095 -3133 189867 88721 -117749 47010 -343883 -9518 -36040 -171445
10550 -171445 -168657 -8319 -34334 201874 -219200 62416 153025 122465 -210627 -55405 336199
10538 -363133 -17193 23049 183796 -225145 140046 309264 59765 49633 208006 -129191
10527 -78796 18431 347383 -216622 -68833 -270450 94975 -139596 -101322 153186 -71031 165318
10515 49094 -16139 125364 -39270 -37560 20869 -56745 -225592 -180180 -45275 135018 77008
10504 77008 -110692 -163248 -29978 -181827 -177780 -165857 -10847 282523 -148665 59519 84229
10493 84229 -83049 -241988 75611 27182 182247 -64522 81298 -107263 30448 -82927 19535
$$ packed form
10573c855k88263a0722p4467j55530C5614J88403F4408a95101B16665p6886a18526
10561a98545G831a93095c133A89867H8721a17749D7010c43883i518k6522j35405
10550a71445K788h319k6015B01874b19200F2416R0609l0560b10627e5405C36199
10538c63133a7193B3049J60747b25145A40046J69218E9765j0132J58373a29191
10527g8796A8431L28952b16622f8833k01617I4975a39596L8274A53186g1031A65318
10515D9094a6139A25364c9270J710B0869e6745j68847M5412d5275A35018n8010
10504G7008a10692n2556b9978j51849M047J1923a0847B82523a48665E9519K4710
10493H4229h3049j58939G5611B7182J55065f4522H1298a07263C0448h2927A9535
$$ plain form
10481 117858 -41272 70703 175706 -143158 226377 88902 -329470 224044 -247422 152708
10470 261546 26337 -219513 114051 129526 -218831 175099 -27713 134849 -73831 -127707
10460 -127707 20740 -345580 41736 29381 -409901 -216405 136445 -74579 -62994 -7924 162751
10448 29092 43022 -106847 136635 -34418 -196942 64659 268549 -20283 -27808 115383 55369
10436 233672 -351197 62381 -300480 -18352 -157682 72387 113982 5510 -60107 114612 -84702
10424 53834 -66984 127417 72866 -51952 68753 253858 -66589 -65676 170143 1549 65706 -195416
10411 -34519 59334 209221 56229 -234599 -72188 -369493 -189411 3686 20957 167586 45099
10399 -15380 92907 93769 -434605 112250 1086 -289182 326517 106131 -161233 10358 54411
$$ packed form
10481A17858d1272G0703J05003a43158B26377H8902c29470B24044b47422A52708
10470B61546B6337b19513A14051J5475b18831A75099b7713A34849g3831n3876
10460a27707B0740c45580D1736j2355d09901J93496A36445g4579J1585g924A62751
10448B9092J3930a06847A36635c4418j62524F4659K03890b0283p525A15383E5369
10436B33672c51197F2381c00480a8352j39330G2387M1595E510f0107A14612h4702
10424E3834f6984A27417n4551e1952F8753J85105f6589R13A70143A549O4157a95416
10411c4519E9334J49887E6229b34599g2188k97305J80082C686J7271J46629D5099
10399a5380I2907Q62d34605A12250A086b89182C26517A06131a61233A0358M4053
$$ plain form
10388 54411 158261 -43299 277177 47147 -179177 179669 -384568 369698 153421 44696
10377 -134433 145280 134765 204880 19467 71912 -36533 173810 420080 423488 410798 336965
10366 336965 515936 327110 79594 378905 182918 202373 158229 52775 -123891 122374
10355 -24618 681033 104484 157565 399152 894464 612762 662714 385425 285860 198566
10345 198566 284443 59066 310449 176633 39814 238300 362425 172945 375384 205127
10335 205127 433954 285184 138919 383538 -21679 196534 -320793 48585 -119151 156521
10324 -119979 166974 504052 214515 9192 22162 5910 183042 9548 83280 414847 53249
10312 -188764 280877 214705 -80487 123351 264436 -212381 -115850 374998 -160858 136721
$$ packed form
10388E4411J03850d3299B77177D7147a79177A79669c84568C69698A53421D4696
10377a34433A45280j0515P0115A9467N2445c6533A73810K46270L408j2690p3833
10366C36965J78971j88826G9594K99311A82918J9455m4144E2775a23891A22374
10355b4618F81033A04484N3081K41587M95312k81702M9952k77289r9565q7294
10345A98566Q5877E9066K51383j33816C9814J98486J24125A72945K02439j70257
10335B05127K28827j48770A38919K44619b1679A96534c20793D8585a19151A56521
10324a19979A66974L37078B14515I192J2970E910J77132I548P3732L31567E3249
10312a88764B80877o6172h0487A23351J41085b12381R6531C74998a60858A36721
$$ plain form
10301 160733 345076 -387539 -407518 -11589 78183 453837 277229 -32759 69215 -50031 -138695
10290 -138695 -87569 -81358 -93100 -18590 82059 216987 230921 -86790 -2551 7689 -45583 -83287
10278 -83287 -198406 -223323 -45601 559402 -90126 122758 34987 -116067 -2717 -315608 15706
10266 139783 -61021 -152173 13309 -15600 133166 217947 229647 517593 536988 155452 321716
10255 321716 218733 358061 219611 98658 82683 287786 118020 156199 29644 242542
10245 242542 137171 -219215 398900 79377 -291266 50015 165122 -53387 -94426 -113262
10235 -113262 81444 70166 -103164 -233822 56420 -129751 139930 -66714 -63815 -197985 255140
10223 -82291 -67480 241808 -197173 -217713 -190286 133051 71336 -31966 -112655 -150063 -59178
$$ packed form
10301A60733J84343c87539j9979a1589G8183L75654j76608c2759F9215e0031q8664
10290a38695N1126O211j1742a8590H2059J34928J3934h6790b551G689d5583l7704
10278h3287j15119k4917d5601E59402i0126A22758C4987a16067b717l12891A5706
10266A39783f1021r1152A3309a5600A33166Q4781J1700K87946J9395A55452J66264
10255C21716j02983J39328j38450I8658j5975K05103A18020L8179B9644K12898
10245B42542j05371b19215C98900G9377b91266E0015J15107e3387m1039j8836
10235a13262H1444j1278a03164j30658E6420a29751A39930f6714K899j34170B55140
10223h2291J4811B41808a97173k0540K7427A33051o1715c1966q0689l7408e9178
$$ plain form
10211 31509 41209 -81864 -45117 291012 9965 -138571 -276677 66179 64437 -99042 293887
10199 53134 -226196 34283 -153483 -71703 -305889 -174426 -25755 -16507 2455 -304084 29205
10187 -55005 -126175 -45272 -151650 42569 -260279 -262477 -99037 143204 -345950 102865 -129804
10175 182347 239557 198193 279881 -144551 42992 -120889 -138037 5001 82830 -229092 -309885
10164 -309885 209979 -153341 -389483 -123340 11378 -284290 -284031 -30057 272957 -59107 -43857
10153 -43857 101716 37261 -299165 16564 -28890 187102 -258014 8237 59133 52943 -470702
10141 -172884 45383 -9533 -105413 163537 -198197 -66646 43473 -52960 12295 28185 -140488
10129 -3955 -237964 -113720 -27392 -108763 105463 439481 -185568 -67891 101975 -112009
$$ packed form
10211C1509R700h1864L6747B91012I965a38571j38106F6179j742i9042B93887
10199E3134b26196C4283a53483g1703k34186J31463b5755R248B455c04084B9205
10187e5005p1170d5272j06378D2569b60279k198i9037A43204c45950A02865a29804
10175A82347N7210m1364Q1688a44551D2992a20889j7148E001P7829b29092q0793
10164c09885B09979a53341k36142a23340A1378b84290K59c0057B72957e9107J5250
10153d3857A01716C7261b99165A6564b8890A87102b58014H237N0896o190d70702
10141a72884D5383i533r5880A63537a98197f6646D3473e2960A2295J5890a40488
10129c955k34009a13720b7392q1371A05463L34018a85568f7891A01975a12009
$$ plain form
10118 -74827 -47682 84596 -66380 -18935 -434289 -241479 -210139 -147085 -243239 -31193 112366
10106 -96936 -75719 173336 -167434 -359193 -82782 399832 25338 -280369 -43476 -48749 -190012
10095 -190012 -274851 187308 -412418 137617 69397 -138196 -124190 264217 121935 -86920
10084 217900 18131 -268447 -73346 -260019 -276106 -256597 -72329 -1446 -110378 -38793 -120756
10073 -120756 -27160 -55462 46269 -72184 -103725 -35178 -110938 -80176 -166675 5200 -62069 -100197
10061 -100197 12532 -89289 32338 42259 -133178 -402255 -73092 -189108 221742 -106937 -182893
10050 -182893 -103841 -93881 56171 -201320 -301779 -109882 840 383172 -105492 32195 -176391
10038 64084 35135 47962 90719 19458 -53680 69031 -118756 -98681 -103907 56754 154391 -247288
$$ packed form
10118g4827K7145H4596f6380a8935m15354J92810L1340O3054r6154c1193A12366
10106i6936K1217A73336a67434j91759h2782C99832B5338b80369d3476n273j41263
10095a90012q4839A87308d12418A37617o8220a38196J4006B64217A21935h6920
10084B17900A8131b68447g3346j86673j6087J9509g2329a446j08932c8793q1963
10073a20756b7160k8302D6269g2184l1541c5178p5760L0762q6499E200f2069l8128
10061a00197A2532h9289C2338R921a33178k69077g3092j16016B21742a06937p5956
10050a82893P9052R960E6171b01320j00459a09882H40L82332a05492C2195a76391
10038F4084k8949J2827M2757A9458e3680F9031a18756K0075n226E6754R7637b47288
$$ plain form
10025 -93234 57408 -177338 -95620 89033 136909 188085 -466965 -69939 138539 18028 68046
10014 68046 97861 -139587 -8708 197566 -46227 10321 57316 139626 -124179 -172248 -197426
10003 -197426 -58299 -108939 321808 -45663 -255140 -90726 -586456 -102571 -144894 -108688 174845
9991 7057 18519 -193303 -210170 -294610 -218575 114292 -281372 62566 -27145 104141 38402
9979 -304058 -56483 -110266 214797 10921 -91511 -272105 122222 -125638 -164913 162653 -275200
9967 -190369 -151471 -66425 -130729 179682 -212928 -419774 -376122 -55956 -79032 -342857 -106970
9955 -454744 130694 129866 -28485 -292790 -53523 -103675 -23028 -432307 -225128 -264528 132165
9943 6911 10346 54316 385887 -251751 -126985 -201561 -224957 -185329 97497 -248478 130579
$$ packed form
10025i3234E7408a77338Q1718H9033M7876N1176d66965f9939A38539A8028N0018
10014F8046K9815a39587h708A97566d6227A0321M6995Q2310a24179m8069k5178
10003a97426e8299n0640C21808d5663k09477i0726m95730a02571m2323L6206A74845
9991G057J1462a93303j6867q4440P6035A14292b81372F2566b7145A04141C8402
9979c04058e6483n3783B14797A0921i1511j80594A22222a25638l9275A62653b75200
9967a90369L8898f6425o4304A79682b12928k06846M3652e5956k3076k63825a06970
9955d54744A30694q28b8485k64305e3523n0152b3028m09279K07179l9400A32165
9943F911L435M3970L31571b51751J24766p4576k3396L9628I7497b48478A30579
$$ plain form
9931 -97627 -382052 -31108 -228524 -346827 -163883 -42359 -119731 34558 12171 -33130 -258741
9920 -258741 -143700 137837 10533 -156255 63807 53951 41207 -256070 76770 108674 76380
9909 76380 68235 -63355 101736 -201168 -190783 -8489 -15285 142579 49481 -174136 -264150 -22456
9896 51768 150301 17311 74243 -26130 -49614 -148695 50732 -338008 -181345 167748 96188
9885 96188 227215 124342 5479 128825 -245948 -320628 -71803 -167717 -173574 -108040 51066
9873 8207 31791 -115086 -93040 -113726 -125628 -102227 184754 8601 -79427 -16375 -117723 105881
9860 -153480 -40110 128797 -48266 -344218 40809 76977 75161 -152213 -28063 149357 -217364
9848 55619 36308 -135198 -81696 243364 -17719 -25066 93635 -306561 -20455 93814 37033
$$ packed form
9931i7627k84425c1108j97416j18303a63883d2359p7372C4558A2171c3130k25611
9920b58741J15041A37837A0533a56255F3807r856j2744b56070G6770L1904l2294
9909G6380q145f3355A01736b01168J0385h489o796A42579D9481a74136r0014b2456
9896E1768R8533A7311N6932b6130k3484r9081E0732c38008J56663A67748p1560
9885I6188J31027j02873E479J23346b45948p4680g1803r5914n857O5534E1066
9873H207K3584a15086K2046k0686j1902K3401A84754H601g9427a6375j01348A05881
9860a53480d0110A28797d8266k95952D0809L6168j816a52213b8063A49357b17364
9848E5619j9311a35198N3502B43364a7719p347I3635c06561b0455I3814C7033
$$ plain form
9836 -36527 9199 -99650 208010 -13779 -309143 -98489 -284453 -272906 -202422 -7345 -25685 -179292
9824 -179292 78322 194186 81276 -137413 -187731 -290895 -74836 4351 -19798 -3040 72108
9812 -133666 99775 38800 146709 -222195 -84071 64983 -300597 -52915 -102092 -10692 -287831
9801 -287831 -199548 79098 -271174 -61108 -129565 -221879 -26450 -420647 -16946 -11423 81190
9789 -222187 -310373 175640 132677 -103343 -171971 -2301 -24322 -280417 -235732 -114286 220022
9777 44506 -237050 -201345 63193 -88433 98405 -188891 -15790 -64513 121530 33131 -75566
9765 -232947 -200771 -97886 -244222 36654 -130559 -136202 -281926 -130341 -14251 73116 -258232
9753 -140087 -39 -112508 -223215 -211020 -52421 67330 34236 -329614 62011 -177179 -246464
$$ packed form
9836c6527I199i9650B08010a3779k95364i8489j85964J1547P0484g345j8340j53607
9824a79292G8322J15864H1276a37413n0318j03164g4836D351a9798c040G2108
9812a33666I9775C8800J07909b22195h4071F4983c00597e2915m9177a0692k77139
9801b87831Q8283G9098b71174f1108o8457r2314b6450l94197a6946N523H1190
9789b22187q8186A75640m2963a03343o8628b301k2021k56095M4685a14286B20022
9777D4506b37050L5705F3193h8433I8405a88891a5790m8723A21530C3131g5566
9765b32947L2176i7886j46336C6654a30559n643j45724a30341a4251G3116b58232
9753a40087c9j12469j10707J2195e2421F7330l3094c29614F2011a77179o9285
$$ plain form
9742 -246464 -295297 -430518 -150052 -306312 -58453 -57106 -307453 136892 -197237 160250
9731 180485 -348937 49886 -277441 -196359 -131682 73181 -252463 121611 -359335 122563
9720 169644 -216636 -345478 2264 19286 76484 -90456 111634 91224 -172721 67012 -139354
9708 -315490 -39308 253470 -19334 -353068 263006 -300 9307 -128564 -340698 62529 113173
9697 113173 -80527 -958 21 -308772 -148557 -137966 -13923 -4219 75976 321231 61938 148192
9685 148192 136524 -235190 26843 -154548 94448 58798 130289 -149809 203132 -121116 58407
9673 -351706 -175505 69815 110949 -155942 -199211 159869 -2892 77432 -64154 162099 -129861
9661 -340841 8506 -55479 -249060 301637 -162961 -278016 -168552 -100924 -100791 -99218 130121
$$ packed form
9742b46464m8833j35221a50052j56260e8453J347k50347A36892a97237A60250
9731A80485c48937D9886b77441Q1082O4677G3181b52463A21611c59335A22563
9720A69644b16636j28842B264J7022N7198i0456A11634k0410a72721F7012a39354
9708c15490c9308B53470a9334l33734B63006c00I307a28564k12134F2529N0644
9697A13173h0527i58B1c08772a48557J0591a3923d219G5976K45255F1938Q6254
9685A48192j1668b35190B6843a54548I4448l5650P1491a49809B03132a21116E8407
9673c51706a75505F9815M1134a55942m3269A59869b892G7432f4154A62099a29861
9661c40841H506e5479j93581C01637a62961j15055J09464O7628J33J573A30121
$$ plain form
9649 -162867 -109203 9235 36307 122830 -218011 -208782 147891 -45718 299343 417223 -178101
9637 7293 -83709 6249 -156865 84153 -265380 12985 104718 -204234 -209932 429915 -36729 -99236
9625 -99236 142049 -193110 -25363 11950 -263460 -157400 187216 100174 -76091 10898 -4706
9613 105421 135158 -171242 -23098 94060 -360921 15557 -187114 -290867 5788 -334638 302095
9601 258196 101263 235652 -275934 -309676 -218708 199220 -292233 106827 10775 -362442
9590 -183711 -61538 69473 156916 209831 -240387 -41275 -64340 -107625 210870 80599 -44648
9578 48975 82768 -48467 -297115 -205375 -121373 188493 -167232 -222421 -4084 -269680 181822
9566 145753 38945 105639 233422 169557 -468856 -195103 347606 117594 95420 -30862 -193101
$$ packed form
9649a62867N3664I235K7072Q6523b18011R229A47891d5718B99343J17880a78101
9637G293h3709F249a56865H4153b65380A2985R1733b04234n698D29915c6729o2507
9625i9236A42049a93110b5363A1950b63460J06060A87216q7042g6091A0898d706
9613A05421K9737a71242b3098I4060c60921A5557a87114j03753E788c34638C02095
9601B58196A01263J34389b75934l3742R0968A99220b92233A06827A0775c62442
9590a83711f1538F9473Q7443N2915b40387d1275k3065m3285B10870H0599d4648
9578D8975L3793d8467k48648R1740Q4002A88493a67232n5189d084k65596A81822
9566A45753C8945O6694J27783o3865d68856a95103C47606A17594k2174c0862j62239
$$ plain form
9555 -193101 -164517 116755 329075 -21020 -292765 -82537 278267 -86521 58099 -26649 -169761
9544 -169761 204128 236596 -225704 -84835 75290 47496 50149 67101 76499 -155908 143587
9532 -80844 178207 90109 -32071 -129069 -324483 -29381 58798 -106446 -141826 6113 100669
9521 100669 -157844 39109 -96794 19577 -310777 201635 -110697 -3862 79296 -219701 -353755
9510 -353755 106956 -266309 -252347 57756 -312844 -16594 -171036 -150328 78203 54560 21751
9498 47948 -36279 -54204 -207451 -56560 -48006 -71758 120515 87503 -101833 -55353 46739
9486 -213383 -88848 -11623 -47965 -330476 -333361 -89844 -91279 -143613 -158553 -132158 -265119 189663
9473 -272960 -70438 63579 -69720 -170943 270702 -209492 -523979 -201835 201435 70448
$$ packed form
9555a93101K8584A16755K12320b1020k71745h2537B78267h6521E8099b6649j43112
9544a69761B04128L2468b25704h4835G5290k7794K653J6952R398a55908A43587
9532h0844A78207q8098c2071r6998j95414b9381E8798a06446l5380F113R4556
9521A00669a57844C9109i6794A9577c10777B01635a10697c862G9296b19701j34054
9510c53755A06956b66309J3962E7756c12844a6594j54442K0708G8203k3643B1751
9498D7948c6279j7925j53247e6560Q554k3752A20515l3012a01833M6480D6739
9486b13383h8848a1623l6342k82511k885h9844j435n2334j4940K6395j32961A89663
9473b72960g0438F3579f9720j01223B70702b09492l14487b01835B01435G0448
$$ plain form
9462 -77324 -110266 164864 -71962 -56559 -2896 -106971 -136871 81384 -218100 -74237 156626
9450 -130336 -125973 70533 -80473 -254589 -155143 41552 -296508 -525289 -13957 -153551 86891
9438 -253298 -211471 -220121 -367709 -77415 93872 68908 -60953 -185273 2562 -88871 81823 -2227
9425 297072 -25935 45241 -171892 105651 -166064 -65381 114909 67741 248142 -283399
9414 -267816 -15435 -288472 30163 134100 29762 203660 -68253 -35509 -175810 61299 -100760
9402 -51105 82382 -162916 -309501 465104 -60705 -39393 -85804 159925 -54909 47063 -20515
9390 -260707 87382 79623 -384298 133906 51955 -37696 -65071 109805 111821 -72903 -41130
9379 -41130 179118 -90398 -2450 -84789 -14346 -120100 -184713 143017 -92215 -30522 -134072
$$ packed form
9462g7324l2942A64864g1962J5403b896j04075k9900H1384b18100g4237A56626
9450a30336M363G0533h0473j74116R9446D1552b96508k28781a3957j39594H6891
9438b53298M1827q650j47588g7415I3872k4964f0953j24320B562h8871H1823b227
9425B97072b5935D5241a71892A05651a66064f5381A14909m7168J80401b83399
9414b67816a5435k73037C0163J03937B9762J73898f8253L2744j40301F1299a00760
9402e1105H2382a62916j46585D65104f0705K1312m6411A59925e4909D7063b0515
9390b60707H7382p759c84298A33906E1955c7696k7375A09805K016g2903L1773
9379d1130A79118i0398b450q2339a4346j05754o4613A43017i2215c0522j03550
$$ plain form
9368 -134072 -85767 -113871 290001 -58199 98843 114511 270337 -95688 133527 -14751 -398136
9357 -398136 -285183 5429 71104 172065 277308 282326 -356423 -203316 -166744 -31709 222752
9345 43880 -68454 -173566 278147 -93962 -60587 24609 -56499 107815 -110974 -25968 -64468
9334 -64468 -52180 -337891 -62421 -132347 -422385 -54198 -139921 -31577 -7500 -13875 100114 95665
9322 95665 -281506 130106 -135970 -312425 214418 294154 168589 -141420 8960 174717
9312 174717 -236208 89717 -186872 -94030 -209632 -10069 -271652 200926 56314 -81548 -291073
9301 -291073 -98406 -191216 15738 150519 -190686 27021 -434086 -298341 4925 102657 -141832
9289 -8004 150059 -329741 -154683 40264 -167497 -229502 -71696 182931 274147 24216 70414
$$ packed form
9368a34072M8305k8104B90001e8199I8843J5668J55826i5688A33527a4751l83385
9357c98136J12953E429O5675J00961J05243N018c56423J53107L6572c1709B22752
9345D3880f8454j05112B78147i3962L3375B4609e6499A07815a10974b5968l8500
9334f4468J2288k85711f2421o9926k90038e4198q5723c1577g500o375A00114m449
9322I5665b81506A30106a35970j76455B14418P9736j25565a41420H960J65757
9312A74717b36208H9717a86872R2842j15602a0069k61583B00926E6314h1548k09525
9301b91073i8406r2810A5738J34781a90686B7021d34086J35745D925R7732a41832
9289h004A50059c29741a54683D0264a67497o2005g1696A82931R1216B4216M6198
$$ plain form
9278 70414 -169794 -81514 -119135 -532318 -61082 271477 -187870 199561 230037 239758 159968
9267 159968 110284 -114259 16747 -211027 -334904 -218598 28537 -234294 -164650 -168841 -124745
9256 -124745 -54880 275500 -114497 231628 -15552 -177803 -313393 -43169 -26035 412079
9245 20009 11735 -57946 -9849 -102654 -254077 201880 -136151 -164293 -398549 -125576 149659
9233 -77550 -68526 -75318 -238828 -76637 -26028 -82665 44946 -208369 30322 -61961 -212927 -114926
9221 -114926 -31970 319119 -44952 -81906 152961 254952 -192069 222951 -8004 233635 66342
9209 -12893 -103453 -192272 69394 2511 -8929 12360 143849 -222820 -83605 171697 159753 23982
9196 160991 57605 -106106 -173239 105401 -43176 -441626 -151531 99526 -108733 5103 -319157
$$ packed form
9278G0414a69794h1514l7621m13183f1082B71477a87870A99561L0476R721p9790
9267A59968m9684a14259A6747b11027j23877J16306B8537b34294O9644m191M4096
9256a24745e4880B75500a14497B31628a5552j62251j35590d3169J7134D12079
9245B0009q274e7946i849r2805j51423B01880a36151k8142k34256a25576A49659
9233g7550R024o792j63510g6637b6028n6637D4946b08369C0322f1961j50966R8001
9221a14926c1970C19119d4952l6954A52961J01991a92069B22951h004B33635F6342
9209a2893r0560q8819F9394B511h929A2360J31489b22820h3605A71697j1944B3982
9196A60991E7605a06106o7133A05401d3176l98450a51531I9526a08733E103c19157
$$ plain form
9184 -80530 163639 61028 -76313 -24810 15408 -104357 46202 -367213 208873 -196481 -12119
9172 133902 -185023 26080 48714 190290 -166796 202972 -260629 180044 -47093 -96285
9162 -96285 -35686 -441905 -97625 -193079 -57160 -165243 269330 146634 -169778 -42494 -41274
9151 -41274 9581 -125868 -63252 49815 -143811 -384525 122390 -341643 -3857 233202 -115885
9139 -218186 -209948 -243350 22079 -190604 -132656 92613 178535 7693 -135502 56220 -53870 -225557
9127 -225557 -252919 -83241 4925 -345072 114032 -102543 -91968 182377 -92267 -466773 -313975
9116 -313975 -193238 199359 -122413 102311 -73451 5900 144918 -137334 16119 106503 114421
9105 114421 -123220 -69184 -201828 -141355 194968 174372 -204049 -251676 167591 -95031 -324967
$$ packed form
9184h0530A63639F1028g6313b4810A5408a04357D6202c67213B08873a96481a2119
9172A33902a85023B6080K2634J41576a66796B02972b60629A80044d7093m9192
9162i6285c5686m06219i7625r5454e7160j08083B69330j22696a69778d2494J220
9151d1274I581a25868O2616D9815a43811k40714A22390c41643c857B33202a15885
9139b18186Q238l3402B2079a90604N7948I2613Q5922G693a35502E6220e3870j71687
9127b25557k7362h3241D925c45072A14032a02543J0575A82377i2267l74506J52798
9116c13975J20737A99359a22413A02311g3451E900J39018a37334A6119R0384P918
9105A14421a23220N4036j32644O0473A94968k0596b04049m7627A67591i5031k29936
$$ plain form
9094 -324967 1407 -548035 7291 -325382 65808 -97923 -76781 -3234 217138 -209255 -24815
9082 -211304 -138146 77473 100542 58775 -303707 -113843 -358646 -77267 213043 -474275 28997
9070 74552 205305 -316305 193248 -326626 -80584 270918 -10519 209870 172938 -107495
9059 -315738 -20089 -207839 102130 32213 -147368 262575 20816 -137831 -148595 218037
9048 -92712 -293258 77380 -15791 -247082 9466 -21471 -43885 -106345 -123274 -20972 -165094
9037 -165094 138094 -338910 30002 -258200 105270 -76119 -116034 -61194 103482 -237471
9026 -156164 -143751 -32166 33711 -81198 -167267 -174022 45280 46070 -32064 289947 -224429 -133375
9014 -133375 14438 61498 144468 -177912 -65774 -195755 185606 -199744 -45455 -449450 -238550
$$ packed form
9094c24967A407e48035G291c25382F5808i7923K1142c234B17138b09255b4815
9082b11304P3158G7473K3069m1767c03707a13843k44803g7267B13043d74275B8997
9070G4552J30753c16305A93248c26626h0584B70918a0519B09870l6932a07495
9059c15738b0089j87750A02130C2213a47368B62575B0816a37831j0764B18037
9048i2712k00546G7380a5791k31291I466b1471k2414o2460j6929b0972j44122
9037a65094A38094c38910C0002b58200A05270g6119l9915N4840A03482b37471
9026a56164J2413c2166C3711h1198q6069o755D5280P90c2064B89947b24429R1054
9014a33375A4438M7060Q2970a77912f5774j29981A85606a99744d5455m03995K10900
$$ plain form
9003 -238550 -69209 -118715 -16923 -152983 -193120 -53097 137052 -94962 54468 46959 -50557
8991 7006 498704 60588 75903 274295 -233284 3495 -319430 -6104 -142005 -74483 282488
8979 -169230 24715 113425 84694 -194727 45156 -48801 -93447 -1432 -249833 -244729 84456 -18024
8966 -69294 64303 -101 -279745 152997 -81890 -102300 317749 -153985 62704 -106103 -126186
8955 -126186 -47888 163048 -440040 91214 -157610 58035 -390681 -96114 71164 18939 -161111
8943 38028 -309923 6907 -41332 -285487 -279268 201839 63393 -214721 537303 201404 -38937
8931 124242 -135781 -140329 -54544 205639 -2826 260282 529593 1448462 4255433 18206934
8921 18206934 11779638 3363489 1085982 776910 456387 402344 191993 206795 48349
$$ packed form
9003b38550f9209m9506a6923j36060m0137e3097A37052i4962E4468p509e0557
8991G006M91698F0588J5315J98392b33284C495c19430f104j35901O7522B82488
8979a69230B4715Q8710k8731a94727D5156d8801m4646a432k48401N104H4456a8024
8966f9294F4303a01k79644A52997h1890k0410C17749a53985F2704a06103k0083
8955a26186d7888A63048d40040I1214a57610E8035c90681i6114G1164A8939a61111
8943C8028c09923F907d1332k44155O219B01839F3393b14721E37303B01404c8937
8931A24242a35781m548e4544B05639b826B60282K69311R18869K806971J3951501
8921A8206934o427296C363489A085982l09072l20523n4043A91993J4802D8349
$$ plain form
8911 -17350 102532 -128897 22741 235528 76548 64155 -224319 -94617 25821 -215592 -197917
8900 -197917 -146719 33089 -177381 -383384 4217 -353145 138618 120923 231418 -151457 -163766
8889 -163766 111400 -254232 265746 -202288 -615 205469 65251 222346 30000 -106750 -302835
8878 -302835 98839 187469 -140534 33097 -28243 44320 -7356 -121035 9954 -235587 -194160
8867 -194160 -198498 -236796 16606 -30004 55316 98906 -125567 -24626 -110935 45030 -128112
$$ packed form
8911a7350A02532a28897B2741K12787G6548j2393b24319i4617B5821b15592J7675
8900a97917N1198C3089a77381k06003D217c53145A38618j7695J10495a51457j2309
8889a63766A11400b54232B65746b02288f15B05469F5251J57095C0000a06750j96085
8878c02835I8839Q8630a40534C3097b8243D4320g356j13679I954b35587M1427
8867a94160m338l8298A6606c0004E5316M3590a25567b4626q6309D5030a28112
$$ [...]
##END NTUPLES=NMR SPECTRUM
##END=
