##TITLE=AC1520_ROEFFECT0004_8213724_yqawQJwKAI
##JCAMPDX= 6.0         $$ Bruker NMR JCAMP-DX V2.0
##DATA TYPE= NMR SPECTRUM
##DATA CLASS= NTUPLES
##ORIGIN= BRUKER
##OWNER= Administrator
$$ 1.72 TOPSPIN		Version 2.1
$$ 2013-10-04 17:57:24.034 -0700  Administrator@X
$$ Compression mode = diff/dup
##.OBSERVE FREQUENCY= 400.02188249412
##.OBSERVE NUCLEUS= ^1H
##.ACQUISITION MODE= SIMULTANEOUS (DQD)
##.ACQUISITION SCHEME= undefined
##.AVERAGES= 64
##.DIGITISER RES= 22
##SPECTROMETER/DATA SYSTEM= spect
##.PULSE SEQUENCE= noesygpps1d.comp
##.SOLVENT NAME= COFFEE_meoh
##.SHIFT REFERENCE= INTERNAL, COFFEE_meoh, 1, 14.96082
##AUDIT TRAIL= $$ (NUMBER, WHEN, WHO, WHERE, PROCESS, VERSION, WHAT)
$$ ##TITLE= Audit trail, TOPSPIN		Version 2.1
$$ ##JCAMPDX= 5.01
$$ ##ORIGIN= Bruker BioSpin GmbH
$$ ##OWNER= Administrator
$$ $$ E:\/data/COFFEE/nmr/AC1520_ROEFFECT0004_8213724_yqawQJwKAI/12/pdata/1/auditp.txt
$$ ##AUDIT TRAIL=  $$ (NUMBER, WHEN, WHO, WHERE, PROCESS, VERSION, WHAT)
(   1,<2013-10-04 17:57:19.175 -0700>,<Administrator>,<X>,<go>,<TOPSPIN 2.1>,
      <created by zg
	started at 2013-10-04 17:45:49.331 -0700,
	POWCHK enabled, PULCHK disabled,
       configuration hash MD5:
       C8 4E 4E 5D D3 5C D8 9E 9F 52 82 E0 59 8A DE 15
       data hash MD5: 64K
       DF 5C F2 DA F8 8F 38 4D 90 3C E2 64 49 34 48 CC>)
(   2,<2013-10-04 17:57:22.159 -0700>,<Administrator>,<X>,<proc1d>,<TOPSPIN 2.1>,
      <Start of raw data processing
       efp LB = 0.3 FT_mod = 6 PKNL = 1 PHC0 = 0 PHC1 = 0 SI = 128K 
       data hash MD5: 128K
       3B 86 4A B4 78 3B F2 F5 AC 12 B8 9E 08 C5 27 40>)
(   3,<2013-10-04 17:57:23.112 -0700>,<Administrator>,<X>,<proc1d>,<TOPSPIN 2.1>,
      <pk PHC0 = -79.82666 PHC1 = 0 
       data hash MD5: 128K
       44 C3 5B 0C A2 F6 4B 94 58 25 85 16 B8 CA EC 5E>)
(   4,<2013-10-04 17:57:23.534 -0700>,<Administrator>,<X>,<proc1d>,<TOPSPIN 2.1>,
      <abs ABSG = 1 
       data hash MD5: 128K
       5C 78 DD 5C 46 97 AA 4D 91 55 29 46 30 DD A1 EB>)
(   5,<2013-10-04 17:57:23.628 -0700>,<Administrator>,<X>,<proc1d>,<TOPSPIN 2.1>,
      <abs ABSG = 2 
       data hash MD5: 128K
       16 69 3C 6F B4 D3 58 8D 42 13 CF 39 2F 88 E6 B5>)
(   6,<2013-10-04 17:57:23.706 -0700>,<Administrator>,<X>,<proc1d>,<TOPSPIN 2.1>,
      <abs ABSG = 3 
       data hash MD5: 128K
       3F 78 32 7A C9 FE 35 24 17 B0 29 7E 8D 98 D9 EF>)
(   7,<2013-10-04 17:57:23.784 -0700>,<Administrator>,<X>,<proc1d>,<TOPSPIN 2.1>,
      <abs ABSG = 4 
       data hash MD5: 128K
       5E CE 1D 1B 87 77 F3 09 F0 E3 96 23 F6 4E 9D 1C>)
(   8,<2013-10-04 17:57:23.862 -0700>,<Administrator>,<X>,<proc1d>,<TOPSPIN 2.1>,
      <abs ABSG = 5 
       data hash MD5: 128K
       14 5B 84 84 94 14 AF 36 B1 F2 7B 62 1A FE 59 3A>)
$$ ##END=
$$ 
$$ $$ hash MD5
$$ $$ B9 1B 3B 9E C0 7F 99 99 67 48 36 22 FD 90 36 A4
##$RELAX= 
##$RELAX= 
##$RELAX= 
##$RELAX= 
##$RELAX= 
##$RELAX= 
##$RELAX= 
##$RELAX= 
$$ Bruker specific parameters
$$ --------------------------
##$DU= <E:\>
##$EXPNO= 12
$$ [...]
##$TP07= 0
##$TPNAME0= <>
##$TPNAME1= <>
##$TPNAME2= <>
##$TPNAME3= <>
##$TPNAME4= <>
##$TPNAME5= <>
##$TPNAME6= <>
##$TPNAME7= <>
##$TPOAL= (0..7)
0.5 0.5 0.5 0.5 0.5 0.5 0.5 0.5
##$TPOFFS= (0..7)
0 0 0 0 0 0 0 0
##$TUNHIN= 0
##$TUNHOUT= 0
##$TUNXOUT= 0
##$USERA1= <user>
##$USERA2= <user>
##$USERA3= <user>
##$USERA4= <user>
##$USERA5= <user>
##$V9= 5
##$VALIST= <valist>
##$VCLIST= <CCCCCCCCCCCCCCC>
##$VD= 0
##$VDLIST= <DDDDDDDDDDDDDDD>
##$VPLIST= <PPPPPPPPPPPPPPP>
##$VTLIST= <TTTTTTTTTTTTTTT>
##$WBST= 2048
##$WBSW= 25
##$XGAIN= (0..3)
0 0 0 0
##$XL= 0
##$YL= 0
##$YMAX_a= 6698162
##$YMIN_a= -13334296
##$ZGOPTNS= <>
##$ZL1= 120
##$ZL2= 120
##$ZL3= 120
##$ZL4= 120
##$ABSF1= 14.96082
##$ABSF2= -5.597362
##$ABSG= 5
##$ABSL= 3
##$ALPHA= 0
##$AQORDER= 0
##$ASSFAC= 0
##$ASSFACI= 0
##$ASSFACX= 0
##$ASSWID= 0
##$AUNMP= <proc_prof1d_extract.lims>
##$AXLEFT= 0
##$AXNAME= <>
##$AXNUC= <1H>
##$AXRIGHT= 0
##$AXTYPE= 0
##$AXUNIT= <>
##$AZFE= 0.1
##$AZFW= 0.1
##$BCFW= 0
##$BC_mod= 0
##$BYTORDP= 0
##$COROFFS= 0
##$CY= 15
##$DATMOD= 1
##$DC= 0
##$DFILT= <>
##$DTYPP= 0
##$F1P= 0
##$F2P= 0
##$FCOR= 0.5
##$FTSIZE= 131072
##$FT_mod= 6
##$GAMMA= 0
##$GB= 0
##$INTBC= 1
##$INTSCL= 1
##$ISEN= 128
##$LB= 0.3
##$LEV0= 0
##$LPBIN= 0
##$MAXI= 10000
##$MC2= 0
##$MEAN= 0
##$ME_mod= 0
##$MI= 0
##$NCOEF= 0
##$NC_proc= -2
##$NLEV= 6
##$NOISF1= 0
##$NOISF2= 0
##$NSP= 0
##$NTH_PI= 0
##$NZP= 0
##$OFFSET= 14.96082
##$PC= 1
##$PHC0= -79.82666
##$PHC1= 0
##$PH_mod= 1
##$PKNL= yes
##$PPARMOD= 0
##$PPDIAG= 0
##$PPIPTYP= 0
##$PPMPNUM= 2147483647
##$PPRESOL= 1
##$PSCAL= 4
##$PSIGN= 0
##$PYNMP= <proc.py>
##$REVERSE= no
##$SF= 400.020009706828
##$SI= 131072
##$SIGF1= 0
##$SIGF2= 0
##$SINO= 400
##$SIOLD= 131072
##$SPECTYP= <>
##$SREGLST= <1H.CDCl3>
##$SSB= 0
##$STSI= 131072
##$STSR= 0
##$SW_p= 8223.68421052631
##$SYMM= 0
##$S_DEV= 0
##$TDeff= 65536
##$TDoff= 0
##$TI= <>
##$TILT= no
##$TM1= 0
##$TM2= 0
##$TOPLEV= 0
##$USERP1= <user>
##$USERP2= <user>
##$USERP3= <user>
##$USERP4= <user>
##$USERP5= <user>
##$WDW= 1
##$XDIM= 131072
##$YMAX_p= 399204788
##$YMIN_p= -11046
##$CURPLOT= <Network HP LaserJet P1505>
##$CURPRIN= <$Network HP LaserJet P1505>
##$DFORMAT= <normdp>
##$LAYOUT= <+/1D_H.xwp>
##$LFORMAT= <normlp>
##$PFORMAT= <normpl>
##$SURQMSG= 1
$$ End of Bruker specific parameters
$$ ---------------------------------
##NTUPLES= NMR SPECTRUM
##VAR_NAME=  FREQUENCY,     SPECTRUM/REAL,   SPECTRUM/IMAG
##SYMBOL=    X,             R,               I
##VAR_TYPE=  INDEPENDENT,   DEPENDENT,       DEPENDENT
##VAR_FORM=  AFFN,          ASDF,            ASDF
##VAR_DIM=   131072,        131072,          131072
##UNITS=     HZ,            ARBITRARY UNITS, ARBITRARY UNITS
##FACTOR=    0.0627417313425164, 1,          1
##FIRST=     8223.62146879497, -2844,        -66593
##LAST=      0,             -1048,           -67953
##MIN=       0,             -11046,          0
##MAX=       8223.62146879497, 399204788,    0
$$ Real data points
##PAGE= N=1
##DATA TABLE= (X++(R..R)), XYDATA
$$ [...]
67709 67524 66630 65369 64354 64015 64220 64613 65166 66133 67461 68577 69041 69186 69715 70788 71945 72877 73665
67692 73665 74159 73803 72500 71090 70448 70479 70618 70964 72171 74272 76317 77320 77062 75883 74272 72862
67676 72862 72347 72982 74316 75605 76357 76503 76278 76063 76096 76282 76431 76620 77043 77614 78146 78814 79925 81181
67658 81181 81813 81677 81551 81990 82449 82153 81334 80838 80725 80155 78791 77482 77124 77379 77176 76273 75638 76144
67640 76144 77371 78113 77786 76897 76193 75905 76006 76697 78122 79757 80623 80175 78718 76966 75560 74960 75326
67623 75326 76303 77235 77738 77891 77863 77722 77658 77941 78415 78490 77957 77485 77884 79136 80518 81510 82196 82900 83829
67604 83829 84991 86120 86713 86473 85745 85187 85017 84841 84289 83543 83156 83503 84442 85315 85317 84125 82237 80525
67586 80525 79408 78684 78157 78052 78561 79301 79614 79272 78549 77630 76439 75190 74556 74857 75372 75072 73925 72878
67568 72878 72504 72394 72112 71908 71900 71291 69384 67002 65779 66102 66805 67076 67525 68891 70659 71774 72019 71905
67550 71905 71634 71002 70084 69327 69081 69471 70436 71399 71340 69905 68132 67254 67082 66443 65075 64030 64130 65050
67532 65050 66208 67556 68978 69769 69443 68519 67812 67353 66654 65718 65051 64775 64412 63648 62831 62493 62624 62566
67514 62566 61620 59815 58074 57454 58153 59509 61012 62784 64807 66272 66346 65339 64378 63985 63643 62843 61838
67497 61838 61062 60412 59602 58848 58712 59376 60482 61568 62302 62410 61867 61167 60956 61220 61222 60456 59349 58673 58548
67478 58548 58507 58431 58874 60317 62458 64473 65698 65867 64995 63385 61620 60177 59081 58139 57432 57250 57588
67461 57588 58082 58510 59050 59861 60727 61326 61712 62206 62889 63444 63595 63589 64097 65569 67644 69243 69433 68285
67443 68285 66796 65878 65500 64976 64048 63449 64176 66315 68769 70233 70297 69465 68348 67153 65930 64862 64080
67426 64080 63492 63053 63037 63680 64722 65621 66149 66456 66639 66646 66618 66827 67127 66887 65749 64215 63212 63249 64182
67407 64182 65523 66696 67251 67184 66986 67031 67011 66305 64924 63646 63144 63225 63176 62616 61829 61386 61695 62837 64535
67388 64535 66197 67206 67366 67043 66725 66485 65979 64990 63815 63028 62909 63226 63527 63555 63388 63299 63537 64197 65230
67369 65230 66443 67432 67639 66781 65274 63992 63455 63464 63678 64231 65349 66623 67252 67026 66514 66112 65475 64271
67351 64271 63026 62632 63230 64150 64916 65734 66799 67665 67696 66874 65764 64786 63919 63188 62964 63524 64521 65299
67333 65299 65693 66175 67083 68099 68688 68830 68911 69020 68813 68181 67667 67946 69023 70186 70700 70361 69435 68265
67315 68265 67062 65973 65186 64848 64875 64950 64713 63980 62818 61595 60917 61263 62496 63937 65109 66173 67440
67298 67440 68747 69728 70488 71420 72407 72834 72571 72368 72918 73958 74738 75075 75458 76213 77021 77313 76871 75939
67280 75939 74926 74117 73564 73236 73194 73549 74257 75076 75734 76066 76014 75679 75299 74967 74484 73800 73460 74104 75489
67261 75489 76600 76889 76802 76798 76521 75511 74183 73424 73532 74162 75027 75945 76429 76061 75294 75114 75774 76512 76645
67242 76645 76267 75641 74624 73185 71967 71742 72483 73417 73871 73740 73280 72808 72571 72639 72816 72813 72516 72070 71735
67223 71735 71692 71934 72320 72756 73276 73914 74664 75661 77121 78837 80024 80122 79639 79681 80692 82135 83356 84154
67205 84154 84445 84105 83481 83391 84146 85025 85145 84459 83492 82578 81918 81935 82819 83900 84163 83403 82296 81396 80639
67186 80639 79887 79334 79120 78970 78512 77795 77309 77600 78782 80274 81149 81080 80814 81345 82750 84270 85382 86156
67168 86156 86620 86517 85975 85714 86181 86971 87521 87907 88512 89308 90029 90716 91525 92182 92230 91743 91256 91041 90966 91049
67148 91049 91603 92682 93844 94700 95370 96213 97336 98507 99331 99422 98658 97358 96041 94993 94295 94159 94722
67131 94722 95532 95863 95773 96291 98099 100511 102248 102881 102910 102772 102505 102288 102553 103395 104458 105588 107087 109044
67113 109044 110906 112050 112493 112702 112918 113008 112810 112329 111597 110558 109160 107641 106776 107558 110209 113568 116015
67096 116015 117132 117866 118924 119814 119983 120088 121140 122807 123701 123335 122785 123146 124221 125156 125634 125864 125961
67079 125961 125978 126251 127106 128365 129582 130638 131719 132864 133975 135154 136600 138192 139527 140427 141111 141866
67063 141866 142792 143841 144866 145686 146344 147218 148604 150292 151860 153267 154757 156280 157508 158463 159597
67048 159597 161158 163016 165257 168257 171747 174453 175394 175249 175664 177301 179325 180866 182210 184154 186758
67033 186758 189338 191526 193776 196750 200491 204329 207516 209905 212048 214643 217839 221170 224120 226601
67019 226601 228875 231198 233701 236439 239341 242195 244864 247439 250048 252572 254763 256556 258088 259505
67005 259505 261040 263172 266297 270120 273775 276773 279520 282637 286097 289421 292507 295747 299343 303030
66991 303030 306613 310363 314647 319411 324338 329315 334484 339914 345458 350882 355996 360771 365505 370697
66977 370697 376488 382339 387628 392546 398022 404696 412308 420188 427955 435465 442502 448961 455218 461868
66963 461868 469070 476513 484022 491828 500063 508357 516192 523582 531200 539869 549967 561168 572677
66950 572677 583828 594594 605446 616729 628369 640205 652268 664498 676474 687852 699037
66939 699037 711065 724745 740070 756412 773043 789453 805491 821407 837697 854817 873036
66928 873036 892374 912509 932913 953422 974612 997169 1020908 1044887 1068633 1092733 1117946
66917 1117946 1144223 1171104 1198640 1227262 1256836 1286552 1315858 1345132 1375246 1406892 1440367
66906 1440367 1475561 1511846 1548303 1584422 1620549 1657406 1695245 1733609 1771853 1809741 1847632
66895 1847632 1886138 1925556 1965559 2005507 2045070 2084424 2123794 2163022 2201750 2239870 2277540
66884 2277540 2314764 2351082 2385757 2418205 2448300 2476313 2502504 2526761 2548705 2568172 2585447
66873 2585447 2600884 2614378 2625288 2632887 2636820 2637220 2634511 2629168 2621607 2612229 2601374 2588975 2574265
66860 2574265 2556158 2534161 2508849 2481294 2452154 2421516 2389458 2356411 2322888 2289082 2254818
66849 2254818 2219703 2183219 2144918 2104856 2063838 2022994 1982921 1943318 1903518 1863363 1823407
66838 1823407 1784250 1745869 1707789 1669790 1632194 1595448 1559723 1525054 1491582 1459268 1427532
66827 1427532 1395608 1363402 1331646 1301000 1271244 1241611 1211756 1182070 1153151 1125384 1099132
66816 1099132 1074867 1052656 1031653 1010536 988633 966376 944618 923690 903296 883097 863136
66805 863136 843776 825433 808338 792305 776670 760671 744046 727208 710875 695530 681153
66794 681153 667331 653640 640075 627063 614910 603259 591345 578802 566026 553773 542619
66783 542619 532771 524004 515680 507202 498606 490370 482486 474186 464975 455543 447081 439975 433678 427645
66769 427645 421698 415537 408676 401144 393635 386647 379929 373129 366572 360932 356387 352548 348997 345434
66755 345434 341410 336369 330141 323177 316331 310443 305895 302273 298576 294113 289177 284601 280806 277636
66741 277636 274968 272897 271184 269055 265955 262277 259015 256823 255551 254528 253051 250681 247383 243536
66727 243536 239735 236486 233956 231842 229584 226937 224353 222480 221228 219662 217070 213815 210824 208473
66713 208473 206410 204335 202410 200825 199388 197817 196179 194741 193517 192200 190606 189013 187938 187563
66699 187563 187508 187257 186698 185939 184663 182200 178536 174808 172170 170412 168376 165700 163349 162218 161927 161451
66683 161451 160366 158937 157362 155564 153590 151671 149943 148511 147604 147216 146761 145568 143705 141828 140341
66668 140341 139187 138421 138275 138515 138357 137331 135810 134407 133282 132305 131472 130785 130066 129248 128567 128167 127813
66651 127813 127289 126731 126221 125450 124276 123231 122874 122872 122389 121282 120202 119511 118770 117445 115552 113462 111594
66634 111594 110469 110490 111359 112208 112573 112787 113106 113071 112189 110785 109564 108714 108066 107762 108008 108334 107956 106992
66616 106992 106504 107093 108087 108441 107879 106801 105610 104592 104059 103949 103536 102116 99963 98146 97368 97322 97189
66599 97189 96410 94990 93411 92377 92338 93107 94051 94643 94666 94065 92988 92030 91914 92721 93736 94208 93988 93304
66581 93304 92311 91221 90473 90328 90441 90285 89843 89457 89064 88153 86594 85084 84515 85151 86563 88079 89097
66564 89097 89270 88763 88232 88236 88610 88602 87636 85834 83854 82409 81947 82539 83805 85043 85608 85311 84395 83206
66546 83206 81981 80986 80562 80789 81251 81453 81449 81669 82094 82062 81173 80002 79445 79635 80011 80293 80737 81351 81515
66527 81515 80749 79489 78693 78875 79810 80977 82002 82757 83294 83705 83886 83520 82431 80911 79576 78938 79160
66510 79160 80086 81344 82478 83106 83013 82181 80870 79619 78911 78742 78742 78736 78893 79257 79493 79345 78997 78652 78063
66491 78063 76891 75358 74008 72906 71565 69851 68476 68355 69661 71732 73712 75047 75543 75291 74657
66476 74657 74122 73929 73927 73891 73913 74225 74610 74425 73495 72598 72540 72928 72579 71220 70059 70327 71906 73820 75464
66457 75464 76699 77209 76690 75615 75054 75585 76846 78213 79372 80166 80427 80224 79940 79858 79863 79601 78730 77118
66439 77118 75119 73598 73227 73717 74111 73876 73335 73052 73269 73958 74873 75465 75340 74991 75425 76738 77643 76887
66421 76887 74670 72210 70366 69262 68901 69378 70510 71803 72945 73983 75001 75886 76399 76343 75754 75083
66405 75083 74939 75399 75838 75727 75358 75388 75923 76539 77036 77588 78164 78374 78005 77257 76359 75389 74595 74400 74792
66386 74792 75131 74896 74384 74261 74646 75005 74905 74507 74243 74309 74605 74986 75339 75492 75286 74809 74417 74375 74571 74749
66366 74749 74951 75463 76261 76817 76642 75820 74816 73916 73161 72684 72690 73010 73059 72526 71921 72114 73322 74832 75846
66347 75846 76353 76901 77657 78173 78214 78280 78889 79707 80034 79930 80086 80529 80353 79147 77894 77805 78793 79833 80460
66328 80460 81058 81846 82439 82478 81990 81002 79474 77794 76713 76426 76236 75469 74299 73355 72905 72859 73249 74137
66310 74137 75168 75628 75061 73655 72035 70812 70273 70379 71052 72400 74495 76939 78964 80072 80403 80351
66294 80351 80106 79704 79276 78977 78902 79186 79963 80977 81542 81191 80193 79139 78271 77556 77220 77602 78516 79263 79429
66275 79429 79307 79374 79700 80081 80383 80500 80191 79333 78247 77480 77279 77506 77991 78672 79337 79595 79323 78983 79248
66256 79248 80365 82021 83748 85228 86269 86765 86795 86569 86157 85431 84330 83042 81846 80947 80521 80662 81166
66239 81166 81645 82020 82635 83651 84671 85342 85959 86933 87910 88094 87401 86566 86043 85535 84839 84410 84594 84951
66221 84951 84954 84881 85297 85928 85910 85152 84663 85287 86623 87539 87446 86727 86075 85723 85416 84967 84650 84915 85794 86818
66201 86818 87578 88044 88231 87926 87080 86203 85922 86219 86538 86580 86587 86835 87178 87235 86761 85829 84866 84556 85387 87227
66181 87227 89491 91678 93534 94833 95391 95313 94912 94335 93598 92938 92690 92766 92724 92483 92550 93332 94611 95868
66163 95868 96788 97228 97174 97000 97297 98044 98333 97360 95408 93406 91867 90827 90450 90911 91728 92006 91513 90925
66145 90925 90799 90921 90962 91222 92184 93622 94664 94719 94046 93381 93201 93304 93075 92243 91405 91488 92528 93367 92896
66126 92896 91393 90205 90250 91290 92665 94170 95921 97760 99212 99967 100111 99904 99543 99116 98620 97973 97176
66109 97176 96510 96442 97229 98670 100269 101635 102671 103480 104143 104592 104701 104522 104439 104967 106306 108075 109514
66092 109514 110013 109517 108579 107984 108109 108561 108595 108066 107795 108696 110632 112420 113022 112459 111525 110856 110481 110044
66074 110044 109307 108516 108333 109205 110720 111839 111945 111392 110867 110555 110267 109996 109805 109360 108253 106849 106174
66057 106174 106701 107726 108292 108310 108376 108786 109238 109392 109274 109047 108694 108075 107195 106361 106052 106567 107739 109065
66039 109065 110163 110910 111137 110553 109220 107832 107146 107260 107739 108363 109358 110930 112871 114669 115778 115897
66023 115897 115323 114956 115531 116812 117879 118259 118354 118681 119258 119962 120979 122446 123959 124901 125106 124840 124393
66006 124393 124094 124471 125781 127455 128616 129249 130324 132576 135664 138800 141733 144667 147587 150247 152703
65991 152703 155301 158074 160591 162535 164104 165614 166998 167964 168477 168786 169036 169144 169051 168804 168238 166851
65975 166851 164329 161111 158178 156169 154839 153453 151535 149086 146266 143177 140017 137226 135275 134302
65961 134302 134031 134020 133950 133727 133381 132913 132294 131669 131451 132015 133239 134558 135649 136929 139125 142456 146440
65944 146440 150505 154480 158469 162531 166687 170958 175173 178922 181942 184435 186755 188955 190902 192646
65930 192646 194323 195786 196788 197534 198551 199959 201364 202643 204214 206208 207991 209075 210040 211817 214342
65915 214342 216764 218885 221510 225174 229340 233254 236932 240759 244567 247730 249936 251361 252207 252539 252527
65900 252527 252439 252383 252353 252491 253001 253765 254298 254133 253126 251403 249165 246529 243442 239840 236005 232503 229565
65883 229565 226721 223397 219705 216223 213132 210090 207007 204353 202421 200750 198690 196282 194116 192473
65869 192473 191081 189786 189048 189421 190713 191993 192525 192448 192343 192295 191712 190109 187782 185453 183480 181653
65853 181653 179684 177656 175997 175160 175270 175926 176424 176359 175925 175508 175153 174699 174237 174050 174200 174572 175315 176717
65835 176717 178495 179725 179819 179299 179225 180031 181252 182321 183312 184782 187120 190252 194003 198489 203877 209756
65819 209756 215176 219568 223356 227253 231251 234781 237713 240471 243105 244947 245476 244957 243880 242312 240226
65804 240226 238031 236199 234707 233360 232399 232246 232780 233475 234172 235178 236518 237642 238012 237667 237056 236608
65788 236608 236608 237250 238619 240712 243478 246778 250419 254410 259124 264961 271963 279999 289221 299983 312325
65773 312325 325842 340039 354453 368338 380608 390335 397148 401045 402003 399978 395167 388090 379360
65760 379360 369375 358323 346573 335092 325269 318200 314252 313323 315191 319466 325692 334007 345384
65747 345384 360683 379579 400922 423991 448748 474956 501868 528937 556081 582890 608148
65736 608148 630539 649319 663911 673357 676780 674110 665879 652555 634586 612859 588559 562546
65724 562546 535280 507288 479271 451738 424891 399009 374683 352559 332946 315689 300418
65713 300418 286997 275715 266767 259493 252603 245453 238721 233358 229252 225489 221670 218220 215434 212969
65699 212969 210531 208406 206967 206056 205268 204529 204090 204156 204797 205976 207392 208484 208945 209136 209736 211066 212950
65682 212950 215089 217356 219861 223013 227495 233815 241809 250802 260365 270778 282753 296871 313369
65669 313369 332260 353474 376933 402644 430695 461035 493195 526289 559397 591947 623623
65658 623623 653910 681880 706604 727706 745226 758923 768076 772335 772690 771251 769934 769457 769579
65645 769579 770010 770805 772074 773602 774890 775343 774265 770753 763833 752850 737695 718573 695568 668607
65631 668607 637984 604860 570967 537607 504964 472563 440395 409438 381021 355815 333548
65620 333548 313567 295509 279448 265597 253992 244420 236556 230126 224894 220563 216847 213675 211201
65607 211201 209405 207773 205601 202680 199569 197085 195594 194785 194062 193152 192388 192379 193302 194585 195447 195701 195815
65590 195815 196250 197005 197908 198991 200368 201953 203628 205629 208578 213104 219502 227612 236943 247115 258352
65575 258352 271453 287121 305455 326229 349338 374729 402097 431052 461470 493195 525372
65564 525372 556448 584908 609750 630280 645881 656163 660981 660151 653431 641001 623628 602117
65552 602117 576885 548344 517457 485580 453932 423520 395291 369813 346815 325501 305497
65541 305497 287188 271073 257159 245215 235312 227694 222194 218148 214954 212500 210938 210223 210019 209996
65527 209996 210006 209948 209612 208728 207121 204748 201709 198295 194912 191751 188598 185169 181613 178410 175729 173226
65511 173226 170694 168620 167721 168097 169222 170753 172847 175499 178017 179581 180116 180174 180038 179451 178361 177406
65495 177406 177234 177596 177658 177237 177229 178629 181487 185121 189038 193289 198045 203278 208912 214889 220957 226621
65479 226621 231463 235370 238331 240161 240541 239257 236393 232412 228056 223905 219915 215572 210557 205077
65465 205077 199508 194065 189036 184925 181968 179672 177308 174835 172900 171888 171346 170545 169294 167976 166995
65450 166995 166462 166353 166684 167453 168564 169889 171353 172871 174218 175176 175875 176868 178662 181190 183937 186542
65434 186542 189025 191429 193680 195982 198908 202668 206513 209328 210729 211183 211174 210749 209928 208982 208058 206895
65418 206895 205253 203413 202007 201426 201528 201847 202003 202020 202220 202683 202954 202604 201945 201727 202053 202204 201738 201196
65400 201196 201273 201764 202019 202173 203241 205879 209614 213448 216879 220107 223475 226934 229985 232072 233010 232973
65384 232973 232090 230278 227599 224550 221687 219117 216627 214168 211852 209592 207125 204413 201649 198902
65370 198902 196154 193768 192550 193083 195217 198293 201673 204996 208204 211506 215212 219479 224323 229789
65356 229789 235905 242509 249416 256771 264943 274066 283973 294511 305422 315906 324907 332057 337843
65343 337843 342573 345727 346773 346075 344382 341764 337763 332427 326423 320138 313278 305529 297102 288431
65329 288431 279808 271547 264109 257706 251993 246436 240938 235966 232186 229992 229154 228837 228167 226933 225597
65314 225597 224549 223563 222123 220016 217361 214265 210780 207101 203462 199792 195753 191339 187231 184258
65300 184258 182477 181095 179496 178159 178180 179957 182786 185869 189216 193131 197244 200727 203351 205572 207445
65285 207445 208185 207239 205298 203712 203136 203216 203339 203134 202350 200883 199116 197801 197349 197522 197950 198679 199941
65268 199941 201610 203252 204684 206239 208435 211474 215064 218552 221294 223199 225030 227961 232549 238154
65254 238154 243552 248102 252051 255683 258558 259912 259535 257824 254998 250706 244648 237284 229670 222731
65240 222731 216789 211641 206877 202298 198203 195199 193555 192852 192470 192262 192490 193229 194181 195066 195817 196296
65224 196296 196202 195482 194567 193910 193448 192786 191813 190847 190162 189643 189023 188278 187635 187316 187439 188150 189632 191832
65206 191832 194247 196174 197238 197571 197441 196892 195898 194706 193665 192700 191286 189169 186902 185366 184815 184666
65190 184666 184228 183399 182603 182264 182531 183375 184718 186471 188542 190865 193317 195568 197093 197503 196945 196165
65174 196165 196048 196971 198481 199611 199566 198250 196248 194321 192811 191473 189887 188057 186538 185919 186189 186746
65158 186746 187038 187132 187555 188639 190106 191374 192162 192663 193123 193489 193689 194041 195017 196592 198226 199699 201597
65141 201597 204632 208838 213878 219897 227324 235796 244013 251045 257316 263833 270844 277792 284445 291454
65127 291454 299712 309453 320070 330628 340593 350220 360151 370462 380321 388844 396041 402527 408461
65114 408461 413198 415878 415861 412688 406285 397373 387156 376344 364886 352731 340308 328040 315920
65101 315920 303912 292321 281454 271351 262178 254425 248242 243016 238070 233363 229031 224749 220238
65088 220238 216034 212974 211122 209899 209056 208712 208628 208333 207896 207662 207240 205853 203888 202915 203549 204333 203609
65071 203609 201738 200521 200899 202188 203315 203868 203962 203945 204383 205682 207532 209132 210089 210701 211398 212392 213898
65054 213898 216078 218469 219992 219957 218804 217511 216451 215160 213184 210774 208651 207276 206437 205518 204115
65039 204115 202391 200928 200259 200563 201652 203087 204312 204814 204310 202816 200535 197663 194331 190747 187312
65024 187312 184480 182428 180942 179720 178681 177895 177358 177046 177074 177550 178317 179107 179902 180904 182230 183952
65008 183952 186365 189766 193991 198580 203430 208777 214531 220281 226090 232523 239489 245830 250648 254372
64994 254372 257750 260410 261414 260967 260536 261238 263000 265311 267968 270871 273896 277285 281546 286654 291899
64979 291899 296777 301393 305639 308605 309377 308004 305165 301173 295861 289286 281962 274432 266968 259789
64965 259789 253256 247695 243070 238914 234731 230609 227289 225372 224506 223750 222756 222099 222261 222760 222602 221339
64949 221339 219420 217726 216987 217365 218335 219143 219528 219764 219930 219568 218318 216474 214605 213063 212224 212690 214626
64932 214626 217172 219182 220374 221232 221981 222333 222230 222113 222238 222224 221533 220005 217798 215187 212638 210743
64916 210743 209765 209367 208968 208284 207557 207347 208063 209460 210752 211479 212141 213609 216066 219069 222544 227029
64900 227029 232799 239449 246682 254855 264265 274451 284811 295499 306994 319023 330709 341723
64888 341723 352551 363527 374358 384877 395624 407135 419077 430603 441276 451006 459081 463961
64876 463961 464384 460415 453164 443711 432694 420833 409253 398893 389784 381376 373611 367309 363266
64863 363266 361174 359709 357553 354146 349576 344135 337997 331073 323114 314170 304928 296211 288034 279569
64849 279569 270319 260990 252799 246203 240734 235978 232105 229367 227539 226114 224748 223303 221701 219981
64835 219981 218283 216597 214705 212568 210544 208975 207707 206329 204774 203405 202527 202143 202227 202974 204596
64820 204596 207009 209825 212665 215368 217966 220468 222820 225185 228217 232790 239318 247420 256312 265340
64806 265340 274092 282365 290330 298489 307063 315496 322828 328436 332168 333959 333773 331796 328234 322966
64792 322966 315965 308068 300748 294864 290091 285818 282119 279448 277901 277346 278010 280243 283638 286965 289268
64777 289268 290746 292283 294254 296171 297583 299005 301582 305869 311330 317271 323868 331782 341000 350649
64763 350649 360009 369167 378496 388003 397501 407034 416786 426796 436990 447274 457407 467079 476315
64750 476315 485542 495075 504811 514591 524419 534037 542682 549570 554186 555792 553266 546091 535137 521792
64736 521792 506675 489964 472627 456251 441634 428497 416809 407347 400479 395208 390252 385562
64724 385562 382061 380126 379088 378194 377422 377163 377587 378704 380880 384943 391643 400962 412020 423658 435079
64709 435079 445889 455726 464098 470597 474976 476955 476152 472323 465485 455712 443075 427986 411398
64696 411398 394387 377583 361231 345719 331734 319769 309694 300991 293355 286914 281866 278073
64684 278073 275085 272462 269991 267768 266236 266026 267468 270239 273721 277667 282274 287612 293463 299844
64670 299844 307213 315830 325200 334470 343129 351051 358132 364231 369135 372162 372193 368745 362840 356224 349789
64655 349789 343351 336881 331137 326870 324026 321988 320173 318174 315867 313725 312637 313125 314971 317741
64641 317741 321274 325499 330282 335771 342504 350825 360568 371608 384324 399033 415321 432397 449906
64628 449906 467802 485522 501704 514846 523968 528692 529006 525035 516966 505186 490485 473884 456115
64615 456115 437503 418561 400413 384310 370853 359887 350944 343536 337285 332155 328404 325937 323853
64602 323853 321059 317339 313408 309937 306835 303562 299865 296133 293235 292000 292537 294001 295262 295940 296694
64587 296694 298503 301866 306694 312701 319708 327654 336517 346377 357640 371060 387154 405363 424075
64574 424075 441872 458665 475285 492017 507926 521685 532596 540541 545297 546404 543685 537556
64562 537556 528578 516902 502408 485400 466969 448558 431283 415732 402146 390461 380257 371056
64550 371056 362771 355663 349881 345409 342445 341353 342011 343678 345808 348627 352477 356923 361052 364502
64536 364502 367651 370774 373439 374754 373889 370342 364082 355594 345691 335207 324945 315653 307749 301121
64522 301121 295509 290941 287536 285007 282799 280705 279001 277980 277692 278083 278966 279851 280203 280077 280141 280962
64506 280962 282536 284629 287213 290376 294109 298424 303512 309588 316670 324639 333407 342968 353345 364422
64492 364422 375625 385790 393640 398557 400848 401354 400932 400173 399297 398344 397667 398126 400413 404326 409021
64477 409021 413794 418066 420864 421200 419159 415803 411727 406470 399828 392934 387238 382929 379275 376221
64463 376221 374692 375278 377437 380263 383414 386962 390747 394233 396776 397814 397012 394432 390522 385829 380787
64448 380787 375773 371152 367175 363950 361571 360218 360104 361367 363955 367563 371840 376824 383036 390936
64434 390936 400440 411260 423615 438260 455766 476158 499328 525513 555264 589328 628795 675081
64422 675081 729386 792297 864218 946113 1039417 1144975 1262084 1388535 1521360 1657444
64412 1657444 1793625 1926624 2053264 2170900 2277630 2372004 2452423 2516801 2562812 2588595
64402 2588595 2593366 2577481 2542024 2488351 2417895 2332029 2231862 2118257 1992539 1857435 1717158
64391 1717158 1576357 1439064 1308553 1187657 1078446 981534 896155 821208 756036 700125
64381 700125 652501 611916 577514 548946 525767 507027 491551 478447 467233 457735 449991 444030
64369 444030 439428 435136 429972 423357 415400 406346 396185 384918 372892 360705 348923 338072 328690
64356 328690 321102 315171 310517 306958 304517 303051 302162 301575 301393 301937 303509 306316 310351 315231 320319
64341 320319 325050 328904 331088 330692 327478 322259 316204 309981 303805 298026 293159 289432 286760 285185
64327 285185 284930 285873 287352 288687 289744 290911 292710 295486 299155 303115 306692 309938 313784 319178 326181
64312 326181 334084 342157 349876 356551 361239 363271 362657 359836 355155 348719 340561 330786 319648 307732
64298 307732 296013 285503 276744 269682 263992 259318 255181 250983 246489 242282 239383 238211 238073 237868
64284 237868 237225 236739 237138 238509 240523 243144 246748 251509 257008 262644 268275 274210 280632 287333 294042
64269 294042 300719 307322 313475 318689 322875 326359 329326 331527 332677 332990 333122 333612 334564 335796 337086
64254 337086 338208 338830 338552 337019 333947 329048 322100 313208 302991 292453 282582 274066 267275 262281
64240 262281 258760 256003 253308 250495 247906 245867 244257 242725 241246 240270 240285 241331 243047 245081 247282
64225 247282 249457 251167 251977 251898 251379 250851 250427 250046 249638 249026 247927 246321 244704 243655 243192 242725 241619
64208 241619 239631 236964 234224 232241 231547 231920 232720 233611 234617 235513 235800 235552 235757 237350 240184 243424
64192 243424 246753 250701 255888 262382 269898 278261 287579 298141 310092 323031 336025 348311 359886
64179 359886 370995 381103 388815 392934 393201 389909 383354 374040 363067 351745 340848 330523 320766
64166 320766 311615 302936 294530 286540 279421 273277 267554 261686 255880 250979 247559 245402 243810 242231
64152 242231 240575 239185 238660 239567 242171 246366 251783 257857 263929 269628 275161 280863 286343 290532 292913
64137 292913 294246 295500 296429 295914 293627 290505 287389 284039 279958 275537 271724 268903 266774 265116 264048
64122 264048 263575 263438 263580 264410 266513 270248 275524 281769 288237 294646 301376 308790 316622 324391 332136
64107 332136 340209 348522 356600 364209 371177 376678 379683 380478 380982 382996 386704 391364 396850 403670 411731
64092 411731 419925 427091 432886 437537 441052 442860 442171 438633 432646 424924 415862 405607 394739 384304
64078 384304 374886 366086 357341 348853 341253 334725 329073 324443 321241 319341 318012 316755 315699 315124
64064 315124 315166 316142 318575 322474 326904 330599 332944 334302 335663 338043 341806 346354 350702 354492 358198
64049 358198 362279 366559 370581 374058 376678 377920 377624 376433 375241 374367 373732 373635 374751 377317 380732
64034 380732 384084 386757 388532 389446 389642 389114 387586 384901 381505 378202 375443 373249 371841 371859 373665
64019 373665 376747 380117 383074 385420 387178 388397 389058 388885 387370 384173 379398 373325 366160 358322 350784
64004 350784 344601 340053 336517 333164 329533 325463 320909 316078 311517 307829 305270 303638 302448 301255
63990 301255 300078 299575 300598 303332 307025 310687 313962 317183 320675 324222 327223 329305 330783 332528
63976 332528 335337 339337 344069 349096 354268 359308 363523 366367 368212 370159 372971 376476 380151 383947
63962 383947 388296 393466 399252 405308 411590 418465 426543 436416 448438 462694 479228 498232 519894
63949 519894 544166 571016 601038 635539 675796 722291 774900 833748 899595 973273 1054957
63938 1054957 1144115 1240018 1342069 1449616 1561606 1676461 1792250 1906893 2018211 2123845
63928 2123845 2221314 2308280 2382815 2443349 2488413 2516617 2526909 2518768 2492158 2447547 2386228
63917 2386228 2310462 2223013 2126449 2022932 1914529 1803484 1692148 1582812 1477514 1377698
63907 1377698 1283931 1196256 1115006 1041080 975228 917323 866663 822905 786222 756419 732281
63896 732281 712134 694968 680710 669443 660610 653152 646283 639923 634370 629682 625464 621232 616940
63883 616940 613148 610693 610161 611689 615231 620854 628642 638404 649789 662814 678161 696764 719114
63870 719114 745063 774188 806267 841477 880252 922888 969197 1018613 1070723 1125551 1183221
63859 1183221 1243502 1305862 1369703 1434163 1497907 1559585 1618572 1674764 1727572 1775507 1816975
63848 1816975 1851095 1877552 1896086 1906499 1908820 1903002 1888616 1865305 1833527 1794439 1749061 1697878
63836 1697878 1641363 1580522 1516717 1451130 1384577 1317778 1251573 1186828 1124237 1064327 1007628
63825 1007628 954593 905179 858701 814453 772457 733344 697498 664734 634823 607812 583590
63814 583590 561605 541380 522905 506193 490904 476946 464997 455704 448622 442743 437920 434901
63802 434901 433921 434188 435013 436538 438791 440745 441054 439305 435891 430933 424080 415304 405253 394702 384068
63787 384068 373578 363528 354221 345814 338350 331819 326170 321341 317231 313522 309716 305548 301259 297276
63773 297276 293742 290631 288158 286614 285782 284921 283549 281902 280430 279112 277602 275889 274434 273561 273016
63758 273016 272251 270958 269168 267007 264674 262598 261283 260805 260678 260433 260198 260432 261248 262290 263281 264303
63742 264303 265439 266510 267401 268395 269855 271671 273320 274512 275558 277054 279352 282336 285605 288758 291556
63727 291556 293970 296212 298720 301977 306213 311322 317128 323594 330532 337323 343263 348207 352483 356152
63713 356152 358865 360595 361972 363423 364400 364015 362205 359695 356859 353315 348801 343899 339534 336097 333382
63698 333382 331203 329673 328901 328666 328543 328326 328334 329194 331192 333881 336466 338616 340648 342948 345533 348323
63682 348323 351448 354845 357748 359148 358931 358209 358313 359689 362012 365034 368793 373008 376858 379731 381892
63667 381892 384089 386630 389229 391628 393922 396173 398090 399218 399206 397805 394976 391164 387118 383163 378930
63652 378930 374034 368701 363396 358199 353135 348829 346110 344910 344187 343217 342447 342839 344778 347965 352027
63637 352027 356793 362143 367899 373845 379712 385364 391083 397351 404103 410542 416093 421245 426953 433404
63623 433404 439964 446237 452552 459287 466389 473867 482228 491967 502958 514818 527666 542148 558837
63610 558837 577969 599546 623216 648121 673440 699218 726279 755035 784608 813256 839421
63599 839421 862168 880918 895149 904506 909104 909666 907294 902972 897267 890595 883556 876572 869200 860264
63585 860264 848905 835182 819440 801554 781256 758915 735473 711696 688006 664980 643487
63574 643487 624197 607263 592593 580110 569689 561161 554497 549748 546729 545044 544479 545124 547069
63561 547069 550324 555073 561554 569560 578434 587824 598060 609577 622362 636343 652012 670190 691392
63548 691392 715828 743949 776509 814052 856615 903895 955275 1009327 1063192 1112437 1151933
63537 1151933 1177737 1188978 1188026 1178626 1163860 1145874 1126792 1108904 1093639 1080926 1069772 1059148
63525 1059148 1048129 1035670 1020716 1002473 980365 953978 923483 890080 855598 821365 787617
63514 787617 754224 721808 691783 665162 641681 620369 600752 583052 567342 553125 539994
63503 539994 528166 517874 508550 499173 489431 480065 471950 465094 458654 451735 444136 436465 429655 424298
63489 424298 420374 417562 415614 414370 413702 413686 414642 416750 419723 423128 426888 431168 435888 440706 445451
63474 445451 450202 454979 459681 464363 469153 473793 477593 480011 481032 480885 479701 477687 475391 473467
63460 473467 472126 471019 469679 468114 466917 466736 467616 468924 469976 470547 470714 470503 470012 469757 470504 472726
63444 472726 476340 480921 486064 491819 499062 509207 523151 540700 561463 586052 615843 651627
63432 651627 693117 739676 790598 844236 897264 945165 983391 1008489 1019270 1017524 1007157 992113
63420 992113 975185 958685 945231 937106 935257 939574 949943 966420 988509 1014780 1043172 1071376
63408 1071376 1097118 1118589 1134732 1145011 1149215 1147824 1142314 1134602 1126081 1117343 1108486 1099196 1088632
63395 1088632 1075754 1059888 1040796 1018334 992367 963029 930758 896211 860396 824682 790239
63384 790239 757484 726454 697560 671519 648555 628170 609820 593431 579186 567312 558239 552484
63372 552484 550025 550007 551398 553820 557634 563429 571617 582237 594927 609227 625193 643554 664996
63359 664996 689391 716052 744701 775793 809683 845800 883017 920779 959412 999026 1038355
63348 1038355 1075053 1107102 1133642 1154454 1169212 1177627 1180098 1177800 1172174 1164565 1156231 1148120 1140325
63335 1140325 1131868 1121264 1107432 1090138 1069712 1046382 1019938 990149 957539 923575 889977
63324 889977 858032 828730 803283 783024 768697 760137 756734 757958 763139 770607 777001 777597 768049
63311 768049 746747 715961 680431 644446 610079 577860 548416 522868 501802 484495 469501
63300 469501 455829 443347 432275 422687 414535 407769 402135 397018 391848 386624 381832 377762 374172
63287 374172 370624 366906 363041 359184 355693 353063 351605 351243 351683 352574 353441 353786 353508 352991 352626 352442
63271 352442 352431 352895 354100 355761 357310 358558 359768 361103 362374 363360 364130 364986 366295 368343 371147 374399
63255 374399 377731 380991 384172 387282 390527 394386 399148 404481 409777 414811 419717 424421 428555 431987
63241 431987 435140 438705 443284 449221 456424 464292 472190 480102 488701 498708 510363 523373 537142
63228 537142 551069 564869 578607 592343 605997 619709 633923 648679 663280 677319 691660
63217 691660 707510 724655 741569 757306 772307 787039 800904 812968 822929 830669 835568 837079
63205 837079 835487 831351 824576 814843 802656 789129 774797 759435 743136 726916 712082 699443
63193 699443 689249 681453 675875 672529 671971 674982 681714 691433 703320 717389 734364 754735 778090
63180 778090 803380 829745 856971 885170 914205 943668 973263 1002825 1031880 1059624 1085538
63169 1085538 1109726 1132401 1153332 1172030 1188067 1200835 1209395 1213059 1211858 1205888 1194456 1176617
63157 1176617 1152547 1123668 1091245 1055468 1016219 974206 930896 887691 845565 805272 767432
63146 767432 732353 700028 670385 643462 619427 598548 581031 566692 554787 544245 534187
63135 534187 524294 514781 506066 498381 491645 485698 480521 476158 472517 469452 467013 465355 464363 463694 463279
63120 463279 463557 464892 466926 468813 470110 471161 472487 474165 476030 478256 481233 484844 488347 491213
63106 491213 493719 496307 498692 500170 500763 501459 503179 505933 509207 512717 516512 520698 525445 531013 537413
63091 537413 544218 550959 557538 563965 569911 574844 578408 580318 580075 577272 572210 565938 559672 554272
63077 554272 550040 546698 543689 540894 538980 538764 540390 543383 547314 551995 557294 563218 570023 577720
63063 577720 585683 593385 601379 610823 622057 634471 647901 663246 681275 701577 723281 746265
63051 746265 771038 797808 826277 856152 887335 919736 953298 988079 1023997 1060689 1097931
63040 1097931 1135931 1174888 1214484 1254178 1293749 1333164 1372215 1410784 1449227 1487903 1526360
63029 1526360 1563368 1597661 1628106 1653308 1671767 1682680 1686131 1682340 1671147 1652498 1627095 1596278
63017 1596278 1561480 1523963 1484905 1445526 1407157 1371181 1338751 1310575 1287167 1269256 1257642
63006 1257642 1252670 1254212 1262199 1276798 1297870 1324632 1356121 1391764 1431213 1473884 1518946 1565697
62994 1565697 1613670 1662418 1711404 1760121 1808235 1855675 1902622 1949279 1995464 2040480 2083314
62983 2083314 2122775 2157396 2185620 2206352 2219083 2223161 2217165 2199502 2169637 2128413 2077151 2016854
62971 2016854 1948519 1873863 1795300 1715137 1635024 1556179 1479864 1407310 1339151 1275275 1215488
62960 1215488 1160215 1110181 1065415 1024972 987864 953813 922758 893956 866274 839362 813972
62949 813972 790890 769984 750541 732149 714793 698290 682160 666149 650597 636103 622908
62938 622908 610710 599071 587991 578030 569809 563375 558143 553470 549084 544915 540765 536465 532249
62925 532249 528633 525854 523667 521770 520148 518830 517549 515975 514280 513133 512981 513524 514070 514305 514472
62910 514472 514892 515636 516700 518141 519756 520936 521275 521213 521548 522208 522012 519982 516589 513369 511512 511201
62894 511201 512119 514004 516560 519220 521285 522263 522077 521133 520185 519814 519861 519572 518470 516958 515904 515775 516375
62877 516375 517297 518398 519779 521459 523134 524217 524098 522472 519478 515628 511608 508067 505373 503372 501435
62862 501435 498857 495350 491214 487074 483435 480417 477916 475979 474927 475007 475967 477186 478222 479125 480202
62847 480202 481625 483333 485123 486703 487783 488324 488655 489221 490106 490882 490995 490330 489364 488727 488610 488693 488650 488590
62829 488590 488900 489844 491412 493375 495275 496558 497093 497510 498682 500877 503673 506602 509421 511750 513061
62814 513061 513299 513141 513303 513920 514782 515861 517288 519167 521681 525033 528906 532367 534799 536693 539023
62799 539023 542133 545727 549768 554672 560701 567787 575905 584950 594250 603033 611701 622002 635486 652231
62785 652231 671410 692574 715891 741570 769766 800975 835980 875304 918990 966815 1018429
62774 1018429 1073340 1130936 1190437 1250612 1309823 1366735 1420843 1471873 1518702 1559342 1592042
62763 1592042 1615949 1630632 1635506 1630180 1615083 1591315 1559936 1521686 1477374 1428217 1375654 1320953
62751 1320953 1265049 1208601 1152201 1096655 1043110 992738 946138 903178 863522 827204 794488
62740 794488 765261 738904 714878 693209 674229 657972 644008 631759 620800 610959 602375 595469
62728 595469 590595 587566 585602 583834 581915 580228 579603 580734 583660 587724 592170 596880 602511 609848
62714 609848 619037 629468 640479 652173 665489 681365 699959 720939 744469 771494 802834 838374
62702 838374 877502 920170 967159 1019421 1077495 1141440 1210959 1285544 1364774 1448444 1536171
62691 1536171 1626975 1719510 1812487 1904397 1992901 2075035 2148066 2209802 2258234 2291582 2308910
62680 2308910 2310167 2295488 2265071 2219921 2162047 2093474 2015656 1930236 1839773 1747078 1654246
62669 1654246 1562886 1474778 1391431 1313206 1239657 1170683 1106689 1047758 993483 943720 898769
62658 898769 858627 822765 790849 762965 738693 716640 695577 675690 657984 642601 628433
62647 628433 614494 601064 589043 578531 568624 558666 549201 541321 535283 530217 525208 520195 515642
62634 515642 511771 508541 506109 504769 504412 504401 504032 502896 500897 498308 495822 494169 493495 493247 492681 491395
62618 491395 489521 487722 486855 487224 488178 488835 489177 489991 491741 494074 496599 499525 503126 507056 510727 514168
62602 514168 518094 523194 529688 537499 546558 556959 568962 582756 598195 614983 633288 653885
62590 653885 677393 703529 731335 759886 788470 816355 842886 867761 890759 911104 927427
62579 927427 938469 943621 942857 936529 925319 910066 891367 869554 845177 819343 793337 767946
62567 767946 743222 718834 694594 670780 648109 627350 608830 592276 577198 563429 551275
62556 551275 541108 532827 525827 519560 514060 509668 506231 502850 498658 493698 488848 484942 482264 480826
62542 480826 480722 481942 484033 486264 488220 490060 492110 494317 496349 498274 500851 504752 509530 513818
62528 513818 516796 519171 522372 527101 533113 540307 549325 560886 575042 591451 610069 631141 654754
62515 654754 680903 710006 742898 780126 821438 866111 913574 963535 1015612 1069045 1122748
62504 1122748 1175488 1225884 1272354 1313235 1347059 1372758 1389690 1397649 1396925 1388177 1372026 1348858
62492 1348858 1319369 1285381 1249716 1214930 1182265 1152029 1124641 1100775 1080608 1063704 1049990
62481 1049990 1040339 1035644 1035573 1038787 1044295 1051980 1061661 1072102 1081236 1087169 1088834 1086064 1079351 1069339
62467 1069339 1056150 1039118 1017371 990641 959552 925393 889736 853945 818568 783302 747893
62456 747893 713105 680488 651213 625414 602604 582358 564455 548728 535057 523394 513706 506053
62444 506053 500712 497949 497565 498808 500807 502846 504383 505263 506098 507920 511093 514866 518264 521054 523401
62429 523401 524937 524792 522547 518701 514132 509390 504524 499283 493522 487619 482425 478494 475428 472321
62415 472321 468807 465346 462524 460399 458523 456327 453501 450332 447582 445657 444039 441971 439530 437385
62401 437385 435632 433744 431854 431097 432134 434111 435847 437441 439854 443239 446712 449731 452838 456742
62387 456742 461332 465894 469874 473155 475924 478616 481827 485997 491105 496668 502014 506701 510898 515234
62373 515234 520153 525586 531498 538399 546809 556424 566441 576702 587883 600467 614333 629645 647396
62360 647396 668453 692566 719004 747913 780330 817021 857947 902828 951456 1003207 1056789
62349 1056789 1110797 1164137 1215569 1263265 1305372 1340901 1369648 1391229 1404726 1409615 1406718 1397783
62337 1397783 1384021 1365295 1340809 1310341 1274696 1235247 1193481 1150999 1109522 1070417 1034107
62326 1034107 1000053 967510 936419 907587 881845 858941 837389 815574 792994 770320 748433
62315 748433 727675 707917 688891 670385 652490 635778 620878 607659 595171 582722 570700
62304 570700 560036 551118 543647 537365 532305 528311 524796 521262 517786 514808 512580 510952 509651 508659
62290 508659 508304 508905 510305 511930 513470 515320 518104 521852 525925 529680 532891 535612 537996 540316 542780
62275 542780 545186 547090 548405 549595 551164 553298 556133 560008 565172 571500 578810 587259 597173 608707
62261 608707 622030 637692 656487 678998 705536 736446 772125 812707 857963 907495 960738
62250 960738 1016720 1074065 1131349 1187304 1240653 1289899 1333325 1369114 1395675 1412308 1419666 1419140
62238 1419140 1411505 1396397 1373321 1342833 1306291 1264704 1218502 1168539 1116665 1064817 1013873
62227 1013873 963875 915287 869472 827794 790631 757474 727743 701223 677868 657493 639707
62216 639707 624016 609961 597225 585622 574976 565103 555921 547407 539361 531458 523733 516819 511413
62203 511413 507522 504490 501716 499146 497168 496269 496729 498341 500458 502658 505311 509131 514184 519792 525500
62188 525500 531602 538533 546286 554788 564350 575211 586883 598470 609491 619958 629821 638826 646812
62175 646812 653693 659175 663056 665861 668693 672334 676971 682971 691431 703607 720157 741240 766990
62162 766990 797372 831763 869201 909028 950786 993303 1034368 1071746 1104332 1131925 1154032
62151 1154032 1169503 1177659 1179318 1176143 1169068 1157829 1142011 1121870 1097857 1069977 1038308 1003978
62139 1003978 969003 935134 903284 873919 847439 824054 803871 787321 775010 766855 761795 758721
62127 758721 757426 758353 761760 767540 775556 785634 797351 810299 824547 840458 858013 876665 895781
62114 895781 914846 933225 950157 965094 977687 987384 993590 996491 997359 997675 998197 999134 1000770 1003458
62100 1003458 1007222 1011952 1017945 1025745 1035482 1046877 1059954 1075149 1092476 1111034 1129672 1147788
62088 1147788 1165209 1181729 1197191 1211776 1225709 1238829 1250934 1262517 1274752 1288785 1305353
62077 1305353 1324901 1347468 1372349 1398436 1425088 1452335 1480127 1507819 1534604 1559922 1583112
62066 1583112 1603191 1619532 1632569 1643347 1652548 1660445 1667657 1675329 1684383 1694946 1706681 1719366
62054 1719366 1732952 1747228 1761684 1775706 1788768 1800359 1809640 1815242 1815659 1809993 1798185 1780354
62042 1780354 1756090 1724609 1685472 1638915 1585700 1527056 1464713 1400467 1335498 1270342 1205671
62031 1205671 1142787 1083157 1027676 976637 930258 888836 852326 820011 790883 764325 740259
62020 740259 718580 698696 679873 661916 645162 629803 615551 602098 589530 578069 567673
62009 567673 558192 549703 542452 536621 532360 529877 529237 530279 532889 537091 542611 548694 554751 560844
61995 560844 567097 572955 577552 580563 582050 581755 579310 575073 569925 564115 557070 548499 538989 529262
61981 529262 519528 509933 501020 493300 486751 481000 475591 469863 463244 456071 449628 444890 441583 438790
61967 438790 435996 433149 430280 427610 425649 424614 424041 423458 423091 423377 424200 425238 426721 429064 431917
61952 431917 434423 436424 438704 441926 445961 450537 456023 463149 472187 482672 493955 505959 519363
61939 519363 534960 552790 572151 592473 613670 635479 657119 678187 699370 721412 743627
61928 743627 764290 782442 798552 813338 826707 838026 846733 852421 854923 854601 852082 847520 840695
61915 840695 832109 823417 816394 811848 809854 810513 813974 820073 828569 839657 853833 871229 891243
61902 891243 912664 934005 953880 971346 985854 996749 1003105 1004293 1000578 992907 982147 968604
61890 968604 952206 933088 912071 890546 869623 849401 829323 809249 789812 771653 754756
61879 754756 738731 723275 708114 692963 677999 664048 651785 641002 631070 621887 613820 606911
61867 606911 600788 595397 591229 588637 587409 587275 588448 591395 596303 603042 611464 621480 633075 646538
61853 646538 662555 681783 704333 729911 758354 789647 823350 858465 894086 929926 965839
61842 965839 1001068 1034359 1064781 1091918 1115197 1133526 1145890 1152068 1152519 1147965 1139399 1128231
61830 1128231 1115928 1103603 1092307 1083488 1078616 1078325 1082374 1090458 1102539 1118256 1136492 1155741
61818 1155741 1174543 1191340 1204404 1212365 1214719 1211506 1202604 1187645 1166565 1140092 1109654 1076802
61806 1076802 1042570 1007356 971519 935974 901922 869998 840122 812218 786606 763496 742589
61795 742589 723594 706722 692210 679598 668015 657061 646947 637850 629665 622446 616634 612530
61783 612530 609793 607673 605640 603658 601945 600604 599500 598464 597572 597124 597298 597881 598423 598570 598203 597346
61767 597346 596088 594629 593340 592790 593530 595627 598369 600677 601915 602169 601760 600842 599582 598353 597373 596352
61751 596352 594824 592729 590397 588046 585575 582824 579825 576792 573987 571598 569642 567980 566452 564901
61737 564901 563126 561071 559114 557860 557509 557702 558088 558649 559326 559837 560200 561011 562662 564642 566182 567386
61721 567386 569115 571871 575372 579164 583018 586638 589638 592048 594405 597050 599558 601043 600870 599052
61707 599052 596258 593397 590902 588343 584982 580639 575715 570537 565270 560411 556710 554280 552282 549864
61693 549864 547118 544812 543441 542796 542299 541544 540616 539966 539831 539850 539522 538967 538872 539698 541411 543909 547055
61676 547055 550178 552301 553284 554167 555912 558311 560532 562230 563487 564142 563940 563149 562360 561709 560819 559416
61660 559416 557519 555184 552555 550021 547790 545405 542263 538562 535187 532735 531213 530586 530850 531432 531261
61645 531261 529895 528122 527165 527585 529125 531109 532795 533740 534143 534485 534685 534044 532191 529538 526544 523113
61629 523113 519114 514897 510718 506218 501158 496194 492105 488644 485109 481862 480102 479996 480133 479370 478335
61614 478335 478378 479686 481233 482196 482539 482296 481090 478555 474686 469565 463188 455807 448150 441009 434729
61599 434729 429241 424372 419966 415892 412224 409318 407388 405962 404031 400913 396875 392777 389196 386097
61585 386097 383229 380471 377671 374495 370818 367139 364179 362069 360273 358393 356607 355090 353417 350992
61571 350992 347894 344877 342533 340838 339474 338216 336988 335899 335311 335492 336090 336348 336085 336026 336816 338048
61555 338048 338746 338594 338147 337947 338043 338431 339285 340437 341206 341243 341177 341843 343072 343927 344141 344609 346152 348278
61537 348278 349663 349651 348873 348549 349575 352231 356247 360897 365276 368676 370652 370808 368888 365276 361092
61522 361092 357494 354890 352977 351321 349657 347773 345531 343119 341059 339814 339396 339344 339039 338131 336887
61507 336887 336059 336200 337032 337646 337309 335963 333998 331841 329824 328123 326622 325008 323196 321538 320416
61492 320416 319772 319264 318777 318543 318771 319418 320345 321482 322709 323728 324227 324130 323641 323079 322783 323045 323925 325065
61474 325065 325904 326277 326706 327825 329550 331032 331572 331303 330823 330460 330193 330087 330315 330770 331105 331282 331700 332581
61456 332581 333557 334164 334516 335145 336268 337483 338235 338361 338215 338371 339196 340558 341904 342716 342906 342778 342706 342950
61438 342950 343680 345001 346939 349448 352457 355845 359394 362802 365723 367889 369311 370350 371474 372889
61424 372889 374431 375779 376646 376915 376853 377190 378663 381392 384915 388790 392815 396651 399739 401844 403262
61409 403262 404196 404332 403401 401759 399923 397809 394985 391550 388152 385175 382408 379559 376679 373935 371352
61394 371352 368876 366427 363808 360914 358067 355843 354450 353553 352768 352067 351636 351660 352315 353695 355578 357433
61378 357433 358758 359315 359153 358652 358438 358847 359480 359695 359543 359738 360585 361485 361755 361515 361461 362106 363544 365591
61360 365591 367832 369840 371679 373972 377115 380744 384349 388106 392641 398130 404197 410650 417780 425876
61346 425876 434859 444541 454898 465930 477438 489073 500441 511103 520693 529155 536727 543574 549531
61333 549531 554252 557557 559617 560809 561341 560982 559290 556172 552129 547819 543565 539369 535188 530914 526299
61318 526299 521326 516637 513230 511600 511404 512031 513280 515343 518338 521933 525423 528281 530810 534146 539313
61303 539313 546313 554424 563335 573513 585330 598201 610834 622063 631288 638392 643456 646420 646910
61290 646910 644690 640292 634689 628132 619913 609770 598997 589404 581509 574558 568161 562863 558935 555645
61276 555645 552326 549423 547851 547784 548811 550865 554174 558452 562910 567175 571560 576304 581113 585696 590320
61261 590320 595521 601569 608428 616000 624227 633154 643045 654197 666550 679699 693298 707102 720469
61248 720469 732265 741627 748573 753548 756620 757438 755819 751967 746172 738640 729704 720022 710453 701713
61234 701713 694071 687323 681207 675813 671374 667756 664641 662319 661645 662825 664788 666395 667940 670764
61220 670764 675600 681976 689144 696750 704541 712148 719505 726876 734148 740581 745673 749907 754253 759183
61206 759183 764490 769842 775088 780129 784832 789074 792787 796106 799659 804575 811939 822270 835593 851793
61192 851793 870656 891715 914407 938480 964048 991089 1018973 1046615 1073068 1097883 1120805
61181 1120805 1141367 1159116 1174236 1187522 1199466 1209771 1218093 1224861 1230678 1235052 1236440 1233732
61169 1233732 1227236 1218087 1207170 1194755 1180656 1164463 1146011 1125858 1104870 1083134 1059760 1034136
61157 1034136 1006920 979400 952295 925703 899914 875626 853488 833902 817194 803452 792193
61146 792193 782684 774668 768504 764506 762447 761685 761433 760830 759140 756135 752197 747949 743868 740202 737161
61131 737161 735098 734546 735931 739132 743525 748744 755369 764533 776861 792139 810104 831180 856044
61118 856044 884652 916132 949746 985593 1024105 1065079 1107614 1150991 1195121 1239907 1284625
61107 1284625 1328377 1370862 1412182 1451980 1489263 1523128 1553190 1579297 1601310 1619284 1633265
61096 1633265 1642662 1646276 1643284 1633840 1618469 1597344 1570508 1538481 1502173 1462463 1420201 1376348
61084 1376348 1331722 1286805 1242145 1198677 1157168 1117563 1079368 1042575 1007724 975144 944651
61073 944651 916111 889834 866239 845422 827273 811790 798997 788580 779762 771709 764132 757444
61061 757444 752218 748618 746486 745848 746929 749715 753898 759279 765876 773574 782211 792093 803868 817667
61047 817667 832912 849258 867143 887068 908931 932581 958471 987093 1018165 1050976 1085255
61036 1085255 1121134 1158521 1197051 1236450 1276494 1316927 1357890 1400088 1443995 1489198 1535019
61025 1535019 1581288 1627972 1674537 1720460 1765980 1811590 1857259 1903130 1950766 2002724 2061054
61014 2061054 2126939 2201466 2285723 2380470 2486992 2608528 2750267 2918434 3120647 3366939
61004 3366939 3669123 4039407 4491338 5042273 5713417 6527404 7507209 8675610 10049163
60995 10049163 11626512 13379823 15253494 17161905 18982050 20558735 21745452 22471065
60987 22471065 22783347 22827573 22773363 22745771 22799242 22921716 23037342 23008481 22667522 21886488
60977 21886488 20642513 19027425 17197386 15307724 13475907 11776863 10250954 8912115
60969 8912115 7756523 6771506 5940555 5244310 4661936 4174158 3764839 3420026 3127183
60960 3127183 2875926 2658436 2468659 2301701 2154000 2023160 1907222 1804508 1713940 1634633
60950 1634633 1565116 1503621 1449089 1400994 1358117 1318318 1279783 1241858 1204525 1167731 1131491
60939 1131491 1096050 1061610 1028210 995967 965066 935492 907181 880359 855224 831403 808352
60928 808352 786300 766071 747815 730596 713572 697014 681791 668224 655850 644086 632808
60917 632808 622348 613093 605072 597963 591555 585993 581361 577326 573599 570486 568462 567376 566601 565905
60903 565905 565552 565607 565745 565824 566062 566514 566873 566940 566816 566494 565705 564214 561884 558427 553666 548166 543035 538890
60885 538890 535441 532171 528894 525528 521937 518285 514961 511860 508346 504285 500553 497952 496078 493899
60871 493899 491157 488556 486694 485447 484459 483702 483296 483100 482802 482389 482322 483136 484885 487127 489453 491838
60855 491838 494375 496898 499192 501320 503390 505168 506433 507698 509965 513623 518020 522303 526279 530160
60841 530160 533822 536589 537677 536768 534350 531430 528597 525445 521328 516638 512665 510071 508167 506044
60827 506044 503787 502119 501332 501150 501372 502038 503076 504168 504980 505327 505230 504923 504585 503917 502377 500019 497679
60810 497679 495998 494663 493009 491015 489190 487823 486841 486211 485925 485687 485175 484476 483790 482789 480844 477943
60794 477943 474856 472283 470337 468982 468491 469060 470253 471178 471247 470622 469975 469839 470134 470291 469908 469238 468917
60777 468917 469298 470256 471522 472942 474414 475863 477402 479315 481763 484635 487764 491209 495175 499710 504542
60762 504542 509269 513726 518123 522740 527479 531898 535653 538723 541201 543171 545044 547578 551171 555269
60748 555269 558935 561946 564908 568324 572012 575550 578878 582134 585176 587535 588677 588167 585832 582072
60734 582072 577856 574040 570664 567196 563479 560122 557835 556668 556088 555642 555215 554746 554097 553307 552715 552604
60718 552604 552881 553291 553851 554863 556623 559299 562976 567469 572101 576049 579143 582152 586099 591324 597295
60703 597295 603275 609071 615139 621983 629522 637221 644867 652924 661863 671410 680848 689843 698519 706887
60689 706887 714882 722945 731780 741217 750074 757641 764665 772277 780477 788455 795998 803633 811500 818982
60675 818982 825653 831765 837549 842659 846747 850111 853299 856357 858847 860455 861255 861529 861528 861343 860788 859471
60659 859471 857090 853597 849062 843631 837681 831741 826049 820436 814843 809718 805537 802077 798534 794386
60645 794386 789813 785213 780633 775844 770761 765444 759722 753122 745368 736825 728222 719975 711964 704044
60631 704044 696532 689985 684584 679990 675774 671796 668145 664878 661907 659029 656088 653176 650609 648508
60617 648508 646517 644182 641588 639213 637051 634310 630299 625277 620101 615279 610798 606652 602931 599373
60603 599373 595453 591118 586969 583407 579985 575998 571409 566720 562078 557089 551590 546177 541697 538451
60589 538451 536070 534011 531963 529832 527525 524833 521651 518310 515493 513512 511714 508977 504919 500314
60575 500314 496232 493146 491094 490247 490699 491952 493199 494372 496458 500509 506482 513272 519865 526375 533829
60560 533829 542853 552619 561346 567916 572573 575865 577396 576313 572735 567941 563085 558456 554162 550711
60546 550711 548408 546712 544900 543144 542439 543470 545919 548792 551223 553114 555251 558638 563464 568839
60532 568839 573669 577478 580172 581462 581090 579411 577194 574941 572833 571169 570213 569581 568451 566587 564773
60517 564773 564031 564746 566647 569174 571651 573543 574873 576170 577769 579430 580810 581973 583146 584305 585364
60502 585364 586611 588594 591695 596109 602175 610459 621584 636159 654692 677226 703057 731057 760207
60489 760207 789564 817776 842956 863093 876512 882109 879550 869322 852302 829289 801252 769968
60477 769968 737816 706616 676971 649021 623389 600876 581459 564265 548636 534681 522583
60466 522583 511857 501810 492487 484643 478683 474022 469652 465057 460305 455483 450466 445334 440613 436807
60452 436807 433834 431179 428520 425925 423484 421143 419100 417966 418123 419051 419659 419287 418094 416499 414655
60437 414655 412620 410676 409153 408078 407252 406569 406076 405789 405639 405595 405684 405930 406343 406896 407416 407625 407443 407155
60419 407155 407150 407578 408430 409735 411380 412816 413300 412551 411021 409512 408711 408987 410335 412385 414661 416917
60403 416917 419092 420958 422079 422271 421882 421468 421299 421331 421545 422120 423258 424899 426657 428065 428991 429877 431453
60386 431453 434131 437545 440627 442229 441963 440629 439700 440164 441865 443946 445714 446993 447929 448847 450131
60371 450131 451881 453690 455026 455781 456222 456558 456880 457316 457840 458055 457655 457022 456848 457271 457937 458807 460176
60354 460176 461856 463189 464131 465514 467764 470146 471851 473266 475411 478608 482496 487050 492708 499479
60340 499479 506631 513464 519911 526314 532895 539460 545315 549488 551391 551265 549754 547153 543330 538269
60326 538269 532313 525917 519495 513521 508503 504708 501969 499716 497279 494446 491778 490036 489202 488565 487910
60311 487910 487981 489368 491625 494174 497539 502809 510216 519208 529746 542532 557862 575055 593118
60298 593118 611170 628017 642125 652406 658482 660036 656611 648454 636995 624051 610900 598330
60286 598330 586995 577341 569568 564012 561130 560821 562213 564493 567509 571237 575095 578274 580306 580852
60272 580852 579303 575289 569359 562554 555402 547805 539797 531789 524035 516458 509191 502869 498013 494321
60258 494321 490880 487081 483140 479724 477201 475435 474215 473631 473779 474333 474790 475122 475767 476903 478166 479277
60242 479277 480438 481760 482698 482639 481858 481341 481609 482187 482370 482129 482043 482598 483839 485634 488029 491214 495260
60225 495260 500036 505389 511264 517508 523671 529224 534033 538483 543118 548284 553991 559866 565232 569640
60211 569640 573465 577658 582661 587843 592341 596244 600594 606285 613313 621027 628703 635782 641909 647099
60197 647099 651750 656193 660228 663272 665049 665949 666608 667278 667783 668007 668056 667870 667010 665067 662182 658885
60181 658885 655543 652121 648360 643928 638521 632116 625172 618429 612517 607829 604528 602391 600823 599343
60167 599343 597976 596895 595900 594739 593816 593965 595446 597627 599787 601784 603778 605732 607503 609142 610897
60152 610897 613117 616145 619995 624051 627458 629911 631748 633321 634835 636875 640391 645743 652185 658734
60138 658734 665206 672139 680115 689496 700384 712302 724131 734735 743564 750524 755656 759166 761311
60125 761311 761907 760397 756838 752326 747953 743796 739568 735771 733349 732400 732105 731933 732147 733025 734306 735570
60109 735570 736562 736961 736457 735358 734541 734365 733980 732198 728836 724842 721176 717878 714285 709927 705072 700377
60093 700377 696123 692012 687826 684074 681675 681089 682034 684032 686870 690464 694577 698905 703320 707893 712682
60078 712682 717528 721953 725304 727125 727439 726594 724810 721942 717646 711729 704417 696349 688221 680344 672543
60063 672543 664517 656200 647798 639670 632251 625889 620608 616141 612245 608814 605781 603258 601766 601814 603041
60048 603041 604342 605147 606106 608118 611125 614412 617683 621211 625219 629786 635172 641509 648206 654279 659306
60033 659306 663551 667219 670191 672418 673899 674214 672806 669853 666135 661768 655778 647384 637156 626448
60019 626448 616024 605661 594807 583204 571154 559506 549203 540495 532742 525229 517954 511417
60007 511417 505926 501478 498107 495914 494746 494118 493524 492739 491937 491649 492409 494230 496488 498516 500223 502027
59991 502027 504348 507360 511090 515439 520092 524677 529085 533539 538253 543041 547338 550616 552812 554265
59977 554265 555212 555496 554876 553436 551404 548659 544832 539919 534488 529172 524269 519905 516231 513206 510511
59962 510511 507979 505905 504648 504149 504133 504577 505521 506508 506733 505992 505164 505452 507181 509556 511552 512891 514161
59945 514161 516133 519020 522267 524922 526297 526501 526369 526666 527214 526968 525050 521529 517037 511940 506360
59930 506360 500874 496500 493714 491839 489795 487295 484996 483615 483273 483610 484199 484682 484802 484577 484395 484799
59914 484799 486157 488550 491808 495415 498538 500520 501561 502659 504611 507233 509776 511895 513768 515465
59900 515465 516810 518013 519805 522573 525805 528828 531802 535469 540111 545283 550536 555931 561737 567971
59886 567971 574439 581043 587915 595281 603180 611325 619344 627160 634949 642717 650259 657542 664624 670925
59872 670925 675182 676626 675732 673260 669035 662457 653834 644238 634187 623453 612275 601750 592663
59859 592663 584765 577607 571410 566617 563210 560989 560060 560484 561861 563823 566671 570998 576916 584082 592261
59844 592261 601353 610952 620357 628966 636291 641705 644644 645237 644542 643998 644645 646660 649406 651983 653906
59829 653906 655290 656303 656592 655387 652122 646895 640423 633586 626835 619939 612388 604075 595418 586794
59815 586794 578160 569355 560550 552247 544961 539009 534361 530560 526973 523348 520035 517584 516253 515984
59801 515984 516574 517664 518676 518999 518300 516600 514115 511067 507665 504270 501451 499556 498155 496329 493820
59786 493820 491483 490132 489350 488117 486322 484802 484013 483577 483229 483222 483548 483731 483827 484742 486974 489753 492040
59769 492040 493675 494912 495577 495566 495650 496752 498762 500897 502953 505286 507749 509640 510768 511721 512982 514501
59753 514501 516275 518611 521519 524478 527165 529985 533517 537696 541801 545095 547424 549387 551877 555204
59739 555204 558672 561279 562775 563714 564649 565666 566681 567755 569017 570594 572571 574710 576295 576716 576267
59724 576267 576021 576882 579033 582128 585507 588259 589646 589712 589160 588665 588690 589792 592316 595603 598164 599076
59708 599076 598811 598451 598526 598987 599787 600955 602274 603299 603650 603100 601634 599641 597805 596498 595504 594566 593856
59691 593856 593602 593545 593277 592914 592941 593398 593654 593070 591571 589618 587933 587274 588036 589847 591765 592971 593139
59674 593139 592180 590059 587059 583874 581063 578510 575654 572187 568287 564311 560519 557052 553869 550665
59660 550665 547154 543565 540610 538807 538070 538113 538989 540934 543785 546935 549932 552852 556036 559593 563261
59645 563261 566610 569274 571059 571847 571517 570050 567769 565221 562698 560080 557367 555147 554157 554487 555528
59630 555528 556654 557625 558432 559211 560294 561872 563504 564437 564558 564579 565051 565646 565767 565451 565224 565266 565138 564329
59612 564329 562842 561280 560447 560768 562035 563865 566306 569691 573907 578276 582320 586181 590096 593843 596901
59597 596901 598694 598522 595907 591472 586950 583664 581366 579041 576433 574047 572034 569904 567378 564715
59583 564715 562101 559310 556168 552863 549571 546171 542552 538948 535801 533441 531922 531043 530522 530287 530534
59568 530534 531326 532355 533294 534276 535671 537530 539593 541805 544447 547690 551219 554384 556665 558077 559222
59553 559222 560759 562760 564732 566314 567624 568818 569784 570516 571384 572732 574636 577303 581253 586744 593580
59538 593580 601938 612755 626617 642819 660249 678562 697405 714838 727856 734754 736300 734697
59526 734697 732251 730960 732165 735991 741681 748700 756988 766110 775013 782903 789643 794977 798026 797972 794738
59511 794738 788671 780010 768998 756113 741947 727109 712333 698170 684494 670866 657492 645231
59499 645231 634522 624998 616485 609667 605253 602915 601562 600348 599040 597735 596611 595795 595242 594914 595167
59484 595167 596620 599557 603783 609116 615604 623121 631273 639922 649397 660011 671771 684634 698483
59471 698483 712620 725791 737077 746396 753951 759622 763170 764680 764581 763616 762899 763582 766307 771329 779102
59456 779102 790103 804046 820054 837819 857853 880307 904366 929164 954526 980312 1005786
59445 1005786 1030165 1053017 1073335 1088781 1096675 1095514 1085166 1066243 1040121 1009174 976164 943303
59433 943303 912159 883929 859206 837757 819019 802624 788235 775474 764526 756249 751195 749126
59421 749126 750091 755190 765385 780100 797951 818412 841752 867700 895204 923255 950975 977179
59409 977179 1000950 1022370 1041269 1055106 1059553 1051939 1033554 1008419 980786 954065 930771 912192
59397 912192 898359 888811 882958 879088 873704 862967 845173 821560 794847 767393 740588 715285
59385 715285 692223 671967 654615 639817 627217 616815 608748 602754 598099 594112 590660 588003 586251
59372 586251 585053 583916 582835 582501 583560 585684 587740 589028 590005 591568 594064 597428 601953 608292 616702
59357 616702 626706 637519 648597 659938 672208 686467 703352 722579 743522 766115 790757
59346 790757 817427 845410 873915 902557 931130 959268 986413 1011820 1034525 1053561 1068285
59335 1068285 1078353 1083484 1083530 1078681 1069259 1055302 1036668 1013602 987031 958315 928839 899731
59323 899731 871658 844874 819569 796021 774295 754083 735146 717708 702077 688125 675520
59312 675520 664300 654780 646994 640647 635542 631676 628973 627313 626785 627609 629909 633900 640088 648861
59298 648861 659968 672771 686833 701717 716258 728613 737157 741080 740241 734986 726258 715520 704325
59285 704325 693953 685207 678246 672851 669140 667781 669126 672504 677048 683006 691532 703157 717186
59272 717186 732679 749424 767720 787639 808713 830103 851010 871053 890031 907105 920725
59261 920725 929905 935098 937033 935112 928080 916182 901506 885935 869719 852351 833954 815314
59249 815314 797336 780879 766522 754060 742844 732918 725199 720232 717539 716630 717839 721549 727284
59236 727284 734261 742362 751829 762442 773649 785096 796317 806192 813437 817532 818646 816885 812199
59223 812199 804789 794969 782751 768144 751789 734670 717256 699521 681808 665061 650035 636767
59211 636767 625052 614962 606624 599777 593869 588526 583722 579531 575809 572230 568668 565571 563727 563552
59197 563552 564694 566475 568465 570477 572233 573474 574336 575304 576682 578331 579942 581360 582588 583703 584932
59182 584932 586751 589736 594249 600206 607090 614242 621207 627909 634624 641871 650307 660515 672716 686616
59168 686616 701599 717157 733263 750254 768262 786713 804589 821137 836040 848802 858381 863881
59156 863881 865447 864127 860843 855729 848324 838162 825300 810561 795121 779616 763844 747636
59144 747636 731644 716783 703213 690537 678792 668446 659463 651180 643203 635656 628428 621060 613738
59131 613738 607594 603512 601233 600093 599935 600711 601797 602505 602964 603903 605853 609145 614297 621612 630506
59116 630506 639974 649691 660064 671235 682717 694141 705690 717502 729107 739875 749716 759003
59104 759003 767947 776373 784022 790768 796489 800998 804303 806813 809011 810875 811839 811468 810036 808257 806616
59089 806616 805140 803676 802092 800257 798137 795828 793259 789939 785314 779298 772101 763673 753817 742803
59075 742803 731344 719858 708248 696552 685304 675045 665875 657725 650648 644602 639237 634100 628889
59062 628889 623476 618053 613215 609421 606367 603413 600593 598461 596879 594922 592371 590350 589769 589829 588908
59047 588908 586478 583385 580639 578699 577690 577404 577141 576260 574978 574093 573951 574161 574318 574473 574851 575630 577135
59030 577135 579823 583893 589046 594745 600604 606671 613489 621759 631737 643063 655216 667830 680413
59017 680413 692272 703139 713508 723851 733684 741910 747922 751962 754580 756207 757156 757559 757371 756844
59003 756844 756941 758832 762997 769123 776772 785808 796200 807840 820619 834460 849229 864659 880198
58990 880198 894860 907670 918506 928022 936355 942366 944717 943294 938880 931851 922098 910158 897475
58977 897475 885345 874273 864514 856555 850760 847085 845468 846141 849326 855013 863217 874086 887513
58964 887513 902943 919779 937706 956419 975293 993535 1010522 1025873 1039282 1050281 1057994 1061196
58952 1061196 1058932 1051181 1038772 1022729 1003839 982698 959788 935599 910982 887285 865706 846520
58940 846520 829311 813912 800654 789712 780701 773033 766275 760052 754083 748491 743678 739662 735830
58927 735830 731512 726519 721025 715328 709904 705335 701913 699519 697951 697030 696307 695153 693513 692258 692409
58912 692409 694202 697164 700902 705475 711134 717948 725652 733746 741950 750743 761216 774099 789103
58899 789103 805416 822599 840706 859803 879923 901435 924837 949930 975689 1001434 1028033
58888 1028033 1057610 1091936 1131170 1173988 1218621 1263676 1308171 1351057 1390880 1425955 1454870
58877 1454870 1476701 1490785 1496495 1493446 1481770 1461932 1434372 1399684 1359187 1314893 1268715 1222078
58865 1222078 1176501 1133973 1096078 1062869 1033158 1005930 981047 958674 938557 920038 902350
58854 902350 884830 867271 850210 834459 820181 806805 793923 781834 771009 761486 753056 745659
58842 745659 739207 733315 727544 721769 716116 710688 705468 700284 694783 688718 682305 675952 669651 663133
58828 663133 656715 651376 647730 645448 643962 643190 643247 644020 645504 648091 652051 657090 662792 669039 675638
58813 675638 682039 687967 693841 699985 705798 710345 713397 715363 716550 717108 717365 717495 717031 715364 712582
58798 712582 709341 706076 702839 699626 696251 692169 687055 681455 676288 671912 668195 665279 663651 663561 664949
58783 664949 667801 672035 677234 683015 689474 696714 704218 711298 717866 724083 729465 733095 734610 734285
58769 734285 732346 728938 724641 720218 715828 711145 706223 701576 697500 693974 691140 689188 687905 687060
58755 687060 687048 688433 691005 694136 697859 702641 708265 714017 719892 726419 733237 739199 744233 749847 757168
58740 757168 765546 773742 781501 789142 796453 802959 808815 814606 820497 826245 831843 837637 843939 850828
58726 850828 858144 865495 872597 879744 887499 895750 903573 910305 916266 922188 928397 934933 942003 949916
58712 949916 958796 968530 978607 987907 995217 1000290 1003935 1006754 1008188 1007076 1002707 994982 983981 969847
58698 969847 952885 933489 912121 889498 866499 843778 821710 800747 781412 763876 748008
58687 748008 733909 721853 711585 702301 693524 685431 678006 670529 662420 654123 646640 640418 635154
58674 635154 630503 626603 623940 622938 623717 626199 630457 636752 645029 654666 665242 677354 692024 709209
58660 709209 727399 744617 759305 770357 777223 780331 780860 779737 777193 773346 768688 763793 758961
58647 758961 754199 749170 743277 736408 729578 724169 720520 717943 716034 715085 715109 715529 716257 718254 722497
58632 722497 728906 736628 744747 752380 758685 763286 766355 768095 768636 768505 768582 769349 770761 772987 776649
58617 776649 782188 789643 799248 811536 826603 843860 862613 882185 901414 918825 933495 944980
58605 944980 952472 955072 953150 948387 942145 934681 926099 916871 907043 896160 884600 873830 864623
58592 864623 856054 847025 837917 830039 824312 821241 821285 824446 830138 838051 848359 860604 873394 885982
58578 885982 899134 913555 928407 942281 954747 965965 975657 983676 991003 999052 1008366 1018835
58566 1018835 1030559 1043591 1057464 1072066 1088532 1108212 1131054 1155823 1181459 1207275 1232184
58555 1232184 1254724 1273803 1288796 1299289 1305306 1307474 1306355 1302078 1295060 1286432 1277150 1267340 1257086
58542 1257086 1246951 1236895 1225534 1211600 1195522 1178551 1160961 1142184 1122208 1101720 1081247
58531 1081247 1061228 1042638 1026569 1013375 1002948 995411 990788 988497 988031 989623 993402 998469 1003740
58518 1003740 1009144 1015030 1020984 1026304 1031128 1035963 1040518 1044138 1047066 1050139 1053509 1056634 1059282 1061536
58504 1061536 1063058 1063375 1062740 1061931 1061397 1061211 1061301 1060931 1058620 1053557 1046561 1038767 1030168 1020544 1010887 1002426
58488 1002426 994899 987429 980653 976224 974394 973783 973570 974371 976812 980823 986674 995267 1006733 1019706
58474 1019706 1032489 1044233 1054725 1063684 1070537 1074435 1074598 1071152 1065304 1058050 1049132 1038156 1026224
58461 1026224 1015341 1006425 999038 992869 988332 985815 985416 987502 992494 999986 1008887 1018391 1028075 1037090
58447 1037090 1044123 1048210 1049135 1047225 1043240 1037938 1031145 1021940 1010501 999080 990218 984632 981665 980877
58433 980877 981981 984106 986647 990312 996008 1003244 1011018 1019643 1030176 1042519 1055681 1069486 1084408
58420 1084408 1099996 1115044 1129051 1142000 1152953 1160471 1164361 1165652 1165033 1162653 1159043 1154735 1149253
58407 1149253 1141987 1133645 1125291 1116407 1105710 1093555 1081654 1070673 1059996 1049806 1041425 1035454
58395 1035454 1031273 1028494 1027217 1026832 1026218 1025182 1024217 1023035 1020968 1018537 1016724 1014932 1011751 1007659 1004858
58380 1004858 1004280 1004796 1005524 1006799 1008617 1010239 1011860 1014808 1019635 1025616 1032322 1039899 1047734 1054832 1061791
58365 1061791 1070498 1081582 1094035 1107422 1122398 1138849 1155679 1172783 1191097 1210280 1228403
58354 1228403 1244329 1258298 1269892 1277718 1281679 1283389 1283765 1282326 1279372 1276620 1275050 1274197 1274218 1276524
58340 1276524 1281710 1288876 1297558 1308305 1320891 1334162 1348135 1364053 1381899 1400100 1418110 1436898
58328 1436898 1456407 1475059 1492258 1508750 1524006 1536048 1544639 1551866 1558761 1564196 1567970 1571872
58316 1571872 1576588 1580611 1583587 1587757 1594588 1602845 1611567 1622114 1635475 1650268 1665264 1681478 1699934
58303 1699934 1719643 1739499 1759986 1781490 1803098 1824417 1846292 1868524 1889391 1908597 1928063
58292 1928063 1948606 1968745 1988091 2008805 2032147 2056715 2081810 2109346 2140492 2173504 2206874
58281 2206874 2241562 2278016 2314052 2347938 2380794 2413848 2446173 2477107 2507923 2539210 2569779
58270 2569779 2600139 2633629 2671967 2713087 2755488 2800976 2850744 2902705 2955563 3011757 3073403
58259 3073403 3138924 3206639 3277875 3353401 3430551 3507212 3584938 3664903 3744785 3823266 3903623
58248 3903623 3988938 4077566 4167318 4260376 4359994 4466011 4577716 4697412 4826986 4964629
58238 4964629 5109003 5262779 5428083 5602728 5785279 5979388 6188542 6411133 6645529
58229 6645529 6895244 7163922 7450134 7752649 8076075 8425672 8801573 9203888 9638231
58220 9638231 10110151 10619686 11168000 11763760 12416281 13128577 13904605 14757047 15700282
58211 15700282 16742667 17894568 19177503 20616967 22234443 24057097 26128507 28500925
58203 28500925 31227738 34377774 38050657 42368528 47466072 53505763 60694124 69270129
58195 69270129 79495615 91681142 106206721 123483394 143883898 167690403 195015992
58188 195015992 225640663 258831563 293262236 326996716 357453591 381513106 396098855
58181 396098855 399204788 390746861 372573471 347626515 318880643 288671087 258552305
58174 258552305 229482627 202087823 176838278 154075534 133952162 116414907 101275760
58167 101275760 88295215 77214359 67765301 59699559 52810603 46922727 41873981 37523833
58159 37523833 33764296 30508001 27672809 25187742 23002705 21078698 19374543 17852440
58151 17852440 16488128 15264430 14160513 13156564 12242719 11413722 10659493 9968978 9338084
58142 9338084 8765429 8244412 7766907 7330529 6935019 6575154 6243799 5938050 5656019
58133 5656019 5391565 5138899 4899065 4675676 4467419 4270544 4085287 3913618 3753459
58124 3753459 3601092 3456829 3322836 3197655 3078089 2964232 2857716 2757237 2660602 2568942
58114 2568942 2484158 2404421 2326793 2252100 2182598 2116963 2052250 1988864 1929018 1872068 1815765
58103 1815765 1760394 1707326 1655131 1601514 1547600 1496121 1446781 1397621 1349586 1305561 1265972
58092 1265972 1229395 1196435 1168991 1146453 1126373 1108229 1093069 1080257 1067985 1056204 1045806
58081 1045806 1035737 1024079 1011030 997731 983246 966072 947615 930752 915663 900331 884389
58070 884389 869194 854816 840306 826393 814707 804737 794598 784351 775556 768057 760286 752319
58058 752319 745544 739507 732174 723216 714199 705546 696104 685745 675730 666409 657041 647936 640402 634483
58044 634483 628951 623494 618837 614887 610873 606987 603765 600262 595105 588984 583750 579379 574181 567704
58030 567704 561022 554344 546789 538474 530428 522461 513419 503536 494324 486082 477816 469631 462963 458185
58016 458185 454089 449928 446008 442257 438220 434519 432195 430502 427465 422812 418341 415242 413064 411485
58002 411485 410954 411234 411294 411073 411551 412805 413879 414807 416775 419902 422786 424829 427182 430818 435355 440331
57986 440331 446001 452210 457944 462681 466891 470822 474075 476681 479249 481619 482679 481931 480044 477653
57972 477653 474738 471397 467949 464120 459361 454135 449663 446303 443370 440500 437941 435556 432935 430448
57958 430448 428806 427635 425954 423911 422468 421409 419453 416441 413654 411754 410119 408516 407695 407884 408297
57943 408297 408609 409461 411085 412910 414913 417926 422217 427215 432992 440434 449506 458861 467678 476427 485348
57928 485348 493645 500723 506777 511602 514286 514700 513863 512174 508726 503043 496078 488680 480445 470979 461055
57913 461055 451518 442110 432364 422808 414409 407477 401769 396962 392549 388021 383535 379549 375510 369951
57899 369951 362374 354039 346355 339467 332872 326489 320539 315222 310963 308171 306444 304887 303465 303048
57885 303048 303862 304992 305794 306687 308128 309874 311711 313940 316704 319705 322833 326076 328671 329515 328666
57870 328666 327236 325662 323503 321125 319826 319770 319442 317991 316548 316390 317255 318509 320505 323611 327141
57855 327141 330473 334204 339013 344335 349311 354126 359258 364218 368249 371577 374897 378173 380960 383344
57841 383344 385619 387504 388498 388565 387860 386356 384253 382032 379553 376049 371636 367737 365145 362717 359078
57826 359078 354695 351084 348733 347055 345833 345507 346401 348640 352397 357259 361814 364886 366798 368593 370518
57811 370518 372173 373532 374609 374535 372187 367633 361935 355623 348361 340057 331405 323183 315704 308994 302962
57796 302962 297371 292055 287089 282446 277782 273008 268685 265377 262900 260623 258133 255263 251989 248850
57782 248850 246945 246844 247901 249155 250415 251909 253521 255235 257836 262170 267862 273593 278563 282998
57768 282998 287351 291677 295793 299431 302140 303447 303283 302048 300280 298269 295824 292391 287787 282798
57754 282798 278513 275024 271457 267451 263835 261524 260499 260270 260598 261290 261984 262594 263320 263895 263615 262517
57738 262517 261556 261062 260073 257977 255812 254966 255380 256058 256579 257010 256986 256146 255189 255317 256773 258818 260967
57721 260967 263374 266129 268888 271135 272366 272327 271473 270674 270044 268769 266621 264678 263687 262681 260353 257038
57705 257038 254019 251546 248990 246522 245045 244541 243932 242707 241495 240866 240653 240611 240755 240855 240499 239866 239602
57688 239602 239743 239514 238326 236335 234027 232021 231263 232576 235854 240339 245797 252801 261945 273532 288123
57673 288123 306660 329948 358544 393165 434533 482645 536585 594748 654445 711183 759054
57662 759054 792286 806615 800161 774169 733013 682531 627878 572893 520717 473746 432922 397931
57650 397931 368361 344137 324870 309504 296770 285606 275300 265802 257721 251443 246436 241993
57638 241993 238275 235859 234586 233796 233431 233868 234822 235499 235878 236743 238287 239670 240188 239988 239438 238611 237550
57621 237550 236230 234144 230862 227150 224589 223746 223615 223136 222328 221497 220323 218381 215908 213424 211075
57606 211075 208833 206866 205272 203845 202491 201529 201223 201357 201494 201336 200606 198922 196049 192156 187827 183989
57590 183989 181456 179998 178191 174889 170715 167235 164827 162364 159013 155269 151908 148945 146103 143445
57576 143445 140999 138450 135696 133172 131219 129708 128567 128043 128073 128085 127806 127683 128084 128706 129161 129496 129703
57559 129703 129317 128073 126509 125420 125072 125270 125728 126056 125958 125840 126677 128851 131616 134074 136076 137708
57543 137708 138597 138396 137487 136560 135882 135526 135880 137259 139349 141641 144085 146692 148813 149565 148830 147241
57527 147241 145292 143104 140999 139636 139403 140077 141184 142378 143454 144328 145071 145781 146366 146704 147042 148037
57511 148037 150232 153452 156746 159006 159832 159750 159534 159421 159192 158763 158292 157788 157061 156033 154679 152698 149796
57494 149796 146349 143185 140588 138023 134976 131517 127929 124401 121324 119222 118058 117162 116175 115428 115070
57479 115070 114532 113423 112354 112158 112707 113108 112777 111761 110333 108915 108107 108144 108401 108033 107027 106161 105972
57462 105972 106222 106381 106249 106031 106023 106242 106312 105857 105031 104342 103841 102976 101530 100157 99554 99492 99252 98697 98321
57443 98321 98445 98992 99920 101280 102768 103774 103991 103671 103148 102500 101776 101230 101131 101385 101509 101044 100067 99266
57425 99266 99320 100153 101025 101393 101406 101506 101863 102401 103017 103543 103804 103950 104373 105026 105197 104302 102650 101065 100049
57406 100049 99655 99846 100448 100950 100793 99866 98393 96568 94680 93328 92942 93176 93317 93306 93825 95256 97070
57389 97070 98494 99423 100339 101572 103029 104656 106832 110021 114059 117989 120749 121956 122010 121619 121473 122096
57373 122096 123542 125126 125853 125284 123768 121862 119879 118056 116721 115995 115648 115443 115358 115379 115359 115221 114992
57356 114992 114530 113663 112794 112875 114385 116666 118644 119962 121093 122540 124267 125801 126651 126742 126596 126903 127839
57339 127839 129010 130056 130923 131405 131031 129693 128038 126844 126308 126193 126323 126625 126984 127338 127677 127810 127530
57322 127530 127169 127447 128499 129572 130120 130627 131778 133260 133993 133382 131816 130131 129046 128980 129945 131542
57306 131542 133207 134409 134697 134042 133195 133143 133965 134776 135025 135178 135808 136797 137863 139139 140621 141819 142579
57289 142579 143511 144859 145784 145703 145531 146440 148023 148980 149146 149443 150089 150284 149653 148711 147807 146864 146281 146819
57271 146819 148260 149362 149542 149545 150062 150757 151098 151132 150888 150030 148787 148285 149210 150909 152593 154603 157525
57254 157525 160698 162795 163659 164532 166450 169218 172047 174547 176856 179273 181946 184631 186705 187691 187842
57239 187842 187988 188826 190518 192895 195740 198831 201910 204781 207416 209977 212805 216363 221057 226971 233642
57224 233642 240134 245614 250032 254169 258866 264356 270469 277153 284469 292218 300026 307776 315660 323882
57210 323882 332658 342302 352949 364279 375864 387635 399553 411154 422101 433065 445110 458096
57198 458096 470574 481643 492123 503358 515541 527888 540044 552534 565973 580400 595370
57187 595370 610310 624816 639049 653824 669999 687651 706035 724392 742673 761494 781497
57176 781497 802774 824789 846768 868125 888627 908402 927882 947438 966790 985022 1001549
57165 1001549 1016868 1031987 1047319 1062710 1078408 1095254 1113886 1134462 1157377 1183551 1213632
57154 1213632 1247507 1284961 1326254 1371583 1420467 1472172 1526273 1582237 1638900 1695188 1751183
57143 1751183 1807741 1864980 1921754 1976784 2029912 2082139 2134813 2188875 2244553 2301536 2359501
57132 2359501 2418420 2478243 2538488 2598533 2658347 2718659 2780388 2844131 2910075 2978021 3047499
57121 3047499 3118274 3190732 3265184 3340603 3414609 3485241 3552677 3619131 3687605 3761092 3842369
57110 3842369 3933561 4035797 4149932 4277879 4423019 4589528 4782052 5006173 5268734 5577719
57100 5577719 5942689 6375721 6891316 7504978 8232233 9088736 10089707 11247985 12573006
57091 12573006 14072029 15751019 17612982 19655828 21872257 24249899 26769338 29401248
57083 29401248 32101854 34799798 37374592 39648113 41415922 42513427 42873134 42531861
57075 42531861 41591368 40170721 38380245 36316960 34067594 31711030 29318374 26949742
57067 26949742 24649898 22448171 20364040 18412866 16607082 14954772 13459179 12118735
57059 12118735 10926440 9870399 8936779 8112548 7385423 6742896 6173082 5666298 5214901
57050 5214901 4811986 4451123 4126813 3834216 3568610 3325909 3103376 2899119 2711124
57041 2711124 2537458 2377026 2229328 2093602 1968824 1854338 1749799 1654600 1567980 1489667
57031 1489667 1419939 1359153 1307601 1265799 1234499 1214351 1205526 1207336 1217875 1233984 1251308 1264104
57019 1264104 1265567 1250113 1216474 1168270 1111071 1049285 985785 923085 863428 807987 756962
57008 756962 710374 668082 629325 593092 559014 527376 498284 471249 445445 420017 394388
56997 394388 368692 343708 320032 297625 276448 257047 240055 225661 214110 206129 202148 201568
56985 201568 203595 208404 216596 227801 240680 253987 266605 276773 282580 283583 281137 276843 271362
56972 271362 264942 258268 252214 247203 243277 240572 239446 240249 243087 247701 253622 260660 269214 279891
56958 279891 292879 307767 323674 339278 352986 363484 369950 371663 367947 359008 346372 331922
56946 331922 316842 301955 288478 277498 269009 262409 257815 255952 256898 259969 265037 272973 284504
56933 284504 299406 317124 337332 359356 381490 401325 416460 424924 425591 418616 405138 386450
56921 386450 363851 339223 314798 291914 270585 250712 233060 218477 206625 196285 186756 178371
56909 178371 171686 166727 163198 160953 159945 159785 159732 159297 158791 158980 160132 161682 163044 164476 166826 170665
56893 170665 176029 182816 191020 200689 212068 225625 241452 258743 276362 293775 310785 326398
56881 326398 338716 346205 348518 345973 339078 329011 317935 308011 300212 294501 290894 289848 291695
56868 291695 296318 303661 314303 329256 349231 374258 404049 438403 476936 518365 560369 600201
56856 600201 635094 662018 677774 680212 669572 648486 620705 589829 558716 529433 503576 482729
56844 482729 468372 461227 461115 467871 482032 504260 534537 572479 617990 670893 730179 794218
56832 794218 861140 927817 988513 1035702 1062904 1066784 1047381 1007763 953636 891924 828572 767547
56820 767547 711515 662398 621068 587483 561697 544219 535195 534154 540998 556443 580827 613060
56808 613060 651281 693942 739506 785313 827259 860401 879856 882022 866037 834197 790726 740144
56796 740144 686630 633902 584715 540511 501947 469611 443914 424645 411181 403117 400399 402986
56784 402986 410647 422985 439415 459188 481393 504573 526203 542912 551624 550581 539573 519728
56772 519728 493148 462209 428883 394921 362339 332871 306748 282900 260770 241176 224953
56761 224953 211523 199574 188619 179103 171361 165239 160486 156817 153649 150425 147149 144225 141871
56748 141871 140044 138693 137524 135782 132943 129648 127323 126642 126698 125976 123957 121572 120104 119800 119753 119209
56732 119209 118599 118850 119921 120765 120794 120599 120882 121450 121776 121943 122368 123054 123777 124709 126141 127779 128933 129289
56714 129289 129016 128287 127298 126617 126847 127870 128957 129691 130381 131409 132582 133296 133154 132282 131196 130382 129939
56697 129939 129650 129430 129500 130005 130749 131509 132373 133429 134324 134484 133736 132523 131523 131166 131388 131699 131642 131295
56679 131295 131149 131469 132041 132660 133425 134302 134768 134265 132858 131209 130068 129893 130662 131785 132431 132227 131557
56662 131557 131089 131245 132144 133662 135371 136731 137556 138055 138450 138899 139780 141545 144191 147296 150513 153426
56646 153426 155121 154907 153606 153057 153986 155352 156207 156994 158227 159090 158531 156996 155865 155659 155901 156273 156728
56629 156728 156763 155806 154348 153689 154447 156065 157771 159325 160812 162318 163775 164754 164713 163918 163643 164688 166194
56612 166194 166782 166463 166411 167196 168356 169547 170893 172155 172583 171885 170506 168889 167264 166210 166406 167581
56596 167581 168512 168396 167583 166797 166334 166250 166640 167468 168562 169861 171247 172276 172612 172564 172532 172228 171346 170688
56578 170688 171391 173012 173702 172627 171074 170639 171353 172225 172753 173157 173693 174464 175585 177114 179075 181735
56562 181735 185400 189863 194589 199541 205195 211635 218366 225138 232034 238493 243213 245565 246379 246830 247223
56547 247223 247322 247118 246649 245685 244178 242609 241380 240303 239061 237652 236051 234041 231767 229758 227979
56532 227979 225637 222513 219712 218269 217627 216416 214284 212068 210414 209131 207836 206462 205036 203523
56518 203523 202002 200629 199444 198416 197531 196676 195739 195014 195016 195506 195213 193136 189824 186819 185108 184617 184931
56501 184931 185752 186718 187357 187436 187080 186606 186412 186805 187618 188184 188051 187487 186982 186538 185933 185391 185389 185831 186012 185503
56481 185503 184675 184229 184522 185432 186582 187570 188220 188737 189508 190658 191869 192687 193031 193347 194181 195521 196645
56464 196645 196813 196047 195026 194350 194175 194487 195266 196298 197195 197774 198196 198735 199642 201202 203437 205696 207002
56447 207002 206996 206231 205443 204898 204510 204147 203680 203098 202700 202833 203308 203474 202945 201928 200845 200035 199806 200231 200905
56428 200905 201480 202420 204513 207509 210021 211081 211087 210952 211027 211229 211489 211573 211050 209960 209063 208976 209504 210155 210804
56409 210804 211509 212193 212948 214073 215446 216366 216477 216297 216445 216900 217433 218155 219097 219836 220078 220152 220408 220645
56391 220645 220678 220884 221662 222806 223976 225253 226715 228007 228914 229818 230965 231918 232388 233067 234774 237271
56375 237271 239699 241706 243307 244052 243398 241805 240595 240739 242336 244995 247996 250310 251304 251469 251845 252775
56359 252775 253762 254405 254835 255290 255818 256476 257380 258569 260016 261647 263165 264139 264463 264362 263836 262724 261570
56342 261570 261596 263263 265569 267397 268893 270864 273533 276697 280414 284574 288382 291238 293690 296509 299327
56327 299327 301193 302097 302847 303782 304700 305790 307398 308973 309447 308704 307718 307186 306987 307021 307638 308995 310756
56310 310756 312575 314259 315547 316413 317521 319610 322497 325298 327545 329383 330914 332193 333734 336143
56296 336143 339246 342370 345352 348489 351643 354318 356610 359189 362366 365898 369615 373422 376868 379609
56282 379609 382223 385608 389700 393758 397830 402824 409110 416053 423066 430131 437196 444153 451633 460775
56268 460775 471864 484033 496548 509551 523353 537916 553333 570039 588274 608119 630245
56257 630245 655729 684822 716662 750547 786803 826271 869765 918289 972904 1033929 1100905
56246 1100905 1173664 1252817 1338857 1431359 1529325 1631754 1737532 1845192 1952959 2058671
56236 2058671 2159633 2253033 2336577 2408330 2466149 2507893 2532108 2538062 2525483 2495034 2448772
56225 2448772 2389244 2318276 2237318 2148633 2055055 1958733 1861086 1763777 1668655 1576776 1488520
56214 1488520 1404609 1325994 1252850 1184780 1121932 1064770 1012882 965247 921620 882392 847145
56203 847145 814778 785131 759013 736367 715830 696491 678735 662978 648874 636217 625396
56192 625396 616419 608603 601606 595674 590569 585484 580391 576200 573162 570298 566906 563423 560365 557626
56178 557626 555377 554419 554983 556127 556851 556954 556629 556272 556870 559267 562822 566071 568884 572455 576933 580831
56162 580831 583351 585606 588814 592955 597972 604559 612691 620878 628094 635184 643305 652280 661609 671921
56148 671921 684153 698208 713530 730272 749070 770449 795084 823801 856844 894178 936885
56137 936885 986971 1045309 1111179 1184268 1265376 1354243 1448213 1543943 1638848 1730089 1814088
56126 1814088 1888667 1954476 2013212 2065614 2112105 2153636 2190385 2220806 2243175 2256997 2262036
56115 2262036 2257624 2244221 2224173 2199401 2169461 2132893 2088973 2036964 1975426 1904054 1825038
56104 1825038 1741286 1654736 1567734 1484317 1408181 1340426 1280767 1229536 1186809 1151002 1120303
56093 1120303 1094543 1074137 1058308 1045960 1037071 1031592 1028171 1025589 1024286 1024907 1026679 1028866 1032372
56080 1032372 1038086 1044974 1051667 1058638 1066913 1075917 1084574 1093242 1102609 1111967 1120623 1129791 1141000 1153823
56066 1153823 1167182 1181626 1198168 1216086 1234035 1252251 1271528 1291286 1310715 1330508 1351219
56055 1351219 1371288 1389090 1405645 1422789 1439981 1455498 1469635 1484104 1499363 1515191 1532809
56044 1532809 1553710 1577291 1602141 1628598 1657468 1687441 1716643 1745676 1776279 1807997 1839125
56033 1839125 1869947 1902049 1935228 1967982 2000348 2033487 2067240 2100823 2135114 2171620 2210184
56022 2210184 2250204 2292818 2339208 2388219 2438471 2491188 2547913 2607319 2667646 2730419 2798086
56011 2798086 2869834 2943594 3020370 3102349 3188448 3276180 3366421 3461936 3562749 3667616 3778471
56000 3778471 3898399 4026527 4159894 4299143 4447304 4604393 4768624 4941713 5127298
55991 5127298 5325123 5532374 5749915 5981687 6229176 6492191 6773851 7078755 7407552
55982 7407552 7759513 8138913 8552337 9001488 9485732 10010001 10582774 11208278 11889006
55973 11889006 12634193 13457316 14367392 15372195 16488485 17739715 19146581 20731362
55965 20731362 22530229 24590942 26963032 29705839 32906373 36677804 41146152 46457112
55957 46457112 52794874 60378216 69445803 80271989 93194797 108594544 126827064
55950 126827064 148171187 172777531 200538729 230895573 262701259 294180761 322912443
55943 322912443 345912326 360116365 363333204 355157135 337137809 312073302 283002106
55936 283002106 252526375 222595260 194516595 169031799 146444963 126778930 109883525
55929 109883525 95489787 83267351 72891757 64076017 56564173 50131427 44598925
55922 44598925 39830419 35709532 32131461 29012923 26290926 23907226 21805380 19942827
55914 19942827 18291937 16826617 15518341 14345668 13295794 12354463 11503910 10731831
55906 10731831 10032697 9398645 8817845 8283083 7793267 7344983 6930612 6546155 6192915
55897 6192915 5869710 5570724 5292654 5036802 4802314 4584069 4379155 4189181 4014350
55888 4014350 3851107 3697438 3554898 3423723 3301223 3186469 3081365 2985559 2895305 2808690
55878 2808690 2727035 2649804 2573259 2495692 2419152 2344468 2269415 2193516 2119872 2050248 1982705
55867 1982705 1916068 1852470 1793309 1736688 1681075 1627882 1578201 1530279 1482360 1435111 1389368
55856 1389368 1344381 1299904 1257284 1217071 1178311 1141446 1108824 1080966 1055298 1030071 1006537
55845 1006537 985748 966193 946419 927272 909757 893080 876493 860801 846524 832711 818883
55834 818883 805985 794221 782230 769605 757841 747684 737983 728363 720354 714406 708343 700495 691977
55821 691977 684126 675894 665769 654331 642975 631768 620388 609672 600521 592531 585077 578531 573216
55808 573216 568525 564190 561026 559421 558552 558029 558701 560934 563811 566999 571626 578132 585042 590962 596052
55793 596052 600410 602989 603472 603320 603400 602283 598542 593086 587490 581540 574318 566403 559073 552120 544144
55778 544144 534309 522507 508750 493773 479385 466900 455932 445833 437338 431578 428377 426723
55766 426723 426057 425884 425002 422442 418530 414013 408848 402848 396704 391292 386622 382319 378353 374423 369602
55751 369602 363545 357176 351284 345407 339090 333110 328247 323787 318631 313135 308508 304929 301561 298006
55737 298006 294626 291683 289135 287076 285609 284548 283762 283384 283217 282594 281295 279862 278457 276303 272874
55722 272874 268838 265104 261719 258399 255271 252429 249575 246836 245054 244555 244565 244626 245594 248360 252423 256657
55706 256657 260612 264197 266945 268626 269761 270581 270213 267915 264341 260614 256868 252715 248439 244623 241160
55691 241160 237650 234331 231719 229818 228455 227778 227720 227687 227584 228379 230745 233936 236936 239957 243732 248025
55675 248025 251962 255208 257725 258980 258572 257234 256090 255231 253940 251945 249575 247090 244738 243091 242473
55660 242473 242450 242570 243023 243900 244587 244810 245495 247555 250463 253067 255189 257263 259055 260010 260377 260730 260764
55643 260764 259740 257790 255592 253077 249638 245362 240900 236333 231293 225975 220939 216067 210813 205307
55629 205307 200181 195527 191119 187463 185426 184848 184573 183858 182868 181935 181399 182031 184370 187549 189847 190544
55613 190544 190298 189663 188317 185981 183061 180038 176959 173864 171006 168388 165740 163165 161251 160315 160041
55598 160041 159953 159790 159369 158605 157695 156831 155788 154328 152858 152150 152432 153276 154249 155132 155674 155782 155907 156578
55580 156578 157572 158087 157809 157357 157666 159346 162460 166452 170359 173568 176341 179365 183010 187320 192256
55565 192256 197412 201873 204927 206674 207464 207127 205332 202319 198646 194520 189953 185229 180575 175738 170553
55550 170553 165613 161690 158789 156395 154282 152465 150772 149208 148339 148523 149069 148912 147868 146594 145720
55535 145720 145682 146861 148988 150881 151698 152033 152849 153781 153623 152181 150522 149545 149269 149346 149242 148124 145615
55518 145615 142639 140637 140089 140512 141454 142470 142620 141269 139199 137662 136549 134760 132194 129946 128517
55503 128517 127300 126021 125272 125323 125652 126011 126738 127642 127758 126710 125293 124290 123691 123421 123743 124506 124988
55486 124988 125012 125264 126060 126725 126707 126412 126388 126554 126752 127258 128151 128941 129362 129842 130604 131046 130592 129561 128547
55467 128547 127564 126394 125265 124510 123955 123206 122270 121442 120856 120520 120490 120686 120862 121016 121516 122503 123460 123679
55449 123679 123066 122300 122277 123334 124856 125795 125739 125189 124591 123680 122359 121560 122315 124281 126195 127545 128753
55432 128753 129894 130411 130183 129790 129530 129143 128683 128662 129125 129474 129450 129466 129806 130338 131092 132182 133105 133162 132696
55413 132696 132824 133783 134704 135240 136109 137646 139049 139576 139290 138112 135451 131502 127752 125318 123745 122242
55397 122242 121089 120887 121314 121597 121570 121431 121089 120547 120313 120684 121208 121472 121751 122211 122269 121459 120270 119363 118629
55378 118629 117815 117391 117890 118947 119785 120217 120511 120806 121298 122374 123796 124427 123551 121934 120772 120226 119811
55361 119811 119584 119913 120531 120804 120613 120155 119277 117890 116657 116331 116709 117113 117599 118772 120598 122302 123335
55344 123335 123669 123279 122123 120608 119374 118603 118101 117937 118469 119735 121255 122317 122245 120780 118580 116924
55328 116924 116471 116683 116804 116816 117009 117334 117849 119038 120869 122152 121829 120418 119269 118821 118560 118264 118142
55311 118142 118044 117592 117055 117100 117730 118306 118548 118676 118696 118433 118243 118781 119990 121117 121750 122143 122518 122732 122672
55292 122672 122377 121766 120812 119860 119228 118745 118312 118554 120073 122300 123980 124666 124884 125001 124881 124586 124398 124138
55274 124138 123434 122661 122611 123124 123160 122454 122036 122738 124156 125506 126574 127312 127336 126530 125590 125260 125513 125918 126373
55255 126373 126927 127304 127161 126624 126132 125898 125832 125793 125657 125347 124969 124763 124735 124526 123762 122417 120821 119536 119133
55236 119133 119717 120613 120911 120443 119963 120279 121412 122658 123278 123180 123095 123925 125673 127247 127706 127414 127425 127965
55218 127965 128241 127744 127007 126797 127152 127485 127269 126400 125181 124157 123744 123877 124201 124539 124957 125437 125816 125998
55200 125998 125964 125648 125123 124753 124807 125064 125146 125041 124885 124525 123832 123205 123141 123440 123496 123265 123288 123772 124322 124559 124396
55179 124396 123719 122508 121308 120860 121147 121449 121452 121645 122479 123856 125610 127737 129830 131011 130925 130302 130127
55162 130127 130628 131428 132259 133172 134292 135635 136956 137718 137597 137068 137036 137724 138396 138355 137739 137110 136727 136487
55144 136487 136207 135730 135050 134456 134292 134493 134769 135173 135928 136698 136737 136022 135522 135969 136893 137262 136640 135323 133781
55125 133781 132393 131350 130418 129082 127329 125991 125966 127310 129298 131115 132225 132443 132065 131753 132001 132751
55109 132751 133647 134391 134727 134429 133573 132647 132225 132656 134079 136343 138758 140333 140541 139747 138793 138356 138688
55092 138688 139597 140577 141242 141655 141973 141941 141277 140463 140433 141364 142462 143112 143508 143840 143691 142859 142092 142261 143128
55073 143128 143644 143240 142240 141161 140205 139435 138940 138720 138687 138808 139085 139456 139930 140659 141670 142595 142950 142728
55055 142728 142564 143189 144646 146070 146469 145866 145383 145928 147072 147690 147447 146986 146806 146725 146519 146313 146089 145489
55037 145489 144429 143312 142337 141232 139954 139029 138828 139090 139596 140622 142178 143394 143388 142358 141170 140184
55021 140184 139112 137780 136397 135235 134559 134685 135586 136669 137393 137934 138742 139664 140086 139839 139400 139221 139361
55004 139361 139781 140512 141405 142086 142289 142057 141616 141240 141210 141692 142635 143895 145359 146868 148258 149632 151326
54987 151326 153383 155286 156419 156607 156037 155010 153977 153451 153507 153589 153157 152286 151346 150450 149656 149439 150357 152221
54969 152221 154014 154724 154118 152832 151977 152452 154321 156793 158958 160462 161393 161857 161948 161891 161864 161785 161547 161274
54951 161274 161127 161015 160747 160319 159857 159405 158972 158592 158250 157964 157979 158470 158992 158779 157846 157217 157674 158812 159713
54932 159713 160013 159758 158914 157817 157660 159551 163148 166941 169833 171863 173587 175588 178549 182980 188619
54917 188619 194617 200437 206129 211716 216906 221465 225272 227913 228834 228058 226179 223433 219351 213657 207032
54902 207032 200584 194908 190052 186103 183321 181726 180836 179888 178264 175868 173209 171025 169691 169001 168503
54887 168503 167966 167551 167676 168701 170578 172824 174998 177149 179614 182473 185499 188596 191976 195815 200042
54872 200042 204628 209814 215729 221835 226986 230148 231053 230129 227911 224619 220283 215087 209441 203815 198607
54857 198607 194043 190019 186196 182454 179120 176468 174218 171954 169822 168192 166763 164827 162522 160939
54843 160939 160591 160611 160029 159120 158695 158653 158222 157339 156836 157209 157952 158264 157849 156961 156101 155719 155829 155887 155401 154592
54823 154592 154090 154072 154144 154003 153794 153833 154326 155325 156548 157346 157230 156480 155864 155877 156552 157802 159444 160951 161743
54804 161743 161775 161496 161241 161090 161233 161917 162902 163445 163011 161771 160321 159200 158686 158759 159160 159650 160169 160677
54786 160677 161028 161219 161465 161758 161712 161280 161192 162044 163293 163940 164024 164566 166080 168011 169794 171656 174044 176987
54768 176987 180434 184657 189831 195641 201668 207913 214578 221537 228273 234176 238851 242385 245306 247878
54754 247878 249361 248400 244384 238064 230724 223140 215536 208148 201372 195509 190618 186607 183402 181131
54740 181131 180023 179941 180136 179900 179391 179367 180045 180711 180593 179694 178609 177902 177904 178755 180362 182463 184874 187555
54722 187555 190438 193465 196803 200752 205359 210352 215363 219958 223603 226022 227500 228381 228377 226904 224024
54707 224024 220395 216313 211508 206051 200761 196324 192617 189177 185888 182846 180057 177608 175736 174418
54693 174418 173252 172024 170953 170117 169173 168006 167162 167110 167504 167699 167700 167957 168432 168453 167532 165876 164068 162562
54675 162562 161557 161113 161238 161913 163000 164165 165079 165737 166343 166833 166802 166085 165179 164842 165409 166620 167859
54658 167859 168467 168036 166697 165091 163996 163956 165078 166906 168561 169373 169433 169282 169110 168632 167696 166590 165679
54641 165679 165087 164794 164636 164313 163773 163525 163976 164622 164544 163731 163147 163362 164008 164732 165710 166807 167204 166517 165483
54622 165483 164778 163922 162249 160404 159819 160931 162777 164195 164685 164305 163484 162935 163099 163652 164018 164203 164584
54605 164584 165172 165727 166452 167805 169615 171029 171414 170801 169548 168204 167646 168515 170275 171523 171506 170818 170380
54588 170380 170349 170393 170445 170597 170605 170150 169517 169445 170165 170928 170736 169416 167826 166941 166902 167052 166836 166439 166383 166742 167009
54567 167009 166709 165937 165259 165243 166052 167313 168336 168582 168032 167109 166278 165741 165464 165368 165428 165558 165561 165367 165340 166036
54547 166036 167453 168813 169410 169410 169408 169453 169188 168825 169080 170008 170748 170847 171045 172155 173805 175031 175687 176415 177445
54528 177445 178219 178168 177287 175932 174535 173545 173173 173171 173214 173413 174052 174921 175387 175125 174410 173663 173101 172798 172715 172661
54508 172661 172541 172568 172892 173112 172617 171367 169926 168793 168140 168118 168790 169682 170003 169645 169435 170081 171243 172033
54490 172033 172124 171969 172094 172566 173133 173562 173774 173800 173729 173628 173539 173545 173798 174415 175330 176253 176792 176677 175933 174814
54470 174814 173548 172279 171260 170963 171758 173511 175578 177219 178046 178248 178460 179302 180828 182421 183248 182872
54454 182872 181508 179864 178655 178017 177387 176242 174959 174555 175468 176955 177931 178064 177765 177431 177108 176739 176410
54437 176410 176374 176941 178180 179590 180337 180044 179121 178157 177305 176523 176042 176173 176852 177719 178496 179063 179409 179771
54419 179771 180576 181866 183080 183739 184068 184561 185252 185917 186671 187818 189202 190279 190768 190796 190482 189851 189117
54402 189117 188621 188518 188786 189370 189967 189926 188916 187580 187001 187541 188645 189679 190481 191139 191788 192649 193761
54385 193761 194635 194624 193702 192546 191837 191753 192047 192251 191916 191109 190531 190756 191479 191949 191888 191464 190656 189455 188544
54366 188544 188865 190403 192091 193021 193052 192288 190886 189627 189676 191216 193028 193975 194260 194731 195537 196227 196747
54349 196747 197496 198479 199111 198995 198472 198260 198737 199656 200431 200617 200132 199095 197648 196093 194930 194402 194137
54332 194137 193658 193133 193154 193804 194483 194694 194500 194140 193760 193641 194093 194877 195260 194923 194275 193681 192977 192128 191758
54313 191758 192384 193547 194298 194382 194385 194815 195523 195989 195832 195027 193880 192853 192275 192182 192441 192922 193552 194386 195593
54294 195593 197120 198460 199124 199349 199946 201395 203519 206070 209049 212234 215016 217090 218885 220974 223471
54279 223471 226390 230098 234876 240238 245206 249151 252053 254145 255617 256459 256250 254282 250234 244659 238613
54264 238613 232998 228394 225086 222843 220878 218509 215814 213422 211816 211032 210784 210572 209908 208749 207514
54249 207514 206417 205152 203563 202276 202080 202880 203823 204386 204787 205284 205668 205626 205241 204862 204688 204686 204756 204867 205051
54230 205051 205251 205142 204259 202556 200744 199779 199850 200102 199537 198171 197072 197222 198449 199663 200093 199993 200045
54213 200045 200430 200808 200923 200749 200188 199125 197801 196622 195588 194404 193203 192594 192847 193567 194326 195058 195612
54196 195612 195583 194998 194608 195026 196019 197054 198023 198921 199349 198999 198295 197888 197816 197785 197978 198795 199932 200505 200172
54177 200172 199505 199096 198867 198434 197695 196854 196193 195978 196346 197130 197969 198608 198940 198859 198330 197545 196807 196337 196376
54158 196376 197204 198644 199783 199686 198460 197196 196838 197420 198387 199260 199926 200559 201378 202294 202828 202588 201768 200977
54140 200977 200662 200940 201819 203187 204623 205622 206034 206119 206263 206851 208168 210004 211596 212491 213335 215152 217871
54123 217871 220227 221310 221555 221883 222477 222870 222842 222627 222365 221885 221046 219949 218790 217803 217366 217840 219109
54106 219109 220443 221054 220792 220136 219537 218958 218200 217408 216989 217054 217284 217362 217245 216945 216379 215590 214855 214376 214094
54087 214094 213928 213888 213789 213251 212304 211610 211725 212423 213142 213771 214536 215411 216221 217131 218400 219778 220796 221600
54069 221600 222820 224492 225823 226252 226170 226266 226669 227104 227465 227777 227836 227384 226554 225838 225650 226105 227149 228705
54051 228705 230728 233223 236137 239161 241804 243836 245591 247678 250468 253986 258175 263038 268421 273844
54037 273844 278809 283336 288080 293773 300586 308173 316198 324515 332764 340205 346322 351426 356311 361264
54023 361264 365641 368561 369939 370759 372233 374667 377252 379049 379934 380316 380155 378830 375999 371958 367011
54008 367011 361150 354692 348535 343191 338008 332070 325568 319605 314828 310926 307417 304203 301273 298410
53994 298410 295473 292580 289915 287559 285521 283715 281922 280043 278272 276768 275280 273421 271170 268801
53980 268801 266474 264238 262214 260453 258808 257318 256425 256388 256782 257023 257005 256720 255796 254227 253081 253414 254707
53963 254707 255523 255584 255973 257135 258019 257734 256940 256929 258103 259997 262089 263929 265124 265879 267117 269492 272668
53946 272668 276041 279611 283638 287979 292393 297080 302332 307969 313690 319541 325493 330992 335640 339995
53932 339995 344998 350824 357047 363693 371322 380040 389203 398327 407764 418290 430445 444450 460415
53919 460415 478386 498397 520662 545658 573902 605545 639949 675502 709945 740895 765918
53908 765918 782380 788152 783101 769553 750726 728838 705007 680364 656406 634245 614212 596245
53896 596245 580161 565527 551831 538949 527038 515893 504819 493349 481725 470451 459698
53885 459698 449312 439170 429298 419762 410604 401830 393454 385661 378878 373387 368839 364368 359317 353694
53871 353694 347880 342183 336830 332157 328400 325266 321998 318038 313590 309349 305703 302361 298852 295200
53857 295200 291894 289302 287361 285821 284519 283387 282475 281991 282080 282475 282674 282503 282214 281925 281345 280272 279009
53840 279009 277999 277341 276975 277053 277678 278422 278558 277814 276668 275874 275772 276025 275949 275311 274856 275708 278072 280868
53822 280868 282892 283894 284240 284078 283534 283352 284365 286322 288027 288879 289618 291214 293617 296152 298727 301975
53806 301975 306198 310781 314932 318782 323371 329479 336699 343866 350241 355952 361317 366281 370816 375414
53792 375414 380609 386116 390967 394514 396897 398540 399635 400285 400758 401284 401796 402027 401742 400764 398902 396010
53776 396010 392062 387173 381641 375932 370416 365112 359846 354640 349725 345184 340902 336986 333960 332244
53762 332244 331495 330672 328849 325913 322489 319208 316174 313181 310332 308134 306898 306323 305905 305580 305708 306537
53746 306537 307926 309493 310773 311435 311635 312087 313483 315971 319547 324687 331985 341225 351547 362765
53732 362765 375882 391976 411208 433393 458966 488545 521656 556406 590176 619887 641720
53721 641720 651760 647982 631727 606956 577999 547863 518147 489912 464357 442707 425512 412183
53709 412183 401470 392569 385625 381039 378519 377165 376387 376345 377337 379066 380762 381870 382406 382767 383389 384545
53693 384545 386181 387926 389428 390727 392134 393701 395000 395545 395319 394741 394186 393663 392963 391961 390760 389579
53677 389579 388619 388057 388134 389079 390843 393010 395041 396655 397848 398650 398972 398708 397790 396137 393743 390913
53661 390913 388313 386557 385689 385116 384099 382358 380247 378345 376964 376140 375992 376743 378210 379565 380032 379697
53645 379697 379302 379254 379273 379133 379260 380230 381900 383414 384101 384105 384058 384365 385024 386075 387852 390521 393548 396093
53627 396093 398046 400219 403277 406857 410140 412948 415759 418935 422530 426732 431757 437302 442792 448381
53613 448381 455007 463209 472440 481918 491615 501944 512907 524090 535217 546206 556724 566052 573382
53600 573382 578100 579954 579102 575900 570603 563578 555781 548503 542380 537051 532018 527341 523188 519220
53586 519220 514946 510383 505944 501961 498644 496116 494036 491615 488548 485613 483730 482658 481248 478867
53572 478867 475983 473432 471654 470642 470100 469586 468842 467973 467091 466009 464641 463368 462486 461585 460087 458208
53556 458208 456710 455781 454894 453791 452879 452528 452611 453000 453888 455334 456918 458199 459213 460325 461863 464000
53540 464000 466698 469674 472726 476158 480546 486016 492135 498605 505667 513619 522271 531088 539680 548039
53526 548039 556556 565900 576619 588699 601571 614507 627001 639044 651387 665272 681385 699170
53514 699170 717623 736603 756817 778592 801393 824636 848288 872427 896867 921550 946763
53503 946763 972525 998150 1022874 1046689 1070206 1093866 1117536 1140680 1162748 1183600 1203693
53492 1203693 1223776 1244295 1265239 1286448 1307754 1328879 1349679 1370530 1392024 1414133 1436158
53481 1436158 1457629 1478807 1500148 1521728 1543486 1565457 1587310 1607918 1625842 1640254 1651154
53470 1651154 1658862 1663372 1664043 1659887 1650406 1636221 1618679 1598958 1577910 1556515 1535667 1515316
53458 1515316 1494572 1473027 1451355 1430194 1409019 1386685 1362772 1337864 1312810 1288191 1264296
53447 1264296 1241126 1218539 1196705 1176228 1157501 1140130 1123322 1106739 1090758 1076142 1063668
53436 1063668 1053741 1046072 1039889 1034701 1030630 1027843 1026136 1025348 1025770 1027694 1030925 1035154 1040542 1047478
53422 1047478 1056017 1065996 1077471 1090652 1105591 1122367 1141216 1161986 1183780 1205822 1228556 1253230
53410 1253230 1280419 1309593 1340210 1372558 1407167 1443861 1481882 1520792 1560931 1602967 1647200
53399 1647200 1693408 1741339 1791128 1843042 1896922 1952129 2007976 2063961 2119763 2175558 2232311
53388 2232311 2290952 2350928 2410185 2466988 2521254 2573688 2624321 2672551 2718021 2760581 2799685
53377 2799685 2834715 2865736 2893099 2916429 2934865 2948308 2957594 2963226 2964650 2960958 2951617 2936227
53365 2936227 2914230 2885435 2850489 2810479 2766226 2718141 2666569 2612074 2555534 2497961 2440050
53354 2440050 2381982 2324015 2267129 2212611 2160951 2111524 2063344 2015744 1968347 1921010 1873991
53343 1873991 1827709 1782161 1736989 1692260 1648695 1606954 1567156 1529319 1493795 1460903 1430467
53332 1430467 1402096 1375615 1350987 1328112 1306994 1287760 1270155 1253280 1236279 1219172 1202720
53321 1202720 1187583 1173884 1161454 1150151 1139984 1131155 1123896 1118088 1113161 1108681 1105000 1103080 1103621
53308 1103621 1106451 1110769 1115890 1121762 1128902 1137847 1148764 1161581 1176319 1192959 1211056 1229896
53296 1229896 1249278 1269855 1292476 1317321 1343874 1371511 1399870 1428783 1458116 1487629 1516784
53285 1516784 1544790 1571040 1595428 1618067 1638799 1657239 1673235 1686963 1698525 1707723 1714274 1718042
53273 1718042 1718889 1716539 1710799 1701927 1690582 1677345 1662322 1645182 1625547 1603382 1579096 1553344
53261 1553344 1526724 1499606 1472193 1444683 1417228 1389741 1361873 1333345 1304246 1274780 1244788
53250 1244788 1213849 1182063 1150495 1120523 1092721 1066501 1040788 1014841 988521 962086 935950
53239 935950 910537 886195 863074 841004 819564 798508 778169 759257 742110 726417 711853
53228 711853 698705 687438 677750 668514 658665 647900 636531 625020 613652 602267 590258 577220
53216 577220 563742 551109 540018 529909 519789 509372 499130 489544 480783 472869 465736 459050
53204 459050 452397 445725 439435 433964 429372 425245 420789 415181 408216 400720 394022 388811 384661 380707
53190 380707 376612 372737 369585 367324 365747 364426 362890 360918 358773 356981 355791 355006 354452 354317 354697
53175 354697 355005 354346 352673 351108 350805 351702 352755 353187 353066 352707 352057 350893 349313 347706 346345 345195
53159 345195 344127 343169 342545 342446 342697 342734 342095 340977 340146 340204 341088 342327 343546 344616 345567 346604 348045
53142 348045 349925 351724 352799 353183 353740 355333 357934 360599 362270 362603 362186 362071 362974 364737 366585 367952
53126 367952 368970 370011 370907 370958 369822 368085 366706 366040 365646 364922 363655 362001 360257 358700 357374 355906
53110 355906 353757 350844 347725 345072 343107 341680 340620 339771 338889 337840 336840 336231 336035 335958 335756 335295
53094 335295 334289 332423 329954 327829 326834 326741 326612 325918 325050 324665 324872 325297 325658 325927 326009 325723 325213 324989
53076 324989 325336 325985 326590 327210 327905 328178 327339 325352 322842 320349 318118 316537 316041 316359 316535 316090 315593
53059 315593 315682 316045 315917 315193 314405 313864 313438 313097 313061 313414 314072 315147 316906 319251 321559 323191 323965 324109
53041 324109 323955 323701 323367 323008 323003 323837 325497 327396 329131 330926 333009 335015 336450 337355 337924 337863 336869
53024 336869 335552 335019 335523 336231 336347 335843 335033 334160 333502 333228 333005 332385 331674 331671 332402 332963 332881 332721 332877
53005 332877 332679 331477 329948 329390 330149 331561 333119 334766 336171 336652 336000 334715 333314 331989 331137 331468
52989 331468 333115 335064 335949 335347 333979 332819 332323 332454 333053 334035 335368 337032 338931 340798 342299 343368
52973 343368 344339 345550 346836 347673 347875 347877 348206 348928 349811 350757 351772 352727 353536 354435 355702 357141 358149
52956 358149 358264 357386 355675 353598 351900 350990 350443 349580 348422 347426 346387 344469 341551 338730 337050 336348
52940 336348 335800 335013 334035 332812 331343 330097 329595 329661 329628 329231 328809 328674 328692 328574 328181 327476 326447 325244
52922 325244 324189 323474 322929 322175 321070 319955 319335 319333 319684 320384 321900 324403 327136 329113 330224 330961 331289
52905 331289 330771 329813 329677 330770 331931 331975 331091 329984 328518 326273 323846 322364 321940 321645 321027 320639 320951
52888 320951 321601 321998 321980 321599 320809 319686 318547 317575 316633 315628 314761 314255 314051 313908 313649 313332 313318 314037
52870 314037 315411 316669 317084 316820 316658 317020 317696 318499 319614 321186 322969 324588 325890 326904 327703 328426
52854 328426 329245 330216 331249 332213 333028 333736 334607 335909 337417 338411 338379 337419 335721 333106 329530 325597 321896
52837 321896 318161 313844 309340 305839 303964 303290 303176 303338 303531 303485 303368 303633 304217 304570 304645 305022 305746 305888
52819 305888 304848 303367 302574 302479 302129 300995 299575 298830 299462 301542 304437 307263 309787 312635 316343 320500
52803 320500 324203 326937 328529 328642 327045 324211 320951 317501 313561 309207 305046 301340 297715 294084
52789 294084 291292 290245 290668 291251 291001 290043 289037 288293 287752 287596 288372 290314 292806 294802 295744 295924 296057
52772 296057 296675 297824 299010 299475 298874 297731 296958 296853 296938 296796 296598 296599 296646 296534 296493 296841 297502 298297 299403
52753 299403 300948 302362 302871 302677 302975 304456 306274 306887 305705 303644 302181 302085 302996 304014 304665 305229
52737 305229 306121 307103 307431 306769 305679 305084 305408 306328 307189 307534 307419 307341 307778 308749 309870 310793 311394 311626
52719 311626 311482 311156 310909 310673 310086 309092 308171 307795 307970 308542 309513 310673 311353 311145 310575 310399 310369 309537 307802
52700 307802 306289 305889 306205 306447 306643 307288 308293 309169 309960 311123 312557 313581 313994 314439 315440 316678
52684 316678 317534 317848 317822 317616 317432 317645 318436 319511 320495 321387 322337 323199 323675 323772 323789 323942 324326 325111 326475
52665 326475 328327 330305 332005 333051 333144 332357 331343 330927 331416 332458 333540 334440 335253 336163 337243 338415
52649 338415 339607 340939 342538 344012 344422 343106 340441 337483 334879 332378 329426 326031 322941 321056
52635 321056 320620 320968 321207 321172 321505 322764 324804 327250 330112 333486 336956 339853 342013 343807 345446 346694
52619 346694 347247 346982 345839 343893 341594 339570 338100 337033 336165 335350 334332 332955 331581 330817 330750 330954
52603 330954 331270 332010 333142 333945 333970 333876 334757 336807 339132 340791 341646 342227 343158 344724 346726 348640 350010
52586 350010 350730 350946 350767 350262 349681 349497 350129 351557 353272 354715 355875 357330 359483 361891 363644 364380
52570 364380 364596 364922 365432 365802 365807 365403 364576 363379 362005 360595 359112 357554 356166 355193 354492 353641 352422
52553 352422 351058 349952 349304 349025 348915 348852 348795 348689 348460 348142 347908 347903 348098 348372 348594 348567 348080 347244 346575 346483
52533 346483 346849 347385 348237 349709 351454 352529 352445 351772 351434 351776 352554 353468 354296 354731 354582 354198 354333 355432
52515 355432 357199 358995 360607 362446 364966 368033 371088 373872 376716 379985 383474 386560 388725 389702
52501 389702 389296 387478 384581 381108 377370 373514 369750 366244 362945 359841 357259 355496 354326 353330 352561
52486 352561 352328 352449 352387 352192 352602 353973 355715 357056 357820 358167 358079 357548 356960 356885 357665 359336 361654 364045
52468 364045 365976 367621 369811 373037 376855 380468 383558 386304 389012 391964 395279 398554 400890 401555
52454 401555 400404 397663 393816 389845 386834 384855 382750 379550 375708 372452 370351 369076 368156 367335 366398
52439 366398 365276 364214 363366 362385 360919 359292 358153 357588 357110 356432 355728 355165 354687 354257 353879 353373 352522
52422 352522 351479 350686 350386 350551 351228 352551 354349 356042 357084 357406 357507 358219 360223 363584 367915 373129
52406 373129 379797 388541 399345 411652 424786 437960 450237 460837 469225 474599 475883 472789 466494
52393 466494 458559 449565 439527 429276 420358 413432 407679 402090 396701 392281 389341 387775 387075 386664
52379 386664 386268 386125 386635 387850 389576 391840 394811 398374 402278 406689 412113 418671 425893 433116 439663
52364 439663 444712 447659 448691 448471 447235 444804 441531 438452 436240 434656 433357 432611 432775 433568 434394
52349 434394 435068 435809 436772 437918 439208 440632 442251 444351 447283 450981 454942 458847 462907 467432 472487
52334 472487 478155 484726 492248 500260 508397 517073 527221 539485 553838 569763 586511 603416 620276
52321 620276 637384 655016 673008 690892 708193 724519 739691 754018 768247 783027 798611
52310 798611 815114 832650 850953 869229 886745 903375 919313 934518 948685 961501 972708
52299 972708 982252 990702 999085 1007801 1015945 1022176 1026022 1027816 1027616 1025005 1020039 1013661 1006832 999741
52285 999741 992247 984740 978004 972356 967350 962430 957656 953708 951297 950693 951676 953731 956290 959045 962290
52270 962290 966848 973372 981617 990570 999386 1008116 1017500 1028235 1040555 1054220 1068666 1083231 1097473
52257 1097473 1111345 1125008 1138562 1151993 1165263 1178320 1191096 1203543 1215484 1226324 1235181
52246 1235181 1241615 1246090 1249426 1251859 1253040 1252928 1252161 1251318 1250253 1248639 1246963 1246367 1247399 1249404 1251349
52231 1251349 1252882 1254235 1255425 1256127 1256290 1256331 1256600 1257008 1257402 1257981 1259105 1260888 1263179 1265756 1268402 1271035
52215 1271035 1273987 1277882 1282967 1288732 1294460 1300103 1306400 1314248 1324051 1335380 1347026 1357722 1367154
52202 1367154 1376152 1385597 1395367 1404651 1412987 1420515 1427505 1434199 1441020 1448348 1456040 1463613 1470965 1478425
52188 1478425 1486114 1493689 1500698 1506743 1511308 1513954 1514720 1513784 1510720 1504744 1495904 1485400 1474369 1462856
52174 1462856 1450401 1437234 1424450 1413134 1403572 1395210 1387255 1379564 1373073 1369073 1368024 1369340 1372281
52161 1372281 1376473 1381402 1386127 1390043 1393558 1397477 1401862 1405890 1408681 1409892 1409617 1408088 1405609 1402577
52147 1402577 1399437 1396502 1393748 1390951 1388213 1386163 1385209 1384693 1383310 1380415 1376397 1371710 1366186 1359649
52133 1359649 1352634 1346048 1340418 1335833 1332353 1330144 1329487 1330897 1334964 1341835 1351202 1363020 1377827 1396030
52119 1396030 1417181 1440332 1464781 1490129 1515984 1542035 1568241 1594485 1620122 1644174 1665913
52108 1665913 1685179 1702394 1718415 1734024 1749365 1764049 1777847 1790828 1802836 1813575 1823553
52097 1823553 1834190 1846408 1859595 1872397 1883951 1893785 1901142 1905311 1906249 1904107 1898514 1889190 1877053
52084 1877053 1863875 1850874 1838395 1826731 1816399 1807630 1800525 1795861 1794770 1797264 1801747 1806490 1811171
52071 1811171 1816698 1824006 1833388 1844537 1856769 1869371 1882077 1895197 1909074 1923455 1937468 1950222
52059 1950222 1961417 1971389 1980460 1988332 1994415 1998772 2002217 2005199 2007133 2007286 2005793 2003146 1999008 1992383
52045 1992383 1982843 1970870 1957026 1941551 1924850 1907706 1890803 1874501 1859115 1844949 1832094
52034 1832094 1820695 1811316 1804425 1799553 1795628 1792056 1788697 1784864 1779431 1772202 1764273 1756553 1748800 1740516
52020 1740516 1731898 1723213 1713978 1703617 1692490 1681450 1670754 1660143 1649723 1639983 1630999 1622307
52008 1622307 1613540 1604651 1595482 1585549 1574285 1561129 1545492 1527065 1506152 1483293 1458613 1431926
51996 1431926 1403462 1374093 1344845 1316605 1290355 1267143 1247452 1230720 1215677 1201105 1186361
51985 1186361 1171449 1156734 1142391 1128021 1112957 1097036 1080848 1065053 1049592 1033781 1017098
51974 1017098 999644 981848 964028 946420 929440 913671 899653 887813 878540 872022 868074 866452
51962 866452 867409 871472 878442 886967 895462 903198 910204 916393 921252 924152 924419 921218 914005 903207
51948 903207 890111 876053 862056 849087 837990 829085 822368 818177 817094 819104 823525 829975 838578
51935 838578 848842 859112 867822 874779 880472 884554 885794 883374 877467 868629 857307 843962 829108
51922 829108 813073 796150 778973 762260 746155 730381 715156 701408 689824 680115 671550 663901
51910 663901 657546 652878 649934 648527 648490 649841 652861 657960 665363 674967 686509 699695 714128 729314
51896 729314 744796 759976 773614 783796 788812 788111 782177 771660 757025 739093 719484 700135
51884 700135 682412 666873 653738 643386 636334 632932 633172 636759 643312 652580 664537 679299 696839
51871 696839 716621 737364 757253 774633 788662 799221 806105 808580 805961 798465 787130 772989
51859 772989 756768 739419 722429 707243 694634 684857 678093 674362 673220 673955 676042 679094 682436
51846 682436 685150 686620 686841 686181 685071 683832 682518 680895 678811 676585 674811 673784 673433 673863 675678
51831 675678 679583 685803 693914 703122 712696 722242 731470 739582 745106 746746 744351 738705 730453 719782
51817 719782 707205 694041 681733 671048 662315 656108 653115 653336 655760 658958 661806 663710 664406 663697
51803 663697 661340 657064 650709 642441 632892 623069 613903 605768 598473 591798 585883 580998 577099 573864
51789 573864 570979 568147 564994 561418 558044 555928 555692 557122 559538 562173 564206 564975 564425 563103 561566
51774 561566 559960 558289 556779 555898 556197 558224 562287 568237 575699 584523 594705 605956 617770 629922
51760 629922 642268 653909 663154 668693 670387 668630 663483 654962 643776 631158 618046 604877 592005
51747 592005 579943 569228 560303 553441 548544 545207 543195 542694 543931 546865 551564 558495 567982 579546
51733 579546 592221 605360 618702 631768 643577 652950 658888 660993 660009 657769 655961 654847 653495
51720 653495 651168 647964 644097 639244 632971 625503 617785 610890 605450 601432 598352 595813 593881 592811
51706 592811 592518 592682 593371 595211 598819 604343 611693 620837 631449 642375 651846 658526 662379 664526
51692 664526 666263 668324 671022 674798 680206 687215 694755 701094 704542 703878 698620 689342 677584 665078
51678 665078 653045 642297 633603 627531 624003 622438 622339 623488 625648 628401 631268 633772 635576 636891
51664 636891 638563 641250 644600 647692 650128 651993 652703 650889 646002 639494 633708 629817 627468 626274
51650 626274 626913 630539 637559 647335 658742 670544 681202 688773 691503 688698 680950 669416 655063
51637 655063 638686 621434 604777 589765 576510 564591 553743 543939 535012 526735 519369 513739
51625 513739 510377 508724 507572 506283 505174 504561 503850 502048 498959 495454 492542 490567 489328 488536 487982
51610 487982 487613 487659 488393 489610 490621 490980 490864 490549 489949 489072 488536 489101 490891 493644 497595 503512 511802
51593 511802 522064 533607 545926 558488 570503 581186 590000 596502 600247 601155 599858 597508 595303
51580 595303 594306 595545 599969 608098 619719 634178 651262 671847 697346 728235 763345 800861
51568 800861 839788 880171 922177 965622 1010354 1056469 1103892 1152163 1200979 1250881 1303330
51557 1303330 1360249 1423262 1492657 1566607 1641491 1713050 1777096 1829301 1865187 1881201 1875973
51546 1875973 1850503 1807332 1749704 1681121 1604983 1524228 1441274 1358265 1277309 1200488 1129624
51535 1129624 1065887 1009525 959996 916496 878329 844855 815288 788745 764521 742358 722481
51524 722481 705246 690573 677754 666053 655425 646316 638788 632224 626067 620418 615625 611582 607812
51511 607812 604086 600553 597331 594279 591126 587504 582896 576888 569598 561566 553192 544579 536044 528384
51497 528384 522276 517632 513910 510958 509097 508354 508116 507875 508002 509365 512215 515798 519075 521522 523171
51482 523171 524191 524606 524272 522989 520785 518105 515476 512884 509759 505828 501753 498580 496614 495089 492989
51467 492989 489981 486510 483123 479840 476298 472485 469076 466747 465335 464123 462960 462554 463522 465648 468403
51452 468403 471672 475585 480135 485473 492220 500823 510939 522088 534697 549790 567805 588455 611674
51439 611674 637764 666244 695091 721464 742919 758002 766413 768986 767231 762706 756856 750966 745364
51426 745364 738642 728549 714094 696332 677016 657313 638163 620942 606889 596228 588381 582701
51414 582701 578545 575128 572020 569584 568459 568813 570467 573392 577550 582486 587581 592498 597097 601282
51400 601282 605406 610319 616305 622354 627308 631502 636416 642816 650230 658346 667942 680041 694901 712377
51386 712377 732781 756881 785401 818980 858436 904712 958657 1021015 1092305 1172438 1260506
51375 1260506 1355044 1454300 1556204 1658204 1757089 1848627 1927543 1988672 2028710 2046682 2042707
51364 2042707 2016970 1970333 1905337 1825768 1735398 1637657 1536185 1434686 1335944 1241535 1152757
51353 1152757 1071332 998791 935541 880914 833976 794017 760418 732401 708939 688754 670559
51342 670559 653546 637675 623348 610841 600046 590481 581326 571688 561348 551275 542937 536866
51330 536866 532113 527271 521788 516079 510655 505538 500532 495756 491763 489226 488476 489187 490490 491472 491695
51315 491695 491276 490603 490040 489810 490035 490900 492755 495865 499932 504069 507548 510539 513854 517928 522308 526213
51299 526213 529388 532224 535084 537657 539054 538591 536478 533699 531111 528795 526281 523326 520301 517892
51285 517892 516544 516155 516249 516550 517382 519251 521940 524383 525727 526233 526720 527396 527730 527276 525981 523803 520777
51268 520777 517574 515255 514095 513259 512112 511343 512202 514892 518282 521053 522648 523207 523144 522957 523085 523700
51252 523700 524667 525796 527056 528623 530749 533481 536449 539126 541340 543296 544950 545713 545086 543338 541125
51237 541125 538579 535198 530615 525064 519025 512870 507045 502237 498956 497043 495827 494751 493657 492540
51223 492540 491345 490125 489186 488802 488873 489082 489402 490140 491384 492684 493536 493961 494343 494876 495545 496510 498082
51206 498082 500289 502921 506092 510312 515796 521961 527764 532337 535274 536799 537801 539313 541590 543890
51192 543890 545349 545806 545671 545449 545688 546990 549611 553245 557498 562292 567469 572387 576372 579247 580965
51177 580965 581050 579133 575848 572429 569351 566041 562056 557843 554031 550549 546931 543119 539463 536162 533166
51162 533166 530639 529127 529073 530261 531813 532790 532870 532512 532427 532903 533609 533981 533710 532977 532334 532273 532748 533176 533008
51143 533008 532174 530820 528834 525950 522226 518057 513757 509518 505764 503009 501184 499510 497448 495438
51129 495438 494301 494063 493836 492924 491676 491147 492148 494740 498375 502363 506308 510292 514596 519217 523852
51114 523852 528417 533247 538473 543504 547649 551115 554672 558217 560464 560526 559165 557811 556907 556084 555535
51099 555535 556040 557575 559053 559844 560607 562078 563892 565369 566763 568844 571562 574003 575563 576413 576853
51084 576853 576802 576057 574574 572399 569677 566728 563827 560931 557927 555031 552612 550737 549259 548291 548159
51069 548159 548928 550279 551911 553803 556187 559507 564220 570349 577434 585217 594078 604344 615502 626643
51055 626643 637400 647717 656903 663841 668267 671134 673595 676360 680095 685542 692655 700272 707237 713553
51041 713553 720068 727375 735399 743737 751983 759994 768205 777391 787747 798259 807108 812531 813225 808563
51027 808563 798936 785706 770367 753753 736187 718150 700468 684024 669545 657541 648135 641026
51015 641026 635824 632426 630988 631634 634295 638634 644106 650339 657478 665810 674968 684008 692525 701214
51001 701214 710867 721201 731117 739842 747312 753687 759126 763990 768689 773181 777064 780273 783424 787379
50987 787379 792755 799862 808840 819738 832690 848001 865876 886140 908481 932797 958864 985698
50975 985698 1011863 1036615 1060264 1083152 1104739 1124189 1141588 1158070 1174884 1192782 1212224
50964 1212224 1233546 1256744 1281544 1308001 1336774 1368448 1402720 1438606 1475390 1513084 1551961
50953 1551961 1591870 1632104 1671722 1709948 1746495 1781603 1815640 1848562 1880002 1910123 1940175
50942 1940175 1971810 2005730 2041203 2076975 2112343 2146960 2179697 2208227 2230200 2244782 2252828
50931 2252828 2255640 2253945 2248012 2237979 2223497 2203476 2176972 2144270 2106457 2063914 2015960 1962160
50919 1962160 1903306 1840809 1775802 1709315 1642683 1577113 1513233 1451671 1393691 1340592 1292671
50908 1292671 1249407 1210402 1175475 1144047 1115293 1088965 1065356 1044466 1025851 1009354 995207
50897 995207 983227 972649 963043 954754 948038 942342 936928 931782 927527 924655 923144 922493 921881 920647
50883 920647 918916 917482 916933 917163 917884 919096 920831 922902 925269 928237 931874 935699 939397 943510 948881
50868 948881 955699 963555 972217 981848 992591 1004479 1017676 1032370 1048507 1066054 1085455 1107399
50856 1107399 1132159 1159639 1190146 1224636 1264017 1308491 1357838 1412128 1471958 1538055 1610783
50845 1610783 1689999 1775273 1866180 1962348 2063344 2168654 2277743 2389885 2503797 2617659
50835 2617659 2729489 2837312 2938964 3032285 3115955 3189920 3254727 3310686 3358148 3398427 3433887
50824 3433887 3466924 3499203 3531996 3566921 3605962 3650687 3701475 3757361 3816396 3875968 3932747
50813 3932747 3982639 4021232 4044583 4049682 4034364 3997237 3937963 3857437 3757504 3640529 3509247
50802 3509247 3366788 3216541 3061967 2906545 2753770 2607020 2469268 2342704 2228420
50793 2228420 2126538 2036810 1959082 1892992 1837540 1791464 1754008 1724815 1703049 1687202 1675894
50782 1675894 1668337 1663777 1661031 1658893 1656549 1653287 1648396 1641765 1634037 1625595 1615771 1603673 1589465
50769 1589465 1574095 1557916 1540266 1520387 1498168 1473900 1447875 1420486 1392404 1364449 1337343
50758 1337343 1311493 1286825 1262947 1239723 1217634 1197424 1179600 1164393 1151880 1141763 1133407
50747 1133407 1126631 1122238 1121231 1123678 1128912 1136738 1147767 1162487 1180650 1201731 1225553 1252228
50735 1252228 1281977 1315257 1352670 1394374 1439780 1488067 1538815 1591918 1647002 1703218 1759664
50724 1759664 1815994 1872548 1929792 1987599 2045190 2101823 2157171 2210793 2261452 2307388 2347238
50713 2347238 2380405 2406647 2425749 2437794 2443545 2444527 2442871 2441001 2441208 2445313 2454566 2469500 2489663
50700 2489663 2513685 2539962 2567219 2594293 2619602 2641040 2656077 2661675 2654563 2632370 2594694 2542919
50688 2542919 2479248 2406210 2326640 2243346 2158736 2075179 1995459 1922155 1856544 1798755 1749058
50677 1749058 1708346 1677312 1655901 1643850 1641141 1647524 1662130 1683918 1712050 1745438 1782359 1821071
50665 1821071 1860570 1900269 1939062 1975223 2007328 2035079 2059128 2080186 2098337 2113236 2124933
50654 2124933 2134353 2142746 2150749 2158240 2164989 2171109 2176887 2182623 2188767 2195942 2204759 2215831 2229963
50641 2229963 2247966 2270207 2296701 2327670 2363635 2404840 2450938 2501300 2555187 2611535 2669105
50630 2669105 2727108 2785293 2843101 2899046 2951076 2996962 3033851 3057956 3065509 3054440 3025243
50619 3025243 2980694 2925075 2863284 2799824 2738104 2680467 2628555 2583413 2545526 2515094 2492219
50608 2492219 2476532 2466835 2461456 2458860 2457504 2455162 2449006 2436733 2417488 2391376 2358283 2317486
50596 2317486 2268502 2211999 2149609 2083010 2013471 1942225 1870896 1801288 1734935 1672956 1616000
50585 1616000 1563934 1515828 1470791 1428908 1391101 1358045 1329586 1305190 1284578 1267740 1254660
50574 1254660 1245291 1239739 1238296 1241239 1248524 1259601 1273655 1290168 1309019 1329866 1351699 1373466
50562 1373466 1394926 1416379 1437726 1458394 1478245 1497980 1518488 1540309 1563885 1589712 1617952
50551 1617952 1648314 1680615 1714971 1751103 1787836 1823704 1857731 1889327 1917913 1943343 1966599
50540 1966599 1989536 2013788 2040168 2069132 2101420 2137952 2179158 2224714 2274169 2327851 2386916
50529 2386916 2452404 2524557 2603322 2689048 2782087 2881917 2987431 3098073 3213868 3334016
50519 3334016 3456055 3576730 3693120 3802643 3902738 3991212 4066580 4127456 4171863 4197682
50509 4197682 4203673 4189768 4156564 4105067 4036906 3954557 3861249 3760656 3656422 3551833 3450101
50498 3450101 3354885 3270046 3198665 3142638 3103223 3081330 3076915 3088599 3114246 3151338 3196386
50487 3196386 3244483 3290118 3328117 3353507 3361271 3347434 3310577 3251895 3173995 3080033 2973514
50476 2973514 2857973 2736689 2613004 2490568 2372500 2260405 2154845 2056667 1967148 1886828
50466 1886828 1814982 1750432 1692335 1640008 1592632 1549484 1510144 1474275 1441476 1411470 1384223
50455 1384223 1359811 1338427 1320357 1305553 1293308 1282874 1274337 1268332 1264899 1263241 1262800 1263878 1266849
50442 1266849 1271217 1275939 1280443 1284981 1290069 1295818 1301776 1307397 1312691 1318275 1324493 1330796 1336504 1342052
50428 1342052 1348731 1357094 1366314 1375462 1384758 1395063 1406713 1419530 1433694 1449890 1468651 1490046
50416 1490046 1514110 1541228 1572002 1606990 1646579 1690955 1740213 1794582 1854316 1919080 1987555
50405 1987555 2057913 2128642 2198706 2267146 2332907 2395093 2453034 2506010 2553110 2593329 2625575
50394 2625575 2648571 2661077 2662308 2651976 2630020 2596713 2553136 2501162 2442714 2379346 2312727
50383 2312727 2245109 2178905 2116118 2058640 2008738 1968385 1938058 1916883 1904190 1900207 1904765 1915903
50371 1915903 1930379 1945207 1958202 1967373 1970673 1966388 1953290 1930409 1897307 1854717 1804529 1749041
50359 1749041 1690518 1631220 1573009 1516575 1461600 1407965 1356396 1307767 1262317 1219918 1180609
50348 1180609 1144441 1111267 1081161 1054727 1032484 1014139 998942 986550 977108 970634 966765 965039
50336 965039 965020 966201 968080 970282 972441 974204 975641 977367 979786 982372 984187 985007 985523 986464 988000
50321 988000 990028 992614 995963 1000166 1005097 1010400 1015571 1020221 1024308 1028095 1031956 1036226 1040975 1045814
50307 1045814 1050165 1053880 1057366 1061037 1064982 1069271 1073985 1078717 1082651 1085647 1088722 1092902 1098126 1103919
50293 1103919 1110560 1118595 1127544 1136088 1143509 1150055 1155900 1160711 1164355 1167170 1169371 1170936 1172283 1174224
50279 1174224 1176942 1179649 1181434 1181736 1179940 1175651 1169907 1165155 1163136 1163357 1164318 1165582 1167804 1171204 1175180
50264 1175180 1179300 1183699 1188304 1192397 1195345 1197324 1199080 1201278 1204321 1208562 1214394 1222070 1231406 1241686
50250 1241686 1251973 1261637 1270387 1277670 1282273 1282931 1279368 1272557 1264001 1254985 1246445 1239175 1233811 1230598
50236 1230598 1229292 1229416 1230685 1233129 1236709 1240769 1244055 1245415 1244512 1241750 1237599 1232072 1224879 1215902
50222 1215902 1205339 1193400 1180072 1165386 1149734 1133678 1117458 1101011 1084460 1068198 1052359
50211 1052359 1036658 1021019 1006016 992337 980106 969065 959109 950212 942098 934534 927775 922215
50199 922215 917731 913915 910822 908931 908378 908753 909693 911165 913182 915697 918782 922419 926132 929387 932365
50184 932365 935789 939963 944524 949194 954181 959831 966544 975071 986145 999554 1014288 1029870 1046969
50171 1046969 1066507 1088837 1113976 1141822 1171738 1202673 1234176 1266660 1300295 1334496 1369018
50160 1369018 1404651 1441947 1480051 1517777 1555314 1593671 1632726 1671014 1707349 1741461 1772600
50149 1772600 1798440 1815961 1823061 1819058 1804135 1778756 1743593 1699784 1649231 1594534 1538392 1483081
50137 1483081 1430491 1382345 1339938 1303774 1273789 1249916 1232177 1220292 1213416 1210218 1208974 1207694
50125 1207694 1204449 1197723 1186732 1171823 1154638 1137279 1120887 1105298 1090284 1076477 1064607 1054401
50113 1054401 1045048 1036479 1029408 1024134 1020015 1016116 1011887 1007257 1002628 998713 995807 993250 990187 986825
50099 986825 984240 982924 982271 981712 981543 982175 983248 984190 985303 987649 991961 998166 1005947 1015221 1025925
50084 1025925 1037737 1050395 1064180 1079644 1096734 1114409 1131453 1147608 1163586 1179969 1196493
50073 1196493 1212540 1227922 1242852 1257469 1271804 1286000 1300143 1313954 1327050 1339489 1351766
50062 1351766 1364341 1377390 1390942 1405025 1419820 1435910 1454162 1475133 1498861 1525583 1556305
50051 1556305 1592067 1632902 1678092 1727236 1780348 1837025 1896404 1958119 2022519 2089684 2158960
50040 2158960 2229885 2302921 2378572 2456056 2533320 2608066 2678215 2741476 2795130 2836566 2863957
50029 2863957 2876422 2873752 2856192 2824571 2780576 2726593 2664948 2597316 2524995 2449604 2373079
50018 2373079 2297010 2222392 2150061 2080899 2015368 1953251 1894173 1838134 1785274 1735417 1688241
50007 1688241 1643781 1602325 1563762 1527337 1492249 1458440 1426739 1398333 1374163 1354745 1340391
49996 1340391 1331427 1328150 1330558 1337980 1348720 1360182 1369889 1376768 1381307 1384302 1385776 1385373 1383291 1380163
49982 1380163 1376039 1370094 1361428 1349808 1335683 1319925 1303638 1287775 1272781 1258801 1246148 1235135
49970 1235135 1225550 1216838 1208861 1202048 1196703 1192699 1189948 1188567 1188348 1188613 1188930 1189603 1191246 1194322 1199335
49955 1199335 1206882 1217049 1229221 1243025 1259226 1279201 1303644 1332005 1362846 1394347 1424769
49944 1424769 1452973 1478404 1500437 1518139 1531171 1540542 1547870 1553978 1558695 1561750 1563158 1562746 1560042
49931 1560042 1554944 1548180 1540921 1534251 1529059 1526110 1525978 1528997 1535290 1544760 1557230 1572863 1592277
49918 1592277 1615864 1643100 1672870 1704197 1735994 1766110 1791343 1808738 1816554 1813985 1800740 1777405
49906 1777405 1745758 1708217 1667168 1625054 1584562 1547966 1516281 1489466 1467354 1450039 1437493
49895 1437493 1429206 1424134 1420613 1416503 1410040 1400718 1389000 1375121 1358544 1338654 1315495 1289597
49883 1289597 1261441 1231315 1199440 1166081 1131782 1097560 1064475 1032781 1001943 971760 943043
49872 943043 916792 893130 871615 852284 835710 822129 811168 802492 796138 792132 790273 790457 792727
49859 792727 796881 802548 809820 819396 831859 847193 865188 885735 908369 932017 955677 979029
49847 979029 1001889 1023338 1041904 1056470 1066680 1072710 1075096 1074619 1071764 1066183 1056997 1043701 1026704
49834 1026704 1007195 986768 966898 948359 931184 915365 901352 889614 880179 873130 869156 868861
49822 868861 871704 876493 882957 892071 904622 920236 938132 958221 980944 1006413 1034074 1062849
49810 1062849 1091281 1117885 1141840 1163189 1182096 1198214 1211030 1220442 1226497 1228812 1226879 1220935
49798 1220935 1212000 1200795 1187044 1170191 1150644 1129916 1109421 1089387 1069226 1048794 1028934
49787 1028934 1010681 994350 979668 966562 955365 946289 939003 932760 926743 920404 913735 907162 901017
49774 901017 895334 890439 887368 887107 889545 893811 899612 907536 917916 930067 942953 955989 968765
49761 968765 980488 990274 997827 1003422 1007342 1009535 1009641 1007167 1001773 993485 982374 968050 949944
49748 949944 928313 904562 880335 856670 834263 813955 796444 781819 769838 760422 753432 748235
49736 748235 744022 740449 737617 735563 734210 733695 734319 736119 738793 741995 745588 749675 754571 760513 767321
49721 767321 774674 782971 793392 806632 821946 838010 854395 871454 888959 905674 920372 932491
49709 932491 941567 946810 947846 945466 941037 935179 927342 916684 903143 887659 871535 855643 840175
49696 840175 825057 810418 796643 784162 773388 764711 758342 754192 752095 752016 753787 756748 760064
49683 760064 763508 767720 773638 781770 791948 803564 816001 829089 843216 858872 876075 894413
49671 894413 913501 932999 952064 969171 982950 993206 1000954 1007382 1012927 1017335 1020357 1022081 1022596
49658 1022596 1021714 1019232 1015177 1009356 1000731 987755 969556 946626 920417 892754 865649 840962
49646 840962 819610 801282 785211 770960 758249 746669 736202 727649 721747 717926 714758 711669
49634 711669 709448 708843 709309 709515 708599 706422 703008 698396 693040 687838 683479 679838 676149 671782 666772
49619 666772 661585 656522 651599 647003 643225 640487 638324 636179 634227 633151 633112 633407 633247 632568 631965 632095
49603 632095 633177 634782 636044 636404 636158 636028 636176 636074 635409 634676 634589 635241 636118 636647 636487 635575 634312 633571
49585 633571 634149 636058 638447 640227 640829 640554 640310 640865 642226 643882 645690 648275 652388 658098 664906
49570 664906 672488 681056 691106 703113 717427 734033 752222 770703 788319 804559 819224 831764
49558 831764 841301 847361 850197 850156 847027 840526 831371 821321 811928 803553 795853 788822 782941 778571
49544 778571 775657 773962 773170 772765 772192 771273 770242 769388 768829 768639 768906 769662 770971 773075 776280 780778
49528 780778 786841 794966 805373 817426 830020 842662 855799 870110 885922 903272 921881 940778
49516 940778 958487 973966 987118 998293 1007808 1016205 1024351 1032806 1041545 1050726 1061082 1072722 1083860
49503 1083860 1091658 1094358 1091907 1084621 1072329 1055344 1035424 1014972 995404 976745 958595 940972
49491 940972 924314 909166 895978 884844 875276 866453 857921 849951 843079 837392 832418 827717 823378
49478 823378 819900 817671 816653 816541 817095 818198 819696 821352 823051 824958 827444 830958 836092 843537 853489
49463 853489 864999 876310 886296 895456 905108 915618 925792 934027 939606 942699 943602 942398 939126
49450 939126 933792 926316 916855 906138 895107 884242 873482 862790 852400 842515 833112 824269 816429
49437 816429 810218 806055 803973 803595 804260 805474 807397 810793 816433 824639 835313 848181 862940 879477
49423 879477 898026 918933 942156 967195 993472 1020457 1047212 1071971 1092278 1105453 1109265 1102999
49411 1102999 1088501 1069972 1052115 1038104 1029080 1025105 1026100 1031972 1042358 1056642 1074193 1094437
49399 1094437 1116694 1140122 1164047 1188421 1213665 1239747 1265445 1288835 1308565 1324424 1336759
49388 1336759 1345729 1351320 1353528 1352163 1346691 1336715 1322603 1305415 1286265 1265994 1245318 1225016
49376 1225016 1205889 1188632 1173657 1160948 1150273 1141770 1136173 1134131 1135315 1138446 1142177 1145717 1148594
49363 1148594 1150207 1149819 1146906 1141353 1133382 1123424 1112059 1100008 1088066 1076848 1066473 1056565 1046712
49350 1046712 1036972 1027848 1019764 1012667 1006203 1000200 994907 990759 987934 986130 984773 983425 982040 980852
49336 980852 980023 979311 978072 975637 971735 966538 960343 953450 946414 940084 935026 930945 927036 922989 919403
49321 919403 917129 916400 916692 917315 918035 919244 921560 925179 929594 934039 938070 941597 944577 947089 949596
49306 949596 952641 956161 959524 962359 964909 967422 969662 971404 973025 975142 977867 980938 984484 989210
49292 989210 995691 1003744 1012566 1021298 1029396 1036608 1042796 1047907 1052172 1056122 1060071 1063608 1065967 1066996
49278 1066996 1067444 1068182 1069622 1072104 1076327 1082773 1090999 1100055 1109552 1119811 1130947 1142364 1153335
49265 1153335 1163737 1173947 1184153 1193965 1202690 1209922 1215836 1220860 1225212 1229094 1233452 1240126 1250942
49252 1250942 1266820 1287928 1314205 1345064 1378743 1412616 1444270 1471873 1493585 1507417 1512207
49241 1512207 1508468 1497870 1482069 1462318 1440052 1417281 1396048 1377531 1361821 1348678 1338370
49230 1338370 1331589 1328632 1328982 1331838 1336694 1343147 1350432 1357677 1364603 1371569 1378857 1386224 1393169 1399394
49216 1399394 1404880 1409786 1414381 1418943 1423695 1428882 1434762 1441230 1447564 1452960 1457427 1461843 1467030 1473047
49202 1473047 1479571 1486712 1495169 1505669 1518347 1532707 1548112 1564285 1581219 1598539 1615264 1630502
49190 1630502 1644300 1657477 1670608 1683475 1695413 1705785 1714047 1719808 1723170 1724883 1726056 1727808
49178 1727808 1731119 1736731 1745146 1756978 1773310 1795380 1823938 1859322 1902074 1952762 2010642 2072768
49166 2072768 2134669 2191570 2238840 2272148 2288502 2287744 2272895 2248858 2220605 2192029 2165620 2142739
49154 2142739 2124142 2110285 2101109 2095830 2093287 2092640 2093660 2096400 2100758 2106391 2112899 2120043 2127802 2136228
49140 2136228 2145331 2155185 2166076 2178207 2191164 2203956 2215753 2226381 2236060 2245071 2253914 2263290
49128 2263290 2273326 2283028 2291154 2297611 2303564 2310146 2317652 2326024 2335447 2346056 2357556 2369651 2382690
49115 2382690 2397480 2414568 2434071 2456142 2481261 2510068 2543211 2581437 2625570 2676293 2734085
49104 2734085 2799337 2872046 2950846 3032370 3112095 3186479 3254543 3317150 3374311 3422773 3456200
49093 3456200 3468220 3456320 3423750 3377803 3325531 3270124 3210824 3146093 3076735 3006162 2938354
49082 2938354 2876225 2821562 2775391 2737698 2707229 2682294 2661838 2645467 2632546 2621727 2611466
49071 2611466 2600757 2589313 2577341 2565244 2553303 2541467 2529537 2517613 2506247 2496090 2487490
49060 2487490 2480431 2474699 2469991 2466037 2462707 2459932 2457563 2455488 2453920 2453293 2453770 2455006 2456533 2458127
49046 2458127 2459605 2460557 2460655 2460196 2460015 2460861 2463055 2466762 2472376 2480542 2491976 2507276 2526766 2550428
49032 2550428 2578021 2609199 2643392 2679659 2716781 2753383 2787778 2817734 2840694 2854493 2858000
49021 2858000 2851419 2836298 2815141 2790590 2764706 2738885 2714204 2691524 2671314 2653726 2638865
49010 2638865 2626767 2617170 2609648 2604012 2600292 2598318 2597702 2598232 2599910 2602557 2605801 2609571 2614149 2619524
48996 2619524 2625142 2630514 2635566 2640055 2643194 2644458 2644415 2644132 2643862 2642847 2640313 2636126 2630493 2623630 2615873
48981 2615873 2607640 2599041 2589866 2580217 2570861 2562685 2555887 2549920 2544202 2538683 2533706 2529475 2525832 2522578
48967 2522578 2519791 2517700 2516368 2515812 2516303 2518187 2521378 2525422 2530209 2536201 2543763 2552685 2562645 2573758
48953 2573758 2586314 2600350 2615804 2632810 2651424 2671464 2693041 2716811 2743047 2770805 2798747
48942 2798747 2826590 2855002 2884231 2913760 2943452 2974154 3006838 3041767 3078810 3117973 3159303
48931 3159303 3202778 3248683 3297646 3349923 3405012 3462249 3521390 3582303 3644545 3707830 3772708
48920 3772708 3840315 3911464 3986103 4063388 4141901 4219870 4295440 4366848 4432525 4491561 4544328
48909 4544328 4592320 4636972 4678755 4717524 4753418 4787013 4818771 4848710 4876585 4902246 4925888
48898 4925888 4948079 4969351 4989621 5008185 5024413 5038196 5049564 5058267 5064104 5067453 5069078 5069470
48886 5069470 5068669 5066646 5063526 5059457 5054506 5048705 5041974 5033974 5024149 5011991 4997226 4979700 4959022
48873 4959022 4934154 4903368 4864795 4817159 4760162 4694577 4622286 4545875 4467473 4387885 4307384
48862 4307384 4227320 4150158 4077659 4009760 3945636 3885158 3828664 3775946 3726411 3680024 3637270
48851 3637270 3598234 3562398 3529401 3499425 3472763 3449485 3429579 3412982 3399469 3388941 3381808
48840 3381808 3378577 3378938 3381672 3385638 3390509 3396434 3403324 3410731 3418248 3425922 3434399 3444615 3457101 3471587
48826 3471587 3487434 3504372 3522589 3542247 3563336 3585926 3610114 3635565 3661440 3686964 3711878
48815 3711878 3736358 3760734 3785299 3810075 3834742 3859067 3883438 3908668 3935274 3963214 3992313
48804 3992313 4022538 4053767 4085724 4118423 4152401 4188316 4226437 4266572 4308226 4350568 4392390
48793 4392390 4432242 4468658 4500433 4526937 4548216 4564636 4576582 4584723 4590384 4595047 4599259 4602240
48781 4602240 4602534 4598730 4589702 4574758 4553930 4527840 4497111 4462113 4423279 4381297 4336854 4290505
48769 4290505 4242794 4194081 4144162 4092535 4039250 3985070 3930718 3876446 3822482 3769268 3716978
$$ [...]
##END NTUPLES=NMR SPECTRUM
##END=
