##TITLE=AC1521_ROEFFECT0005_8202113_Uv8gaAcAhf
##JCAMPDX= 6.0         $$ Bruker NMR JCAMP-DX V2.0
##DATA TYPE= NMR SPECTRUM
##DATA CLASS= NTUPLES
##ORIGIN= BRUKER
##OWNER= Administrator
$$ 1.72 TOPSPIN		Version 2.1
$$ 2013-09-26 21:39:30.354 -0700  Administrator@X
$$ Compression mode = diff/dup
##.OBSERVE FREQUENCY= 400.02188249412
##.OBSERVE NUCLEUS= ^1H
##.ACQUISITION MODE= SIMULTANEOUS (DQD)
##.ACQUISITION SCHEME= undefined
##.AVERAGES= 8
##.DIGITISER RES= 22
##SPECTROMETER/DATA SYSTEM= spect
##.PULSE SEQUENCE= zg30
##.SOLVENT NAME= COFFEE_meoh
##.SHIFT REFERENCE= INTERNAL, COFFEE_meoh, 1, 14.98509
##AUDIT TRAIL= $$ (NUMBER, WHEN, WHO, WHERE, PROCESS, VERSION, WHAT)
$$ ##TITLE= Audit trail, TOPSPIN		Version 2.1
$$ ##JCAMPDX= 5.01
$$ ##ORIGIN= Bruker BioSpin GmbH
$$ ##OWNER= Administrator
$$ $$ E:\/data/COFFEE/nmr/AC1521_ROEFFECT0005_8202113_Uv8gaAcAhf/10/pdata/1/auditp.txt
$$ ##AUDIT TRAIL=  $$ (NUMBER, WHEN, WHO, WHERE, PROCESS, VERSION, WHAT)
(   1,<2013-09-26 21:39:23.055 -0700>,<Administrator>,<X>,<go>,<TOPSPIN 2.1>,
      <created by zg
	started at 2013-09-26 21:38:16.846 -0700,
	POWCHK enabled, PULCHK disabled,
       configuration hash MD5:
       C8 4E 4E 5D D3 5C D8 9E 9F 52 82 E0 59 8A DE 15
       data hash MD5: 64K
       61 FE 96 57 B8 05 17 D0 11 35 1C 3A 92 5B 76 CA>)
(   2,<2013-09-26 21:39:25.977 -0700>,<Administrator>,<X>,<proc1d>,<TOPSPIN 2.1>,
      <Start of raw data processing
       efp LB = 0 FT_mod = 6 PKNL = 1 PHC0 = 0 PHC1 = 0 SI = 32K 
       data hash MD5: 32K
       81 DE 85 C2 C2 06 49 46 A1 07 C3 5D B0 1E 74 97>)
(   3,<2013-09-26 21:39:26.337 -0700>,<Administrator>,<X>,<proc1d>,<TOPSPIN 2.1>,
      <pk PHC0 = 92.32361 PHC1 = 0 
       data hash MD5: 32K
       09 99 98 6C DD DC 03 B4 C4 BE 71 BB 78 AB E1 A2>)
(   4,<2013-09-26 21:39:26.555 -0700>,<Administrator>,<X>,<proc1d>,<TOPSPIN 2.1>,
      <abs ABSG = 1 
       data hash MD5: 32K
       41 45 50 5D DB E9 7F 77 1A FC 48 0D E9 68 E1 9D>)
(   5,<2013-09-26 21:39:26.624 -0700>,<Administrator>,<X>,<proc1d>,<TOPSPIN 2.1>,
      <abs ABSG = 2 
       data hash MD5: 32K
       8A C5 37 A1 80 EA D7 78 B2 A6 22 B9 53 A8 03 FF>)
(   6,<2013-09-26 21:39:26.710 -0700>,<Administrator>,<X>,<proc1d>,<TOPSPIN 2.1>,
      <abs ABSG = 3 
       data hash MD5: 32K
       C8 BC 9A 62 24 6E FA 7B 09 A7 01 D9 0A 49 94 D6>)
(   7,<2013-09-26 21:39:26.779 -0700>,<Administrator>,<X>,<proc1d>,<TOPSPIN 2.1>,
      <abs ABSG = 4 
       data hash MD5: 32K
       2A 81 88 29 5D 50 F7 AD 47 7C 1B D0 E8 D0 26 F2>)
(   8,<2013-09-26 21:39:26.865 -0700>,<Administrator>,<X>,<proc1d>,<TOPSPIN 2.1>,
      <abs ABSG = 5 
       data hash MD5: 32K
       DF 64 6C F5 BB A5 95 BC DA F5 02 22 88 6C 29 A4>)
$$ ##END=
$$ 
$$ $$ hash MD5
$$ $$ 28 E7 DB 54 2B FF 86 D0 1F 82 BF F6 C7 78 6F C0
##$RELAX= 
##$RELAX= 
##$RELAX= 
##$RELAX= 
##$RELAX= 
##$RELAX= 
##$RELAX= 
$$ Bruker specific parameters
$$ --------------------------
##$DU= <E:\>
##$EXPNO= 10
$$ [...]
##$TP= (0..7)
150 150 150 150 150 150 150 150
##$TP07= 0
##$TPNAME0= <>
##$TPNAME1= <>
##$TPNAME2= <>
##$TPNAME3= <>
##$TPNAME4= <>
##$TPNAME5= <>
##$TPNAME6= <>
##$TPNAME7= <>
##$TPOAL= (0..7)
0.5 0.5 0.5 0.5 0.5 0.5 0.5 0.5
##$TPOFFS= (0..7)
0 0 0 0 0 0 0 0
##$TUNHIN= 0
##$TUNHOUT= 0
##$TUNXOUT= 0
##$USERA1= <user>
##$USERA2= <user>
##$USERA3= <user>
##$USERA4= <user>
##$USERA5= <user>
##$V9= 5
##$VALIST= <valist>
##$VCLIST= <CCCCCCCCCCCCCCC>
##$VD= 0
##$VDLIST= <DDDDDDDDDDDDDDD>
##$VPLIST= <PPPPPPPPPPPPPPP>
##$VTLIST= <TTTTTTTTTTTTTTT>
##$WBST= 1024
##$WBSW= 4
##$XGAIN= (0..3)
0 0 0 0
##$XL= 0
##$YL= 0
##$YMAX_a= 668324
##$YMIN_a= -569768
##$ZGOPTNS= <>
##$ZL1= 120
##$ZL2= 120
##$ZL3= 120
##$ZL4= 120
##$ABSF1= 14.98509
##$ABSF2= -5.573092
##$ABSG= 5
##$ABSL= 3
##$ALPHA= 0
##$AQORDER= 0
##$ASSFAC= 0
##$ASSFACI= 0
##$ASSFACX= 0
##$ASSWID= 0
##$AUNMP= <proc_prof1d_extract_pilot.lims>
##$AXLEFT= 0
##$AXNAME= <>
##$AXNUC= <1H>
##$AXRIGHT= 0
##$AXTYPE= 0
##$AXUNIT= <>
##$AZFE= 0.1
##$AZFW= 0.1
##$BCFW= 0
##$BC_mod= 0
##$BYTORDP= 0
##$COROFFS= 0
##$CY= 15
##$DATMOD= 1
##$DC= 0
##$DFILT= <>
##$DTYPP= 0
##$F1P= 0
##$F2P= 0
##$FCOR= 0.5
##$FTSIZE= 32768
##$FT_mod= 6
##$GAMMA= 0
##$GB= 0
##$INTBC= 1
##$INTSCL= 1
##$ISEN= 128
##$LB= 0
##$LEV0= 0
##$LPBIN= 0
##$MAXI= 10000
##$MC2= 0
##$MEAN= 0
##$ME_mod= 0
##$MI= 0
##$NCOEF= 0
##$NC_proc= -8
##$NLEV= 6
##$NOISF1= 0
##$NOISF2= 0
##$NSP= 0
##$NTH_PI= 0
##$NZP= 0
##$OFFSET= 14.98509
##$PC= 1
##$PHC0= 92.32361
##$PHC1= 0
##$PH_mod= 1
##$PKNL= yes
##$PPARMOD= 0
##$PPDIAG= 0
##$PPIPTYP= 0
##$PPMPNUM= 2147483647
##$PPRESOL= 1
##$PSCAL= 4
##$PSIGN= 0
##$PYNMP= <proc.py>
##$REVERSE= no
##$SF= 400.02
##$SI= 32768
##$SIGF1= 0
##$SIGF2= 0
##$SINO= 400
##$SIOLD= 32768
##$SPECTYP= <>
##$SREGLST= <1H.CDCl3>
##$SSB= 0
##$STSI= 32768
##$STSR= 0
##$SW_p= 8223.68421052631
##$SYMM= 0
##$S_DEV= 0
##$TDeff= 65536
##$TDoff= 0
##$TI= <>
##$TILT= no
##$TM1= 0
##$TM2= 0
##$TOPLEV= 0
##$USERP1= <user>
##$USERP2= <user>
##$USERP3= <user>
##$USERP4= <user>
##$USERP5= <user>
##$WDW= 1
##$XDIM= 32768
##$YMAX_p= 496501112
##$YMIN_p= -686013
##$CURPLOT= <Network HP LaserJet P1505>
##$CURPRIN= <$Network HP LaserJet P1505>
##$DFORMAT= <normdp>
##$LAYOUT= <+/1D_H.xwp>
##$LFORMAT= <normlp>
##$PFORMAT= <normpl>
##$SURQMSG= 1
$$ End of Bruker specific parameters
$$ ---------------------------------
##NTUPLES= NMR SPECTRUM
##VAR_NAME=  FREQUENCY,     SPECTRUM/REAL,   SPECTRUM/IMAG
##SYMBOL=    X,             R,               I
##VAR_TYPE=  INDEPENDENT,   DEPENDENT,       DEPENDENT
##VAR_FORM=  AFFN,          ASDF,            ASDF
##VAR_DIM=   32768,         32768,           32768
##UNITS=     HZ,            ARBITRARY UNITS, ARBITRARY UNITS
##FACTOR=    0.250966925370066, 1,           1
##FIRST=     8223.43324360094, 126533,       -237035
##LAST=      0,             -276384,         27836
##MIN=       0,             -686013,         0
##MAX=       8223.43324360094, 496501112,    0
$$ Real data points
##PAGE= N=1
##DATA TABLE= (X++(R..R)), XYDATA
$$ [...]
$$ plain form
19536 -13428 -268795 28283 -52871 -189897 217851 147195 -176597 179644 95307 455631
19526 455631 -267971 30331 97916 -89443 -190241 177709 -84387 -296157 73032 -143475
19515 73615 425703 -212181 -114420 188671 33283 49176 -323291 -434335 -233414 -200617
19505 -200617 -57835 200152 -185696 273744 349091 58758 -141688 -166072 -338290 246781
19494 103352 -25828 -375008 -202218 -73957 106418 74546 -168874 158645 1675 170195
19484 170195 3658 4936 -163557 -347870 -205187 -182502 -323596 -80324 292569 -107276 -85100
19473 -85100 -477808 -166195 -25146 -29890 -300889 -405358 -230638 -408377 20629 37550 -96456
19461 460575 -126226 -259706 173513 -52182 61676 80892 -298587 270338 222988 84976
$$ packed form
19536a3428k55367B8283e2871j37026B17851p0656a76597A79644q4337L60324
19526D55631b67971C0331O7585h9443j00798A77709h4387k11770G3032a43475
19515G3615L52088b12181R7761A88671C3283J5893c23291j11044K00921L2797
19505b00617e7835B00152a85696B73744P5347E8758a41688k4384j72218B46781
19494A03352b5828l49180J72790g3957A06418l1872a68874A58645A675J68520
19484A70195C658J278a63557j84313J42683K2685j41094h0324B92569a07276K2176
19473h5100l92708a66195b5146m744k70999j04469J74720j77739B0629J6921i6456
19461D60575a26226j33480A73513e2182F1676J9216b98587B70338m7350H4976
$$ plain form
19450 29281 -81862 -323639 358174 -48699 -32045 -191070 -168707 -323392 -300635 62882 -172595
19438 -38330 -250899 -239055 -158764 -96006 -100504 -293273 -554935 -23619 -80050 59960 13682
19426 -33367 -67900 130834 -77877 28455 -289474 -349814 407075 -21680 120825 -163987 55498
19414 -158579 173580 -301338 122571 281470 -67344 166088 21769 -172393 -50334 -82680
19404 -82680 58322 -177415 -207310 29728 -92876 -22011 -3623 -87068 -280538 -292634 -99168
19392 -50581 -325117 -165572 -221107 -203884 245506 -137806 -233984 -107958 -117921 -159001 -15786
19380 258634 -144084 -64174 13536 -381025 204624 257763 -2990 -246235 81606 -215912 -28539
19368 20830 -232555 -428309 18968 57472 -67961 -428195 -155479 173529 -123864 -96798
$$ packed form
19450B9281h1862k41777C58174d8699J6654j59025K2363j54685K2757F2882a72595
19438c8330k12569J1844Q0291O2758m498j92769k61662b3619n6431E9960A3682
19426c3367l4533A30834g7877B8455b89474o0340D07075b1680A20825a63987E5498
19414a58579A73580c01338A22571J58899f7344A66088B1769a72393e0334l2346
19404h2680E8322a77415k9895B9728i2876b2011c623q3445j93470j2096i9168
19392e0581k74536J59545n5535J7223B45506a37806r6178a07958r963m1080a5786
19380B58634a44084f4174A3536c81025B04624N3139b990k43245H1606b15912b8539
19368B0830b32555j95754A8968L8504f7961l60234a55479A73529a23864K7066
$$ plain form
19358 -96798 -263534 -308353 44029 -376458 42369 -419582 -103745 -28565 -213943 106971
19347 -20137 -235357 -247856 -71487 -93192 388489 459400 -121764 361435 -567801 -306652
19337 -306652 -61507 -8637 -125391 -328231 -166668 262208 -278078 -156387 -96267 -12569
19326 -114280 -215506 -29054 148140 -44074 -432003 -208015 -36395 -139600 -296401 245697
19315 258841 71687 107561 -154081 -252959 21424 9175 -20879 -217800 3518 84925 -493608
19303 46655 224955 187955 -98783 -95567 -22393 -36778 -205291 -67933 14393 27566 29708 131857
19291 131857 -87346 -233499 -188587 -22282 -10621 -134827 -61963 -52571 -209351 -429289 -181032
19279 -55322 -6672 -165703 106384 794 163246 -471214 -28781 -123394 1402 -230940 -39482
$$ packed form
19358i6798j66736m4819D4029c76458D2369d19582a03745b8565j85378A06971
19347b0137k15220j2499g1487k1705C88489P0911a21764C61435e67801K61149
19337c06652f1507h637j16754k02840J61563B62208b78078J21691O0120a2569
19326a14280j01226b9054A48140d4074l87929b08015c6395j03205j56801B45697
19315B58841G1687L5874a54081r8878B1424I175b0879j96921C518Q1407d93608
19303D6655J78300l7000i8783L216b2393j4385j68513f7933A4393J3173K142J02149
19291A31857h7346j46153M4912b2282a0621j24206f1963R392j56780k19938a81032
19279e5322f672j59031A06384G94J62452d71214b8781r4613A402b30940c9482
$$ plain form
19267 256543 270430 -164734 -431936 -189572 -15595 57486 21846 87722 -105277 168074
19256 276599 -283401 -71668 113512 74080 187072 250697 -205794 -58437 -387406 -145714
19245 -228229 -214737 162479 -75117 166101 112996 -191665 -110035 56203 -77960 1952 -127060
19233 -265907 27685 -31484 -289755 -425276 -210644 -157029 -114805 -17855 -236596 -422369
19223 -422369 207877 -93147 354420 183491 194997 -275055 112813 34477 -52099 -142267
19213 -142267 44076 138192 124809 -111541 26875 34695 -350971 87705 -127815 49258 420296
19202 420296 312696 323620 -90054 -208276 -259614 -144578 -169763 -108344 -28311 -155638 -10327
19190 -118718 -110567 -271895 75745 -84813 147625 -41625 114653 -334159 146783 -276914
$$ packed form
19267B56543J3887a64734k67202a89572a5595E7486B1846O5876a05277A68074
19256B76599b83401g1668A13512l9432J12992O3625b05794e8437l28969a45714
19245b28229J3492A62479g5117A66101n3105a91665Q1630E6203g7960A952a27060
19233b65907B7685c1484k58271j35521b10644N3615M2224a7855k18741j85773
19223d22369B07877i3147C54420j70929J1506b75055A12813C4477e2099r0168
19213a42267D4076R4116j3383a11541B6875P820c50971H7705a27815D9258L71038
19202D20296j07600J0924i0054j18222n1338J15036k5185O1419b8311j27327a0327
19190a18718Q151j61328G5745h4813A47625d1625A14653c34159A46783b76914
$$ plain form
19179 -104511 32390 -154085 -163769 -32867 -169988 -434388 152967 -149524 27731 -114465
19168 -133272 -3379 90216 180203 122530 206607 107492 -57379 -239868 84826 -99637 -172681
19157 -172681 -148474 -150650 -94063 -67575 217023 -492842 -36757 -236492 -52534 -39809 -11253
19145 -18824 -20751 -156292 237470 76978 -376399 -2509 -205661 -26275 -102139 -285961 559
19133 -113834 322041 -70847 -24660 -15862 -111792 -178597 -88136 -2671 -64317 64941 -80095 -158394
19121 -158394 -101303 68212 92030 -37255 16051 53591 -115569 -64935 -84371 -62313 -447343
19110 -447343 106589 -16251 206515 -32601 -260485 27137 46158 20131 241939 -241416
19099 263674 53413 -371090 -222518 204823 -57244 -182434 -135637 -336850 132478 -406492
$$ packed form
19179a04511C2390a54085r684c2867j37121k64400A52967a49524B7731a14465
19168a33272c379I0216Q9987n7673Q4077r9115e7379j82489H4826i9637p3044
19157a72681K4207k176N6587K6488B17023d92842c6757j99735e2534J2725a1253
19145a8824j927j35541B37470G6978c76399b509k03152b6275p5864j83822E59
19133a13834C22041g0847b4660Q798r5930o6805h8136b671o1646F4941h0095p8299
19121a58394N7091F8212K3818c7255A6051L7540a15569N0634j9436K2058l85030
19110d47343A06589a6251B06515c2601k27884B7137J9021B0131K21808b41416
19099B63674E3413c71090J48572B04823e7244j25190M6797k01213A32478d06492
$$ plain form
19088 -16273 -162824 54082 283480 -76542 123624 154215 -21770 123772 -115372 -279549
19078 -279549 129149 1125 215684 -104825 -219168 135168 -357206 -137859 62485 -221084
19067 -49949 -92358 -443987 -248503 -398729 -9001 186041 -66799 997 3344 -53685 -12856 -336668
19055 -336668 160964 -100073 -146099 -274406 -105016 -217998 -289621 -25606 124163 15193
19044 -10443 -68073 -152105 258167 -17436 65560 39303 -157126 -6201 -427559 -33804 115780
19032 -258663 -131429 -121030 -136220 213866 -164055 106495 289309 385803 -142876 29412
19021 125354 282260 -7816 186956 104164 -143144 -97178 -141528 114341 -2702 -212788 16636
19009 -309454 -3928 -117424 -122863 170102 -129260 70410 -478108 68328 -326036 -346758 -151124
$$ packed form
19088a6273j46551E4082K29398g6542A23624L0591b1770A23772a15372j64177
19078b79549A29149A125K14559a04825j14343A35168c57206a37859F2485b21084
19067d9949m2409l51629J95484j50226i001A86041f6799I97K347e3685a2856l23812
19055c36668A60964a00073m6026j28307a05016j12982p1623b5606A24163A5193
19044a0443n7630q4032B58167a7436F5560k6257a57126f201m21358c3804A15780
19032b58663J27234J0399j5190B13866a64055A06495J82814R6494a42876B9412
19021A25354J56906g816A86956q2792a43144M5966m4350A14341b702k10086A6636
19009c09454c928j13496n439A70102a29260G0410d78108F8328c26036k0722a51124
$$ plain form
18997 189541 -87142 -131019 -220029 10091 487502 -183159 -378747 -49630 270371 -20616 -97673
18986 -97673 -10245 68129 -469568 68074 -69500 -301790 -45125 -268396 78411 53514 -358786
18974 -114383 -4808 153025 -203902 -180313 -225048 146800 -163319 -508707 -113604 -106287 136794
18962 108556 180821 69865 -414512 85620 -89028 -231701 -124080 53713 -276607 -65482 -282748
18951 -282748 -88696 31898 194593 -35529 77749 -385212 -154669 -108328 164829 -165286
18940 -5394 113903 -226067 142108 -375791 -463647 -292402 -171665 -104731 -36861 251708
18929 -201817 -115104 -61308 -29915 -105060 -66538 185543 31843 191525 145557 -197555 -200540
18918 -200540 -85863 -103029 -299542 -129786 -169632 1371 -184765 -210238 2137 374716 -23019
$$ packed form
18997A89541h7142m3877q9010A0091M77411a83159j95588d9630B70371b0616p7057
18986i7673a0245F8129d69568F8074f9500k32290d5125k23271G8411k4897c58786
18974a14383d808A53025b03902K3589m4735A46800a63319l45388a13604P317A36794
18962A08556P2265F9865d14512H5620h9028j42673J07621E3713b76607f5482k17266
18951b82748h8696C1898J62695c5529G7749c85212a54669M6341A64829a65286
18940e394A13903b26067A42108c75791q7856J71245J20737O6934c6861B51708
18929b01817Q6713N3796b9915p5145L8522A85543C1843J59682m5968a97555k985
18918b00540h5863j7166j96513a29786l9846A371a84765k5473B137L72579b3019
$$ plain form
18906 -291625 -187738 121963 167062 300202 18471 474859 -106711 156786 27924 -143196
18895 24654 247303 -295274 -114708 -46722 467020 -233600 -69507 -335354 197735 -345795
18884 -61501 161966 -147305 -171814 -275013 -6045 61226 70694 175696 -243071 7681 -227248
18872 -226483 -31352 -153039 231171 -286362 -347799 62537 171427 94946 213082 36912
18861 95686 -344483 -271343 127762 -251282 -187908 -77916 -333667 67040 30979 -122452 117148
18849 -60694 236632 23074 125313 -68988 -392523 1991 -319342 85479 212218 161711 49740
18837 -78361 -63122 -37347 -266122 -294065 118096 41477 266283 -415127 -410481 177715 297237
18826 297237 107454 -285285 -223449 -60534 316996 -91419 174202 228526 249741 40675 65137
$$ packed form
18906b91625J03887A21963M5099J33140A8471M56388a06711A56786B7924a43196
18895B4654K22649b95274a14708d6722D67020b33600f9507k65847A97735c45795
18884f1501A61966a47305k4509j03199f045F1226R468J05002b43071G681b27248
18872b26483c1352j21687B31171b86362o1437F2537J08890p6481J18136C6912
18861I5686c44483P3140A27762b51282O3374g7916k55751F7040C0979a22452A17148
18849f0694B36632B3074J02239f8988l23535A991c19342H5479J26739n0507D9740
18837g8361J5239K5775k28775k7943A18096D1477K24806d15127M646A77715J19522
18826B97237A07454b85285O1836f0534C16996i1419A74202N4324K1215D0675K4462
$$ plain form
18815 65137 13743 -6676 -190044 -140388 111539 294504 171443 316552 -185469 343381
18804 -320952 -138814 -474029 207071 7679 -106367 146575 -157353 15621 -209459 157416
18793 -148221 -202826 -281130 -313189 -74107 -103171 -141598 -342059 -293301 -156972 56316 -292511
18781 -132436 -202772 -134457 -167832 110703 -293096 99887 2579 2545 -261847 -7686 -88887 -97656
18769 -97656 185691 25893 -193730 6126 86293 -67885 -71092 -62129 -245126 -172230 -76575 109892
18756 12376 -101970 -202069 -285148 295688 -113613 -51043 222072 -434443 133681 -101740
18745 -94309 -166537 97746 -207565 99417 -210612 -175298 -341956 -131246 -515101 310251
18734 -333834 -578709 -123007 212485 -208752 -62061 162359 131062 -118226 99172 241243
$$ packed form
18815F5137A3743f676j83368M9656A11539J82965j23061J45109a85469C43381
18804c20952a38814l35215B07071G679a06367A46575a57353A5621b09459A57416
18793a48221n4605p8304l2059g4107k9064l8427k00461M8758J36329E6316b92511
18781a32436p0336O8315l3375A10703b93096I9887B579l4b61847g686q1201q769
18769i7656A85691B5893a93730F126Q0167f7885l207Q963j82997P2896g6575A09892
18756A2376a01970j00099q3079B95688a13613e1043B22072d34443A33681a01740
18745i4309p2228I7746b07565I9417b10612L5314j66658a31246l83855C10251
18734c33834k44875a23007B12485b08752f2061A62359l1297a18226I9172J42071
$$ plain form
18724 241243 77583 -92868 126005 -5045 -281348 -172400 -313146 -347124 73179 -101594 -128261
18713 -128261 -289981 135299 99003 36210 -181810 -376149 94872 -106531 78375 -934 350234
18701 -166986 -66500 -255935 5238 101848 -23554 -10544 108842 -21226 19037 -313022 -93984
18689 -349020 -273328 95320 180682 177073 229441 -215497 206201 -457114 403133 -64854 -190016
18678 -190016 -132706 -93050 41321 212341 -46225 284444 -169708 -254993 -255821 -162745 -55946
18666 13216 -460996 168109 -166531 119636 -132098 -249897 -255084 -18261 245190 -62139
18655 289409 48208 -15431 36302 -156185 201364 -37635 -171793 52965 -102574 -174306 105108
18643 -405560 -145224 142620 -176352 -212463 -174733 -96805 -167481 -115867 -88129 64741 53090
$$ packed form
18724B41243G7583i2868A26005e045k76303J08948j40746l3978G3179a01594k6667
18713a28261j61720A35299l6296C6210a81810j94339I4872a06531G8375i34C50234
18701a66986f6500j89435E238R6610b3554a0544A08842b1226A9037c13022i3984
18689c49020P5692I5320Q5362l609N2368b15497B06201d57114D03133f4854j25162
18678a90016N7310L9656D1321J71020d6225B84444a69708q5285q28R3076e5946
18666A3216d60996A68109a66531A19636a32098j17799n187a8261B45190f2139
18655B89409D8208a5431C6302a56185B01364c7635j34158E2965a02574p1732A05108
18643d05560a45224A42620a76352l6111L7730P7928p0676N1614K7738F4741j1651
$$ plain form
18632 53090 -105859 73248 -81516 -85469 63346 -196694 -103759 221876 39024 62834 216831
18621 216831 12388 -316469 8591 -148311 60964 109382 -270827 -200748 -155155 -80758 74449
18609 103937 -187973 -151854 -20574 -152248 -171831 -110424 53369 -140194 118011 21117 187226
18598 187226 -59532 -298921 -211056 -129190 -97622 196033 165720 159868 15672 -146057 23194
18586 -352451 -172633 -141874 60773 -28930 -181985 -28530 -214582 -377495 -254613 -339211
18576 -339211 62624 -149653 133545 -55432 -109900 87616 197295 -355338 90776 -116463
18565 -305619 -125281 204310 -347259 -178126 -135180 219472 -199118 -32403 -41466 -377673
18555 -377673 -2656 91460 6422 131100 68367 -69164 -241036 -49254 -28873 -112984 -408542
$$ packed form
18632E3090a05859G3248h1516l953F3346a96694R2935B21876C9024K3810J53997
18621B16831A2388c16469H591a48311F0964M8418b70827P0079M5593P4397G4449
18609A03937a87973L6119b0574j31674j9583O1407E3369a40194A18011B1117J66109
18598A87226e9532k39389Q7865Q1866L1568A96033l0313n852A5672a46057B3194
18586c52451a72633L0759F0773b8930j53055b8530j86052j62913J22882q4598
18576c39211F2624a49653A33545e5432n4468H7616J09679c55338I0776a16463
18565c05619a25281B04310c47259J69133M2946B19472a99118c2403r063l36207
18555c77673b656I1460F422J24678o2733f9164j71872d9254K0381q4111k95558
$$ plain form
18544 -408542 -40221 -145401 -159962 328959 -19646 -439410 21693 -167035 -80336 120073
18533 -402815 -64841 -333366 70641 -150020 -361853 356479 152884 -51355 -202551 -64967
18522 -19068 -451712 -243216 112712 262497 -148777 -82656 -51396 -153669 149849 23628
18511 -152562 -141231 144769 -194104 180798 -241441 185885 40246 337388 113855 162176
18501 162176 -39274 739 -478307 -187425 15170 -27720 -89968 -102677 -254496 -10648 183269
18489 -256468 -392390 54273 66739 -91083 -167391 66968 40115 -43878 35882 -119321 -102013
18478 -102013 237135 253818 -126097 -110653 -7743 -117016 169365 -186584 -139654 -120731 102378
18466 118841 -25388 30899 -540137 -226347 37341 -48456 -286690 -68 350722 254239 144565
$$ packed form
18544d08542d0221j05180j4561C28959a9646m19764B1693a67035h0336A20073
18533d02815f4841k68525G0641a50020k11833C56479A52884e1355j51196f4967
18522a9068m32644K08496A12712J49785a48777O6121L1260j02273A49849B3628
18511a52562J1331A44769a94104A80798b41441A85885D0246K97142A13855M8321
18501A62176c9274G39d78307a87425A5170b7720o2248j2709j51819a0648A83269
18489b56468j35922E4273J2466i1083p6308F6968k6853d3878C5882a19321J7308
18478a02013B37135J6683a26097J5444g743j09273A69365a86584M6930J8923A02378
18466A18841b5388C0899e40137b26347C7341d8456k38234f8C50722r6483j09674
$$ plain form
18455 144565 -113788 -190533 -159694 -57754 -331578 -21699 -309298 80637 267089 44305 -136271
18443 -100198 5687 -38795 -155986 245568 -38299 254897 55010 391582 145539 273066
18433 273066 5995 -174404 -294422 25856 83031 -221692 -76257 -61242 -3100 -220650 -74371
18421 -113684 -119219 37870 -175867 46022 126205 -105788 157288 100207 -249529 66591 64623
18410 64623 57114 -212999 -295719 -17026 -125380 -36861 235674 -59248 86759 3296 -3910 104153
18397 172045 -117626 209450 -12386 177790 158458 150296 -292574 -73325 -13769 -14513 -279584
18386 -279584 -148141 -209942 10557 406646 -347592 -116497 -110950 -14488 197725 -58958 198146
18374 252118 265831 108636 81613 32591 77911 -282778 36956 33395 -63959 188861 -473914
$$ packed form
18455A44565a13788p6745L0839e7754k73824b1699k87599H0637J86452D4305a36271
18443a00198E687c8795j17191B45568c8299B54897E5010L36572A45539J27527
18433B73066E995a74404j20018B5856N7175b21692g6257J5015c100k17550g4371
18421a13684n535C7870a75867D6022Q0183a05788A57288n7081b49529F6591j968
18410F4623p509b12999q2720a7026j08354c6861B35674e9248H6759C296c910A04153
18397A72045a17626B09450a2386A77790j9332q162b92574g3325a3769p44k65071
18386b79584J31443o1801A0557L96089c47592a16497N547a4488A97725e8958A98146
18374B52118J3713A08636k7023C2591M5320b82778C6956l561f3959A88861d73914
$$ plain form
18362 -40613 329814 -43758 6522 102513 -451650 95308 239514 9999 -229048 -45111 -331513
18351 -331513 -222516 -130829 -323499 -130890 -82059 205575 193373 -301215 -228143 86820
18340 86564 -97390 169606 -99899 -50165 79348 67925 33258 -148789 -81684 -108652 -350031
18329 -350031 272423 123638 143426 40383 -16269 -306258 -43 34300 -280812 -323635 601076
18317 -422162 48050 -176243 -269996 -53396 -321652 -134773 -16070 -189696 -89199 -35312 -39381
18306 -39381 -58490 165960 -15085 -268393 -126679 116721 -22919 -107269 12589 -68380 -335854
18295 -335854 25581 -296507 -315643 -174867 202485 12356 -402784 -206239 99774 -89374
18284 -262781 -45328 138400 -193241 -152239 159136 -435554 195680 -167851 -91400 -95543
$$ packed form
18362d0613C29814d3758F522R5991d51650I5308J44206I999b29048d5111k86402
18351c31513J08997R1687j92670a30890M8831B05575j2202c01215P3072H6820
18340H6564i7390A69606i9899M9734G9348j1423C3258a48789O7105k6968k41379
18329c50031B72423A23638J9788D0383a6269k89989d3C4300b80812m2823F01076
18317d22162D8050a76243r3753e3396k68256a34773a6070j73626h9199c5312m069
18306c9381j9109A65960a5085k53308a26679A16721b2919q4350A2589f8380k67474
18295c35854B5581b96507j9136J40776B02485A2356d02784J96545I9774h9374
18284b62781d5328A38400a93241M1002A59136d35554A95680a67851P6451m143
$$ plain form
18274 -95543 100821 -320708 110686 -235460 -66760 -74300 134016 105111 -370606 -263607
18264 -263607 -221011 -412619 -129752 196005 -1987 -354670 -166144 60234 144941 12829 -223959
18252 112088 71085 -143652 -288944 155270 31233 -197366 -321819 -291939 201465 28524
18241 41111 246192 313659 -316010 198332 -24978 -316683 196682 -35836 -253830 244769
18230 9101 16183 -274170 -30622 -79590 224059 212134 -330057 -220757 -127684 -170105 375513
18218 -461284 -74536 1975 99203 -331980 -233043 208397 -217903 10604 -292199 219001 -192033
18206 254909 132073 -53576 7745 196892 -18048 72851 -157853 -149076 59079 166560 -151803
18194 315262 -187604 -259005 26688 84688 -352100 333826 -251899 -33391 -35275 -360002 94673
$$ packed form
18274i5543A00821c20708A10686b35460f6760p540A34016k8905c70606J06999
18264b63607M2596j91608a29752A96005a987l52683a66144F0234Q4707A2829b23959
18252A12088m1003a43652j45292A55270C1233a97366j24453K9880B01465B8524
18241D1111K05081O7467c16010A98332b4978k91705A96682c5836k17994B44769
18230I101P082b74170c0622m8968B24059j1925c30057J09300R3073m2421C75513
18218d61284g4536A975R7228c31980R8937B08397b17903A0604b92199B19001a92033
18206B54909j22836e3576G745J89147a8048G2851a57853Q777E9079J07481a51803
18194C15262a87604p1401B6688N8000c52100C33826b51899c3391j884l24727I4673
$$ plain form
18182 148021 -266367 345913 -255751 -229792 -286177 98282 35268 38499 -152657 -74872 38964
18170 61425 -101938 -30428 24506 -91556 111135 48186 -104804 341586 -242817 -311919 249239
18158 70917 198568 105575 -13120 -148997 259408 -109753 -70987 -161295 -20967 -253751 -98916
18146 -15011 -19726 20897 -39432 -175308 310943 -212414 -25248 54846 -75395 -288588 546
18134 101403 -125792 -217107 -275825 -135629 -196836 -186490 -27973 -171943 35691 -168058 -102547
18123 -102547 289667 -286709 -186133 -21521 -208626 63918 -226238 -266932 100028 -149853
18112 -138938 -50975 6257 -92946 -51126 143740 21061 208728 45471 94038 -438889 354148
18100 193594 64320 -16931 48449 -92051 6699 66156 -117162 -333289 140955 -152692 195683
$$ packed form
18182A48021b66367C45913b55751K5959n6385I8282C5268L231a52657g4872C8964
18170F1425a01938c0428B4506i1556A11135D8186a04804C41586b42817o9102B49239
18158G0917J27651r2993a3120j35877B59408a09753L8766r0308b0967k32784i8916
18146a5011m715B0897c9432j35876C10943b12414b5248E4846g5395k13193E46
18134A01403a25792r1315n8718a35629o1207J0346b7973j43970C5691a68058O5511
18123a02547B89667b86709J00576b1521j87105F3918b26238m0694A00028a49853
18112a38938e0975F257i2946M1820A43740B1061J87667D5471M8567d38889C54148
18100A93594F4320a6931D8449i2051F699N9457a17162k16127A40955a52692A95683
$$ plain form
18088 -8726 8660 -108724 73698 -19699 72085 -20229 52362 201859 127955 -188029 361692
18076 13193 -160048 -119702 233968 -150525 90559 -233533 -16665 -278561 -86474 -332938
18066 -332938 -8265 122196 51726 -19391 7499 -145127 -96878 65265 137499 -12791 -25534
18055 -25534 107224 29551 173463 -2099 -4576 -375357 -169213 -35891 -287280 -95153 78562
18043 30451 -181791 188443 48960 139884 -216437 440793 -229314 -5885 179513 -227703
18032 93973 21777 -39085 -124853 181392 -247172 153850 -394153 5980 455213 115118 -32326
18020 5925 101093 -226185 191609 82344 65574 -41753 -54972 363040 -22716 -27806 61833
18008 -20789 -60905 247328 -347308 74764 164730 -55142 12935 126759 -225449 156537 -189114
$$ packed form
18088h726H660a08724G3698a9699G2085b0229E2362J49497p3904a88029C61692
18076A3193a60048M0346B33968a50525I0559b33533a6665k61896h6474k46464
18066c32938h265A22196E1726a9391G499a45127M8249F5265P2234a2791j2743
18055b5534A07224B9551J43912b099k477l70781a69213c5891k51389i5153G8562
18043C0451a81791A88443D8960R0924b16437D40793b29314e885A79513b27703
18032I3973B1777c9085q5768A81392b47172A53850c94153E980M49233A15118c2326
18020E925R5168b26185A91609H2344j6770d1753j3219C63040b2716n090F1833
18008b0789m0116B47328c47308G4764Q9966e5142A2935J13824b25449A56537a89114
$$ plain form
17996 244151 165917 -200 -40640 -35036 231472 -180107 -146125 -73570 284292 83773 22767
17984 -19845 -77045 -66750 151778 -188129 76134 -147091 -63010 -53372 -180735 -26370 -364708
17973 -364708 -108181 -390689 -410902 27025 134694 27565 -248576 163171 -170245 -79919
17962 -191136 325871 13660 -203624 -373180 333729 59208 -297634 24096 -129658 311490
17951 -292200 -150284 -103394 -197386 130534 -141909 15856 -45388 71024 106140 -182778 -230759
17940 -230759 31022 -286241 204122 -53393 -132030 -121663 -112838 -312019 347031 -71420 197262
17928 50399 -55210 -225135 -235157 26655 107881 115539 -124077 254053 -182281 181491 -193660
17916 227704 146767 -168701 -35185 -176531 238248 101234 -26707 69243 512742 -12944
$$ packed form
17996B44151p8234b00m0440N604B31472a80107L3982P2555B84292H3773B2767
17984a9845n7200J0295A51778a88129G6134a47091f3010R638j27363b6370l38338
17973c64708a08181k82508k0213B7025J07669B7565b48576A63171a70245g9919
17962a91136C25871A3660b03624j69556C33729E9208b97634B4096a29658C11490
17951b92200J41916M6890r3992A30534a41909A5856d5388G1024L5116a82778m7981
17940b30759C1022b86241B04122e3393p8637J0367Q825j99181C47031g1420A97262
17928E0399e5210j69925j0022B6655Q1226P658a24077B54053a82281A81491a93660
17916B27704q0937a68701c5185j41346B38248A01234b6707F9243M43499a2944
$$ plain form
17905 322542 98384 -150818 -227530 28932 -147969 77350 -37641 -100665 -194128 -85541 -94664
17894 -94664 -224805 270594 -202393 -85641 152208 29198 30107 -133776 -305252 111676 91725
17883 91725 94772 204521 229995 -21112 -20503 40046 21444 138999 -302182 -121710 -159391
17872 -159391 170700 86267 128140 -199727 140984 76370 -73564 473962 -17851 -19969 -91356
17861 -91356 -34840 383310 -223457 -60971 46449 -184510 136113 280012 -192686 -205632
17851 -205632 -71671 13824 212672 -146219 174869 -144416 -170322 -142313 310584 -152186
17840 200194 -147036 108787 289065 29803 115982 -335129 221885 -116998 -176340 166931
17829 174237 -375860 -148052 -54289 18368 67381 10401 314128 228013 -10125 78009 -69357
$$ packed form
17905C22542I8384a50818p6712B8932a47969G7350c7641o3024r3463h5541r123
17894i4664j30141B70594b02393h5641A52208B9198R09a33776j71476A11676j9951
17883I1725L047J09749K5474b1112O09D0046j8602J17555c02182a21710l7681
17872a59391A70700q4433M1873a99727A40984o4614g3564D73962a7851k118p1387
17861i1356c4840C83310b23457f0971D6449a84510A36113J43899a92686j2946
17851b05632g1671A3824J98848a46219A74869a44416k5906K8009C10584a52186
17840B00194a47036A08787J80278B9803Q6179c35129B21885a16998n9342A66931
17829A74237c75860a48052e4289A8368M9013A0401L03727q6115a0125G8009f9357
$$ plain form
17817 -415931 -141289 -31668 -238704 61427 -86123 367840 155788 -86819 75108 64688 15113
17805 -41400 206950 -78737 -63524 -5069 -262394 -140521 197577 -34752 202586 40117 56842
17794 56842 407445 112057 -123650 -92918 -155331 -67464 179566 -13170 103173 -173455
17783 -191424 -178967 -182216 300049 156240 114125 -401900 -422224 355391 -68002 185929 -70788
17771 53333 -92368 113912 4456 114028 223985 314433 48135 204954 -142725 100664 82674
17760 82674 -86355 -196821 85235 109243 91930 181610 -303668 40847 219687 -335001 -4228
17748 -105988 117052 207546 633823 -194781 8305 247740 95690 -221348 -155913 195847
17737 -241204 -99883 -294104 4829 -178886 130914 337187 -189299 28059 -240654 -57555
$$ packed form
17817d15931a41289c1668k07036F1427h6123C67840A55788h6819G5108j0420A5113
17805d1400B06950g8737J5213e069k57325J21873A97577c4752B02586D0117J6725
17794E6842L50603A12057a23650L0732o2413f7464A79566a3170A03173a73455
17783a91424J2457l249C00049j43809m2115d01900k0324C55391f8002A85929g0788
17771E3333i2368A13912D456J09572J09957R0448D8135J56819a42725A00664j7990
17760H2674h6355j10466H5235K4008j7313Q9680c03668D0847J78840c35001d228
17748a05988A17052R0494M26277a94781H305K39435I5690b21348O5435A95847
17737b41204i9883j94221D829a78886A30914K06273a89299B8059b40654e7555
$$ plain form
17726 436535 -8681 -1390 -145073 -471096 -140573 -337664 200447 70254 29381 -28767 -150534
17715 -150534 -291645 90168 281468 -120782 169041 -31344 -78439 -179903 60851 221373
17705 221373 339947 306634 134138 268241 40064 -308548 -87004 -28533 43558 -160401
17694 63700 -185574 183281 -78331 -44293 18373 64421 -59150 -138527 -127543 70423 -199167
17682 58391 -44007 134546 109434 -80055 237921 -101247 303840 -91718 -38471 152510 410811
17671 410811 -164719 -201942 247110 154822 101959 -281685 -139385 42159 2712 215114 203957
17660 203957 -34765 141394 138155 -43569 24229 226725 342951 54588 178096 -130278 40423
17648 -33998 -38354 169155 309919 -24522 26563 -177259 -381608 167112 166627 14650 119293
$$ packed form
17726D36535h681a390j43683l26023a40573j97091B00447G0254B9381b8767j21767
17715a50534j41111I0168J91300a20782A69041c1344m7095j01464F0851J60522
17705B21373J18574l3313A34138J34103D0064c08548h7004b8533D3558a60401
17694F3700a85574A83281g8331L4038A8373M6048e9150p9377J0984G0423a99167
17682E8391d4007A34546k5112h0055B37921a01247C03840i1718c8471A52510K58301
17671D10811a64719l7223B47110r2288n2863b81685a39385D2159B712K12402j1157
17660B03957c4765A41394l239d3569B4229K02496J16226E4588J23508a30278D0423
17648c3998m356A69155J40764b4522B6563a77259k04349A67112m85A4650J04643
$$ plain form
17637 119293 -83973 206591 142553 233723 -111168 -178513 -59386 171667 -98226 15683 -184608
17625 -23477 4842 438963 -227177 138179 108365 -47802 96596 -27307 -115922 -70976 -448811
17614 -448811 -54781 -77464 -53013 116719 -186296 210077 -62330 62898 9068 3617 -307151
17602 81521 -157405 -239312 -131228 -22716 101278 -230546 268665 146975 263762 341407
17592 341407 175245 78230 -138339 22513 161607 80157 114889 70302 105097 -41434 287773
17580 -100055 189473 190626 140632 -275068 -43574 -182911 -41547 290488 -393359 192771
17569 -243380 -55041 104640 38919 -105884 -46051 136950 -258871 29749 75216 -54427 -51108
17558 -51108 113213 -10480 231097 -10349 -42426 98619 86372 16309 -88889 49551 70578
$$ packed form
17637A19293h3973B06591o4038R1170a11168o7345e9386A71667i8226A5683a84608
17625b3477D842M34121b27177A38179k9814d7802I6596b7307q8615M4946l77835
17614d48811e4781k2683K4451A16719a86296B10077f2330F2898I068C617c07151
17602H1521a57405q1907J08084b2716A01278b30546B68665j21690J16787P7645
17592C41407j66162G8230a38339B2513J39094H0157L4732m4587L4795d1434B87773
17580a00055A89473J153m9994b75068d3574j39337d1547B90488c93359A92771
17569b43380e5041A04640C8919a05884d6051A36950b58871B9749M5467e4427L319
17558e1108A13213a0480B31097a0349l2077I8619j2247A6309h8889D9551K1027
$$ plain form
17547 70578 273421 125684 -24994 274379 141149 218246 -31465 6211 -96888 -23318 -141398
17536 -141398 -35049 -189068 -44405 -409236 96124 15877 -43254 250558 -187253 355167
17525 100596 -131242 20571 232794 59826 268759 -43817 306027 124523 117263 19076 133395
17514 133395 274276 21680 555535 181558 39832 694404 200728 287838 -339037 202395
17503 -32665 -47538 -29045 -67484 -140478 -50833 -29773 -78882 263991 -177574 -61394 101766
17491 30527 -79098 204953 125507 -220957 -67831 -79650 -46324 -168402 121754 66931 -253717
17479 36688 165170 146786 387291 325128 197456 138020 157820 190524 363706 540304 423813
17468 423813 277508 -77878 321614 94361 -71555 -160975 256217 407142 119573 112605 -119678
$$ packed form
17547G0578K02843A25684b4994B74379j33230P7097c1465F211i6888b3318j18080
17536a41398c5049j54019d4405l64831I6124A5877d3254B50558a87253C55167
17525A00596a31242B0571K12223E9826K08933d3817C06027A24523p260A9076J14319
17514A33395J40881B1680N33855A81558C9832O54572B00728Q7110c39037B02395
17503c2665j4873J8493l8439p2994e0833K1060m9109B63991a77574f1394A01766
17491C0527g9098B04953p9446b20957f7831j1819L3326j22078A21754n4823b53717
17479C6688J28482j8384K40505o2163j27672n9436J9800L2704J73182J76598j16491
17468D23813j46305g7878C21614I4361g1555q9420B56217J50925A19573o968a19678
$$ plain form
17456 138733 356058 328365 527656 4364 731200 226541 535392 220371 284559 259831
17446 259831 417862 -20125 329977 709690 31088 198589 110121 140751 -62275 262115
17435 185428 393607 4509 188202 396656 62568 66163 -256443 296237 274731 289098 -75739
17423 154465 392897 515115 6095 37374 437685 252415 254609 390321 332910 575328 328633
17412 328633 314993 407603 192833 429025 356754 160380 371459 -72061 -9672 127448 158524
17401 158524 202756 26430 59689 612459 -225068 277241 -96596 128761 129269 63884 83158
17390 83158 74058 200267 264401 -15748 332731 149728 116722 46221 400351 39261 277366
17379 277366 79706 35407 107755 -44582 -205620 22134 110799 353521 -202890 -38153 293788
$$ packed form
17456A38733K17325k7693J99291D364P26836B26541L08851B20371O4188k4728
17446B59831J58031b0125C29977L79713C1088J67501q8468L0630f2275B62115
17435A85428K08179D509J83693K08454F2568L595b56443B96237k1506J4367g5739
17423A54465K38432J22218F095L1279M00311j85270K194J35712n7411K42418k46695
17412C28633j3640R2610A92833K36192p2271A60380K11079g2061i672A27448L1076
17401A58524M4232B6430L3259N52770b25068B77241i6596A28761N08F3884J9274
17390H3158r100J26209O4134a5748C32731A49728l3006D6221L54130C9261K38105
17379B77366G9706C5407P2348d4582j61038B2134Q8665K42722b02890c8153B93788
$$ plain form
17367 -14279 -26973 121005 309009 492541 160874 -248565 23224 99943 302806 119610
17356 265349 134915 911 -138329 92815 109386 -223163 201963 -31681 179626 215572 47039
17344 243413 178100 -206598 -258940 707722 133463 10616 -71077 -14444 -76118 27284 88815
17333 88815 -47706 70586 148227 44519 111093 148195 167815 -5526 336495 453511 194983
17321 83053 -100100 272226 150945 -194439 -23573 326230 293143 -98473 299771 43576
17310 135246 302466 -332418 121936 -16969 -122075 142374 241086 285780 -131428 167993
17299 180932 55479 76341 270121 63318 -117085 351389 404869 -73389 313976 128923
17288 359140 182414 2741 -44131 153890 102202 -268142 166142 227065 -78152 219947 322451
$$ packed form
17367a4279j2694A21005J88004J83532A60874b48565B3224P6719K02863A19610
17356B65349j30434I11a38329I2815J6571b23163B01963c1681A79626L5946D7039
17344B43413o5313b06598n2342G07722A33463A0616g1077a4444o1674B7284O1531
17333H8815d7706G0586P7641D4519O6574L7102J9620e526C36495J17016A94983
17321H3053a00100B72226j21281a94439b3573C26230l3087i8473B99771D3576
17310A35246J67220c32418A21936a6969j05106A42374R8712M4694a31428A67993
17299A80932E5479K0862J93780F3318a17085C51389N3480g3389C13976A28923
17288C59140j76726B741d4131A53890n1688b68142A66142O0923g8152B19947J02504
$$ plain form
17277 322451 -109098 -104005 6405 300727 376079 -30715 203367 429331 121553 61300 265973
17266 265973 117941 328237 148105 17138 -56933 322082 -207896 179647 139300 -213200
17255 142768 93652 86625 239767 111269 278794 44566 72699 369400 406407 -160247 -26951
17243 292899 -67173 53063 324178 163786 476831 340554 187772 -83403 160181 345973
17233 345973 375762 348144 314224 205776 382306 449809 304277 520446 392739 99827
17222 192285 145011 387037 -66809 77975 318688 539747 106525 464825 5413 -213720
17211 350365 183620 -89757 311271 305605 69052 279011 198463 379090 219901 300401 147258
17199 -81003 86809 288743 597943 319134 443332 239679 196648 293293 181442 -109907
$$ packed form
17277C22451a09098N093F405K94322P5352c0715B03367K25964A21553o0253K04673
17266B65973A17941K10296A48105A7138e6933C22082b07896A79647m0347b13200
17255A42768m9116p027J53142A11269J67525D4566K8133K96701L7007a60247b6951
17243B92899f7173E3063K71115j60392L13045j36277j52782h3403A60181J85792
17233C45973K9789k7618l3920j08448J76530O7503j45532K16169j27707I9827
17222A92285m7274K42026f6809G7975K40713K21059A06525L58300E413b13720
17211C50365j66745h9757C11271n666F9052K09959q0548J80627j59189Q0500A47258
17199h1003H6809K01934L09200k78809J24198k03653m3031R6645j11851a09907
$$ plain form
17188 64983 566628 214710 248326 332826 112645 225858 209301 350607 516133 279865
17178 279865 392728 146664 162050 341779 -5046 73336 252050 176003 211997 239597 460817
17167 460817 81109 546226 376243 537321 -81489 31630 368233 246449 371749 549017
17157 549017 120013 220935 246584 141124 96986 323773 196370 259631 233039 186405
17147 186405 377236 213868 683120 314475 4517 230371 168430 395781 56441 303222
17137 303222 170118 506883 289762 385485 130251 299514 571632 116516 248089 156848
17127 156848 401274 224502 27478 359559 452029 41562 252122 491943 205955 494726
17117 494726 321404 584358 159411 172170 420904 300474 383418 255117 517834 393833
$$ packed form
17188F4983N01645B14710L3616Q4500A12645J13213j6557J41306J65526k36268
17178B79865J12863A46664J5386J79729e046G3336J78714p6047L5994K7600K21220
17167D60817H1109M65117j69983J61078h1489C1630L36603j21784J25300J77268
17157E49017A20013J00922K5649j05460m4138K26787j27403O3261k6592m6634
17147A86405J90831j63368M69252C14475D517K25854o1941K27351E6441K46781
17137C03222j33104L36765k17121R5723A30251J69263K72118A16516J31573r1241
17127A56848K44426j76772B7478L32081R2470D1562K10560K39821B05955K88771
17117D94726j73322K62954A59411J2759K48734j20430Q2944j28301K62717j24001
$$ plain form
17107 393833 285751 358067 813050 294380 581144 370746 302915 324445 378084 614341
17097 614341 435525 374821 609234 588681 269141 616549 473980 139259 593367 359918
17087 359918 359045 171454 499238 524760 511709 433740 36197 382434 440715 528522 603473
17076 603473 230047 446267 554529 258402 179570 479028 198158 777340 577569 511112
17066 511112 451501 456457 521885 288405 347799 358073 477224 401913 306711 567496 583545
17055 583545 515586 401458 241857 595505 255743 559167 812061 321851 688737 457367
17045 457367 663954 678057 450093 575517 502784 794400 686480 545402 555119 270713
17034 352079 461365 516531 568998 437834 422101 774613 647643 504623 278913 502709
$$ packed form
17107C93833j08082P2316M54983B94380K86764k10398o7831K1530N3639K36257
17097F14341j78816o0704K34413k0553B69141L47408j42569A39259M54108k33449
17087C59918q73A71454L27784K5522j3051p7969C6197L46237N8281Q7807P4951
17076F03473B30047K16220J08262B58402p8832K99458A98158N79182j99771o6457
17066E11112n9611M956O5428k33480N9394J0274J19151p5311r5202K60785J6049
17055E83545o7959j14128j59601L53648B55743L03424K52894C21851L66886k31370
17045D57367K06587J4103k27964J25424p2733K91616j07920j41078R717B70713
17034C52079J09286N5166N2467j31164j5733L52512j26970j43020k25710K23796
$$ plain form
17024 502709 661654 340921 638800 370680 567586 594294 369840 562696 506210 767380
17014 767380 885268 580530 1011899 711330 913073 446379 611993 753740 755221 761682
17004 761682 564873 633690 777385 1063644 757409 1048684 1125205 774787 1034183 541409
16994 541409 786344 939441 655293 799334 827123 937730 587863 503051 720858 602468
16984 602468 644987 1010570 881470 643971 838017 681911 866043 964994 591153 589865
16974 589865 798081 1167523 1050126 864648 1063945 734975 856933 1098541 639489 848095
16964 848095 825160 815749 837147 1030757 890421 607745 1001073 900441 1016860 771340
16954 771340 1250544 1078247 1194593 1090009 1053900 1018554 1069048 782099 1096533 1232971
$$ packed form
17024E02709J58945l20733K97879k68120J96906K6708k24454J92856n6486K61170
17014G67380J17888l04738M31369l00569K01743D46379J65614J41747J481O461
17004G61682j96809O8817J43695K86259l06235K91275P6521l50418K59396m92774
16994E41409K44935J53097k84148J44041K7789J10607l49867q4812K17807j18390
16984F02468M2519L65583j29100k37499J94046j56106J84132R8951l73841j288
16974E89865K08216L69442j17397j85478J99297l28970J21958K41608m59052K08606
16964H48095k2935r411K1398J93610j40336k82676L93328j00632J16419k45520
16954G71340M79204j72297J16346j04584l6109l5346N0494k86949L14434J36438
$$ plain form
16944 1232971 1021922 789688 1144514 1078759 1117687 1355062 1568649 1073016 1181529 1141807
16934 1141807 1050265 1147234 1420568 1421706 1155835 1208325 901354 1229437 1369447 1490608
16924 1490608 1373414 1290526 1361040 1218369 1252304 1271931 1387529 1546973 1359386 1596540
16914 1596540 1802967 1176973 1544872 1326041 1251292 1217047 1476531 1563236 1491443 1989232
16904 1989232 1861833 1457314 1820809 1554404 1735850 1854050 1722594 1856566 1490226
16895 1490226 1458344 1872473 1972557 1803588 1833338 1696295 1956408 1819388 2027399 1963752
16885 1963752 1822357 2058928 2398545 2162219 1960403 2260782 2511730 2446709 2264227 2393050
16875 2393050 2385367 2348552 2178987 2516692 2551901 2856603 2355773 2703428 2283151 2313561
$$ packed form
16944A232971k11049k32234L54826o5755L8928K37375K13587m95633J08513l9722
16934A141807r1542R6969K73334J138k65871N2490l06971L28083J40010J21161
16924A490608j17194q2888P0514j42671L3935J9627J15598J59444j87587K37154
16914A596540K06427o25994L67899k18831p4749l4245K59484Q6705p1793M97789
16904A989232j27399m04519L63495k66405J81446J18200j31456J33972l66340
16895A490226l1882M14129J00084j68969K9750j37043K60113j37020K08011o3647
16885A963752j41395K36571L39617k36326k01816L00379K50948o5021j82482J28823
16875B393050p683l6815j69565L37705L5209L04702n00830L47655m20277L0410
$$ plain form
16865 2313561 2667452 2502887 2616307 2795948 2909424 2751928 2844506 3151075 3270357 3046849
16855 3046849 2900304 3028415 2894518 2835306 2986263 3429640 3057689 3139101 3056599 3496526
16845 3496526 3476550 3643349 3140598 3380322 4217969 3571994 3740057 3420230 3565749 4038813
16835 4038813 4414092 4046929 4114847 4231781 4509818 4300853 4418179 4450585 4578177 4668397
16825 4668397 4928841 4715780 4769188 5030207 5099852 5303555 5419318 5752833 5201000 5314980
16815 5314980 5457051 5315410 5666726 6162687 6301349 6157086 6429846 6825925 6933662
16806 6933662 6845490 6760503 6635368 7295133 7443312 7514733 7891159 7844276 7905406 8060272
16796 8060272 8481571 8504414 9145940 8995053 9463260 9994039 9948452 9909852 10457593 10714648
$$ packed form
16865B313561L53891j64565J13420J79641J13476j57496R2578L06569J19282k23508
16855C046849j46545J28111j33897n9212J50957M43377l71951Q1412q2502M39927
16845C496526j9976J66799n02751K39724Q37647o45975J68063l19827J45519M73064
16835D038813L75279l67163O7918J16934K78037k08965J17326L2406J27592R0220
16825D668397K60444k13061N3408K61019O9645K03703J15763L33515n51833J13980
16815E314980J42071j41641L51316M95961J38662j44263K72760L96079J07737
16806F933662q8172q4987j25135O59765J48179P1421L76426m6883O1130J54866
16796H060272M21299K2843O41526j50887M68207N30779m5587l8600N47741K57055
$$ plain form
16786 10714648 11094115 11355737 11884565 12060018 12477302 12473376 13098356 13394868 13647696 14350140
16776 14350140 14826942 15152730 15523444 16098418 16871457 17684199 17971964 18559782 19196725
16767 19196725 19712745 20427777 21262614 22471631 22681063 24289699 24539533 25964805 26844065
16758 26844065 28024786 29315467 30932499 31929703 33672769 35236066 36460805 38190157
16750 38190157 40388144 42223802 44228156 46943372 49427400 52355131 55473887 58579359
16742 58579359 61662098 65065028 69172795 73386547 78089815 82811263 88372609 93925001
16734 93925001 99570141 106976711 113489246 120678231 128664577 137098075 145666408 154305221
16726 154305221 163291521 172388872 181523393 189938441 197771719 204822574 210514878 215058865
$$ packed form
16786A0714648L79467K61622N28828J75453M17284l926O24980K96512K52828P02444
16776A4350140M76802L25788L70714N74974P73039Q12742K87765N87818O36943
16767A9196725N16020P15032Q34837J209017K09432J608636K49834J425272Q79260
16758B6844065J180721J290681J617032R97204J743066J563297J224739J729352
16750C8190157K197987J835658K004354K715216K484028K927731L118756L105472
16742E8579359L082739L402930M107767M213752M703268M721448N561346N552392
16734I3925001N645140P406570O512535P188985P986346Q433498Q568333Q638813
16726A54305221Q986300R097351R134521Q415048P833278P050855N692304M543987
$$ plain form
16718 215058865 217547148 219227840 218724035 216728407 212900191 207755356 201249474 194149252
16710 194149252 186270256 177499082 168108234 159010705 149822888 140681401 131981983 123814318
16702 123814318 115981710 108267397 101648717 94821689 88981775 83637970 78236725 73306198
16694 73306198 68684710 64764540 60849201 57840260 54379023 51047054 47975738 45971624
16686 45971624 43324280 41121807 39279766 37104117 35174846 33814617 32066849 30353661
16678 30353661 29253427 27840671 26610233 25250243 24673609 23214672 22511246 21471746
16670 21471746 20613200 20083615 18997273 18308010 17357685 16920770 16229014 15940730 15016436
16661 15016436 14868552 14389136 13864158 13139073 12365964 12741091 12064792 11598180 11838243
$$ packed form
16718B15058865K488283J680692n03805j995628l828216n144835o505882p100222
16710A94149252p878996q771174r390848r097529r187817r141487q699418q167665
16702A23814318p832608p714313o618680o827028n839914n343805n401245m930527
16694G3306198m621488l920170l915339l008941l461237l331969l071316k004114
16686D5971624k647344k202473j842041k175649j929271j360229j747768j713188
16678C0353661j100234j412756j230438j359990n76634j458937p03426j039500
16670B1471746q58546n29585j086342o89263r50325m36915o91756k88284r24294
16661A5016436j47884m79416n24978p25085p73109L75127o76299m66612K40063
$$ plain form
16652 11838243 11039433 10538771 10340754 9819634 9834107 9409119 9157221 8898047 8574956
16643 8574956 8433820 8239378 8237682 7888538 7760783 7437346 7072810 7135343 6791171 6666927
16633 6666927 6624938 6409395 6044186 5925353 5673052 6079412 5718856 5489717 5489730 5477167
16623 5477167 5230683 5090977 5234738 4968018 4670201 4503464 4567632 4055484 4698621 4644258
16613 4644258 4258696 4806699 3990504 3960950 3894080 3571527 3591952 3773697 3616420 3479315
16603 3479315 3690288 3453925 3168779 3210969 3025912 2796187 3246786 3106974 3208413 2665523
16593 2665523 2496416 3016437 2749884 2632417 2583645 2506658 2542437 2479180 2446550 2321336
16583 2321336 2269036 2277055 2496813 2244845 2176543 2079133 2340158 2332539 2271093 2369484 1959110
$$ packed form
16652A1838243p98810n00662j98017n21120J4473m24988k51898k59174l23091
16643H574956j41136j94442j696l49144j27755l23437l64536O2533l44172j24244
16633F666927m1989k15543l65209j18833k52301M06360l60556k29139J3j2563
16623E477167k46484j39706J43761k66720k97817j66737O4168n12148O43137n4363
16613D644258l85562N48003q16195k9554o6870l22553K0425J81745j57277j37105
16603C479315K10973k36363k85146M2190j85057k29725M50599j39812J01439n42890
16593B665523j69107N20021k66553j17467m8772p6987L5779o3257l2630j25214
16583B321336n2300Q019K19758k51968o8302r7410K61025p619o1446R8391m10374
$$ plain form
16572 1959110 1855864 1765456 1852793 1741819 2062721 2018745 1705198 1838874 1918091 1701184
16562 1701184 1754505 1700839 1732067 1969954 1374618 1932333 1483447 1720928 1557125 1483901
16552 1483901 1388736 1685086 1673581 1337278 1303126 1310874 1126718 1553906 1312478 1348434
16542 1348434 1279211 1202904 1230818 1164555 1327138 1490250 1071931 1271184 1152307 1194473
16532 1194473 1037627 1411058 1031897 1229995 1198696 1191197 1311938 963238 1174751 1290755
16522 1290755 981766 1134532 921449 1209986 1138463 1088417 785681 737850 1227072 1062222
16512 1062222 698171 1167467 1007424 665915 779646 1065678 1186291 840205 951234
16503 951234 930497 685656 748863 601297 859991 615388 1029397 895775 946487 632828
$$ packed form
16572A959110j03246r0408Q7337j10974L20902m3976l13547J33676P9217k16907
16562A701184N3321n3666L1228K37887n95336N57715m48886K37481j63803p3224
16552A483901r5165K96350j1505l36303l4152P748j84156M27188k41428L5956
16542A348434o9223p6307K7914o6263J62583J63112m18319J99253j18877M2166
16532A194473j56846L73431l79161J98098l1299p499J20741l48700K11513J16004
16522A290755l08989J52766k13083K88537p1523n0046l02736m7831M89222j64850
16512A062222l64051M69296j60043l41509J13731K86032J20613l46086J11029
16503I51234k0737k44841O3207j47566K58694k44603M14009j33622N0712l13659
$$ plain form
16493 632828 806565 691109 587169 650842 997805 684915 604110 659216 1102518 621383
16483 621383 609909 628497 682702 635574 661007 543716 697267 412604 635485 440561
16473 440561 407407 429297 582466 962538 516411 798822 858030 565436 212604 634072
16463 634072 816401 447918 654837 616468 215110 593315 561290 507096 476360 504405
16453 504405 528090 520081 431475 238270 139403 236489 407126 433181 288133 548814 455674
16442 455674 612300 405019 344033 460184 475482 354297 539350 605990 566825 763042
16432 763042 571059 271843 207477 302053 302430 385482 129126 690532 152208 405225 -14435
16420 355507 225536 377921 381822 331194 147844 291177 569403 188347 490638 518762
$$ packed form
16493F32828J73737j15456j03940O3673L46963l12890q0805N5106M43302m81135
16483F21383j1474J8588N4205m7128K5433j17291J53551k84663K22881j94924
16473D40561l3154K1890J53169L80072m46127K82411N9208k92594B12604M21468
16463F34072J82329l68483K06919l8369B15110L78205l2025n4194l0736K8045
16453E04405K3685q009q8606j93205r8867R7086J70637K6055j45048K60681r3140
16442D55674J56626k07281o0986J16151J5298j21185J85053O6640l9165J96217
16432G63042j91983B71843o4366R4576L77Q3052A29126N61406A52208K53017a4435
16420C55507j29971J52385L901n0628A47844J43333K78226A88347L02291K8124
$$ plain form
16410 518762 344469 488905 448216 495201 223167 77282 473385 142254 460885 341160
16400 341160 266522 470337 705752 -60164 216934 122371 300819 238561 54929 189186
16390 189186 446537 164014 82293 232823 436118 -13754 327691 511248 466731 266183
16380 266183 213108 -4169 299260 296089 3566 249511 -102232 141321 482281 565095 145063
16368 301998 95287 74960 142333 -6175 280468 167892 261007 170711 295812 -35202 284554
16356 413481 -96031 342387 44558 349208 358960 227570 94774 -154934 -94371 -72347 333997
16344 88285 -19136 122565 265072 374289 191265 -94802 223549 219913 466975 369839 361108
16333 361108 152188 324168 -43261 -149389 175508 123340 294458 128821 -7141 167235
$$ packed form
16410E18762j74293J44436m0689M6985B23167G7282L96103A42254L18631j19725
16400C41160p4638K03815K35415f0164B16934r4563J78448o2258E4929J34257
16390A89186K57351A64014q1721J50530K03295a3754C27691J83557m4517k00548
16380B66183n3075d169B99260l171C566K45945a02232A41321L40960Q2814A45063
16368C01998I5287k0327O7373f175B80468j12576R3115r0296J25101c5202B84554
16356D13481i6031C42387D4558L04650R752j31390I4774a54934O0563K2024C33997
16344H8285a9136A22565J42507J09217j83024i4802B23549l636K47062r7136q731
16333C61108A52188J71980d3261j06128A75508n2168J71118A28821g141A67235
$$ plain form
16322 354957 344007 178830 158259 258961 391742 -42083 -164707 171625 304009 206349
16312 206349 415453 -241709 7562 -197467 -53550 -80783 170648 37285 248455 127173
16302 127173 182308 183626 203763 178825 392184 -228696 152436 109658 71980 -129707 52006
16290 226394 262771 208839 -28187 315754 218956 -110504 176609 367106 -111311 354320
16279 263226 -38114 -22186 -350626 219530 193672 58672 196725 139390 246228 113427
16268 257512 -26612 -68263 -110657 -60363 168106 -190124 295365 495805 -291202 23249
16257 -60916 -170222 23611 267027 -127072 -49371 222812 36800 43865 19216 109327 -26293
16245 874 258909 -153336 134729 436456 213112 303294 79495 -272554 -74756 88497 -30786
$$ packed form
16322C54957j0950j65177k0571J00702J32781d2083j22624A71625J32384r7660
16312B06349K09104b41709G562a97467e3550k7233A70648C7285K11170j21282
16302A27173N5135J318K0137k4938K13359b28696A52436m2778l7678a29707E2006
16290B26394L6377n3932b8187C15754r6798a10504A76609J90497a11311C54320
16279B63226c8114J5928l28440B19530k5858E8672J38053n7335J06838A13427
16268B57512b6612m1651m2394N0294A68106a90124B95365K00440b91202B3249
16257f0916j09306B3611K43416a27072d9371B22812C6800P065A9216R0111b6293
16245H74K58035a53336A34729L01727B13112R0182G9495b72554g4756H8497c0786
$$ plain form
16233 181211 206829 -31243 314798 -242235 174540 -388158 -98820 -56552 -163138 -22844
16222 -9218 -97889 96215 191004 36389 26828 169299 91437 -186362 -217595 -154173 82872 -163466
16209 -237830 134437 243168 93788 185319 213517 -101731 291281 188493 -131942 199774
16198 -98810 94276 61204 -63904 -70857 -220677 107581 -9956 -35219 224826 64134 312206
16187 312206 -207117 -197170 99366 168725 85811 -96549 151944 -122451 62490 171708 155039
16176 155039 46344 379036 -122778 96026 196563 270728 -139759 -7805 11581 -303114 -194757
16165 -194757 -214271 -349100 -147774 147313 385204 97490 -3978 -27288 388012 296014 -155831
16153 114941 -54397 -204407 7701 349368 -368579 184686 -144815 41828 135095 -90401 63027
$$ packed form
16233A81211K5618c1243C14798b42235A74540c88158i8820M2268j06586b2844
16222i218q8671I6215R4789C6389r561J42471p7862a86362l1233O3422H2872a63466
16209b37830A34437J08731I3788R1531K8198a01731B91281j02788a31942A99774
16198i8810I4276l3072f3904o953j49820A07581i956k5263B24826F4134K48072
16187C12206b07117R947I9366O9359q2914i6549A51944a22451F2490J09218j6669
16176A55039D6344L32692a22778I6026J00537P4165a39759g805A1581c03114J08357
16165a94757j9514j34829a47774A47313K37891I7490c978k3310C88012r1998a55831
16153A14941e4397j50010G701L41667c68579A84686a44815D1828R3267i0401F3027
$$ plain form
16141 -87267 -267139 96151 -127452 -145704 -23893 -197360 203425 233656 -64554 -13190 -128676
16130 -128676 -59142 119885 -132876 -125743 8585 58632 235888 178996 -77610 -25497 -257328
16119 -257328 -167846 28765 626 47524 -49685 124231 -10709 -165187 2292 -185427 33646
16107 147622 -238813 -113358 -169421 -166399 358581 178780 447648 382735 14631 -9002 -331347
16096 -331347 352540 -25007 -219482 -40547 -2894 -87998 -105448 28865 -244055 -49704 -19458
16084 -154847 -48252 306893 -77599 82867 158361 -82088 -251272 -93546 -197973 170054 153386
16073 153386 32063 259680 13382 -9215 -39325 354110 -222128 -45258 -151184 280791 102130
16061 99594 173242 56182 -54154 -442653 -212134 71413 -391009 269592 99447 -33140 155632
$$ packed form
16141h7267j79872I6151a27452j8252b3893j73467B03425L0231f4554a3190j15486
16130a28676e9142A19885a32876P133H585N0047J77256n6892g7610b5497k31831
16119b57328Q9482B8765F26M6898d9685A24231a0709j54478B292a85427C3646
16107A47622b38813a13358n6063L022C58581A78780K68868o4913A4631i002l22345
16096c31347C52540b5007j94475d0547b894q5104j7450B8865b44055d9704a9458
16084a54847d8252C06893g7599H2867P5494h2088j69184i3546j04427A70054j6668
16073A53386C2063K27617A3382i215l0110C54110b22128d5258j05926B80791A02130
16061I9594P3648E6182e4154l88499b12134G1413c91009B69592I9447c3140A55632
$$ plain form
16049 -74638 -220305 31623 18273 -75102 74304 -358577 183975 135987 163362 -250007 88873
16037 -11544 -39508 -115932 240191 -45587 -272053 128318 -176777 -451435 44617 177900
16027 177900 -101281 -91750 18864 91635 90155 -168936 -2945 -240656 -339977 177660 133402
16016 133402 -27954 -149167 -23172 -99590 -22699 -152343 -165743 -236379 -13299 -193456 26171
16004 307997 -242856 13357 -110070 47806 23320 -39611 -268584 -45218 206974 -249711
15993 -164364 -245700 -246112 -179998 -181959 99736 -183845 242299 -142528 138523 26597 280946
15982 280946 -40093 34818 165618 96430 227404 -9433 113502 67524 -21368 84154 -105906
15970 239161 -153026 -343039 -179317 39148 93514 -13387 59700 -63822 -97974 45876 114533
$$ packed form
16049g4638j45667C1623j3350g5102G4304c58577A83975m7988K7375b50007H8873
16037a1544k7964p6424B40191d5587k26466A28318a76777k74658D4617J33283
16027A77900a01281R531A8864P2771j480a68936b945k37711r9321A77660m4258
16016A33402b7954j21213b3172p6418b2699j29644j3400p0636a3299j80157B6171
16004C07997b42856A3357a10070D7806B3320c9611k28973d5218B06974b49711
15993a64364q1336m12O6114j961I9736a83845B42299a42528A38523B6597K54349
15982B80946d0093C4818J30800o9188J30974i433A13502m5978b1368H4154a05906
15970B39161a53026j90013J63722C9148N4366a3387E9700f3822l4152D5876O8657
$$ plain form
15959 114533 -214975 -38444 9984 -156008 -153214 -147666 108585 -47655 264319 -293502 -244266
15948 -244266 -148595 -124936 -231116 26760 -67408 -42734 -49950 20079 -119072 24196 -182175
15936 -166631 -95913 -377940 -145802 -107876 -240206 -205693 110838 -220525 1119 -331110
15925 -270728 128015 446284 -77967 387684 1136 22083 -134638 248478 -193174 -72574
15914 141806 332988 -131900 -317328 -250415 -395996 233768 12567 -116994 37317 87751
15904 87751 796 27866 -108259 2570 291393 -57454 55564 115103 70164 308576 -20617 18125
15891 23133 153081 -13710 -166505 237263 -102343 -63177 -86466 -375095 17593 9717 -78018
15879 -158580 -10765 -219494 -311433 -189193 -21195 156492 286050 240366 -79123 -45214 -483008
$$ packed form
15959A14533b14975c8444I984a56008K794N548A08585d7655B64319b93502M9236
15948b44266R5671K3659j06180B6760f7408K4674p216B0079a19072B4196a82175
15936a66631P0718k82027a45802L7926j32330L4513A10838b20525A119c31110
15925b70728A28015L18269g7967C87684A136K0947a34638B48478a93174g2574
15914A41806J91182a31900j85428O6913j45581B33768A2567a16994C7317N0434
15904H7751G96K7070a08259B570K88823e7454E5564N9539m4939K38412b0617A8125
15891B3133J29948a3710j52795B37263a02343L9166k3289k88629A7593p876g8018
15879a58580a0765k08729r1939J22240b1195A56492J29558m5684g9123L3909m37794
$$ plain form
15868 -483008 101558 -133359 -37996 101306 -60704 96806 19744 16586 -1692 48546 77822
15857 77822 -113055 -197118 -387681 -375502 -29265 75051 79530 57624 -325290 -170722 -187314
15846 -187314 -245176 99867 158665 -47354 399689 -149659 -123493 -79907 44982 292281 62837
15834 -115653 -2649 60158 -84056 -93368 -433675 305690 -7588 -202293 -71383 -49058 -140761
15823 -140761 56501 -160158 -114411 57216 -464871 -344286 -37950 167979 -112106 -32621
15812 171826 178073 -121616 -64601 19961 31813 131284 -160667 -62584 -58699 -24473 -71180
15801 -71180 -3678 112919 68658 361303 -118285 -172640 96288 -240478 103230 -24300 175219
15789 127321 -156773 46843 -121450 161677 150188 112640 188599 179403 -312054 383406 265482
$$ packed form
15868d83008A01558a33359c7996A01306f0704I6806A9744l158a692D8546K9276
15857G7822a13055q4063j90563J2179b9265G5051M479k1906c25290J54568j6592
15846a87314n7862I9867N8798d7354C99689a49659K6166M3586D4982K47299F2837
15834a15653b649F0158h4056r312l40307C05690g588j94705g1383K2325r1703
15823a40761E6501a60158M5747E7216d64871J20585c7950A67979a12106c2621
15812A71826O247a21616N7015A9961J1852R9471a60667f2584L885b4473m6707
15801g1180c678A12919m4261K92645a18285n4355I6288b40478A03230b4300A75219
15789A27321a56773D6843a21450A61677j1489l7548P5959r196c12054C83406j17924
$$ plain form
15778 265482 169112 -35511 -26802 -66134 -260491 107510 18291 103763 -144664 -202091 17790
15766 -63440 -183247 285328 -43091 -139785 -376363 -388941 -57131 10812 -141836 274168 151466
15755 151466 -39368 -373676 -248097 490957 48610 122548 308936 -99462 191648 55954
15744 -58453 -75858 -447482 114468 55176 240384 273458 42347 -257367 -254327 -158275 2510
15732 -32627 289047 333623 43695 -264256 -4042 -133647 114401 -173336 -196949 -6198 92172
15720 -91312 91777 -30202 -292591 -102945 -156651 -174612 -186727 40810 -277078 -185078 -169827
15709 -169827 16364 68092 -76680 128008 -77908 -155632 -230982 -258469 -989 -179808 4586 -253942
15696 -12018 -87042 95825 -126699 -493722 254380 -92947 287526 118437 -306587 240972
$$ packed form
15778B65482r6370c5511Q709l9332j94357A07510A8291Q5472a44664n7427A7790
15766f3440j19807B85328d3091r6694k36578j2578e7131A0812a41836B74168j22702
15755A51466c9368l34308J25579D90957D8610P3938J86388i9462A91648E5954
15744e8453j7405l71624A14468E5176J85208L3074D2347b57367L040R6052B510
15732c2627B89047M4576D3695b64256d042j29605A14401a73336k3613f198I2172
15720i1312I1777c0202k62389a02945n3706j7961j2115D0810b77078R2000J5251
15709a69827A6364N1728g6680A28008g7908p7724p5350k7487i89j78819D586b53942
15696a2018p5024I5825a26699l67023B54380i2947B87526A18437c06587B40972
$$ plain form
15685 -26314 -8753 -215997 -369070 -132804 -283349 -432314 -64431 -190393 -212577 -384071
15675 -384071 -25176 -134125 -237468 311989 -358329 59111 -148305 -117425 128738 -46069
15664 163600 -9048 207307 -107763 -360885 -51440 -64410 -71276 131514 23120 -92860 -143293
15653 -143293 -55623 18784 -113027 115999 232176 253398 140917 -120859 38619 175698
15643 175698 -87309 -79518 -299116 -153529 -243203 -245294 95759 223156 -193001 -267883 3999
15631 -210200 6294 -302338 -8201 25977 73249 97829 -66691 153793 158555 853 589896 -116291
15618 262297 117551 -139531 -188578 281302 -420610 -207441 2114 -207537 -279166 -140349
15608 -140349 -154572 29853 -291640 15862 -218359 -119932 -92476 -382565 -4078 280761 240048
$$ packed form
15685b6314h753k07244j53073a32804j50545j48965f4431j25962k2184j71494
15675c84071b5176j08949j03343C11989c58329E9111a48305L0880A28738d6069
15664A63600i048B07307a07763k53122e1440j2970o866A31514B3120i2860n0433
15653a43293e5623A8784a13027A15999J16177K1222j12481a20859C8619J37079
15643A75698h7309P791k19598J45587q9674k091I5759J27397a93001p4882C999
15631b10200F294c02338h201B5977M7272K4580f6691A53793M762H53N89043a16291
15618B62297A17551a39531m9047B81302d20610b07441B114b07537p1629J38817
15608a40349j4223B9853b91640A5862b18359R8427K7456k90089d078B80761m0713
$$ plain form
15597 240048 80318 -111743 -68224 -124849 63979 -182276 45226 105872 116818 50947 -73686
15585 164593 -75132 -32176 -53445 -10199 81318 -85224 195881 -118891 -156298 138233 201654
15574 201654 110050 232687 189140 -612404 36971 -97395 87913 -311998 -99642 -154946 135639
15562 -65684 111417 -143501 -245158 -185726 168360 -366821 146147 291117 -268340 178409
15551 -95536 94632 62199 132479 -178523 44154 -304683 -209859 73231 52026 -118356 114550
15539 154010 137189 -190524 -264730 49809 28276 191645 -27529 -157563 -128510 138081 10908
15527 -158943 336222 12355 242102 -515005 60990 -36383 -157039 123072 -201527 -33043
15516 -31606 185918 -128240 270540 222600 -39571 40091 98487 146689 -82129 56975 -154987
$$ packed form
15597B40048H0318a11743M3519n6625F3979a82276D5226O0646J0946E0947g3686
15585A64593g5132c2176k1269a0199H1318h5224A95881a18891l7407A38233O3421
15574B01654r1604J22637m3547f12404C6971i7395H7913c11998i9642n5304A35639
15562f5684A11417a43501j01657N9432A68360c66821A46147J44970b68340A78409
15551i5536I4632l2433P0280a78523D4154c04683R4824G3231k1205a18356A14550
15539A54010j6821a90524p4206D9809k1533J63369b7529j30034K9053A38081A0908
15527a58943C36222A2355K29747e15005F0990c6383j20656A23072b01527c3043
15516c1606A85918a28240B70540m7940c9571D0091N8396M8202h2129E6975a54987
$$ plain form
15504 -78932 121950 235443 268479 -172724 199464 289351 44131 -134275 -191794 24452 6002
15492 128842 -86146 -283199 179 62610 62369 34951 16145 -63809 -315641 222078 -250906
15480 -96502 -176706 -65188 143904 411361 -195267 -23782 147347 -119131 -80046 5952 -15454
15468 -78354 8140 -38534 138837 63487 -468082 119441 124601 59303 -412225 96495 -196064
15456 -90281 170373 -175262 122092 292274 -171215 96874 -58898 -116787 -318405 -115497
15445 -63421 -101874 -7248 -40930 213362 37283 -16871 40244 50082 -10000 -161983 76053 -145228
15432 166240 200323 -67230 -171960 -260921 -35488 -69359 -166359 61754 -44713 28346 155643
15421 155643 -269111 -424911 -121700 -87915 -9310 -437575 125709 160865 -76140 -14110 98447
$$ packed form
15504g8932A21950J13493L3036a72724A99464Q9887D4131a34275n7519B4452F002
15492A28842h6146j97053A79O2431k41k7418A6145f3809k51832B22078b50906
15480i6502q0204f5188A43904K67457a95267b3782A47347a19131L9085E952a5454
15468g8354H140c8534A38837F3487d68082A19441N160E9303d12225I6495a96064
15456i0281A70373a75262A22092J70182a71215I6874e8898n7889k01618a15497
15445f3421l8453g248l3682B13362C7283a6871D0244R838a0000j51983G6053a45228
15432A66240L4083f7230j04730q8961c5488l3871r7000F1754d4713B8346J27297
15421A55643b69111j55800a21700L3785i310m28265A25709L5156g6140a4110I8447
$$ plain form
15409 116225 -162208 -74257 -242164 -149851 34519 154826 -20796 -301280 -6307 -32104 33858
15397 -73042 -216289 -117513 73690 88605 -276730 -190058 -333951 26541 -53931 45631 202832
15386 202832 -184762 46000 62711 78767 -113430 90298 500963 196579 -73354 155248
15375 -26820 -93272 208567 -454427 250589 -52706 -185230 -63838 253318 -97950 386934
15364 -176570 -251111 179556 226722 25837 -46171 275695 -323536 -242915 59733 -62860 11092
15352 317813 -169849 159168 151126 -53986 -167324 61434 454494 306207 37134 151420
15342 151420 -74902 -65898 -174266 -146175 -10608 -142486 120847 -41961 -155984 27859 1439
15330 34851 332992 102571 198687 54057 56850 -277230 189779 -212598 -153846 36982 309521
$$ packed form
15409A16225a62208g4257j67907R2313C4519J20307b0796k80484f307k5797C3858
15397g3042j43247R8776G3690J4915b76730Q6672j43893B6541e3931D5631J57201
15386B02832a84762D6000J6711J6056a13430I0298M10665A96579g3354A55248
15375b6820o6452B08567d54427B50589e2706j32524f3838B53318i7950C86934
15364a76570p4541A79556M7166B5837d6171B75695c23536Q0621E9733f2860A1092
15352C17813a69849A59168q042e3986j13338F1434L93060j48287C7134J14286
15342A51420g4902R004j08368K8091a0608j31878A20847d1961j14023B7859A439
15330C4851K98141A02571R6116E4057K793b77230A89779b12598N8752C6982K72539
$$ plain form
15319 309521 87562 -110598 -305845 202968 -150622 199152 93949 466279 44273 -381728
15308 -298859 -49248 175588 -95935 144753 130808 -30802 -76868 351780 509203 257911
15298 257911 289314 -133024 29784 -162626 125319 112134 262778 145166 301302 113055
15287 -12790 -24159 -38482 278680 -26832 -81097 131351 282192 1574 163440 -68432 34875
15275 -35729 22595 311596 22776 120296 93098 143648 -22961 380984 105460 194821 39337
15263 259039 133419 -86990 -291006 12435 -57530 37228 -69195 337936 14904 337352 -64066
15251 43688 393381 282932 370708 483530 618486 1565753 1219928 1531181 1647303 476233
15240 326710 305277 519991 28112 -6030 57394 196188 360384 -68450 -103897 308191 141415
$$ packed form
15319C09521H7562a10598j95247B02968a50622A99152I3949L72330D4273c81728
15308b98859d9248A75588i5935A44753j3945c0802m6066C51780J57423k51292
15298B57911L1403a33024B9784a62626A25319j3185J50644j17612J56136A13055
15287a2790j1369j4323B78680b6832n4265A31351J50841A574J61866f8432C4875
15275c5729B2595K89001B2776R7520k7198N0550b2961C80984A05460Q9361C9337
15263B59039j25620h6990k04016A2435e7530C7228f9195C37936A4904L22448f4066
15251D3688L49693j10449Q7776J12822J34956R47267l45825L11253J16122D76233
15240C26710k1433K14714B8112f030E7394J38794J64196f8450l5447C08191A41415
$$ plain form
15228 -28225 7241 302171 -211240 158534 -112685 286801 -42310 175462 72104 -37593 140987
15216 -101735 158388 8665 89978 39122 97523 189071 115740 -9176 -14125 79763 -33782 213960
15203 -130641 393023 -33039 204344 -64383 59787 -17564 120454 50675 275156 87421 -6161
15191 -8085 437936 91066 184085 64814 217867 163939 54157 -182264 140820 -203773 395984
15179 249302 67813 -39863 15005 227565 260758 82121 38726 -301678 -95047 400249 19148
15167 96939 97722 195181 134432 24570 262706 -208283 89267 42525 207289 -299639 226569
15155 -26071 322329 -1263 169061 103106 127095 72235 130083 -131272 63226 -1102 193540
15143 278908 316763 91164 -37410 175797 30407 -74569 92837 280485 -12804 -29508 8330
$$ packed form
15228b8225G241K94930b11240A58534a12685B86801d2310A75462G2104c7593A40987
15216a01735A58388H665Q1313C9122N8401R1548p3331i176m949G9763c3782B13960
15203a30641C93023c3039B04344f4383E9787a7564A20454E0675K24481H7421f161
15191h085D37936I1066R3019F4814J53053n3928E4157a82264A40820b03773C95984
15179B49302F7813c9863A5005K12560L3193H2121C8726c01678i5047D00249A9148
15167I6939P83R7459o0749B4570K38136b08283H9267D2525J64764b99639B26569
15155b6071C22329a263A69061o5955K3989n4860N7848a31272F3226a102A93540
15143B78908L7855I1164c7410A75797C0407g4569I2837J87648a2804j6704H330
$$ plain form
15131 129490 174554 -52661 -40980 142336 187813 -179735 571 23984 279289 80447 283576
15120 283576 -236417 -194676 -75900 -7154 153108 116917 219864 -50806 -160132 431625 -393836
15108 -43993 26550 146125 122197 45548 86597 294029 196081 -130458 74890 -61651 6856
15096 148944 181087 34201 -77983 -147493 357777 -123526 67884 115278 168372 186386 141321
15085 141321 198068 235495 64815 136298 114628 241370 169616 309803 180724 15017 275421
15074 275421 -52417 136826 408856 182361 57016 190173 197739 -71571 21158 322739 258039
15063 258039 204835 139236 144686 95719 64387 37678 219911 74315 133288 134183 13511 243707
15051 243707 441898 -24974 118263 66302 163781 254893 169896 78512 -353140 197440 323432
$$ packed form
15131A29490M5064e2661J1681A42336M5477a79735E71K3413K55305H0447K03129
15120B83576b36417M1741g5900g154A53108l6191J02947e0806j09326D31625c93836
15108d3993B6550J19575k3928D5548M1049K07432r7948a30458G4890f1651F856
15096A48944L2143C4201g7983o9510C57777a23526F7884M7394N3094J8014m5065
15085A41321N6747L7427F4815P1483k1670J26742p1754J40187j29079A5017K60404
15074B75421e2417A36826K72030A82361E7016J33157P566g1571B1158L01581o4700
15063B58039n3204o5599N450m8967l1332k6709J82233G4315N8973Q95A3511K30196
15051B43707J98191b4974A18263n1961R7479R1112q4997G8512c53140A97440J25992
$$ plain form
15040 323432 268293 334098 257628 346140 371975 190108 504128 140143 404387 266622
15030 266622 223942 -221609 298187 32693 449035 420361 251206 318723 274811 92507 279101
15019 279101 72129 133345 74907 -253935 139669 194395 95980 166275 398963 213572 398489
15008 398489 104400 536467 316846 -213319 139949 223714 300800 404738 242659 43234
14997 118674 212852 344278 349462 295545 327959 261223 408335 99038 197684 106700 -143021
14985 -17810 152401 274846 368418 -47474 558038 264290 149830 392590 -69337 363936
14974 174352 304420 545750 140755 -93536 311620 299617 380647 50636 253944 104343
14963 236769 17316 534018 -9127 41234 77589 185592 314789 169674 460046 183352
$$ packed form
15040C23432n5139O5805p6470Q8512K5835j81867L14020A40143K64244j37765
15030B66622m2680b21609B98187C2693M16342k8674j69155O7517m3912I2507J86594
15019B79101G2129O1216n8438b53935A39669N4726I5980P0295K32688j85391J84917
15008C98489A04400M32067k19621b13319A39949Q3765P7086J03938j62079D3234
14997A18674R4178J31426N184n3917L2414o6736J47112I9038R8646r0984a43021
14985a7810A52401J22445R3572d7474E58038B64290j14460K42760f9337C63936
14974A74352J30068K41330A40755i3536C11620j2003Q1030E0636K03308A04343
14963B36769A7316N16702i127D1234L6355J08003J29197j45115K90372A83352
$$ plain form
14952 311179 181236 199479 305345 24613 96722 206293 171653 267664 179947 299712 512842
14941 512842 180444 424087 94125 71624 310921 165716 321262 432101 212621 272345
14931 272345 77725 386041 229633 -244092 365315 371076 435342 273233 415801 328016
14921 328016 444866 242939 168641 94968 490329 -59464 125938 291196 405359 407310
14911 407310 236534 410352 462517 158263 33838 518981 133825 570971 528809 35884
14900 480240 438888 310719 126159 -46272 608596 -136315 116615 337796 196095 140049
14890 140049 161983 361720 203346 703706 283741 93136 261094 82210 109103 204625
14880 204625 301774 817783 365333 342264 400708 579538 400182 496583 568420 610421 517096
$$ packed form
14952C11179j29943J8243J05866B4613P2109J09571l4640R6011q7717J19765K13130
14941E12842A80444K43643I4125k2501K39297j45205J55546J10839B12621N9724
14931B72345G7725L08316j56408b44092C65315N761O4266j62109J42568q7785
14921C28016J16850k01927p4298p3673L95361e9464A25938J65258J14163J951
14911D07310j70776J73818N2165A58263C3838M85143A33825M37146m2162C5884
14900D80240m1352j28169A26159d6272F08596a36315A16615K21181j41701n6046
14890A40049K1934J99737j58374N00360B83741I3136J67958H2210K6893R5522
14880B04625R7149N16009C65333k3069N8444J78830j79356R6401P1837M2001r3325
$$ plain form
14869 517096 777041 290314 442762 370728 684523 592878 655757 507695 168813 307773
14859 307773 433772 567890 602926 415830 617419 137081 453136 331048 652319 364605
14849 364605 329462 391819 341716 526042 235798 444947 195773 91144 626306 561899
14839 561899 453892 436413 64856 282460 340657 742055 512645 319854 341003 559822
14829 559822 583285 232638 608343 486051 663906 74904 494630 647247 708614 470579
14819 470579 356283 617343 369187 314837 520561 227383 594655 420226 513316 714223
14809 714223 463971 524700 340577 745735 331233 578985 600135 186801 563984 807654
14799 807654 342554 646487 585832 118805 369539 659014 475409 556970 622296 522168
$$ packed form
14869E17096K59945B90314J52448p2034L13795r1645O2879j48062A68813J38960
14859C07773J25999J34118L5036j87096K01589A37081L16055j22088L21271k87714
14849C64605l5143O2357n0103J84326B35798K09149A95773I1144N35162o4407
14839E61899j08007j7479F4856K17604N8197M01398k29410j92791K1149K18819
14829E59822K3463B32638L75705j22292J77855G4904M19726J52617O1367k38035
14819D70579j14296K61060k48156n4350K05724B27383L67272j74429R3090K00907
14809G14223k50252O0729j84123M05158C31233K47752K1150A86801L77183K43670
14799H07654C42554L03933o0655A18805K50734K89475j83605Q1561O5326j00128
$$ plain form
14789 522168 725290 767735 598165 646024 358781 552660 297556 617210 659595 614394
14779 614394 679800 707972 375736 689142 483652 366251 696777 715619 706218 654453 544002
14768 544002 780480 627378 515872 797255 868607 484896 361493 532744 768568 709180
14758 709180 421778 428603 1046167 396692 508584 336662 604682 658115 606696 435088
14748 435088 988620 519201 827604 752097 400592 596406 1124391 1160105 775237 498855
14738 498855 593102 618403 412928 382428 384221 514390 860079 779075 774545 1047106 820129
14727 820129 498815 608131 730196 639201 902153 523633 855643 1064508 783730 759932
14717 759932 849668 597331 850358 843343 727461 763586 896551 752422 944700 947389 678003
$$ packed form
14789E22168K03122M2445j69570M7859k87243J93879k55104L19654M2385m5201
14779F14394O5406K8172l32236L13406k05490j17401L30526J8842r401n1765j10451
14768E44002K36478j53102j11506K81383P1352l83711j23403J71251K35824n9388
14758G09180k87402O825O17564C96692J11892j71922K68020N3433n1419j71608
14748D35088N53532m69419L08403p5507l51505J95814N27985L5714l84868k76382
14738D98855R4247K5301k05475l0500J793J30169L45689q1004m530K72561k26977
14727H20129l21314J09316J22065r0995K62952l78520L32010K08865k80778k3798
14717G59932Q9736k52337K53027p015j15882L6125J32965j44129J92278K689k69386
$$ plain form
14706 678003 638160 674513 776960 927652 1026296 976413 865434 947885 789603 1234283
14696 1234283 782372 1024463 1029322 883928 838731 1097923 725019 690807 1038359 1045373
14686 1045373 716176 1157039 739400 955935 1171900 842535 858761 746430 1224810 910170
14676 910170 1041828 1197053 1255925 926980 718705 1105038 1108055 867110 1184331 1205267
14666 1205267 1174757 1120370 1156394 1262703 1329513 990815 1022648 1142766 971372 1387540
14656 1387540 1477255 1349984 1046959 1193306 1188838 1350411 1264556 1183664 1226898 1285406 1227687
14645 1227687 1466305 1061387 1417305 1082139 1034910 1205968 1224543 1125228 1234695 1014732
14635 1014732 1103646 1245896 1308868 1449142 1149042 1348824 1608443 1408576 1489693 1137854
$$ packed form
14706F78003l9843L6353J02447J50692R8644m9883j10979Q2451j58282M44680
14696A234283m51911K42091M859j45394m5197K59192l72904l4212L47552P014
14686A045373l29197M40863m17639K16535K15965l29365J6226j12331M78380l14640
14676I10170J31658J55225N8872l28945k08275L86333L017k40945L17221K0936
14666A205267l0510n4387L6024J06309O6810l38698L1833J20118j71394M16168
14656A387540Q9715j27271l03025J46347m468J61573q5855q0892M3234N8508n7719
14645A227687K38618m04918L55918l35166m7229J71058J8575r9315J09467k19963
14635A014732Q8914J42250O2972J40274l00100J99782K59619j99867Q1117l51839
$$ plain form
14625 1137854 1367382 1711084 1333272 1335772 1592000 1429191 1620582 1698265 1695204 1699362 1766147
14614 1766147 1818998 1634560 1479914 1642031 1536495 1527090 1568866 1684288 1810418 1820407
14604 1820407 1493451 1726892 1785612 1622660 1500541 1858540 1625667 1906520 1624472 1576186
14594 1576186 1754303 1906496 1931241 1874458 1891992 2099508 1630425 1741896 1839485 2022775
14584 2022775 1856530 1902098 1872530 1988623 2228457 2015126 1742077 2118609 2185862 2360410
14574 2360410 1817122 2025344 2321586 2578330 2363280 2293785 2076257 2475458 2343123 2373968
14564 2373968 2469627 2689673 2384127 2540240 2841322 2647080 2841757 2967625 3234014 3331524
14554 3331524 3673878 3859797 3927625 4672113 5966634 8027800 12229250 23308059 44002221
$$ packed form
14625A137854K29528L43702l77812K500K56228j62809J91391P7683l061M158O6785
14614A766147N2851j84438j54646J62117j05536r405M1776J15422J26130R989
14604A820407l26956K33441N8720j62952j22119L57999k32873K80853k82048m8286
14594A576186J78117J52193K4745n6783J7534K07516m69083J11471R7589J83290
14584B022775j66245M5568k9568J16093K39834k13331k73049L76532O7253J74548
14574B360410n43288K08222K96242K56744k15050o9495k17528L99201j32335L0845
14564B373968R5659K20046l05546J56113L01082j94242J94677J25868K66389R7510
14554C331524L42354J85919O7828P44488J294521K061166M201450J1078809K0694162
$$ plain form
14545 44002221 42753660 22040657 11469310 7558937 4465983 2884967 1934696 1901323
14537 1901323 1999709 2090277 1709544 2169867 1858592 1974905 2260346 1915307 2154474 2318270
14527 2318270 2376224 2102800 2264041 1900523 2382642 2693219 2633360 2726909 2337234 2417805
14517 2417805 2896534 2639743 2913015 2692062 2616122 2640873 2958730 2523467 2754398 2836833
14507 2836833 2783130 2884395 2583111 3220423 2928429 3031805 2964846 3138595 3029510 3401523
14497 3401523 3152809 3199928 3343954 3256254 3422945 3561259 3424880 3859137 3632200 3415087
14487 3415087 3668119 3549520 3549045 3587947 3764950 3684129 3950939 3938843 3913141 3819984 4033886
14476 4033886 4008438 4384152 4355817 4117808 4299299 4252989 4555182 4223278 4343830 4529932
$$ packed form
14545D4002221j248561k0713003j0571347l910373l092954j581016r50271l3373
14537A901323R8386R0568l80733M60323l11275J16313K85441l45039K39167J63796
14527B318270N7954k73424J61241l63518M82119L10577n9859R3549l89675Q0571
14517B417805M78729k56791K73272k20953p5940K4751L17857m35263K30931Q2435
14507B836833n3703J01265l01284O37312k91994J03376o6959J73749j09085L72013
14497C401523k48714M7119J44026q7700J66691J38314j36379M34257k26937k17113
14487C415087K53032j18599m75L8902J77003q0821K66810j2096k5702r3157K13902
14476D033886k5448L75714k8335k38009J81491m6310L02193l31904J20552J86102
$$ plain form
14466 4529932 4472243 4604995 4617373 4586354 4432654 4845965 4401531 5381152 5136255 5200675
14456 5200675 5321803 5413150 5605476 5540233 5407028 5409976 5397700 5549493 5404114 5423547
14446 5423547 5836182 5637990 5830050 6175627 6363268 6158520 6131314 6318563 6268563 6325076
14436 6325076 6355662 6800883 6569637 6644135 6648657 6978229 7356122 7245894 7127859 7340059
14426 7340059 7452770 7346818 7647271 7495470 8052809 7696031 8037140 8311093 8454321
14417 8454321 8588948 8800939 8561918 8964132 8870964 9042380 9327202 9628649 9713970 9625337
14407 9625337 10105101 10037789 10111559 10471728 10391857 10609045 10914227 11136580 11345069 11025185
14397 11025185 11193083 11527899 11848644 11631777 12004735 12631706 12307474 12819455 12998929
$$ packed form
14466D529932n7689J32752J2378l1019j53700M13311m44434R79621k44897O4420
14456E200675J21128R1347J92326o5243j33205K948j2276J51793j45379J9433
14446E423547M12635j98192J92060L45577J87641k04748k7206J87249n0000N6513
14436F325076L0586M45221k31246P4498M522L29572L77893j10228j18035K12200
14426G340059J12711j05952L00453j51801N57339l56778L41109K73953J43228
14417H454321J34627K11991k39021M02214r3168J71416K84822L01447Q5321q8633
14407I625337M79764o7312P3770L60169p9871K17188L05182K22353K08489l19884
14397A1025185J67898L34816L20745k16867L72958O26971l24232N11981J79474
$$ plain form
14388 12998929 13114119 13319216 13541749 13864446 13960513 14611401 14598218 15077267 15726596 15538721
14378 15538721 15752553 16141062 16214607 16929816 17000608 17223912 17649578 18055196 18199238 18592372
14368 18592372 19191066 19605999 19841882 20468014 20784032 21160400 21524541 22069410 22782940
14359 22782940 23328765 23755238 24397303 24877648 25587961 26110827 26782795 27673504 28104007
14350 28104007 28917267 29782775 30188716 30979069 31680661 32305432 33385498 34421463 35279616
14341 35279616 36466177 37124129 38344062 39734936 40368999 41617427 42934820 44284734
14333 44284734 45700627 47179858 48451201 50005154 51328068 53020065 54963839 56817476
14325 56817476 58402864 60801300 62753443 64963661 67513039 69764325 72619310 75458684
$$ packed form
14388A2998929J15190K05097K22533L22697R6067O50888j3183M79049O49329j87875
14378A5538721K13832L88509P3545P15209P0792K23304M25666M05618J44042L93134
14368A8592372N98694M14933K35883O26132L16018L76368L64141N44869P13530
14359B2782940N45825M26473O42065M80345P10313N22866O71968Q90709M30503
14350B8104007Q13260Q65508M05941P90353P01592O24771J080066J035965Q58153
14341C5279616J186561O57952J219933J390874O34063J248428J317393J349914
14333D4284734J415893J479231J271343J553953J322914J691997J943774J853637
14325E6817476J585388K398436J952143K210218K549378K251286K854985K839374
$$ plain form
14317 75458684 78067330 80673328 84478152 87719887 91365141 94961341 98780247 103026067
14309 103026067 107521778 112298373 117247136 122617645 128055977 134026329 140163984 146993020
14301 146993020 153839657 161654894 169821857 178192529 187247733 196885568 207129834 217787662
14293 217787662 228836609 241059131 253894416 266994339 281438672 296205772 311196337
14286 311196337 326893457 343048420 359581347 376426743 392979906 409188007 425287135
14279 425287135 440052365 453880276 466734568 478127464 487285384 493493188 496501112
14272 496501112 495481609 492710537 488561223 484688484 478230507 471875061 465733268 456505901
14264 456505901 442557671 427564497 411455980 394507677 377123102 359475502 342933629
$$ packed form
14317G5458684K608646K605998L804824L241735L645254L596200L818906M245820
14309A03026067M495711M776595M948763N370509N438332N970352O137655O829036
14301A46993020O846637P815237Q166963Q370672R055204R637835J0244266J0657828
14293B17787662J1048947J2222522J2835285J3099923J4444333J4767100J4990565
14286C11196337J5697120J6154963J6532927J6845396J6553163J6208101J6099128
14279D25287135J4765230J3827911J2854292J1392896R157920O207804L007924
14272D96501112j019503k771072m149314l872739o457977o355446o141793r227367
14264D56505901j3948230j4993174j6108517j6948303j7384575j7647600j6541873
$$ plain form
14257 342933629 325998065 310025729 294342812 279391707 265439492 252647279 240022891
14250 240022891 227769593 216172721 205217864 194904987 185302300 176470966 168293101
14243 168293101 160211056 152748642 145562070 138786663 132487281 127023026 121617695 116510515
14235 116510515 110966877 106655884 102212939 98332577 94591341 90941071 87154988 83812625
14227 83812625 80870606 77781281 74905351 72101408 69374988 66974953 64854491 62789052
14219 62789052 60691500 58506110 56411098 54760260 53083279 51580399 50535183 48640256
14211 48640256 46929315 45354558 44371840 43471551 42440523 41230950 39822251 38673189
14203 38673189 37325786 36474724 35827889 34941533 33981679 32953906 32136741 31677390 30613244
$$ packed form
14257C42933629j6935564j5972336j5682917j4951105j3952215j2792213j2624388
14250B40022891j2253298j1596872j0954857j0312877r602687q831334q177865
14243A68293101q082045p462414p186572o775407o299382n464255n405331n107180
14235A16510515n543638m310993m442945l880362l741236l650270l786083l342363
14227H3812625k942019l089325k875930k803943k726420k400035k120462k065439
14219F2789052k097552k185390k095012j650838j676981j502880j045216j894927
14211D8640256j710941j574757r82718r00289j031028j209573j408699j149062
14203C8673189j347403q51062o46835q86356r59854j027773q17165m59351j064146
$$ plain form
14194 30613244 29899173 29176097 28739522 27660153 27137699 26393469 25615966 25291552 24561679
14185 24561679 24124852 23441326 23310200 22476161 21841056 21512165 21190760 20909953 20007661
14176 20007661 20225026 19920769 19014613 18873366 18675158 18404990 17744772 17186400 16873502
14167 16873502 16872359 16150265 16374053 15639445 15903040 14946385 15211607 14901541 14420162 14214602
14157 14214602 13802579 13968018 13535003 13458781 13086726 13153649 12775474 12583939 12488719 12378753
14147 12378753 12094766 11774551 11397099 11456814 11107112 10937455 10913956 10923521 10490873 10276163
14137 10276163 10188987 10211723 10116702 9659870 9418400 9678018 9158601 9134542 9134558 9124289 8785430
14126 8785430 8593649 8326811 8708763 8598123 8611477 8000954 8000519 8370287 7775981 8022117
$$ packed form
14194C0613244p14071p23076m36575j079369n22454p44230p77503l24414p29873
14185B4561679m36827o83526j31126q34039o35105l28891l21405k80807r02292
14176B0007661K17365l04257r06156j41247j98208k70168o60218n58372l12898
14167A6873502j143p22094K23788p34608K63595r56655K65222l10066m81379k05560
14157A4214602m12023J65439m33015p6222l72055O6923l78175j91535r5220j09966
14147A2378753k83987l20215l77452N9715l49702j69657k3499R565m32648k14710
14137A0276163q7176K2736r5021m56832k41470K59618n19417k4059J6j0269l38859
14126H785430j91781k66838L81952j10640J3354o10523m35L69768n94306K46136
$$ plain form
14116 8022117 7724597 7340651 7332933 7750223 7276815 7413364 7334497 7187368 6699436 6835691
14106 6835691 6995453 6853552 6533974 6698634 6197546 6482680 6642435 6216787 6121596 5929044
14096 5929044 6244164 5969259 5803563 5691308 5819631 5574190 5508481 5719031 5308733 5848336
14086 5848336 5535904 5228040 5313702 5490120 4879328 5153857 5186062 4999175 5085957 5133445
14076 5133445 4628394 4879043 4889392 4868811 4630598 4774532 4431003 4456761 4423027 4551057
14066 4551057 4451561 4334761 4502693 3926999 3832965 4401480 4216380 4107742 3907933 4216934
14056 4216934 4075436 4249541 3985167 3736009 3725609 3953433 3863692 3969613 3571432 3887412
14046 3887412 3678725 3562913 3509072 3383887 3275357 3512530 3486082 3217212 3462352 3056348
$$ packed form
14116H022117k97520l83946p718M17290m73408J36549p8867j47129m87932J36255
14106F835691J59762j41901l19578J64660n01088K85134J59755m25648r5191j92552
14096E929044L15120k74905j65696j12255J28323k45441o5709K10550m10298N39603
14086E848336l12432l07864Q5662J76418o10792K74529L2205j86887Q6782M7488
14076E133445n05051K50649J0349k0581k38213J43934l43529K5758l3734J28030
14066D551057r9496j16800J67932n75694r4034N68515j85100j08638j99809L09001
14056D216934j41498J74105k64374k49158j0400K27824q9741J05921l98181L15980
14046C887412k08687j15812n3841j25185j08530K37173k6448k68870K45140m06004
$$ plain form
14036 3056348 3106765 3374791 3466555 3389845 3175449 3077398 3298061 3275884 2859257 3170467
14026 3170467 3290811 2916444 3092494 2793611 2537307 2893598 2834195 2565521 2434137 2868741
14016 2868741 3105470 2773540 2389456 2699057 2875427 2854752 2485812 2443118 2167491 2153532
14006 2153532 2514956 2173908 2651766 2355371 2486785 2399187 2284173 2107388 2287211 2240837
13996 2240837 1950562 2147564 2082565 2067673 2101558 2372625 2842211 3665893 6943561 15365539
13986 15365539 37373800 44790457 26979907 15150194 9386531 6186120 5346425 4157582
13978 4157582 3590436 3292689 3076066 3025878 2714042 2661540 2581161 2547459 2532714 2275088
13968 2275088 2223058 2738367 2318079 2252402 2308747 2602986 2253472 2512655 2460430 1932425
$$ packed form
14036C056348N0417K68026R1764p6710k14396r8051K20663k2177m16627L11210
14026C170467J20344l74367J76050k98883k56304L56291n9403k68674j31384M34604
14016B868741K36729l31930l84084L09601J76370k0675l68940m2694k75627j3959
14006B153532L61424l41048M77858k96395J31414q7598j15014j76785J79823m6374
13996B240837k90275J97002o4999j4892L3885K71067M69586Q23682L277668Q421978
13986A5365539K2008261P416657j7810550j1829713n763663l200411q39695j188843
13978D157582n67146k97747k16623n0188l11836n2502q0379l3702j4745k57626
13968B275088n2030N15309m20288o5677N6345K94239l49514K59183n2225n28005
$$ plain form
13958 1932425 1840356 2213616 2061510 2143607 2131820 2122824 1910784 2160025 2119086 1979285
13948 1979285 1825857 2037635 1892865 1976319 1615829 2348815 1775303 1658930 2002898 1714849
13938 1714849 1783959 1744632 1664779 1694817 1740467 1569930 1774572 1942787 1554371 1234413
13928 1234413 1308852 1562129 1803754 1537006 1584941 1568934 1397594 1746955 1483116 1464104
13918 1464104 1759714 1512374 1706063 1875416 1545699 1452413 1673584 1593355 1517080 1490270
13908 1490270 1596383 1648696 1848726 1410521 1542520 1434199 1129267 1544865 1116648 1243525
13898 1243525 1548772 1557881 1368322 1369896 1454652 1269387 1254802 1568741 1237029 1495033
13888 1495033 1478264 1395184 1473611 1263787 1291680 1467636 1378314 1098104 866603 1413696
$$ packed form
13958A932425r2069L73260j52106Q2097j1787q996k12040K49241m0939j39801
13948A979285j53428K11778j44770Q3454l60490P32986n73512j16373L43968k88049
13938A714849O9110l9327p9853L0038M5650j70537K04642J68215l88416l19958
13928A234413P4439K53277K41625k66748M7935j6007j71340L49361k63839j9012
13918A464104K95610k47340J93689J69353l29717r3286K21171q0229p6275k6810
13908A490270J06113N2313K00030m38205J31999j08321l04932M15598m28217J26877
13898A243525L05247R109j89559J574Q4756j85265j4585L13939l31712K58004
13888A495033j6769q3080P8427k09824K7893J75956q9322k80210k31501N47093
$$ plain form
13878 1413696 961715 1455453 1373910 1116867 1518527 1367901 1086649 1007807 1396657 1233791
13868 1233791 1337399 1356696 829029 1229666 1146298 1302562 1334595 1126426 1110487 1297879
13858 1297879 1068911 1113069 1244523 1051438 890679 1344948 986541 1075748 1178558 1267126
13848 1267126 1060968 1018769 881299 1045365 1337414 1013442 689563 971975 949847 1014755
13838 1014755 1114419 881066 1167343 888844 1207338 943725 1077824 1043132 689269 1209956
13828 1209956 867102 929406 683596 555536 1289087 1105216 937311 746930 807772 649351
13818 649351 852235 962709 857513 753011 1136079 1027209 1035452 563986 1179726 859081
13808 859081 596879 634136 571612 692179 937659 1063076 832098 832743 520920 831368
$$ packed form
13878A413696m51981M93738q1543k57043M01660j50626k81252p8842L88850j62866
13868A233791J03608J9297n27667M00637q3368J56264L2033k08169j5939J87392
13858A297879k28968M4158J31454j93085j60759M54269l58407Q9207J02810Q8568
13848A267126k06158m2199j37470J64066K92049l23972l23879K82412k2128O4908
13838A014755R9664k33353K86277k78499L18494k63613J34099l4692l53863N20687
13828A209956l42854O2304k45810j28060P33551j83871j67905j90381O0842j58421
13818F49351K02884J10474j05196j04502L83068j08870Q243m71466O15740l20645
13808H59081k62202L7257o2524J20567K45480J25417k30978O45l11823L10448
$$ plain form
13798 831368 643156 945733 713685 680249 666482 731545 921917 622154 1034369 716683
13788 716683 622449 423227 909722 552501 851353 896760 736285 963064 628983 680389
13778 680389 683284 483159 838647 964473 941555 523033 594010 721791 744860 705720 551880
13767 551880 738472 757644 603618 1031442 974325 679648 753566 762757 768552 733769 1009066
13756 1009066 788790 354001 412702 511296 652052 676775 605594 705371 814878 558272
13746 558272 435902 839032 770044 754870 520300 415397 679886 645380 836528 515287
13736 515287 382615 797076 593938 625112 556382 669160 663372 729034 538505 462447 437337
13725 437337 651019 456452 253437 573697 623323 565022 593290 564151 723558 660406
$$ packed form
13798H31368j88212L02577k32048l3436j3767O5063J90372k99763M12215l17686
13788G16683r4234j99222M86495l57221K98852M5407j60475K26779l34081N1406
13778F80389K895k00125L55488J25826k2918m18522P0977J27781K3069l9140j53840
13767E51880J86592J9172j54026M27824n7117k94677P3918R191N795l4783K75297
13756A009066k20276C54001N8701R8594J40756K4723p1181R9777J09507k56606
13746E58272j22370M03130o8988j5174k34570j04903K64489l4506J91148l21241
13736E15287j32672M14461k03138L1174o8730J12778n788O5662j90529p6058k5110
13725D37337K13682j94567k03015L20260M9626n8301K8268k9139J59407o3152
$$ plain form
13715 660406 848487 786050 468514 490999 713431 473087 465325 338029 592646 482246
13705 482246 310915 309094 638196 465879 616411 431878 319255 295210 628492 379698
13695 379698 569281 519942 545504 756589 461487 318662 197919 641771 684890 578829
13685 578829 558520 380939 633741 342263 517339 675270 339443 380656 312609 321935
13675 321935 843115 373522 613160 769368 437870 552863 152103 592166 478629 205444
13664 434652 571837 322158 295201 431881 885348 24035 383077 455847 447570 409193 111528
13652 697102 388907 180261 374290 379104 634232 571515 433876 440800 144179 515854
13642 515854 681409 715011 524096 515337 430788 541889 505906 394913 390454 697209 357461
$$ packed form
13715F60406J88081o2437l17536K2485K22432k40344p762j27296K54617j10400
13705D82246j71331j821L29102j72317J50532j84533j12623k4045L33282k48794
13695C79698J89583m9339K5562K11085k95102j42825j20743M43852M3119j06061
13685E78829k0309j77581K52802k91478J75076J57931l35827M1213o8047R326
13675C21935N21180C73522K39638J56208l31498J14993A52103M40063j13537B05444
13664D34652J37185k49679k6957J36680M53467B4035L59042P2770q277l8377A11528
13652F97102l08195A80261J94029M814K55128o2717j37639O924A44179L71675
13642E15854J65555L3602j90915q759q4549J11101l5983j10993m459L06755l39748
$$ plain form
13631 357461 746477 315268 295173 482856 451551 529684 383251 347933 521098 463855
13621 463855 542965 385914 659265 290530 423791 618828 514049 123655 638414 328295
13611 328295 404411 784174 341691 581670 344963 474529 623147 422017 625972 540617
13601 540617 446866 345482 172560 245091 315318 443566 465421 683534 361214 464103
13591 464103 521951 457541 296815 264297 447673 157585 155579 607458 239183 631568
13581 631568 113976 456092 390999 570000 374471 -15344 197627 178875 264802 171366
13571 171366 777066 257415 94549 178473 252319 442854 463361 350808 388534 670075
13561 670075 184824 495057 319738 318973 295298 434836 64241 334902 160100 406338
$$ packed form
13631C57461L89016C15268k0095J87683l1305P8133j46433l5318J73165n7243
13621D63855P9110j57051K73351B90530J33261J95037j04779A23655N14759l10119
13611C28295P6116L79763C41691K39979k36707J29566J48618k01130K03955q5355
13601E40617r3751j01384A72560P2531P0227J28248K1855K18113l22320J02889
13591D64103N7848o4410j60726l2518J83376A57585k006M51879B39183L92385
13581F31568A13976L42116o5093J79001j95529a5344A97627j8752Q5927r3436
13571A71366O05700B57415I4549Q3924P3846J90535K0507j12553L7726K81541
13561F70075A84824L10233j75319p65k3675J39538F4241K70661A60100K46238
$$ plain form
13551 406338 31471 298249 106962 126181 445490 163957 650722 96495 398999 542189
13541 542189 217725 517520 263363 725093 239425 155986 577265 313430 360553 336772
13531 336772 307537 186829 334786 581302 127175 212011 636193 304234 188101 -13974
13520 243766 225032 90252 441777 206560 237714 336823 457254 368081 629397 352812
13510 352812 255773 381873 296013 620689 342287 362017 360003 151745 199976 -173561 -22363
13498 73817 65719 161944 341913 353734 341727 67572 238890 135780 247244 207568 2701
13486 77002 595952 180407 341525 349733 139118 200254 191813 61513 363909 308294 92953
13474 395825 115476 317024 85487 328965 402311 274880 174191 310487 157435 381259
$$ packed form
13551D06338C1471K66778A06962J9219L19309A63957M86765I6495L02504J43190
13541E42189B17725K99795k54157M61730B39425q3439M21279k63835M7123k3781
13531C36772k9235j20708J47957K46516A27175Q4836M24182C04234j16133a3974
13520B43766j8734I0252L51525B06560L1154R9109J20431q9173K61316k76585
13510C52812r7039J26100q5860L24676k78402J9730k014A51745M8231a73561b2363
13498G3817q098R6225J79969J1821j2007F7572J71318j03110J11464l9676B701
13486G7002N18950A80407J61118Q208A39118O1136q441F1513L02396n5615I2953
13474C95825A15476K01548H5487K43478P3346j27431j00689J36296j53052K23824
$$ plain form
13464 381259 187435 210048 413180 29041 268137 157793 113713 185192 347276 138833
13453 391251 345369 133749 117400 414698 366698 386729 167703 324578 433414 379241
13443 379241 159386 207323 211751 166919 322921 385552 14573 228372 322036 796857 -70493
13431 425368 391349 117969 354402 229322 282561 527182 186001 161716 330204 259797
13421 259797 290534 390029 64478 433532 289456 159536 394360 89110 183514 410684
13411 410684 321245 380838 167954 359719 374391 70509 79492 156267 -31624 463540 161402
13399 -35774 233007 155294 354266 457210 309772 261085 61293 -2943 108357 -171422 446114
13387 -23005 57697 448677 482805 220800 10893 469086 209850 217310 176476 275412 204344
$$ packed form
13464C81259A87435K2613K03132B9041K39096j10344m4080P1479J62084A38833
13453C91251m5882A33749j6349K97298m8000K0031A67703J56875J08836n4173
13443C79241A59386M7937M428m4832J56002O2631A4573K13799R3664M74821g0493
13431D25368l4019A17969K36433j25080N3239K44621A86001k4285J68488p0407
13421B59797L0737R9495F4478L69054j44076j29920K34824H9110R4404K27170
13411D10684q9439N9593A67954J91765J4672G0509Q983P6775c1624D63540A61402
13399c5774B33007p7713J98972J02944j47438m8687F1293b943A08357a71422D46114
13387b3005E7697L90980L4128B20800A0893M58193B09850P460m0834R8936p1068
$$ plain form
13376 204344 305181 345629 27544 290717 386214 190411 348823 -152619 77911 502724
13366 502724 206778 73155 172378 -27324 101549 342068 438355 -93867 366463 110277
13355 -60332 185074 506897 575187 366348 489755 147703 248671 288617 648404 372303
13345 372303 161481 196405 271236 499009 187098 83200 188765 105450 372821 507070
13335 507070 255236 299102 193594 -19466 -55217 330666 403316 228517 471308 347296
13325 347296 265145 -85790 152279 233038 341455 414140 532079 210755 139697 195842 536906
13314 536906 607312 133114 263423 121073 295796 121823 330679 200125 247791 299181
13304 299181 202402 -232091 181827 181692 -109721 305843 72713 34911 147436 329872 365249
$$ packed form
13376B04344J00837M0448B7544K63173R5497A90411J58412a52619G7911M24813
13366E02724B06778G3155R9223b7324A01549K40519R6287i3867C66463A10277
13355f0332A85074L21823O8290k08839J23407A47703J00968L9946L59787k76101
13345C72303A61481L4924P4831K27773A87098H3200J05565q3315K67371J34249
13335E07070k51834M3866j05508a9466l5751C30666P2650j74799K42791j24012
13325C47296q2151h5790A52279Q0759J08417P2685J17939B10755p1058N6145L41064
13314E36906P0406A33114J30309A21073J74723A21823K08856j30554M7666N1390
13304B99181r6779b32091A81827j35a09721C05843G2713C4911J12525J82436L5377
$$ plain form
13293 365249 228785 495321 279355 400652 354761 267698 33491 429468 409995 118209
13282 89892 -103172 -105566 59689 370091 196955 303703 181621 -94705 27093 -159268 53802
13270 414636 107830 30985 211381 87540 365926 48417 318862 -13536 112271 110820 -37004
13258 65411 -44686 334839 70381 184045 -344517 -203615 -63683 254306 191432 177908 -239458
13246 -365700 -221697 205940 -150147 114079 36510 564248 153016 136475 143601 -31696
13235 -125778 -9951 225386 88199 110459 472756 23470 321658 155041 42232 454518 291532
13224 291532 -242308 27604 88547 48044 -198838 352274 269828 395182 -134498 226402
13213 28186 95004 200035 -207203 121298 -16072 556382 -24921 111993 463139 -13646
$$ packed form
13293C65249j36464K66536k15966J21297m5891q7063C3491L95977j9473A18209
13282H9892a03172k394E9689L10402j73136J06748j22082i4705B7093a59268E3802
13270D14636A07830C0985J80396H7540K78386D8417K70445a3536A12271j451c7004
13258F5411d4686C34839G0381J13664c44517J40902f3683B54306o2874j3524b39458
13246c65700J44003B05940a50147A14079C6510N27738A53016j6541P126c1696
13235a25778i951B25386H8199K2260L62297B3470K98188A55041D2232M12286j62986
13224B91532b42308B7604O0943m0503a98838C52274q2446J25354a34498B26402
13213B8186O6818J05031b07203A21298a6072E56382b4921A11993L51146a3646
$$ plain form
13202 -47508 15958 185436 84407 340852 35383 130991 -256275 168655 28584 272225 55055
13190 270576 371214 132030 148029 -163729 310248 168321 -69314 -249210 13635 127804
13180 127804 128514 385415 91453 13407 400328 24961 298081 320972 -312202 250242 409991
13169 409991 -303419 78388 114174 318181 -32846 -65314 126518 245167 228063 185644 141778
13158 141778 54393 101356 22181 -4704 285735 -8470 -36652 259948 -114846 -181501 -136225
13147 -136225 290661 10473 62000 76335 111371 27827 79460 77694 -45027 101253 295620
13136 295620 57980 110732 107683 323998 250022 14665 -212820 -107295 -177127 330081 99932
13124 372238 -90920 -151099 17214 355680 197657 -101164 227349 116861 -272552 -600999
$$ packed form
13202d7508A5958J69478H4407K56445C5383R5608b56275A68655B8584K43641E5055
13190B70576J00638A32030J5999a63729C10248j41927f9314j79896A3635J14169
13180A27804P10K56901I1453A3407L86921B4961K73120K2891c12202B50242J59749
13169D09991c03419G8388L5786K04007c2846l2468A26518J18649j7104m2419m3866
13158A41778E4393M6963B2181d704B85735h470k8182B59948a14846o6655M5276
13147a36225B90661A0473N1527J4335L5036B7827N1633j766d5027A01253J94367
13136B95620E7980N2752l049K16315p3976A4665b12820J05525o9832C30081I9932
13124C72238i0920o0179A7214L38466j58023a01164B27349j10488b72552l28447
$$ plain form
13114 -600999 256549 -332302 412053 -212935 77296 28658 21901 98934 104250 299524 -197446
13102 107358 121826 232971 87495 -18930 -27282 286048 -15782 -31312 160796 168522 268242
13091 268242 19976 11607 20397 205240 282824 281331 -187366 90939 -83306 -111692 110837
13079 441182 87657 20933 144978 210548 153627 131469 159000 240316 207305 59156 -45368
13067 -3122 149012 -76286 -125672 256410 182640 177353 46268 -254692 118281 321961 308994
13056 308994 38230 326169 354607 17758 -14166 -97053 105781 248188 172114 543433 244537
13044 385287 120050 57800 301801 -39246 12400 37107 228488 -313567 -111396 1457 211681
13033 211681 -107621 388801 173335 -302057 270525 248116 182808 266021 -174903 -124643
$$ packed form
13114f00999B56549c32302D12053b12935G7296B8658o757P7033N316J95274a97446
13102A07358J4468J11145H7495a8930q352B86048a5782j5530A60796P726R9720
13091B68242A9976q369Q790J84843P7584j493a87366I0939h3306k8386A10837
13079D41182H7657B0933J24045O5570n6921k2158K7531Q1316l3011E9156d5368
13067c122A49012g6286m9386B56410p3770n287D6268b54692A18281K03680j2967
13056C08994C8230K87939K8438A7758a4166q2887A05781J42407p6074L71319B44537
13044C85287A20050E7800K44001c9246A2400K4707J91381c13567a11396A457K10224
13033B11681a07621C88801A73335c02057B70525k2409o5308Q3213a74903N0260
$$ plain form
13023 -124643 261936 77058 228598 248949 104983 175537 -77473 13721 101607 39775 -34271
13011 -60017 58054 -156886 258129 30109 631617 90810 65148 49030 276928 177874 189048
13000 189048 -99618 3613 167814 -234916 289213 225865 -23775 36568 25955 145201 -70572
12988 109655 10985 12792 158038 -74438 -91379 -11959 -37215 69825 -183619 168798 142659
12977 142659 -92479 67678 86508 234858 344198 -198598 -5023 57388 148554 179790 112900
12966 112900 -230916 -25350 -117596 229715 156208 -239657 2498 351696 -142362 -95337 -40925
12954 -67428 124940 18288 473863 46899 -57407 -51110 -61586 136485 224631 109000 90729
12943 90729 -243262 86433 156454 -96172 36546 -229500 116696 105212 209484 -158137 -207984
$$ packed form
13023a24643B61936G7058J51540K0351A04983P0554g7473A3721Q7886C9775c4271
13011f0017E8054a56886B58129C0109O01508I0810k5662j6118K27898r9054J1174
13000A89048i9618C613J64201b34916B89213o3348b3775C6568j0613J19246g0572
12988A09655A0985J807J45246g4438j6941a1959k5256F9825a83619A68798k6139
12977A42659i2479F7678J8830J48350J09340a98598e023E7388R1166L1236o6890
12966A12900b30916b5350r2246B29715p3507b39657B498L49198a42362M7025d0925
12954f7428A24940A8288M55575D6899e7407O297j0476A36485Q8146A09000j8271
12943I0729b43262H6433P0021i6172C6546b29500A16696j1484J04272a58137m9847
$$ plain form
12932 -207984 -23736 -85138 396212 -80507 -26750 174707 108543 46100 507609 -255988 378091
12920 241613 -218717 154689 100279 204680 151003 83789 240488 -35029 131745 148544
12910 148544 146917 358278 80118 66889 18193 -62212 -53284 249121 24031 180067 -240272
12898 172722 302746 45682 233423 80861 -234388 -41627 184312 8431 366085 304401 -284594
12886 342680 -104484 76699 66237 228379 -128326 178557 145117 54398 218507 -48711
12875 1341 180119 177378 217151 -300833 -11271 -147794 -92047 192898 470906 31772 54818
12864 54818 149352 52658 -219899 82678 77818 157485 147093 -220176 193447 19806 -291444
12852 230842 -38129 -406056 -258061 -56479 120309 -128371 133908 -13327 90049 231730
$$ packed form
12932b07984b3736o1402C96212h0507b6750A74707o6164D6100M61509b55988C78091
12920B41613b18717A54689n4410J04401n3677o7214J56699c5029A31745J6799
12910A48544j627K11361H0118j3229A8193f2212Q928B49121B4031J56036b40272
12898A72722J30024D5682J87741H0861b34388d1627A84312H431L57654o1684b84594
12886C42680a04484G6699j0462J62142a28326A78557l3440E4398J64109d8711
12875A341J78778k741L9773c00833a1271j36523N5747A92898K78008C1772K3046
12864E4818R4534E2658b19899H2678m860P9667j0392b20176A93447A9806b91444
12852B30842c8129l67927J47995e6479A20309a28371A33908a3327I0049J41681
$$ plain form
12842 231730 221182 93594 210355 182817 259815 86936 87034 -49615 13600 41062 28727 -87005
12829 -65096 127353 -99445 -202717 235116 -92378 283156 -179694 181353 350233 202161
12819 202161 -150567 -23537 158111 75587 308655 -223379 -70659 -232658 -63065 -112369
12809 -112369 -255786 -253062 152252 167251 189390 159383 16980 18719 14367 -130152 -68208
12798 -68208 -157234 118197 81788 -106799 196008 -30309 395850 399045 -96695 29933 -53092
12786 -9255 44055 66377 125045 231810 6074 30511 -307262 -40454 -145662 87674 -93567
12774 221829 165796 68634 252462 -86954 160035 -7755 -13223 -88669 24599 -369518 38455
12762 310444 448589 56660 -188564 107760 444886 -67316 -6703 219748 170301 -192183
$$ packed form
12842B31730j0548I3594J16761k7538P6998H6936R8d9615A3600K7462j2335h7005
12829f5096A27353i9445j03272B35116i2378B83156a79694A81353J68880j48072
12819B02161a50567b3537A58111G5587K33068b23379g0659j61999f3065m9304
12809a12369j43417K724A52252J4999K2139l0007A6980J739m352a30152O1944
12798f8208q9026A18197l6409a06799A96008c0309C95850L195i6695B9933e3092
12786i255D4055K2322N8668J06765F074K4437c07262d0454j05208H7674i3567
12774B21829n6033F8634J83828h6954A60035g755n468p5446B4599c69518C8455
12762C10444J38145E6660a88564A07760L37126f7316f703B19748m9447a92183
$$ plain form
12751 16996 -25267 182223 -57987 -71058 129213 39706 213206 37629 239269 18162 -363736
12739 9783 85010 -173342 -2124 297055 211579 72758 330196 321543 -70777 84280 -83855 -78511
12727 -78511 16979 49915 10087 -14843 40131 9297 -145736 -119095 217548 162229 -53273
12715 172394 -50872 57582 -3383 -281212 173065 -81453 -126249 169156 172451 260647 101194
12703 192689 180056 294557 223231 381340 51407 354206 358278 15005 552107 136499 159278
12692 159278 24771 -33143 -93731 150369 -110302 14383 -17034 -10371 152545 126391 82626
12681 82626 90217 -146897 182972 39093 35573 -130613 241985 206894 136569 -203814 208510
12669 -180452 141758 96874 314455 -139170 93849 73274 -22010 297635 -178196 -55183
$$ packed form
12751A6996b5267A82223e7987j3071A29213C9706J73500C7629K01640A8162c63736
12739I783P5227a73342b124B97055q5476G2758K57438q653g0777H4280h3855N344
12727g8511A6979L2936A0087a4843D0131I297a45736K6641B17548n5319e3273
12715A72394e0872E7582c383k77829A73065h1453m4796A69156L295Q8196A01194
12703A92689j2633J14501p1326J58109E1407L02799M072A5005N37102A36499K2779
12692A59278B4771c3143o0588A50369a10302A4383a7034O663A52545k6154m3765
12681H2626P591a46897A82972C9093l520a30613B41985l5091p0325b03814B08510
12669a80452A41758m4884K17581a39170I3849k0575b2010B97635a78196e5183
$$ plain form
12658 -49406 4268 120489 179189 306524 227850 -10397 -288103 155147 -29849 215164 73315
12646 -150562 -62867 -125180 108854 -199549 75796 216617 -5768 -159134 42586 -51364 -263567
12635 -263567 79245 70442 -8479 230262 307930 309412 388717 306977 165100 60994 327634
12624 327634 48448 92068 394342 -196460 108544 254085 -351727 77267 200804 -138080
12613 409566 164034 25473 236965 168990 -12810 -10878 233500 63292 27856 -121082 294833
12601 227695 357628 157333 261752 -18025 34287 62189 43617 381231 -35621 340922
12590 209478 -46301 144236 -186692 121361 191186 -38013 -103620 25703 18501 -214492 138756
12578 67802 -30732 -12979 13122 -182454 318027 -193823 -36993 -208456 25913 66009 -160601
$$ packed form
12658d9406D268J16221N8700J27335p8674a0397k77706A55147b9849B15164G3315
12646a50562f2867o2313A08854a99549G5796J40821e768j53366D2586e1364k12203
12635b63567G9245q803h479B30262P7668J482P9305q1740j41877F0994K66640
12624C27634D8448M3620L02274a96460A08544J45541c51727G7267J23537a38080
12613D09566A64034B5473K11492o7975a2810J932B33500F3292B7856a21082B94833
12601B27695J29933A57333J04419a8025C4287K7902j8572L37614c5621C40922
12590B09478d6301A44236a86692A21361O9825c8013o5607B5703p202b14492A38756
12578F7802c0732a2979A3122a82454C18027a93823c6993j71463B5913M0096a60601
$$ plain form
12566 300917 -198123 41848 34732 6290 79630 15263 -10038 148204 113256 251303 -179234
12554 271670 341856 282637 189791 108635 -222110 -90893 -149085 99609 235896 60753 -42706
12542 -285016 23406 354728 70566 57803 129258 -11350 -36880 141879 -38384 283511 -232381
12530 -165356 -107612 -102079 -122051 232836 77278 -177479 -27378 130983 -10680 89929 -19150
12518 53679 -194280 70448 38293 166131 202179 -289167 -40722 -26086 86178 104822 63809
12507 63809 -254078 -101835 -82166 49708 63348 -268927 115036 136081 -164039 12603 -233876
12495 -284759 229049 256419 -54068 199344 -166156 130544 -161490 141697 197392 -52182
12484 63661 31269 41912 115615 195065 -147155 99286 -75969 -324603 165877 -11419 -44500
$$ packed form
12566C00917a98123D1848p116F290P3340A5263a0038A48204l4948J38047a79234
12554B71670P0186n9219r2846q1156b22110i0893n8192I9609J36287F0753d2706
12542b85016B3406L31322G0566j2763P1455a1350k5530A41879c8384B83511b32381
12530a65356N7744N533j9972B32836G7278a77479b7378A30983a0680H9929a9150
12518E3679a94280G0448l2155J27838L6048b89167d0722J4636H6178J8644m1013
12507F3809b54078a01835J9669D9708J3640b68927A15036K1045a64039A2603b33876
12495b84759B29049K7370e4068A99344a66156A30544a61490A41697N5695e2182
12484F3661C1269J0643P3703P9450a47155I9286g5969k48634A65877a1419l3081
$$ plain form
12473 -44500 -146631 295118 137637 2783 -114679 387735 -119018 43159 149015 56099
12462 -104458 -96561 69518 -109296 214019 281497 -2467 -53470 108759 58294 -38191 349018
12450 -172346 -26125 326034 10705 191581 171176 -129592 -334051 111345 62151 96616
12440 96616 2029 -16625 -114925 -42515 318192 -270949 39876 -29315 -122315 102429 203382
12429 203382 439944 -100224 -60438 -235550 99393 246234 37421 241554 -178040 -6287
12418 -44597 -127469 -238230 -43734 81782 109713 216537 -402316 101644 -40677 308847 42698
12406 -33587 -99539 100059 273899 -127823 -86177 158862 -130945 -124068 -202756 -58105 -125131
12395 -125131 -64431 -253691 31547 -118023 155343 -164760 -227025 -152744 -472381 -242425
$$ packed form
12473d4500j02131B95118A37637B783a14679C87735a19018D3159J05856E6099
12462a04458P897F9518a09296B14019O7478b467n1003A08759n0465c8191C49018
12450a72346b6125C26034A0705J80876k0405a29592k04459A11345m9194L4465
12440I6616B029a6625r8300d2515C18192b70949C9876b9315r3000A02429J00953
12429B03382K36562a00224L9786j75112I9393J46841C7421K04133a78040f287
12418d4597q2872j10761d3734H1782K7931J06824d02316A01644d0677C08847D2698
12406c3587o5952A00059J73840a27823M1646A58862a30945O877p8688e8105o7026
12395a25131O0700j89260C1547a18023A55343a64760o2265P4281l19637K29956
$$ plain form
12385 -242425 -13334 -242569 188372 70356 220293 -39276 335399 -103643 384948 117836
12374 -154846 115539 -57533 330911 121686 -342779 -5914 289181 341184 119923 89221
12364 89221 -12807 1211 102923 32396 8996 -4299 3755 44292 -108238 -245466 161156 -161212
12351 276544 23528 97408 345571 119754 176705 232027 373143 383693 -5477 -85176 -279000
12340 -279000 19448 251918 -139580 -51058 134922 -148658 -76204 -265805 -450113 -103528
12329 95364 -281202 -80799 -5716 184910 -116838 131109 125995 266601 -17759 -111703 165967
12317 85365 -298522 79615 281984 235858 192115 -12414 250846 -60942 165043 -337181 -17885
12305 75264 318722 -144548 -233248 -235100 28767 204557 43516 277238 175558 -15379 109108
$$ packed form
12385b42425a3334k29235A88372G0356J49937c9276C35399a03643C84948A17836
12374a54846A15539e7533C30911A21686c42779e914B89181N2003A19923l0702
12364H9221a2807A211J01712C2396H996d299C755M0537a08238j37228A61156a61212
12351B76544B3528P3880K48163A19754N6951N5322J41116J0550e477p9699j93824
12340b79000A9448K32470a39580e1058A34922a48658P2454j89601j84308a03528
12329I5364b81202h0799e716A84910a16838A31109n114J40606a7759r3944A65967
12317H5365b98522G9615K02369m6126m3743a2414B50846f0942A65043c37181a7885
12305G5264K43458a44548q8700j852B8767J75790D3516K33722j01680a5379A09108
$$ plain form
12293 -192081 -104287 7187 216140 180692 -377799 -16950 190089 114297 40221 184269 335991
12282 335991 128738 466737 30739 180839 35900 132343 246802 -9326 -58103 208474 82841
12270 473578 54928 134361 219800 141656 82636 109297 324244 -357485 38516 82040 411639
12259 411639 272696 -6221 -10043 -150644 29930 -104993 -108009 172854 -38407 132525 8123
12247 -167864 -55618 192972 -82166 7961 208242 2824 440474 -84028 -201549 -310890 330698
12235 92823 130844 262563 9821 321303 203079 -300606 54799 343131 339534 144219 185479
12224 185479 407152 276776 128922 333655 276903 -3920 316562 355157 24470 28061 67124
12213 67124 193897 228170 104099 51792 82669 204801 150392 -81550 72342 262454 224263
$$ packed form
12293a92081Q7794G187K08953l5448c77799a6950A90089p5792D0221J44048J51722
12282C35991A28738L37999C0739J50100C5900R6443J14459i326m8777B08474H2841
12270D73578E4928P9433Q5439p8144n9020K6661K14947c57485C8516M3524L29599
12259D11639j38943f221l822j40601B9930a04993l016A72854c8407A32525H123
12247a67864e5618A92972h2166G961K00281B824M37650h4028j17521j09341C30698
12235I2823L8021J31719I821L11482j18224c00606E4799K88332l597A44219M1260
12224A85479K21673j30376A28922K04733n6752c920C16562L8595B4470L591L9063
12213F7124J26773L4273A04099E1792L0877J22132n4409h1550G2342J90112l8191
$$ plain form
12202 224263 305978 127359 15258 314629 100972 232271 -21899 334634 -25451 64022
12191 238514 167963 291368 314841 257560 464102 114324 215213 188573 -277813 97472
12180 -165634 412837 299762 85665 19994 34555 98571 58081 361637 288982 238235 -32726
12168 79824 123508 127880 -103317 39891 136301 250774 303572 162278 424830 -162663 210496
12156 -49276 219245 185674 -39430 -40200 313551 448394 691 -12052 287883 -167580 66077
12144 226442 298054 335642 33615 383527 -137066 -57961 129284 93112 35828 14718 -239400
12132 208385 -225557 -110196 179546 16348 -170898 -268248 -292734 143146 77268 -18826
12121 -39471 -53250 16215 103176 298045 -304223 -231262 -331496 66218 -334228 -35200 -143474
$$ packed form
12202B24263Q1715A27359A5258K99371A00972J31299b1899C34634b5451F4022
12191B38514p0551J23405K3473n7281K06542A14324J00889k6640b77813I7472
12180a65634D12837j13075H5665A9994J4561O4016m0490L03556p2655n0747c2726
12168G9824M3684M372a03317C9891R6410J14473N2798j41294K62552a62663B10496
12156d9276B19245l3571c9430p70C13551J34843F91a2052B87883a67580F6077
12144B26442P1612L7588C3615L49912a37066e7961A29284l6172C5828A4718b39400
12132B08385b25557a10196A79546A6348a70898r7350k4486A43146o5878a8826
12121c9471j3779A6215Q6961J94869c04223P2961j00234F6218c34228c5200j08274
$$ plain form
12110 -143474 10906 -134898 144179 -50575 23957 92464 -329581 -10329 263807 31756 61052
12099 61052 65140 377030 231130 248710 -70872 -158322 168561 119045 -28592 158100 399473
12088 399473 -19641 -46471 88437 -11229 -223524 81064 -8455 -106962 -119050 -117028 158081
12076 -171590 37843 91226 -122629 38260 -191177 282175 61612 -150117 426441 22801
12065 322525 104123 408621 1039774 1858643 2040567 1018879 492902 84508 123340 123541
12055 123541 -39601 177912 -139269 76983 -217753 338873 118588 -5174 49555 -52062 -148192
12044 -148192 -63216 6398 -224817 -163433 9037 -120052 3806 -148457 186446 4049 68154
12033 68154 3472 164744 -363483 -162398 109582 -178103 295082 113862 200980 -204605
$$ packed form
12110a43474A0906a34898A44179e0575B3957O8507c29581a0329B63807C1756K9296
12099F1052M088L11890j45900J7580g0872q7450A68561m9516b8592A58100K41373
12088C99473a9641k6830H8437a1229k12295H1064h455r8507j2088K022A58081
12076a71590C7843N3383a22629C8260a91177B82175F1612a50117D26441B2801
12065C22525A04123L04498O31153Q18869J81924A018879D92902H4508L8832K01
12055A23541c9601A77912a39269G6983b17753C38873A18588e174D9555e2062r6130
12044a48192f3216F398b24817O1384I037a20052C806a48457A86446D049O4105
12033F8154C472J61272c63483a62398A09582a78103B95082A13862Q7118b04605
$$ plain form
12022 -159131 -32612 42868 128020 -109871 -162194 250346 -261365 -75127 -52298 -18631 -20418
12011 -20418 -38606 86496 -66313 353336 -56370 215145 104065 181705 -216504 285882 -121745
11999 11473 267547 -369399 344 -29609 -103415 126085 -171948 -296283 -452639 -160750 -288921
11988 -288921 123484 291332 -35547 -119998 -39907 -199397 -151369 -204093 -15623 -132672 168780
11976 83144 -137659 96718 -52477 118879 261557 -341462 -26621 293610 -115254 137501
11965 -30194 188586 275688 139483 7076 -140724 -331827 -70859 125552 -93040 -64005 182419
11953 -76110 -100183 -244143 -35913 104586 50291 292531 -257115 -322093 30938 268658 -365620
11941 44509 47143 68147 33718 186306 138993 -101438 42405 -319534 -85888 -159842 -30200
$$ packed form
12022a59131c2612D2868Q5152a09871n2323B50346b61365g5127K2829a8631j787
12011b0418j8188H6496f6313C53336e6370B15145A04065P7640b16504B85882a21745
11999A1473K56074c69399C44b9609p3806A26085a71948j24335j56356a60750j28171
11988b88921A23484J67848c5547q4451c9907j59490M8028n2724a5623j17049A68780
11976H3144a37659I6718e2477A18879J42678c41462b6621B93610a15254A37501
11965c0194A88586Q7102j36205G076a40724j91103g0859A25552i3040K9035A82419
11953g6110k4073j43960c5913A04586E0291K42240b57115o4978C0938K37720c65620
11941D4509K634K1004C3718J52588m7313a01438D2405c19534h5888p3954c0200
$$ plain form
11929 -140175 325084 -193002 52141 41485 27733 30757 44257 215053 -108369 -215330 -60221
11917 -221560 -182749 -63412 286196 172737 126265 -164102 -81849 -184624 -289555 -63823
11906 -287888 360075 333969 -28454 159776 -119879 -2630 -17405 217338 321152 119857
11895 90595 -63874 -72409 191878 -3382 67433 368930 -213485 -8215 -55859 -9564 169499 -60087
11882 -111217 -57165 48459 12807 83214 -457730 41733 210069 -443653 17639 -169265 -243088
11871 -243088 -144223 -28652 81052 19238 -27240 -359868 -11976 -331217 -212329 162015 99978
11860 99978 -329934 -104684 10070 -114786 98269 -403428 -218737 -152514 -12101 -183354
11850 -183354 125710 81022 465158 85888 -147620 -36952 -154603 324725 56829 91110
$$ packed form
11929a40175C25084a93002E2141j0656j3752L024J3500J70796a08369j06961f0221
11917b21560L8811f3412B86196j13459m6472a64102h1849j02775j04931f3823
11906b87888C60075k6106b8454A59776a19879b630j4775B17338J03814A19857
11895I0595f3874q535A91878c382F7433L01497b13485h215m7644i564A69499f0087
11882a11217N4052D8459A2807P0407d57730D1733J68336d43653A7639a69265p3823
11871b43088R8865b8652H1052A9238b7240l32628a1976l19241J18888A62015o2037
11860I9978c29934a04684A0070a14786I8269d03428J84691O6223a2101j71253
11850a83354A25710m4688L84136H5888a47620c6952j17651C24725E6829L4281
$$ plain form
11840 91110 -95019 301386 -31664 92993 293814 -48063 219283 304834 275027 198042 -259259
11828 -146731 139778 157119 -73217 238705 -124634 411986 151307 122067 -326447 46855
11817 -248478 88304 -70904 243635 -87136 -159504 -508594 -24030 104264 155601 263684 -39649
11805 -376944 -157869 211534 -325941 -68790 -160779 46578 108327 -61655 -133292 -931 -263516
11794 -263516 -107692 -59564 138891 60575 -35589 58927 34714 468045 217184 -15998 161491
11782 59444 120432 -344205 -41222 -2573 -7441 -123356 -236203 9952 -34735 -119326 -38049 -234783
11770 -234783 -313358 200303 362120 -120955 -327619 -176126 56913 102678 -426852 -120575
11759 -78127 38166 14989 22809 138528 458136 -217731 251196 -97802 -104365 12074 460685
$$ packed form
11840I1110i5019C01386c1664I2993K00821d8063B19283Q5551k9807p6985b59259
11828a46731A39778J7341g3217B38705a24634D11986A51307k9240c26447D6855
11817b48478H8304g0904B43635h7136p2368l49090b4030A04264N1337J08083c9649
11805c76944a57869B11534c25941f8790r1989D6578O1749f1655p1637i31k62585
11794b63516a07692M8128A38891F0575c5589E8927k4213M33331B17184a5998A61491
11782E9444O0988c44205d1222b573m868j15915j12847I952c4735q4591c8049j96734
11770b34783p8575B00303J61817a20955k06664J51493E6913M5765d26852a20575
11759g8127C8166A4989P820J15719L19608b17731B51196i7802o563A2074M48611
$$ plain form
11748 460685 119681 -120510 -9094 -103060 250930 -174016 290801 263667 198790 256311 -307468
11736 234099 149582 -15971 24481 111818 113984 126495 25580 -336682 -228337 -93180 -139750
11725 -139750 -196709 -143101 229720 243022 22149 212983 51621 -74233 48828 -176545 -137979
11714 -137979 130396 218096 -6197 -40615 11398 366927 -58980 33948 -154026 110935 -18212
11702 -111620 -121312 29952 163907 52390 -37399 -298103 -191117 -323656 379406 -112154
11691 -136869 208227 -335765 -315896 208745 93404 -138081 -140879 99977 -88191 12580 267674
11680 267674 -159168 154121 -10580 206021 207979 18389 -206042 68701 96870 -140275 259081
11668 45677 -100892 -144846 -199042 -1126 -169599 49192 -109406 175402 -206458 193750 -67844
$$ packed form
11748D60685A19681a20510i094r3966B50930a74016B90801k7134o4877N7521c07468
11736B34099q4517a5971B4481Q7337K166J2511B5580c36682J08345i3180m6570
11725a39750n6959N3608B29720J3302B2149J90834E1621g4233D8828a76545L8566
11714a37979A30396Q7700f197l4418A1398L55529e8980C3948a54026A10935a8212
11702a11620r692B9952J33955E2390c7399k60704J06986j32539C79406a12154
11691a36869B08227c35765J9869B08745I3404a38081k798I9977h8191A2580K55094
11680B67674a59168A54121a0580B06021J958A8389b06042F8701K8169a40275B59081
11668D5677a00892m3954n4196a126j68473D9192a09406A75402b06458A93750f7844
$$ plain form
11656 296622 230862 -180156 167073 -189161 9836 105117 120134 -144758 -196937 -24315 172153
11644 158206 25076 -1766 -270754 55163 128456 284058 165837 212272 327289 -313110 35701
11632 -115577 227537 17253 7669 -50872 223833 -81857 -96399 -46224 -179859 218006 -35037
11620 -4686 178445 221673 32848 95821 105619 124785 -256290 -26279 53478 -272839 -34231
11608 15302 -584 -189210 -12257 343642 -78790 77351 58017 6316 169611 105594 31023 149068
11596 149068 349723 331681 342733 352493 -156781 -135785 403813 6119 -264036 10631 106318
11585 106318 -55576 35389 150677 412577 421173 -111906 -58304 263854 -112902 342485
11574 526817 165160 78348 -173888 84979 -72136 -79948 13872 -400862 -301441 383661 -157494
$$ packed form
11656B96622o5760a80156A67073a89161I836R5281J5017a44758n2179b4315A72153
11644A58206B5076a766k68988E5163P3293J55602j18221M6435J15017c13110C5701
11632a15577B27537A7253G669e0872B23833h1857j4542d6224j33635B18006c5037
11620d686A78445M3228C2848O2973R798J9166b56290b6279E3478b72839c4231
11608A5302e84j88626a2257C43642g8790G7351j9334F316J63295o4017C1023J18045
11596A49068K00655j8042J1052R760a56781K0996D03813F119b64036A0631R5687
11585A06318e5576C5389J15288K61900Q596a11906N3602B63854a12902C42485
11574E26817A65160G8348a73888H4979g2136p812A3872d00862R9421C83661a57494
$$ plain form
11562 106588 -55643 133121 104122 61238 63253 -20550 311159 95663 31448 -129599 -25085
11550 199930 300970 -73915 220152 -274609 -26223 -51161 -163020 151099 317539 -148794
11539 -256714 41457 225264 242975 171365 487936 -120481 -446574 40275 -25267 -10998 -119748
11528 -119748 104004 33144 255120 212206 -231535 277699 -150164 117166 81128 79942
11518 79942 221581 200859 514172 -16136 -108729 -17316 -10630 8500 358736 -41302 516551
11506 260478 336759 84572 17915 -274919 193760 149607 65027 29395 95892 -73028 196411
11494 218220 46286 357451 16551 249467 -63128 -37911 -180003 -68704 348525 80657 270227
11483 270227 311241 149099 437328 203806 134877 -20669 287348 228210 62082 252824
$$ packed form
11562A06588e5643A33121k8999m2884K015b0550C11159I5663C1448a29599b5085
11550A99930J01040g3915B20152b74609b6223k4938j11859A51099J66440a48794
11539b56714D1457J83807J7711p1610L16571a20481l26093D0275b5267a0998j08750
11528a19748A04004C3144K21976m2914b31535B77699a50164A17166l6038j186
11518G9942J41639k0722L13313a6136r2593a7316O686H500L50236d1302E16551
11506B60478P6281H4572A7915b74919A93760m4153F5027B9395O6497g3028A96411
11494B18220D6286L11165A6551K32916f3128K5217j42092f8704C48525H0657J89570
11483B70227M1014A49099K88229B03806o8929b0669B87348n9138F2082J90742
$$ plain form
11473 252824 51855 150274 171006 -49691 33041 313377 234617 206222 218988 310426 99395
11461 394963 131358 -53116 -41419 -75885 243402 339794 -193587 104316 296442 -37765
11450 -100627 127775 84360 -121055 50568 298316 97851 195622 -191469 15156 -44416 71975
11438 -102744 104221 -269534 -181598 29916 -197437 -38850 290851 34492 -224502 267507
11427 -24431 -39602 -180177 -12674 -143392 -13964 1415 321088 -35501 115234 226669 -71193
11415 -90404 52117 35287 310615 61731 100646 136321 64524 252497 -235989 140185 42648
11403 -355404 169375 -64170 -27479 85517 -11517 313865 -284779 -236923 465013 2787 1781
11392 1781 162125 68004 108789 68274 -36327 46215 5797 132352 140161 -236877 77042 116655
$$ packed form
11473B52824E1855R8419K0732d9691C3041K80336p8760k8395J2766R1438I9395
11461C94963A31358e3116J1697l4466B43402R6392a93587A04316J92126c7765
11450a00627A27775m3415a21055E0568K47748I7851R7771a91469A5156d4416G1975
11438a02744A04221b69534Q7936B9916a97437c8850B90851C4492b24502B67507
11427b4431j5171j40575a2674j30718a3964A415L19673c5501A15234J11435g1193
11415i0404E2117j6830K75328F1731L8915L5675F4524J87973b35989A40185D2648
11403c55404A69375f4170b7479H5517a1517C13865b84779M7856D65013B787j006
11392A781J60344F8004M0785m0515c6327D6215E797J26555P809b36877G7042L9613
$$ plain form
11380 116655 5036 99102 153792 147036 37845 -140863 -98890 -109669 138511 -27692 140633
11368 -150671 -213181 185407 209992 92033 43487 127253 24852 118073 -235129 19181 169720
11357 169720 -14954 195825 -102861 125858 97526 236969 -94741 -122989 95938 -143971
11346 316937 -321981 -169672 278265 -163721 169999 -282340 76020 175072 -136375 -102755
11336 -102755 160789 -198069 -82682 -485026 213635 -46828 35178 -40817 -296956 243778
11325 119983 115157 -232924 175342 -22776 22565 -161448 -81105 -86141 353877 -3744 51077
11313 2723 -255386 265244 162684 60264 -98828 -262466 26301 -330222 -195697 106770
11302 -59664 -143802 -196090 -205708 263087 -41810 -157489 -142851 -150417 202373 -154368 82044
$$ packed form
11380A16655E036R4066N4690o756C7845a40863M1973j0779A38511b7692A40633
11368a50671o2510A85407K4585I2033D3487Q3766B4852R3221b35129A9181J50539
11357A69720a4954A95825a02861A25858k8332J39443i4741k8248I5938a43971
11346C16937c21981J52309B78265a63721A69999b82340G6020R9052a36375L3620
11336a02755A60789a98069h2682m02344B13635d6828C5178d0817k56139B43778
11325A19983m826b32924A75342b2776B2565a61448Q0343n036C53877c744E1077
11313B723b55386B65244j02560F0264i8828j63638B6301c30222J34525A06770
11302e9664q4138n2288r618B63087d1810j15679J4638p566B02373a54368H2044
$$ plain form
11290 23027 -48356 -463713 409164 -115856 -294015 -32004 -170051 -215578 595 -140150 32052
11278 -45665 21289 -123242 -84859 32766 39135 -263563 -104750 -404828 137787 130865 -55512
11266 -228404 25410 168659 -258970 -195965 46713 -116670 -259878 64802 -54703 304704
11255 87485 -75970 -284406 335957 65237 21507 130514 16127 -208478 27847 -149920 244318
11243 40242 -69588 98263 -270691 160788 -98654 74681 -120662 14465 -7476 56115 283173
11232 283173 26862 180881 86397 65855 -193070 -506996 138427 -37277 157474 90118
11222 90118 -16541 -213776 -69252 292194 49893 -43777 159126 -144660 -571144 101263
11211 -156989 -262965 231070 21381 -93322 -64868 -50333 78969 224920 -112829 176094
$$ packed form
11290B3027d8356m15357D09164a15856j78159c2004j38047m5527E95a40150C2052
11278d5665B1289a23242L8383C2766O369b63563a04750l00078A37787o922e5512
11266b28404B5410J43249b58970O3005D6713a16670j43208F4802e4703C04704
11255H7485g5970k08436C35957F5237B1507J09007A6127b08478B7847a49920B44318
11243D0242f9588I8263b70691A60788i8654G4681a20662A4465g476E6115K27058
11232B83173B6862J54019H6397k0542a93070l13926A38427c7277A57474o7356
11222I0118a6541j97235f9252B92194D9893d3777A59126a44660m26484A01263
11211a56989j05976B31070B1381i3322K8454J4535G8969J45951a12829A76094
$$ plain form
11200 108367 -49812 -88207 -180536 -56561 88163 -103904 -298819 48055 -51031 116996 3289
11188 -22203 45806 -6585 160154 78218 66177 -209601 48528 -257086 337930 -193054 -194814
11177 -194814 -51579 323593 -175605 92838 -218021 -55247 -53237 -108080 -112617 -65910 -152788
11166 -152788 -146849 142851 -215572 235830 -103521 -60425 -166191 95618 92762 -86726 25181
11154 216148 -213781 -421442 -285315 44220 486268 141140 224661 -167768 65056 126526
11144 126526 -19286 -25971 -217273 -102925 -86764 362772 -13923 -34196 11816 -93225 -147974
11133 -147974 -245207 -155371 -6238 -492389 121489 -152824 71587 314110 -40790 36532 21128
11122 21128 355150 18258 368121 -140514 -157500 1866 253065 393032 108016 50859 -481401
$$ packed form
11200A08367d9812l8395r2329e6561H8163a03904j94915D8055e1031A16996C289
11188b2203D5806f585A60154G8218j2041b09601D8528b57086C37930a93054j760
11177a94814e1579C23593a75605I2838b18021e5247K010n4843m537M6707q6878
11166a52788N939A42851b15572B35830a03521M3096j05766I5618k856h6726B5181
11154B16148b13781k07661J36127D4220M42048A41140Q3521a67768F5056O1470
11144A26526a9286o685j91302a02925J6161C62772a3923k0273A1816i3225n4749
11133a47974r7233Q9836f238m86151A21489a52824G1587K42523d0790C6532j5404
11122B1128L34022A8258L49863a40514j6986A866K51199J39967A08016E0859d81401
$$ plain form
11110 -112963 98725 89735 -270587 85430 217726 19536 49888 149464 339533 -52677 228051
11098 20795 313381 285243 455341 185338 253725 541452 208612 630516 503440 307571
11088 307571 -184402 221905 460316 230976 442721 205500 448351 -22780 170348 -26175
11077 233020 213331 176360 361570 360194 455838 30477 128388 532353 325300 443445 386168
11066 386168 559039 341993 256539 206158 294702 580314 507653 689530 697469 1045111 893652
11055 893652 702084 492578 910821 609197 967756 469012 869112 728002 768053 816308
11045 816308 854308 739021 348516 514122 1010541 696597 651371 900969 645457 581683
11035 581683 554637 631442 503556 626738 960890 978574 425668 862977 669146 593744
$$ packed form
11110a12963I8725q990b70587H5430J32296A9536L0352R9576J90069e2677B28051
11098B0795K92586k8138J70098A85338O8387K87727B08612M21904j27076j95869
11088C07571a84402B21905K38411k29340K11745B05500K42851b2780A70348b6175
11077B33020j9689l6971J85210j376R5644C0477R7911M03965k07053J18145n7277
11066C86168J72871k17046q5454n0381Q8544K85612p2661J81877P939L47642j51459
11055H93652j91568k09506M18243l01624L58559D69012M00100j41110M0051M8255
11045H16308L8000j15287C48516J65606M96419l13944m5226K49598k55512o3774
11035E81683k7046P6805j27886J23182L34152J7684D25668M37309j93831p5402
$$ plain form
11025 593744 617127 797199 553502 705571 668413 596195 597937 910568 604569 645717 842652
11014 842652 855317 546704 690618 871631 774088 346656 656307 422434 318911 610292
11004 610292 920382 499002 232004 605808 845869 687110 774697 645494 941324 653357
10994 653357 901375 891476 585825 564425 767839 818896 806499 1201339 1072285 995357 1076410
10983 1076410 1187990 1239187 933364 1497212 1330952 1383502 1762857 1803272 1966209 2434245
10973 2434245 3061172 3358622 3060805 3068157 2925786 3047208 2575524 2432491 2120665 2125298
10963 2125298 1676320 1813425 1681610 1374409 1866847 1478517 1915017 1623398 1936860
10954 1936860 1489397 1538310 1211425 1051481 1195191 717723 481616 375088 308550 541314
$$ packed form
11025E93744K3383J80072k43697J52069l7158p2218J742L12631l05999M1148J96935
11014H42652J2665l08613J43914J81013r7543C46656L09651k33873j03523K91381
11004F10292L10090m21380B32004L73804K40061j58759Q7587j29203K95830k87967
10994F53357K48018r899l05651k1400K03414N1057j2397L94840j29054p6928Q1053
10983A076410J11580N1197l05823N63848j66260N2550L79355M0415J62937M68036
10973B434245O26927K97450k97817P352j42371J21422m71684j43033l11826M633
10963B125298m48978J37105j31815l07201M92438l88330M36500k91619L13462
10954A936860m47463M8913l26885j59944J43710m77468k36107j06528o6538K32764
$$ plain form
10944 541314 417420 239953 20041 -163627 -91155 301362 17677 76305 -62913 145847
10933 133005 -17093 -191502 223337 259393 -27549 308387 -138843 -11050 298077 126947
10922 -36664 -196512 133124 127576 118210 -202118 -67131 -356567 87512 -2046 -89335 270516
10910 6559 152210 -101271 138686 -45972 76737 90398 312053 319394 97418 137607 178959
10899 178959 -38272 288128 -170500 327741 26416 93539 65979 162394 -158333 -233955 299028
10887 115385 -152332 -379013 -466117 -204270 -265131 262953 92726 174579 -155525 -71698
10876 213703 -43184 -282954 -154609 56913 83722 252812 34101 -136875 13567 143922
10866 143922 -337399 -398340 -168253 273799 238121 116960 -369774 18630 -73210 145334
$$ packed form
10944E41314j23894j77467B0041a63627P2472C01362A7677N8628f2913A45847
10933A33005a7093j74409B23337L6056b7549C08387a38843a1050B98077A26947
10922c6664j59848A33124n548r366b02118f7131k89436H7512b046q7289B70516
10910F559J45651a01271A38686d5972G6737J3661K21655P341I7418M0189M1352
10899A78959c8272B88128a70500C27741B6416O7123k7560R6415a58333p5622B99028
10887A15385a52332k26681q7104b04270o0861B62953I2726Q1853a55525g1698
10876B13703d3184k39770J28345E6913K6809J69090C4101a36875A3567J30355
10866A43922c37399o0941a68253B73799l5678A16960c69774A8630g3210A45334
$$ plain form
10855 98584 47810 -74318 -49984 -61635 -83708 -92146 3210 -256315 -122159 61758 -60384 -175175
10843 -175175 329422 194204 43107 -211194 179803 -111937 188779 43727 284667 -40329
10832 89591 57411 24411 -268762 71165 6712 30453 -181633 -96378 -253729 196676 378835
10821 378835 -99392 -162555 -72683 -74894 -28267 -375018 67823 -124247 37773 -26133 -25563 -23006
10809 -23006 58241 165196 -105075 42768 237533 -101716 -270950 -114304 -35560 178193
10798 -87226 -92381 -283138 -180855 25453 127723 -111811 -181906 -37899 -330381 -150017 14738
10786 -169496 -12172 -47971 214818 4492 24092 -41184 94972 -11854 159631 -85076 6278
10774 143124 -181586 50083 -329292 -353266 55201 334131 12873 -73838 91370 -99377 113315
$$ packed form
10855I8584D7810g4318K4334j1651k2073q438C210b56315a22159F1758f0384j14791
10843a75175C29422j35218D3107b11194A79803a11937A88779D3727K40940d0329
10832H9591l2180B4411b68762G1165F712K3741a81633Q5255j57351A96676J82159
10821C78835i9392o3163g2683k211b8267l46751F7823a24247C7773b6133N70K557
10809b3006E8241J06955a05075D2768J94765a01716j69234a14304c5560A78193
10798h7226n155j90757J02283B5453J02270a11811p0095c7899k92482a50017A4738
10786a69496a2172l5799B14818D492J9600d1184I4972a1854A59631h5076F278
10774A43124a81586E0083c29292k3974E5201K78930A2873g3838I1370i9377A13315
$$ plain form
10762 -146241 -126465 22994 3998 -152789 -353165 -90201 64792 22836 54453 156909 -319414
10750 -148987 -96784 162915 273266 78074 92215 180966 -139654 194632 5759 -99733 -181989
10739 -181989 -319694 300065 108719 -43537 -84576 207406 93537 -38515 -217624 -116173
10729 -116173 -63581 -28005 -44757 -24339 134484 -58360 -179773 373483 67323 135313 109636
10718 109636 263215 46437 240642 -241484 57650 6323 165714 -50498 50352 183167 -47154
10706 128869 -113009 -158854 -42589 -90913 -243797 -31383 151058 38237 360044 -152684
10695 35577 -151949 27893 -91382 -247557 -147704 229669 28470 -236275 -358238 -22274 -16715
10684 -16715 -224190 -85342 -59371 144962 20050 -85076 -116104 -121169 24945 258388 -84115
$$ packed form
10762a46241J9776B2994C998a52789k00376i0201F4792B2836L1617J02456c19414
10750a48987N2203A62915J10351G8074J4141Q8751a39654A94632E759i9733q2256
10739a81989j37705C00065A08719d3537m1039B07406I3537c8515j79109J01451
10729a16173N2592b8005j6752K0418A34484e8360j21413C73483F7323O7990k5677
10718A09636J53579D6437J94205b41484E7650F323J59391e0498E0352J32815d7154
10706A28869a13009m5845d2589m8324j52884c1383A51058C8237L21807a52684
10695C5577a51949B7893i1382j56175R9853B29669B8470b36275j21963b2274N559
10684a6715k07475h5342K5971A44962B0050h5076l1028n065B4945K33443h4115
$$ plain form
10672 -55123 -53645 -50369 118969 -179095 -270599 -66031 -4912 -367905 182778 -113762 412512
10660 -287049 -794 -34561 -214165 -152912 33144 254652 -35997 15830 281098 111004 -236667
10648 388527 165372 -72347 -36442 -93933 -62000 -192395 -1536 111325 -137583 -48977 -238796
10637 -238796 -24596 -63516 -9066 -41187 -204893 121169 76710 -347150 -118114 112692 -320246
10625 -48173 -370835 147466 -8930 -129217 -270126 -58420 -82427 98273 -224940 -1234 223428
10613 -150871 384443 76960 43730 -302553 -209541 -110638 -343010 158332 120652 234979
10603 234979 -70978 -67143 80985 -293439 -96440 -157789 127040 122879 -63312 -49674 253473
10591 -70385 -123266 -109398 -206652 -106466 -115171 -52701 -170111 -96792 -95726 60844 -72792 -137404
$$ packed form
10672e5123J478L276A18969a79095r1504f6031d912l62993A82778a13762D12512
10660b87049g94l3767j79604O1253C3144K21508c5997A5830K65268A11004b36667
10648C88527A65372g2347L5905n7491L1933j30395a536A11325a37583d8977j89819
10637b38796b4596l8920i066l2121j63706A21169m4459c47150a18114A12692c20246
10625d8173l22662A47466h930j20287j40909e8420k4007I8273b24940a234B23428
10613a50871C84443G6960l3230c02553R3012R8903k32372A58332l7680J14327
10603B34979g0978L835H0985b93439i6440o1349A27040m161f3312J3638B53473
10591g0385n2881J3868r7254J00186q705e2701j17410P3319J066F0844g2792o4612
$$ plain form
10579 -137404 77620 -277493 323330 -39588 -12477 37250 -195817 41605 110691 -133873 286750
10567 36631 -77608 -84154 178071 278848 -92675 9827 45966 -269094 175951 -19588 -212334
10556 -212334 -190485 319967 39913 -147150 190644 -167996 -52646 -47869 -96848 55849 -70902
10544 153460 -78189 -546241 100602 177136 103472 -143391 416878 -162645 282599 -4383
10533 280507 -136384 -350055 -213946 -267477 -101689 48975 7544 88218 38793 -238773 -66136
10521 124364 -117031 65638 -111191 270426 82527 -265022 -21208 66947 149496 -42674 -28177
10510 -28177 -13960 -80163 164601 193897 -4596 67886 -203205 -75322 22939 -88093 -14425
10498 26818 318166 133595 111205 -128951 -234336 71070 151036 -82891 74845 323376 -99179
$$ packed form
10579a37404G7620b77493C23330c9588a2477C7250a95817D1605O9086a33873B86750
10567C6631g7608o546A78071J00777i2675I827L6139b69094A75951a9588j92746
10556b12334K1849C19967C9913a47150A90644a67996e2646M777m8979E5849g0902
10544A53460g8189m68052A00602P6534p3664a43391D16878a62645B82599d383
10533B80507a36384k13671J36109n3531a01689D8975G544Q0674C8793b38773f6136
10521A24364a17031F5638a11191B70426H2527b65022b1208F6947Q2549d2674J4497
10510b8177a3960o6203A64601K9296d596F7886b03205g5322B2939h8093a4425
10498B6818K91348A33595k2390a28951j05385G1070P9966h2891G4845K48531i9179
$$ plain form
10486 -57874 120256 20270 70948 109931 173931 159266 215671 405439 171739 362308 276331
10475 276331 227639 125457 -132405 153387 -254248 -72914 88601 73880 -140774 76264
10464 265903 -263377 -181206 211522 56065 104162 -131535 -68419 440852 159882 68544
10453 -4307 -253708 46541 -14008 -246971 -104705 -74745 5271 40354 -403038 -112337 -104662
10442 -104662 -16269 18204 -15993 37371 91537 230406 -106172 2010 231896 313708 126847
10430 -322335 -345143 -46314 -133846 -5005 294212 -188854 2165 43098 -85001 -535755 -38243
10418 -195226 -332712 274734 65514 -129300 -214333 32135 281910 -57433 -162899 -58981
10407 -145080 187798 -311844 -72452 -158943 112998 96995 229762 -69811 108576 -152949
$$ packed form
10486e7874A20256B0270N0678L8983O4000j4665N6405J89768A71739J90569q5977
10475B76331m8692j02182a32405A53387b54248g2914H8601j4721a40774G6264
10464B65903b63377Q2171B11522E6065M8097a31535O3116D40852A59882F8544
10453d307k49401D6541a4008k32963a04705K9960E271L5083d03038a12337P675
10442a04662a6269A8204a5993C7371N4166J38869a06172B010K29886Q1812A26847
10430c22335k2808d6314q7532e005B94212a88854B165M0933h5001m50754c8243
10418a95226j37486B74734F5514a29300q5033C2135K49775e7433j05466e8981
10407a45080A87798c11844g2452q6491A12998j6003J32767f9811A08576a52949
$$ plain form
10396 19861 -27497 120299 143077 75289 -120118 151743 477718 -163690 271694 37726
10385 155881 154485 -156935 -32160 289292 140537 201385 185978 304634 293779 321409 356040
10374 356040 68808 407004 227795 272406 437836 534819 314091 393123 347157 590091
10364 590091 429404 297935 64766 546149 609782 276966 99355 28581 113084 202599 291928
10353 291928 492981 367869 522418 503565 421309 286639 193772 280093 311441 284000 133414
10341 41818 138165 -62406 178109 110561 220120 39935 260089 -36060 272868 -112432 40954
10329 244652 58924 320718 82114 287911 270859 62654 -87544 296936 87079 91572 516865
10318 516865 273377 88801 207063 295395 -2907 -174115 98937 74536 -262219 445796 -147194
$$ packed form
10396A9861b7497A20299K2778o7788a20118A51743L25975a63690B71694C7726
10385A55881j396a56935c2160B89292A40537O0848j5407J18656j0855K7630L4631
10374C56040F8808L38196j79209M4611J65430R6983k20728P9032m5966K42934
10364E90091j60687j31469F4766M81383O3633B76966I9355B8581Q4503Q9515Q9329
10353B91928K01053j25112J54549j8853q2256j34670r2867Q6321L1348k7441A33414
10341D1818R6347f2406A78109o7548J09559C9935K20154c6060B72868a12432D0954
10329B44652E8924K61794H2114K05797j7052F2654h7544B96936H7079M493M25293
10318E16865k43488H8801J18262Q8332b907j71208I8937k4401b62219D45796a47194
$$ plain form
10306 -145653 -117447 30323 -117386 -20149 296470 62253 279265 21841 -36268 282840 -189604
10294 538879 -143239 200125 276433 341355 246226 -70796 16281 -19499 233984 129879 244215
10283 244215 236541 -142482 -75039 8652 -19898 98736 -313497 -420952 -153540 -139209 177047
10271 67220 173105 284162 16843 133867 229663 25839 73227 218228 94999 -310945 232414
10259 191066 366797 92212 281854 246245 357039 46770 124131 287135 -1656 -366886 -275098
10248 -275098 -35461 -156004 80581 -5728 -46365 -39282 -211319 -21637 -153590 -135565 68168
10236 -100669 371845 91522 135963 -181730 76437 -168731 49594 305316 155414 -88095
10225 20270 -76815 3353 -160785 -392982 -146715 94853 -48415 137229 -190870 -61915 -109393
$$ packed form
10306a45653K8206C0323a17386b0149B96470F2253K17012B1841c6268B82840a89604
10294E38879a43239B00125P6308O4922r5129g0796A6281a9499B33984j04105J14336
10283B44215p674a42482O7443H652a9898I8736c13497j07455a53540J4331A77047
10271F7220J05885J11057A6843J17024R5796B5839M7388J45001I4999c10945B32414
10259A91066J75731I2212J89642l5609J10794D6770P7361J63004a656l65230R1788
10248b75098c5461j20543H0581e728m0637P083j72037b1637j31953J8025F8168
10236a00669C71845I1522M4441a81730G6437a68731D9594K55722j49902h8095
10225B0270g6815C353a60785k32197a46715I4853d8415A37229a90870f1915m7478
$$ plain form
10214 -109393 -387640 -16931 -28285 119465 17824 -203311 156758 55611 217015 -263846
10203 -83887 -408584 -262871 12730 -87344 209540 -98646 -55022 -143976 48025 12572 -15716
10191 4938 13302 -411115 -167060 -304452 -116499 51056 -328091 -132712 -125960 -200576 -296099
10180 -296099 -81801 -10441 13208 128373 -102064 59793 -71040 218939 -250768 17401 143466
10169 143466 -79891 -169282 -110022 -412889 100011 28083 -92228 -119550 -154437 -80150 -283202
10158 -283202 230745 -34228 -73852 224339 -2739 37543 -48066 -432273 -228087 -257860 -30476
10146 -399754 -64497 79299 -119909 -225666 -72597 -145872 -324197 99529 -94564 75396 -46672
10134 -176096 129429 -245996 -211621 -115401 147506 -106235 90636 -62522 -224344 29744
$$ packed form
10214a09393k78247a6931j1354A19465A7824b03311A56758E5611J61404b63846
10203h3887l24697J45713A2730h7344B09540i8646M3624q8954D8025A2572a5716
10191D938Q364d11115a67060j37392a16499E1056c28091a32712O752p4616r5523
10180b96099h1801a0441A3208J15165a02064E9793g1040B18939b50768A7401J26065
10169A43466g9891q9391N9260l02867A00011B8083i2228k7322l4887P4287k03052
10158b83202B30745c4228l9624B24339b739C7543d8066l84207K04186k9773c0476
10146c99754f4497G9299a19909j05757g2597p3275j78325I9529i4564G5396d6672
10134a76096A29429b45996L4375R6220A47506a06235I0636f2522j61822B9744
$$ plain form
10123 -63666 -75420 -132291 -374775 -128163 -2303 -220599 -59962 -216448 -121291 -184391 60776
10111 75832 -15329 -68987 -32399 -146564 -33316 -370866 157436 -212405 12892 -62372 80445
10099 203926 -287935 -57436 168596 -415294 245232 -154033 -3991 -212994 238103 -222851
10088 67106 -240069 -11260 -23999 120989 -237556 274637 -80227 10097 183776 151941 -162600
10076 7347 -64774 -84734 -125070 -134335 -18740 -193590 -343499 -239918 -30465 -302403 -382021
10065 -382021 111479 79589 347044 -19930 68229 54503 141893 -79331 -10097 -50809 61821
10053 -4800 -15583 -52947 -229482 -62471 -8414 -27620 -142975 -299413 -186392 27654 76256
10042 76256 -248399 -182286 162189 178417 -325925 73104 -77185 -133231 -47631 -181283 3035
$$ packed form
10123f3666j1754n6871k42484a28163b303k18296e9962j56486R5157o3100F0776
10111G5832a5329n3658c2399j14165c3316l37550A57436b12405A2892f2372H0445
10099B03926b87935e7436A68596d15294B45232a54033c991k09003B38103b22851
10088F7106b40069a1260j2739A20989b37556B74637h0227A0097J73679l1835a62600
10076G347f4774j9960m0336r265a8740j74850j49909J03581c0465k71938p9618
10065c82021A11479l1890K67455a9930F8229j3726Q7390g9331a0097m0712F1821
10053d800j0783l7364j76535f2471h414j9206j15355j56438J13021B7654M8602
10042G6256b48399O6113A62189J6228c25925G3104g7185n6046d7631j33652C035
$$ plain form
10030 425636 163066 -29661 70736 -350563 -95283 4072 -348078 -332979 63747 141161 -229719
10018 -112812 318215 -346853 -382408 31384 -104993 -116317 104923 -40093 -229960 14113
10007 -248666 -229844 159708 -199380 -233683 -25332 -125076 367648 -416893 116544 -138198
9996 -223788 -150899 6686 -237911 -346571 -101918 216399 30012 282234 -154402 247834
9985 -68115 -99026 -209057 111153 -378245 223983 313168 145442 -108568 -276661 -165175
9975 -165175 22092 -367870 -93194 -98607 -151788 -10656 -303467 -169718 -90700 -133056 -84377
9964 -84377 -272287 -112957 -172246 -323979 -84267 -74763 -296196 245461 -215237 287119 160474
9953 160474 -237235 -455954 27688 -258030 -122686 -258408 273290 204935 -18666 -166253
$$ packed form
10030D25636A63066b9661G0736c50563i5283D072c48078J5099F3747P7414b29719
10018a12812C18215c46853l5555C1384a04993j1324A04923d0093j89867A4113
10007b48666J8822A59708a99380l4303b5332r9744C67648d16893A16544a38198
9996b23788P2889F686b37911j08660a01918B16399C0012K52222a54402B47834
9985f8115l0911j10031A11153c78245B23983Q9185A45442a08568j68093J11486
9975a65175B2092c67870i3194n413n3181a0656k92811J33749P9018m2356M8679
9964h4377j87910a12957n9289j51733h4267R504k21433B45461b15237B87119j26645
9953A60474b37235k18719B7688b58030a22686j35722B73290o8355a8666j47587
$$ plain form
9943 -166253 66348 -172100 -24736 -178003 217619 -314607 176617 -48359 -249326 79987
9932 -36379 151099 -47639 258809 -207964 45742 -183459 -107711 -32479 206874 97192 -85564
9920 252061 -71357 216933 376778 -266484 -147094 -53498 -262796 -124955 -213345 -91828
9909 -338341 -211181 -384334 -97257 46443 11142 113276 98730 -56948 -366927 -292753 -49294
9897 -72501 225692 241672 -186125 -195350 81626 -316836 -271129 184665 69330 76489 93102
9886 93102 -321449 -67756 53963 -162941 283362 -204571 -95917 152115 12278 -94964 -70617
9875 -70617 -224308 -10893 39664 -259406 169257 -49521 45548 -399152 235168 150031 -96251
9863 -110984 13068 -123497 165832 -133839 -386207 201684 -55459 -169956 -80443 -229585
$$ packed form
9943a66253F6348a72100b4736j53267B17619c14607A76617d8359k00967G9987
9932c6379A51099d7639B58809b07964D5742a83459P5748c2479B06874I7192h5564
9920B52061g1357B16933J59845b66484J19390e3498k09298a24955q8390i1828
9909c38341J27160j73153i7257D6443A1142J02134j4546e6948l09979P4174d9294
9897g2501B25692J5980a86125r225H1626c16836M5707A84665F9330P159J6613
9886I3102c21449f7756E3963a62941B83362b04571i5917A52115A2278i4964K4347
9875g0617j53691a0893C9664b59406A69257d9521D5548c99152B35168q5137i6251
9863a10984A3068a23497A65832a33839k52368B01684e5459j14497h0443j49142
$$ plain form
9853 -229585 210690 90521 -81110 -93410 -94792 -97992 -112511 -19964 -112362 -116804 -77942 -252806
9841 -252806 -124037 586332 338171 -219876 -404870 -62022 -43311 77094 -313430 -180763
9831 -180763 -227216 9736 -280546 -138527 -3049 -100455 -16805 434 10504 85864 92369 -135042
9818 -49568 -104298 192261 -217312 16743 -215691 51482 -45835 -91223 -117360 226179 -132309
9806 534522 -92279 -248404 -295905 74361 -7702 -119553 -86075 -192351 -134805 -469335 -399812
9795 -399812 -224003 -93746 -188391 169222 6183 -211109 -229357 -392925 -79743 84687 27651
9783 -229949 86938 -172543 144237 66872 -98323 -78973 -120797 230324 -212508 -26814 -197020
9772 -197020 -182791 -371770 -255923 69766 -137930 -282225 -96304 -358302 216371 130 -107313
$$ packed form
9853b29585B10690I0521h1110j2300j382l200j4519a9964r2398m442L8862j74864
9841b52806a24037E86332k48161b19876j84994f2022J8711G7094c13430J32667
9831a80763m6453I736b80546a38527c049r7406a6805D34J0070P5360O505a35042
9818d9568n4730A92261b17312A6743b15691E1482d5835m5388k6137B26179a32309
9806E34522i2279j56125m7501G4361g702j11851L3478j06276N7546l34530O9523
9795c99812J75809i3746r4645A69222F183b11109j8248j63568g9743H4687B7651
9783b29949H6938a72543A44237F6872i8323J9350m1824B30324b12508b6814j70206
9772a97020J4229j88979J15847F9766a37930j44295i6304k61998B16371A30a07313
$$ plain form
9760 174487 58581 98979 254540 -101902 -256840 -304601 221297 -362035 -87050 -130629 -169116
9749 -169116 -249479 -45136 105375 -318133 -336722 -81287 -138068 34712 -346439 -94657 38203
9737 -111321 28767 -39166 -130874 260394 -291224 -180496 -164352 -229208 -240652 -452432 -152926
9725 190050 -184416 -200761 -116413 -273547 40080 -345662 -89648 -38136 221208 192628 -161283
9713 -127057 -225719 -162345 79699 112134 -361371 -187906 55546 -77112 35365 104376 42384
9701 -77423 -59322 234138 -2867 -33168 -101939 51173 -74056 -124924 152227 -204067 -106834
9690 -106834 -111073 52798 -118919 81869 95905 -215275 146873 76000 -13160 -201822 211180
9678 -33711 -147229 57166 -112505 -277534 -113657 -167708 103149 84093 -472830 -11691 -59582
$$ packed form
9760A74487E8581M0398J55561a01902j54938m7761B21297c62035h7050m3579l8487
9749a69116q0363d5136A05375c18133j8589h1287n6781C4712c46439i4657C8203
9737a11321B8767c9166r1708B60394b91224J10728J6144o4856j1444k11780a52926
9725A90050a84416j6345Q4348j57134D0080c45662h9648c8136B21208k8580a61283
9713a27057r8662O3374G9699L2435c61371J73465E5546g7112C5365O9011D2384
9701g7423J8101B34138b867l0301o8771E1173g4056n0868A52227b04067R7233
9690a06834m239E2798a18919H1869J4036b15275A46873p0873a3160j88662B11180
9678c3711j13518E7166a12505j65029a13657n4051A03149j9056d72830a1691m7891
$$ plain form
9667 -59582 -30066 -70474 163297 -52953 64038 -201132 149826 41649 -288843 -346316 -53089
9655 -232333 -3346 47808 145282 -198798 -385822 -41573 266 240986 83382 -277916 -27 44994
9642 -227359 -328157 -222197 242884 74765 3352 -116536 45469 -329438 -234215 -82650 -257634
9631 -257634 -103318 -221867 -87043 245202 51992 11216 -225817 -344438 -236335 -240792 280962
9619 -81867 -116426 257558 -255692 -92603 -38450 -5505 -99272 -106834 -116726 -325232 -57595 -2947
9606 333394 -100167 -312612 -92366 -87512 -185622 -11703 -330239 -144129 -197090 -160976 297823
9594 -48612 -67061 -136927 -11907 -387681 -53472 -180885 -300562 -108748 -54464 -203861 -165988
9583 -165988 1914 -371505 -282476 -152397 -89652 56069 53059 -97845 -318441 -45577 -195340
$$ packed form
9667e9582K9516m0408A63297e2953F4038b01132A49826D1649b88843n7473e3089
9655b32333c346D7808R7474a98798j87024d1573B66K40720H3382b77916b7D4994
9642b27359j00798J05960B42884G4765C352a16536D5469c29438R5223h2650j74984
9631b57634a03318j18549h7043B45202E1992A1216b25817j18621J08103m457B80962
9619h1867l4559B57558b55692i2603c8450e505r3767p562r892k08506e7595b947
9606C33394a00167k12445i2366M854r8110a1703l18536a44129n2961L6114B97823
9594d8612j8449o9866a1907l75774e3472j27413j19677a08748N4284j49397L7873
9583a65988A914c71505Q9029J30079O2745E6069l010i7845k20596d5577j49763
$$ plain form
9572 -195340 -63161 26364 304916 -73887 35838 27871 -83389 -73467 -303077 -48499 -10420 13713
9559 -96320 -166142 -332449 221595 -120024 -176358 -159687 1587 -127003 -106628 67742 158472
9548 158472 67573 17743 -445880 -100793 -9761 117105 -51072 -238579 -106879 10206 77821
9537 77821 -63329 11274 -106383 255747 -113640 -114849 230544 149609 8949 -104948 -303483
9526 -303483 -38718 -6372 -164011 -42068 103664 -18881 47888 140986 120038 309548 -90305
9514 -40156 -59672 -184420 162502 -124658 16385 84663 -131100 -247445 -126842 -128916 61156
9502 -32619 -449994 -405809 -164348 -186674 4621 16348 226524 145432 -104739 -251183 70272
9490 -15270 371377 -103492 -88543 28692 28387 285259 -129104 -42670 103118 -187271 129616
$$ packed form
9572a95340f3161B6364K78552g3887C5838p967h3389R922k29610d8499a0420A3713
9559i6320o9822j66307B21595a20024n6334J6671A587a27003K0375F7742R0730
9548A58472F7573A7743d45880a00793i761A17105e1072j87507a06879A0206O7615
9537G7821f3329A1274a06383B55747a13640j209B30544q0935H949a04948j98535
9526c03483c8718f372j57639d2068A03664a8881D7888R3098k0948J89510i0305
9514d0156j9516j24748A62502a24658A6385O8278a31100j16345J20603k074F1156
9502c2619m17375M4185a64348k2326D621J1727K10176q1092a04739j46444G0272
9490a5270C71377a03492J4949B8692l05K56872a29104d2670A03118a87271A29616
$$ plain form
9478 -193923 49256 -364172 -97228 -195188 -256218 161020 -55537 -339200 -229269 283563 -135476
9466 -25930 -1468 -115395 -286916 97179 88208 -194178 -48794 24837 -127162 48647 -386908
9454 -191303 -62184 -48241 -171311 -411593 -103614 -421074 92271 120324 -342857 109234
9443 -168673 -279744 -154286 13754 -193231 -108010 -167689 -104096 -109559 -116486 103226 66088
9432 66088 45496 -408618 196827 -201093 -121728 -39026 -74013 -305691 1032 -94303 -336550
9421 -336550 -211510 -93214 140702 385767 -181614 114152 -21634 -215099 141078 -61214
9410 66049 -388246 -93362 -46870 9735 -352604 -122486 -114151 3917 -25114 -184679 38303 -80528
9397 -111278 -56448 22794 -221093 -194341 -91501 -128181 232620 79772 11948 -146214 -41604
$$ packed form
9478a93923D9256c64172i7228r7960o1030A61020e5537k83663J09931B83563a35476
9466b5930a468j13927j71521I7179q971a94178d8794B4837a27162D8647c86908
9454a91303f2184J3943j23070k40282a03614l17460I2271K8053c42857A09234
9443a68673j11071J25458A3754a93231Q5221n9679O3593n463o927A03226l7138
9432F6088k0592d08618A96827b01093P9365c9026l4987k31678A032i4303k42247
9421c36550J25040i3214A40702K45065a81614A14152b1634j93465A41078f1214
9410F6049c88246i3362M6492I735c52604a22486Q335C917b5114j59565C8303h0528
9397a11278N4830B2794b21093K6752i1501l6680B32620G9772A1948a46214d1604
$$ plain form
9385 -337262 -180203 82976 34970 -300891 10662 343044 -172206 3838 -293258 -206465 -180344
9374 -180344 -82474 -94142 180512 72467 -275604 -262889 -212134 -288777 -219898 -144162 -205539
9363 -205539 -190007 133147 -56794 -118770 -195445 57554 245730 -153008 -35804 -385607 -288366
9352 -288366 29597 93356 -233095 -101367 66528 -72011 -310037 -141271 -116757 -71601 192213
9340 -190975 -247135 -84082 -365516 -65629 -264356 -188857 85139 -121689 -32291 -122409 -145265
9329 -145265 81071 -446278 -12875 -53852 -80347 -41012 -45571 32656 -196798 -89645 23616
9317 85025 -158158 63108 -532810 -50986 166534 -162763 -35877 -76568 -229288 130586 242082
9306 242082 -51143 247926 -30196 -520902 -112871 17027 -128076 -188056 -78146 97458 -84310
$$ packed form
9385c37262J57059H2976C4970c00891A0662L32382a72206C838b93258Q6793K6121
9374a80344h2474j1668A80512G2467b75604J2715N0755p6643O8879P5736o1377
9363b05539J5532A33147e6794o1976p6675E7554J88176a53008c5804l49803R7241
9352b88366B9597O3759b33095a01367F6528g2011k38026a41271K4514M5156A92213
9340a90975n6160h4082k81434f5629j98727P5499H5139a21689c2291r0118k2856
9329a45265H1071d46278a2875m0977k6495L9335m559C2656a96798h9645B3616
9317H5025a58158F3108e32810e0986A66534a62763c5877m0691j52720A30586J11496
9306B42082e1143B47926c0196m90706a12871A7027a28076n9980g8146I7458h4310
$$ plain form
9294 -70330 -61108 11245 -121153 38389 -113584 -29514 137568 200112 10454 -104778 -59797
9283 -59797 -256182 -196622 200336 64660 36010 319567 138902 50957 -157262 -297238 163134
9271 137750 -127484 -63117 -250904 -39305 -154071 16332 84244 -87455 -112219 -77104 -5242
9259 -329470 -93597 -294951 -57932 -91352 -126651 -83100 114353 126857 -77119 -67248 -284461
9248 -284461 -52034 -216797 -367473 36970 -277915 -202996 141938 -59406 57461 21302 -145677
9236 -190241 -313184 21777 12485 -522029 -199570 -26150 -119283 31279 -77750 224212 -22885
9224 134111 99855 -348842 65803 42083 -40413 349648 -237234 -286754 46395 140918 -183470
9212 -135142 -172728 -345032 -402836 113207 12623 287849 128708 156887 -182530 60717 -226062
$$ packed form
9294g0330R222A1245a21153C8389a13584b9514A37568O2544A0454a04778M4981
9283e9797j96385N9560B00336F4660k8650K83557A38902E0957a57262j39976A63134
9271A37750a27484f3117j87787c9305j14766A6332O7912h7455k4764L5115e242
9259c29470i3597k01354e7932l3420l5299M3551A14353J2504g7119R871k17213
9248b84461e2034j64763j50676C6970b77915P4919A41938e9406E7461B1302a45677
9236a90241j22943B1777r292e22029a99570b6150r3133C1279g7750B24212b2885
9224A34111l4256c48842F5803k3720d0413C49648b37234m9520D6395R4523a83470
9212a35142l7586j72304n7804A13207A2623K75226A28708K8179a82530F0717b26062
$$ plain form
9200 59495 -122655 6809 59723 27427 -282249 136344 55984 -210179 -64245 -241601 95448
9188 -14488 -22894 6540 -30145 70806 -53899 8288 223407 158277 -147198 27410 112909 -259617
9175 133218 -9588 -404160 317167 154138 -264933 163133 83085 -87427 -230360 322428
9164 -61671 143967 -17006 -95185 -136163 213559 -207124 -362052 -195956 134182 90267 117026
9153 117026 -153528 -201648 87738 247705 38553 -61238 -257381 83630 -95995 88704 -241270
9141 35978 -299586 -106019 -50641 6641 -102869 8544 -206220 -261964 -64693 -45301 -354027
9130 -354027 95127 -117095 -4005 -477627 18259 -259952 126550 -221164 -126214 -178547 -4373
9118 -89936 -110944 62728 -143041 -48310 -176485 65610 -174904 -61724 -135540 24787 34857
$$ packed form
9200E9495a22655F809N2914B7427b82249A36344E5984b10179f4245j77356I5448
9188a4488q406F540c0145G0806e3899H288K15119o5130a47198B7410Q5499b59617
9175A33218i588l94572C17167A54138b64933A63133q0048h7427j42933C22428
9164f1671A43967a7006p8179m0978B13559b07124j54928J66096A34182m3915K6759
9153A17026a53528m8120H7738J59967C8553f1238j96143H3630i5995H8704b41270
9141C5978b99586a06019e0641F641a02869H544b06220n5744f4693J9392l08726
9130c54027I5127a17095d005m73622A8259b59952A26550b21164R4950n2333d373
9118h9936k1008F2728a43041d8310j28175F5610a74904f1724p3816B4787J0070
$$ plain form
9107 34857 768 35484 -31696 19625 -3866 -67509 -350218 -109996 231566 45884 -8172 -11773
9095 -11773 -121518 2238 -299651 -199904 -301641 88434 -474146 -302833 -40629 -61307 -502544
9084 -502544 64769 -192896 -177865 -19546 14440 -116086 -317529 100245 147445 -133138 -124715
9073 -124715 -258927 -39241 -168206 90146 -66338 -14489 -370528 79243 19372 -313578 292921
9061 153642 90999 -67439 -196524 -402496 -121000 34904 -261337 -54029 38182 86015 3054
9049 114000 75504 210590 -114573 -31304 79465 -322938 -168966 196133 -243647 19512
9038 -188757 -166549 264597 340501 224021 -25314 -12516 -69391 -235115 78229 -134665 -178304
9027 -178304 117853 211651 9021 174733 -343223 -61966 -187952 -169809 -277706 -66064 -11280
$$ packed form
9107C4857G68L4716c1696A9625c866o3643k82709a09996B31566D5884h172l601
9095a1773j09745B238b99651R9747j01737H8434d74146J71313d0629k0678m41237
9084e02544F4769a92896J5031a9546A4440a16086k01443A00245M7200a33138Q423
9073a24715j34212c9241j28965I0146f6338a4489l56039G9243A9372c13578B92921
9061A53642o2643f7439j29085k05972a21000C4904b61337e4029C8182M7833C054
9049A14000l8496J35086a14573c1304G9465c22938J53972A96133b43647A9512
9038a88757K2208B64597P5904j16480b5314a2516n6875j65724G8229a34665m3639
9027a78304A17853R3798I021J65712c43223f1966j25986J8143j07897f6064a1280
$$ plain form
9015 -133017 82484 -146040 25080 -129245 -175506 60985 -55461 -90305 -121401 -169697 146240
9003 325371 -308883 -673 -104233 -198134 -319844 200384 -81229 59819 156734 -248954 -9821
8991 857 -92393 -57276 -70125 220372 141542 -154109 81988 -253822 260813 -101754 -111148
8980 -111148 -140469 309078 -152026 40396 -95737 127854 -248166 303 -82384 -37789 -94027
8969 -94027 134628 63761 -168898 237956 -120991 257879 -131205 -176700 -425890 -242842
8959 -242842 -17742 132545 -215995 -116932 -137573 157620 -332754 121391 6784 -436716 17248
8947 -200170 -474943 10937 -289769 10033 -79062 27587 -198767 -328961 332279 270444 -103252
8935 -254488 504591 383330 -115987 -61053 331619 109612 271939 64471 284614 570651
$$ packed form
9015a33017H2484a46040B5080a29245m6261F0985e5461l4844l1096m8296A46240
9003C25371c08883f73j03560r3901j21710B00384h1229E9819R6915b48954i821
8991H57i2393L5117j2849B20372p8830a54109H1988b53822B60813a01754r394
8980a11148k9321C09078a52026D0396i5737A27854b48166C03h2384c7789n6238
8969i4027A34628F3761a68898B37956a20991B57879a31205m5495k49190J83048
8959b42842a7742A32545b15995R9063k0641A57620c32754A21391F784d36716A7248
8947b00170k74773A0937b89769A0033g9062B7587a98767j30194C32279o1835a03252
8935b54488E04591j21261a15987N4934C31619A09612J62327F4471K20143K86037
$$ plain form
8925 570651 895838 1618833 4969505 15654399 13118652 5312024 2119750 917778 576902
8916 576902 82593 287594 73697 108548 250498 352310 -51582 152703 199672 483128 -1103
8904 -61489 17013 137057 117169 65811 282253 -40876 254632 142573 274095 -187890 394498
8892 -237578 -184585 -21856 -202061 -579531 283173 -162020 245656 -104975 5274 -184405
8881 182867 -260012 -122400 159780 -103807 215374 -241225 -115598 -72827 -875 52023 61653
$$ packed form
8925E70651L25187P22995L350672J0684894k535747E312024B119750I17778l40876
8916E76902H2593K05001G3697L4851J41950J01812e1582A52703M6969K83456a103
8904f1489A7013J20044j9888n1358K16442d0876B54632j12059J31522a87890C94498
8892b37578N2993b1856j80205l77470B83173a62020B45656a04975E274a84405
8881A82867b60012a22400A59780a03807B15374b41225a15598M2771h75E2023R630
$$ [...]
##END NTUPLES=NMR SPECTRUM
##END=
