##TITLE=AC1521_ROEFFECT0005_8202113_Uv8gaAcAhf
##JCAMPDX= 6.0         $$ Bruker NMR JCAMP-DX V2.0
##DATA TYPE= NMR SPECTRUM
##DATA CLASS= NTUPLES
##ORIGIN= BRUKER
##OWNER= Administrator
$$ 1.72 TOPSPIN		Version 2.1
$$ 2013-09-26 21:52:31.493 -0700  Administrator@X
$$ Compression mode = diff/dup
##.OBSERVE FREQUENCY= 400.02188249412
##.OBSERVE NUCLEUS= ^1H
##.ACQUISITION MODE= SIMULTANEOUS (DQD)
##.ACQUISITION SCHEME= undefined
##.AVERAGES= 64
##.DIGITISER RES= 22
##SPECTROMETER/DATA SYSTEM= spect
##.PULSE SEQUENCE= noesygpps1d.comp
##.SOLVENT NAME= COFFEE_meoh
##.SHIFT REFERENCE= INTERNAL, COFFEE_meoh, 1, 14.96094
##AUDIT TRAIL= $$ (NUMBER, WHEN, WHO, WHERE, PROCESS, VERSION, WHAT)
$$ ##TITLE= Audit trail, TOPSPIN		Version 2.1
$$ ##JCAMPDX= 5.01
$$ ##ORIGIN= Bruker BioSpin GmbH
$$ ##OWNER= Administrator
$$ $$ E:\/data/COFFEE/nmr/AC1521_ROEFFECT0005_8202113_Uv8gaAcAhf/12/pdata/1/auditp.txt
$$ ##AUDIT TRAIL=  $$ (NUMBER, WHEN, WHO, WHERE, PROCESS, VERSION, WHAT)
(   1,<2013-09-26 21:52:26.444 -0700>,<Administrator>,<X>,<go>,<TOPSPIN 2.1>,
      <created by zg
	started at 2013-09-26 21:40:54.416 -0700,
	POWCHK enabled, PULCHK disabled,
       configuration hash MD5:
       C8 4E 4E 5D D3 5C D8 9E 9F 52 82 E0 59 8A DE 15
       data hash MD5: 64K
       01 E1 C9 FE 4F 43 FF 2E 62 78 C1 52 3E AD 40 47>)
(   2,<2013-09-26 21:52:29.507 -0700>,<Administrator>,<X>,<proc1d>,<TOPSPIN 2.1>,
      <Start of raw data processing
       efp LB = 0.3 FT_mod = 6 PKNL = 1 PHC0 = 0 PHC1 = 0 SI = 128K 
       data hash MD5: 128K
       3B D7 3D C1 5E 5D 04 8A EC 0F 6E 6E BA D7 3B 86>)
(   3,<2013-09-26 21:52:30.477 -0700>,<Administrator>,<X>,<proc1d>,<TOPSPIN 2.1>,
      <pk PHC0 = -85.92407 PHC1 = 0 
       data hash MD5: 128K
       A2 17 BD AE E7 75 0F 64 EA 0E 2E 26 CC 39 30 4F>)
(   4,<2013-09-26 21:52:30.902 -0700>,<Administrator>,<X>,<proc1d>,<TOPSPIN 2.1>,
      <abs ABSG = 1 
       data hash MD5: 128K
       8C 98 5F C7 06 8C 10 80 4F C2 59 70 5B B2 F5 C1>)
(   5,<2013-09-26 21:52:31.023 -0700>,<Administrator>,<X>,<proc1d>,<TOPSPIN 2.1>,
      <abs ABSG = 2 
       data hash MD5: 128K
       E9 A4 D9 C3 37 95 D1 70 22 44 52 3B 41 E0 B7 6F>)
(   6,<2013-09-26 21:52:31.129 -0700>,<Administrator>,<X>,<proc1d>,<TOPSPIN 2.1>,
      <abs ABSG = 3 
       data hash MD5: 128K
       35 CC 34 69 8A 0F 07 6D C7 7B F9 B2 13 57 9A C0>)
(   7,<2013-09-26 21:52:31.235 -0700>,<Administrator>,<X>,<proc1d>,<TOPSPIN 2.1>,
      <abs ABSG = 4 
       data hash MD5: 128K
       FE DD 61 0C AA 80 DF A4 2D D7 DE F9 FF 38 DC 00>)
(   8,<2013-09-26 21:52:31.311 -0700>,<Administrator>,<X>,<proc1d>,<TOPSPIN 2.1>,
      <abs ABSG = 5 
       data hash MD5: 128K
       B2 AD BA 35 D4 7F 9E 94 BA 84 7D AE DB B6 9F 4D>)
$$ ##END=
$$ 
$$ $$ hash MD5
$$ $$ 52 33 53 EC 35 77 B4 2D 3C F2 FA 5B 4E 13 C8 C1
##$RELAX= 
##$RELAX= 
##$RELAX= 
##$RELAX= 
##$RELAX= 
##$RELAX= 
##$RELAX= 
##$RELAX= 
$$ Bruker specific parameters
$$ --------------------------
##$DU= <E:\>
##$EXPNO= 12
$$ [...]
##$TP07= 0
##$TPNAME0= <>
##$TPNAME1= <>
##$TPNAME2= <>
##$TPNAME3= <>
##$TPNAME4= <>
##$TPNAME5= <>
##$TPNAME6= <>
##$TPNAME7= <>
##$TPOAL= (0..7)
0.5 0.5 0.5 0.5 0.5 0.5 0.5 0.5
##$TPOFFS= (0..7)
0 0 0 0 0 0 0 0
##$TUNHIN= 0
##$TUNHOUT= 0
##$TUNXOUT= 0
##$USERA1= <user>
##$USERA2= <user>
##$USERA3= <user>
##$USERA4= <user>
##$USERA5= <user>
##$V9= 5
##$VALIST= <valist>
##$VCLIST= <CCCCCCCCCCCCCCC>
##$VD= 0
##$VDLIST= <DDDDDDDDDDDDDDD>
##$VPLIST= <PPPPPPPPPPPPPPP>
##$VTLIST= <TTTTTTTTTTTTTTT>
##$WBST= 1024
##$WBSW= 4
##$XGAIN= (0..3)
0 0 0 0
##$XL= 0
##$YL= 0
##$YMAX_a= 6882220
##$YMIN_a= -13835180
##$ZGOPTNS= <>
##$ZL1= 120
##$ZL2= 120
##$ZL3= 120
##$ZL4= 120
##$ABSF1= 14.96094
##$ABSF2= -5.597241
##$ABSG= 5
##$ABSL= 3
##$ALPHA= 0
##$AQORDER= 0
##$ASSFAC= 0
##$ASSFACI= 0
##$ASSFACX= 0
##$ASSWID= 0
##$AUNMP= <proc_prof1d_extract.lims>
##$AXLEFT= 0
##$AXNAME= <>
##$AXNUC= <1H>
##$AXRIGHT= 0
##$AXTYPE= 0
##$AXUNIT= <>
##$AZFE= 0.1
##$AZFW= 0.1
##$BCFW= 0
##$BC_mod= 0
##$BYTORDP= 0
##$COROFFS= 0
##$CY= 15
##$DATMOD= 1
##$DC= 0
##$DFILT= <>
##$DTYPP= 0
##$F1P= 0
##$F2P= 0
##$FCOR= 0.5
##$FTSIZE= 131072
##$FT_mod= 6
##$GAMMA= 0
##$GB= 0
##$INTBC= 1
##$INTSCL= 1
##$ISEN= 128
##$LB= 0.3
##$LEV0= 0
##$LPBIN= 0
##$MAXI= 10000
##$MC2= 0
##$MEAN= 0
##$ME_mod= 0
##$MI= 0
##$NCOEF= 0
##$NC_proc= -2
##$NLEV= 6
##$NOISF1= 0
##$NOISF2= 0
##$NSP= 0
##$NTH_PI= 0
##$NZP= 0
##$OFFSET= 14.96094
##$PC= 1
##$PHC0= -85.92407
##$PHC1= 0
##$PH_mod= 1
##$PKNL= yes
##$PPARMOD= 0
##$PPDIAG= 0
##$PPIPTYP= 0
##$PPMPNUM= 2147483647
##$PPRESOL= 1
##$PSCAL= 4
##$PSIGN= 0
##$PYNMP= <proc.py>
##$REVERSE= no
##$SF= 400.020009660752
##$SI= 131072
##$SIGF1= 0
##$SIGF2= 0
##$SINO= 400
##$SIOLD= 131072
##$SPECTYP= <>
##$SREGLST= <1H.CDCl3>
##$SSB= 0
##$STSI= 131072
##$STSR= 0
##$SW_p= 8223.68421052631
##$SYMM= 0
##$S_DEV= 0
##$TDeff= 65536
##$TDoff= 0
##$TI= <>
##$TILT= no
##$TM1= 0
##$TM2= 0
##$TOPLEV= 0
##$USERP1= <user>
##$USERP2= <user>
##$USERP3= <user>
##$USERP4= <user>
##$USERP5= <user>
##$WDW= 1
##$XDIM= 131072
##$YMAX_p= 379519177
##$YMIN_p= -12816
##$CURPLOT= <Network HP LaserJet P1505>
##$CURPRIN= <$Network HP LaserJet P1505>
##$DFORMAT= <normdp>
##$LAYOUT= <+/1D_H.xwp>
##$LFORMAT= <normlp>
##$PFORMAT= <normpl>
##$SURQMSG= 1
$$ End of Bruker specific parameters
$$ ---------------------------------
##NTUPLES= NMR SPECTRUM
##VAR_NAME=  FREQUENCY,     SPECTRUM/REAL,   SPECTRUM/IMAG
##SYMBOL=    X,             R,               I
##VAR_TYPE=  INDEPENDENT,   DEPENDENT,       DEPENDENT
##VAR_FORM=  AFFN,          ASDF,            ASDF
##VAR_DIM=   131072,        131072,          131072
##UNITS=     HZ,            ARBITRARY UNITS, ARBITRARY UNITS
##FACTOR=    0.0627417313425164, 1,          1
##FIRST=     8223.62146879497, 1764,         -70807
##LAST=      0,             5311,            -70664
##MIN=       0,             -12816,          0
##MAX=       8223.62146879497, 379519177,    0
$$ Real data points
##PAGE= N=1
##DATA TABLE= (X++(R..R)), XYDATA
$$ [...]
$$ plain form
63744 308208 310207 312048 313317 314586 316665 319926 324087 328336 331929 334903 337952 341402 344714 347374
63730 347374 349838 353033 357107 361206 364484 366942 369287 372313 376414 381388 386615 391583 396239 400776
63716 400776 405255 409616 413773 417389 419811 420719 420716 420767 421023 420693 419222 417121 415362 414226 413131 411475
63700 411475 409294 407049 404996 403086 401481 400833 401676 403636 405724 407597 410028 413748 418191 421974 424433
63685 424433 426043 427339 428132 428065 427443 427043 427294 427956 428531 428824 429232 430585 433471 437586 441900 445620 448813
63668 448813 451925 454908 457141 458207 458462 458689 459265 459773 459516 458307 456513 454265 451002 446198 440391
63653 440391 434967 430833 427676 424625 421276 417865 414840 412544 411121 410480 410572 411806 414758 419249 424199
63638 424199 428878 433892 440238 447625 454574 460251 465367 470994 477156 483199 489001 495078 501601 508024
$$ packed form
63744C08208J999J841J269J269K079L261M161M249L593K974L049L450L312K660
63730C47374K464L195M074M099L278K458K345L026M101M974N227M968M656M537
63716D00776M479M361M157L616K422R08lN1K56l30j471k101j759j136j095j656
63700D11475k181k245k053j910j605o48Q43J960K088J873K431L720M443L783K459
63685D24433J610J296P93o7o22m00K51O62N75K93M08J353K886M115M314L720L193
63668D48813L112K983K233J066K55K27N76N08k57j209j794k248l263m804n807
63653D40391n424m134l157l051l349l411l025k296j423o41R2J234K952M491M950
63638D24199M679N014O346P387O949N677N116N627O162O043N802O077O523O423
$$ plain form
63624 508024 513855 519365 525217 531667 538474 545590 553722 564054 577308 593092 610241 627916 646375
63611 646375 666581 689150 713886 740363 768669 799253 832108 866370 900782 934335 966389
63600 966389 996329 1023402 1046846 1066031 1080504 1090084 1095010 1095860 1093187 1087234 1078060 1065948 1051596
63587 1051596 1035893 1019419 1002113 983431 962857 940301 916053 890516 864136 837541 811564
63576 811564 786990 764316 743762 725437 709502 696232 685883 678346 672956 668841 665564 663337
63564 663337 662511 662972 664145 665491 666964 669075 672577 678004 685401 694537 705435 718551 734439 753418
63550 753418 775690 801595 831541 865791 904470 947530 994356 1043489 1093086 1141800 1189060
63539 1189060 1234495 1277264 1315749 1347482 1369479 1379495 1377645 1366684 1350279 1330961 1309824
$$ packed form
63624E08024N831N510N852O450O807P116Q132J0332J3254J5784J7149J7675J8459
63611F46375K0206K2569K4736K6477K8306L0584L2855L4262L4412L3553L2054
63600I66389K9940K7073K3444J9185J4473R580M926Q50k673n953r174j2112j4352
63587A051596j5703j6474j7306j8682k0574k2556k4248k5537k6380k6595k5977
63576H11564k4574k2674k0554j8325j5935j3270j0349p537n390m115l277k227
63564F63337q26M61J173J346J473K111L502N427P397R136J0898J3116J5888J8979
63550G53418K2272K5905K9946L4250L8679M3060M6826M9133M9597M8714M7260
63539A189060M5435M2769L8485L1733K1997J0016j850j0961j6405j9318k1137
$$ plain form
63528 1309824 1287582 1265046 1242493 1219296 1194691 1168493 1140685 1110758 1078151 1043268 1007435
63517 1007435 971640 935892 900064 864896 831656 801027 772808 746645 722591 700858 681351
63506 681351 663621 647077 631197 615730 600783 586579 573136 560391 548598 538203 529179 520827
63494 520827 512489 504244 496656 490070 484432 479609 475563 472308 469943 468586 468018 467614 466999 466746 467989
63479 467989 471306 476217 481741 487061 491700 495576 499120 503011 507543 512382 517005 521101 524471 526921
63465 526921 528525 529715 530891 532098 533295 534651 536301 538020 539440 540458 541179 541613 541742 541754 541915 542271
63449 542271 542775 543600 545062 547270 550165 553872 558732 565017 572874 582558 594432 608817 626147 647224
63435 647224 672846 702984 736604 772411 809617 848077 888151 930380 974579 1018674 1058858
$$ packed form
63528A309824k2242k2536k2553k3197k4605k6198k7808k9927l2607l4883l5833
63517A007435l5795l5748l5828l5168l3240l0629k8219k6163k4054k1733j9507
63506F81351j7730j6544j5880j5467j4947j4204j3443j2745j1793j0395r024q352
63494E20827q338q245p588o586n638m823m046l255k365j357n68m04o15k53J243
63479D67989L317M911N524N320M639L876L544L891M532M839M623M096L370K450
63465E26921J604J190J176J207J197J356J650J719J420J018P21M34J29J2J61L56
63449E42271N04Q25J462K208K895L707M860O285P857R684J1874J4385J7330K1077
63435F47224K5622L0138L3620L5807L7206L8460M0074M2229M4199M4095M0184
$$ plain form
63424 1058858 1091562 1115458 1131471 1141255 1146206 1147848 1148437 1150583 1156251 1166222 1180403 1198438 1219889
63411 1219889 1243891 1268966 1293429 1315967 1335629 1351461 1362607 1368805 1370286 1367018 1358652 1345597
63399 1345597 1329604 1312580 1294998 1275999 1254784 1231217 1205243 1176610 1145422 1112286 1077635
63388 1077635 1041453 1003954 966044 928775 892786 858596 826910 798189 772289 749036 728746
63377 728746 711633 697045 684044 672705 664173 659311 657779 658562 660998 665124 671420 680385 692152
63364 692152 706390 722773 741569 763503 789049 818152 850640 886501 925587 967391 1011301
63353 1011301 1056742 1102885 1148516 1192524 1234339 1273618 1309593 1340984 1366550 1385620 1398230
63342 1398230 1404875 1406132 1402483 1394528 1383282 1369897 1354964 1338269 1319325 1297860 1273673 1246388
$$ packed form
63424A058858L2704K3896J6013R784M951J642N89K146N668R971J4181J8035K1451
63411A219889K4002K5075K4463K2538J9662J5832J1146O198J481l268q366j3055
63399A345597j5993j7024j7582j8999k1215k3567k5974k8633l1188l3136l4651
63388A077635l6182l7499l7910l7269l5989l4190l1686k8721k5900k3253k0290
63377G28746j7113j4588j3001j1339q532m862j532P83K436M126O296Q965J1767
63364F92152J4238J6383J8796K1934K5546K9103L2488L5861L9086M1804M3910
63353A011301M5441M6143M5631M4008M1815L9279L5975L1391K5566J9070J2610
63342A398230O645J257l649p955j1246j3385j4933j6695j8944k1465k4187k7285
$$ plain form
63330 1246388 1215769 1182173 1146441 1109471 1072184 1035818 1001853 971556 945685 924465 907506
63319 907506 893721 881704 870541 860297 851664 845065 839887 834300 825727 811754 791066 764025
63307 764025 732687 700100 669037 640897 615634 592695 571883 553373 537273 523450 511607
63296 511607 501288 491896 482943 474281 466050 458535 452071 446765 442181 437682 433310 429858 427657 425739
63282 425739 422829 418962 415396 413075 411879 411356 411362 411794 412451 413472 415257 417557 419267 419655 419315 419427
63266 419427 420527 422517 425386 429086 432960 436137 438584 441162 444573 448734 453212 457736 462164 466450
63252 466450 470797 475468 480379 485284 490469 496705 504213 512141 519449 526070 532860 540668 549764 559995
63238 559995 571042 582570 594433 606769 619841 633859 649065 665708 683697 702447 721413
$$ packed form
63330A246388l0619l3596l5732l6970l7287l6366l3965l0297k5871k1220j6959
63319I07506j3785j2017j1163j0244q633o599n178n587q573j3973k0688k7041
63307G64025l1338l2587l1063k8140k5263k2939k0812j8510j6100j3823j1843
63296E11607j0319r392q953q662q231p515o464n306m584m499m372l452k201j918
63282D25739k910l867l566k321j196n23OM32O57J021J785K300J710L88l40J12
63266D19427J100J990K869L700L874L177K447K578L411M161M478M524M428M286
63252D66450M347M671M911M905N185O236P508P928P308O621O790P808R096J0231
63238E59995J1047J1528J1863J2336J3072J4018J5206J6643J7989J8750J8966
$$ plain form
63227 721413 740639 760483 780897 801388 821661 841899 862322 882868 903456 924197 945110
63216 945110 965898 986274 1006310 1026143 1045434 1063394 1079239 1092383 1102257 1108310 1110258 1108128
63204 1108128 1102032 1092153 1078922 1062853 1044070 1022355 998019 972470 947496 924013 901844 880770
63192 880770 861432 844985 832054 822295 814935 809560 806363 805869 808600 814916 824799 837545 851861
63179 851861 866718 882211 899278 918400 938819 959233 978866 997466 1014663 1030065 1043989
63168 1043989 1057286 1070097 1081298 1089621 1094919 1097883 1098814 1097243 1092578 1084559 1073033 1057750 1038607
63155 1038607 1015886 990202 962405 933484 904256 875086 846119 817759 790692 765424 742101
63144 742101 720789 701587 684375 668738 654339 641169 629345 618890 609780 601936 595043 588740
$$ packed form
63227G21413J9226J9844K0414K0491K0273K0238K0423K0546K0588K0741K0913
63216I45110K0788K0376K0036J9833J9291J7960J5845J3144R874O053J948k130
63204A108128o096r879j3231j6069j8783k1715k4336k5549k4974k3483k2169k1074
63192H80770j9338j6447j2931r759p360n375l197m94K731O316R883J2746J4316
63179H51861J4857J5493J7067J9122K0419K0414J9633J8600J7197J5402J3924
63168A043989J3297J2811J1201Q323N298K964R31j571m665q019j1526j5283j9143
63155A038607k2721k5684k7797k8921k9228k9170k8967k8360k7067k5268k3323
63144G42101k1312j9202j7212j5637j4399j3170j1824j0455r110p844o893o303
$$ plain form
63132 588740 583180 579040 576658 575490 574809 574649 575575 577647 580231 582913 586070 590228 595235 600400 605261
63117 605261 609861 614341 618607 622506 626150 629886 633938 638142 642099 645556 648577 651280 653540 655159
63103 655159 656282 657463 659162 661333 663604 665767 667952 670396 673235 676538 680377 684781 689759 695391
63089 695391 701798 708822 715829 721965 726656 729775 731341 731274 729594 726735 723424 720153 716856 713249 709531
63074 709531 706614 705478 706259 708156 710456 713494 718265 725075 733098 741492 750551 761222 773770 787627
63060 787627 802603 819529 839371 862210 887547 915231 945508 978368 1013460 1050729 1090650
63049 1090650 1133661 1179660 1228143 1278500 1330009 1381910 1433852 1486160 1539378 1593583 1648310
63038 1648310 1703054 1757537 1811461 1864346 1915846 1966062 2015210 2062907 2108012 2149287 2186035
$$ packed form
63132E88740n560m140k382j168o81j60R26K072K584K682L157M158N007N165M861
63117F05261M600M480M266L899L644L736M052M204L957L457L021K703K260J619
63103F55159J123J181J699K171K271K163K185K444K839L303L839M404M978N632
63089F95391O407P024P007O136M691L119J566o7j680k859l311l271l297l607l718
63074G09531k917j136P81J897K300L038M771O810Q023Q394R059J0671J2548J3857
63060G87627J4976J6926J9842K2839K5337K7684L0277L2860L5092L7269L9921
63049A090650M3011M5999M8483N0357N1509N1901N1942N2308N3218N4205N4727
63038A648310N4744N4483N3924N2885N1500N0216M9148M7697M5105M1275L6748
$$ plain form
63027 2186035 2217852 2243888 2262673 2272782 2273424 2264334 2245461 2217131 2180375 2136720 2087534 2033769
63015 2033769 1976351 1916622 1856256 1796899 1739977 1686741 1638302 1595485 1558681 1527963 1503467
63004 1503467 1485574 1474522 1469846 1470559 1476044 1486497 1502166 1522356 1545578 1570518 1596487 1623033
62992 1623033 1649717 1676438 1703441 1730663 1757395 1782924 1807189 1830458 1852462 1872231 1888685
62981 1888685 1901079 1908934 1911891 1909739 1902320 1889271 1870046 1844302 1812270 1774694 1732459 1686348
62969 1686348 1637134 1585876 1533912 1482415 1431952 1382681 1334918 1289247 1245998 1205017 1166238
62958 1166238 1130152 1097285 1067316 1039131 1011797 985181 959631 935442 912729 891496 871565
62947 871565 852594 834342 816780 799912 783675 768149 753670 740545 728756 718050 708191 698956
$$ packed form
63027B186035L1817K6036J8785J0109O42r090j8873k8330l6756m3655m9186n3765
63015B033769n7418n9729o0366n9357n6922n3236m8439m2817l6804l0718k4496
63004A503467j7893j1052m676P13N485J0453J5669K0190K3222K4940K5969K6546
62992A623033K6684K6721K7003K7222K6732K5529K4265K3269K2004J9769J6454
62981A888685J2394P855K957k152p419j3049j9225k5744l2032l7576m2235m6111
62969A686348m9214n1258n1964n1497n0463m9271m7763m5671m3249m0981l8779
62958A166238l6086l2867k9969k8185k7334k6616k5550k4189k2713k1233j9931
62947H71565j8971j8252j7562j6868j6237j5526j4479j3125j1789j0706r859r235
$$ plain form
62935 698956 690074 681485 673620 667143 662240 658373 654858 651547 648726 646423 644104 641197 637754 634374
62921 634374 631529 629187 627097 625225 623767 622920 622814 623491 624751 626081 627007 627582 628371 629923 632343 635334
62905 635334 638386 640907 642453 643128 643633 644672 646199 647386 647438 646446 645379 645235 646223 647670 648563 648111
62889 648111 646049 642754 639164 636284 634567 633791 633565 633714 634099 634369 634249 633938 633961 634685 636161 638189 640174
62872 640174 641093 640163 637617 634398 631058 627409 623391 619653 616825 614576 611932 608393 604331 600341 596674
62857 596674 593438 591052 590122 590775 592212 593215 593314 593301 594276 596255 598182 599308 599953 600586 600811 599917 598087
62840 598087 596319 595240 594611 593965 593101 591857 590099 588200 587048 587137 588021 588941 589713 590678 592137 594254
62824 594254 597306 601468 606316 610964 614808 617979 620982 624157 627491 630762 633698 636098 637978 639608
$$ packed form
62935F98956q882q589p865o477m903l867l515l311k821k303k319k907l443l380
62921F34374k845k342k090j872j458q47j06O77J260J330R26N75P89J552K420K991
62905F35334L052K521J546O75N05J039J527J187N2r92j067j44R88J447Q93m52
62889F48111k062l295l590k880j717p76k26J49L85K70j20l11K3P24J476K028J985
62872F40174R19r30k546l219l340l649m018l738k828k249k644l539m062l990l667
62857E96674l236k386r30O53J437J003R9j3R75J979J927J126O45O33K25q94j830
62840E98087j768j079o29o46q64j244j758j899j152Q9Q84R20P72R65J459K117
62824E94254L052M162M848M648L844L171L003L175L334L271K936K400J880J630
$$ plain form
62810 639608 641409 643713 646504 649376 651910 654235 657091 661139 666319 672107 678304 685227 693116 701768
62796 701768 710952 720846 731683 743186 754809 766577 779314 793957 811007 830821 854024 881236
62784 881236 912499 947361 985531 1027202 1072825 1122840 1177675 1237573 1302234 1370847 1442692
62773 1442692 1517519 1595154 1674866 1755259 1834627 1911265 1983629 2050452 2110583 2162542 2204390
62762 2204390 2234375 2251693 2256462 2249095 2229996 2199756 2159192 2109117 2050316 1983835 1911013 1833302
62750 1833302 1752406 1670617 1590455 1513563 1440142 1369697 1302151 1238092 1178278 1123193 1072877
62739 1072877 1026805 984166 944653 908870 877527 850254 825683 802758 781575 762811 746767
62728 746767 733262 722079 713085 705988 700334 695722 691844 688379 685170 682514 681047 681219 682993 686045
$$ packed form
62810F39608J801K304K791K872K534K325K856M048N180N788O197O923P889Q652
62796G01768R184R894J0837J1503J1623J1768J2737J4643J7050J9814K3203K7212
62784H81236L1263L4862L8170M1671M5623N0015N4835N9898O4661O8613P1845
62773A442692P4827P7635P9712Q0393P9368P6638P2364O6823O0131N1959M1848
62762B204390K9985J7318M769p367j9099l0240m0564n0075n8801o6481p2822p7711
62750A833302q0896q1789q0162p6892p3421p0445o7546o4059n9814n5085n0316
62739A072877m6072m2639l9513l5783l1343k7273k4571k2925k1183j8764j6044
62728G46767j3505j1183q994p097n654m612l878l465l209k656j467J72J774L052
$$ plain form
62714 686045 690047 694802 700426 707526 716872 728611 741988 756257 771787 789922 811673 836820
62702 836820 864443 894092 926280 962076 1002375 1047327 1096151 1147556 1200669 1255638 1313201
62691 1313201 1373615 1436039 1498887 1560636 1620289 1677184 1730317 1777874 1817621 1847898 1868124
62680 1868124 1878201 1877795 1866579 1845011 1814275 1775454 1729211 1676419 1618578 1557359 1494158 1430326
62668 1430326 1367334 1306163 1246814 1188979 1133129 1080461 1031839 987193 945960 907660 872072
62657 872072 839336 810038 784744 763129 743922 725965 709108 693796 680097 667555 655852
62646 655852 645121 635508 626707 618147 609503 601047 593608 588116 584837 582938 581036 578436 575793 574436
62632 574436 575055 577125 579408 580829 580957 579937 578119 575785 573201 570833 569196 568288 567394 565835 563860
$$ packed form
62714F86045M002M755N624P100R346J1739J3377J4269J5530J8135K1751K5147
62702H36820K7623K9649L2188L5796M0299M4952M8824N1405N3113N4969N7563
62691A313201O0414O2424O2848O1749N9653N6895N3133M7557L9747L0277K0226
62680A868124J0077m06j1216k1568l0736l8821m6243n2792n7841o1219o3201o3832
62668A430326o2992o1171n9349n7835n5850n2668m8622m4646m1233l8300l5588
62657H72072l2736k9298k5294k1615j9207j7957j6857j5312j3699j2542j1703
62646F55852j0731r613q801q560q644q456p439n492l279j899j902k600k643j357
62632E74436O19K070K283J421J28j020j818k334k584k368j637r08q94j559j975
$$ plain form
62617 563860 562345 561586 560884 559596 558170 557757 559075 562056 566354 571630 577409 583226 589074 595374 602421
62602 602421 610225 618940 628984 640627 653892 669062 686793 707401 730453 755516 782971 813559
62590 813559 847270 883192 920400 958468 997067 1035509 1072900 1108411 1141216 1170374 1195001
62579 1195001 1214498 1228515 1236691 1238475 1233265 1220920 1202272 1178921 1152243 1122688 1090209 1055156
62567 1055156 1018435 981013 943804 907944 874530 843861 815415 788815 764408 742598 723111
62556 723111 705354 689200 674869 662207 650699 640200 631110 623678 617538 612155 607383 603295 599772
62543 599772 596620 593985 592295 591732 591980 592480 592689 592146 590645 588598 586942 586352 586646 587205 587867 589028
62527 589028 590875 593059 595391 598524 603538 610964 620496 631549 643785 657203 672080 688921 708212
$$ packed form
62617E63860j515p59p02j288j426m13J318K981M298N276N779N817N848O300P047
62602F02421P804Q715J0044J1643J3265J5170J7731K0608K3052K5063K7455L0588
62590H13559L3711L5922L7208L8068L8599L8442L7391L5511L2805K9158K4627
62579A195001J9497J4017Q176J784n210j2345j8648k3351k6678k9555l2479l5053
62567A055156l6721l7422l7209l5860l3414l0669k8446k6600k4407k1810j9487
62556G23111j7757j6154j4331j2662j1508j0499r090p432o140n383m772m088l523
62543E99772l152k635j690n63K48N00K09n43j501k047j656n90K94N59O62J161
62527E89028J847K184K332L133N014P426R532J1053J2236J3418J4877J6841J9291
$$ plain form
62514 708212 730144 754728 782116 812528 845813 881409 918818 957869 998369 1039758 1081230
62503 1081230 1121952 1160974 1197215 1229925 1259082 1285081 1307985 1327245 1342171 1352586 1359186
62492 1359186 1363433 1367091 1371592 1377813 1386399 1398138 1413798 1433749 1458000 1486482 1518797 1553629
62480 1553629 1589029 1623796 1658312 1693349 1727926 1758735 1781884 1795001 1797733 1790850 1775325 1751826
62468 1751826 1720286 1679881 1630011 1571542 1506844 1438546 1368632 1298609 1229783 1162981 1098619
62457 1098619 1037547 981345 931121 886379 845758 808700 775687 747066 722543 701904 685289
62446 685289 672428 662317 654101 647722 643316 640524 638880 638416 639313 641323 644047 647476 651694 656217
62432 656217 660171 663000 664614 664968 663947 661567 657875 652744 646196 638815 631390 624196 617062 610021
$$ packed form
62514G08212K1932K4584K7388L0412L3285L5596L7409L9051M0500M1389M1472
62503A081230M0722L9022L6241L2710K9157K5999K2904J9260J4926J0415O600
62492A359186M247L658M501O221Q586J1739J5660J9951K4251K8482L2315L4832
62480A553629L5400L4767L4516L5037L4577L0809K3149J3117K732o883j5525k3499
62468A751826l1540m0405m9870n8469o4698o8298o9914p0023o8826o6802o4362
62457A098619o1072n6202n0224m4742m0621l7058l3013k8621k4523k0639j6615
62446F85289j2861j0111q216o379m406k792j644m64Q97K010K724L429M218M523
62432F56217L954K829J614L54j021k380l692n131o548p381p425p194p134p041
$$ plain form
62418 610021 603366 597082 590792 584430 578465 573228 568400 563416 558106 552773 547840 543592 540048 536936
62404 536936 533905 530868 527986 525398 523192 521658 521210 521951 523512 525403 527421 529769 532958 537475 543164
62389 543164 549078 554349 559110 564048 569179 573840 578007 582683 588523 594861 600824 606842 614089 622746
62375 622746 631761 640338 648770 657619 666838 676150 685775 696318 708185 721516 736517 753478 772527
62362 772527 793709 817384 844420 875775 911818 952065 995767 1042784 1093677 1148694 1206834
62351 1206834 1266259 1325553 1384135 1441367 1495791 1545507 1588942 1624853 1651937 1669160 1676622
62340 1676622 1675664 1667884 1654226 1635092 1610882 1582072 1548957 1511770 1471097 1427895 1383120 1337699
62328 1337699 1292881 1250049 1209757 1171302 1133783 1097424 1063301 1031851 1002322 973868 946419
$$ packed form
62418F10021o655o284o290o362n965n237m828m984n310n333m933m248l544l112
62404E36936l031l037k882k588k206j534m48P41J561J891K018K348L189M517N689
62389E43164N914N271M761M938N131M661M167M676N840O338N963O018P247Q657
62375F22746R015Q577Q432Q849R219R312R625J0543J1867J3331J5001J6961J9049
62362G72527K1182K3675K7036L1355L6043M0247M3702M7017N0893N5017N8140
62351A206834N9425N9294N8582N7232N4424M9716M3435L5911K7084J7223P462
62340A676622r58p780j3658j9134k4210k8810l3115l7187m0673m3202m4775m5421
62328A337699m4818m2832m0292l8455l7519l6359l4123l1450k9529k8454k7449
$$ plain form
62317 946419 919998 893865 867217 840603 815746 793751 774058 755440 737524 720971 706547
62306 706547 694474 684488 676006 668251 660655 653355 647080 642357 638922 636025 633242 630844 629357 628938
62292 628938 629276 630026 631118 632630 634530 636726 639230 642108 645320 648788 652537 656524 660400 663769 666709
62277 666709 669656 672599 674805 675690 675722 676055 677431 679888 683473 688641 695730 704524 714759 726897 741917
62262 741917 760392 782162 807080 835763 869272 908086 951752 999630 1051692 1108194 1168671
62251 1168671 1231682 1295760 1360155 1424221 1486305 1543872 1594792 1638026 1672854 1698033 1712273
62240 1712273 1715317 1708065 1691673 1666971 1634713 1595860 1551365 1501957 1448388 1391775 1333595 1275476
62228 1275476 1218915 1164880 1113518 1064534 1018023 974671 934998 898823 865842 836395 811026
$$ packed form
62317I46419k6421k6133k6648k6614k4857k1995j9693j8618j7916j6553j4424
62306G06547j2073r986q482p755p596p300o275m723l435k897k783k398j487m19
62292F28938L38P50J092J512J900K196K504K878L212L468L749L987L876L369K940
62277F66709K947K943K206Q85L2L33J376K457L585N168P089Q794J0235J2138J5020
62262G41917J8475K1770K4918K8683L3509L8814M3666M7878N2062N6502O0477
62251A168671O3011O4078O4395O4066O2084N7567N0920M3234L4828K5179J4240
62240A712273L044p252j6392k4702l2258l8853m4495m9408n3569n6613n8180n8119
62228A275476n6561n4035n1362m8984m6511m3352l9673l6175l2981k9447k5369
$$ plain form
62217 811026 789367 770051 751940 735022 719878 706685 695060 684663 675511 667693 661060 655321
62205 655321 650347 646302 643388 641447 639907 638359 637124 636960 638168 640350 643205 647114 652538 659094
62191 659094 665862 672568 679968 688859 699113 709904 720600 731147 741805 752848 764433 776467
62179 776467 788479 799850 810314 820255 830471 841564 853513 865885 878659 892845 910159 931954
62167 931954 958562 989691 1025172 1065058 1109225 1157286 1208965 1264110 1322050 1381049 1438706
62156 1438706 1492845 1541966 1584889 1620370 1647266 1665024 1673807 1674101 1666227 1650278 1626481 1595603
62144 1595603 1558970 1518102 1474285 1428429 1381305 1333881 1287400 1243093 1201822 1163987 1129806
62133 1129806 1099647 1074016 1053129 1036529 1023224 1012347 1003636 997260 993276 991465 991706 994218 999215
$$ packed form
62217H11026k1659j9316j8111j6918j5144j3193j1625j0397r152p818o633n739
62205F55321m974m045k914j941j540j548j235j64J208K182K855L909N424O556
62191F59094O768O706P400Q891J0254J0791J0696J0547J0658J1043J1585J2034
62179G76467J2012J1371J0464R941J0216J1093J1949J2372J2774J4186J7314K1795
62167I31954K6608L1129L5481L9886M4167M8061N1679N5145N7940N8999N7657
62156A438706N4139M9121M2923L5481K6896J7758Q783K94p874j5949k3797l0878
62144A595603l6633m0868m3817m5856m7124m7424m6481m4307m1271l7835l4181
62133A129806l0159k5631k0887j6600j3305j0877q711o376l984j811K41K512M997
$$ plain form
62120 999215 1006391 1014970 1024254 1033990 1044204 1054831 1065503 1075573 1084341 1091459 1097112 1101641 1104970
62107 1104970 1106595 1106282 1104489 1101940 1098951 1095366 1091050 1086255 1081722 1078634 1078237 1081000 1086097 1092049
62093 1092049 1097975 1103899 1109907 1115568 1120506 1125080 1129965 1135283 1140641 1145996 1151997 1159311 1168003 1177769
62079 1177769 1188526 1200520 1214022 1229135 1245848 1264078 1283703 1304642 1326810 1349860 1373001
62068 1373001 1395360 1416665 1437542 1459011 1481660 1505224 1528939 1552250 1575185 1598090 1621124
62057 1621124 1644093 1666662 1688495 1709043 1727323 1742143 1752586 1758254 1759114 1755208 1746517 1732904
62045 1732904 1714123 1689970 1660468 1625852 1586353 1542166 1493786 1442259 1388879 1334599 1279871
62034 1279871 1225136 1171275 1119427 1070416 1024472 981471 941314 904041 869807 838848 811376
$$ packed form
62120I99215P176Q579R284R736J0214J0627J0672J0070Q768P118N653M529L329
62107A104970J625l13j793k549k989l585m316m795m533l088l97K763N097N952
62093A092049N926N924O008N661M938M574M885N318N358N355O001P314Q692R766
62079A177769J0757J1994J3502J5113J6713J8230J9625K0939K2168K3050K3141
62068A373001K2359K1305K0877K1469K2649K3564K3715K3311K2935K2905K3034
62057A621124K2969K2569K1833K0548J8280J4820J0443N668Q60l906q691j3613
62045A732904j8781k4153k9502l4616l9499m4187m8380n1527n3380n4280n4728
62034A279871n4735n3861n1848m9011m5944m3001m0157l7273l4234l0959k7472
$$ plain form
62023 811376 787302 766042 746694 728520 711285 695154 680385 667106 655318 644960 635932 628022
62011 628022 620884 614200 607978 602664 598786 596421 595133 594545 594858 596606 599905 604155 608584 612988 617833
61996 617833 623633 630292 637000 642713 646768 649189 650501 651288 651878 652293 652318 651616 649954 647460 644586 641661
61980 641661 638583 635042 631000 626737 622508 618403 614629 611616 609653 608548 607810 606995 605735 603696 600881
61965 600881 597887 595454 593679 591941 589675 586941 584141 581526 579190 577252 575734 574426 573220 572524
61951 572524 573049 575122 578403 582250 586161 589904 593556 597600 602812 609812 618721 629306 641361 654858
61937 654858 669729 685628 702019 718519 735068 751654 767886 783046 796679 808940 820154
61926 820154 830197 838607 845272 850563 854648 857022 857061 854939 851685 848321 845185 842141 839221 836868
$$ packed form
62023H11376k4074k1260j9348j8174j7235j6131j4769j3279j1788j0358r028p910
62011F28022p138o684o222n314l878k365j288n88L13J748L299M250M429M404M845
61996F17833N800O659O708N713M055K421J312P87N90M15K5p02j662k494k874k925
61980F41661l078l541m042m263m229m105l774l013j963j105p38q15j260k039k815
61965F00881k994k433j775j738k266k734k800k615k336j938j518j308j206o96
61951E72524N25K073L281L847L911L743L652M044N212P000Q909J0585J2055J3497
61937F54858J4871J5899J6391J6500J6549J6586J6232J5160J3633J2261J1214
61926H20154J0043Q410O665N291M085K374L9k122l254l364l136l044k920k353
$$ plain form
61912 836868 835636 835903 837934 842008 848296 856634 866600 877842 890103 902992 915992 928893 941917
61899 941917 955023 967187 976777 982802 985592 986205 985332 982870 978339 971561 962882 952829 941641 929359
61885 929359 916409 903807 892437 882294 872727 863293 853989 844732 835155 825045 814561 803933
61873 803933 793340 783203 774102 766226 759355 753649 749832 748194 747907 747972 748500 750413 754104 759150 765335
61858 765335 773213 783476 796325 811727 829771 850323 872673 896019 920340 946459 975145 1006253
61846 1006253 1038751 1071421 1103396 1134081 1162861 1189122 1212415 1232295 1248086 1259278 1266288
61835 1266288 1270314 1272121 1271325 1267240 1260149 1251315 1242062 1233323 1225861 1220271 1216716 1215051 1215176 1216891
61821 1216891 1219581 1222531 1225409 1227900 1229024 1227470 1222586 1214381 1202519 1186237 1165544 1141703 1116033
$$ packed form
61912H36868j232K67K031M074O288Q338R966J1242J2261J2889J3000J2901J3024
61899I41917J3106J2164R590O025K790O13q73k462m531o778q679j0053j1188j2282
61885I29359j2950j2602j1370j0143r567r434r304r257r577j0110j0484j0628
61873H03933j0593j0137r101p876o871n706l817j638k87O5N28J913L691N046O185
61858G65335P878J0263J2849J5402J8044K0552K2350K3346K4321K6119K8686L1108
61846A006253L2498L2670L1975L0685K8780K6261K3293J9880J5791J1192P010
61835A266288M026J807p96m085p091q834r253q739p462n590l555j665J25J715
61821A216891K690K950K878K491J124j554m884q205j1862j6282k0693k3841k5670
$$ plain form
61808 1116033 1088861 1060204 1030892 1002241 974916 948775 923733 900199 878642 859191 841720
61797 841720 825983 811680 798604 786788 776358 767296 759402 752367 745852 739759 734510 730711 728274
61784 728274 726267 723906 721380 719328 717808 716265 714298 711961 709440 706911 704703 703160 702261 701637 700894
61769 700894 699778 698231 696675 696027 696934 699107 701850 705107 709375 714609 719928 724662 729135 734096 739780
61754 739780 745842 751832 757401 762343 766800 771246 775925 780459 784243 787037 788888 789762 789631 788799 787649
61739 787649 786055 783487 779869 775984 772824 770702 769129 767384 765013 762019 758832 756111 754312 753405
61725 753405 753060 753071 753404 753882 754101 753776 752978 751945 750793 749528 748133 746468 744310 741711 739126 736830
61709 736830 734325 730773 726012 720737 715550 710300 704620 698667 692878 687224 681208 674634 667995 661981
$$ packed form
61808A116033k7172k8657k9312k8651k7325k6141k5042k3534k1557j9451j7471
61797H41720j5737j4303j3076j1816j0430r062p894p035o515o093n249l799k437
61784G28274k007k361k526k052j520j543j967k337k521k529k208j543q99o24p43
61769G00894j116j547j556o48R07K173K743L257M268N234N319M734M473M961N684
61754G39780O062N990N569M942M457M446M679M534L784K794J851Q74j31q32j150
61739G87649j594k568l618l885l160k122j573j745k371k994l187k721j799r07
61725G53405l45J1L33M78K19l25p98j033j152j265j395j665k158k599k585k296
61709G36830k505l552m761n275n187n250n680n953n789n654o016o574o639o014
$$ plain form
61695 661981 656872 652530 648713 645091 641039 635846 629416 622634 616672 611881 607677 603616 600074 597508
61681 597508 595465 593018 590029 587222 584921 582462 579139 575124 570993 566845 562440 557884 553665 550135
61667 550135 547323 545125 543365 541819 540444 539437 538877 538568 538428 538687 539427 540299 541074 542128 543964 546498
61651 546498 549206 551661 553592 554822 555686 557046 559261 561439 562500 562673 563179 564603 566446 568196 569836
61636 569836 571136 571393 570298 568413 566411 564398 562274 560163 558106 555792 553034 550154 547571 545280
61622 545280 542983 540416 537379 533817 530130 527031 524827 523071 521074 518459 515154 511261 507153 503265
61608 503265 499559 495510 490786 485563 480079 474405 468804 463770 459392 455202 450986 447227 444367 442094
61594 442094 439843 437592 435628 433840 431761 429114 425931 422322 418488 414722 411145 407669 404458 401990
$$ packed form
61695F61981n109m342l817l622m052n193o430o782n962m791m204m061l542k566
61681E97508k043k447k989k807k301k459l323m015m131m148m405m556m219l530
61667E50135k812k198j760j546j375j007n60l09j40K59P40Q72P75J054J836K534
61651E46498K708K455J931J230Q64J360K215K178J061J73N06J424J843J750J640
61636E69836J300K57j095j885k002k013k124k111k057k314k758k880k583k291
61622E45280k297k567l037l562l687l099k204j756j997k615l305l893m108l888
61608E03265l706m049m724n223n484n674n601n034m378m190m216l759k860k273
61594D42094k251k251j964j788k079k647l183l609l834l766l577l476l211k468
$$ plain form
61580 401990 400319 398733 396613 394196 391940 389600 386693 383602 381447 380821 381266 381948 382271 381869 380718
61565 380718 379473 379102 379852 380913 381354 381151 381104 381893 383382 384748 385266 384992 384635 384754 385291 386045 387232
61548 387232 389170 391559 393493 394316 394243 394148 394890 396737 399238 401683 403830 406072 408818 411893 414702 416738
61532 416738 417730 417634 416788 415847 415200 414610 413682 412463 411272 410247 409371 408681 408055 407072 405543 403916 402738
61515 402738 401895 400876 399514 397978 396295 394484 392964 392198 391988 391700 391052 390117 388683 386384 383464 380732
61499 380732 378686 377264 376462 376479 377117 377690 377767 377452 376881 376055 375358 375512 376733 378395 379788 380687 381088 381017
61481 381017 380857 381246 382311 383503 384440 385322 386298 387130 387812 388846 390404 391900 392962 394174 396160 398414
61465 398414 399841 400138 399900 399660 399552 399787 400682 402152 403717 405072 406249 407280 408106 408749 409184 409178 408659
$$ packed form
61580D01990j671j586k120k417k256k340k907l091k155o26M45O82L23m02j151
61565C80718j245l71P50J061M41k03m7P89J489J366N18k74l57J19N37P54J187
61548C87232J938K389J934Q23p3r5P42J847K501K445K147K242K746L075K809K036
61532D16738R92r6q46r41o47n90r28j219j191j025q76o90o26r83j529j627j178
61515D02738q43j019j362j536j683j811j520p66k10k88o48r35j434k299k920k732
61499C80732k046j422q02J7O38N73P7l15n71q26o97J54J221J662J393Q99M01p1
61481C81017j60L89J065J192R37Q82R76Q32O82J034J558J496J062J212J986K254
61465C98414J427K97k38k40j08K35Q95J470J565J355J177J031Q26O43M35on19
$$ plain form
61448 408659 408123 408160 408729 409407 410275 411899 414343 416799 418466 419384 420204 421440 423151 425100 427048 428998
61432 428998 431190 433713 436206 438298 440233 442651 445669 448622 450934 452892 455229 458154 461127 463529
61418 463529 465316 466983 469052 471628 474394 476993 479345 481596 483812 485820 487312 488005 487777 486715 485027
61403 485027 482879 480419 477961 475884 474156 472186 469491 466370 463585 461443 459610 457891 456728 456626
61389 456626 457359 458083 458159 457620 456809 455784 454307 452414 450825 450516 451782 453873 455682 456693 457158 457542
61373 457542 458158 459277 461116 463506 465847 467686 469255 471166 473653 476342 478757 480869 483053 485729
61359 485729 489109 493142 497495 501726 505712 509863 514698 520188 525841 531548 537999 546012 555702 566622
61345 566622 578396 590704 602794 613741 623366 632344 641131 649314 656383 662646 668773 674743 679851
$$ packed form
61448D08659n36L7N69O78Q68J624K444K456J667R18Q20J236J711J949J948J950
61432D28998K192K523K493K092J935K418L018K953K312J958K337K925K973K402
61418D63529J787J667K069K576K766K599K352K251K216K008J492O93k28j062j688
61403D85027k148k460k458k077j728j970k695l121k785k142j833j719j163j02
61389D56626P33P24P6n39q11j025j477j893j589l09J266K091J809J011M65L84
61373D57542O16J119J839K390K341J839J569J911K487K689K415K112K184K676
61359D85729L380M033M353M231L986M151M835N490N653N707O451Q013R690J0920
61345E66622J1774J2308J2090J0947R625Q978Q787Q183P069O263O127N970N108
$$ plain form
61332 679851 683673 686405 688235 688895 688034 685653 682007 677440 672472 667725 663525 659788 656506 654090 652955
61317 652955 652878 653115 653123 653055 653546 655237 658449 663139 669023 675827 683507 692233 702120 713023 724674 736970
61301 736970 750012 763751 777648 790827 802583 812677 821157 828018 833021 835704 835558 832377 826559
61288 826559 818932 810171 800515 790095 779335 768818 758956 749966 742040 735274 729599 725028 721858
61275 721858 720270 719755 719401 718870 718747 719725 721769 724365 727346 731084 735944 741857 748485 755579 763091
61260 763091 771091 779661 788757 798193 807845 817836 828376 839453 850859 862498 874367 886048 896506
61247 896506 904628 909846 912069 911291 907722 902179 895778 889089 881916 874046 865813 857735 850022 842768
61233 842768 836321 831024 826819 823515 821271 820451 821170 823388 827259 832838 839546 846513 853544 861265 870187
$$ packed form
61332F79851L822K732J830O60q61k381l646m567m968m747m200l737l282k416j135
61317F52955p7K37Qo8M91J691L212M690N884O804P680Q726R887J0903J1651J2296
61301G36970J3042J3739J3897J3179J1756J0094Q480O861N003K683j46l181n818
61288H26559p627q761r656j0420j0760j0517r862q990p926o766n675m571l170
61275G21858j588n15l54n31j23R78K044K596K981L738M860N913O628P094P512
61260G63091Q000Q570R096R436R652R991J0540J1077J1406J1639J1869J1681J0458
61247H96506Q122N218K223p78l569n543o401o689p173p870q233q078p713p254
61233H42768o447n297m205l304k244q20P19K218L871N579O708O967P031P721Q922
$$ plain form
61218 870187 880174 890883 902138 913540 924183 933246 940659 946903 952382 957255 961674 965890 970214
61205 970214 975017 980568 986739 993088 999398 1005965 1013337 1022028 1032577 1045472 1060868 1078684 1099043
61192 1099043 1122131 1147460 1173856 1200477 1227353 1254589 1281589 1307627 1332625 1356657 1379009
61181 1379009 1398554 1414928 1428682 1440216 1449185 1455078 1457920 1458233 1456528 1452835 1446550 1436872 1423641
61168 1423641 1407578 1389434 1369157 1346280 1320888 1293739 1265583 1236830 1207699 1178248 1148445
61157 1148445 1118666 1089839 1062560 1036361 1010609 985936 963960 945555 930215 917177 906299
61146 906299 897559 890502 884687 880209 877332 875942 875585 875709 875705 875082 873793 872082 870045 867872 866487 867176
61130 867176 870390 875583 882461 891660 903772 918538 935643 955715 979768 1007977 1039687 1074359
$$ packed form
61218H70187R987J0709J1255J1402J0643R063P413O244N479M873M419M216M324
61205I70214M803N551O171O349O310O567P372Q691J0549J2895J5396J7816K0359
61192A099043K3088K5329K6396K6621K6876K7236K7000K6038K4998K4032K2352
61181A379009J9545J6374J3754J1534Q969N893K842L13j705l693o285r678j3231
61168A423641j6063j8144k0277k2877k5392k7149k8156k8753k9131k9451k9803
61157A148445k9779k8827k7279k6199k5752k4673k1976j8405j5340j3038j0878
61146I06299q740p057n815m478k877j390l57J24mo23j289j711k037k173j385O89
61130H67176L214N193O878R199J2112J4766J7105K0072K4053K8209L1710L4672
$$ plain form
61118 1074359 1111856 1151913 1193959 1237528 1282448 1328667 1376141 1424744 1473954 1522759 1570189
61107 1570189 1615783 1659223 1699767 1736501 1769076 1797764 1822681 1843189 1858133 1866559 1868300 1863997
61095 1863997 1854455 1839932 1820114 1794701 1763641 1726888 1684593 1637824 1588512 1538272 1487663
61084 1487663 1436986 1387131 1338961 1292330 1246618 1202055 1159704 1120250 1083633 1049924 1019658
61073 1019658 992956 968994 946822 926346 908127 892492 879219 867958 858641 851486 846600 843488
61061 843488 841143 838947 837444 837742 840106 843638 847504 852006 858089 866248 876359 888371 902558 919152
61047 919152 938084 959152 982154 1006878 1033228 1061418 1091718 1123969 1157595 1192195 1227788
61036 1227788 1264299 1301107 1337462 1373230 1408843 1444521 1479867 1514259 1547352 1579131 1609873
$$ packed form
61118A074359L7497M0057M2046M3569M4920M6219M7474M8603M9210M8805M7430
61107A570189M5594M3440M0544L6734L2575K8688K4917K0508J4944Q426J741m303
61095A863997r542j4523j9818k5413l1060l6753m2295m6769m9312n0240n0609
61084A487663n0677m9855m8170m6631m5712m4563m2351l9454l6617l3709l0266
61073A019658k6702k3962k2172k0476j8219j5635j3273j1261r317p155m886l112
61061H43488k345k196j503K98K364L532L866M502O083Q159J0111J2012J4187J6594
61047I19152J8932K1068K3002K4724K6350K8190L0300L2251L3626L4600L5593
61036A227788L6511L6808L6355L5768L5613L5678L5346L4392L3093L1779L0742
$$ plain form
61025 1609873 1640221 1670935 1702167 1733220 1763347 1792642 1821864 1851665 1882490 1915039 1950241
61014 1950241 1988672 2030466 2075992 2126369 2183298 2248817 2325307 2415410 2521891 2647832 2796907
61003 2796907 2973235 3181538 3428639 3725342 4086592 4530219 5076832 5750601 6576725
60994 6576725 7573289 8741634 10061670 11494631 12992525 14513408 16037934 17574290
60986 17574290 19138538 20716075 22233491 23570324 24609126 25287978 25618475 25665504 25515482
60977 25515482 25254813 24953025 24636506 24262676 23725840 22908219 21746674 20267341 18568622
60968 18568622 16774946 14996776 13313171 11771281 10392143 9177783 8118467 7198928
60960 7198928 6402543 5713540 5117883 4603465 4160055 3778949 3452204 3172068 2931390
$$ packed form
61025A609873L0348L0714L1232L1053L0127K9295K9222K9801L0825L2549L5202
61014A950241L8431M1794M5526N0377N6929O5519P6490R0103J06481J25941J49075
61003B796907J76328K08303K47101K96703L61250M43627N46613O73769Q26124
60994F576725R96564J168345J320036J432961J497894J520883J524526J536356
60986A7574290J564248J577537J517416J336833J038802O78852L30497M7029j50022
60977B5515482k60669l01788l16519l73830n36836q17621j161545j479333j698719
60968A8568622j793676j778170j683605j541890j379138j214360j059316r19539
60960G198928p96385o89003n95657n14418m43410l81106l26745k80136k40678
$$ plain form
60951 2931390 2724461 2546834 2394112 2261435 2144424 2040148 1946807 1862836 1786682 1717051
60941 1717051 1652843 1592905 1536106 1481564 1428664 1377126 1327200 1279495 1234346 1191574 1151053
60930 1151053 1113209 1078659 1047604 1019831 995008 972631 952011 932809 915479 900731 888555
60919 888555 878068 868396 859434 851671 845444 840504 836319 832746 830240 829217 829249 829270 828635 827668 826915 826192
60903 826192 824738 822214 819203 816618 814682 812500 808715 802779 795536 788313 781483 774305 766184 757514
60889 757514 749057 741068 733552 726925 721695 717635 713943 710284 707090 704659 702463 699722 696388 693210
60875 693210 690884 689434 688505 688078 688632 690476 693147 695798 698216 701089 705143 710394 716509 723479 731401
60860 731401 739827 748052 756142 765037 775266 786014 795944 804715 813163 822023 831040 839533 847401 855095
$$ packed form
60951B931390k06929j77627j52722j32677j17011j04276r3341q3971p6154o9631
60941A717051o4208n9938n6799n4542n2900n1538m9926m7705m5149m2772m0521
60930A151053l7844l4550l1055k7773k4823k2377k0620j9202j7330j4748j2176
60919H88555j0487r672q962p763o227m940m185l573k506j023L2K1o35r67p53p23
60903H26192j454k524l011k585j936k182l785n936p243p223o830p178q121q670
60889G57514q457p989p516o627n230m060l692l659l194k431k196k741l334l178
60875F93210k326j450r29m27N54J844K671K651K418K873M054N251O115O970P922
60860G31401Q426Q225Q090Q895J0229J0748R930Q771Q448Q860R017Q493P868P694
$$ plain form
60846 855095 862751 869820 875680 880311 884211 887835 891279 894279 896344 897100 896740 895958 895146 893829 891283
60831 891283 887651 884076 881669 880672 880707 881524 883353 886675 891710 898074 905030 912378 920882 931457 944075
60816 944075 957933 972660 988654 1006125 1024505 1043226 1062584 1083391 1106041 1130221 1155199
60805 1155199 1180140 1204546 1228767 1253766 1280025 1306962 1333677 1359790 1385193 1409493 1432250
60794 1432250 1453444 1473052 1490437 1504721 1515583 1523169 1527444 1528315 1526199 1521773 1515154 1505942 1494066
60781 1494066 1479965 1463911 1445832 1425936 1404867 1383006 1360175 1336265 1311666 1286756 1261457
60770 1261457 1235722 1210114 1185438 1161920 1139059 1116279 1093487 1071053 1049402 1028721 1009054
60759 1009054 990524 973147 956384 939337 921806 904800 889400 875316 861264 846678 832284
$$ packed form
60846H55095P656P069N860M631L900L624L444L000K065P56l60p82q12j317k546
60831H91283l632l575k407r97L5Q17J829L322N035O364O956P348Q504J0575J2618
60816I44075J3858J4727J5994J7471J8380J8721J9358K0807K2650K4180K4978
60805A155199K4941K4406K4221K4999K6259K6937K6715K6113K5403K4300K2757
60794A432250K1194J9608J7385J4284J0862P586M275Q71k116m426o619r212j1876
60781A494066j4101j6054j8079j9896k1069k1861k2831k3910k4599k4910k5299
60770A261457k5735k5608k4676k3518k2861k2780k2792k2434k1651k0681j9667
60759A009054j8530j7377j6763j7047j7531j7006j5400j4084j4052j4586j4394
$$ plain form
60748 832284 818867 806299 794146 782540 771879 762126 752962 744296 736128 728130 719864 711288 702707
60735 702707 694330 686181 678291 670700 663442 656782 651254 647127 644011 641324 638999 637326 636245 635241
60721 635241 634006 632777 631939 631537 631313 631029 630588 629858 628511 626119 622538 618199 613785 609523 605001 599873
60705 599873 594532 589798 586004 582692 579211 575349 571264 567003 562322 557001 551209 545450 540192 535737
60691 535737 532461 530774 530527 530656 529932 528058 525690 523499 521795 521022 521747 523771 525962 527594 529312
60676 529312 532114 535760 538961 540891 541801 542258 542570 543029 543989 545442 547058 548737 550669 552741 554530
60661 554530 556054 557902 560286 562618 564524 566784 570500 575590 580816 585255 589139 593165 597628 602521
60647 602521 607943 613867 619697 624584 628258 631200 633850 635981 637043 636820 635450 633025 629670 625930
$$ packed form
60748H32284j3417j2568j2153j1606j0661r753r164q666q168p998q266q576q581
60735G02707q377q149p890p591p258o660n528m127l116k687k325j673j081j004
60721F35241j235j229q38m02k24k84m41p30j347k392l581m339m414m262m522n128
60705E99873n341m734l794l312l481l862m085m261m681n321n792n759n258m455
60691E35737l276j687k47J29p24j874k368k191j704p73P25K024K191J632J718
60676E29312K802L646L201J930R10M57L12M59R60J453J616J679J932K072J789
60661E54530J524J848K384K332J906K260L716N090N226M439L884M026M463M893
60647F02521N422N924N830M887L674K942K650K131J062k23j370k425l355l740
$$ plain form
60633 625930 622594 620006 617967 616323 615039 613557 610872 606856 602889 600414 599229 598026 596244 594383
60619 594383 592614 590292 587144 583906 581249 578902 576397 573974 572037 570300 568246 566022 564167 562692
60605 562692 561113 559232 557281 555470 553933 552895 552299 551466 549805 547731 546205 545467 544943 544311 543840 543631
60589 543631 543393 543214 543764 545328 547291 548951 550217 551127 551398 551028 550778 551319 552289 552843 552871 553031 553902 555819
60571 555819 559259 564520 570995 577544 583811 590534 598350 606928 615638 624544 634265 645103 656699 668343
60557 668343 679280 688799 696378 701832 705225 706677 706336 704421 701193 696989 692327 687829 683933 680771
60543 680771 678392 676959 676630 677433 679395 682651 687212 692787 699039 705963 713759 722349 731227 739872 748056
60528 748056 755600 761967 766441 768821 769680 769712 768955 766979 763878 760624 758175 756529 755018 753299 751502
$$ packed form
60633F25930l336k588k039j644j284j482k685m016l967k475j185j203j782j861
60619E94383j769k322l148l238k657k347k505k423j937j737k054k224j855j475
60605E62692j579j881j951j811j537j038n96q33j661k074j526p38n24o32m71k09
60589E43631k38j79N50J564J963J660J266R10K71l70k50N41R70N54K8J60Q71J917
60571E55819L440N261O475O549O267O723P816Q578Q710Q906R721J0838J1596J1644
60557F68343J0937R519P579N454L393J452l41j915l228m204m662m498l896l162
60543F80771k379j433l29Q03J962L256M561N575O252O924P796Q590Q878Q645Q184
60528G48056P544O367M474K380Q59L2p57j976l101l254k449j646j511j719j797
$$ plain form
60513 751502 749561 747095 744197 741740 740411 739819 739122 738359 738587 740603 744064 748147 752782 758950 767840
60498 767840 779951 795055 812852 833499 857510 885245 916555 950783 986925 1023826 1060506
60487 1060506 1096364 1130811 1162555 1189466 1209393 1221094 1224275 1219046 1205658 1184679 1157058 1123981
60475 1123981 1086895 1047571 1007765 968633 930722 894539 860812 830031 801955 775872 751286
60464 751286 728246 707160 688477 672459 658980 647457 637115 627443 618424 610355 603462 597704
60452 597704 592839 588613 584859 581518 578647 576313 574339 572207 569469 566293 563285 560628 557712 553946
60438 553946 549666 545807 542811 540373 538205 536489 535385 534647 534038 533699 533681 533487 532593 531221 530097 529519
60422 529519 529158 528809 528782 529326 530120 530684 531068 531815 533340 535572 538127 540570 542540 543933 545038 546269
$$ packed form
60513G51502j941k466k898k457j329n92o97p63K28K016L461M083M635O168Q890
60498G67840J2111J5104J7797K0647K4011K7735L1310L4228L6142L6901L6680
60487A060506L5858L4447L1744K6911J9927J1701L181n229j3388k0979k7621l3077
60475A123981l7086l9324l9806l9132l7911l6183l3727l0781k8076k6083k4586
60464G51286k3040k1086j8683j6018j3479j1523j0342r672r019q069o893n758
60452E97704m865m226l754l341k871k334j974k132k738l176l008k657k916l766
60438E53946m280l859k996k438k168j716j104p38o09l39j8j94q94j372j124n78
60422E29519l61l49k7N44P94N64L84P47J525K232K555K443J970J393J105J231
$$ plain form
60406 546269 547636 548695 549217 549706 550876 552680 554216 554768 554565 554306 554282 554377 554689 555589 557133 558948 560773
60389 560773 562664 564495 565872 566854 568313 571006 574620 578208 581364 584386 587463 590374 593053 595803
60375 595803 598672 601130 602693 603616 604673 606455 609002 611888 614452 616175 617043 617472 617824 618217 618822 619990
60359 619990 621831 623973 625996 627939 630117 632616 635220 637724 640184 642960 646619 651543 657472 663727
60345 663727 670097 677164 685452 694592 703697 712235 720065 726955 732693 737528 741773 744947 745952 744239
60331 744239 740238 734562 727462 719312 710994 703289 696266 689611 683252 677307 671855 667176 663844 662038
60317 662038 660929 659323 656910 654476 652917 652461 652948 654488 657599 662768 669975 678693 688414 699260
60303 699260 711957 727135 744758 764173 784482 804758 824266 842675 859815 875095 887454
$$ packed form
60406E46269J367J059N22M89J170J804J536N52k03k59k4R5L12R00J544J815J825
60389E60773J891J831J377R82J459K693L614L588L156L022L077K911K679K750
60375E95803K869K458J563R23J057J782K547K886K564J723Q68M29L52L93O05J168
60359F19990J841K142K023J943K178K499K604K504K460K776L659M924N929O255
60345F63727O370P067Q288R140R105Q538P830O890N738M835M245L174J005j713
60331G44239m001n676p100q150q318p705p023o655o359n945n452m679l332j806
60317F62038j109j606k413k434j559m56M87J540L111N169P207Q718R721J0846
60303F99260J2697J5178J7623J9415K0309K0276J9508J8409J7140J5280J2359
$$ plain form
60292 887454 896118 901063 902551 900660 895642 888270 879294 868869 857082 844700 832725 821371 810111
60279 810111 798595 786876 774856 762290 749409 736832 724805 713167 702101 692120 683218 674849
60267 674849 667045 660709 656322 653111 650039 647020 644516 642502 640560 638681 637287 636625 636633 637152 637874 638370
60251 638370 638703 639656 641740 644252 645985 646706 647236 648088 648757 648487 647193 645421 643778 642594 641804 641046
60235 641046 640084 639269 639348 640716 642976 645256 646958 648348 650480 654289 659625 665390 670665 675332 679507
60220 679507 683127 686569 690974 697130 704433 711734 718911 726702 735238 743748 751734 759487 767302 775144
60206 775144 783337 792711 803575 815121 826170 835981 844171 850609 855763 860491 865056 868883 871652
60193 871652 873944 876231 877821 877498 874879 870631 865641 860483 855392 850222 844579 838343 831893 825556
$$ packed form
60292H87454Q664M945J488j891n018p372q976j0425j1787j2382j1975j1354j1260
60279H10111j1516j1719j2020j2566j2881j2577j2027j1638j1066r981q902q369
60267F74849p804o336m387l211l072l019k504k014j942j879j394o62QN19P22M96
60251F38370L33R53K084K512J733P21N30Q52O69k70j294j772j643j184p90p58
60235F41046r62q15P9J368K260K280J702J390K132L809N336N765N275M667M175
60220F79507L620L442M405O156P303P301P177P791Q536Q510P986P753P815P842
60206G75144Q193R374J0864J1546J1049R811Q190O438N154M728M565L827K769
60193H71652K292K287J590l23k619m248m990n158n091n170n643o236o450o337
$$ plain form
60179 825556 819243 812883 806747 800931 795028 788893 783275 779081 776339 774470 773257 772869 773241 774108 775459
60164 775459 777246 778860 779616 779686 779791 780110 780325 780696 782101 784695 787356 788909 789349 789497 790020 791242 793433
60147 793433 796726 800859 805357 809919 814572 819731 826128 834271 843783 853656 863384 873486 884650 896730
60133 896730 908914 920510 931231 940903 949333 956345 961723 965226 966926 967374 967291 967210 967492 968297 969356
60118 969356 970164 970786 972060 974482 977228 978953 979485 979982 981304 982911 983625 982905 980874 977535 972626 966194
60102 966194 958818 951173 943675 936568 930019 923957 918090 912316 907044 902960 900505 899577 899618 899976 900484
60087 900484 901855 905235 910998 918127 925133 931514 937859 944558 950998 956278 960126 962609 963333 961606
60073 961606 957325 951143 943678 934976 924832 913270 900548 887062 873393 860164 847693 835975
$$ packed form
60179H25556o313o360o136n816n903o135n618m194k742j869j213l88L72Q67J351
60164G75459J787J614P56P0J05L19K15L71J405K594K661J553M40J48N23J222K191
60147G93433L293M133M498M562M653N159O397Q143R512R873R728J0102J1164J2080
60133H96730J2184J1596J0721R672Q430P012N378L503J700M48q3q1K82Q05J059
60118I69356Q08O22J274K422K746J725N32M97J322J607P14p20k031l339m909o432
60102I66194p376p645p498p107o549o062n867n774n272m084k455r28M1L58N08
60087I00484J371L380N763P129P006O381O345O699O440N280L848K483P24j727
60073I61606m281o182p465q702j0144j1562j2722j3486j3669j3229j2471j1718
$$ plain form
60061 835975 825053 815075 805944 797349 789366 782545 777015 771895 766220 760273 755401 752491 751207 750799
60047 750799 751063 752147 753991 756530 760190 765517 772343 779886 787769 796364 805857 815433 823934 831014
60033 831014 837107 842345 846081 847601 846831 844138 839856 834243 827518 819556 809853 798195 785227 771991
60019 771991 759047 746413 734180 722645 711821 701351 691174 681901 674297 668584 664415 661292
60007 661292 658803 656697 655042 654246 654692 656377 658964 662157 665862 670145 675048 680332 685349 689377 692364
59992 692364 695154 698700 703124 707820 712453 717415 723141 729335 735226 740419 745054 749065 751758 752454
59978 752454 751336 749227 746532 742819 737609 731279 724859 719147 714354 710533 707836 706200 705056 703720
59964 703720 702018 700398 699435 699352 699993 701112 702604 704492 706799 709465 712310 715024 717222 718645 719350
$$ packed form
60061H35975j0922r978r131q595p983o821n530n120n675n947m872k910j284m08
60047G50799K64J084J844K539L660N327O826P543P883Q595R493R576Q501P080
60033H31014O093N238L736J520p70k693m282n613o725p962r703j1658j2968j3236
60019G71991j2944j2634j2233j1535j0824j0470j0177r273p604n713m169l123
60007F61292k489k106j655p96M46J685K587L193L705M283M903N284N017M028K987
59992F92364K790L546M424M696M633M962N726O194N891N193M635M011K693O96
59978G52454j118k109k695l713n210o330o420n712m793l821k697j636j144j336
59964G03720j702j620r63q3O41J119J492J888K307K666K845K714K198J423P05
$$ plain form
59949 719350 719617 719641 719437 719035 718591 718186 717682 716953 716125 715383 714578 713244 711014 707897 704173 700139 695954
59932 695954 691617 687091 682528 678351 674998 672621 671047 669990 669290 669008 669293 669980 670385 669884 668820 668427
59916 668427 669548 671726 673905 675726 677715 680477 684265 689156 695027 701338 707555 713876 721005 729073
59902 729073 737288 744876 751848 758604 765250 771664 777857 783876 789575 794812 799672 804205 808159 811288
59888 811288 813869 816629 820179 824648 829727 834965 840078 845106 850279 855757 861575 867695 873811 879237
59874 879237 883340 886049 887544 887587 885727 882160 877677 872509 865956 857502 847678 837323 826686 815909
59860 815909 805807 797243 789971 782923 775612 768547 762349 757244 753450 751309 750743 751173 752290 754466
59846 754466 758122 763130 769152 776183 784297 793038 801520 809224 816526 824351 833362 843447 853852 863694
$$ packed form
59949G19350K67K4k04m02m44m05n04p29q28p42q05j334k230l117l724m034m185
59932F95954m337m526m563m177l353k377j574j057p00k82K85O87M05n01j064l93
59916F68427J121K178K179J821J989K762L788M891N871O311O217O321P129Q068
59902G29073Q215P588O972O756O646O414O193O019N699N237M860M533L954L129
59888H11288K581K760L550M469N079N238N113N028N173N478N818O120O116N426
59874H79237M103K709J495M3j860l567m483n168o553q454r824j0355j0637j0777
59860H15909j0102q564p272p048p311p065o198n105l794k141n66M30J117K176
59846G54466L656N008O022P031Q114Q741Q482P704P302P825R011J0085J0405R842
$$ plain form
59832 863694 872332 879402 884811 888819 891913 894385 896148 896986 896718 894903 890681 883313 872793 859725
59818 859725 844805 828739 812442 796797 782245 768926 757125 747179 738993 732052 725981 720732
59806 720732 716324 712797 710400 709240 708700 707774 706202 704780 704245 704287 703992 702846 700855 698006 694194 689674
59790 689674 685106 680967 677175 673382 669448 665533 661820 658354 655198 652607 650851 649820 649015 648102 647348
59775 647348 647264 647895 648751 649388 649787 650094 650308 650428 650716 651563 653111 655111 657208 659329 661782 664906 668660
59758 668660 672732 677078 682088 688067 694829 702034 709652 717690 725745 733323 740487 747664 754811 761321
59744 761321 766847 771690 776169 780064 782971 784890 786212 787357 788538 789638 790209 789856 788789 787732 787191
59729 787191 787087 787123 787183 787234 787250 787359 787763 788394 789038 789841 791194 792966 794452 795365 796302 797873 799936 802100
$$ packed form
59832H63694Q638P070N409M008L094K472J763Q38k68j815m222p368j0520j3068
59818H59725j4920j6066j6297j5645j4552j3319j1801r946q186o941o071n249
59806G20732m408l527k397j160n40r26j572j422n35M2k95j146j991k849l812m520
59790F89674m568m139l792l793l934l915l713l466l156k591j756j031q05r13p54
59775F47348q4O31Q56O37L99L07K14J20K88Q47J548K000K097K121K453L124L754
59758F68660M072M346N010N979O762P205P618Q038Q055P578P164P177P147O510
59744G61321N526M843M479L895K907J919J322J145J181J100N71l53j067j057n41
59729G87191j04L6O0N1J6J09M04O31O44Q03J353J772J486R13R37J571K063K164
$$ plain form
59711 802100 804363 806621 808140 808323 807692 807254 807118 806608 805668 805152 805469 805792 805147 803751 802694 802570 802896
59694 802896 802873 802377 802112 802869 804678 806729 808103 808432 807819 806467 804751 803407 803130 803940 805320 807013
59678 807013 809263 812152 815092 817180 817735 816337 812774 807333 801036 795115 790101 785488 780321 774106
59664 774106 767170 760219 753619 747238 741026 735510 731452 729083 727938 727488 727650 728593 730318 732684 735709
59649 735709 739559 744142 748823 752735 755406 757033 758070 758612 758377 757222 755397 753229 750820 748286 746040
59634 746040 744599 744214 744853 746351 748366 750420 752204 753695 754778 755101 754646 754057 753860 753655 752689 751134
59618 751134 750088 750291 751484 753068 754673 755917 756364 756161 756221 757323 759415 762092 765289 769050 773082
59603 773082 777046 780948 784730 787794 789483 789846 789388 788211 785995 782785 779244 776026 773286 770824 768221
$$ packed form
59711H02100K263K258J519J83o31m38j36n10r40n16L17L23o45j396j057j24L26
59694H02896k3m96k65P57J809K051J374L29o13j352j716j344k77Q10J380J693
59678H07013K250K889K940K088N55j398l563n441o297n921n014m613n167o215
59664G74106o936o951o600o381o212n516m058k369j145m50J62R43J725K366L025
59649G35709L850M583M681L912K671J627J037N42k35j155j825k168k409k534k246
59634G46040j441l85O39J498K015K054J784J491J083L23m55n89j97k05r66j555
59618G51134j046K03J193J584J605J244M47k03O0J102K092K677L197L761M032
59603G73082L964L902L782L064J689L63m58j177k216l210l541l218k740k462k603
$$ plain form
59588 768221 764836 760224 754860 750071 746853 744932 743236 741097 738683 736348 733971 731179 728019 725000
59574 725000 722370 719686 716490 713290 711285 710970 711559 712099 712686 714013 716084 718198 720217 722957 726970
59559 726970 731497 735232 737824 740072 742687 745392 747444 748651 749496 750326 750847 750648 750057 750073 751370 753732
59543 753732 756685 760432 765746 773068 782059 792078 802739 813924 825635 838098 851808 867129
59531 867129 883723 900396 915517 927795 936986 944023 950339 956952 964146 971855 979982 988227 995871
59518 995871 1002005 1005988 1007605 1006863 1003697 997893 989277 978087 965034 950840 935792 919977 903877
59505 903877 888309 873672 859693 846189 833770 823362 815131 808275 801929 795997 791073 787756 786151
59492 786151 785887 786459 787521 788956 790798 793184 796371 800649 806194 813072 821330 830947 841783 853734
$$ packed form
59588G68221l385m612n364m789l218j921j696k139k414k335k377k792l160l019
59574G25000k630k684l196l200k005l15N89N40N87J327K071K114K019K740M013
59559G26970M527L735K592K248K615K705K052J207Q45Q30N21j99n91J6J297K362
59543G53732K953L747N314P322Q991J0019J0661J1185J1711J2463J3710J5321
59531H67129J6594J6673J5121J2278R191P037O316O613P194P709Q127Q245P644
59518I95871O134L983J617p42l166n804q616j1190j3053j4194j5048j5815j6100
59505I03877j5568j4637j3979j3504j2419j0408q231o856o346n932m924l317j605
59492G86151k64N72J062J435J842K386L187M278N545O878Q258R617J0836J1951
$$ plain form
59478 853734 866913 881420 896978 913062 929379 945851 962099 977402 991290 1003705 1014391
59467 1014391 1022708 1028447 1032345 1035261 1037275 1038235 1038881 1040691 1044836 1051995 1062941 1078282 1097498 1119149
59453 1119149 1142470 1168014 1196303 1226489 1256837 1285900 1312666 1336154 1355712 1371513 1383975
59442 1383975 1392663 1396250 1393413 1383288 1365342 1339786 1308446 1274511 1240736 1208031 1176173 1145596
59430 1145596 1117923 1094561 1075237 1058408 1043079 1029830 1019931 1013956 1011761 1013497 1019791 1030750
59418 1030750 1045542 1063395 1084452 1109011 1136241 1164261 1191261 1215975 1237360 1254699 1268176
59407 1268176 1278563 1285928 1288963 1285885 1275840 1259488 1238713 1215997 1193576 1172700 1153689 1136804
59395 1136804 1122794 1112327 1104914 1098427 1089629 1075530 1054951 1029236 1001286 973672 947624 923495
$$ packed form
59478H53734J3179J4507J5558J6084J6317J6472J6248J5303J3888J2415J0686
59467A014391Q317N739L898K916K014R60O46J810M145P159J0946J5341J9216K1651
59453A119149K3321K5544K8289L0186L0348K9063K6766K3488J9558J5801J2462
59442A383975Q688L587k837j0125j7946k5556l1340l3935l3775l2705l1858l0577
59430A145596k7673k3362j9324j6829j5329j3249r899n975k195J736O294J0959
59418A030750J4792J7853K1057K4559K7230K8020K7000K4714K1385J7339J3477
59407A268176J0387P365L035l078j0045j6352k0775k2716k2421k0876j9011j6885
59395A136804j4010j0467p413o487q798j4099k0579k5715k7950k7614k6048k4129
$$ plain form
59383 923495 901573 882238 865814 852572 842546 835126 829247 824301 820451 817755 815521 813118 811056
59370 811056 810534 812023 814895 818350 822081 826088 830533 835936 842890 851312 860475 870089 880878 893719
59356 893719 908602 924791 941798 959801 979315 1000831 1024692 1050950 1079312 1109373 1140801
59345 1140801 1173091 1205270 1236163 1264920 1291119 1314439 1334508 1350974 1363389 1370947 1372643 1367889
59333 1367889 1356884 1340343 1319075 1293923 1265888 1235983 1204877 1172792 1139867 1106720 1074641
59322 1074641 1045109 1018972 996141 976098 958495 943094 929413 917001 906066 897300 890834 885782
59310 885782 881130 876735 873062 870287 868240 866998 866822 867517 868506 869700 871686 874829 878828 883520 889509
59295 889509 897359 906578 916039 925184 934177 943071 951547 959480 966962 973464 977550 977848 974123 967301
$$ packed form
59383I23495k1922j9335j6424j3242j0026p420n879m946l850k696k234k403k062
59370H11056n22J489K872L455L731M007M445N403O954Q422R163R614J0789J2841
59356H93719J4883J6189J7007J8003J9514K1516K3861K6258K8362L0061L1428
59345A140801L2290L2179L0893K8757K6199K3320K0069J6466J2415P558J696m754
59333A367889j1005j6541k1268k5152k8035k9905l1106l2085l2925l3147l2079
59322A074641k9532k6137k2831k0043j7603j5401j3681j2412j0935q766o466n052
59310H85782m652m395l673k775k047j242j76O95R89J194J986L143L999M692N989
59295H89509P850R219R461R145Q993Q894Q476P933P482O502M086K98l725o822
$$ plain form
59281 967301 958887 950525 943701 939424 938213 940457 946441 955902 967991 982034 998071 1016324 1036323
59268 1036323 1056817 1076366 1093774 1108245 1119553 1127921 1133350 1135155 1132499 1125326 1114446 1100720
59256 1100720 1084523 1066108 1046220 1026131 1006987 989134 972163 955849 940968 928822 919814
59245 919814 913014 907500 903647 902552 904498 908712 914598 922424 932594 944724 957709 970391 982010
59232 982010 992344 1001583 1009808 1016506 1020787 1022044 1020105 1014880 1006441 995472 982982 969260 953697
59219 953697 936015 917202 898794 881586 865497 850407 836575 824435 814390 806662 800936 796309
59207 796309 792101 788614 786661 786420 787193 788258 789434 790735 792058 793481 795416 798116 801303 804530 807706
59192 807706 810949 814109 816804 818909 820682 822328 823700 824549 824971 825419 826283 827609 829320 831602 834898
$$ packed form
59281I67301q414q362o824m277j211K244N984R461J2089J4043J6037J8253J9999
59268A036323K0494J9549J7408J4471J1308Q368N429J805k656p173j0880j3726
59256A100720j6197j8415j9888k0089j9144j7853j6971j6314j4881j2146r008
59245I19814o800n514l853j095J946M214N886P826J0170J2130J2985J2682J1619
59232I82010J0334R239Q225O698M281J257j939n225q439j0969j2490j3722j5563
59219I53697j7682j8813j8408j7208j6089j5090j3832j2140j0045p728n726m627
59207G96309m208l487j953k41P73J065J176J301J323J423J935K700L187L227L176
59192H07706L243L160K695K105J773J646J372Q49M22M48Q64J326J711K282L296
$$ plain form
59177 834898 839505 845334 852146 859863 868513 878066 888619 900652 914716 930741 947947 965625 983808
59164 983808 1002860 1022501 1041533 1058550 1072709 1083731 1091487 1095842 1096796 1094458 1088790 1079619 1067027
59151 1067027 1051623 1034304 1015816 996697 977509 958807 940817 923327 906083 889225 873269
59140 873269 858671 845436 833101 821172 809641 799005 789674 781478 774001 767270 761725 757536 754432
59127 754432 752336 751670 752624 754577 756764 759263 762787 767653 773596 780584 789099 799348 810736 822481
59113 822481 834388 846646 859153 871448 883186 894271 904585 913916 922174 929477 935895 941264
59101 941264 945303 947893 949228 949724 949779 949626 949445 949418 949507 949323 948588 947690 947283 947185 946162 943178 938485 933104
59083 933104 927565 921645 915062 907751 899532 890216 880125 869934 859757 849003 837457 826038 816013
$$ packed form
59177H34898M607N829O812P717Q650R553J0553J2033J4064J6025J7206J7678J8183
59164I83808J9052J9641J9032J7017J4159J1022P756M355R54k338n668r171j2592
59151A067027j5404j7319j8488j9119j9188j8702j7990j7490j7244j6858j5956
59140H73269j4598j3235j2335j1929j1531j0636r331q196p477o731n545m189l104
59127G54432k096o66R54J953K187K499L524M866N943O988Q515J0249J1388J1745
59113H22481J1907J2258J2507J2295J1738J1085J0314R331Q258P303O418N369
59101I41264M039K590J335M96N5j53j81k7Q9j84p35q98m07r8j023k984m693n381
59083I33104n539n920o583p311q219r316j0091j0191j0177j0754j1546j1419j0025
$$ plain form
59070 816013 807743 800586 793856 787428 781543 776467 772358 769170 766569 764122 761599 759030 756562 754389
59056 754389 752737 751731 751278 751138 750965 750200 748276 745269 742221 740363 740041 740645 741518 742537 743809 745270
59040 745270 746805 748404 750012 751465 752817 754477 756762 759453 762103 764754 768110 772981 779636 787750
59026 787750 796852 806806 817790 829787 842209 854203 865326 875763 885876 895800 905472 914723
59014 914723 923085 929742 933958 935510 934630 931824 927980 924393 922139 921415 921808 923271 926509 932261 940529
58999 940529 950763 962642 976325 991921 1008943 1026439 1043545 1059734 1074593 1087718 1099017
58988 1099017 1108882 1117670 1125010 1129937 1131784 1130636 1126835 1120488 1111866 1101972 1092226 1083658 1076753 1071962
58974 1071962 1069858 1070655 1074025 1079685 1087907 1099173 1113457 1130125 1148517 1168382 1189684 1212105
$$ packed form
59070H16013q270p157o730o428n885n076m109l188k601k447k523k569k468k173
59056G54389j652j006m53j40j73p65j924l007l048j858l22O04Q73J019J272J461
59040G45270J535J599J608J453J352J660K285K691K650K651L356M871O655Q114
59026G87750R102R954J0984J1997J2422J1994J1123J0437J0113R924R672R251
59014I14723Q362O657M216J552q80k806l844l587k254p24L93J463L238N752Q268
58999I40529J0234J1879J3683J5596J7022J7496J7106J6189J4859J3125J1299
58988A099017R865Q788P340M927J847j148l801o347q622r894r746q568o905m791
58974A071962k104P97L370N660Q222J1266J4284J6668J8392J9865K1302K2421
$$ plain form
58962 1212105 1234875 1257036 1277751 1296348 1312210 1324742 1333359 1337383 1336111 1329241 1317213 1300788
58950 1300788 1280304 1255753 1227753 1197985 1168295 1139615 1112126 1086162 1062432 1041445 1023166
58939 1023166 1007195 992957 979920 968117 958408 951668 947648 945091 942980 941100 939316 937023 933727
58926 933727 929662 925390 921140 916951 913120 909984 907396 904812 901926 898950 896440 895097 895536 897826
58912 897826 901328 905323 909824 915491 922810 931687 941850 953266 965947 979650 994042 1009153 1025503
58899 1025503 1043758 1064334 1087332 1112716 1140416 1170292 1202224 1236311 1272787 1311578 1352177
58888 1352177 1394256 1438143 1484208 1531853 1579607 1626162 1670640 1711665 1746906 1774104 1792216
58877 1792216 1801259 1801603 1793944 1779411 1758806 1731894 1698172 1658387 1614638 1568984 1522570 1476257
$$ packed form
58962A212105K2770K2161K0715J8597J5862J2532Q617M024j272o870j2028j6425
58950A300788k0484k4551k8000k9768k9690k8680k7489k5964k3730k0987j8279
58939A023166j5971j4238j3037j1803r709o740m020k557k111j880j784k293l296
58926I33727m065m272m250m189l831l136k588k584k886k976k510j343M39K290
58912H97826L502L995M501N667P319Q877J0163J1416J2681J3703J4392J5111J6350
58899A025503J8255K0576K2998K5384K7700K9876L1932L4087L6476L8791M0599
58888A352177M2079M3887M6065M7645M7754M6555M4478M1025L5241K7198J8112
58877A792216R043L44p659j4533k0605k6912l3722l9785m3749m5654m6414m6313
$$ plain form
58865 1476257 1431375 1389436 1351381 1317381 1287097 1259835 1234721 1211060 1188589 1167426 1147899
58854 1147899 1130212 1113957 1098012 1081456 1064662 1048954 1035015 1022155 1009448 997055 985825
58843 985825 975907 966413 956440 945919 935402 925392 916029 907102 898210 889124 880116 871783 864440
58830 864440 857835 851547 845526 840164 836006 833504 832873 833894 835912 838288 840997 844585 849447 855293
58816 855293 861536 868056 875174 882803 889946 895415 898968 901487 903978 906622 908806 909853 909512 907900
58802 907900 905276 901960 898261 894245 889647 884248 878385 872812 867846 862917 857314 851281 845896 841880
58788 841880 838988 836748 835287 835035 836091 838338 841899 846829 852500 857927 862697 867073 871146 874458
58774 874458 876635 877835 878305 877993 876874 875193 872996 869855 865582 860872 856725 853447 850744 848579 847213
$$ packed form
58865A476257m4882m1939l8055l4000l0284k7262k5114k3661k2471k1163j9527
58854A147899j7687j6255j5945j6556j6794j5708j3939j2860j2707j2393j1230
58843I85825r918r494r973j0521j0517j0010r363q927q892r086r008q333p343
58830H64440o605o288o021n362m158k502o31J021K018K376K709L588M862N846
58816H55293O243O520P118P629P143N469L553K519K491K644K184J047l41j612
58802I07900k624l316l699m016m598n399n863n573m966m929n603o033n385m016
58788H41880k892k240j461k52J056K247L561M930N671N427M770M376M073L312
58774H74458K177J200M70l12j119j681k197l141m273m710m147l278k703k165j366
$$ plain form
58759 847213 846470 845734 844940 844955 846597 849694 853535 857820 862662 867949 873396 879167 885738 892915 899605
58744 899605 905105 910308 917075 926338 937194 947876 957274 965371 972618 979343 985748 992165 999072 1006863
58730 1006863 1015632 1025123 1034894 1044592 1054121 1063616 1073313 1083395 1093813 1104212 1114181 1123716 1133354
58717 1133354 1143654 1154513 1165177 1175034 1184301 1193722 1203484 1212540 1219218 1222578 1223007 1221323 1217494
58704 1217494 1210607 1200049 1186297 1170327 1152558 1132680 1110273 1085292 1058125 1029647 1001218
58693 1001218 974214 949315 926392 905084 885299 867111 850577 835865 823372 813303 805036
58682 805036 797133 788263 778247 768137 759179 751774 745593 740474 736774 734785 734358 735490 738893 745351
58668 745351 754701 765994 778626 792666 808032 824029 840007 855898 871593 886197 898472 907804
$$ packed form
58759H47213p43p36p94J5J642L097L841M285M842N287N447N771O571P177O690
58744H99605N500N203O767R263J0856J0682R398Q097P247O725O405O417O907P791
58730A006863Q769R491R771R698R529R495R697J0082J0418J0399R969R535R638
58717A133354J0300J0859J0664R857R267R421R762R056O678L360M29j684l829
58704A217494o887j0558j3752j5970j7769j9878k2407k4981k7167k8478k8429
58693A001218k7004k4899k2923k1308j9785j8188j6534j4712j2493j0069q267
58682H05036p903q870j0016j0110q958p405o181n119l700j989m27J132L403O458
58668G45351R350J1293J2632J4040J5366J5997J5978J5891J5695J4604J2275R332
$$ plain form
58656 907804 914274 917863 918144 914882 908617 900507 891706 882866 874012 864853 855374 846125 837844 830879
58642 830879 825204 820867 818118 817089 817643 819661 823186 828082 833780 839640 845442 851314 857211 862738
58628 862738 867471 871232 873945 875475 875890 875831 876406 878577 882738 888920 897244 908020 921375 936887
58614 936887 953637 970627 987211 1003221 1018685 1033379 1046623 1057447 1064909 1068258 1067004 1061181
58602 1061181 1051626 1039820 1027125 1014142 1000883 987578 975048 964132 954899 946765 939403 933210
58590 933210 928805 926422 926148 928458 934027 943032 955015 969407 985680 1002960 1020083 1036419 1052253
58577 1052253 1068023 1083522 1098211 1111987 1125110 1137615 1149403 1160895 1173076 1186832 1202642
58566 1202642 1220939 1242240 1266671 1293668 1322362 1352034 1382013 1411311 1438665 1462958 1483581
$$ packed form
58656I07804O470L589K81l262o265q110q801q840q854r159r479r249q281o965
58642H30879n675m337k749j029N54K018L525M896N698N860N802N872N897N527
58628H62738M733L761K713J530M15n9N75K171M161O182Q324J0776J3355J5512
58614I36887J6750J6990J6584J6010J5464J4694J3244J0824P462L349j254n823
58602A061181r555j1806j2695j2983j3259j3305j2530j0916r233q134p362o193
58590I33210m405k383k74K310N569R005J1983J4392J6273J7280J7123J6336J5834
58577A052253J5770J5499J4689J3776J3123J2505J1788J1492J2181J3756J5810
58566A202642J8297K1301K4431K6997K8694K9672K9979K9298K7354K4293K0623
$$ plain form
58555 1483581 1500381 1513241 1521722 1525279 1523925 1518445 1509835 1498811 1486069 1472572 1459019 1445239
58543 1445239 1430756 1415774 1400939 1386130 1370302 1352657 1333240 1312103 1288810 1263446 1237562
58532 1237562 1213302 1191758 1172773 1156115 1142195 1131591 1124464 1120549 1119378 1120388 1123146 1127575
58520 1127575 1133773 1141536 1150223 1159109 1167738 1175912 1183441 1189887 1194486 1196489 1195736 1192780 1188314 1182654
58506 1182654 1175990 1168837 1161755 1154653 1146863 1138059 1128756 1119666 1110885 1102065 1093216 1084824 1077123 1069695
58492 1069695 1062106 1054724 1048535 1044198 1041647 1040575 1040879 1042479 1045234 1049366 1055633 1064622 1076120 1089538
58478 1089538 1104635 1121189 1138202 1154218 1168499 1181214 1192281 1200683 1205262 1205660 1202118 1194911
58466 1194911 1184513 1172014 1158791 1145864 1133841 1123313 1114952 1109303 1106688 1107177 1110368 1115410 1121542
$$ packed form
58555A483581J6800J2860Q481L557j354n480q610j1024j2742j3497j3553j3780
58543A445239j4483j4982j4835j4809j5828j7645j9417k1137k3293k5364k5884
58532A237562k4260k1544j8985j6658j3920j0604p127l915j171J010K758M429
58520A127575O198P763Q687Q886Q629Q174P529O446M599K003p53k956m466n660
58506A182654o664p153p082p102p790q804r303r090q781q820q849q392p701p428
58492A069695p589p382o189m337k551j072L04J600K755M132O267Q989J1498J3418
58478A089538J5097J6554J7013J6016J4281J2715J1067Q402M579L98l542p207
58466A194911j0398j2499j3223j2927j2023j0528q361n649k615M89L191N042O132
$$ plain form
58453 1121542 1128629 1136951 1146457 1156341 1165279 1172090 1176318 1178194 1177902 1174980 1168771 1159418 1148052 1136020
58439 1136020 1124346 1113938 1105653 1099828 1096194 1094441 1094492 1096041 1098546 1102074 1107631 1116083 1127071 1139390
58425 1139390 1152089 1164828 1177611 1190682 1204341 1218303 1231500 1242831 1251739 1257697 1259776 1257481
58413 1257481 1251645 1243760 1234702 1224711 1214154 1203272 1191332 1177091 1160378 1142568 1125350 1109584
58401 1109584 1095437 1082880 1071778 1061927 1053368 1046393 1041106 1037200 1034190 1031658 1029416 1027609 1026485
58388 1026485 1025707 1024316 1021840 1019115 1017317 1016548 1016162 1016243 1017613 1020312 1023140 1025128 1026669 1028736 1031705
58373 1031705 1035437 1039940 1045357 1051674 1058981 1067766 1078548 1091363 1105881 1121838 1139071 1157361
58361 1157361 1176436 1195976 1215406 1233868 1250644 1265527 1278605 1289842 1298918 1305482 1309473 1311251
$$ packed form
58453A121542P087Q322R506R884Q938O811M228J876k92k922o209r353j1366j2032
58439A136020j1674j0408q285n825l634j753N1J549K505L528N557Q452J0988J2319
58425A139390J2699J2739J2783J3071J3659J3962J3197J1331Q908N958K079k295
58413A257481n836p885r058r991j0557j0882j1940j4241j6713j7810j7218j5766
58401A109584j4147j2557j1102r851q559o975n287l906l010k532k242j807j124
58388A026485p78j391k476k725j798p69l86Q1J370K699K828J988J541K067K969
58373A031705L732M503N417O317P307Q785J0782J2815J4518J5957J7233J8290
58361A157361J9075J9540J9430J8462J6776J4883J3078J1237R076O564L991J778
$$ plain form
58349 1311251 1311344 1310109 1307885 1305475 1303994 1303985 1305174 1307535 1312047 1319682 1329976 1341455 1353263 1365601
58335 1365601 1378754 1392691 1407622 1423868 1440922 1457505 1472949 1487737 1502285 1515947 1527708
58324 1527708 1537237 1544765 1550454 1554372 1556724 1557773 1557914 1558030 1559242 1562000 1565908 1570666 1576520 1583483
58310 1583483 1590963 1598818 1608082 1619800 1633500 1647602 1661150 1674522 1688548 1703600 1719548 1736040
58298 1736040 1752685 1769242 1785746 1802397 1819409 1837028 1855388 1874193 1892881 1911431 1930774
58287 1930774 1952055 1975522 2000359 2025493 2050406 2075334 2100933 2127747 2155909 2185317 2215963
58276 2215963 2247941 2281273 2316008 2352360 2390469 2430206 2471589 2515170 2561525 2610519 2661630
58265 2661630 2714765 2770116 2827409 2886107 2946271 3008341 3072044 3136421 3201061 3266389 3332612
$$ packed form
58349A311251R3j235k224k410j481rJ189K361M512P635J0294J1479J1808J2338
58335A365601J3153J3937J4931J6246J7054J6583J5444J4788J4548J3662J1761
58324A527708R529P528N689L918K352J049J41J16J212K758L908M758N854O963
58310A583483P480P855R264J1718J3700J4102J3548J3372J4026J5052J5948J6492
58298A736040J6645J6557J6504J6651J7012J7619J8360J8805J8688J8550J9343
58287A930774K1281K3467K4837K5134K4913K4928K5599K6814K8162K9408L0646
58276B215963L1978L3332L4735L6352L8109L9737M1383M3581M6355M8994N1111
58265B661630N3135N5351N7293N8698O0164O2070O3703O4377O4640O5328O6223
$$ plain form
58254 3332612 3399375 3466727 3535413 3605831 3677705 3751274 3827853 3908717 3994239 4084646 4180594
58243 4180594 4282359 4389445 4501904 4621282 4749370 4886638 5032724 5187854 5352890
58234 5352890 5528450 5714886 5912932 6123765 6348737 6589481 6847822 7125129 7422323
58225 7422323 7740965 8083736 8453528 8852960 9285413 9755580 10268251 10827486 11437937
58216 11437937 12106139 12839611 13645850 14533912 15516770 16611277 17836937 19216739 20779451
58207 20779451 22560516 24602645 26959386 29700013 32910912 36695448 41180915 46533359
58199 46533359 52968547 60753520 70213163 81750319 95842702 112952341 133337840
58192 133337840 156859898 182901733 210451092 238309044 265376945 290942883 314768997
$$ packed form
58254C332612O6763O7352O8686P0418P1874P3569P6579Q0864Q5522R0407R5948
58243D180594J01765J07086J12459J19378J28088J37268J46086J55130J65036
58234E352890J75560J86436J98046K10833K24972K40744K58341K77307K97194
58225G422323L18642L42771L69792L99432M32453M70167N12671N59235O10451
58216A1437937O68202P33472Q06239Q88062R82858J094507J225660J379802J562712
58207B0779451J781065K042129K356741K740627L210899L784536M485467N352444
58199D6533359O435188P784973R459643J1537156J4092383J7109639K0385499
58192A33337840K3522058K6041835K7549359K7857952K7067901K5565938K3826114
$$ plain form
58185 314768997 336746774 356188342 371305904 379519177 378613013 367962772 348917057
58178 348917057 324143872 296548965 268496716 241577158 216713162 194347958 174601750
58171 174601750 157368059 142344416 129052484 116935836 105537736 94644240 84287165
58164 84287165 74626990 65822051 57959449 51047354 45035396 39839678 35363041 31507654
58156 31507654 28181821 25304110 22805017 20626228 18720064 17049548 15585896 14303291
58148 14303291 13176160 12181171 11299300 10514475 9811920 9179052 8606280 8085427 7608771
58139 7608771 7170806 6769285 6402765 6068050 5761188 5479609 5221577 4984449 4765117
58130 4765117 4561595 4372648 4196140 4029018 3868955 3715175 3567882 3427540 3294480
$$ packed form
58185C14768997K1977777J9441568J5117562Q213273r06164j0650241j9045715
58178C48917057k4773185k7594907k8052249k6919558k4863996k2365204j9746208
58171A74601750j7233691j5023643j3291932j2116648j1398100j0893496j0357075
58164H4287165r660175q804939p862602o912095o011958n195718m476637l855387
58156C1507654l325833k877711k499093k178789j906164j670516j463652j282605
58148A4303291j127131r94989q81871p84825p02555o32868n72772n20853m76656
58139G608771m37965m01521l66520l34715l06862k81579k58032k37128k19332
58130D765117k03522j88947j76508j67122j60063j53780j47293j40342j33060
$$ plain form
58121 3294480 3168638 3049796 2938218 2834418 2737970 2647244 2560830 2478572 2400753 2327048
58111 2327048 2256930 2190480 2128016 2069350 2013965 1961507 1911614 1863667 1817218 1772283 1728877
58100 1728877 1686746 1645868 1606660 1569311 1533470 1499035 1466586 1436571 1408610 1382115 1357020
58089 1357020 1333411 1310968 1289354 1268694 1249113 1230242 1211702 1193619 1176128 1158748 1140809
58078 1140809 1122165 1103122 1084054 1065484 1048012 1031631 1015549 999185 982904 967274 952149
58067 952149 937192 922898 910228 899385 889616 880197 871082 862573 854789 847489 840246 832853 825596
58054 825596 818786 811959 804087 794891 785390 776746 769132 762171 755860 750388 745503 740795 736261 731922
58040 731922 727279 721890 716158 710774 705591 699870 693438 686765 679988 672742 664995 657173 649241 640465
$$ packed form
58121C294480j25842j18842j11578j03800r6448r0726q6414q2258p7819p3705
58111B327048p0118o6450o2464n8666n5385n2458m9893m7947m6449m4935m3406
58100A728877m2131m0878l9208l7349l5841l4435l2449l0015k7961k6495k5095
58089A357020k3609k2443k1614k0660j9581j8871j8540j8083j7491j7380j7939
58078A140809j8644j9043j9068j8570j7472j6381j6082j6364j6281j5630j5125
58067I52149j4957j4294j2670j0843r769r419r115q509p784p300p243p393p257
58054H25596o810o827p872r196r501q644p614o961o311n472m885m708m534m339
58040G31922m643n389n732n384n183n721o432o673o777p246p747p822p932q776
$$ plain form
58026 640465 630436 619723 609221 599349 590218 582082 575201 569463 564384 559319 553667 547294 540911
58013 540911 535676 532198 530154 528917 528172 527792 527550 527259 526932 526544 525892 524905 523865 523066 522523 522337 523129
57996 523129 525646 529845 534657 538799 541719 543714 545378 547145 549281 551976 555208 558567 561406 563260
57982 563260 564080 564099 563525 562333 560240 556941 552587 547985 544081 541156 538829 536866 535623 535465 536106 536879
57966 536879 537475 538085 538950 540110 541524 543178 545126 547629 551098 555549 560165 563830 566168 567856 569835
57951 569835 572441 575297 577811 579655 580958 582173 583701 585582 587579 589440 591052 592531 594383 597376
57937 597376 601886 607366 612738 617428 621782 626506 631913 637767 643587 648950 653614 657411 659959 660546
57923 660546 658601 654386 648978 643400 637859 631963 625479 618657 611854 605152 598510 592174 586725 582601
$$ packed form
58026F40465j0029j0713j0502r872r131q136o881n738n079n065n652o373o383
58013E40911n235l478k044j237p45l80k42k91l27l88o52r87j040p99n43j86P92
57996E23129K517M199M812M142K920J995J664J767K136K695L232L359K839J854
57982E63260Q20J9n74j192k093l299m354m602l904k925k327j963j243j58O41P73
57966E36879N96O10Q65J160J414J654J948K503L469M451M616L665K338J688J979
57951E69835K606K856K514J844J303J215J528J881J997J861J612J479J852K993
57937E97376M510N480N372M690M354M724N407N854N820N363M664L797K548N87
57923F60546j945m215n408n578n541n896o484o822o803o702o642o336n449m124
$$ plain form
57909 582601 579723 577642 575979 574586 573377 572223 571031 569670 567800 565055 561549 557937 554763 551879
57895 551879 548683 544768 540167 535199 530331 526053 522526 519367 516038 512464 509067 506227 503892 501684
57881 501684 499222 496344 493192 490083 487192 484393 481449 478179 474328 469553 463845 457804 452144 446972
57867 446972 441854 436462 430884 425385 420300 416116 413228 411516 410518 410011 410036 410325 410324 410109 410812 413614 418498
57850 418498 424403 430456 436638 443226 450035 456423 461848 466239 469889 473140 476186 479072 481792 484362
57836 484362 486786 488960 490706 491954 492930 494033 495420 496848 498069 499254 500737 502430 503918 505183
57822 505183 506700 508585 510130 510712 510784 511408 512943 514726 515930 516175 515396 513719 511642 509764 508067 505855
57806 505855 502527 498066 492684 486412 479288 471537 463456 455431 448147 442179 437089 431504 424594 417149
$$ packed form
57909E82601k878k081j663j393j209j154j192j361j870k745l506l612l174k884
57895E51879l196l915m601m968m868m278l527l159l329l574l397k840k335k208
57881E01684k462k878l152l109k891k799k944l270l851m775n708o041n660n172
57867D46972n118n392n578n499n085m184k888j712r98n07K5K89jk15P03K802M884
57850D18498N905O053O182O588O809O388N425M391L650L251L046K886K720K570
57836D84362K424K174J746J248R76J103J387J428J221J185J483J693J488J265
57822E05183J517J885J545N82P2O24J535J783J204K45p79j677k077j878j697k212
57806E05855l328m461n382o272p124p751q081q025p284n968n090n585o910p445
$$ plain form
57792 417149 410809 406530 404137 402960 402330 401772 401333 401685 403403 406249 409592 413379 418112 423904 430192
57777 430192 436518 443080 450203 457621 464539 470257 474607 477944 480793 483326 485188 485945 485579 484257 481787
57762 481787 477864 472829 467549 462241 456002 448018 438905 430268 423076 417031 411509 406515 402375 398875
57748 398875 395240 391036 386777 383419 381346 380074 378956 377871 376943 375785 373535 369845 365516 361825
57734 361825 359376 357845 356702 355783 355139 354659 354126 353455 352701 351898 351088 350468 350260 350353 350272 349660 348707 347930
57716 347930 347576 347466 347444 347622 347970 347909 346738 344482 341969 340006 338751 337982 337598 337500 337148 335728 332905
57699 332905 329278 325987 323909 323216 323457 323950 324184 324045 323737 323508 323459 323593 323956 324722 326092 328127 330645
57682 330645 333371 336340 340230 346257 355644 369097 386740 408522 434668 465846 502933 546490
$$ packed form
57792D17149o340m279k393j177o30n58m39L52J718K846L343L787M733N792O288
57777D30192O326O562P123P418O918N718M350L337K849K533J862P57l66j322k470
57762D81787l923n035n280n308o239p984r113q637p192o045n522m994m140l500
57748C98875l635m204m259l358k073j272j118j085r28j158k250l690m329l691
57734C61825k449j531j143r19o44m80n33o71p54q03q10o20k08R3q1o12r53p77
57716C47930l54j10k2J78L48o1j171k256k513j963j255p69l84r8l52j420k823
57699C32905l627l291k078o93K41M93K34j39l08k29m9J34L63P66J370K035K518
57682C30645K726K969L890O027R387J3453J7643K1782K6146L1178L7087M3557
$$ plain form
57670 546490 596149 650191 705741 759733 810142 856443 898634 935452 963342 977274 973049 949546
57658 949546 909370 857609 799796 740598 683643 631646 586023 546520 511824 480875 453469
57647 453469 429657 409091 391272 376125 363824 354139 346390 340066 335128 331627 329316 327735 326474
57634 326474 325229 323850 322429 321173 320080 318873 317318 315462 313465 311403 309379 307651 306433 305632
57620 305632 304897 303909 302576 301041 299559 298264 297002 295520 293857 292419 291649 291762 292770 294448 296190
57605 296190 297248 297313 296657 295528 293817 291545 289288 287669 286627 285636 284376 282710 280269 276758 272658
57590 272658 268962 266120 263847 262026 261060 260980 260902 259934 258196 256372 254590 252339 249335 245953 242848 240538
57574 240538 239181 238273 236732 233817 230009 226498 223845 221682 219750 218506 218363 218904 219391 219656 219940 220072
$$ packed form
57670E46490M9659N4042N5550N3992N0409M6301M2191L6818K7890J3932m225k3503
57658I49546m0176n1761n7813n9198n6955n1997m5623l9503l4696l0949k7406
57647D53469k3812k0566j7819j5147j2301r685p749o324m938l501k311j581j261
57634C26474j245j379j421j256j093j207j555j856j997k062k024j728j218q01
57620C05632p35r88j333j535j482j295j262j482j663j438p70J13J008J678J742
57605B96190J058O5o56j129j711k272k257j619j042r91j260j666k441l511m100
57590B72658l696k842k273j821r66q0p8r68j738j824j782k251l004l382l105k310
57574B40538j357r08j541k915l808l511k653k163j932j244j43N41M87K65K84J32
$$ plain form
57558 220072 219500 218240 217253 217548 219127 221075 222585 223650 224761 226168 227634 228875 230006 231363 232991
57543 232991 234583 235943 237207 238401 239146 239204 239161 240035 242054 244253 245485 245483 244652 243240 241267 239093 237398
57526 237398 236439 235826 235207 234817 235062 235904 236991 238115 239221 240153 240787 241223 241503 241326 240500 239557 239396 240282
57508 240282 241674 243063 244438 245803 246836 247325 247485 247462 246926 245575 243689 241761 239891 238003 236355
57493 236355 235253 234420 233215 231438 229414 227358 225273 223386 222100 221347 220601 219756 219415 220016 221153 222082
57477 222082 222494 222452 222023 221417 221100 221233 221331 220984 220624 220917 221593 221672 220895 220116 220033 220179 219595 217976 215679
57458 215679 213103 210699 209304 209638 211387 213307 214392 214555 214091 213072 211582 210098 209099 208502 207907 207245
57442 207245 206782 206579 206497 206718 207733 209547 211355 212391 212812 213335 214253 215275 216164 216951 217456 217179 216005
$$ packed form
57558B20072n72j260r87K95J579J948J510J065J111J407J466J241J131J357J628
57543B32991J592J360J264J194P45N8m3Q74K019K199J232kq31j412j973k174j695
57526B37398r59o13o19l90K45Q42J087J124J106R32O34M36K80j77q26r43j61Q86
57508B40282J392J389J375J365J033M89J60k3n36j351j886j928j870j888j648
57493B36355j102q33j205j777k024k056k085j887j286p53p46q45l41O01J137R29
57477B22082M12m2m29o06l17J33R8l47l60K93O76P9p77p79q3J46n84j619k297
57458B15679k576k404j395L34J749J920J085J63m64j019j490j484r99n97n95o62
57442B07245m63k03q2K21J015J814J808J036M21N23R18J022Q89P87N05k77j174
$$ plain form
57425 216005 214624 213893 213990 214475 214968 215389 215700 215896 216286 217349 219131 221065 222532 223391 223804 223847 223571 223260
57407 223260 223259 223548 223771 223701 223462 223269 223154 223069 223055 223196 223422 223446 222952 221951 221027 221041 222382 224591 226941 229255
57387 229255 231788 234472 236884 239085 241879 245800 250277 254238 257252 259583 261406 262567 263044 263055 262732
57372 262732 262116 261388 260656 259619 258097 256820 256926 258407 259788 259770 258605 257407 256666 256055 255330 254685 254346
57355 254346 254357 254762 255611 256783 258138 259742 261699 263905 266261 268918 271950 274997 277591 279629 281075
57340 281075 281482 280397 278210 276037 274704 274357 274936 276336 277959 278844 278682 278315 278850 280536 282740 284729
57324 284729 286197 287311 288550 290356 292760 295403 297945 300231 302075 303310 304187 305375 307395 310324
57310 310324 314153 318919 324265 329400 333939 338422 343539 349137 354456 359080 363189 367138 371324 376239
$$ packed form
57425B16005j381p31R7M85M93M21L11J96L90J063J782J934J467Q59M13M3k76l11
57407B23260jK89K23p0k39j93j15q5j4J41K26K4m94j001r24J4J341K209K350K314
57387B29255K533K684K412K201K794L921M477L961L014K331J823J161M77J1l23
57372B62732o16p28p32j037j522j277J06J481J381j8j165j198p41o11p25o45l39
57355B54346J1M05Q49J172J355J604J957K206K356K657L032L047K594K038J446
57340B81075M07j085k187k173j333l47N79J400J623Q85j62l67N35J686K204J989
57324B84729J468J114J239J806K404K643K542K286J844J235Q77J188K020K929
57310C10324L829M766N346N135M539M483N117N598N319M624M109L949M186M915
$$ plain form
57296 376239 381979 387840 393057 397904 403309 409348 415017 419765 424322 429360 434100 437213 438679 439731
57282 439731 441015 441807 441293 439809 438287 437159 436405 436346 437697 440942 446169 453492 463115 474888 488182
57267 488182 502426 517558 533863 551514 570264 589408 608086 625873 643061 660105 676827
57256 676827 692592 707307 721768 736750 752087 766926 780650 793316 805410 817442 829584
57245 829584 841455 852438 862374 871739 880982 890031 898649 906920 914992 922703 929891 936829 943858 950890
57231 950890 957797 965046 973253 982251 991362 1000645 1011078 1023260 1036647 1050466 1064757 1079957 1095923
57218 1095923 1112122 1128672 1146453 1165904 1186098 1205360 1222753 1238684 1254131 1269607 1285191
57207 1285191 1301268 1318627 1337669 1358073 1379623 1402946 1428918 1457624 1488441 1520935 1554995
$$ packed form
57296C76239N740N861N217M847N405O039N669M748M557N038M740L113J466J052
57282D39731J284P92n14j484j522j128p54n9J351L245N227P323R623J1773J3294
57267D88182J4244J5132J6305J7651J8750J9144J8678J7787J7188J7044J6722
57256F76827J5765J4715J4461J4982J5337J4839J3724J2666J2094J2032J2142
57245H29584J1871J0983R936R365R243R049Q618Q271Q072P711P188O938P029P032
57231I50890O907P249Q207Q998R111R283J0433J2182J3387J3819J4291J5200J5966
57218A095923J6199J6550J7781J9451K0194J9262J7393J5931J5447J5476J5584
57207A285191J6077J7359J9042K0404K1550K3323K5972K8706L0817L2494L4060
$$ plain form
57196 1554995 1590087 1624974 1658306 1689117 1716781 1741041 1762237 1781092 1798171 1813878 1828901
57185 1828901 1844151 1860228 1877512 1896869 1919664 1946788 1978103 2013073 2051497 2093437 2138827
57174 2138827 2187391 2238607 2291685 2346030 2401808 2459463 2518502 2577391 2635060 2692110 2750224
57163 2750224 2810803 2874380 2940658 3008362 3075304 3139336 3199596 3257066 3314287 3374604 3440952
57152 3440952 3514602 3594859 3680104 3769210 3862279 3960489 4064902 4174150 4282257 4379218 4455390
57141 4455390 4507345 4540734 4567513 4598916 4639281 4685458 4731464 4773086 4808488 4836653 4857398
57130 4857398 4872648 4886046 4900937 4919339 4942131 4968689 4996732 5024503 5053282 5085988 5123131
57119 5123131 5162050 5200432 5238530 5277422 5317594 5360604 5410105 5469568 5540365 5623221 5719783
$$ packed form
57196A554995L5092L4887L3332L0811K7664K4260K1196J8855J7079J5707J5023
57185A828901J5250J6077J7284J9357K2795K7124L1315L4970L8424M1940M5390
57174B138827M8564N1216N3078N4345N5778N7655N9039N8889N7669N7050N8114
57163B750224O0579O3577O6278O7704O6942O4032O0260N7470N7221O0317O6348
57152C440952P3650Q0257Q5245Q9106R3069R8210J04413J09248J08107R6961P6172
57141D455390N1955L3389K6779L1403M0365M6177M6006M1622L5402K8165K0745
57130D857398J5250J3398J4891J8402K2792K6558K8043K7771K8779L2706L7143
57119E123131L8919L8382L8098L8892M0172M3010M9501N9463P0797Q2856R6562
$$ plain form
57108 5719783 5831369 5958061 6100946 6263937 6452043 6669746 6923164 7222481 7580531
57099 7580531 8010511 8526973 9147456 9891069 10776328 11820395 13035627 14421779 15960662
57090 15960662 17616555 19334922 21038490 22637123 24059485 25282194 26327985 27244115
57082 27244115 28095127 28968420 29953424 31085385 32305638 33486782 34500597 35265125 35744180
57073 35744180 35925405 35805254 35382161 34653224 33619901 32302148 30745467 29011026 27158884
57064 27158884 25238242 23285369 21324248 19371189 17444449 15571376 13785801 12119489
57056 12119489 10596282 9230521 8026236 6977041 6069219 5286548 4613160 4034047 3535445
57047 3535445 3105391 2733398 2409990 2127208 1879027 1660556 1467211 1295220 1142216
$$ packed form
57108E719783J11586J26692J42885J62991J88106K17703K53418K99317L58050
57099G580531M29980N16462O20483P43613Q85259J044067J215232J386152J538883
57090A5960662J655893J718367J703568J598633J422362J222709J045791R16130
57082B7244115Q51012Q73293R85004J131961J220253J181144J013815P64528M79055
57073C5744180J81225j20151m23093p28937j033323j317753j556681j734441j852142
57064B7158884j920642j952873j961121j953059j926740j873073j785575j666312
57056A2119489j523207j365761j204285j049195r07822p82671o73388n79113m98602
57047C535445m30054l71993l23408k82782k48181k18471j93345j71991j53004
$$ plain form
57038 1142216 1006620 886840 781509 689665 609989 540503 479772 427764 384748 349972 322363
57027 322363 302057 290238 287680 294223 309436 332796 362984 397711 434754 473296 514226 558705
57015 558705 605442 648850 680411 692766 683023 652802 606263 548585 485252 421212 360077 304138
57003 304138 254756 212303 176045 144757 117616 94328 74655 58215 44667 33802 25528 19989
56991 19989 17506 18113 21281 26338 33024 41362 51119 61666 72361 82856 92903 101853 108389 110978
56977 110978 108803 102320 92863 81846 70413 59436 49445 40823 34450 31767 33488 38513 44968
56964 44968 52281 61437 73234 87270 102885 120026 138644 158082 177663 197079 215345 229834
56952 229834 237343 236277 227543 213649 197275 180372 163957 148653 135413 125411 119166 116354
$$ packed form
57038A142216j35596j19780j05331r1844p9676o9486o0731n2008m3016l4776k7609
57027C22363k0306j1819k558O543J5213K3360L0188L4727L7043L8542M0930M4479
57015E58705M6737M3408L1561J2355r743l0221m6539n7678o3333o4040o1135n5939
57003C04138m9382m2453l6258l1288k7141k3288j9673j6440j3548j0865q274n539
56991A9989k483O07L168N057O686Q338R757J0547J0695J0495J0047Q950O536K589
56977A10978k175o483r457j1017j1433j0977r991q622o373k683J721N025O455
56964D4968P313R156J1797J4036J5615J7141J8618J9438J9581J9416J8266J4489
56952B29834P509j066q734j3894j6374j6903j6415j5304j3240j0002o245k812
$$ plain form
56940 116354 116731 120670 128426 139480 153147 169359 188157 208717 229519 249393 268027 285555
56928 285555 301808 315574 324249 324839 316047 299344 277702 253642 228827 204757 182788 163404
56916 163404 146162 130494 116254 103641 93018 84688 78435 73441 69026 65342 62975 62149 62744
56903 62744 64857 68774 74462 81573 89808 98892 108363 117890 127665 138047 149032 160565 173172
56890 173172 187569 203659 220427 236849 252497 267285 281093 293530 303554 309377 309370 303286 292348
56877 292348 278323 262951 247996 234972 224556 216781 211996 211191 215290 224632 239308 259474 285047
56864 285047 315437 349729 386776 425045 462976 499882 536021 571134 602855 626905 639108
56853 639108 637532 623179 599129 569177 536980 505869 478675 457393 443182 436860 439140 450283
$$ packed form
56940A16354L77L939P756J1054J3667J6212J8798K0560K0802J9874J8634J7528
56928B85555J6253J3766Q675N90q792j6703k1642k4060k4815k4070k1969j9384
56916A63404j7242j5668j4240j2613j0623q330o253m994m415l684k367q26N95
56903F2744K113L917N688P111Q235R084R471R527R775J0382J0985J1533J2607
56890A73172J4397J6090J6768J6422J5648J4788J3808J2437J0024N823po084j0938
56877B92348j4025j5372j4955j3024j0416p775m785q05M099R342J4676K0166K5573
56864B85047L0390L4292L7047L8269L7931L6906L6139L5113L1721K4050J2203
56853F39108j576j4353k4050k9952l2197l1111k7194k1282j4211o322K280J1143
$$ plain form
56841 450283 470131 498921 537501 585924 642121 702698 764977 827558 889160 947902 1001607
56830 1001607 1047417 1080557 1094765 1085467 1052820 1001532 938238 869316 800207 735207 677228
56819 677228 627974 588465 559268 540490 532045 533988 546241 567943 597325 632288 670912 711470
56807 711470 752299 791855 828519 859865 882025 890263 880932 853490 810877 758091 700367 642200
56795 642200 587145 537700 495251 460283 432659 411754 396848 387889 385597 390309 400822 414878
56783 414878 430720 447716 465580 483641 500905 516039 526895 530612 524782 508586 482878 449768
56771 449768 412314 373937 337221 303127 271574 242672 217129 195560 177716 162522 148849
56760 148849 136306 125249 115970 108034 100683 93745 87734 82982 79156 75783 72874 70764 69591 69114
$$ packed form
56841D50283J9848K8790L8580M8423N6197O0577O2279O2581O1602N8742N3705
56830A001607M5810L3140J4208r298l2647n1288o3294o8922o9109o5000n7979
56819F77228m9254l9509k9197j8778q445J943J2253K1702K9382L4963L8624M0558
56807G11470M0829L9556L6664L1346K2160Q238r331k7442m2613n2786n7724n8167
56795F42200n5055m9445m2449l4968k7624k0905j4906q959k292M712J0513J4056
56783D14878J5842J6996J7864J8061J7264J5134J0856L717n830j6196k5708l3110
56771D49768l7454l8377l6716l4094l1553k8902k5543k1569j7844j5194j3673
56760A48849j2543j1057r279p936p351o938o011m752l826l373k909k110j173m77
$$ plain form
56746 69114 68845 68270 67209 66024 65178 64514 63396 61716 60272 59831 60173 60408 59948 58841 57384 55834
56730 55834 54377 53070 51876 50945 50711 51484 53035 54772 56272 57517 58761 60278 62106 63926 65300
56715 65300 66060 66378 66575 67081 68428 70797 73613 76023 77791 79274 80623 81737 83070 85507 89007
56700 89007 92128 93514 93311 92585 91947 91397 90994 90893 91035 91429 92407 93991 95404 95949 95981 96223 96527 96244
56682 96244 95570 95392 95863 96214 96149 96349 97230 98128 98242 97648 96804 95691 94076 92234 90809 90189 90415 91420
56664 91420 92923 94294 94971 94996 94952 95478 96941 99235 101699 103498 104377 104871 105554 106403 107204 108281 110325
56647 110325 113520 117237 120692 123610 126108 128147 129409 129784 129853 130684 133105 137094 141809 146034 148746
56632 148746 149669 149510 149420 149937 150668 151114 151445 152073 152890 153480 153827 154078 153764 152177 149642 147576 146862 146844
$$ packed form
56746F9114k69n75j061j185q46o64j118j680j444m41L42K35m60j107j457j550
56730E5834j457j307j194r31k34P73J551J737J500J245J244J517J828J820J374
56715F5300P60L18J97N06J347K369K816K410J768J483J349J114J333K437L500
56700H9007L121J386k03p26o38n50m03j01J42L94R78J584J413N45L2K42L04k83
56682I6244o74j78M71L51o5K00Q81Q98J14n94q44j113j615j842j425o20K26J005
56664I1420J503J371O77K5m4N26J463K294K464J799Q79M94O83Q49Q01J077K044
56647A10325L195L717L455K918K498K039J262L75O9Q31K421L989M715M225K712
56632A48746R23j59r0N17P31M46L31O28Q17N90L47K51l14j587k535k066p14j8
$$ plain form
56614 146844 146423 145552 145004 145050 145129 144749 144033 143267 142375 141126 139641 138403 137736 137391 136841 135965 135227 134985
56596 134985 134893 134405 133672 133369 133658 133926 133712 133246 132751 131890 130432 129031 128649 129384 130408 131020 131322 131867
56578 131867 133016 134703 136659 138759 141109 143658 145860 147191 148029 149426 151742 154221 156399 159248
56564 159248 164121 171047 178973 187319 196235 205464 214207 222421 231098 240616 249577 256052 259547 261075
56550 261075 261693 261651 260830 259295 257307 255196 253371 252160 251483 250803 249457 247038 243620 239747 236084 232965
56534 232965 230330 228079 226188 224383 222052 218947 215753 213498 212354 211376 209483 206415 202690 198990
56520 198990 195779 193208 191043 188797 186281 184022 182828 182826 183127 182651 181129 179128 177262 175755 174739
56505 174739 174494 175033 175759 175956 175564 175058 174552 173432 171148 168082 165341 163739 163191 163067 162951 162962 163400
$$ packed form
56614A46844m21q71n48M6P9l80p16p66q92j249j485j238o67l45n50q76p38k42
56596A34985r2m88p33l03K89K68k14m66m95q61j458j401l82P35J024O12L02N45
56578A31867J149J687J956K100K350K549K202J331Q38J397K316K479K178K849
56564A59248M873O926P926Q346Q916R229Q743Q214Q677R518Q961O475L495J528
56550B61075O18m2q21j535j988k111j825j211o77o80j346k419l418l873l663l119
56534B32965k635k251j891j805k331l105l194k255j144r78j893l068l725l700
56520A98990l211k571k165k246k516k259j194kL01m76j522k001j866j507j016
56505A74739k45N39P26J97l92n06n06j120k284l066k741j602n48j24j16J1M38
$$ plain form
56488 163400 164250 165166 165925 166599 167093 166830 165411 163500 162454 162909 164270 165815 167612 169788 171580 172105
56472 172105 171851 172370 174361 176918 178997 180707 182589 184403 185508 186022 186673 187592 188141 188039 187869 188249
56456 188249 189095 190025 190913 191712 192228 192540 193233 194663 196301 197305 197516 197354 196981 196314 195769 196131 197428
56439 197428 198668 199045 198859 198765 198752 198512 198396 199092 200415 201226 200727 199357 198174 197836 198357 199374 200341 200840
56421 200840 201023 201515 202645 204063 205363 206693 208330 209991 211121 211696 212178 212747 213152 213373 213839 214826
56405 214826 216084 217299 218449 219471 220050 220103 220105 220502 221092 221469 221775 222434 223280 223627 223321 223097 223607 224537
56387 224537 225023 224684 223881 223103 222467 221812 221057 220324 219815 219651 219952 220934 222751 225033 226862 227569 227597 228190
56369 228190 230088 232751 234969 236015 236141 236232 237119 238925 240868 241967 242177 242578 244114 246400 248160 248776
$$ packed form
56488A63400Q50R16P59O74M94k63j419j911j046M55J361J545J797K176J792N25
56472A72105k54N19J991K557K079J710J882J814J105N14O51R19N49j02j70L80
56456A88249Q46R30Q88P99N16L12O93J430J638J004K11j62l73o67n45L62J297
56439A97428J240L77j86r4j3k40j16O96J323Q11m99j370j183l38N21J017R67M99
56421B00840J83M92J130J418J300J330J637J661J130N75M82N69M05K21M66R87
56405B14826J258J215J150J022N79N3KL97N90L77L06O59Q46L47l06k24N10R30
56387B24537M86l39q03p78o36o55p55p33n09j64L01R82J817K282J829P07K8N93
56369B28190J898K663K218J046J26R1Q87J806J943J099K10M01J536K286J760O16
$$ plain form
56353 248776 248930 249673 251231 252945 254139 254778 255299 256007 256813 257544 258334 259497 261108 262966 264967 267183
56337 267183 269497 271524 273170 274957 277473 280699 284185 287643 291011 294144 296934 299670 302843 306536
56323 306536 310340 313805 316585 318276 318694 318503 318957 320667 322893 324330 324385 323503 322570 322314 323102 324902
56307 324902 327397 330235 333215 336192 339019 341717 344609 348170 352740 358357 364643 370807 376028 380001
56293 380001 383007 385445 387544 389601 392113 395324 398792 401792 404137 406417 409415 413503 418612 424538
56279 424538 431147 438390 446345 455328 465799 477940 491309 505075 518694 532224 545937 559919
56267 559919 574305 589654 606701 625797 646925 670139 695635 723451 753565 786306 822291
56256 822291 862018 906081 955752 1012674 1077646 1150307 1230347 1318440 1415521 1521660 1636298
$$ packed form
56353B48776J54P43J558J714J194O39N21P08Q06P31P90J163J611J858K001K216
56337B67183K314K027J646J787K516L226L486L458L368L133K790K736L173L693
56323C06536L804L465K780J691M18j91M54J710K226J437N5q82r33k56P88J800
56307C24902K495K838K980K977K827K698K892L561M570N617O286O164N221L973
56293C80001L006K438K099K057K512L211L468L000K345K280K998M088N109N926
56279D24538O609P243P955Q983J0471J2141J3369J3766J3619J3530J3713J3982
56267E59919J4386J5349J7047J9096K1128K3214K5496K7816L0114L2741L5985
56256H22291L9727M4063M9671N6922O4972P2661Q0040Q8093R7081J06139J14638
$$ plain form
56245 1636298 1759196 1890332 2028885 2172892 2319936 2467695 2613862 2756045 2891897
56236 2891897 3018954 3134261 3234531 3316871 3379151 3419750 3437463 3432027 3404484 3356649 3290202
56225 3290202 3206509 3107321 2995388 2874120 2746634 2615288 2482157 2349625 2220011 2094657
56215 2094657 1973791 1857501 1746564 1642138 1544927 1454965 1372006 1295788 1225972 1162126
56205 1162126 1103838 1050766 1002605 959025 919548 883548 850597 820812 794474 771241 750159
56194 750159 730689 713274 698603 686693 676932 668607 660924 652989 644465 636092 628963 623334 618604
56181 618604 614255 610215 606330 602187 597692 593377 589881 587327 585347 583472 581494 579630 578389 578095
56167 578095 578601 579587 580991 582967 585631 589126 593647 599142 605223 611709 618928 627090 635752 644438 653382
$$ packed form
56245A636298J22898J31136J38553J44007J47044J47759J46167J42183J35852
56236B891897J27057J15307J00270Q2340O2280M0599J7713n436k7543m7835o6447
56225C290202q3693r9188j11933j21268j27486j31346j33131j32532j29614j25354
56215B094657j20866j16290j10937j04426r7211q9962q2959p6218o9816o3846
56205A162126n8288n3072m8161m3580l9477l6000l2951k9785k6338k3233k1082
56194G50159j9470j7415j4671j1910r761q325p683p935q524q373p129n629m730
56181F18604m349m040l885m143m495m315l496k554j980j875j978j864j241k94
56167E78095N06R86J404J976K664L495M521N495O081O486P219Q162Q662Q686Q944
$$ plain form
56152 653382 662944 672708 682105 691824 703621 718554 736252 756052 777967 802285 829125 858907
56140 858907 892650 931279 975056 1023993 1078209 1137557 1201540 1270085 1343832 1423064 1506715
56129 1506715 1592927 1680161 1767146 1852071 1932459 2005862 2070509 2125700 2172068 2211197 2244407
56118 2244407 2271834 2292737 2306240 2311405 2307096 2292598 2268482 2236505 2198576 2155868 2108520 2055789
56106 2055789 1996729 1931211 1860316 1785635 1708641 1631079 1555450 1484344 1419335 1360981 1309582
56095 1309582 1265244 1227287 1194391 1165563 1140500 1118958 1100399 1084497 1071445 1061398 1053934
56084 1053934 1048356 1044286 1041704 1040698 1041367 1043691 1047225 1051203 1055337 1060294 1066990 1075454 1084827 1094505
56070 1094505 1104816 1116403 1129345 1143159 1157398 1171860 1186408 1201027 1215975 1231460 1247180
$$ packed form
56152F53382R562R764R397R719J1797J4933J7698J9800K1915K4318K6840K9782
56140H58907L3743L8629M3777M8937N4216N9348O3983O8545P3747P9232Q3651
56129A506715Q6212Q7234Q6985Q4925Q0388P3403O4647N5191M6368L9129L3210
56118B244407K7427K0903J3503N165m309j4498k4116l1977l7929m2708m7348n2731
56106B055789n9060o5518p0895p4681p6994p7562p5629p1106o5009n8354n1399
56095A309582m4338l7957l2896k8828k5063k1542j8559j5902j3052j0047p464
56084A053934n578m070k582j006O69K324L534L978M134M957O696Q464R373R678
56070A094505J0311J1587J2942J3814J4239J4462J4548J4619J4948J5485J5720
$$ plain form
56059 1247180 1262641 1277897 1293450 1309266 1324530 1338669 1352019 1365071 1377643 1389552 1401615
56048 1401615 1415099 1430306 1446484 1463115 1480518 1499118 1518900 1539803 1562015 1585594 1610309
56037 1610309 1636090 1663152 1691551 1721090 1751845 1784298 1818744 1855004 1892826 1932063 1972387
56026 1972387 2013412 2055280 2098601 2143669 2190358 2238892 2289948 2343721 2399662 2457490 2517713
56015 2517713 2580665 2645831 2712725 2781826 2853978 2929391 3007873 3089561 3174787 3263588 3355970
56004 3355970 3452359 3553293 3659024 3769949 3887045 4011270 4142825 4281538 4427748 4582461
55994 4582461 4746894 4922177 5109183 5308382 5520304 5746275 5988074 6246705 6522470
55985 6522470 6816685 7132392 7472745 7839806 8235841 8664861 9131764 9640815 10196355
$$ packed form
56059A247180J5461J5256J5553J5816J5264J4139J3350J3052J2572J1909J2063
56048A401615J3484J5207J6178J6631J7403J8600J9782K0903K2212K3579K4715
56037A610309K5781K7062K8399K9539L0755L2453L4446L6260L7822L9237M0324
56026A972387M1025M1868M3321M5068M6689M8534N1056N3773N5941N7828O0223
56015B517713O2952O5166O6894O9101P2152P5413P8482Q1688Q5226Q8801R2382
56004C355970R6389J00934J05731J10925J17096J24225J31555J38713J46210J54713
55994D582461J64433J75283J87006J99199K11922K25971K41799K58631K75765
55985F522470K94215L15707L40353L67061L96035M29020M66903N09051N55540
$$ plain form
55976 10196355 10804488 11472751 12208774 13020978 13920678 14922395 16042832 17301950 18726002
55967 18726002 20348671 22210077 24358411 26855327 29779623 33227018 37313628 42188886
55959 42188886 48049126 55140794 63762295 74280915 87142994 102811741 121598817
55952 121598817 143460503 167890975 193983841 220627622 246767610 271665648 295009215
55945 295009215 316655150 335998590 351408267 360367526 360491456 350786746 332225061
55938 332225061 307270128 278837578 249439982 220861584 194206627 170047379 148562254
55931 148562254 129671176 113159498 98761722 86207986 75255179 65705075 57401380
55924 57401380 50214011 44026286 38727466 34206811 30352997 27061788 24243486 21822272
$$ packed form
55976A0196355O08133O68263P36023Q12204Q99700J001717J120437J259118J424052
55967A8726002J622669J861406K148334K496916K924296L447395M086610M875258
55959D2188886N860240P091668Q621501J0518620J2862079J5668747J8787076
55952A21598817K1861686K4430472K6092866K6643781K6139988K4898038K3343567
55945B95009215K1645935J9343440J5409677Q959259J23930r704710j8561685
55938C32225061k4954933k8432550k9397596k8578398k6654957k4159248k1485125
55931A48562254j8891078j6511678j4397776j2553736j0952807r550104q303695
55924E7401380p187369o187725n298820m520655l853814l291209k818302k421214
$$ plain form
55916 21822272 19732397 17918533 16337053 14952830 13735132 12657838 11700890 10848083
55908 10848083 10084232 9396150 8774533 8212228 7701592 7235427 6809105 6419444 6062273
55899 6062273 5733007 5428780 5148043 4888558 4647479 4422899 4213751 4018556 3835623
55890 3835623 3664081 3503586 3353420 3212904 3082138 2961296 2849669 2746260 2650723 2562832
55880 2562832 2481837 2407219 2339175 2277272 2219468 2163720 2109885 2058823 2010326 1963115 1916179
55869 1916179 1868693 1819238 1766750 1712142 1657633 1604537 1552856 1502776 1455202 1410689 1369014
55858 1369014 1330058 1294168 1261489 1231634 1204040 1178004 1152489 1126707 1100881 1075784 1051627
55847 1051627 1028022 1004778 981921 959173 936229 913468 891554 870451 849697 829536 810870
$$ packed form
55916B1822272k089875j813864j581480j384223j217698j077294r56948q52807
55908A0848083p63851o88082o21617n62305n10636m66165m26322l89661l57171
55899F062273l29266l04227k80737k59485k41079k24580k09148j95195j82933
55890C835623j71542j60495j50166j40516j30766j20842j11627j03409r5537q7891
55880B562832q0995p4618o8044o1903n7804n5748n3835n1062m8497m7211m6936
55869A916179m7486m9455n2488n4608n4509n3096n1681n0080m7574m4513m1675
55858A369014l8956l5890l2679k9855k7594k6036k5515k5782k5826k5097k4157
55847A051627k3605k3244k2857k2748k2944k2761k1914k1103k0754k0161j8666
$$ plain form
55836 810870 794041 778485 763722 749877 737124 725283 714123 703517 693232 683090 673257 663839
55824 663839 654426 644697 635248 626919 619386 611407 602481 593355 584793 576867 569713 563908 559570 555905
55810 555905 552251 549003 546995 546557 547692 550633 555571 562117 569567 577573 586193 595388 604724 613439
55796 613439 620691 625905 628893 629463 627137 621711 613947 604996 595136 583798 571093 558429 547128
55783 547128 537088 527364 517584 508181 499562 491753 484646 478065 471638 465147 459088 454554 452457 452884
55769 452884 455086 457946 460603 462844 464852 466574 467487 466938 464422 459575 452426 443712 434475 425172 415665
55754 415665 406207 397639 390232 383079 375315 367333 360036 353362 346526 339407 332631 326375 320140 313886
55740 313886 308373 303972 300064 296121 292598 290047 288032 285820 283707 282677 282784 282778 281528 279177 276655
$$ packed form
55836H10870j6829j5556j4763j3845j2753j1841j1160j0606j0285j0142r833r418
55824F63839r413r729r449q329p533p979q926r126q562p926p154n805m338l665
55810E55905l654l248k008m38J135K941M938O546P450Q006Q620R195R336Q715
55796F13439P252N214K988N70k326n426p764q951r860j1338j2705j2664j1301
55783E47128j0040r724r780r403q619p809p107o581o427o491o059m534k097M27
55769D52884K202K860K657K241K008J722R13n49k516m847p149q714r237r303r507
55754D15665r458q568p407p153p764p982p297o674o836p119o776o256o235o254
55740C13886n513m401l908l943l523k551k015k212k113j030J07oj250k351k522
$$ plain form
55725 276655 274632 273215 272145 270867 268753 265693 262284 259093 255978 252557 249151 246726 245866 246312 247606
55710 247606 249717 252731 256350 260081 263707 267161 270027 271668 271946 271427 270633 269303 266723 262690 257829
55695 257829 252896 248018 242922 237778 233427 230604 229181 228447 227902 227408 226787 225879 225180 225795 228268 231773
55679 231773 234957 237380 239586 241874 243732 244681 245064 245575 246358 247038 247365 247325 246761 245471 243782 242465
55663 242465 241872 241592 241355 241847 243969 247510 251271 254651 258401 263407 269271 274710 279001 282396 285242
55648 285242 287411 288690 289064 288341 286010 281810 276158 269740 262979 256114 249412 242963 236540 230016 223683
55633 223683 217883 212589 207687 203418 200085 197519 195254 193084 191097 189293 187633 186313 185460 184635 183189
55618 183189 181162 179280 177939 176684 174919 172732 170753 169526 169217 169591 169998 169638 168217 166258 164509
$$ packed form
55725B76655k023j417j070j278k114l060l409l191l115l421l406k425q60M46J294
55710B47606K111L014L619L731L626L454K866J641K78n19p94j330k580m033m861
55695B57829m933m878n096n144m351k823j423p34n45m94o21r08o99O15K473L505
55679B31773L184K423K206K288J858R49L83N11P83O80L27m0n64j290j689j317
55663B42465n93k80k37M92K122L541L761L380L750N006N864N439M291L395K846
55648B85242K169J279L74p23k331m200n652o418o761o865o702o449o423o524o333
55633B23683n800n294m902m269l333k566k265k170j987j804j660j320q53q25j446
55618A83189k027j882j341j255j765k187j979j227l09L74M07l60j421j959j749
$$ plain form
55603 164509 163111 161520 159260 156634 154593 153828 153984 153934 153008 151672 150735 150138 149104 147440 146035 145826
55587 145826 146753 148059 149190 149966 150212 149751 148731 147635 146907 146740 147148 148073 149428 151179 153262 155424
55571 155424 157368 159169 161287 163963 166788 169198 171212 173371 176008 178850 181343 183103 184000 184060 183474
55556 183474 182587 181672 180649 179108 176743 173781 170809 168083 165261 162113 159220 157456 156765 156076 154651
55541 154651 153036 152320 152870 154195 155715 157113 158153 158716 159002 159249 159233 158496 157071 155583 154503 153685
55525 153685 152728 151471 149939 148168 146337 144839 143905 143286 142505 141369 140059 138867 138033 137745 137976 138230
55509 138230 137736 136163 134075 132447 131645 131043 129742 127540 125100 123295 122610 123062 124320 125840 127176
55494 127176 128338 129627 131000 131832 131555 130357 129071 128468 128738 129398 129543 128536 126796 125636 125860 126743
$$ packed form
55603A64509j398j591k260k626k041p65J56n0r26j336r37n97j034j664j405k09
55587A45826R27J306J131P76K46m61j020j096p28j67M08R25J355J751K083K162
55571A55424J944J801K118K676K825K410K014K159K637K842K493J760Q97O0n86
55556A83474q87r15j023j541k365k962k972k726k822l148k893j764o91o89j425
55541A54651j615p16N50J325J520J398J040N63K86K47j6p37j425j488j080q18
55525A53685r57j257j532j771j831j498r34o19p81j136j310j192q34k88K31K54
55509A38230m94j573k088j628q02o02j301k202k440j805o85M52J258J520J336
55494A27176J162J289J373Q32k77j198j286o03K70O60J45j007j740j160K24Q83
$$ plain form
55478 126743 126861 125841 124710 124535 125273 126144 126559 126421 125933 125533 125744 126680 127780 128222 127600 126166 124610
55461 124610 123638 123442 123514 123313 123188 124072 125999 127592 127643 126744 126505 127423 128436 128665 128585 129062 130040 130887 131518
55442 131518 132358 133356 133822 133345 132323 131371 130617 129840 128982 128198 127589 127184 127117 127551 128354 129061 129254 128920 128412
55423 128412 128129 128305 129011 130163 131486 132608 133392 134167 135441 137300 139207 140528 141197 141696 142482 143625
55407 143625 144923 146060 146519 145703 143515 140786 138725 137846 137554 136865 135319 133113 130695 128592 127503
55392 127503 128017 129925 132076 133256 133219 132667 132340 132414 132760 133365 134266 135261 135971 136162 135863 135211 134300 133156
55374 133156 131771 130233 128855 127976 127558 127154 126469 125732 125260 124869 124223 123591 123679 124595 125502 125645 125322 125406
55356 125406 126134 126835 126828 126247 125811 125981 126548 127006 127234 127622 128521 129770 130894 131635 131954 131734 130941 130014 129560
$$ packed form
55478A26743J18j020j131j75P38Q71M15j38m88m00K11R36J100M42o22j434j556
55461A24610r72j96P2k01j25Q84J927J593N1q99k39R18J013K29q0M77R78Q47O31
55442A31518Q40R98M66m77j022r52p54p77q58p84o09m05o7M34Q03P07J93l34n08
55423A28412k83J76P06J152J323J122P84P75J274J859J907J321O69M99P86J143
55407A43625J298J137M59q16k188k729k061q79k92o89j546k206k418k103j089
55392A27503N14J908K151J180l7n52l27P4L46O05R01R95P10J91k99o52r11j144
55374A33156j385j538j378q79m18m04o85p37m72l91o46o32Q8R16R07J43l23Q4
55356A25406P28P01pn81m36J70N67M58K28L88Q99J249J124P41L19k20p93r27m54
$$ plain form
55337 129560 129547 129312 128605 128075 128380 129288 130107 130560 130741 130543 129791 128703 127618 126379 124614 122587 121184
55320 121184 120985 121806 123188 124802 126267 127100 127088 126422 125434 124515 124314 125449 127800 130389 132166 132772 132555
55303 132555 132204 132378 133272 134413 135187 135578 136058 136796 137449 137746 137752 137507 136941 136207 135528 134639 133094 131284
55285 131284 130338 130629 131148 130910 130252 130075 130430 130657 130557 130547 130930 131752 133127 134866 135908 135103 132772 130782
55267 130782 130705 132376 134416 135685 135955 135648 135367 135521 136073 136631 136873 136821 136658 136419 136005 135467 135214 135714
55249 135714 136870 137840 137857 137210 136929 137388 137765 137256 136261 135800 136118 136474 136167 135155 133776 132421 131471 131085
55231 131085 130968 130714 130392 130394 130800 131264 131434 131148 130340 129236 128506 128687 129512 130301 130955 131990 133539 134947
55213 134947 135562 135472 135309 135648 136708 138236 139651 140581 141225 141830 142055 141480 140568 140297 140736 140870 140104 139140
$$ packed form
55337A29560j3k35p07n30L05R08Q19M53J81j98p52j088j085j239j765k027j403
55320A21184j99Q21J382J614J465Q33j2o66r88r19k01J135K351K589J777O06k17
55303A32555l51J74Q94J141P74L91M80P38O53K97Ok45n66p34o79q89j545j810
55285A31284r46K91N19k38o58j77L55K27j00j0L83Q22J375J739J042q05k331j990
55267A30782p7J671K040J269K70l07k81J54N52N58K42n2j63k39m14n38k53N00
55249A35714J156R70J7o47k81M59L77n09r95m61L18L56l07j012j379j355r50l86
55231A31085j17k54l22KM06M64J70k86q08j104p30J81Q25P89O54J035J549J408
55213A34947O15r0j63L39J060J528J415R30O44O05K25n75r12k71M39J34p66r64
$$ plain form
55195 139140 138910 139319 139561 139209 138467 137751 137488 137955 138877 139456 139258 138794 138828 139383 139818 139655 139015 138423 138454
55176 138454 139302 140456 141074 140913 140519 140308 139970 139216 138598 138975 140422 142212 143646 144407 144341 143475 142199
55159 142199 141017 140146 139672 139769 140368 140885 140897 140841 141444 142592 143402 143370 142802 142101 141277 140344 139582 139129 138725
55140 138725 138120 137433 136934 136782 137067 137726 138322 138275 137561 136841 136687 136999 137418 137934 138728 139616 140120 140072 139837
55121 139837 139851 140149 140484 140776 141230 141986 142837 143519 144161 145120 146315 147120 147174 147001 147456 148732 150249 151376
55103 151376 151869 151788 151490 151742 153249 155852 158463 159969 160049 159117 157849 156845 156393 156285 156055 155525 154923
55086 154923 154453 154019 153531 153146 153019 153044 153023 152943 152920 153054 153453 154198 155160 156019 156619 157118 157691 158314 158944 159636
55066 159636 160344 160850 161095 161331 161702 161960 161857 161568 161368 161112 160473 159586 158998 158950 159135 159182 159064 158942 159005 159557
$$ packed form
55195A39140k30M09K42l52p42p16k63M67R22N79j98m64L4N55M35j63o40n92L1
55176A38454Q48J154O18j61l94k11l38p54o18L77J447J790J434P61o6q66j276
55159A42199j182q71m74R7N99N17J2n6O03J148Q10l2n68p01q24r33p62m53m04
55140A38725o05o87m99j52K85O59N96m7p14p20j54L12M19N16P94Q88N04m8k35
55121A39837J4K98L35K92M54P56Q51O82O42R59J195Q05N4j73M55J276J517J127
55103A51376M93q1k98K52J507K603K611J506Q0r32j268j004m52j08k30n30o02
55086A54923m70m34m88l85j27K5k1q0k3J34L99P45R62Q59O00M99N73O23O30O92
55066A59636P08N06K45K36L71K58j03k89k00k56o39q87n88m8J85M7j18j22O3N52
$$ plain form
55046 159557 160799 162301 163077 162581 161402 160540 160201 159775 158918 158027 157477 156919 155811 154346 153396 153575 154721
55029 154721 156209 157411 157827 157263 156084 155051 154658 154772 154951 154884 154429 153606 152745 152304 152277 152101 151479 151011
55011 151011 151514 152946 154474 155529 156269 157014 157768 158392 158843 159090 159228 159716 161009 162764 163934 163996 163628
54994 163628 163778 164488 165105 165312 165298 165093 164470 163593 163157 163578 164439 165011 165091 165014 165090 165398 166072 167355 169187
54975 169187 170968 171979 172030 171509 170830 170058 169167 168398 168085 168187 168303 168194 168071 168278 168871 169640 170396 171125
54957 171125 171967 173098 174467 175593 175873 175269 174486 174224 174447 174657 174761 175187 176134 177112 177494 177274 177003 177105
54939 177105 177535 178129 178938 180073 181364 182472 183328 184241 185483 186928 188273 189493 190936 193043 196133
54924 196133 200395 205772 211843 217986 223778 229131 234101 238786 243420 248182 252720 256142 257707 257409
$$ packed form
55046A59557J242J502P76m96j179q62l39m26q57q91n50n58j108j465r50J79J146
55029A54721J488J202M16n64j179j033l93J14J79o7m55q23q61m41k7j76o22m68
55011A51011N03J432J528J055P40P45P54O24M51K47J38M88J293J755J170O2l68
54994A63628J50P10O17K07j4k05o23q77m36M21Q61N72Q0p7P6L08O74J283J832
54975A69187J781J011N1n21o79p72q91p69l13J02J16j09j23K07N93P69P56P29
54957A71125Q42J131J369J126K80o04p83k62K23K10J04M26R47R78L82k20k71J02
54939A77105M30N94Q09J135J291J108Q56R13J242J445J345J220J443K107L090
54924A96133M262N377O071O143N792N353M970M685M634M762M538L422J565k98
$$ plain form
54910 257409 255679 252720 248485 243209 237579 232195 227070 221809 216196 210562 205605 201898 199473 197820
54896 197820 196275 194426 192227 189832 187387 184993 182864 181518 181620 183406 186264 189196 191748 194303
54882 194303 197419 201246 205738 211038 217232 223904 230390 236456 242387 248337 253854 258095 260401 260675
54868 260675 259358 257015 253832 249644 244547 239117 233724 228001 221591 215197 210090 206508 203304 199492
54854 199492 195377 191724 188558 185528 182937 181412 180653 179473 177251 174651 172607 171250 170223 169468 169073
54839 169073 168678 167716 166228 164962 164598 165219 166480 167833 168596 168279 167168 166236 166185 166757 167248 167444 167697
54822 167697 168268 169037 169826 170585 171193 171470 171550 171876 172628 173375 173580 173216 172674 172253 172031 172124 172730 173920 175546
54803 175546 177312 178722 179122 178196 176541 175435 175838 177619 179756 181176 181432 180885 180352 180459 181213 182176
$$ packed form
54910B57409j730k959m235n276n630n384n125n261n613n634m957l707k425j653
54896A97820j545j849k199k395k445k394k129j346J02J786K858K932K552K555
54882A94303L116L827M492N300O194O672O486O066N931N950N517M241K306K74
54868B60675j317k343l183m188n097n430n393n723o410o394n107l582l204l812
54854A99492m115l653l166l030k591j525p59j180k222k600k044j357j027p55l95
54839A69073l95r62j488j266l64O21J261J353P63l17j111r32n1N72M91J96K53
54822A67697N71P69P89P59O08K77Q0L26P52P47K05l64n42m21k22R3O06J190J626
54803A75546J766J410M00r26j655j106M03J781K137J420K56n47n33J07P54R63
$$ plain form
54787 182176 182944 183349 183394 183313 183561 184364 185280 185658 185633 186145 187762 190031 192349 194981 198563 202902 207039
54770 207039 210566 214214 218940 224881 231538 238552 245912 253557 261104 267923 273304 276681 277980 277725
54756 277725 276554 274579 271343 266476 260257 253443 246637 240030 233722 228049 223362 219588 216265 213036
54742 213036 209899 206983 204421 202522 201652 201614 201492 200597 199437 199219 200450 202502 204573 206532 208604 210824
54726 210824 213213 216157 220134 225105 230427 235362 239599 243476 247752 252829 257984 261654 262828 261905
54712 261905 259929 257320 253819 249360 244343 239044 233353 227310 221502 216623 212849 209812 207026 204225
54698 204225 201418 198702 196015 193183 190332 188050 186811 186337 185879 185114 184386 184072 184125 184272 184303 184015 183384
54681 183384 182902 183346 184865 186645 187737 187885 187300 186048 184160 182158 180920 180891 181709 182609 183045 182939 182533
$$ packed form
54787A82176P68M05M5q1K48Q03R16L78k5N12J617K269K318K632L582M339M137
54770B07039L527L648M726N941O657P014P360P645P547O819N381L377J299k55
54756B77725j171j975l236m867o219o814o806o607o308n673m687l774l323l229
54742B13036l137k916k562j899q70l8j22q95j160k18J231K052K071J959K072K220
54726B10824K389K944L977M971N322M935M237L877M276N077N155L670J174r23
54712B61905j976k609l501m459n017n299n691o043n808m879l774l037k786k801
54698B04225k807k716k687k832k851k282j239m74m58p65p28l14N3J47L1k88o31
54681A83384m82M44J519J780J092J48n85j252j888k002j238k9Q18R00M36j06m06
$$ plain form
54664 182533 182039 181409 180536 179611 179022 178850 178769 178571 178442 178523 178538 178191 177672 177445 177779 178689 180027 181310 181844
54645 181844 181498 181062 181367 182273 183015 183262 183250 183097 182727 182354 182371 182712 182965 183095 183371 183566 183049 181881 181030
54626 181030 181142 181827 182505 183291 184506 185947 187271 188613 190133 191321 191445 190468 188967 187350 185767 184541
54610 184541 184003 183892 183549 182777 182035 181758 181948 182503 183422 184515 185315 185545 185440 185450 185783 186249 186441 186080 185406
54591 185406 185069 185367 185731 185390 184466 183850 183991 184355 184282 183808 183299 182760 182056 181496 181597 182265 182737 182488 181935
54572 181935 181958 182889 184183 185121 185596 186030 186615 186990 186842 186492 186502 186794 186667 185769 184636 184059 184261 184935 185827
54553 185827 186867 187850 188392 188301 187811 187365 187267 187552 188068 188617 189039 189230 189173 189033 189146 189785 190921 192339 193928
54534 193928 195629 197150 198059 198300 198344 198662 199300 200083 200892 201501 201463 200621 199507 198763 198315 197614 196637 196042
$$ packed form
54664A82533m94o30q73r25n89j72q1j98j29Q1J5l47n19k27L34R10J338J283N34
54645A81844l46m36L05R06P42K47j2j53l70l73J7L41K53J30K76J95n17j168q51
54626A81030J12O85O78P86J215J441J324J342J520J188J24r77j501j617j583j226
54610A84541n38j11l43p72p42k77J90N55R19J093Q00K30j05J0L33M66J92l61o74
54591A85406l37K98L64l41r24o16J41L64p3m74n09n39p04n60J01O68M72k49n53
54572A81935K3R31J294R38M75M34N85L75j48l50J0K92j27q98j133n77K02O74Q92
54553A85827J040R83N42r1m90m46r8K85N16N49M22J91n7j40J13O39J136J418J589
54534A93928J701J521R09K41M4L18O38P83Q09O09l8q42j114p44m48p01r77n95
$$ plain form
54516 196042 196205 196663 196785 196563 196394 196428 196557 196830 197383 198023 198238 197699 196532 195063 193537 192113 190961
54499 190961 190289 190324 191189 192643 194023 194665 194438 193803 193353 193367 193681 193834 193487 192860 192590 192914 193280 193144 192925
54480 192925 193541 195058 196506 197187 197488 198046 198789 199312 199641 199972 200043 199525 198841 198804 199457 199971 199758 199117 198681
54461 198681 198811 199641 201075 202528 203215 203008 202503 202077 201524 200931 201078 202269 203331 202805 200935 199536 199795
54444 199795 200989 201663 201327 200541 199846 199292 198839 198573 198396 197934 197048 196218 196125 196892 198039 199194 200474 201961
54426 201961 203169 203419 202671 201535 200554 199879 199661 200157 201242 202361 203307 204556 206384 208075 208583 207806
54410 207806 206687 206165 206494 207428 208493 209076 208814 208053 207576 207760 208264 208555 208390 207813 207120 206879 207527 208786
54392 208786 209857 210368 210732 211432 212361 213198 214021 215099 216297 217100 217208 216807 216247 215755 215502 215691 216391 217347
$$ packed form
54516A96042J63M58J22k22j69L4J29K73N53O40K15n39j167j469j526j424j152
54499A90961o72L5Q65J454J380O42k27o35m50J4L14J53l47o27k70L24L66j36k19
54480A92925O16J517J448O81L01N58P43N23L29L31P1n18o84l7O53N14k13o41m36
54461A98681J30Q30J434J453O87k07n05m26n53n93J47J191J062n26j870j399K59
54444A99795J194O74l36p86o95n54m53k66j77m62q86q30r3P67J147J155J280J487
54426B01961J208K50p48j136r81o75k18M96J085J119R46J249J828J691N08p77
54410B07806j119n22L29R34J065N83k62p61m77J84N04K91j65n77o93k41O48J259
54392B08786J071N11L64P00R29Q37Q23J078J198Q03J08m01n60m92k53J89P00R56
$$ plain form
54374 217347 218139 218589 218945 219478 219936 219659 218413 216872 215979 215978 216400 216876 217489 218301 219001 219292 219358 219707 220656
54355 220656 222025 223218 223651 223318 222926 223158 223858 224286 224148 223928 224074 224393 224488 224365 224258 224230 224291 224617 225309
54336 225309 226204 227238 228714 230882 233556 236488 239839 243744 247707 251016 253666 256304 259286 262362
54322 262362 265337 268374 271372 273635 274595 274542 274153 273498 272023 269524 266626 264039 261589 258419 254152
54307 254152 249465 245301 241767 238226 234429 231022 228771 227630 226889 225954 224641 222945 221014 219279 218188
54292 218188 217704 217391 217051 216955 217335 217940 218319 218312 218068 217733 217407 217288 217595 218245 218798 218906 218709 218702 219165 219862
54272 219862 220348 220457 220385 220378 220523 220868 221542 222635 223990 225169 225656 225217 224243 223611 223924 224882 225665 225955 226226
54253 226226 226973 228033 228920 229448 229671 229551 229103 228693 228694 228900 228731 228017 227171 226525 225958 225291 224682 224377 224328
$$ packed form
54374B17347P92M50L56N33M58k77j246j541q93jM22M76O13Q12P00K91O6L49R49
54355B20656J369J193M33l33l92K32P00M28j38k20J46L19R5j23j07k8O1L26O92
54336B25309Q95J034J476K168K674K932L351L905L963L309K650K638K982L076
54322B62362K975L037K998K263R60n3l89o55j475k499k898k587k450l170m267
54307B54152m687m164l534l541l797l407k251j141p41r35j313j696j931j735j091
54292B18188m84l13l40r6L80O05L79pk44l35l26j19L07O50N53J08j97pM63O97
54272B19862M86J09p2pJ45L45O74J093J355J179M87m39r74o32L13R58P83K90K71
54253B26226P47J060Q87N28K23j20m48m10JK06j69p14q46o46n67o67o09l05m9
$$ plain form
54234 224328 224347 224437 224707 224985 224834 224072 223141 222797 223407 224689 226167 227739 229531 231309 232479 232842 232960
54217 232960 233477 234358 235182 235937 236952 238056 238375 237235 235009 232825 231607 231453 231703 231505 230478 229032
54201 229032 227927 227442 227123 226408 225310 224293 223649 223265 223013 223102 223795 224863 225610 225611 225214 225021 225003 224579 223685
54182 223685 223189 223926 225627 227264 228248 228791 229253 229635 229788 229678 229353 228981 228986 229821 231494 233529 235427 236881
54164 236881 237627 237513 236833 236196 235914 235754 235362 234661 233751 232724 231722 230866 230043 229032 227922 227082 226668
54147 226668 226491 226451 226650 226948 226925 226574 226552 227319 228407 228973 228843 228541 228458 228441 228145 227452 226562 225918 225951 226649
54127 226649 227439 227698 227276 226365 225119 223734 222720 222660 223664 225313 227148 229001 230930 233064 235459 237902
54111 237902 239872 240908 241021 240655 240363 240607 241612 243140 244550 245372 245705 245861 245829 245456 244954 244795 245123
$$ packed form
54234B24328J9R0K70K78j51p62r31l44O10J282J478J572J792J778J170L63J18
54217B32960N17Q81Q24P55J015J104L19j140k226k184j218j54K50j98j027j446
54201B29032j105m85l19p15j098j017o44l84k52Q9O93J068P47Jl97j93j8m24q94
54182B23685m96P37J701J637R84N43M62L82J53j10l25l72NQ35J673K035J898J454
54164B36881P46j14o80o37k82j60l92p01r10j027j002q56q23j011j110q40m14
54147B26668j77m0J99K98k3l51k2P67J088N66j30l02q3j7k96o93q90o44L3O98
54127B26649P90K59m22r11j246j385j014o0J004J649J835J853J929K134K395K443
54111B37902J970J036J13l66k92K44J005J528J410Q22L33J56l2l73n02j59L28
$$ plain form
54094 245123 245658 246120 246393 246325 245807 245154 245000 245652 246758 247665 247881 247169 245603 243695 242227 241755 242331 243643
54076 243643 245213 246505 247218 247564 248031 248817 249802 251045 252825 255019 256825 257429 256778 255481 254205 253351
54060 253351 253045 253144 253384 253712 254292 255066 255595 255662 255765 256592 258123 259660 260741 261654 262988 265043 267796
54043 267796 271164 275017 279076 283029 286838 290871 295640 301295 307357 313065 318116 323027 328641 335352
54029 335352 342906 350859 359018 367484 376532 386523 397787 410494 424724 440572 457954 476174 493974
54016 493974 510237 524667 537649 549449 559522 566426 568352 564069 553749 538949 521616 503069
54004 503069 483964 464904 446604 429414 413221 398067 384460 372728 362448 353067 344838 338469
53992 338469 333905 330131 326378 322816 319768 316930 313949 311217 309275 307763 305851 303634 302163 301869
$$ packed form
54094B45123N35M62K73o8n18o53j54O52J106R07K16p12j566j908j468m72N76J312
54076B43643J570J292P13L46M67P86R85J243J780K194J806O04o51j297j276q54
54060B53351l06R9K40L28N80P74N29O7J03Q27J531J537J081R13J334K055K753
54043B67796L368L853M059L953L809M033M769N655O062N708N051M911N614O711
54029C35352P554P953Q159Q466R048R991J1264J2707J4230J5848J7382J8220J7800
54016D93974J6263J4430J2982J1800J0073O904J926m283j0320j4800j7333j8547
54004E03069j9105j9060j8300j7190j6193j5154j3607j1732j0280r381q229o369
53992C38469m564l774l753l562l048k838k981k732j942j512j912k217j471k94
$$ plain form
53978 301869 301747 300565 298226 295504 292958 290743 289067 288060 287300 286108 284359 282594 281324 280673 280625
53963 280625 281069 281530 281422 280803 280467 281043 282325 283747 285096 286444 287703 288734 289775 291344 293675 296492
53947 296492 299267 301560 303249 304672 306432 308803 311433 313912 316490 319874 324359 329510 334660 339390
53933 339390 343523 347103 350470 353935 357252 359762 361236 362253 363586 365585 368381 372255 377336 383178
53919 383178 389018 394360 399176 403759 408608 414119 420064 425752 431033 436744 443598 451060 457982 464012
53905 464012 469532 474397 477827 479737 481157 482858 484373 484844 484129 482466 479709 475768 471350 467416 463979
53890 463979 460135 455238 449504 443492 437530 431756 426243 420984 415960 411214 406671 402087 397458 393214
53876 393214 389650 386476 383416 380910 379565 379108 378697 378223 378462 379842 381905 384272 387286 391194 395396
$$ packed form
53978C01869j22j182k339k722k546k215j676j007p60j192j749j765j270o51m8
53963B80625M44M61j08o19l36N76J282J422J349J348J259J031J041J569K331K817
53947B96492K775K293J689J423J760K371K630K479K578L384M485N151N150M730
53933C39390M133L580L367L465L317K510J474J017J333J999K796L874N081N842
53919C83178N840N342M816M583M849N511N945N688N281N711O854P462O922O030
53905D64012N520M865L430J910J420J701J515M71p15j663k757l941m418l934l437
53890D63979l844m897n734o012n962n774n513n259n024m746m543m584m629m244
53876C93214l564l174l060k506j345m57m11m74K39J380K063K367L014L908M202
$$ plain form
53861 395396 399192 402805 407013 412044 417513 423218 429449 436481 444263 452674 461826 472108 484079 498009
53847 498009 513143 527732 540370 551332 562065 573224 583475 590178 590867 584143 569923 549447
53835 549447 524935 498790 472916 448610 426758 407844 391883 378593 367660 358715 351139 344152
53823 344152 337304 330825 325284 320869 317239 314175 312088 311445 311865 312323 312405 312786 314053 315544 316032 315426
53807 315426 315076 316249 318850 321920 324965 328328 332386 336816 340886 344342 347827 352212 357526 362783
53793 362783 367088 370687 374566 379154 383897 388088 391566 394418 396556 398029 399325 400812 402038 402058 400441
53778 400441 397604 394225 390709 387192 383584 379528 374729 369542 364836 361006 357399 353043 347825 342618
53764 342618 338342 335228 332943 331057 329196 327008 324278 321130 317987 315287 313274 312014 311465 311481 311860
$$ packed form
53861C95396L796L613M208N031N469N705O231P032P782Q411R152J0282J1971J3930
53847D98009J5134J4589J2638J0962J0733J1159J0251O703O89o724j4220k0476
53835E49447k4512k6145k5874k4306k1852j8914j5961j3290j0933q945p576o987
53823C44152o848o479n541m415l630l064k087o43M20M58Q2L81J267J491M88o06
53807C15426l50J173K601L070L045L363M058M430M070L456L485M385N314N257
53793C62783M305L599L879M588M743M191L478K852K138J473J296J487J226K0j617
53778D00441k837l379l516l517l608m056m799n187m706l830l607m356n218n207
53764C42618m276l114k285j886j861k188k730l148l143k700k013j260n49J6L79
$$ plain form
53749 311860 312577 313911 316074 318646 320602 321165 320477 319169 317481 315308 313080 311871 312174 313051 313061 311848
53733 311848 310312 309347 309036 309088 309380 309831 310264 310709 311428 312279 312543 311861 311057 311446 313463 316439 319615 322804
53715 322804 325988 328896 331288 333343 335495 338066 341148 344606 348005 350780 352721 354176 355643 357329
53701 357329 359220 361361 363854 366722 369970 373654 377688 381693 385320 388619 391858 394991 397572 399276
53687 399276 400270 401049 402074 403616 405676 407861 409481 410069 409827 409364 408975 408324 406972 405033 403067 401362
53671 401362 399605 397382 394837 392634 391333 390986 391314 392037 392928 393642 393664 392545 390312 387656 385495 384182
53655 384182 383235 382070 380835 380209 380394 380734 380486 379659 378901 378806 379562 381007 382661 383826 384093 383800 383713 384190
53637 384190 384915 385550 386330 387771 389887 392026 393617 394895 396677 399375 402416 404804 406234 407422 409291
$$ packed form
53749C11860P17J334K163K572J956N63o88j308j688k173k228j209L03Q77J0j213
53733C11848j536r65l11N2K92M51M33M45P19Q51K64o82q04L89K017K976L176L189
53715C22804L184K908K392K055K152K571L082L458L399K775J941J455J467J686
53701C57329J891K141K493K868L248L684M034M005L627L299L239L133K581J704
53687C99276R94P79J025J542K060K185J620N88k42m63l89o51j352j939j966j705
53671D01362j757k223k545k203j301l47L28P23Q91P14K2j119k233k656k161j313
53655C84182r47j165j235o26J85L40k48q27p58r5P56J445J654J165K67k93q7M77
53637C84190P25O35P80J441K116K139J591J278J782K698L041K388J430J188J869
$$ plain form
53622 409291 412012 415034 417962 421090 425012 429840 434999 439744 443779 447387 451123 455432 460394 465624
53608 465624 470384 474058 476713 479168 482392 486819 492146 497550 501991 504715 505883 506626 508087 510353
53594 510353 512592 514144 515035 515473 515376 514671 513634 512606 511606 510495 509241 507781 505913 503640 501323
53579 501323 499208 497076 494799 492912 491969 491512 490367 488100 485536 483571 482033 480137 477773 475748 474810
53564 474810 474768 474732 474007 472702 471535 471147 471587 472401 473175 473954 475187 477298 480315 483923 487939 492678 498634
53547 498634 505736 513193 520264 526983 533847 540984 547988 554514 560677 566768 572872 578847 584477 589504
53533 589504 593654 596769 598966 600746 602970 606508 611622 617831 624643 632333 641682 652964 665597 678846
53519 678846 692605 707368 723666 741666 761074 781322 801980 823075 844946 867842 891841
$$ packed form
53622D09291K721L022K928L128L922M828N159M745M035L608L736M309M962N230
53608D65624M760L674K655K455L224M427N327N404M441K724J168P43J461K266
53594E10353K239J552Q91M38r7p05j037j028j000j111j254j460j868k273k317
53579E01323k115k132k277j887r43m57j145k267k564j965j538j896k364k025r38
53564D74810m2l6p25j305j167l88M40Q14P74P79J233K111L017L608M016M739N956
53547D98634P102P457P071O719O864P137P004O526O163O091O104N975N630N027
53533E89504M150L115K197J780K224L538N114O209O812P690R349J1282J2633J3249
53519F78846J3759J4763J6298J8000J9408K0248K0658K1095K1871K2896K3999
$$ plain form
53508 891841 917018 943360 970496 997896 1025348 1052871 1080146 1106555 1131999 1157140 1182447
53497 1182447 1207390 1231075 1253439 1275300 1297365 1319704 1342197 1364904 1387707 1410014 1431279
53486 1431279 1451784 1472514 1494070 1515900 1536855 1556365 1574763 1592494 1609461 1625432 1640621
53475 1640621 1655282 1668886 1680308 1688880 1694752 1698183 1699049 1697296 1693358 1687803 1680873 1672641 1663204
53462 1663204 1652311 1639168 1623153 1604615 1584661 1564226 1543605 1522690 1501339 1479563 1457563
53451 1457563 1435508 1413194 1390234 1366702 1343244 1320341 1297888 1275875 1254995 1236048 1219035
53440 1219035 1203366 1188763 1175456 1163744 1153974 1146674 1141915 1138619 1135360 1132014 1129912 1130124 1132261
53427 1132261 1135298 1138940 1143744 1150341 1159003 1169621 1181716 1194700 1208557 1224027 1241811 1261794
$$ packed form
53508H91841K5177K6342K7136K7400K7452K7523K7275K6409K5444K5141K5307
53497A182447K4943K3685K2364K1861K2065K2339K2493K2707K2803K2307K1265
53486A431279K0505K0730K1556K1830K0955J9510J8398J7731J6967J5971J5189
53475A640621J4661J3604J1422Q572N872L431Q66j753l938n555o930q232r437
53462A663204j0893j3143j6015j8538j9954k0435k0621k0915k1351k1776k2000
53451A457563k2055k2314k2960k3532k3458k2903k2453k2013k0880j8947j7013
53440A219035j5669j4603j3307j1712r770p300m759l296l259l346k102K12K137
53427A132261L037L642M804O597Q662J0618J2095J2984J3857J5470J7784J9983
$$ plain form
53415 1261794 1283377 1306304 1330757 1356822 1384378 1413528 1444696 1478152 1513675 1550831 1589416
53404 1589416 1629587 1671703 1716106 1762871 1811633 1861726 1912684 1964704 2018547 2074834 2133410
53393 2133410 2193476 2254308 2315630 2377283 2438851 2499838 2559953 2618954 2676473 2732364 2786953
53382 2786953 2840390 2891792 2939660 2983205 3022756 3058763 3090972 3118808 3141941 3160090 3172851
53371 3172851 3180173 3182571 3180299 3172755 3159344 3140551 3117290 3089227 3054697 3012613 2963894 2910696
53359 2910696 2854731 2796753 2737242 2676873 2616252 2555604 2494974 2434680 2375474 2318248 2263469
53348 2263469 2210848 2159616 2109235 2059820 2011788 1965186 1919603 1874823 1831311 1789802 1750465
53337 1750465 1712859 1676771 1642691 1611176 1582061 1554774 1529215 1505743 1484328 1464388 1445685
$$ packed form
53415A261794K1583K2927K4453K6065K7556K9150L1168L3456L5523L7156L8585
53404A589416M0171M2116M4403M6765M8762N0093N0958N2020N3843N6287N8576
53393B133410O0066O0832O1322O1653O1568O0987O0115N9001N7519N5891N4589
53382B786953N3437N1402M7868M3545L9551L6007L2209K7836K3133J8149J2761
53371C172851P322K398k272p544j3411j8793k3261k8063l4530m2084m8719n3198
53359B910696n5965n7978n9511o0369o0621o0648o0630o0294n9206n7226n4779
53348B263469n2621n1232n0381m9415m8032m6602m5583m4780m3512m1509l9337
53337A750465l7606l6088l4080l1515k9115k7287k5559k3472k1415j9940j8703
$$ plain form
53326 1445685 1428724 1413799 1400104 1386350 1372047 1357678 1343880 1330956 1319137 1308696 1299678
53315 1299678 1291893 1285223 1279640 1274999 1271252 1268908 1268667 1270406 1273001 1275563 1278534 1283215 1290459 1300222
53301 1300222 1312179 1326232 1342312 1360065 1379058 1399130 1420370 1442825 1466449 1491363 1517891
53290 1517891 1546078 1575267 1604459 1633285 1662411 1692652 1723636 1753494 1779987 1801983 1819917
53279 1819917 1834985 1847981 1858858 1867211 1872839 1875655 1875335 1871605 1864895 1856133 1845581 1832372 1815768
53266 1815768 1796507 1776208 1755477 1733326 1708591 1681325 1652473 1622726 1592192 1560920 1529174
53255 1529174 1497141 1464696 1431681 1398288 1364993 1332069 1299289 1266357 1233645 1202140 1172398
53244 1172398 1143906 1115880 1088387 1062021 1036624 1011187 985263 959726 935698 913322 892147
$$ packed form
53326A445685j6961j4925j3695j3754j4303j4369j3798j2924j1819j0441r018
53315A299678p785o670n583m641l747k344k41J739K595K562K971M681P244R763
53301A300222J1957J4053J6080J7753J8993K0072K1240K2455K3624K4914K6528
53290A517891K8187K9189K9192K8826K9126L0241L0984K9858K6493K1996J7934
53279A819917J5068J2996J0877Q353N628K816l20l730o710q762j0552j3209j6604
53266A815768j9261k0299k0731k2151k4735k7266k8852k9747l0534l1272l1746
53255A529174l2033l2445l3015l3393l3295l2924l2780l2932l2712l1505k9742
53244A172398k8492k8026k7493k6366k5397k5437k5924k5537k4028k2376k1175
$$ plain form
53233 892147 872250 854301 838679 825086 812879 801344 789810 778079 766747 756590 747495 738354
53221 738354 728094 716586 704490 692519 680956 669652 658306 646805 635316 624053 613122
53210 613122 602732 593252 584689 576320 567303 557678 548386 540219 533048 526139 518869 511032 502775 494460
53196 494460 486398 478610 470942 463459 456547 450570 445605 441476 437824 434192 430325 426475 423157 420555
53182 420555 418418 416523 414895 413460 411900 410028 408078 406449 405366 404907 405030 405413 405579 405386 405104 404826
53166 404826 404200 403121 402322 402743 404455 406641 408583 410209 411632 412666 413007 412671 411972 411162 410208 408983
53150 408983 407647 406736 406598 406684 405699 402764 398324 393705 389910 387084 384940 383233 381858 380797 380067 379506
53134 379506 378772 377839 377337 377850 378850 378913 377280 374748 372724 371772 371492 371534 372137 373613 375707 377632 378666
$$ packed form
53233H92147j9897j7949j5622j3593j2207j1535j1534j1731j1332j0157r095r141
53221G38354j0260j1508j2096j1971j1563j1304j1346j1501j1489j1263j0931
53210F13122j0390r480q563q369r017r625r292q167p171o909p270p837q257q315
53196D94460q062p788p668p483o912n977m965m129l652l632l867l850l318k602
53182D20555k137j895j628j435j560j872j950j629j083m59J23L83J66j93k82k78
53166D04826o26j079p99M21J712K186J942J626J423J034L41l36o99q10r54j225
53150D08983j336r11j38Q6r85k935m440m619l795k826k144j707j375j061p30n61
53134C79506p34r33n02N13J000O3j633k532k024r52k80M2O03J476K094J925J034
$$ plain form
53117 378666 378702 378396 378741 380258 382500 384437 385383 385496 385369 385372 385484 385628 385841 385956 385369 383505 380562 377492
53099 377492 375055 373182 371469 369978 369065 368538 367545 365485 362703 360132 358462 357701 357234 356312 354807 353490
53083 353490 353092 353074 352033 349581 347101 346037 346089 345943 345369 345490 346900 348564 349071 348314 347389 347188 347607
53066 347607 348033 348173 348364 349176 350754 352618 354262 355764 357478 359236 360387 360771 361093 362097 363783 365714
53050 365714 367637 369413 370743 371519 372165 373055 373763 373472 372154 370765 370136 370092 369794 368624 366531 363869
53034 363869 361169 358953 357478 356644 356101 355429 354376 353082 351931 350981 349733 347888 346166 345753 346820
53019 346820 348196 348767 348665 348627 348763 348628 348241 348206 348740 349277 349303 349067 349126 349547 349997 350390 350970 351791 352547 353044
52999 353044 353470 353969 354218 353806 352970 352540 353004 353940 354637 355045 355710 356785 357604 357522 356875 356655 357332 358430
$$ packed form
53117C78666L6l06L45J517K242J937R46J13j27LJ12J44K13J15n87j864k943l070
53099C77492k437j873j713j491r13n27r93k060k782k571j670p61m67r22j505j317
53083C53490l98j8j041k452k480j064N2j46n74J21J410J664N07p57r25k01M19
53066C47607M26J40J91Q12J578J864J644J502J714J758J151L84L22J004J686J931
53050C65714J923J776J330P76O46Q90P08k91j318j389o29m4k98j170k093k662
53034C63869k700k216j475q34n43o72j053j294j151r50j248j845j722m13J067
53019C46820J376N71j02l8J36j35l87l5N34N37K6k36N9M21M50L93N80Q21P56M97
52999C53044M26M99K49m12q36m30M64R36O97M08O65J075Q19q2o47k20O77J098
$$ plain form
52981 358430 359335 360098 361116 362331 363235 363678 364260 365646 367788 370076 372116 373944 375548 376589 376867 376789
52965 376789 377100 378223 380007 381971 383640 384775 385529 386261 387050 387559 387630 387757 388468 389386 389457 388135 385854
52948 385854 383264 380692 378546 377452 377347 377006 375259 372467 370031 368603 367571 366298 365017 364161 363522
52933 363522 362639 361600 360913 360709 360498 359665 358003 355857 353951 352930 352804 352876 352379 351178 349831 349067 349311
52916 349311 350448 351916 353117 353860 354294 354459 354290 354135 354698 356022 356989 356546 355226 354668 355514 356585 356496
52899 356496 355431 354670 354766 354988 354578 353818 353530 353929 354469 354659 354605 354717 355205 356042 357159 358414 359454 359857
52881 359857 359484 358534 357237 355718 354262 353487 353952 355517 357254 358174 358100 357875 358640 360897 364236 367967
52865 367967 371823 375884 379959 383507 386263 388630 391119 393597 395401 396133 396036 395591 394985 394074 392649 390636
$$ packed form
52981C58430R05P63J018J215R04M43N82J386K142K288K040J828J604J041K78p8
52965C76789L11J123J784J964J669J135P54P32P89N09P1J27P11R18P1j322k281
52948C85854k590k572k146j094j05l41j747k792k436j428j032j273j281q56o39
52933C63522q83j039o87k04k11q33j662k146j906j021j26P2m97j201j347p64K44
52916C49311J137J468J201P43M34J65j69j55N63J324R67m43j320n58Q46J071q9
52899C56496j065p61R6K22m10p60k88L99N40J90n4J12M88Q37J117J255J040M03
52881C59857l73r50j297j519j456p75M65J565J737R20p4k25P65K257L339L731
52865C67967L856M061M075L548K756K367K489K478J804P32r7m45o06r11j425k013
$$ plain form
52849 390636 388073 384981 381323 377194 373027 369328 366044 362522 358410 354351 351299 349283 347413 345133
52835 345133 342833 341009 339465 337816 336336 335668 335859 336251 336325 336216 336284 336591 336929 337031 336587 335356 333560
52818 333560 332057 331792 332973 334889 336595 337756 338785 340232 342210 344507 347071 350066 353436 356694
52804 356694 359369 361491 363441 365453 367381 368806 369235 368392 366550 364423 362450 360373 357851 355268 353437
52789 353437 352513 351719 350300 348282 346141 344142 342328 340784 339601 338761 338303 338330 338618 338620 338234 338228 339371 341375
52771 341375 343287 344809 346552 348908 351349 353120 354122 354763 355341 355919 356506 356906 356651 355513 354006 352958
52755 352958 352646 352708 352861 353285 354140 355070 355463 355147 354627 354570 355073 355520 355276 354442 353723 353486 353301 352715 352108
52736 352108 352339 353646 355397 356974 358348 359658 360751 361488 362111 362806 363112 362266 360168 357689 355953 355503
$$ packed form
52849C90636k563l092l658m129m167l699l284l522m112m059l052k016j870k280
52835C45133k300j824j544j649j480o68J91L92P4j09O8L07L38J02m44j231j796
52818C33560j503k65J181J916J706J161J029J447J978K297K564K995L370L258
52804C56694K675K122J950K012J928J425M29q43j842k127j973k077k522k583j831
52789C53437r24p94j419k018k141j999j814j544j183q40m58K7K88Kl86oJ143K004
52771C41375J912J522J743K356K441J771J002O41N78N78N87M00k55j138j507j048
52755C52958l12O2J53M24Q55R30L93l16n20n7N03M47k44q34p19k37j85n86o07
52736C52108K31J307J751J577J374J310J093P37O23O95L06q46k098k479j736m50
$$ plain form
52720 355503 356120 357192 358145 358707 358857 358592 357823 356635 355482 354884 354899 355069 354901 354264 353318 352270 351268
52703 351268 350400 349727 349301 349172 349276 349396 349341 349126 348856 348482 347894 347301 347256 348107 349565 350975 352006 352943
52685 352943 354270 356070 357924 359359 360264 360825 361177 361348 361494 361892 362564 363220 363788 364706 366316 368177 369425
52668 369425 369837 370077 370786 371806 372446 372235 371238 369914 368853 368456 368643 369022 369422 370106 371356 373062 374819
52651 374819 376157 376673 376296 375587 375403 376030 376997 377953 379111 380429 380952 379827 377710 376270 376271 376941 377377
52634 377377 377727 378640 380234 382204 384442 386937 389348 391241 392673 394045 395499 396901 398270 399692 400762
52619 400762 400670 399048 396404 393489 390604 387756 385210 383414 382438 381839 381164 380331 379470 378644 377889 377302 376855
52602 376855 376225 375137 373891 373283 373818 375169 376585 377692 378668 379754 380944 382222 383723 385365 386542
$$ packed form
52720C55503O17J072R53N62J50k65p69j188j153n98J5J70j68o37r46j048j002
52703C51268q68o73m26j29J04J20n5k15k70l74n88n93m5Q51J458J410J031R37
52685C52943J327J800J854J435R05N61L52J71J46L98O72O56N68R18J610J861J248
52668C69425M12K40P09J020O40k11r97j324j061l97J87L79M00O84J250J706J757
52651C74819J338N16l77p09j84O27R67R56J158J318N23j125k117j440JO70M36
52634C77377L50R13J594J970K238K495K411J893J432J372J454J402J369J422J070
52619D00762r2j622k644k915k885k848k546j796r76n99o75q33q61q26p55n87m47
52602C76855o30j088j246o08N35J351J416J107R76J086J190J278J501J642J177
$$ plain form
52587 386542 386610 385701 384768 384618 385179 385943 386916 388619 391099 393494 394983 395861 397088 398892 400475 401261 401746
52570 401746 402700 404009 404979 405476 406082 407093 408065 408495 408369 407782 406532 404477 401981 399625 397664 396111
52554 396111 395069 394646 394626 394574 394161 393213 391691 389985 388950 389081 389732 389733 388828 387970 388018 388699 389203 389325 389461
52535 389461 389737 389789 389466 389246 389692 390694 391551 391689 391185 390575 390310 390514 391192 392480 394488 396999 399592
52518 399592 402081 404634 407356 410057 412692 415762 419875 424898 429910 434066 437171 439344 440541 440742
52504 440742 440333 439796 439036 437398 434517 430854 427225 423937 420616 416859 412851 409294 406827 405595 405342
52489 405342 405778 406770 408173 409609 410488 410263 408708 406118 403285 401119 400074 399944 400316 401067 402316 404043
52473 404043 406078 408428 411226 414370 417540 420728 424369 428729 433480 438091 442348 446156 449162 451028
$$ packed form
52587C86542O8r09r33j50N61P64R73J703K480K395J489Q78J227J804J583P86M85
52570D01746R54J309R70M97O06J011R72M30j26n87j250k055k496k356j961j553
52554C96111j042m23k0n2m13r48j522j706j035J31O51Jr05q58M8O81N04J22J36
52535C89461K76N2l23k20M46J002Q57J38n04o10k65K04O78J288K008K511K593
52518C99592K489K553K722K701K635L070M113N023N012M156L105K173J197K01
52504D40742m09n37p60j638k881l663l629l288l321l757m008l557k467j232k53
52489D05342M36R92J403J436Q79k25j555k590k833k166j045j30L72P51J249J727
52473D04043K035K350K798L144L170L188L641M360M751M611M257L808L006J866
$$ plain form
52459 451028 451904 452190 451909 450796 448938 446747 444213 440719 435907 430346 425064 420701 417339 414819 412833
52444 412833 410893 408646 406223 404092 402586 401688 401153 400661 399983 399138 398296 397380 396000 394046 392133 391108
52428 391108 391188 391822 392317 392276 391600 390502 389588 389452 389985 390362 389974 389203 389088 390343 392855 396003 399258 402541
52410 402541 406188 410631 416090 422588 430238 439349 450143 462403 475482 488626 501255 513036 523757
52397 523757 533107 540508 545203 546579 544395 538738 529952 518810 506675 495183 485404 477312 470207
52384 470207 463708 458119 453771 450336 447251 444692 443574 444382 446413 448576 450634 453245 456910 461382
52370 461382 466060 470546 474706 478518 481974 484909 486909 487638 487249 486180 484597 482491 480291 478834 478491
52355 478491 478824 479320 479947 480662 480981 480683 480459 481133 482427 483302 483431 483510 484065 484812 485548 486863 489341 492546
$$ packed form
52459D51028Q76K86k81j113j858k191k534l494m812n561n282m363l362k520j986
52444D12833j940k247k423k131j506q98n35m92o78q45q42r16j380j954j913j025
52428C91108Q0O34M95m1o76j098r14j36N33L77l88p71j15J255K512L148L255L283
52410D02541L647M443N459O498P650R111J0794J2260J3079J3144J2629J1781J0721
52397E23757R350P401M695J376k184n657q786j1142j2135j1492r779q092p105
52384D70207o499n589m348l435l085k559j118Q08K031K163K058K611L665M472
52370D61382M678M486M160L812L456K935K000P29l89j069j583k106k200j457l43
52355D78491L33M96O27P15L19k98k24O74J294Q75J29P9N55P47P36J315K478L205
$$ plain form
52337 492546 495503 497965 500668 504475 509796 516727 525143 534502 544073 553609 563520 574231 585616 597314
52323 597314 609277 621738 634711 647846 660795 673525 686212 699003 711960 725189 738871
52312 738871 753130 767845 782618 797038 811126 825552 841286 858905 878240 898678 919704
52301 919704 940989 962081 982385 1001603 1019945 1037547 1053821 1067812 1079226 1088671 1096608 1102469
52289 1102469 1105354 1105502 1104487 1103797 1103589 1103043 1101558 1099187 1096113 1092285 1087766 1083092 1078957 1075580 1072587
52274 1072587 1069576 1066706 1064661 1064057 1064925 1066806 1069292 1072364 1076170 1080635 1085526 1090927 1097434 1105695
52260 1105695 1115801 1127281 1139659 1152833 1166935 1181974 1197763 1214023 1230399 1246467 1261897
52249 1261897 1276592 1290460 1303053 1313723 1322214 1328869 1334099 1337915 1340214 1341272 1341515 1340913 1339027
$$ packed form
52337D92546K957K462K703L807N321O931Q416R359R571R536R911J0711J1385J1698
52323E97314J1963J2461J2973J3135J2949J2730J2687J2791J2957J3229J3682
52312G38871J4259J4715J4773J4420J4088J4426J5734J7619J9335K0438K1026
52301I19704K1285K1092K0304J9218J8342J7602J6274J3991J1414R445P937N861
52289A102469K885J48j015o90k08n46j485k371l074l828m519m674m135l377k993
52274A072587l011k870k045o04Q68J881K486L072L806M465M891N401O507Q261
52260A105695J0106J1480J2378J3174J4102J5039J5789J6260J6376J6068J5430
52249A261897J4695J3868J2593J0670Q491O655N230L816K299J058K43o02j886
$$ plain form
52236 1339027 1335743 1331522 1326820 1321708 1316291 1310995 1305960 1300406 1293229 1284268 1274539 1265121 1256224 1247523
52222 1247523 1239004 1231061 1223813 1216747 1209243 1201418 1194251 1188747 1185053 1182538 1180729 1179837 1180234 1181727
52208 1181727 1183708 1185866 1188376 1191455 1195117 1199373 1204279 1209648 1215076 1220442 1226121 1232529 1239610 1246896
52194 1246896 1253882 1260299 1266298 1272544 1279806 1288236 1297203 1305895 1313820 1320600 1325726 1328843 1330019 1329386
52180 1329386 1326829 1322458 1317050 1311384 1305199 1297459 1287805 1277273 1267360 1258742 1251171 1244274 1238066 1232844
52166 1232844 1228933 1226610 1225970 1226745 1228333 1230249 1232590 1235918 1240499 1245675 1250226 1253429 1255538 1257172
52152 1257172 1258506 1259295 1259514 1259661 1260443 1262320 1265223 1268558 1271671 1274445 1277274 1280272 1282862 1284530 1285628
52137 1285628 1286954 1288721 1290479 1291877 1292856 1293171 1292555 1291578 1291701 1294116 1298946 1305754 1314290 1324442 1336085
$$ packed form
52236A339027l284m221m702n112n417n296n035n554p177q961r729r418q897q701
52222A247523q519p943p248p066p504p825p167n504l694k515j809q92L97J493
52208A181727J981K158K510L079L662M256M906N369N428N366N679O408P081P286
52194A246896O986O417N999O246P262Q430Q967Q692P925O780N126L117J176o33
52180A329386k557m371n408n666o185p740r654j0532r913q618p571o897o208n222
52166A232844l911k323o40P75J588J916K341L328M581N176M551L203K109J634
52152A257172J334P89K19J47P82J877K903L335L113K774K829K998K590J668J098
52137A285628J326J767J758J398R79L15o16r77J23K415M830O808Q536J0152J1643
$$ plain form
52122 1336085 1349434 1365115 1383371 1403518 1424618 1446340 1468674 1491192 1513232 1534633 1555611
52111 1555611 1576017 1595388 1613766 1631822 1649970 1667920 1685400 1702837 1720892 1739600 1758418
52100 1758418 1777067 1795938 1815560 1835847 1855952 1874754 1891319 1904969 1915187 1921743 1924853 1924914
$$ packed form
52122A336085J3349J5681J8256K0147K1100K1722K2334K2518K2040K1401K0978
52111A555611K0406J9371J8378J8056J8148J7950J7480J7437J8055J8708J8818
52100A758418J8649J8871J9622K0287K0105J8802J6565J3650J0218O556L110O1
$$ [...]
##END NTUPLES=NMR SPECTRUM
##END=
