##TITLE=AC1522_ROEFFECT0005_8202157_LwNfmbabSr
##JCAMPDX= 6.0         $$ Bruker NMR JCAMP-DX V2.0
##DATA TYPE= NMR SPECTRUM
##DATA CLASS= NTUPLES
##ORIGIN= BRUKER
##OWNER= Administrator
$$ 1.72 TOPSPIN		Version 2.1
$$ 2013-09-26 22:13:22.454 -0700  Administrator@X
$$ Compression mode = diff/dup
##.OBSERVE FREQUENCY= 400.02188249412
##.OBSERVE NUCLEUS= ^1H
##.ACQUISITION MODE= SIMULTANEOUS (DQD)
##.ACQUISITION SCHEME= undefined
##.AVERAGES= 8
##.DIGITISER RES= 22
##SPECTROMETER/DATA SYSTEM= spect
##.PULSE SEQUENCE= zg30
##.SOLVENT NAME= COFFEE_meoh
##.SHIFT REFERENCE= INTERNAL, COFFEE_meoh, 1, 14.98509
##AUDIT TRAIL= $$ (NUMBER, WHEN, WHO, WHERE, PROCESS, VERSION, WHAT)
$$ ##TITLE= Audit trail, TOPSPIN		Version 2.1
$$ ##JCAMPDX= 5.01
$$ ##ORIGIN= Bruker BioSpin GmbH
$$ ##OWNER= Administrator
$$ $$ E:\/data/COFFEE/nmr/AC1522_ROEFFECT0005_8202157_LwNfmbabSr/10/pdata/1/auditp.txt
$$ ##AUDIT TRAIL=  $$ (NUMBER, WHEN, WHO, WHERE, PROCESS, VERSION, WHAT)
(   1,<2013-09-26 22:13:15.454 -0700>,<Administrator>,<X>,<go>,<TOPSPIN 2.1>,
      <created by zg
	started at 2013-09-26 22:12:09.157 -0700,
	POWCHK enabled, PULCHK disabled,
       configuration hash MD5:
       C8 4E 4E 5D D3 5C D8 9E 9F 52 82 E0 59 8A DE 15
       data hash MD5: 64K
       49 95 B0 81 E5 6C 8A A6 04 8E 91 6E CA 7F 52 27>)
(   2,<2013-09-26 22:13:18.360 -0700>,<Administrator>,<X>,<proc1d>,<TOPSPIN 2.1>,
      <Start of raw data processing
       efp LB = 0 FT_mod = 6 PKNL = 1 PHC0 = 0 PHC1 = 0 SI = 32K 
       data hash MD5: 32K
       C6 80 CF 8A 1E EF E4 1F 77 75 44 B1 CD EB C7 56>)
(   3,<2013-09-26 22:13:18.657 -0700>,<Administrator>,<X>,<proc1d>,<TOPSPIN 2.1>,
      <pk PHC0 = 93.41675 PHC1 = 0 
       data hash MD5: 32K
       EE 35 E3 08 0E B5 4E 2C ED 18 3F CC F1 7C 71 36>)
(   4,<2013-09-26 22:13:18.813 -0700>,<Administrator>,<X>,<proc1d>,<TOPSPIN 2.1>,
      <abs ABSG = 1 
       data hash MD5: 32K
       9D 38 49 FC 54 CD 5B 59 48 5C 22 65 C6 12 3D 75>)
(   5,<2013-09-26 22:13:18.969 -0700>,<Administrator>,<X>,<proc1d>,<TOPSPIN 2.1>,
      <abs ABSG = 2 
       data hash MD5: 32K
       79 03 21 56 D6 00 69 6F 07 BF C4 1A 80 C9 6E AB>)
(   6,<2013-09-26 22:13:19.047 -0700>,<Administrator>,<X>,<proc1d>,<TOPSPIN 2.1>,
      <abs ABSG = 3 
       data hash MD5: 32K
       3B BC A3 26 16 AF 8C 20 64 A6 EE 7A 1C E6 59 CC>)
(   7,<2013-09-26 22:13:19.110 -0700>,<Administrator>,<X>,<proc1d>,<TOPSPIN 2.1>,
      <abs ABSG = 4 
       data hash MD5: 32K
       0E 04 51 AF 83 D9 A9 A9 C3 FF 5D 67 F4 A7 16 76>)
(   8,<2013-09-26 22:13:19.157 -0700>,<Administrator>,<X>,<proc1d>,<TOPSPIN 2.1>,
      <abs ABSG = 5 
       data hash MD5: 32K
       0C 4F 2E 7D C2 92 60 CE BD B4 FF ED 91 D6 E9 C1>)
$$ ##END=
$$ 
$$ $$ hash MD5
$$ $$ 3F C9 1C D8 35 BE FC A8 FF D9 A4 D5 BB 88 B2 6F
##$RELAX= 
##$RELAX= 
##$RELAX= 
##$RELAX= 
##$RELAX= 
##$RELAX= 
##$RELAX= 
$$ Bruker specific parameters
$$ --------------------------
##$DU= <E:\>
##$EXPNO= 10
$$ [...]
150 150 150 150 150 150 150 150
##$TP07= 0
##$TPNAME0= <>
##$TPNAME1= <>
##$TPNAME2= <>
##$TPNAME3= <>
##$TPNAME4= <>
##$TPNAME5= <>
##$TPNAME6= <>
##$TPNAME7= <>
##$TPOAL= (0..7)
0.5 0.5 0.5 0.5 0.5 0.5 0.5 0.5
##$TPOFFS= (0..7)
0 0 0 0 0 0 0 0
##$TUNHIN= 0
##$TUNHOUT= 0
##$TUNXOUT= 0
##$USERA1= <user>
##$USERA2= <user>
##$USERA3= <user>
##$USERA4= <user>
##$USERA5= <user>
##$V9= 5
##$VALIST= <valist>
##$VCLIST= <CCCCCCCCCCCCCCC>
##$VD= 0
##$VDLIST= <DDDDDDDDDDDDDDD>
##$VPLIST= <PPPPPPPPPPPPPPP>
##$VTLIST= <TTTTTTTTTTTTTTT>
##$WBST= 1024
##$WBSW= 4
##$XGAIN= (0..3)
0 0 0 0
##$XL= 0
##$YL= 0
##$YMAX_a= 662142
##$YMIN_a= -562414
##$ZGOPTNS= <>
##$ZL1= 120
##$ZL2= 120
##$ZL3= 120
##$ZL4= 120
##$ABSF1= 14.98509
##$ABSF2= -5.573092
##$ABSG= 5
##$ABSL= 3
##$ALPHA= 0
##$AQORDER= 0
##$ASSFAC= 0
##$ASSFACI= 0
##$ASSFACX= 0
##$ASSWID= 0
##$AUNMP= <proc_prof1d_extract_pilot.lims>
##$AXLEFT= 0
##$AXNAME= <>
##$AXNUC= <1H>
##$AXRIGHT= 0
##$AXTYPE= 0
##$AXUNIT= <>
##$AZFE= 0.1
##$AZFW= 0.1
##$BCFW= 0
##$BC_mod= 0
##$BYTORDP= 0
##$COROFFS= 0
##$CY= 15
##$DATMOD= 1
##$DC= 0
##$DFILT= <>
##$DTYPP= 0
##$F1P= 0
##$F2P= 0
##$FCOR= 0.5
##$FTSIZE= 32768
##$FT_mod= 6
##$GAMMA= 0
##$GB= 0
##$INTBC= 1
##$INTSCL= 1
##$ISEN= 128
##$LB= 0
##$LEV0= 0
##$LPBIN= 0
##$MAXI= 10000
##$MC2= 0
##$MEAN= 0
##$ME_mod= 0
##$MI= 0
##$NCOEF= 0
##$NC_proc= -8
##$NLEV= 6
##$NOISF1= 0
##$NOISF2= 0
##$NSP= 0
##$NTH_PI= 0
##$NZP= 0
##$OFFSET= 14.98509
##$PC= 1
##$PHC0= 93.41675
##$PHC1= 0
##$PH_mod= 1
##$PKNL= yes
##$PPARMOD= 0
##$PPDIAG= 0
##$PPIPTYP= 0
##$PPMPNUM= 2147483647
##$PPRESOL= 1
##$PSCAL= 4
##$PSIGN= 0
##$PYNMP= <proc.py>
##$REVERSE= no
##$SF= 400.02
##$SI= 32768
##$SIGF1= 0
##$SIGF2= 0
##$SINO= 400
##$SIOLD= 32768
##$SPECTYP= <>
##$SREGLST= <1H.CDCl3>
##$SSB= 0
##$STSI= 32768
##$STSR= 0
##$SW_p= 8223.68421052631
##$SYMM= 0
##$S_DEV= 0
##$TDeff= 65536
##$TDoff= 0
##$TI= <>
##$TILT= no
##$TM1= 0
##$TM2= 0
##$TOPLEV= 0
##$USERP1= <user>
##$USERP2= <user>
##$USERP3= <user>
##$USERP4= <user>
##$USERP5= <user>
##$WDW= 1
##$XDIM= 32768
##$YMAX_p= 487099611
##$YMIN_p= -688497
##$CURPLOT= <Network HP LaserJet P1505>
##$CURPRIN= <$Network HP LaserJet P1505>
##$DFORMAT= <normdp>
##$LAYOUT= <+/1D_H.xwp>
##$LFORMAT= <normlp>
##$PFORMAT= <normpl>
##$SURQMSG= 1
$$ End of Bruker specific parameters
$$ ---------------------------------
##NTUPLES= NMR SPECTRUM
##VAR_NAME=  FREQUENCY,     SPECTRUM/REAL,   SPECTRUM/IMAG
##SYMBOL=    X,             R,               I
##VAR_TYPE=  INDEPENDENT,   DEPENDENT,       DEPENDENT
##VAR_FORM=  AFFN,          ASDF,            ASDF
##VAR_DIM=   32768,         32768,           32768
##UNITS=     HZ,            ARBITRARY UNITS, ARBITRARY UNITS
##FACTOR=    0.250966925370066, 1,           1
##FIRST=     8223.43324360094, -131324,      -22381
##LAST=      0,             -27804,          -210641
##MIN=       0,             -688497,         0
##MAX=       8223.43324360094, 487099611,    0
$$ Real data points
##PAGE= N=1
##DATA TABLE= (X++(R..R)), XYDATA
$$ [...]
19539b75289j09008A68509f350H0423l7860a59282D542g5730A9474J53166K34782
$$ -275289 -384297 168509 -6350 80423 42563 -159282 4542 -75730 19474 172640 407422
19528D07422d86C3126J47518o3603C6943J1358J89657c20457R7402Q2739o4586
$$ 407422 -486 33126 180644 117041 36943 48301 237958 -320457 -223055 -140316 -204902
19517b04902A30555b51648G0783a56487P5965A70964b27907R8573K1091l4872
$$ -204902 130555 -251648 70783 -156487 -80522 170964 -227907 -129334 -108243 -143115
19507a43115A5868J15124P906a16526M5609m5151k15605G3903c5933p7051A25010
$$ -143115 15868 130992 138898 -116526 -70917 -116068 -331673 73903 -35933 -112984 125010
19495A44821b68690K342F4174a87115I994J16311K27867A50102a35694c9206n405
$$ 144821 -268690 -266348 64174 -187115 9994 126305 354172 150102 -135694 -39206 -44611
19484d4611A46643A4875c67992M3511J40074q1055f0956b8096H6166J5362a78608
$$ -44611 146643 14875 -367992 -324481 -184407 -265462 -60956 -28096 86166 101528 -178608
19472g0364B17872i0010b6974k83I9552k5061K01738a7362C9497i6908k23888
$$ -70364 217872 -90010 -26974 -27257 99552 74491 276229 -17362 39497 -96908 -320796
19461c20796o3124F98c85568A23994b57531d8626j5565K8161C6400H121a20556
$$ -320796 -383920 698 -385568 123994 -257531 -48626 -64191 -36030 36400 8121 -120556
19449d37905C64276a75085k80463A20677P3778d3021o090j87194R6968M6611k42440
$$ -437905 364276 -175085 -455548 120677 194455 -43021 -49111 -236305 -139337 -92726 -335166
19438c35166M4093c448B93806a12607j669m5907n0097D8931b59178M2258N8367
$$ -335166 -291073 -3448 293806 -112607 -114276 -160183 -210280 48931 -259178 -216920 -158553
19427a58553b2076g383C4887g0548q413k68048D339K6722a90520j38775a2477
$$ -158553 -22076 -7383 34887 -70548 -78961 -347009 4339 31061 -190520 -329295 -12477
19415d58668A56604a53469P6719A13362b1403A45229O3560c46717a5610B9191
$$ -458668 156604 -153469 -76750 113362 -21403 145229 208789 -346717 -15610 29191
19404i9875G159a88n9317m5254l00154J72787A9855b17988f0660p336B38122A556
$$ -99875 7159 -188 -59505 -104759 -404913 -232126 19855 -217988 -60660 -67996 238122 1556
19391B15087i6254A02805J27525j12970h2055l5982A84920h7255j65121B98225
$$ 215087 -96254 102805 230330 117360 -82055 -118037 184920 -87255 -252376 298225
19380H5462b768k42383A09520b77728R3162K6821b6723j96278k14357a03743A70131
$$ 85462 -2768 -245151 109520 -277728 -184566 -157745 -26723 -223001 -437358 -103743 170131
19368b65357J1156J05842N8725I1341a14007j47799E7690a43729A54877p3669
$$ -265357 -254201 -148359 -89634 91341 -114007 -261806 57690 -143729 154877 81208
19358H1208l7304L9723a37019A76351a46959P0871n8627j51816C8946J35743a25589
$$ 81208 43904 83627 -137019 176351 -146959 -76088 -134715 -286531 38946 174689 -125589
19346A2470J60303a33019K6797F5103B2241b9414A53514b78149A96076g1387n8314
$$ 12470 172773 -133019 -106222 65103 22241 -29414 153514 -278149 196076 -71387 -129701
19335a29701e073F1149i6028E8610b93359A23566c04796A19976B4429K49716d419
$$ -129701 -5073 61149 -96028 58610 -293359 123566 -304796 119976 24429 274145 -4419
19323f8362A03745a98096f4119m3781n2727n165j85483A60861E9677C011O1376
$$ -68362 103745 -198096 -64119 -107900 -160627 -165792 -351275 160861 59677 3011 64387
19312F4387b07164r0919J15944k0453E2547a64478C01412i3742k98354j1203J10599
$$ 64387 -207164 -298083 -182139 -202592 52547 -164478 301412 -93742 -392096 -403299 -292700
19301b92700q6722b4263I4926N0400a37107A63394a06062n2426P3796D3286b31522
$$ -292700 -379422 -24263 94926 145326 -137107 163394 -106062 -158488 -84692 43286 -231522
19289e315A3298c932F2164K86221B4712L18866a6051j6765j34919K2023B49551
$$ -5315 13298 -3932 62164 348385 24712 343578 -16051 -32816 -167735 -145712 249551
19277B71444b11079A28150P4805q408n8096A2286J55137e2064K0142o6263r5247
$$ 271444 -211079 128150 202955 194547 136451 12286 167423 -52064 -31922 -98185 -193432
19266a93432g7388m5643J5443j54090k1094N8748I6195l5504c70843k5637a21987
$$ -193432 -77388 -123031 -107588 -261678 -282772 -224024 96195 60691 -370843 -396480 -121987
19254A45634b42568B97312d8730a6803B5599a12104K8701l74393B60476A9115
$$ 145634 -242568 297312 -48730 -16803 25599 -112104 -83403 -457796 260476 19115
19243a44277E6764a0215C14649a3158C1708d35897A99334c12285h2998k15490
$$ -144277 56764 -10215 314649 -13158 31708 -435897 199334 -312285 -82998 -298488
19233b98488J40320k14682B3993P9175A3676J30250l1203C0784J44154m9198a18589
$$ -298488 -158168 -372850 23993 103168 13676 143926 112723 30784 174938 125740 -118589
19221a56126j08551A03100i5486j58311A51717a17478b2124k79424d1980j26223
$$ -156126 -264677 103100 -95486 -253797 151717 -117478 -22124 -301548 -41980 -168203
19211a68203e9910A24864b76689A71394q0242c28979f3370n3630j8243d5059j47291
$$ -168203 -59910 124864 -276689 171394 91152 -328979 -63370 -117000 -135243 -45059 -192350
19200a92350A39367c29391R4455K6951G0003a16503L5727m0604e9699m7052l01333
$$ -192350 139367 -329391 -234936 -207985 70003 -116503 -80776 -121380 -59699 -106751 -408084
19189d08084J52254l2294B1862J241b44773l2753Q6281n8862e821f43j66053J6155
$$ -408084 -255830 -288124 21862 23103 -244773 -277526 -191245 -250107 -5821 -643 -166696 -150541
19177a50541q8807Q9001l47885h9512a8269j30303d9968A06559d3643A40356Q2025
$$ -150541 -239348 -150347 -498232 -89512 -18269 -148572 -49968 106559 -43643 140356 222381
19166B22381a23065C0929J5669i7541A42712J20382I0397h3663h166j15766M8175
$$ 222381 -123065 30929 46598 -97541 142712 263094 90397 -83663 -8166 -123932 -75757
19155g5757p8204q1425H4215D1961a9873A63002d2613I6405h0298l9996J3278
$$ -75757 -153961 -235386 84215 41961 -19873 163002 -42613 96405 -80298 -120294 -107016
19144a07016j41148a9264l35036I0342b05201F7992K33985a89598K2890A36278
$$ -107016 -248164 -19264 -354300 90342 -205201 67992 301977 -189598 -166708 136278
19133b3426J1169B23871H136J1812a16024J5834K0170B82426b83818a04898A31805
$$ -23426 -12257 223871 8136 19948 -116024 -100190 -80020 282426 -283818 -104898 131805
19121a51085e443k3787k57768A18241C2987a43720j66126M4625B56556a62298
$$ -151085 -5443 -29230 -286998 118241 32987 -143720 -309846 -265221 256556 -162298
19110a44296k10230A26077B969c14638A50050L631b64442A36012J57424a68396
$$ -144296 -354526 126077 2969 -314638 150050 153681 -264442 136012 293436 -168396
19099H0856a45439A12906L914b74120B42896c16342c5314A12872M2132A0817K1196
$$ 80856 -145439 112906 116820 -274120 242896 -316342 -35314 112872 155004 10817 32013
19088C2013g1359b6109l6213G3116b85871L6229F9381i9197k54268A46434R4420
$$ 32013 -71359 -26109 -62322 73116 -285871 -249642 69381 -99197 -353465 146434 240854
19077B40854h4566I8915d5453j5481D8482B2787b46943c0776A0632P377Q0344
$$ 240854 -84566 98915 -45453 -60934 48482 22787 -246943 -30776 10632 18009 98353
19066I8353B2325n246d3493q6735E6406b10020J1866P1485o2631a3450j08911
$$ 98353 22325 17079 -43493 -130228 56406 -210020 -198154 -126669 -189300 -13450 -122361
19055a22361A28322b66975C35881a25251A21263h413j14686l08558a60271o5824
$$ -122361 128322 -266975 335881 -125251 121263 -8413 -123099 -431657 -160271 -226095
19045b26095R2817N9480j041A15541f6388l8992C33072A12528a26103a5062p7676
$$ -226095 -133278 -73798 -74839 115541 -66388 -105380 333072 112528 -126103 -15062 -92738
19034i2738E0251d85984a12165A16424J56194D1262b72260I753b9835m2962A60243
$$ -92738 50251 -485984 -112165 116424 272618 41262 -272260 9753 -29835 -72797 160243
19022a63223B31176B6033K42311a35567D980g6780A33452j6022d78725a94659
$$ -163223 231176 26033 268344 -135567 4980 -76780 133452 117430 -478725 -194659
19011b647k21087i4024m3344F2552f1414A32e0612H6611K4843a00870K3046o47
$$ -2647 -223734 -94024 -137368 62552 -61414 132 -50612 86611 111454 -100870 -77824 -78471
18999g8471I112a27619M9103b8411o4063k73165B48959d92068a31611B740a71449
$$ -78471 9112 -127619 -78516 -28411 -92474 -365639 248959 -492068 -131611 2740 -171449
18987g2328B15997I5780b32909I0009h9065C29473b63049N9088c6318k50737I4735
$$ -72328 215997 95780 -232909 90009 -89065 329473 -263049 -203961 -36318 -287055 94735
18975a36670e8779k85414a4613A26509a62579A55654c5229A29286J2532k7255
$$ -136670 -58779 -344193 -14613 126509 -162579 155654 -35229 129286 141818 114563
18965A14563h2131j61084g6493j77589K5269K212K3414Q3444D1285a19558C09523
$$ 114563 -82131 -243215 -76493 -254082 -228813 -226601 -203187 -119743 41285 -119558 309523
18953B90528D8705c51912D4985a54322k33793D47565b93528B77220a06133j93008
$$ 290528 48705 -351912 44985 -154322 -388115 447565 -293528 277220 -106133 -299141
18943b99141a06060j10166M6332A84747O914E5172A2467d5300j08309G157a28854
$$ -299141 -106060 -216226 -169894 184747 191661 55172 12467 -45300 -153609 7157 -128854
18931i4370A5921M07319a9747Q321B02835c13514L8874A45035a77588L7461a9065
$$ -94370 15921 423240 -19747 -11426 202835 -313514 -274640 145035 -177588 -140127 -19065
18919c68995e4024q112l7824D8322a86790q4763A52413c70957C07181e165j65187
$$ -368995 -54024 -62136 -99960 48322 -186790 -271553 152413 -370957 307181 -5165 -170352
18908a70352j33935f3500m42K7483j63810p9180d8635B61964b10997E4690a44087
$$ -170352 -304287 -63500 -63942 -36459 -200269 -279449 -48635 261964 -210997 54690 -144087
18896A7249c40434D63270b74732M4879d8965H9774M7531d452k35654i1943F3359
$$ 17249 -340434 463270 -274732 -229853 -48965 89774 137305 -4452 -240106 -91943 63359
18884A44091O4927q7534d11572Q5595h2496D2256K00232F9824b97601L4059N9104
$$ 144091 209018 121484 -411572 -325977 -82496 42256 242488 69824 -297601 -263542 -204438
18873b04438j53385j4027a02317j90240H098a73029d9879j73740c0403l3150q9550
$$ -204438 -357823 -371850 -102317 -292557 8098 -173029 -49879 -223619 -30403 -63553 -153103
18862a53103k08574a62034h0582F4395c52816o0221J93249m1704h2185P260k5948
$$ -153103 -361677 -162034 -80582 64395 -352816 -413037 -219788 -261492 -82185 -74925 -100873
18851a00873k9009C8880h1707C42623f3323A98181G1054O289c0353k51870A67792
$$ -100873 -129882 38880 -81707 342623 -63323 198181 71054 77343 -30353 -282223 167792
18839A82328b85743f0658j84856D73173G4766d2389l68296a62306J2968j33530
$$ 182328 -285743 -60658 -245514 473173 74766 -42389 -410685 -162306 -149338 -282868
18829b82868D4702a68314I0044b0412j69480i0481L8416A76203a67194B32005
$$ -282868 44702 -168314 90044 -20412 -189892 -90481 -52065 176203 -167194 232005
18818B66066A24538O3853n5876J27966d3146A26118h8170A78334d4160M205C04677
$$ 266066 124538 188391 132515 260481 -43146 126118 -88170 178334 -44160 -39955 304677
18806f3471j3400I8790c10907O2682e8860B38047M6970a08187l04020a08609l52264
$$ -63471 -76871 98790 -310907 -248225 -58860 238047 285017 -108187 -412207 -108609 -460873
18795d60873h7721A91078b64231B4268O250a19095D30571a96063j8378h1523L9152
$$ -460873 -87721 191078 -264231 24268 30518 -119095 430571 -196063 -214441 -81523 -42371
18784d2371l5460H5296b02182A2950a92241j91107c1322l88797H9699c0082j07892
$$ -42371 -77831 85296 -202182 12950 -192241 -383348 -31322 -420119 89699 -30082 -137974
18773a37974A68338a3285j76310D2708L2894h281B08813b43697D8664a96427A7130
$$ -137974 168338 -13285 -189595 42708 75602 -8281 208813 -243697 48664 -196427 17130
18761B61967n2079R401d7787j56386C3973e0941A19908a72315l0408C63144B7627
$$ 261967 209888 219289 -47787 -204173 33973 -50941 119908 -172315 -202723 363144 27627
18749d66524J42830C04340E2054b04908b1860D8431H636J47215a31930l4645j70561
$$ -466524 -323694 304340 52054 -204908 -21860 48431 8636 155851 -131930 -166575 -337136
18738c37136a68390R400A51714a22397e5814l72222B57612b32101m377O0094k96972
$$ -337136 -168390 -158990 151714 -122397 -55814 -428036 257612 -232101 -236478 -176384 -473356
18727d73356A56466b07222A73465f4379j04198K0572A1417a52338G7581a31737
$$ -473356 156466 -207222 173465 -64379 -168577 -148005 11417 -152338 77581 -131737
18716d6370k18207E0526q63A5201d42962b10890d4717D5024e6986k63631a22683
$$ -46370 -264577 50526 49663 15201 -442962 -210890 -44717 45024 -56986 -320617 -122683
18704a69697J8350A21961e1852m869J8151j88690f6579B5220f6938j41742q6486
$$ -169697 -151347 121961 -51852 -56721 -38570 -227260 -66579 25220 -66938 -208680 -295166
18693b95166j1181a6405j82557f1894H7126f2306a8489C35679a14547A18358b00604
$$ -295166 -306347 -16405 -198962 -61894 87126 -62306 -18489 335679 -114547 118358 -200604
18681A39766R7696D2036c10807d199B01270a72205e2205p1169j34968E4904L7128
$$ 139766 237462 42036 -310807 -4199 201270 -172205 -52205 -123374 -258342 54904 92032
18670I2032J4551g254l79900a23950A92341a86729a5612k54967a4393k35397j15402
$$ 92032 106583 -7254 -387154 -123950 192341 -186729 -15612 -270579 -14393 -249790 -365192
18659c65192J35831l5273r8900A13709h0998k31424N311I4178a62763c7880B49717
$$ -365192 -229361 -264634 -363534 113709 -80998 -312422 -307111 94178 -162763 -37880 249717
18647b40486O4861B72683C1356P9322k0170J31183b59416c1391B25784H6321b29873
$$ -240486 -175625 272683 31356 110678 90508 221691 -259416 -31391 225784 86321 -229873
18635a45786r9766G3522P9370m6526k2212J2305l1335b43260B32699C3549b62516
$$ -145786 -245552 73522 152892 106366 84154 96459 65124 -243260 232699 33549 -262516
18623b79736E5069g8489j84210i1553m2452B49192b27138G6197c70126b0895r0306
$$ -279736 55069 -78489 -262699 -91553 -134005 249192 -227138 76197 -370126 -20895 -111201
18612a11201E2582J3082a53033p634a143C3967h0172A36064a84332O4652E149
$$ -111201 52582 65664 -153033 -160667 -1143 33967 -80172 136064 -184332 -119680 5149
18600A69932O784q4852J17531J63431e44135B58564d5365l91536A6941b76294
$$ 169932 176716 91864 209395 372826 -544135 258564 -45365 -436901 16941 -276294
18589b82286j44798A85298b24553a07787j76826A33308a36068A64996a33630A6515
$$ -282286 -427084 185298 -224553 -107787 -284613 133308 -136068 164996 -133630 16515
18578c81411a04728A11023C6214a37503G6759J11758a89259D2927J73251a83125
$$ -381411 -104728 111023 36214 -137503 76759 188517 -189259 42927 216178 -183125
18567A41004e3841j80042f0685E2967a01408A16386d031k17701j08906P0023j31826
$$ 141004 -53841 -233883 -60685 52967 -101408 116386 -4031 -221732 -330638 -260615 -392441
18556c92441f9451B75482a90557R4953B1480e9827o3280m3260A06772K22709i1378
$$ -392441 -69451 275482 -190557 -95604 21480 -59827 -123107 -166367 106772 329481 -91378
18544c17875c9534J7381j47228B6691L5343a60662B09099h8375B60638J65890
$$ -317875 -39534 -22153 -169381 26691 62034 -160662 209099 -88375 260638 426528
18534D26528b81241h0013j29823B32599I4565J3596b00604C50123c13651A5573
$$ 426528 -281241 -80013 -209836 232599 94565 108161 -200604 350123 -313651 15573
18523C044h698j6239j12051E9836c03960A73957d63818a09446b8087B44103c78364
$$ 3044 -8698 -24937 -136988 59836 -303960 173957 -463818 -109446 -28087 244103 -378364
18511a07548k92024B1445a70328A52405a00802k7517k62487R7805C3185L0740
$$ -107548 -399572 21445 -170328 152405 -100802 -128319 -390806 -293001 33185 63925
18501F3925R7798a92726P1996o4327m70f6449C181f7596b1129k00377A62146c04783
$$ 63925 161723 -192726 -120730 -185057 -185527 -66449 3181 -67596 -21129 -221506 162146 -304783
18488a72598E2361d6280j68485B0059b27687O7053n7596f5173l8286F7011B8748
$$ -172598 52361 -46280 -214765 20059 -227687 -160634 -218230 -65173 -103459 67011 28748
18476b6993j79862C7813J7039j5090a94462f4929D3540L81646G1893a31722n6390
$$ -26993 -206855 37813 54852 39762 -194462 -64929 43540 425186 71893 -131722 -188112
18465a88112k36503C60862a38362N1127d0512j03112k83893A30939F0508a13715
$$ -188112 -424615 360862 -138362 -87235 -40512 -143624 -427517 130939 60508 -113715
18454C490f4980j00876A56093m8222a81428A01336j403K0675a78721a5373k08297
$$ 3490 -64980 -165856 156093 107871 -181428 101336 99933 120608 -178721 -15373 -223670
18443b23670f8370k09366A07135a77371p5578E2482K81074b75526H2452g4563
$$ -223670 -68370 -277736 107135 -177371 -252949 52482 333556 -275526 82452 -74563
18432a56949B9879b57585e2554a868m6712B51840K0529b56603j22752A48216a71803
$$ -156949 29879 -257585 -52554 -1868 -48580 251840 272369 -256603 -379355 148216 -171803
18420g6055B4351J71440k1200a16578C2131a20328d0123m0068c4678j20635j49643
$$ -76055 24351 195791 174591 -116578 32131 -120328 -40123 -80191 -34678 -155313 -304956
18409c04956l5620i2490o1885C75374a01800A82766c18032B14751b8533a508I186
$$ -304956 -340576 -92490 -154375 375374 -101800 182766 -318032 214751 -28533 -1508 9186
18397e1843j19649j2368f8348a9326j26954A5491a06517j55026N3274k7113A55131
$$ -51843 -171492 -183860 -68348 -19326 -146280 15491 -106517 -261543 -208269 -235382 155131
18385i0732q0903a3031H4733J95674c88652g955B3134f7531A53718h6550A02380
$$ -90732 -171635 -13031 84733 280407 -388652 -7955 23134 -67531 153718 -86550 102380
18373c02413C14535F5626a17486j48999A77970g3836j51823l4243A6998N79794
$$ -302413 314535 65626 -117486 -266485 177970 -73836 -225659 -259902 16998 596792
18363E96792I8004a52345f7455F3151A5052b53629m6057a43592k7416E4049b33940
$$ 596792 98004 -152345 -67455 63151 15052 -253629 -299686 -143592 -171008 54049 -233940
18351a47504j36982F1094P9691b67023a20228A12821b83959E2364c0504B4784
$$ -147504 -284486 61094 140785 -267023 -120228 112821 -283959 52364 -30504 24784
18340g4946j17558J0871Q3285j95625B36340H0817C1111a25458N7041k15779A04048
$$ -74946 -192504 -181633 -98348 -293973 236340 80817 31111 -125458 -68417 -284196 104048
18328a61154C53457D8676b41023e9033A08185e5895C01059M3734c9839k59144
$$ -161154 353457 48676 -241023 -59033 108185 -55895 301059 344793 -39839 -298983
18318b98983B09817A3064J34264a47673n5837G517a78381j06117c1370k9102r8913
$$ -298983 209817 13064 147328 -147673 -203510 7517 -178381 -284498 -31370 -60472 -159385
18307a59385f121m2730l6698A75317a06263A43386a19286d1953m1305E6996J42139
$$ -159385 -6121 -48851 -85549 175317 -106263 143386 -119286 -41953 -83258 56996 199135
18296A99135c18096f0105B14394b54655j17071e8010j30088P6398D8396a29840
$$ 199135 -318096 -60105 214394 -254655 -371726 -58010 -188098 -111700 48396 -129840
18285A05753b50378J06320A94889h2098A29566a34772A27384O8283b27570j28786
$$ 105753 -250378 -144058 194889 -82098 129566 -134772 127384 195667 -227570 -356356
18275c56356B14304e8753m39614a48912A64047g6313C6896L72958a73979A05197
$$ -356356 214304 -58753 -498367 -148912 164047 -76313 36896 409854 -173979 105197
18264a1867C0380c38855a13305H0271a18001j51159J23823l0189b1911j24518
$$ -11867 30380 -338855 -113305 80271 -118001 -269160 -145337 -175526 -21911 -146429
18254a46429A72903c6065C2707J23291b18198M6803m786c8868C8358e1972B70299
$$ -146429 172903 -36065 32707 155998 -218198 -171395 -176181 -38868 38358 -51972 270299
18242F3803c34432d7558j3607C2698h7801a013A2325b39112A35072b03577A78671
$$ 63803 -334432 -47558 -61165 32698 -87801 -1013 12325 -239112 135072 -203577 178671
18230i417j23342l98008a6781D3528a33310k59778B41599c729l59595A4182b07182
$$ -9417 -132759 -530767 -16781 43528 -133310 -393088 241599 -3729 -363324 14182 -207182
18218B4523J25980a66340g5033A26431b2905m8465B05615a52287q7131e4716q580
$$ 24523 150503 -166340 -75033 126431 -22905 -71370 205615 -152287 -239418 -54716 -63296
18207f3296k54350J21690B8426c22846A7836Q7395L5187d65368A78096e63585
$$ -63296 -317646 -195956 28426 -322846 17836 105231 140418 -465368 178096 -563585
18196b56856A52094B862c2432m40324d3835A04198e5993h500l4341B11168p4958
$$ -256856 152094 2862 -32432 -472756 -43835 104198 -55993 -8500 -42841 211168 136210
18185A36210a37893B04562p8088c7040H459a78782J2533q838F80c41994h3951
$$ 136210 -137893 204562 126474 -37040 8459 -178782 -166249 -175087 680 -341994 -83951
18173a67494b7043A61264G3384Q0578n0736f8461A8336b0815D06654a83754I7146
$$ -167494 -27043 161264 73384 153962 103226 -68461 18336 -20815 406654 -183754 97146
18161b01127Q6404B49270c48568D3819N4312a88870M6983j16481J28008A44261
$$ -201127 -114723 249270 -348568 43819 98131 -188870 -141887 -258368 -130360 144261
18150A49771n1425h2084l7062A93043J60377a04882k5259A11807c43278B83532
$$ 149771 98346 -82084 -119146 193043 353420 -104882 -130141 111807 -343278 283532
18139c56173a31536C0173a41372B21991n1430a8628A40368b39241o238F887b49868
$$ -356173 -131536 30173 -141372 221991 170561 -18628 140368 -239241 -245479 6887 -249868
18127B52829a34921j70703C82137b0442A51551J38044b94771B72156B1968a30549
$$ 252829 -134921 -305624 382137 -20442 151551 289595 -294771 272156 21968 -130549
18116a10886A30233P3220b35550g1352j27112k4646Q1915A01466a88866L1587
$$ -110886 130233 203453 -235550 -71352 -198464 -223110 -141195 101466 -188866 -157279
18106a57279I107J89211c07945A68335h1039e174l9201J5974c823l68015o6277
$$ -157279 9107 198318 -307945 168335 -81039 -5174 -44375 -28401 -3823 -371838 -438115
18095d38115B7824g2585o9926M9105G2282N4155C7669J6652a03958A21293k030
$$ -438115 27824 -72585 -142511 -93406 72282 126437 37669 54321 -103958 121293 119263
18084A19263H095J82977a81988L9387K1972A30266a03621a4143C941K22172H7272
$$ 119263 8095 191072 -181988 -142601 -120629 130266 -103621 -14143 3941 226113 87272
18072b69074a9137l11591a26665B30958B9769l910J29030b46595R4782A85830
$$ -269074 -19137 -330728 -126665 230958 29769 25859 154889 -246595 -151813 185830
18061a30021j78260H3427M2896a15223C15951h161I295J38163L3242J84723b13627
$$ -130021 -308281 83427 126323 -115223 315951 -8161 9295 147458 180700 365423 -213627
18049d00505J5321J14373i8947B17171a52441A02981b12098A91534C2024a8766
$$ -400505 -385184 -270811 -98947 217171 -152441 102981 -212098 191534 32024 -18766
18038A21313a35049j073F8411a7202B48575A09302c1603l1783a3274A74967c2479
$$ 121313 -135049 -136122 68411 -17202 248575 109302 -31603 -63386 -13274 174967 -32479
18026i810j20613O721M7306k54766e1616B77572b68038j30234D808d4066j63505
$$ -9810 -130423 -123702 -76396 -331162 -51616 277572 -268038 -398272 4808 -44066 -207571
18015b07571k0452J07066C75958a09224C38901e5983j8046b5878j14480j55646
$$ -207571 -228023 -120957 375958 -109224 338901 -55983 -74029 -25878 -140358 -296004
18005b96004a21790N9799G2994a1992k0909j14121g0112I5566a34865o9955C7559
$$ -296004 -121790 -61991 72994 -11992 -32901 -147022 -70112 95566 -134865 -204820 37559
17993a74606j8945C93867j95556A9335N396d62588g5521a7756A56407A403Q025
$$ -174606 -193551 393867 198311 19335 24731 -462588 -75521 -17756 156407 1403 9428
17982I428a75123B4507a7092p7410C46340i9623B6361P6199D148a23500A57112
$$ 9428 -175123 24507 -17092 -94502 346340 -99623 26361 102560 4148 -123500 157112
17970H0943a20669N5524j25319F6452L01303j43537F7548c32212I19N373b29965
$$ 80943 -120669 -65145 -190464 66452 367755 224218 67548 -332212 919 6292 -229965
17958b60198A03308K5770a68573L5906B51265F0632a24477M7310j27662A06571
$$ -260198 103308 129078 -168573 -132667 251265 60632 -124477 -77167 -204829 106571
17947E6867b14919n9035A93206q005J70947b56902A18404b65030c772D4579O7681
$$ 56867 -214919 -273954 193206 185201 356148 -256902 118404 -265030 -3772 44579 112260
17936A12260K56672H5912d21507a23120n1778D4406c42201d3144p5068h08B18652
$$ 112260 368932 85912 -421507 -123120 -174898 44406 -342201 -43144 -118212 -808 218652
17924b61834I8915a10908R537P636A06787e4836H6589i5622A18272a40291c8578
$$ -261834 98915 -110908 -101371 -93735 106787 -54836 86589 -95622 118272 -140291 -38578
17912b33838A27345b58935e4118l29977C414L67736A39490i1903j8419k57337
$$ -233838 127345 -258935 -54118 -384095 3414 371150 139490 -91903 -110322 -367659
17902c67659G061L89816a03885A9688K44965b12483n4892H7128b5676j5693A0062
$$ -367659 7061 396877 -103885 19688 264653 -212483 -267375 87128 -25676 -41369 10062
17890C49765a15356G1568J78300D7791c42030J00208A55691D3093b05883L9483
$$ 349765 -115356 71568 249868 47791 -342030 -241822 155691 43093 -205883 -166400
17880a66400F0674a15238B21572p5495C1027K07236b76009J30503D5065P2683
$$ -166400 60674 -115238 221572 146077 31027 238263 -276009 -145506 45065 117748
17870A17748c27245J45917h1261E1243J31469a39163E73090a06610F5851J87446
$$ 117748 -327245 -181328 -81261 51243 182712 -139163 573090 -106610 65851 253297
17860B53297a37468o2176B95106f0745A6883b7709B26927a77577h5413j79414
$$ 253297 -137468 -199644 295106 -60745 16883 -27709 226927 -177577 -85413 -264827
17850b64827r1579A00138b37065G7118B9522Q849J49200J8217e1713I6409J36543
$$ -264827 -356406 100138 -237065 77118 29522 38371 187571 205788 -51713 96409 232952
17839B32952a43514j9495N0482j89300b0698A9408b98039a08491C40469d0110
$$ 232952 -143514 -163009 -112527 -301827 -20698 19408 -298039 -108491 340469 -40110
17828A17858J29763J6911a580A88447A3906a40463O4697L1635H4871e5767j1271
$$ 117858 247621 264532 -1580 188447 13906 -140463 -75766 -44131 84871 -55767 -67038
17817f7038C3589J29540c50723B08672b92674J45115n6026J970d0823A68410a08198
$$ -67038 33589 163129 -350723 208672 -292674 -147559 -203585 -201615 -40823 168410 -108198
17805B4090K35903a24245J4377B95177h7411A76740B7254a8691C7466j2094J3355
$$ 24090 259993 -124245 -109868 295177 -87411 176740 27254 -18691 37466 25372 38727
17794C8727J95133a28474M6377D06473A42391b71444B19788q1717J9989a27616
$$ 38727 233860 -128474 -82097 406473 142391 -271444 219788 138071 158060 -127616
17783b58832B71621a65792A74856a31926F8347h7733A3771b2632H8138l4867b85911
$$ -258832 271621 -165792 174856 -131926 68347 -87733 13771 -22632 88138 53271 -285911
17771a8200C59255n2129b22269A03926a72821B25813a176B0327O1653d1624B19010
$$ -18200 359255 307126 -222269 103926 -172821 225813 -1176 20327 81980 -41624 219010
17759B36758a72086L542B50719a59203m1611D287a85946d4312q8444J7006c2998
$$ 236758 -172086 -168544 250719 -159203 -200814 4287 -185946 -44312 -132756 -115750 -32998
17747A15959h6775e067j54629j40130h1940C56737D8016a64456k6721K9249L6861
$$ 115959 -86775 -5067 -159696 -299826 -81940 356737 48016 -164456 -191177 -161928 -125067
17736a25067B778a15488j79686C42330C6175L67054A03311k3699K0082J444b03818
$$ -125067 2778 -115488 -295174 342330 36175 403229 103311 79612 99694 101138 -203818
17724i9641B90359D1097f5530o1257M6265j69239A07688J475A5190c46288a27253
$$ -99641 290359 41097 -65530 -126787 -80522 -249761 107688 109163 15190 -346288 -127253
17712C3674J97829f2445O514d467A56714c05391C49263h5336e444k4341B2443
$$ 33674 231503 -62445 -55931 -4467 156714 -305391 349263 -85336 -5444 -29785 22443
17700a62767I6201b03682h8345A74796H3803b6568A54449e3409b269k39008c7806
$$ -162767 96201 -203682 -88345 174796 83803 -26568 154449 -53409 -2269 -241277 -37806
17688I9264h0656B87326c90012B48388B5012M84042k49427b0882C15325C9533
$$ 99264 -80656 287326 -390012 248388 25012 509054 259627 -20882 315325 39533
17677a63799b4628m1334B85P6712b63852A40750Q5884D0765f5037F5653j3730
$$ -163799 -24628 -65962 285 76997 -263852 140750 226634 40765 -65037 65653 51923
17666E1923L653O3578k5764a4577k58912A62351b02080l821A06069j2338a3805
$$ 51923 55576 119154 93390 -14577 -273489 162351 -202080 -205901 106069 93731 -13805
17654B03474B2628d4417n2419l11395A8344i0157I964N9490J22727h9576B67155
$$ 203474 22628 -44417 -96836 -408231 18344 -90157 9964 69454 192181 -89576 267155
17642B14053a67868F652J31350J18145b76153A94988a56989H4122J40101a34630
$$ 214053 -167868 6652 138002 256147 -276153 194988 -156989 84122 224223 -134630
17631C17931c49034A75104b08118f6499A6963O3974a2407I5605L9524b4878A94687
$$ 317931 -349034 175104 -208118 -66499 16963 80937 -12407 95605 135129 -24878 194687
17619F1904K41399A24227B2110a73270B9158d9894A76467a78566A41495a91101
$$ 61904 303303 124227 22110 -173270 29158 -49894 176467 -178566 141495 -191101
17608c66310e5430I9674M471m099D1340J34057N0105r0414L2942f7308p4015k03427
$$ -366310 -55430 99674 104145 100046 41340 175397 225502 135088 168030 -67308 -141323 -344750
17596c44750a01747C31658E9364j5966b38250j8567B7649a284A43285I069K212
$$ -344750 -101747 331658 59364 43398 -238250 -256817 27649 -1284 143285 9069 11281
17585A1281J64019a48248g180j49533A31933h9940B78604A26874m4799a6525B42532
$$ 11281 175300 -148248 -7180 -156713 131933 -89940 278604 126874 82075 -16525 242532
17573G5531d00327f7101A60616a35649F2478a86071A85694a04012r8204c1824
$$ 75531 -400327 -67101 160616 -135649 62478 -186071 185694 -104012 -202216 -31824
17562A24420J26157C0296M5854C825J74432a8435A23483A8271O5479J56891H2483
$$ 124420 250577 30296 76150 3825 178257 -18435 123483 18271 83750 240641 82483
17550B22155D8371K47926a21104C035P7224k1591K02652A7072e9603B12239L2683
$$ 222155 48371 296297 -121104 3035 80259 58668 261320 17072 -59603 212239 244922
17539B44922A06055i5468G4971K258B549P1690c5351B6471L0215E7K4047I117
$$ 244922 106055 -95468 74971 77229 2549 74239 -35351 26471 56686 57 24104 9117
17526D61285b23647G4695a2523j612E21451b46467D02790A74324F7865e4274m497
$$ 461285 -223647 74695 -12523 -14135 521451 -246467 402790 174324 67865 -54274 -58771
17515e8771D8146f2312j95205B73687f9093e092B27383e5667j30557D8607K84856
$$ -58771 48146 -62312 -257517 273687 -69093 -5092 227383 -55667 -186224 48607 333463
17504C33463A06391D4299b82301n6989A81561L5611G4124J85471l7977b59215
$$ 333463 106391 44299 -282301 -339290 181561 217172 74124 259595 221618 -259215
17493B67219a11281K9162H5076b2085B63919a8717A07355J18618k5600a00696
$$ 267219 -111281 -82119 85076 -22085 263919 -18717 107355 225973 200373 -100696
17482C8735K91501A47283n3030A4870K57347r4120a86804A90483j0548K42737
$$ 38735 330236 147283 94253 14870 272217 178097 -186804 190483 179935 422672
17472D22672A18572C4375K48709c928D73410j63248D7578i499B88779A13476b25355
$$ 422672 118572 34375 283084 -3928 473410 310162 47578 -9499 288779 113476 -225355
17460F9038D336K03645a30896D39849j1198C2564O7162b67419a06399B69421j1765
$$ 69038 4336 207981 -130896 439849 428651 32564 99726 -267419 -106399 269421 257656
17449B57656J79988j13273p0785K13647B13746i0492D39802A23518M55811k10570
$$ 257656 437644 324371 253586 467233 213746 -90492 439802 123518 579329 368759
17439C68759q134j535j51606A8429L90917A18614R0405K94639k48407j9575Q4722
$$ 368759 360625 359090 207484 18429 409346 118614 209019 503658 255251 235676 320398
17428C20398J56574A36601B8414N37438A58907J25183K87449A18276K16566p5971
$$ 320398 476972 136601 28414 565852 158907 284090 571539 118276 334842 258871
17418B58871L08458G7838M3239l1092c8684A42231K84553o0043h2882A95808K48833
$$ 258871 567329 77838 121077 89985 -38684 142231 426784 366741 -82882 195808 444641
17407D44641j14864M4932j62188E5158c46q7705A02748D7636f2410b8489m9353
$$ 444641 329777 374709 212521 55158 -346 -88051 102748 47636 -62410 -28489 -77842
17396g7842C03397i6646B79636j00252a43838j2872B01195o7362d2354D00275
$$ -77842 303397 -96646 279636 179384 -143838 -156710 201195 133833 -42354 400275
17385C27070a5269C59343m2497c04705E0694a79130e0924b0642j96009A89733
$$ 327070 -15269 359343 316846 -304705 50694 -179130 -50924 -20642 -216651 189733
17374B09154L3381c734A74202P589L44206H5747N1122F7418k9269d2286B47435
$$ 209154 242535 -3734 174202 181791 525997 85747 136869 67418 38149 -42286 247435
17362C89815f9137E01060A15832L7178J54471j4757m1220E7566M5990e5038l7620
$$ 389815 -69137 501060 115832 153010 307481 292724 251504 57566 103556 -55038 -92658
17351i2658B74470B3822M8279J22764J32041j23034R6052m1813m2955a15351A67863
$$ -92658 274470 23822 72101 194865 326906 203872 299924 258111 215156 -115351 167863
17339B77600b00725G9542C7444L4811K02446a03483C14207b4754j40811A69833
$$ 277600 -200725 79542 37444 72255 274701 -103483 314207 -24754 -165565 169833
17328C28158G0919K04176p3938O7919p1137D5069J28678J44357r0833Q7052q0383
$$ 328158 70919 275095 201157 269076 197939 45069 173747 318104 227271 314323 233940
17317B33940A00103K17543j34706J35621a56559B92214j7511Q0358g4337I352
$$ 233940 100103 317646 182940 318561 -156559 292214 274703 355061 -74337 9352
17306e3447C93290A62185K9913d8005J6523P586l15314a15087f961B5378K03417
$$ -53447 393290 162185 192098 -48005 -31482 -23896 -339210 -115087 -6961 25378 228795
17295B28795M4438j27912Q3684H4313J34998K16689f8613H066L4593i8225D6605
$$ 228795 273233 145321 229005 84313 219311 436000 -68613 8066 42659 -98225 46605
17283B16458B9803L64165j20011J27651j64951p7952J71662j62260J2247J78644
$$ 216458 29803 393968 273957 401608 236657 158705 330367 168107 180354 358998
17273C58998j46849A1473J13384k7137j3265B5755K00841F2470N1733J78353A22301
$$ 358998 212149 11473 124857 97720 84455 25755 226596 62470 114203 292556 122301
17261B92939a14722c0423p0428I7380K07972c9682A36075J63131A27828e6778
$$ 292939 -114722 -30423 -100851 97380 305352 -39682 136075 299206 127828 -56778
17250a49014A69480L03759A41280Q4220B6460d8144C02521D7721J09862l7906
$$ -149014 169480 473239 141280 225500 26460 -48144 302521 47721 157583 119677
17240A19677J33724r7823K31276A02595N42562k24916B09667M0954i1715C36683
$$ 119677 253401 155578 386854 102595 645157 420241 209667 250621 -91715 336683
17229A54234b5426D71966q2948J6006o8260I7676K59328k9647k2087p5591q6529
$$ 154234 -25426 471966 389018 405024 336764 97676 357004 327357 305270 229679 143150
17218A43150J71321a03177A91135D730J35880M7594K23004I7780L04465M1467
$$ 143150 314471 -103177 191135 4730 140610 188204 411208 97780 402245 443712
17208D43712A81738J67675A53375O2263J46002O662A11676K38916K030m2129K0729
$$ 443712 181738 349413 153375 215638 361640 368302 111676 350592 352622 310493 331222
17197C31222j27953I1267K39297A34539K81582j18419G3066M24586j80920H7988
$$ 331222 203269 91267 330564 134539 416121 297702 73066 497652 316732 87988
17186D02751N9449A42847F5214J02898K34839J79042B64454M23053B34261A08950
$$ 402751 462200 142847 65214 168112 402951 581993 264454 687507 234261 108950
17175D37674A76668a56998C04662Q1082i9886H8372K34078I3988K46678E7631
$$ 437674 176668 -156998 304662 385744 -99886 88372 322450 93988 340666 57631
17164B62381K87971k47542J61610F3299L77686j36649K54726j84950Q5565l0845
$$ 262381 550352 302810 464420 63299 440985 304336 559062 374112 459677 428832
17154D28832j48563J14317p3020D6983O7019j5118L86065g1230E54998J74185
$$ 428832 280269 394586 321566 46983 114002 98884 484949 -71230 554998 729183
17144G29183b25057B76307J58551j28729K18019j5059A86623K0663J84871l4386
$$ 729183 -225057 276307 434858 306129 524148 509089 186623 207286 392157 357771
17134C57771A11551M7443Q9364K55606A84996J17023j11746a4453B85741j27230
$$ 357771 111551 158994 248358 503964 184996 302019 190273 -14453 285741 158511
17124A58511J30602J43626p243j2909J33772n511b8098A66917M29888a112E66603
$$ 158511 289113 432739 425496 412587 546359 540848 -28098 166917 596805 -1112 566603
17112C90186F2553M14366D5358L54094j15384K64097k7225J14648C01817K77780
$$ 390186 62553 476919 45358 399452 284068 548165 520940 635588 301817 579597
17102E79597K4067B18994L40721j65474o5847R1942p0964j50388M04190B77255
$$ 579597 603664 218994 559715 394241 328394 420336 349372 198984 603174 277255
17091F15485n1472R6279k3004k59579O26103D39900d391D20132q4754n3628J5643
$$ 615485 564013 660292 637288 377709 1003812 439900 -4391 420132 335378 281750 297393
17080B97393Q4167M881M16604l73915J4401q8363K30594I8891K17139m744J78792
$$ 297393 381560 386441 803045 429130 443531 355168 585762 98891 316030 311286 490078
17069D90078n9182j88154E5426N52086j23287P7367j97056L67675l14601K84617
$$ 490078 430896 242742 55426 607512 484225 561592 364536 732211 417610 702227
17059G02227n7463B49088O2411q04M20179k42145K33115K611j92745L01870k93527
$$ 702227 644764 249088 311499 310695 730874 488729 721844 724455 531710 833580 540053
17048E40053m2776K28902C12079K20713J02863L5246p1277j46624L6995M18262
$$ 540053 497277 726179 312079 532792 635655 670901 599624 453000 489995 908257
17038I08257l3682k27563m9532j00417k39757K62700p2102M8114K46458K77545
$$ 908257 874575 647012 597480 497063 257306 520006 447904 496018 742476 1020021
17028A020021D16126K44566J31351o724j93701J23000C47416M91351l13892O4693
$$ 1020021 416126 660692 792043 785319 591618 714618 347416 838767 524875 589568
17018E89568j94482J48452J92659j50964J85486K2314j6505k31438L99101j27681
$$ 589568 395086 543538 736197 585233 770719 793033 776528 545090 944191 816510
17008H16510K20331K04979m85964P8748l22413K02972j03384P4786L6252j91464
$$ 816510 1036841 1241820 755856 834604 512191 715163 611779 686565 722817 531353
16998E31353J75148R2712j88272J36037Q1533k4096m7599R8254J12808l106j64748
$$ 531353 706501 799213 610941 746978 828511 804415 756816 855070 967878 964772 800024
16987H00024l07843J96610Q4580j95398M59996k41728o3952Q197p4763M4106k9906
$$ 800024 492181 688791 773371 577973 1037969 796241 732289 740486 665723 709829 679923
16976F79923N35922m00473K93831l28988j85736J19013J57890M2779k11775N0614
$$ 679923 1215845 815372 1109203 780215 594479 713492 871382 914161 702386 753000
16966G53000M75692k35635Q6033J69348j9327j30591k4162k63104K82615k59354
$$ 753000 1228692 993057 1079090 1248438 1229111 1098520 1074358 811254 1093869 834515
16956H34515K77371r2319O8258l10312K35457K38985m6487Q4972j02588m1679
$$ 834515 1111886 1019567 1087825 777513 1012970 1251955 1205468 1290440 1187852 1146173
16946A146173K90557k11677m3436r4706l7286q8179K89361m71659K95010p5767
$$ 1146173 1436730 1225053 1181617 1086911 1049625 961446 1250807 779148 1074158 998391
16936I98391J27377j6739K29021k50663K65495J72401j04157k75998O6691p6404
$$ 998391 1125768 1109029 1338050 1087387 1352882 1525283 1421126 1145128 1211819 1135415
16926A135415K71289j71861P6078O3116k7234J50397N1277k86864J08552J871
$$ 1135415 1406704 1234843 1310921 1374037 1346803 1497200 1548477 1261613 1370165 1372036
16916A372036j9884J91989l91961J01262J77132J6485J03025J06798j89617j38192
$$ 1372036 1352152 1544141 1152180 1253442 1430574 1447059 1550084 1656882 1467265 1329073
16906A329073L36610l3496j14448k1004L33291j41000k23272M24891j50902j49724
$$ 1329073 1665683 1632187 1517739 1496735 1830026 1689026 1465754 1890645 1739743 1590019
16896A590019J41282R8763L8547J03323l09202L27899M6532j32485J79373m77536
$$ 1590019 1731301 1830064 1868611 1971934 1662732 1990631 2037163 1904678 2084051 1606515
16886A606515o9687M88896k161j60069Q902J64434J18219m1822K37297k27314
$$ 1606515 1536828 2025724 2023563 1863494 1872396 2036830 2155049 2113227 2350524 2123210
16876B123210L08988J05494j57172j06016L38668m22395J48207J9561q2315N60723
$$ 2123210 2432198 2537692 2380520 2274504 2613172 2190777 2338984 2358545 2276230 2836953
16866B836953m0190p7364q4230R5331L5891J3566J02016j15095M03454m0490m08773
$$ 2836953 2796763 2719399 2635169 2730500 2766391 2779957 2881973 2766878 3170332 3129842 2721069
16855B721069M98097l60400j3119K04561J65253L08028j04084l91522N22887m46258
$$ 2721069 3219166 2858766 2845647 3050208 3215461 3523489 3419405 3027883 3550770 3104512
16845C104512O8160L91230K3714J13222K28962l5959k90625L25303k43415L17743
$$ 3104512 3172672 3563902 3587616 3700838 3929800 3893841 3603216 3928519 3685104 4002847
16835D002847J52337j79451J41363j73256K32236L78211n45436L72576J72166
$$ 4002847 4155184 3975733 4117096 3943840 4176076 4554287 4008851 4381427 4553593
16826D553593K86890P4874L24760k94897J73189K3575N28K50123J47565o4398
$$ 4553593 4840483 4915357 5240117 4945220 5118409 5141984 5142512 5392635 5540200 5475802
16816E475802J52646J22487J24038J71355P256K06977j55566O79532k80234o7290
$$ 5475802 5628448 5750935 5874973 6046328 6053584 6260561 6104995 6784527 6504293 6437003
16806F437003M04571K00543L64568L30305n23493N22054j14491M24863K64898
$$ 6437003 6841574 7042117 7406685 7736990 7213497 7735551 7621060 8045923 8310821
16797H310821k262K09179O12246N7788K33700K68482K68103j0220o8795R10302
$$ 8310821 8308559 8517738 9129984 9187772 9421472 9689954 9958057 9947837 9879042 10789344
16787A0789344O9436J40859K19910P23328J89455J74170L67738N68985M46107
$$ 10789344 10858780 10999639 11219549 11942877 12132332 12306502 12674240 13243225 13689332
16778A3689332K74235M75125J30137O35326M47442R18493N23880L5016M96218
$$ 13689332 13963567 14438692 14568829 15204155 15651597 16570090 17093970 17128986 17625204
16769A7625204J097397L59204Q04736R96084L55716Q81983J124532R55548P43948
$$ 17625204 18722601 19081805 19886541 20882625 21238341 22120324 23244856 24200404 24944352
16760B4944352Q53031J582678Q37910J237046J598328R35388J705065J420217
$$ 24944352 25797383 27380061 28217971 29455017 31053345 31988733 33693798 35114015
16752C5114015J784074J570373J991539J982055K464629K334531K428605K659001
$$ 35114015 36898089 38468462 40460001 42442056 44906685 47241216 49669821 52328822
16744E2328822K604566L018509L513088L749788L609700M202094M321392M810624
$$ 52328822 54933388 57951897 61464985 65214773 68824473 73026567 77347959 82158583
16736H2158583N116783N434609O462506N823021O900464P300298P488969P901779
$$ 82158583 87275366 92709975 99172481 104995502 111895966 119196264 126685233 134587012
16728A34587012Q090689Q547205Q450963Q901573Q012316Q056906P254276O542191
$$ 134587012 142677701 151224906 159675869 168577442 176589758 184646664 191900940 198443131
16720A98443131N517825M005289K906776J159180k15952k153317k902969m853184
$$ 198443131 203960956 207966245 210873021 212032201 211816249 209662932 206759963 201906779
16712B01906779n446488o810311p677301q305656q419044r009324q543465q487243
$$ 201906779 196460291 189649980 181972679 173667023 165247979 156238655 147695190 139207947
16704A39207947q648137p733638p739332p232041o754604o590834n766957n590997
$$ 139207947 130559810 122826172 115086840 107854799 101100195 94509361 88742404 83151407
16696H3151407n303367m655530m458512m018370l882388l324400l936739k489613
$$ 83151407 77848040 73192510 68733998 64715628 60833240 57508840 53572101 51082488
16688E1082488k628102k773570k259247k432580k056871j680668j690431j894370
$$ 51082488 48454386 45680816 43421569 40988989 38932118 37251450 35561019 33666649
16680C3666649j790184j309600j485967j333130j259481q83068j207708q72470
$$ 33666649 31876465 30566865 29080898 27747768 26488287 25605219 24397511 23525041
16672B3525041j212824p66301j007794r06396q17797j83221j049511o88967m74486
$$ 23525041 22312217 21545916 20538122 19631726 18813929 18630708 17581197 16892230 16417744
16663A6417744p60493n81386j55857q01389l25914o40430m38083k21864m20820
$$ 16417744 15657251 15075865 14920008 14118619 13792705 13152275 12714192 12492328 12071508
16654A2071508m85627k97336o6847n89902j63711l55344l95019l07184J75820
$$ 12071508 11585881 11288545 11221698 10631796 10468085 10112741 9717722 9410538 9586358
16645I586358n03069j34469o01280k04934l68872r622k54022j3843k23499n44650
$$ 9586358 9083289 8948820 8347540 8142606 7773734 7764112 7510090 7496247 7272748 6728098
16635F728098K63215m28081l23547K29590k77076R3158p9860j14382n77131k39086
$$ 6728098 6991313 6563232 6239685 6469275 6192199 6285357 6205497 6091115 5513984 5274898
16625E274898m21186Q22293n62774j40289J31964k3047j63021l61592J7332l63423
$$ 5274898 4853712 5676005 5113231 4972942 5104906 5081859 4918838 4557246 4574578 4211155
16615D211155j01276J21776j06364o9411O8716k6649n25058L78341m57997K26899
$$ 4211155 4109879 4231655 4125291 4055880 4124596 4097947 3572889 3951230 3493233 3720132
16605C720132l47985K50232J38859k39003j76150j8983O190n27674M09643m27409
$$ 3720132 3372147 3622379 3761238 3522235 3346085 3327102 3333292 2805618 3215261 2787852
16595B787852K16899j78935J21494J9023k22325j94546k36984J74817J93724L7862
$$ 2787852 3004751 2825816 2947310 2966333 2744008 2549462 2312478 2487295 2681019 2718881
16585B718881l45923L70933o71006K02324j06803Q0879j60112L69308m61561L35418
$$ 2718881 2372958 2743891 2072885 2275209 2168406 2249285 2089173 2458481 1996920 2332338
16575B332338r6670L8479k84314N6871O5190R0575j77058j30010R4958m32629
$$ 2332338 2235668 2274147 1989833 2046704 2111894 2202469 2025411 1895401 1990359 1557730
16565A557730N66366l42668j21609r7669J68191L16301l1984m23499K07963m65834
$$ 1557730 2124096 1781428 1659819 1562150 1730341 2046642 2014658 1591159 1799122 1333288
16555A333288N30226l84652N7983K99760l63281J26887m36232p7432K54751J3462
$$ 1333288 1863514 1478862 1536845 1836605 1473324 1600211 1163979 1086547 1341298 1354760
16545A354760J34292k05845r6j3722p1894O8604K64507k30228k01043J69307n4363
$$ 1354760 1489052 1283207 1283111 1269389 1197495 1266099 1530606 1300378 1099335 1268642 1214279
16534A214279j27281K15529o2805j54859J98236K8161o31479L40235J50727K32100
$$ 1214279 1086998 1302527 1239722 1084863 1283099 1311260 679781 1020016 1170743 1402843
16524A402843l96781M20752k2098o85539J90627K81612J62477k59143k91960J72761
$$ 1402843 1006062 1426814 1404716 719177 909804 1191416 1353893 1094750 802790 975551
16514I75551K30897k42089r7708k33328p0819M49669k54977P8807j25838L37051
$$ 975551 1206448 964359 866651 633323 562504 1012173 757196 836003 710165 1047216
16504A047216m22563K03664P5182l18840j03128R7650L27754k26512o4867J29635
$$ 1047216 624653 828317 903499 584659 481531 579181 906935 680423 615556 745191
16494G45191j93789K93379p3657L4889Q444C31301N32463j67317P6311k54819
$$ 745191 551402 844781 771124 806013 814457 331301 863764 696447 772758 517939
16484E17939K95166j04970j25496M70151l64006R7481p4070j37115N9750k83753
$$ 517939 813105 708135 582639 1052790 688784 786265 712195 575080 634830 351077
16474C51077L66108C25278L92835r5806J04274K2140k52709M6679r84q1273M00778
$$ 351077 717185 325278 718113 622307 726581 748721 496012 542691 541707 460434 861212
16463H61212j36946C22251J85161L3535R9729B60951q5385N06549A62399K52877
$$ 861212 724266 322251 507412 540947 640676 260951 175566 682115 162399 415276
16453D15276K40806r7577j36314J16110Q0888I5475M4724J93795K8311r8626M37349
$$ 415276 656082 558505 422191 538301 619189 95475 140199 333994 362305 263679 701028
16442G01028J79445C54809K18089B81738K47329R0321m6378j31191H0479K88800
$$ 701028 880473 354809 572898 281738 529067 619388 573010 441819 80479 369279
16432C69279k2253o7741K20276J68327C27769r9273L33699A84192K48474k11863
$$ 369279 347026 279285 499561 667888 327769 228496 562195 184192 432666 220803
16422B20803J36615P4222R11j73925J33463J39841j68923J49375j82123A28160
$$ 220803 357418 431640 432551 258626 392089 531930 363007 512382 330259 128160
16411F77965k95550K3106J54345K2516A84730J51768L5922a59703E86016A26935
$$ 677965 382415 405521 559866 582382 184730 336498 372420 -159703 586016 126935
16400A44401J71618L11831n5731B09190L5196J02529P6163b837B29456J38934
$$ 144401 316019 627850 572119 209190 244386 346915 423078 -2837 229456 368390
16390C68390L3616J67732r2240N623A92212K77299A32866L68832I6557K01569
$$ 368390 402006 569738 477498 483121 192212 469511 132866 501698 96557 298126
16380B98126J28767A54988D4970j6439O35746l28670A52735M08254B78682J47670
$$ 298126 426893 154988 44970 28531 664277 335607 152735 560989 278682 426352
16370D26352A28653M37021l6785B48150J10097h3086C59113A29703a05580B63104
$$ 426352 128653 565674 528889 248150 358247 -83086 359113 129703 -105580 263104
16359A14421M614P0594J68384c9702E3927b596B70899R5427M198O6735j90068
$$ 114421 119035 189629 358013 -39702 53927 -2596 270899 366326 370524 437259 247191
16348B47191J1080h189I0349J78716P9755J51780B43430r8866a5804F0738L06290
$$ 247191 258271 -8189 90349 269065 348820 500600 243430 144564 -15804 60738 367028
16337C67028H7179Q4789K08999A09931p938o215M58329B22407g1830h551l365
$$ 367028 87179 171968 380967 109931 101993 95778 554107 222407 -71830 -8551 -11916
16326a1916C25686a54496B30441b2619I638P8152K53922b1492D40323H4406J88000
$$ -11916 325686 -154496 230441 -22619 9638 87790 341712 -21492 440323 84406 272406
16315B72406f129C3888J43040K3232h732o8105A63549j4853Q2215n5787a37817
$$ 272406 -6129 33888 176928 200160 -8732 -76837 163549 148696 230911 175124 -137817
16303A85722q3470L98118f0056B03161J4041a4873B63759H8548N7587J70099e9079
$$ 185722 102252 500370 -60056 203161 217202 -14873 263759 88548 146135 316234 -59079
16291d9836C94408A34111j8599k187k3825a17316j6764B17670a35751C8373f7861
$$ -49836 394408 134111 115512 113325 89500 -117316 -134080 217670 -135751 38373 -67861
16279f932C7968N1852C2683M5578C3022O7640h2682B58146a19403A20853E2297
$$ -6932 37968 89820 32683 78261 33022 100662 -82682 258146 -119403 120853 52297
16267H1602L81616j88679i9011A02620K09339a25248K9449E56157j56372j51498
$$ 81602 463218 274539 -99011 102620 311959 -125248 -95799 556157 399785 248287
16257B48287a09726B79377D119d6283K2894E08704c87171h8738A0764J95157K35039
$$ 248287 -109726 279377 4119 -46283 -23389 508704 -387171 -88738 10764 205921 440960
16246D40960A5073Q6866b56022P9060D3832a3848A20476a27557A28187O487g1150
$$ 440960 15073 101939 -256022 -176962 43832 -13848 120476 -127557 128187 134674 -71150
16234a01775j47433A18974O4657l1916N0629o276E1382R0904k2796K8550i1126
$$ -101775 -249208 118974 183631 151715 202344 196068 51382 142286 119490 148040 -91126
16222A82797C5709a64332A68230l645l5640J48445a36688M0291k9232I9234a26869
$$ 182797 35709 -164332 168230 164585 128945 277390 -136688 -96397 -125629 99234 -126869
16210I485Q1468a29644A84302B1232J49772b29648A0048a84078F2792K6845d9603
$$ 9485 90953 -129644 184302 21232 171004 -229648 10048 -184078 62792 89637 -49603
16198a44749A83557E1731M215P4302c0769A01775A9611K08028j04258A7531c6608
$$ -144749 183557 51731 55946 130248 -30769 101775 19611 227639 123381 17531 -36608
16186E6797C399b8190A02760a88961D045J2916i4112q5454m01100b22009B22108
$$ 56797 3399 -28190 102760 -188961 4045 16961 -94112 -179566 -580666 -222009 222108
16174c39435d4950C61505D2562g7846a0815m0480k24775O6226f5098n1947j40612
$$ -339435 -44950 361505 42562 -77846 -10815 -51295 -276070 -209844 -65098 -117045 -257657
16163b57657f4739A70577J09550C6201M44405G069b76689h9673k18462D2006a7785
$$ -257657 -64739 170577 280127 36201 480606 7069 -276689 -89673 -308135 42006 -17785
16151b21089J8317e0864E4949J36731J01310a09720L2767H7180a53388g4309l91905
$$ -221089 -202772 -50864 54949 191680 292990 -109720 -76953 87180 -153388 -74309 -466214
16140d66214J70667f9175l43229b00983k0423a02531j16330k6541A32147b67830
$$ -466214 -295547 -69175 -412404 -200983 -221406 -102531 -218861 -245402 132147 -267830
16129b57930E3462j7158J05629L05549b33106b4622A38178a04404b3227A72410
$$ -257930 53462 36304 141933 447482 -233106 -24622 138178 -104404 -23227 172410
16118B50067M6834l7775j23425D9794f0712A38614g8256o9669e4308e960B14876
$$ 250067 296901 259126 135701 49794 -60712 138614 -78256 -147925 -54308 -5960 214876
16106h535k47165B56193A20738J07008L5443D0830a31800n7818m6169C12108b93985
$$ -8535 -255700 256193 120738 227746 263189 40830 -131800 -189618 -235787 312108 -293985
16094i6572A8906O40J40930b18437E4995m852J26407B4796a2658j82708C17063
$$ -96572 18906 19546 160476 -218437 54995 50143 176550 24796 -12658 -195366 317063
16082B29069a00278A14665d0747D850J25377L49392A28439a22503A5913b31702
$$ 229069 -100278 114665 -40747 4850 130227 479619 128439 -122503 15913 -231702
16071h6330l38206e0867j5965C28179C3014a09824b9338k2599H1604K34552A7558
$$ -86330 -424536 -50867 -66832 328179 33014 -109824 -29338 -51937 81604 316156 17558
16059c9961I8835R6876e25732a92955q4319J08767B07694O955a54916A40936a95494
$$ -39961 98835 195711 -525732 -192955 -277274 -168507 207694 214649 -154916 140936 -195494
16047g5384j65779D2904P471i2015c4593G2043b43134K4732I0587i4934J5818
$$ -75384 -241163 42904 50375 -92015 -34593 72043 -243134 -218402 90587 -94934 -79116
16036g9116a1012B29770b2666k82235a13976D72b34206A27040B0937K6774J50427
$$ -79116 -11012 229770 -22666 -304901 -113976 472 -234206 127040 20937 47711 198138
16025A98138n971f8927l9718F7423f5748B94309A15288a2951j85213m5321B6252
$$ 198138 192167 -68927 -108645 67423 -65748 294309 115288 -12951 -198164 -243485 26252
16013d4066r5155r7134j2885E0166J97268A17137d659G3217J02951g7200A5683
$$ -44066 -139221 -236355 -249240 50166 247434 117137 -4659 73217 176168 -77200 15683
16001c16077A27023l772b30093K5710A28937c25462G4092a57514A83130C4126
$$ -316077 127023 123251 -230093 -204383 128937 -325462 74092 -157514 183130 34126
15990b65144N6302A2286R71E84K9964g2146A32742n5865K77161I2305O0613C7201
$$ -265144 -208842 12286 13257 584 30548 -72146 132742 76877 354038 92305 152918 37201
15977b129A73909b89433M7922e3477D5090K5274Q7130K41130e5065k37949a12914
$$ -2129 173909 -289433 -241511 -53477 45090 70364 157494 398624 -55065 -293014 -112914
15965c6655A70361O9175c4097j34374A87178J91778a58607O7420A9997J6135J78179
$$ -36655 170361 239536 -34097 -168471 187178 378956 -158607 -91187 19997 36132 214311
15954B14311b36503B7467b02869A35318d7526C518b26816C25816F7033h9463c8698
$$ 214311 -236503 27467 -202869 135318 -47526 3518 -226816 325816 67033 -89463 -38698
15942g3688l23877J46461A8531K38497a25342e5244k22583i848m28960D4337c6183
$$ -73688 -397565 -251104 18531 257028 -125342 -55244 -277827 -9848 -438808 44337 -36183
15930i2647J5043k5411D0856a0866j70060l6209M5870n4060o0343B09954a84222
$$ -92647 -77604 -103015 40856 -10866 -180926 -217135 -171265 -225325 -285668 209954 -184222
15918B47867j0359b74429j05480a37170B03329N2336h7954a6579C51891A34656
$$ 247867 237508 -274429 -379909 -137170 203329 255665 -87954 -16579 351891 134656
15907b4709J0653j72447I8548J5131d1388A00182a44102c9924l3366B73666a46907
$$ -24709 -14056 -186503 98548 113679 -41388 100182 -144102 -39924 -73290 273666 -146907
15895a53168m8550E0673J3154J36541a29686D1731N9492L73640d43224A1497M7115
$$ -153168 -201718 50673 63827 200368 -129686 41731 101223 474863 -443224 11497 58612
15884E8612M5001i0538A8980a62835C11135A07581i9269B31589b19j16413N4576
$$ 58612 103613 -90538 18980 -162835 311135 107581 -99269 231589 -219 -116632 -62056
15873f2056j75700G4845a88099k5693d5811p1962B28937q9206a20873n6429d3485
$$ -62056 -237756 74845 -188099 -213792 -45811 -117773 228937 139731 -120873 -177302 -43485
15861E1594b90012f7448E9877j443c30290C34943a45036M4856f483A06203d8904
$$ 51594 -290012 -67448 59877 58434 -330290 334943 -145036 -100180 -6483 106203 -48904
15849b39694B50054R5269c64408B0767b00961O6747I2430a05616m24554a41278
$$ -239694 250054 345323 -364408 20767 -200961 -134214 92430 -105616 -530170 -141278
15838c2186j77635a00666B395L12607i9791D053K42475F1238a33457B10642D628
$$ -32186 -209821 -100666 2395 315002 -99791 4053 246528 61238 -133457 210642 4628
15826b43604B37281h8616B53939a35700k1805j29236B01335h4028I5732g8116
$$ -243604 237281 -88616 253939 -135700 -157505 -286741 201335 -84028 95732 -78116
15815B0958L3810r253b43735e8159A66474B9639c4903j09211l2464j02127b5933
$$ 20958 54768 45515 -243735 -58159 166474 29639 -34903 -144114 -176578 -278705 -25933
15803B25074a69958C9870F829a58023d0450p0274j98031k2662M4286J16275c8242
$$ 225074 -169958 39870 6829 -158023 -40450 -110724 -308755 -331417 -287131 -170856 -38242
15791f9487m83062B14285b13375k1639O0337N2345j42144F1977g1314a3750r1553
$$ -69487 -552549 214285 -213375 -235014 -174677 -122332 -264476 61977 -71314 -13750 -105303
15780a05303B26964a69258N486E11J88658n8112a22762B6226g509m1009o1241
$$ -105303 226964 -169258 -163772 511 189169 131057 -122762 26226 -7509 -48518 -109759
15769a09759K0891k6938l73413K06267b3163A49150R7209d381A45606e5667r5228
$$ -109759 -88868 -115806 -489219 -282952 -23163 149150 246359 -4381 145606 -55667 -150895
15758a50895j9434m5701B22297m7774p5575a7546A61459L9864c3929k18541E1197
$$ -150895 -170329 -216030 222297 174523 98948 -17546 161459 201323 -33929 -252470 51197
15746E88968d29620a48588D98443a11212G4502J7767a13186B254c30574N9757
$$ 588968 -429620 -148588 498443 -111212 74502 92269 -113186 2254 -330574 -270817
15736b70817B02399a03309c8734A21842b04078d3907J668j05962k02789a31746
$$ -270817 202399 -103309 -38734 121842 -204078 -43907 -42239 -148201 -350990 -131746
15725c10183B6387L3607j975J79708a34907d124j41309j15342A80129p9615c1327
$$ -310183 26387 59994 58019 237727 -134907 -4124 -145433 -260775 180129 100514 -31327
15713D4936h3214G6316c04830a15481B0313b74191a0474B18153c17554O9155f4088
$$ 44936 -83214 76316 -304830 -115481 20313 -274191 -10474 218153 -317554 -248399 -64088
15701G3397J77221j1268b48511D7480b7286j30944A77045N4573a21627A51405
$$ 73397 250618 239350 -248511 47480 -27286 -158230 177045 231618 -121627 151405
15690A21567O1109J59666a21686G0266M057b55731B60318b34235C0737b44262
$$ 121567 182676 342342 -121686 70266 74323 -255731 260318 -234235 30737 -244262
15679A1822J03612a37287B0303a10207A28047a21672j9337l4292I7880J38851
$$ 11822 115434 -137287 20303 -110207 128047 -121672 -141009 -175301 97880 236731
15669B36731A4228b60906A0568Q4034h5981F3598b25868a00065k2795q1906I4050
$$ 236731 14228 -260906 10568 94602 -85981 63598 -225868 -100065 -122860 -204766 94050
15657B24651G4557c01250j02851a07960l0e1989p3386B21169a98383k2632A1978
$$ 224651 74557 -301250 -404101 -107960 -107990 -51989 -125375 221169 -198383 -221015 11978
15645b14962J4505b2544F2904R9856c4665k31559A34847b74753B90213r2150q3450
$$ -214962 -200457 -22544 62904 162760 -34665 -266224 134847 -274753 290213 198063 114613
15634A14613c70204A31551J315c1296m6885j16030a8575j71730j53282D6194a93392
$$ 114613 -370204 131551 132866 -31296 -78181 -194211 -18575 -190305 -343587 46194 -193392
15622G7079a27065A98965L817r7087M8362A6686h7541P043C37139A0855a59386
$$ 77079 -127065 198965 202782 105695 154057 16686 -87541 -80498 337139 10855 -159386
15610a12004a3732B81538i0900B630J02497a26445K1874A60481B0548K19803b30080
$$ -112004 -13732 281538 -90900 2630 105127 -126445 -104571 160481 20548 240351 -230080
15598A333J87881Q4543a92452G6372i6931A52716c05977j24650a05102D9619k825
$$ 1333 189214 273757 -192452 76372 -96931 152716 -305977 -430627 -105102 49619 46794
15587D6794J1515p427n684J33310f2135j61249h9950k62117f7990A92976e3990
$$ 46794 58309 50882 45198 178508 -62135 -223384 -89950 -352067 -67990 192976 -53990
15575e9768q838F5207a86786A6019B59J74469G3062k455c531k09789C969a45428
$$ -59768 -68606 65207 -186786 16019 259 174728 73062 70607 -3531 -213320 3969 -145428
15562a4555l27364A81880A5452d8630o8671B10687G6137J65407M2563a5051n536
$$ -14555 -341919 181880 15452 -48630 -117301 210687 76137 241544 284107 -15051 -20587
15551b0587B13738r7911b80006j42268i6850H9393D2960e4512J5770F5501Q8665
$$ -20587 213738 115827 -280006 -422274 -96850 89393 42960 -54512 -38742 65501 154166
15540A54166B3288O50116c15642F812a4749q0930a0952D77340k25047D1685O4202
$$ 154166 23288 673404 -315642 6812 -14749 -95679 -10952 477340 252293 41685 105887
15529A05887J08613p2496J56118C1188K31083A0672N8248a66807I1062p627f0103
$$ 105887 214500 142004 298122 31188 262271 10672 68920 -166807 91062 83435 -60103
15517H2312M6826d5320r7271j47732J19000h24j76740f4926j05776d3900j10451
$$ 82312 129138 -45320 -142591 -290323 -171323 -824 -177564 -64926 -170702 -43900 -154351
15506a54351E4031a18925q5713G9105h2797D1080a26449j5114d1103B82521j06162
$$ -154351 54031 -118925 -204638 79105 -82797 41080 -126449 -141563 -41103 282521 176359
15495A76359C3545L7109L23700c8941j82797H5624a44120B31840b09675B50049
$$ 176359 33545 70654 394354 -38941 -221738 85624 -144120 231840 -209675 250049
15484a1722C01981D6812a44491r2971I0691L4036a7021k5637a8000A26479k659
$$ -11722 301981 46812 -144491 -237462 90691 124727 -17021 -42658 -18000 126479 123820
15473A23820a05826k14408F5069J81006H8563P7116a42682c8868j0067B76436
$$ 123820 -105826 -320234 65069 246075 88563 165679 -142682 -38868 -48935 276436
15462a78486l9073E6699J30394g4518j50220I7895M05377A26758a73655L5165
$$ -178486 -217559 56699 187093 -74518 -224738 97895 503272 126758 -173655 -138490
15452a38490c6355I2826a3702j97347e8840I2896f8415j3937j40611I344O7871
$$ -138490 -36355 92826 -13702 -211049 -58840 92896 -68415 -82352 -222963 9344 77215
15441G7215J56773c5435j92344B86432c7105A27570a54315A01666a78756B99099
$$ 77215 233988 -35435 -227779 286432 -37105 127570 -154315 101666 -178756 299099
15430e5573C18663b6725k05377k4879F3237a6961n9384l79842d0300B78799j33331
$$ -55573 318663 -26725 -232102 -256981 63237 -16961 -76345 -456187 -40300 278799 145468
15419A45468m1345K93347A82992K41895d2254A21161l7819h261j61411Q48A95155
$$ 145468 104123 397470 182992 424887 -42254 121161 83342 -8261 -169672 -168824 195155
15407a06825K7763I4139i9819A44994O4789a11331A7012p815a64136H6762h1748
$$ -106825 -79062 94139 -99819 144994 209783 -111331 17012 9197 -164136 86762 -81748
15395b1433G9201J32617n7630b18691i9411D4256J41400b31849D832N9279K18777
$$ -21433 79201 211818 154188 -218691 -99411 44256 185656 -231849 4832 64111 282888
15384B82888j34107l1846a201B41471e5189n1424m5372I1935d7985A88630b21651
$$ 282888 148781 116935 -1201 241471 -55189 -106613 -151985 91935 -47985 188630 -221651
15372A4133N3146k2613J9441P8412b59180j79104H0123a94788p1452e4114A04589
$$ 14133 67279 44666 64107 142519 -259180 -438284 80123 -194788 -266240 -54114 104589
15360B26273H2283b85711a01602b807A66968A9951K53933c09494A254a46751a8302
$$ 226273 82283 -285711 -101602 -2807 166968 19951 273884 -309494 1254 -146751 -18302
15348a66980I3128k8005i8561d0819H6503J35224a28924I3955d91371B11719a56252
$$ -166980 93128 65123 -98561 -40819 86503 221727 -128924 93955 -491371 211719 -156252
15336A61627g5756A66354D8114Q8619n9920M34509G3535K36399a34533D40275
$$ 161627 -75756 166354 48114 136733 76813 511322 73535 309934 -134533 440275
15325A3157B01K88025G595a04697A50837g9535E1357O6049B3479J7735J539b79147
$$ 13157 201 288226 7595 -104697 150837 -79535 51357 117406 23479 41214 42753 -279147
15312E3807P0345f47E24424g7409b3602B69612a75298B52900D7397J21088M2558
$$ 53807 124152 -647 524424 -77409 -23602 269612 -175298 252900 47397 168485 211043
15301B11043L79565b58687j65488A70805a9643A11817J80760e782E868Q8645a62052
$$ 211043 590608 -258687 -424175 170805 -19643 111817 292577 -5782 5868 94513 -162052
15289a42225l6936B36949b67777B4450b43764B92953g0628C4648R3283a77638
$$ -142225 -179161 236949 -267777 24450 -243764 292953 -70628 34648 127931 -177638
15278c2221C54716b98534b406B87794q9301G2846b7864C7304A3378J37846a64637
$$ -32221 354716 -298534 -2406 287794 198493 72846 -27864 37304 13378 151224 -164637
15266a85600C65725A4717g7763C86859A90950m2842p2909K5559M25724a00160
$$ -185600 365725 14717 -77763 386859 190950 148108 75199 100758 526482 -100160
15255c71815a1828a01C51023i6786D08503A84959J81604K77681M964J099683j48487
$$ -371815 -11828 -101 351023 -96786 408503 184959 366563 644244 649208 1748891 1600404
15244A600404n50060K79036E02544j48587C7614b6293I1587A7153O2216J84211
$$ 1600404 1050344 1329380 502544 353957 37614 -26293 91587 17153 79369 263580
15234B63580e7895C35065A08628b71103g3922C77466G9125J52506q4627d5566
$$ 263580 -57895 335065 108628 -271103 -73922 377466 79125 231631 147004 -45566
15223B1179J91348A0097b4244k79036B23363c9278k13895A42599M9355B4635J88049
$$ 21179 212527 10097 -24244 -303280 223363 -39278 -253173 142599 191954 24635 212684
15212B12684C9496J34576J08155b56100B44743A17518l1448c29028E6775K42359
$$ 212684 39496 174072 282227 -256100 244743 117518 86070 -329028 56775 299134
15202B99134a45953D04410A34130J90457j07339p5969K97516a09432C2319c5243
$$ 299134 -145953 404410 134130 324587 217248 141279 438795 -109432 32319 -35243
15191H3007J10512b58672A65356e3279A48302K56351c9839B08301i3772I1202
$$ 83007 193519 -258672 165356 -53279 148302 404653 -39839 208301 -93772 91202
15180A45344m7541i4596K2431A11926b24474g5942C28464b0227A73081c42366
$$ 145344 97803 -94596 -72165 111926 -224474 -75942 328464 -20227 173081 -342366
15169B01325I0375d2850D121b1658j18133A69866J029n4607j776B1510L05306
$$ 201325 90375 -42850 4121 -21658 -139791 169866 170895 116288 114512 21510 326816
15158C26816J6469p5190R5155A79075M2575n5552B142a36592C6740b74611B33137
$$ 326816 343285 268095 363250 179075 221650 166098 2142 -136592 36740 -274611 233137
15146I3801b20621B02386H5037J60327A8677c0062C87927j70337m3891E7093J65509
$$ 93801 -220621 202386 85037 245364 18677 -30062 387927 217590 173699 57093 222602
15135B22602A6298L764K60030b21489B47320H0555c1906C03462a51409A01145
$$ 222602 16298 20062 280092 -221489 247320 80555 -31906 303462 -151409 101145
15124A66982q3009J0712K65269a85153B74031K794a55012c2307K423B5119J93560
$$ 166982 83973 94685 359954 -185153 274031 276825 -155012 -32307 -29884 25119 218679
15113B18679J89437A66554J60508A52630R6300f2640b7551j15229j35194A75025
$$ 218679 408116 166554 327062 152630 248930 -62640 -27551 -142780 -277974 175025
15102C3748O5553d7319A42353a15950B50216K35898k13249j02626J56647h567
$$ 33748 99301 -47319 142353 -115950 250216 486114 272865 170239 326886 -8567
15091B09603I5806K4473d0812E8010r462K5841a40708D1676K12609o9349a70853
$$ 209603 95806 120279 -40812 58010 48548 74389 -140708 41676 254285 184936 -170853
15079A63451M0748c1169B90729F1637Q1046D2990i1093D836c0948j1881k0940
$$ 163451 204199 -31169 290729 61637 142683 42990 -91093 4836 -30948 -42829 -63769
15068f3769C18921a70236d30j8291A82869q130J5859r616g111C61589A25622d9982
$$ -63769 318921 -170236 -430 -18721 182869 174739 190598 180982 -7111 361589 125622 -49982
15055G8055L5641J34341O1179q6356a895C21175A40895o6029J40138j07058J92849
$$ 78055 113696 248037 309216 222860 -1895 321175 140895 74866 215004 107946 300795
15044C00795D1186b29519B68717p2A13352J31636N30512C02295I9018f5670C94730
$$ 300795 41186 -229519 268717 268645 113352 244988 775500 302295 99018 -65670 394730
15032A76729K20538a16135E9463L02237e6941B41939J69699A69808c1733G0585
$$ 176729 397267 -116135 59463 361700 -56941 241939 411638 169808 -31733 70585
15021A57556P993a621A20300b3105Q973A80957F9159J17894C4977K13989j04173
$$ 157556 165549 -1621 120300 -23105 -14132 180957 69159 187053 34977 248966 144793
15010A44793J65331r8160M7964O7349h8896A60455F9988a1201A02804A8755K31227
$$ 144793 310124 211964 259928 327277 -88896 160455 69988 -11201 102804 18755 249982
14999B49982O2517F1068L12316j33741K1768A02426J11895l604j05167J78457
$$ 249982 312499 61068 373384 239643 261411 102426 214321 210717 105550 284007
14989B84007A29795a70061D43186Q4544k61177j19786N3946J573l7213P531k3838
$$ 284007 129795 -170061 443186 527730 266553 146767 200713 202286 165073 172604 148766
14978A48766J93608G8635L66890B01330K31515A45066L5982K58601B07908J85916
$$ 148766 342374 78635 445525 201330 432845 145066 181048 439649 207908 393824
14968C93824j19858K67650r1697G484K21850k7867F9993N02075k31760p7358B2332
$$ 393824 273966 541616 449919 7484 229334 201467 69993 572068 340308 262950 22332
14956D35809J15467k36133A42193k9229M54500A26379J46334J25459I9176L2303
$$ 435809 551276 315143 142193 112964 567464 126379 272713 398172 99176 131479
14946A31479L76731B13878K15670b1014D01784m4592A68113D5919e1869I1017
$$ 131479 508210 213878 429548 -21014 401784 357192 168113 45919 -51869 91017
14935D45806k00708q9266I887K81874M009g413F1014J56924q8680L24749j77118
$$ 445806 245098 155832 9887 291761 295770 -7413 61014 217938 129258 454007 276889
14924B76889o4067L26393F4964K43662K74105I3935K46716J01234j89264J27333
$$ 276889 212822 539215 64964 308626 582731 93935 340651 441885 252621 379954
14914C79954A22722K14857k2315j10836O8272o5073K48590r0192K45324d3359
$$ 379954 122722 337579 315264 204428 272700 207627 456217 366025 611349 -43359
14903A63886L42871I5888J79614K0587j44312j6689N0926P7262J17035j18865
$$ 163886 506757 95888 275502 296089 151777 135088 186014 263276 380311 261446
14893B61446A29312D3789L23190Q6344J57156k67249m177A66317J54323C6484
$$ 261446 129312 43789 366979 453323 610479 343230 339053 166317 320640 36484
14882C10175K84275B31797D5742L06597j02567j12902J21390J09169K23258E6159
$$ 310175 594450 231797 45742 352339 249772 136870 258260 367429 590687 56159
14871D34984j42250K43307k54772K1929P6642j24328J7050m5543N7479L68696
$$ 434984 292734 536041 281269 303198 379840 255512 272562 227019 284498 653194
14861F53194N4602l51379j70414L03180j12865J59928K10342j77622L797r0185
$$ 653194 707796 356417 186003 489183 376318 536246 746588 568966 572763 482578
14851D82578J33721A74815M71890B38002K4382j22992J93934j09497K44134j00615
$$ 482578 616299 174815 646705 238002 262384 139392 333326 223829 467963 367348
14841C67348M9759N8034J75118k83585k7751R9955J17823Q6117k27369k1081r8163
$$ 367348 417107 475141 650259 366674 338923 438878 556701 642818 415449 394368 296205
14830B96205L91280p5079r9917J60003n7173p1623J6721k5821j80352L50182j71716
$$ 296205 687485 612406 512489 672492 615319 543696 560417 534596 354244 704426 532710
14819E32710J39115j37960P6648l9227B81603J50780L67825C89229K03628j6821
$$ 532710 671825 533865 610513 571286 281603 432383 800208 389229 592857 576036
14809E76036r0123k5988M9285J51871k51095J4089j20767N71703B34396L99271
$$ 576036 485913 459925 509210 661081 409986 424075 303308 875011 234396 633667
14799F33667n567j50123K3062J19416J9402Q8057j13471m1136n5944J2224R3978
$$ 633667 628100 477977 501039 620455 639857 727914 614443 573307 517363 529587 623565
14788F23565J92100l96630L51003j71265m2051J78090l32730n01j06854A43452
$$ 623565 815665 419035 770038 598773 556722 734812 402082 401581 294727 143452
14777I41310l39596p5263K34915B15727N50550M6845k32866j67562J69146J50704
$$ 941310 601714 526451 761366 215727 766277 813122 580256 412694 581840 732544
14767G32544j99603m2006O3694R2933B48830L28153J43584J15232l40914r0229
$$ 732544 532941 490935 554629 647562 248830 576983 720567 835799 494885 404656
14757D04656N1436K78598O6512j51396p5468M1387J10759j19304Q4594q4516n0189
$$ 404656 456092 734690 801202 649806 574338 615725 726484 607180 691774 607258 557069
14746E57069K03814l02688r6008N70349r4194P1498j51747M7791k6326Q5489m4363
$$ 557069 760883 458195 362187 932536 838342 909840 758093 805884 779558 865047 820684
14735H20684k78734L15769k52551L15613j21710j94772N8810o7076P9112K43966
$$ 820684 541950 857719 605168 920781 799071 604299 663109 596033 675145 919111
14725I19111j66187K02553O2270k25687j47579J12018j93647J84353N78231m56746
$$ 919111 752924 955477 1017747 792060 644481 756499 562852 747205 1325436 868690
14715H68690M6010k15433M2324K7450k56802K65084K07366K88086l20165k15206
$$ 868690 914700 699267 741591 769041 512239 777323 984689 1272775 952610 737404
14705G37404n7541K34039R3007o7843k15951j5648C45297N86780P6481j22630
$$ 737404 679863 913902 1006909 939066 723115 707467 345297 932077 1008558 885928
14695H85928L96868n76172J22378j25800M5418N6394M81049n34180J73768K33668
$$ 885928 1282796 706624 829002 703202 748620 805014 1286063 751883 925651 1159319
14685A159319J21101j17868l77903K35592M4893j08219k73875P6377K39065j99541
$$ 1159319 1280420 1162552 784649 1020241 1065134 956915 683040 759417 998482 798941
14675G98941j59798P47684n74863J68724R6511Q608k13552L34990q9929l82670
$$ 798941 639143 1386827 811964 980688 1077199 1085807 872255 1207245 1117316 734646
14665G34646L58598l45298M73976J66946m00392j00974K75798K93630j44831l59201
$$ 734646 1093244 747946 1221922 1388868 988476 887502 1163300 1456930 1312099 952898
14655I52898L89473j25824j90304O48110l80157J1427N6524k25227P7511J04189
$$ 952898 1342371 1216547 1026243 1674353 1294196 1305623 1362147 1136920 1214431 1318620
14645A318620j24237J16008J7448q1602n3435j17861K00424j46471K24528q7990
$$ 1318620 1194383 1310391 1327839 1246237 1192802 1074941 1275365 1128894 1353422 1265432
14635A265432J42770n16042M42806k71077L35812j01123k72417L70001K21443
$$ 1265432 1408202 892160 1334966 1063889 1399701 1298578 1026161 1396162 1617605
14626A617605p9087m62508J78052K76746k90993J31902L43698k08810M0989R74
$$ 1617605 1538518 1076010 1254062 1530808 1239815 1371717 1715415 1506605 1547594 1548568
14616A548568O6944j86348K41422l49248l8206M55263j13298p8318o1924P3534
$$ 1548568 1615512 1429164 1670586 1321338 1283132 1738395 1625097 1546779 1484855 1558389
14606A558389N7677o8919K12996m8363R7798j36991l61468N40647l63661P3781
$$ 1558389 1616066 1547147 1760143 1711780 1809578 1672587 1311119 1851766 1488105 1561886
14596A561886J3360J16447Q5812n16052K42672M16083j93817J07527j443O7626
$$ 1561886 1575246 1691693 1777505 1261453 1504125 1920208 1726391 1833918 1832475 1900101
14586A900101l88017J90724M216L64000J70301k58412o5386R5010J50221j47187
$$ 1900101 1512084 1702808 1707024 2071024 2241325 1982913 1917527 2012537 2162758 2015571
14576B015571K73071l06384L16379J2823k32435N42490m55016m3504L4694K47067
$$ 2015571 2288642 1982258 2298637 2311460 2079025 2621515 2166499 2122995 2157689 2404756
14566B404756O6742n6005J19820l17821M63092l26157K32091j07063O98893k09343
$$ 2404756 2471498 2415493 2535313 2217492 2680584 2354427 2586518 2479455 3178348 2969005
14556B969005K45826M67822l94242O79196J33646J115153J902508L426416P126686
$$ 2969005 3214831 3682653 3288411 3967607 4101253 5216406 7118914 10545330 17672016
14547A7672016N718948J2892044N808897B0205123I898024k758884k937876j303971
$$ 17672016 23390964 36283008 42091905 20205123 9898024 7139140 4201264 2897293
14539B897293q25612L92167n36809K11497K13233m14196N36871l85672j29020
$$ 2897293 2071681 2463848 1927039 2138536 2351769 1937573 2474444 2088772 1959752
14530A959752J32954L9531r0826M2915M09990l84157K54664j39989L15292J3471
$$ 1959752 2092706 2132237 2041411 2084326 2494316 2110159 2364823 2224834 2540126 2553597
14520B553597o5780l0108K64060j13213J95558l08866l2186M28417p1952p6553
$$ 2553597 2487817 2457709 2721769 2608556 2804114 2495248 2463062 2891479 2819527 2742974
14510B742974J6249J28480J21699K32967l96145K33955J22570l42351N06051j72139
$$ 2742974 2759223 2887703 3009402 3242369 2846224 3080179 3202749 2860398 3366449 3194310
14500C194310K3393k83929J10288O6615j46084P63506k58796l40631M86750m7807
$$ 3194310 3217703 2933774 3044062 3110677 2964593 3728099 3469303 3128672 3615422 3567615
14490C567615N6557j5668L70498j83552R0107N1844k316J74354n0872j81982P8370
$$ 3567615 3624172 3608504 3979002 3795450 3885557 3937401 3935085 4109439 4058567 3876585 3954955
14479C954955J26936J62129p6180k33626K11373o146J05209K96714l88322J45586
$$ 3954955 4081891 4244020 4167840 3934214 4145587 4139441 4244650 4541364 4153042 4298628
14469D298628L17106L91839j89109j35281J89065l26458L76668l48258L28188
$$ 4298628 4615734 5007573 4818464 4683183 4872248 4545790 4922458 4574200 4902388
14460D902388P9906j4472K33031j9638N2049J33413r976L69538k58703r2204J24259
$$ 4902388 4982294 4967822 5200853 5181215 5233264 5366677 5356701 5726239 5467536 5375332 5499591
14449E499591J10523K5424k4884O5895J64590K25896j6563K50000o0980n8848
$$ 5499591 5610114 5635538 5610654 5676549 5841139 6067035 6050472 6300472 6239492 6180644
14439F180644k9209M87666k63516J61637k33591N40813l85760K50513K00880K46933
$$ 6180644 6151435 6639101 6375585 6537222 6303631 6844444 6458684 6709197 6910077 7157010
14429G157010k97426J9857N42652j13984M55462k89587K91349J70771J36378O2103
$$ 7157010 6859584 6879441 7422093 7308109 7763571 7473984 7765333 7936104 8072482 8134585
14419H134585K00353j73827L03516K0071K47682m2653k1390J74852M17312l45033
$$ 8134585 8334938 8161111 8464627 8484698 8732380 8689727 8668337 8843189 9260501 8915468
14409H915468L99942K37793K77183n3156o3253N51399L97535k96697M31327K11541
$$ 8915468 9315410 9553203 9830386 9777230 9713977 10265376 10662911 10366214 10797541 11009082
14399A1009082j84098J14461N34213m8755L08565r4701J88693N42430P2128K16776
$$ 11009082 10824984 10939445 11473658 11424903 11733468 11638767 11827460 12369890 12442018 12658794
14389A2658794L68979K38155L08494p5637L71579L44060J38992K28130M00049
$$ 12658794 13027773 13265928 13574422 13498785 13870364 14214424 14353416 14581546 14981595
14380A4981595R4434L43871K9714N84336K13920L20474N13843J95763J89566M18907
$$ 14981595 15076029 15419900 15449614 16033950 16247870 16568344 17082187 17277950 17467516 17886423
14370A7886423N88805j69071J186678O4980J92203L12765O93778Q35276M8312
$$ 17886423 18475228 18306157 19492835 19557815 19750018 20062783 20756561 21591837 21640149
14361B1640149P20674J61254P36351M87578P07350Q66880j62853P58089K76071
$$ 21640149 22360823 22522077 23258428 23746006 24453356 25320236 25157383 25915472 26191543
14352B6191543R37049N00328R54952K38974J088767J031491P16585Q34716P71133
$$ 26191543 27128592 27628920 28583872 28822846 29911613 30943104 31659689 32494405 33265538
14343C3265538Q43974R06819Q76189Q85606J188674J085461Q45389J371547J196249
$$ 33265538 34109512 35016331 35892520 36778126 37966800 39052261 39897650 41269197 42465446
14334D2465446J227248J495134J493219J539899J403641J499431J400169K009135
$$ 42465446 43692694 45187828 46681047 48220946 49624587 51124018 52524187 54533322
14326E4533322J539321K006450K077919J661894L063533J755966K244540K531189
$$ 54533322 56072643 58079093 60157012 61818906 64882439 66638405 68882945 71414134
14318G1414134K893076L145711K806009L179764L385389L103741L953897L876808
$$ 71414134 74307210 77452921 80258930 83438694 86824083 89927824 93881721 97758529
14310I7758529L906947M623478M551663M852015N313073N386506O080796O794332
$$ 97758529 101665476 106288954 110840617 115692632 121005705 126392211 132473007 139267339
14302A39267339O074327O975729P357287P792820Q452956R059159R309668R863121
$$ 139267339 145341666 152317395 159674682 167467502 175920458 184979617 194289285 204152406
14294B04152406J0962091J0749159J1886114J2402273J3206169J3608290J4140063
$$ 204152406 215114497 225863656 237749770 250152043 263358212 276966502 291106565
14287B91106565J5156841J5170941J5728971J6024026J6157961J6127534J6327659
$$ 291106565 306263406 321434347 337163318 353187344 369345305 385472839 401800498
14280D01800498J5646526J5451683J4468566J3485945J1822577R707801M716015
$$ 401800498 417447024 432898707 447367273 460853218 472675795 482383596 487099611
14273D87099611k328577o735960l004076M104858J783762n369839o450456q531154
$$ 487099611 484771034 478035074 475030998 479135856 480919618 475549779 469099323 460568169
14265D60568169j1485683j2032647j4015958j4933688j6176559j6877444j6645550
$$ 460568169 449082486 437049839 423033881 408100193 391923634 375046190 358400640
14258C58400640j6976491j6637216j6475464j5430442j5234592j3545130j2863167
$$ 358400640 341424149 324786933 308311469 292881027 277646435 264101305 251238138
14251B51238138j3288037j2042397j1607369j1247498r981396r017139r404215
$$ 251238138 237950101 225907704 214300335 203052837 193071441 184054302 174650087
14244A74650087q167233p978144p665771o908171o944799n687358n921894n218660
$$ 174650087 166482854 158504710 150838939 143930768 136985969 131298611 125376717 120158057
14236A20158057n510509m809935m745025m035272m139049l684102m114601l230276
$$ 120158057 114647548 109837613 105092588 101057316 96918267 93234165 89119564 85889288
14228H5889288l485382k908826l193160k811817k590501k501558k409147k046477
$$ 85889288 82403906 79495080 76301920 73490103 70899602 68398044 65988897 63942420
14220F3942420k034465j950012k356054k082032j756656j563607j441346j296643
$$ 63942420 61907955 59957943 57601889 55519857 53763201 52199594 50758248 49461605
14212D9461605j946745j112093j690071j087301j318601j023443j029362j089670
$$ 49461605 47514860 46402767 44712696 43625395 42306794 41283351 40253989 39164319
14204C9164319q48596j603026p52041n86890p97180j092019j061608j105777n50972
$$ 39164319 38315723 36712697 35960656 35373766 34576586 33484567 32422959 31317182 30766210
14195C0766210p34090p92066l83791r35762j115661m49118n67001m10096q71396
$$ 30766210 30032120 29240054 28856263 27920501 26804840 26355722 25788721 25378625 24507229
14186B4507229l63872o89883m67037m02741l22176o92387n34530m97918l04700
$$ 24507229 24143357 23453474 22986437 22583696 22261520 21569133 21034603 20536685 20231985
14177B0231985l23060k39728l80797m55051m17932m10323n23873n33873K69915
$$ 20231985 19908925 19669197 19288400 18833349 18415417 18005094 17481221 16947348 17217263
14168A7217263p63678k23202m07289j63898k69865l44032m12796K02271o27691
$$ 17217263 16453585 16230383 15823094 15659196 15389331 15045299 14632503 14834774 14207083
14159A4207083q7208j58673m15298l60639K49058k52510l95926m13056j08781
$$ 14207083 14119875 13961202 13545904 13185265 13434323 13181813 12785887 12372831 12264050
14150A2264050l8013l06740k91806m5062J56887o41129k96113n9243J85492m53069
$$ 12264050 12226037 11919297 11627491 11582429 11739316 11098187 10802074 10742831 10928323 10475254
14140A0475254L7228l52541J3799n04749P0215L96635p23495J9985m87039J87515
$$ 10475254 10512482 10159941 10173740 9668991 9739206 10135841 9412346 9432331 8945292 9132807
14130I132807k15765M1299j28988k65023k59415M15356k30373l38087k2023J47716
$$ 9132807 8917042 8958341 8829353 8564330 8304915 8720271 8489898 8151811 8129788 8277504
14120H277504n20543P0249j50914O8835k86225k33053M1522L20233p39685M56813
$$ 8277504 7756961 7827210 7676296 7745131 7458906 7225853 7267375 7587608 6847923 7304736
14110G304736n55700K23247k34895l27270J19898J05848o7512l34269l1576j2493
$$ 7304736 6749036 6972283 6737388 6410118 6530016 6635864 6568352 6234083 6202507 6190014
14100F190014j49637p0816n9697q1492J06916r3997L0863n25393j73505L81095
$$ 6190014 6040377 5969561 5909864 5828372 5935288 5841291 5872154 5346761 5173256 5554351
14090E554351k06152o6057k41896K34300k62744K65880k65l48493L12319n5661
$$ 5554351 5348199 5282142 5040246 5274546 5011802 5277682 5277417 4928924 5241243 5185582
14080E185582q93422L35591N4635r0534L45185m09705J71613n0664o45236M57881
$$ 5185582 4292160 4627751 4682386 4591852 4937037 4527332 4698945 4648281 4003045 4460926
14070D460926j07192l05289l734K27754p8442Q1763K3773j96514K7540j7327j16553
$$ 4460926 4353734 4048445 4044711 4272465 4194023 4275786 4299559 4103045 4130585 4113258 3996705
14059C996705Q6021j19005k2897L42972k48995j21913k5285l75416l3241j42065
$$ 3996705 4082726 3963721 3940824 4283796 4034801 3912888 3887603 3512187 3478946 3336881
14049C336881O59060l06116j34870P0727o7304m33512J01785j9456k592m4280
$$ 3336881 3995941 3689825 3554955 3625682 3558378 3124866 3226651 3207195 3204603 3160323
14039C160323J02405j12026l06602O87944n15967J58651j01271K608k60129K08549
$$ 3160323 3262728 3150702 2844100 3532044 3016077 3174728 3073457 3076065 2815936 3024485
14029C024485K48073m03089j1066o9834N61865k35611j05880k66759P8319j48184
$$ 3024485 3272558 2869469 2858403 2788569 3350434 3114823 3008943 2742184 2820503 2672319
14019B672319p0294J44321l80854K08020o988J70744k05804P9601r262j53991
$$ 2672319 2602025 2746346 2365492 2573512 2566524 2737268 2531464 2611065 2601803 2447812
14009B447812j56887J71386j28968j20932P5061J78875J07002l28367l57139K83871
$$ 2447812 2290925 2462311 2333343 2212411 2287472 2466347 2573349 2244982 1887843 2171714
13999B171714K24926m43142J43946M04533m21439j09260O0027J83749N49588P92876
$$ 2171714 2396640 1953498 2097444 2501977 2080538 1971278 2031305 2215054 2764642 3557518
13989C557518K511754O061838O269347J2192069J2789942j8521071j1468997n203505
$$ 3557518 6069272 12131110 18400457 30592526 43382468 24861397 13392400 8188895
13981H188895k141965j164060p00596m69584j71206n84667J12278M0522k18083
$$ 8188895 6046930 4882870 4182274 3712690 3541484 2956817 3069095 3109617 2891534
13972B891534l36391N4081L2934o5065N369K13764m58521n0975J83808l51823
$$ 2891534 2555143 2609224 2642158 2577093 2582462 2796226 2337705 2286730 2470538 2118715
13962B118715j39365j6892K59961m00228M06224j00748K82892j94782k31675J47554
$$ 2118715 1979350 1962458 2222419 1822191 2228415 2127667 2410559 2215777 1984102 2131656
13952B131656k00426k76600N15592k15513K73814m9698R5223n44998o2527J53424
$$ 2131656 1931230 1654630 2170222 1954709 2228523 2178825 2274048 1729050 1666523 1819947
13942A819947l39153O77669n68425M31015k45730j33336j3951n7552J56756K2767
$$ 1819947 1480794 2158463 1590038 2021053 1775323 1641987 1628036 1570484 1727240 1750007
13932A750007J95717k41949K4686O3562m15226k3079J74087L0852L8668K6455
$$ 1750007 1945724 1703775 1728461 1792023 1376797 1353718 1527805 1558657 1597325 1623780
13922A623780k5425k3762K03972l50909j01034L00612M0253q7879l58831O88406
$$ 1623780 1598355 1574593 1778565 1427656 1326622 1627234 1667487 1579608 1220777 1909183
13912A909183m43646l8863N9803j61706K62518n01522J97425L56075k54416p0105
$$ 1909183 1465537 1426674 1486477 1324771 1587289 1085767 1283192 1639267 1384851 1314746
13902A314746k2392K95036M8616l92758J31635o0773J76251l75950K98727j78988
$$ 1314746 1292354 1587390 1636006 1243248 1374883 1314110 1490361 1114411 1413138 1234150
13892A234150K0020J59119k91491N04158j91564j02565l67772K28770L7109J51970
$$ 1234150 1254170 1413289 1121798 1625956 1434392 1331827 964055 1192825 1229934 1381904
13882A381904k27394k41615L10664J20299K9068J23244l99776L5186J4541N92986
$$ 1381904 1154510 912895 1223559 1343858 1372926 1496170 1096394 1131580 1146121 1739107
13872A739107o89571M5615M7246k31961N1368j75555N61859k68464J69989m72496
$$ 1739107 1049536 1095151 1142397 910436 961804 786249 1348108 1079644 1249633 777137
13862G77137J80496R5395k93275N12896k32646k36206K59180M8152J75481l44650
$$ 777137 957633 1053028 759753 1272649 1040003 803797 1062977 1111129 1286610 941960
13852I41960O2327J64107r241n40340N08650j6974k38209J15053L89J32359m98275
$$ 941960 1004287 1168394 1159153 618813 1127463 1110489 872280 987333 987722 1120081 621806
13841F21806M48258m8342q4424o8859K75994j04709L11466n99712J92500J86489
$$ 621806 1070064 1021722 937298 868439 1144433 1039724 1351190 751478 943978 1130467
13831A130467m31292J15813L23581j50926L24152l78298j70008J46551J83379
$$ 1130467 699175 814988 1138569 987643 1311795 933497 763489 910040 1093419
13822A093419O4188m08968L5951J18296L0225N0091O8662l69042J76214M42642
$$ 1093419 1157607 748639 784590 902886 933111 983202 1051864 682822 859036 1301678
13812A301678D56388M03886n1554R8210o9134Q8749l03634K10993k74257M62770
$$ 1301678 456388 860274 808720 906930 837796 926545 622911 833904 559647 1022417
13802A022417j77949K19565l62139L8885J79861K23522l37743J61101k03592J59610
$$ 1022417 844468 1064033 701894 740779 920640 1144162 806419 967520 763928 923538
13792I23538J43655k9685l48310L40587l49667J41790k113k84609P180R9349K08004
$$ 923538 1067193 1037508 689198 1029785 680118 821908 819795 535186 542366 641715 849719
13781H49719m3329l75556L77324J04603N3914J33443J02512m68669L9374K7923
$$ 849719 806390 430834 808158 912761 966675 1100118 1202630 733961 773335 801258
13771H01258j1448m9286p1596m5669O0095J57318k10308j17060J48261j70077
$$ 801258 789810 740524 668928 623259 683354 840672 630364 513304 661565 491488
13761D91488K52718k55520J95317l4995J90334O9489j90966n1939P3473j4599
$$ 491488 744206 488686 684003 649008 839342 908831 717865 665926 739399 724800
13751G24800j43273J53258P713o6134J62156j48276k59686J23444J2496j40135
$$ 724800 581527 734785 742498 676364 838520 690244 430558 554002 566498 426363
13741D26363J90424J47471B87838J11354K30341j54022M90882k55412P7503k62675
$$ 426363 616787 764258 287838 399192 629533 475511 966393 710981 788484 525809
13731E25809k3011L95028j28350j64817Q0940j22134R7965K96265l43715B78476
$$ 525809 502798 897826 769476 604659 685599 563465 661430 957695 613980 278476
13720F50761k67772K42132k82707L7376K17510L13225j09523q4044B76696M58140
$$ 650761 382989 625121 342414 379790 597300 910525 801002 716958 276696 734836
13710G34836A47900M85151k53116O01981D83179l0397p2711J42603L73125l85017
$$ 734836 147900 633051 379935 981916 483179 452782 380071 522674 895799 510782
13700E10782Q3300j89176J15318N5492j45144K00960k84519K68681j08204J06307
$$ 510782 594082 404906 520224 575716 430572 631532 347013 615694 507490 613797
13690F13797M0630k29870J08009j24594K85102k35861J4K11125J46782k45513
$$ 613797 654427 424557 532566 407972 693074 457213 457227 668352 815134 569621
13680E69621k30647J24209p4002L80697B53159L84772j77963j62159L24533p2719
$$ 569621 338974 463183 389181 769878 253159 637931 459968 297809 622342 549623
13670E49623J08595k34029J79133j02957f8192C34698M22631A90350N16530k23879
$$ 549623 658218 424189 603322 500365 -68192 334698 757329 190350 706880 483001
13660D83001r4613L94948B32292L29341k65583Q188L29061B52037J2947N07823
$$ 483001 388388 783336 232292 561633 296050 304238 633299 252037 264984 772807
13650G72807k80533A97647K33187J3254J30803q8847J86479l03748Q3540L00174
$$ 772807 492274 197647 430834 444088 574891 486044 672523 368775 452315 752489
13640G52489B50721L23172B20195E7396L92350k9929J64451k35808E9823L89420
$$ 752489 250721 573893 220195 57396 449746 419817 584268 348460 59823 449243
13630D49243l295p6812n8975K85892l3373A97746J11979K26485k2494E2393K39087
$$ 449243 445948 369136 310161 596053 562680 197746 309725 536210 513716 52393 291480
13619B91480o5876A08750K00552J31480j44986m4588c852I31129A73731L8895
$$ 291480 225604 108750 309302 440782 295796 251208 -3852 931129 173731 212626
13609B12626K59907k7981P8111k06204Q6674k4265Q7964n8015p8069o8552A11856
$$ 212626 472533 444552 522663 316459 403133 378868 466832 408817 330748 262196 111856
13597D72191R7774J59309l45015j33539r2203J36582K76802A54795j1412M00172
$$ 472191 569965 729274 384259 250720 158517 295099 571901 154795 143383 543555
13587E43555k42102J52267o9529K63311A61184J92465K81764k05560J84012B72677
$$ 543555 301453 453720 384191 647502 161184 353649 635413 429853 613865 272677
13576E55412j93641K48795A12270M34963j57273A90367J55948q49k3190J54760
$$ 555412 361771 610566 112270 547233 389960 190367 346315 345466 322276 477036
13566D77036A95334L17563B18327K50199B33542J06572n1280j9309P9487J00693
$$ 477036 195334 512897 218327 468526 233542 340114 288834 269525 349012 449705
13556D49705A10811a1466H8464J90215K59997k50561o2694n6061f2450D52874
$$ 449705 110811 -11466 88464 278679 538676 288115 225421 169360 -62450 452874
13545A87499l9676J44969J16545o1201K20759k23407k5056A00328L09598A24866
$$ 187499 147823 292792 409337 348136 568895 345488 320432 100328 409926 124866
13534C24258j52575L51905j22306g185A72843L1657J14057k8750N5843N0866J87619
$$ 324258 171683 523588 401282 -7185 172843 204500 318557 289807 345650 396516 584135
13523E84135j20402h9543A63443N7927O8943B6537J40185K31002c6841D3227J87795
$$ 584135 463733 -89543 163443 221370 290313 26537 166722 397724 -36841 43227 231022
13512B31022A08594J45804J17912k1108H4471L89851g6461A15897K03953A51196
$$ 231022 108594 254398 372310 351202 84471 474322 -76461 115897 319850 151196
13501B04875K16166c6243E06333J4154j50170J27221j92742H114K41131K09370
$$ 204875 421041 -36243 506333 520487 370317 497538 304796 8114 249245 458615
13491D58615r2461J79256J03722H1696a16087E84199B06913L56222B19469n5174
$$ 458615 366154 545410 649132 81696 -116087 584199 206913 563135 219469 164295
13481A64295P803K41494A45038J43680M7262a81581C27148e8891E83860H9422
$$ 164295 172098 413592 145038 288718 335980 -181581 327148 -58891 583860 89422
13470C16260j43592B4910M34220N2821j90704J00066M561J10101H3705J78445
$$ 316260 172668 24910 459130 511951 321247 421313 425874 535975 83705 262150
13460B62150a204C91144A9592R928J27763M2268J02375Q4787A65321O0643K37944
$$ 262150 -1204 391144 19592 29520 157283 199551 301926 386713 165321 225964 463908
13449D63908A89498H4071L34686E8220J49531J57498L527A36422N5321G6962j2453
$$ 463908 189498 84071 418757 58220 207751 365249 368776 136422 191743 76962 64509
13438F4509A6277J4789J47371R0899R7489H9060O7733N23650C02294J33781j69901
$$ 64509 16277 31066 178437 269336 366825 89060 156793 680443 302294 436075 266174
13427B66174J57810A93148b5906B88096M1223j46157G1067J24991R4552j22479
$$ 266174 423984 193148 -25906 288096 329319 183162 71067 196058 290610 168131
13417A68131a89646C18722A5316J19138h6256C02690j23240b42155A25082E0321
$$ 168131 -189646 318722 15316 134454 -86256 302690 179450 -242155 125082 50321
13406A99536J51200H5921D1230P2132J98284A26637M23227G8850P3403K08782
$$ 199536 350736 85921 41230 113362 311646 126637 549864 78850 152253 361035
13396C61035j18524m6070I468J39476D4533J06636J16802j00649h4178D41664
$$ 361035 242511 196441 9468 148944 44533 151169 267971 167322 -84178 441664
13385I9506a13903A7885L30926H7635N8131E9045Q7916i6149l5334B93745r2757
$$ 99506 -113903 17885 348811 87635 145766 59045 146961 -96149 -131483 293745 200988
13374B00988J12669j21858R1170J39644A39713k2986p868K71323r3642m4104j3241
$$ 200988 313657 191799 282969 422613 139713 116727 108859 380182 286540 242436 229195
13363B29195l4598J4261K3362J37033A20990K50303m0541j06671M3121n9703k1585
$$ 229195 194597 208858 232220 369253 120990 371293 330752 224081 267202 207499 185914
13352A85914J26086J73389j0434j57576j30025K0136K4263R2953J02824j11777
$$ 185914 312000 485389 474955 317379 187354 207490 231753 324706 427530 315753
13342C15753j23041J11365J28879k02502K14196i3873B47812n9804J7213E4681
$$ 315753 192712 304077 432956 230454 444650 -93873 247812 188008 205221 54681
13331A58814R6082O6297F4610K48734C6140L1493J49502Q1466J0129a06859C12683
$$ 158814 254896 321193 64610 313344 36140 67633 217135 298601 308730 -106859 312683
13319D23832A49127Q5243K32393E7191M0934M5278K02295p9666O5035A20537O2365
$$ 423832 149127 234370 466763 57191 98125 143403 345698 266032 331067 120537 182902
13308A82902p273H3537J51997G0406J04255q0849P5170q524K15012b6088I6202
$$ 182902 175629 83537 235534 70406 174661 93812 168982 160458 375470 -26088 96202
13296A74203a18544c1146p2671b138n9836B66805c7831A37305H888Q7088j0369
$$ 174203 -118544 -31146 -103817 -2138 -61974 266805 -37831 137305 8888 95976 85607
13285H5607B1211J7936K44553I2231K96893a57895J2805C43302k9182m7267a62495
$$ 85607 21211 39147 283700 92231 389124 -157895 -145090 343302 314120 266853 -162495
13273d208G8253Q3184d5151D17522A59287J11751a08018B36767J18176i1964A7644
$$ -4208 78253 161437 -45151 417522 159287 271038 -108018 236767 354943 -91964 17644
13261A83922P832F9965J25301J85394A25711a46204D95920A8038K73008q6939
$$ 183922 191754 69965 195266 380660 125711 -146204 495920 18038 291046 204107
13251B04107p7795a13721h564F7134e2447B10921b01991E23742G0516a98479D08305
$$ 204107 126312 -113721 -8564 67134 -52447 210921 -201991 523742 70516 -198479 408305
13239C56570A22780j2722j2543M47958A82437K39259A38968h3047J9733A97992
$$ 356570 122780 110058 97515 545473 182437 421696 138968 -83047 -63314 197992
13228e9026C21027r9017m1647K35015c0763j60577A8554K44079j00695d7716B86795
$$ -59026 321027 222010 180363 415378 -30763 -191340 18554 262633 161938 -47716 286795
13216E8971B8946K32063G7655K35422b2766A3699a23545A35485B4060R4294c2522
$$ 58971 28946 261009 77655 313077 -22766 13699 -123545 135485 24060 118354 -32522
13204E16611H3059M6239Q6029e5162B21784m7073p755H590J70708a72657F0456
$$ 516611 83059 129298 215327 -55162 221784 174711 166956 8590 179298 -172657 60456
13192E5837J86370l3750a97322O4023C26163j25065M5562F9456M7871e0806C48247
$$ 55837 242207 208457 -197322 -133299 326163 201098 246660 69456 117327 -50806 348247
13180b98088b194H0107J9755K62577A58441b8221n9372B3532J3791M1042r889
$$ -298088 -2194 80107 99862 362439 158441 -28221 -87593 23532 37323 78365 68476
13169F8476O0994D0149J53909d7705k1026B2a01613E97514a01095A3140k702R072
$$ 68476 129470 40149 194058 -47705 -68731 22 -101613 597514 -101095 13140 10438 19510
13157A9510c8498B58902k5549b05025A75551l9445b2029B048J71850p6451J01041
$$ 19510 -38498 258902 233353 -205025 175551 136106 -22029 2048 173898 97447 198488
13146A98488b27098P7300C31028A61806B9817J57350g8942I016c004A99952h1617
$$ 198488 -227098 -149798 331028 161806 29817 187167 -78942 9016 -3004 199952 -81617
13134A35362P2532d2286m724p3608A53204f2378j21788C21128a42645A58460j0789
$$ 135362 207894 -42286 -47010 -120618 153204 -62378 -184166 321128 -142645 158460 147671
13123A47671J62857a69441D6367b67327H6366a10648A26682K57286E615f398m5481
$$ 147671 310528 -169441 46367 -267327 86366 -110648 126682 383968 5615 -6398 -51879
13112e1879C3984L49211a4894B51979h7479l30918J95177A03733h5841C4006J78986
$$ -51879 33984 383195 -14894 251979 -87479 -418397 -223220 103733 -85841 34006 212992
13101B12992e2594A14864a92271C9130P6431O5462Q0827C5678d2924A96931K67193
$$ 212992 -52594 114864 -192271 39130 115561 181023 261850 35678 -42924 196931 464124
13090D64124A31177d0235F3264J3330e4178C38584a97694l385b8457B44456D8203
$$ 464124 131177 -40235 63264 76594 -54178 338584 -197694 -201079 -28457 244456 48203
13078a53666B15964b79526e3061H2956a00508j8990B9980K0900a03025H9204h1498
$$ -153666 215964 -279526 -53061 82956 -100508 -119498 29980 50880 -103025 89204 -81498
13066a15043B68919A3077K29639F6807a71807B90924q7776a82777B00963e095
$$ -115043 268919 13077 242716 66807 -171807 290924 203148 -182777 200963 -5095
13055B39826d1295B15391m6794R3122a97579A86c9311A95296m7541f9484D5603
$$ 239826 -41295 215391 168597 261719 -197579 186 -39311 195296 147755 -69484 45603
13043A91426J88062E4063A8916L7831J61847b01559A65098n4420J05051o432Q3012
$$ 191426 379488 54063 18916 56747 218594 -201559 165098 110678 215729 209297 292309
13032B92309A12421J4063K6458H775P8407K42935g3651F3505J76461B8853M87829
$$ 292309 112421 126484 152942 8775 87182 330117 -73651 63505 239966 28853 516682
13021E16682A9740K91016j54248R3980j15709h0574A33048a47244B62082j13762
$$ 516682 19740 310756 156508 250488 134779 -80574 133048 -147244 262082 148320
13011A48320L5479B3938J86264B7249J76865H1606A0253b88806C19198a38900
$$ 148320 183799 23938 210202 27249 204114 81606 10253 -288806 319198 -138900
13000I7127f6663c0098J0680B22180Q6530m7129c73164a59707D5788b06453A4403
$$ 97127 -66663 -30098 -19418 222180 308710 261581 -373164 -159707 45788 -206453 14403
12988A3010g4709A66534J06474g632B5901c7273B54988K06485H7683K24366E9989
$$ 13010 -74709 166534 273008 -7632 25901 -37273 254988 461473 87683 312049 59989
12976e9269A49398c1045A966M9022c4288a6377j56924C56948A56228D0796K46131
$$ -59269 149398 -31045 1966 50988 -34288 -16377 -173301 356948 156228 40796 286927
12965B86927j09411K01255A3225c41158B5236c5522j73105A53968F9412K66841
$$ 286927 177516 378771 13225 -341158 25236 -35522 -208627 153968 69412 336253
12955C36253l7728j01032e52B91534m7380A8805b54509b4857j58164B38575b87987
$$ 336253 298525 197493 -552 291534 244154 18805 -254509 -24857 -183021 238575 -287987
12943a625j02650A98335q1776f625p4016k5087A51538j7535a71800k09462A76701
$$ -1625 -104275 198335 116559 -6625 -80641 -105728 151538 134003 -171800 -381262 176701
12931a56989B5499K2039L65142b63397e4443j8307D27535A08891Q691i5553q2630
$$ -156989 25499 47538 412680 -263397 -54443 -72750 427535 108891 117582 -95553 -178183
12920a78183B46633n5054H0845d2291M953A80506a58051l6948A71541e6505C70697
$$ -178183 246633 191579 80845 -42291 -37338 180506 -158051 -194999 171541 -56505 370697
12908b38902I3773d2250k14925e6425D2964a03756B23980a70246a5240k6521j52034
$$ -238902 93773 -42250 -257175 -56425 42964 -103756 223980 -170246 -15240 -41761 -193795
12897a93795b2011A48000G464N4985A8631g9952B9831R7319a1324k78380C22289
$$ -193795 -22011 148000 7464 62449 18631 -79952 29831 127150 -11324 -289704 322289
12885C14881I4587m3592a19498C25271h3165B15912I5192e2713C55109j14460
$$ 314881 94587 50995 -119498 325271 -83165 215912 95192 -52713 355109 240649
12875B40649a5397B9442i4749H3285O2504a06435C03522r9877f5969c0979k08867
$$ 240649 -15397 29442 -94749 83285 145789 -106435 303522 203645 -65969 -30979 -239846
12864b39846J19254l2959l8596B77672b20372D4852J92177G0947M1651L43605
$$ -239846 -120592 -153551 -192147 277672 -220372 44852 237029 70947 112598 456203
12854D56203g4130A86542J99602A71788a48169E173M301K33670L2747b29774l621
$$ 456203 -74130 186542 386144 171788 -148169 5173 9474 243144 275891 -229774 -233395
12843b33395a968A23983J53955D7317K37737G7978a41461r6465R5098k3607A7453
$$ -233395 -1968 123983 277938 47317 285054 77978 -141461 -237926 -142828 -166435 17453
12831B77749a12650C8800K01784a01907c6264A95536a28202A08713l7713R015
$$ 277749 -112650 38800 240584 -101907 -36264 195536 -128202 108713 71000 80015
12821H0015K46118A44915C4854K66424k3104b52951h9534j08081B35887H552a3325
$$ 80015 326133 144915 34854 301278 278174 -252951 -89534 -197615 235887 8552 -13325
12809F6096a11985B11712F5481L1664J1790c51978C89129g1498I6022J03843a69259
$$ 66096 -111985 211712 65481 97145 108935 -351978 389129 -71498 96022 199865 -169259
12797C62923k0167j27515i9346d9415C026a9943A50883C7238b50869j4556f5824
$$ 362923 342756 215241 -99346 -49415 3026 -19943 150883 37238 -250869 -265425 -65824
12785D5821J02369J04788j05953e5602A89844m6694K69046j86530a2555A84006
$$ 45821 148190 252978 147025 -55602 189844 143150 412196 225666 -12555 184006
12774c65197a59985B15256c7140Q074A97323J51358B444c73213B26179q181g935
$$ -365197 -159985 215256 -37140 -29066 197323 348681 2444 -373213 226179 217998 -7935
12762H7110J49155C5140a75735B67140R9144e6880j32031A58610c50379e2057
$$ 87110 236265 35140 -175735 267140 366284 -56880 -188911 158610 -350379 -52057
12751b51043f4313C24627a52762B970J02264d0006A14811M2583A2250c6384j8537
$$ -251043 -64313 324627 -152762 2970 105234 -40006 114811 157394 12250 -36384 -54921
12740e4921A78706c2915j75951q1822D527J94036i6351k1158c0077A02149a22145
$$ -54921 178706 -32915 -208866 -290688 4527 198563 -96351 -117509 -30077 102149 -122145
12728a07700B75306d1328f605p1135k59963i4462C21551A58577G6414J07751f6461
$$ -107700 275306 -41328 -6605 -77740 -337703 -94462 321551 158577 76414 184165 -66461
12716E4374c1036A25177J07127q6796i6389F24883a29630A81909a01409C07254
$$ 54374 -31036 125177 232304 145508 -96389 624883 -129630 181909 -101409 307254
12705A97148F0912N0191K2928D7867b291B00714L4841j2357J33400j00772P840
$$ 197148 60912 111103 134031 47867 -2291 200714 235555 223198 356598 255826 263666
12694B63666p0907d7145C65351b02197A39094J51362g9205A57943L684K71522
$$ 263666 192759 -47145 365351 -202197 139094 290456 -79205 157943 161627 433149
12684D33149D9751a20006B32666a06057A58000N7343p9368J75776F1560e5335
$$ 433149 49751 -120006 232666 -106057 158000 215343 135975 311751 61560 -55335
12673a05655F9480K15094b82979J35392P03f610q439B23842a42450B81793a15059
$$ -105655 69480 284574 -282979 -147587 -146884 -6610 -15049 223842 -142450 281793 -115059
12661b48315A75770J10312j23796J84337h3260D96500g6251D35956j99788J20284
$$ -248315 175770 286082 162286 346623 -83260 496500 -76251 435956 236168 356452
12651C56452j17135j6554J0152F279J41404M5892q8528L35719a75662B27403A07476
$$ 356452 239317 222763 232915 6279 147683 193575 105047 440766 -175662 227403 107476
12639c42646J28352a3188B74862a81182b8803A2109K10412G7723J27228P8373
$$ -342646 -214294 -13188 274862 -181182 -28803 12109 222521 77723 204951 283324
12629B83324N9382p9026b63515D7476O3563R2859D1260c475C2160K75308M550
$$ 283324 342706 263680 -263515 47476 111039 203898 41260 -3475 32160 307468 312018
12618C12018A37497B281J67727a203m4175g252k14275O2580D1164a04029B8688
$$ 312018 137497 2281 170008 -1203 -45378 -7252 -221527 -158947 41164 -104029 28688
12606A05139a36870D46498A20467b4870j48616A24469D4771K04712J82740j06517
$$ 105139 -136870 446498 120467 -24870 -173486 124469 44771 249483 432223 325706
12596C25706n7084n0503C8445k195j0139J79574R9719r7244E1780a3323C32962
$$ 325706 268622 218119 38445 36250 26111 205685 305404 208160 51780 -13323 332962
12584a11337D993i8735I3768c6852j31491a0707B73783e411C00608a33195A29091
$$ -111337 4993 -98735 93768 -36852 -168343 -10707 273783 -5411 300608 -133195 129091
12572g2073I4152a65205B79290a86268H4386B676g7136A75595E228b00623B9223
$$ -72073 94152 -165205 279290 -186268 84386 2676 -77136 175595 5228 -200623 29223
12560A75206J27547G3321l5736K69956j16143o1210e9535C1170L74445O8937b1506
$$ 175206 302753 73321 37585 307541 191398 130188 -59535 31170 405615 474552 -21506
12548A18368J886k066K69354r5545J01330a61951j14497k36488A32882E7696J6923
$$ 118368 120254 118188 387542 291997 393327 -161951 -276448 -512936 132882 57696 74619
12537G4619J31153m1410B6157a47271B28941a21464M7450B93671a8499D0412a50325
$$ 74619 205772 164362 26157 -147271 228941 -121464 -74014 293671 -18499 40412 -150325
12525d8201a1540C41519k3607d5563C1076K33031A9678J05597a14809B2013K15505
$$ -48201 -11540 341519 317912 -45563 31076 264107 19678 125275 -114809 22013 237518
12514B37518p8581J41154H3626b70261j3195I7582c98730H4994N6790a73278g0016
$$ 237518 158937 300091 83626 -270261 -283456 97582 -398730 84994 141784 -173278 -70016
12502A77538b4156q6996H523a5598C69151c5843E5139J95740f4553k1430K6636
$$ 177538 -24156 -111152 8523 -15598 369151 -35843 55139 250879 -64553 -85983 -59347
12491e9347m3234a5557B4313K13205a5907r5245C55837C1758M3320c1343j93304
$$ -59347 -102581 -15557 24313 237518 -15907 -111152 355837 31758 75078 -31343 -224647
12480b24647m6851a22617C992J39480b24921C6300K17810c601j36103a2814A06608
$$ -224647 -271498 -122617 3992 143472 -224921 36300 254110 -3601 -139704 -12814 106608
12468D5812a07341A71406h0280L064m5722L9966A67367F2705L0759g4497A06787
$$ 45812 -107341 171406 -80280 -77216 -122938 -82972 167367 62705 93464 -74497 106787
12456d7486l17390A00559B2942J49416f5304D4080b085E9739J24493i6830m6641
$$ -47486 -364876 100559 22942 172358 -65304 44080 -2085 59739 184232 -96830 -143471
12445a43471O0100A00893O9946K49591A6713J41663a16983L8675A13053k0602
$$ -143471 -83371 100893 170839 420430 16713 158376 -116983 -78308 113053 92451
12435I2451a5577E8046b19427A80655E1950L0322K71585c06833a22480A79810
$$ 92451 -15577 58046 -219427 180655 51950 82272 353857 -306833 -122480 179810
12424A85085R863h5229k53015C07442A3459a89773F0159B870M9085a71276L3051
$$ 185085 194948 -85229 -338244 307442 13459 -189773 60159 2870 51955 -171276 -138225
12413a38225G1404L6201K1064a38418B5129a26232p5695C8082J35249c4701H5171
$$ -138225 71404 107605 128669 -138418 25129 -126232 -201927 38082 173331 -34701 85171
12401a59478E2669b09923j81601A56097f1490D692c07895A27962d09844j11952
$$ -159478 52669 -209923 -391524 156097 -61490 4692 -307895 127962 -409844 -521796
12391e21796b22210j33712a56610l00883b9976p9277D7592b69918B03700H1363
$$ -521796 -222210 -355922 -156610 -457493 -29976 -109253 47592 -269918 203700 81363
12380c5551B0563a02584b410A79746c5950B88183a41363A14389a87567L6812A2069
$$ -35551 20563 -102584 -2410 179746 -35950 288183 -141363 114389 -187567 -150755 12069
12368A22704J7747a43745r4133A83730D0027a87375A39684b50231B26236a74412
$$ 122704 140451 -143745 -237878 183730 40027 -187375 139684 -250231 226236 -174412
12357C57447D1689a12130D1323n636L7747N0008j447O414a6636G2133J44859A01698
$$ 357447 41689 -112130 41323 35687 73434 123442 121995 128409 -16636 72133 216992 101698
12344A16178b88306J37313B08633d1608o1895A92474b47082E067M01178f6222
$$ 116178 -288306 -150993 208633 -41608 -103503 192474 -247082 5067 406245 -66222
12333A8835b9245k42046f4082k47178A28291b34126A61565C5895b8432A1529L13381
$$ 18835 -29245 -271291 -64082 -311260 128291 -234126 161565 35895 -28432 11529 324910
12322C24910j28762D6905K85618j16806l9881p8158m2812c42322C2621A3250K86863
$$ 324910 196148 46905 332523 215717 175836 97678 54866 -342322 32621 13250 300113
12311C00113A49863D5135a59219g0746N001A57021J7763e996C05941i183j62121
$$ 300113 149863 45135 -159219 -70746 -65745 157021 174784 -5996 305941 -9183 -171304
12300a71304A23316J01699q959r0140J45508Q3080j32500o8926n4744i0111o8670
$$ -171304 123316 225015 216056 125916 271424 354504 222004 153078 98334 -90111 -158781
12289a58781I0708A5806J25418R5703g3491C89758b2909k05532A75529J42469
$$ -158781 90708 15806 141224 236927 -73491 389758 -22909 -228441 175529 317998
12279C17998B7454d7575B46626b84876E50645A16849m9232a17270C27816I5426
$$ 317998 27454 -47575 246626 -284876 550645 116849 67617 -117270 327816 95426
12268A10192K447K91535C7694j4797J45099a16372B95581b25976B45307I4625
$$ 110192 112639 404174 37694 22897 167996 -116372 295581 -225976 245307 94625
12257B6750a77336D14071r5207E8881a264C1060J53727N6392q6200J57898b39421
$$ 26750 -177336 414071 318864 58881 -1264 31060 184787 241179 154979 312877 -239421
12245A91508E749L12371n1294g7059b2121F2821J75373f3064L0282k59574C75690
$$ 191508 5749 318120 266826 -77059 -22121 62821 238194 -63064 -32782 -292356 375690
12233C95051F3288K20474b051A49824p3762K25959j20619c15477A6447K99310
$$ 395051 63288 283762 -2051 149824 76062 302021 181402 -315477 16447 315757
12223C15757A12534J75610r2285a8468C85233n5679A00170a59572C76583l87j64573
$$ 315757 112534 288144 195859 -18468 385233 329554 100170 -159572 376583 376196 211623
12212B11623G2178L51998E7344J61014K3740B530a41522j71544B54001N4568Q4807
$$ 211623 72178 424176 57344 218358 242098 2530 -141522 -313066 254001 308569 393376
12201C93376C4431J43854J29767H6713R0604M3894l456g0800A31460J19388L8253
$$ 393376 34431 178285 308052 86713 177317 221211 217755 -70800 131460 250848 289101
12190B89101I4580f982k65528E09477A62483n4164M1222c5479C39679A0564J76978
$$ 289101 94580 -6982 -272510 509477 162483 108319 149541 -35479 339679 10564 187542
12179A87542P7297m1578i2092j67291A16166c9065D8516J23640Q8625G7284J8448
$$ 187542 264839 223261 -92092 -259383 116166 -39065 48516 172156 260781 77284 95732
12168I5732m0197B2542J06383R9037A9579A879d9078A53999l5617J69477C9879
$$ 95732 55535 22542 128925 227962 19579 1879 -49078 153999 118382 287859 39879
12156D32112A63949h512j87892e9921H7875P3733D9205a4636B11958m8915m5692
$$ 432112 163949 -8512 -196404 -59921 87875 161608 49205 -14636 211958 163043 117351
12145A17351L832b4443A08089m9080K83119a00607H3180J52580q8486J32238J51592
$$ 117351 121183 -24443 108089 59009 342128 -100607 83180 235760 147274 279512 431104
12134D31104h1683A59475a07754c1009E9516L10441C759a10783C93277f2502l6060
$$ 431104 -81683 159475 -107754 -31009 59516 369957 3759 -110783 393277 -62502 -98562
12123i8562A28292J07031F6635J30365n3346R5475k8149b575G4250J36532a60153
$$ -98562 128292 235323 66635 197000 143654 239129 210980 -2575 74250 210782 -160153
12111b6817k24447a18005N036E02104g064E3832c5639D1965J62718b81242A88538
$$ -26817 -251264 -118005 -112969 502104 -7064 53832 -35639 41965 204683 -281242 188538
12099i7745b1136o0404E6645P0316c6399m7332f098j81869N704N1351B85209a94308
$$ -97745 -21136 -81540 56645 126961 -36399 -83731 -6098 -187967 -182263 -130912 285209 -194308
12086A03663N3157a1579A9247Q2065b59844B7978J7157P0046c9137a59A04801
$$ 103663 156820 -11579 19247 101312 -259844 27978 45135 115181 -39137 -159 104801
12074A91231b48488B62601a25462B2426f393E5353d8035j88757j00877E05322
$$ 191231 -248488 262601 -125462 22426 -6393 55353 -48035 -236792 -337669 505322
12063E94867N71970N20344K36401F67786l21633H8879d7830B075K46383j7739
$$ 594867 1166837 1687181 1923582 667786 346153 88879 -47830 2075 248458 230719
12053B30719J56210m313A50362f9747A1630L0144h7851F629a95791o5188C69060
$$ 230719 386929 382616 150362 -69747 11630 41774 -87851 6629 -195791 -260979 369060
12041a98909D26946j17607a88800k3925A44025A8120J61648b9648N300D7599L8827
$$ -198909 426946 309339 -188800 -212725 144025 18120 179768 -29648 -24348 47599 86426
12030H6426d5043n7032A50289k6621B6707b18266b3773p0848p0363B15087R9925
$$ 86426 -45043 -102075 150289 123668 26707 -218266 -23773 -94621 -164984 215087 315012
12019C15012C5381K81195H1355J5940b82031E0278i6264A512a47436H4076a32450
$$ 315012 35381 316576 81355 97295 -282031 50278 -96264 1512 -147436 84076 -132450
12007F987J19889m6147a44560J2643p7409n9479A23607b90138g8722A98966a54998
$$ 6987 126876 80729 -144560 -131917 -209326 -268805 123607 -290138 -78722 198966 -154998
11995b09397N816E5643i997k51935j75305H8126a48174B15021c5860j35763E0182
$$ -209397 -203581 55643 -9997 -261932 -437237 88126 -148174 215021 -35860 -171623 50182
11983a59549H3356J48915m6604F0512O7059E1114a67711K2116i30D7388M4187
$$ -159549 83356 232271 185667 60512 127571 51114 -167711 -145595 -930 47388 91575
11972I1575P075D9223B1287J0488b49554b0466E25M6669L13376i1536j3543L5080
$$ 91575 98650 49223 21287 31775 -249554 -20466 525 47194 360570 -91536 -105079 -69999
11960f9999A11926J76173A06223K17910A16121a03401L5269k6746m4100I3375
$$ -69999 111926 288099 106223 324133 116121 -103401 -68132 -94878 -138978 93375
11949b32815I4190a59346g7264B38268c1502n9513I1248J72966a6836B72406e8618
$$ -232815 94190 -159346 -77264 238268 -31502 -91015 91248 264214 -16836 272406 -58618
11937a30183m6887e8581k15679j4734B60719a35445p5970b0197k05151G302J75384
$$ -130183 -177070 -58581 -274260 -288994 260719 -135445 -211415 -20197 -225348 7302 182686
11926A82686b09407r45h7088k30173n7850O3632C837L9898a2902A25066J90379
$$ 182686 -209407 -210352 -87088 -317261 -375111 -311479 3837 43735 -12902 125066 315445
11915C15445A18057R6453G7667B1803g5617D514J31392B1611c1250B41880j16402
$$ 315445 118057 214510 77667 21803 -75617 4514 135906 21611 -31250 241880 125478
11904A25478g1861B59113J30296E7567B0974d50326P2360a09460c5614A24408
$$ 125478 -71861 259113 389409 57567 20974 -450326 -377966 -109460 -35614 124408
11893B29292f8150K9704p3801b6446l7230k9203j59935a25654I4492i8885B34533
$$ 229292 -68150 -38446 -112247 -26446 -63676 -92879 -252814 -125654 94492 -98885 234533
11881e06618c4618E0621A1f5542A92114a77504A2172J09757c00812C9369a74882
$$ -506618 -34618 50621 11 -65542 192114 -177504 12172 121929 -300812 39369 -174882
11869F9925b77817A9577b78807r7855a59905G9043i172j55212G9359B0827a54198
$$ 69925 -277817 19577 -278807 -376662 -159905 79043 -9172 -164384 79359 20827 -154198
11857B1311c02193j0587D0700K36374e5295C8022J83781h4776D8934J18104a29329
$$ 21311 -302193 -312780 40700 277074 -55295 38022 221803 -84776 48934 167038 -129329
11845a74479Q3458n4097r8205P8223H4551a82721E9028J14056G912L2616a07183
$$ -174479 -91021 -145118 -243323 -165100 84551 -182721 59028 173084 7912 40528 -107183
11833B14921F5430D847L2918d665n4897B4276a3971C23567b06719M6291m8884
$$ 214921 65430 4847 37765 -4665 -59562 24276 -13971 323567 -206719 -160428 -209312
11822b09312a9226E2460d076B17167j726a04995M8189a7767j01945C5438J81310
$$ -209312 -19226 52460 -4076 217167 215441 -104995 -56806 -17767 -119712 35438 216748
11811B16748F8073a43793A60617c75463c2315B0128e68577B6004f4478J7911P806
$$ 216748 68073 -143793 160617 -375463 -32315 20128 -568577 26004 -64478 -46567 -38761
11800c8761B4228J44045P358j1628A4375b57008R4243o4215A09413R5442C086
$$ -38761 24228 168273 175631 164003 14375 -257008 -162765 -226980 109413 204855 3086
11788e41888b20630E2374a15509N3646A92374B1217Q7370c4620B5003K4078J99989
$$ -541888 -220630 52374 -115509 -61863 192374 21217 108587 -34620 25003 49081 249070
11777B49070q9951J72012G8732g4934A11518c45112A82479b22658a8434A0979
$$ 249070 159119 331131 78732 -74934 111518 -345112 182479 -222658 -18434 10979
11766b89871k9159a00562A2979P5768N0817h1806j02730C4005d22095E340a96746
$$ -289871 -319030 -100562 12979 88747 139564 -81806 -184536 34005 -422095 5340 -196746
11754a16423j03006O4398D33761A63749J01100b189l00659d9279I2311J16634
$$ -116423 -219429 -155031 433761 163749 264849 -2189 -302848 -49279 92311 208945
11744B08945a10276c2304D48813j86504f6361m6011B3110K3979K6022R5660o6337
$$ 208945 -110276 -32304 448813 262309 -66361 -112372 23110 47089 73111 168771 102434
11733A02434a50877K2127o7206H6851b4507p4748B21403i7840C85351A41221K50755
$$ 102434 -150877 -128750 -195956 86851 -24507 -99255 221403 -97840 385351 141221 391976
11722C91976L8026H1343c8227G2499a10417H7656a27686A87223j1179a28198A76054
$$ 391976 430002 81343 -38227 72499 -110417 87656 -127686 187223 176044 -128198 176054
11710b79828h7317B11510L2779G2903B3325K4413M6571g2757C38111b10651c2702
$$ -279828 -87317 211510 244289 72903 23325 47738 94309 -72757 338111 -210651 -32702
11698A2160L9751J98351b13736e5734j88957B56112E9916K10440f9231j33350
$$ 12160 51911 250262 -213736 -55734 -244691 256112 59916 270356 -69231 -202581
11688b02581a9920m7213q30k5263d3803A21712D6263K47881j36934K54370a18729
$$ -202581 -19920 -67133 -67963 -93226 -43803 121712 46263 294144 157210 411580 -118729
11676C3461b51604B40069k6438J4004K69078D5989A0162e9194A36095j148c4703
$$ 33461 -251604 240069 213631 227635 496713 45989 10162 -59194 136095 134947 -34703
11664B71259o1958c1533E5280P4082a6604m08503a5286j01478a5214A59814c9836
$$ 271259 209301 -31533 55280 129362 -16604 -425107 -15286 -116764 -15214 159814 -39836
11652D40167a75120E2958a8627K51A02382a58385j33302C23944f4771J7160A88848
$$ 440167 -175120 52958 -18627 -18376 102382 -158385 -291687 323944 -64771 -47611 188848
11640H2292r603b93161c0474B43543C173M8497b39931A45758a48526b9889E624
$$ 82292 72689 -293161 -30474 243543 3173 51670 -239931 145758 -148526 -29889 5624
11628f6467B57740c7059C4724N5643F227i313A52844e1202j61495B42164I842
$$ -66467 257740 -37059 34724 90367 6227 -9313 152844 -51202 -212697 242164 9842
11616F5219K65148e21357a23547A54557a61290j41148h2784A80359h5599G1075
$$ 65219 330367 -521357 -123547 154557 -161290 -302438 -82784 180359 -85599 71075
11605g6059j76589K1725G8439e6076C0978b21048H3939B4789K8990K23421P6118
$$ -76059 -252648 -230923 78439 -56076 30978 -221048 83939 24789 53779 277200 353318
11594C53318a67068B64615M1479j00346K12405D2409O4087a93355C7280a5557
$$ 353318 -167068 264615 306094 205748 418153 42409 106496 -193355 37280 -15557
11583a3044E3578e4524D1871a31389C8133b8404A4639f5012A67014P0599j14684
$$ -13044 53578 -54524 41871 -131389 38133 -28404 14639 -65012 167014 237613 122929
11572A22929R2030K24638d2060A57375f3641B51420a13207G9991K52529A30760
$$ 122929 214959 439597 -42060 157375 -63641 251420 -113207 79991 332520 130760
11561D80958a75358L618F6502O7357e959n6508E08567G9881A915K06219H4164
$$ 480958 -175358 -171740 66502 133859 -5959 -62467 508567 79881 1915 208134 84164
11549C09163j35531b0437l5012n9700A50689P2916a40395F4228K56967A35817
$$ 309163 173632 -20437 -55449 -115149 150689 223605 -140395 64228 321195 135817
11538C24934h2115C63895q1105d812A69554R9232g8640L0806C02500a32630B61044
$$ 324934 -82115 363895 282790 -4812 169554 268786 -78640 -47834 302500 -132630 261044
11526b2403G2508J74593r1309o1508f8149B9835d1914B01619K383c7073k61639
$$ -22403 72508 247101 155792 94284 -68149 29835 -41914 201619 204002 -37073 -298712
11515b98712A05240a74091E7346K90375F578O0141M38229c8914B04695H0823j5941
$$ -298712 105240 -174091 57346 347721 6578 66719 504948 -38914 204695 80823 64882
11504F4882J64223I0961l360c6464j0841B81335I4297L86445j45255K21058A16091
$$ 64882 229105 90961 87601 -36464 -47305 281335 94297 480742 335487 556545 116091
11492b3642D24633h4668C48558P4045I5674M32433k55391A31286J22061D5082
$$ -23642 424633 -84668 348558 422603 95674 528107 272716 131286 253347 45082
11481a91897B11672R9555b02150A60957o3511d1935C29173j24739g9250B87429
$$ -191897 211672 311227 -202150 160957 97446 -41935 329173 204434 -79250 287429
11470D14665d9559E55576k50262B0164a67958H2790J17993i4157B48793K28512
$$ 414665 -49559 555576 305314 20164 -167958 82790 200783 -94157 248793 477305
11460D77305A96623p6334J27804i2594B44400M2401j05090m3872P0757h0748F817
$$ 477305 196623 120289 248093 -92594 244400 286801 181711 137839 208596 -80748 6817
11448b3141C64812f1289A80363b04103c5714I7375a35698D5118a05969D07662
$$ -23141 364812 -61289 180363 -204103 -35714 97375 -135698 45118 -105969 407662
11437a22151a5963q475A00347K07370a97009H2L16294j25211A7179g0635C76174
$$ -122151 -15963 -24438 100347 307717 -197009 82 316376 191165 17179 -70635 376174
11425d1603A02969b13060A23510J8026d9055E9038L0152J70100A05485D3535g8128
$$ -41603 102969 -213060 123510 141536 -49055 59038 89190 259290 105485 43535 -78128
11413A54043b20297G3782R9816a19502M398B8543i7333E4824A2779a17052G0796
$$ 154043 -220297 73782 173598 -119502 -115104 28543 -97333 54824 12779 -117052 70796
11401g0549o1592E3434j0962K74641C3899a37180I9777j2573N4242n9469b10487
$$ -70549 -132141 53434 42472 317113 33899 -137180 99777 87204 141446 81977 -210487
11389A65502a84715e2950A60571i9806J5533j11530d5613j8116j01864G4210a67662
$$ 165502 -184715 -52950 160571 -99806 -84273 -195803 -45613 -63729 -165593 74210 -167662
11377A58594g3440j04079E6943g8142k096D2336P4776a28346R827r4470E4190
$$ 158594 -73440 -177519 56943 -78142 -80238 42336 117112 -128346 -118519 -212989 54190
11365b69685I8618c6082j72725C3060A1871K57127F8220L0602a37979j6054n7290
$$ -269685 98618 -36082 -208807 33060 11871 268998 68220 98822 -137979 -154033 -211323
11354b11323I5818c8913J6167A13732a33027A47817G3656M9019O9681J4790c17025
$$ -211323 95818 -38913 -22746 113732 -133027 147817 73656 122675 192356 207146 -317025
11342A15661C0669N5100e5731F1264a32211f4205K1876B84570a03604j91412G2352
$$ 115661 30669 85769 -55731 61264 -132211 -64205 -42329 284570 -103604 -295016 72352
11330a78353l093C32674g3044j368a4630l54678j5818a26281I4547b20158K7196
$$ -178353 -181446 332674 -73044 -74412 -14630 -369308 -385126 -126281 94547 -220158 -192962
11319a92962a8607k01288a00809B22340E4553P76J25860k833a96655Q7684E1362
$$ -192962 -18607 -219895 -100809 222340 54553 55329 181189 178356 -196655 -108971 51362
11307C97995a8631j75053B63752J6867j01284K9424a83340P8489B51884a95012
$$ 397995 -18631 -193684 263752 280619 179335 208759 -183340 -104851 251884 -195012
11296c7225B44788H2894c1353k76G0346e1936A80093b42901C7958b4134A3974
$$ -37225 244788 82894 -31353 -31629 70346 -51936 180093 -242901 37958 -24134 13974
11284a94395j50643f5356B74642b31405l32208H8885a74383f8541L3910k9090
$$ -194395 -345038 -65356 274642 -231405 -563613 88885 -174383 -68541 -34631 -63721
11274f3721C73923I7792a14645A51649c536C55436B4223N3979a0812F0954k5364
$$ -63721 373923 97792 -114645 151649 -3536 355436 24223 78202 -10812 60954 35590
11263C5590Q4203K0029d451B83444h2523p6356J6312j19444a30149A80878b22291
$$ 35590 119793 139822 -4451 283444 -82523 -158879 -142567 -262011 -130149 180878 -222291
11251f9851A23523M1106J57097j05421a82273o4347e055D2227a21181k04877P8756
$$ -69851 123523 164629 321726 216305 -182273 -246620 -5055 42227 -121181 -326058 -247302
11240b47302E8314a36041j67753m6003f8043K241p0132j62906g2121a3958n9294
$$ -247302 58314 -136041 -303794 -349797 -68043 -65802 -135934 -298840 -72121 -13958 -73252
11229g3252k23418A32397O7441a68362P6617L9472A46774b05512p8576a01742
$$ -73252 -296670 132397 199838 -168362 -91745 -52273 146774 -205512 -284088 -101742
11218D70915a58978k33885J36513P2511H6204A1294i471j35594j75954a118E4270
$$ 470915 -158978 -392863 -256350 -183839 86204 11294 -9471 -145065 -321019 -1118 54270
11206f4109k4500K2034G218a54376O8637o4675P4739M963j7657B46767f7957A3608
$$ -64109 -88609 -66575 7218 -154376 -85739 -150414 -75675 -70712 -88369 246767 -67957 13608
11193a81620A87802n74Q1320a78298f0969B9868b54044B36945i6778j32539a12906
$$ -181620 187802 187228 268548 -178298 -60969 29868 -254044 236945 -96778 -229317 -112906
11181A71870b69008I4882b5667j96786i1731j37626K200C2777a72599A35082k3046
$$ 171870 -269008 94882 -25667 -222453 -91731 -229357 -227157 32777 -172599 135082 112036
11170A12036i2463q8040D2818L62040d70722g2225A31751J40800E2619P6710n6677
$$ 112036 -92463 -180503 42818 404858 -470722 -72225 131751 272551 52619 129329 72652
11159G2652p300n044J18082b46904d3045d93E9817b57015b7078C6698J50003b22164
$$ 72652 65352 60308 178390 -246904 -43045 -493 59817 -257015 -27078 36698 186701 -222164
11146b29290g6347A39267K684J22555c18495A51467G2711c1057o398B47812d3363
$$ -229290 -76347 139267 141951 264506 -318495 151467 72711 -31057 -37455 247812 -43363
11134B29920d3679B45770H3988f9473A34390a5952C33952a73523B62399j07493
$$ 229920 -43679 245770 83988 -69473 134390 -15952 333952 -173523 262399 154906
11124A54906J42292I3702J32019i0298B26900K8680a24108k86683F3761b3611
$$ 154906 297198 93702 225721 -90298 226900 255580 -124108 -410791 63761 -23611
11113C34754a7996D9941h744A48025f38n1624r400D7553M34165k03260E314K39063
$$ 334754 -17996 49941 -8744 148025 -638 -52262 -61662 47553 481718 278458 5314 244377
11101B44377a21819C7474K29959a52165H5009a77629D01796H0314J32939J0820
$$ 244377 -121819 37474 267433 -152165 85009 -177629 401796 80314 213253 224073
11091B24073R1915J73099b9169D20847r8837M9711A10864K05358A4505J35915
$$ 224073 315988 489087 -29169 420847 322010 371721 110864 316222 14505 150420
11081A50420B0078n084f87C32K43421n8606K58189N1659n2701G6616L64376m7043
$$ 150420 20078 14994 -687 332 243753 185147 443336 494995 442294 76616 440992 393949
11069C93949K24463j15853j2855P1896j82719M8937o9513K61163j73385j5565
$$ 393949 618412 502559 489704 561600 378881 427818 358305 619468 446083 430518
11059D30518l4038K976J30391L60902B95630L60600j91849K40333p8072N0167
$$ 430518 396480 399456 529847 890749 295630 656230 464381 704714 626642 676809
11049F76809O7539j74414N223L33761J24594k22403l27628K52070j41973K26703
$$ 676809 744348 569934 575157 908918 1033512 811109 483481 735551 593578 820281
11039H20281k60136J82600k28260L64255j96061r4800l7949L17830k25489L3870
$$ 820281 560145 742745 514485 878740 682679 587879 549930 867760 642271 676141
11029F76141l35723M81904k45558K20578j51007K43217l32470l8670k2731o9962
$$ 676141 340418 822322 576764 797342 646335 889552 557082 518412 495681 425719
11019D25719J67452J97686j68946J5838k54945O2942M9871q3091J55769J43316
$$ 425719 593171 790857 621911 637749 382804 445746 495617 412526 568295 711611
11009G11611K86678B59623L57610n352J20932Q4610o4853K77292j42903j33695
$$ 711611 998289 259623 617233 611881 732813 817423 752570 1029862 886959 753264
10999G53264j37291K06450k98557L65605Q6903Q3286n09618M85726m33091L07924
$$ 753264 615973 822423 523866 889471 976374 1059660 550042 1035768 602677 910601
10989I10601j41449P3197K2109K29760l56712M89141l90234L00923m6771k6645
$$ 910601 769152 842349 864458 1094218 737506 1226647 836413 1137336 1090565 1063920
10979A063920L44717R7469K53749l2552M25964K75600J64763L49839l27783K16137
$$ 1063920 1408637 1506106 1759855 1727303 2153267 2428867 2593630 2943469 2615686 2831823
10969B831823L56843j37384n12491j64638j85941m74023J41051l37438P2454J70873
$$ 2831823 3188666 3051282 2538791 2374153 2188212 1714189 1855240 1517802 1590256 1761129
10959A761129k8163j96753L13363m73317L16134k84986k46034k48033q8977K0919
$$ 1761129 1732966 1536213 1849576 1376259 1692393 1407407 1161373 913340 824363 845282
10949H45282n1717k57268j11101J71471O8622k13310K9059A64390M50074A75550
$$ 845282 793565 536297 425196 596667 665289 451979 481038 164390 614464 175550
10938B44220A12150C5632a96500A08327K4316m7293o269a80529H2371a35964B90539
$$ 244220 112150 35632 -196500 108327 132643 85350 79081 -180529 82371 -135964 290539
10926A02788a61814B69219C5535a2777A12277c6690G3550j3565g0305C16287c47099
$$ 102788 -161814 269219 35535 -12777 112277 -36690 73550 59985 -70305 316287 -347099
10914A64145p8317b6085E4871a67265B86938c69299H7356c6874c627A88168f7046
$$ 164145 85828 -26085 54871 -167265 286938 -369299 87356 -36874 -3627 188168 -67046
10902A18409P8004J02979i0000F4016K6913g3216G4581Q3811o3341L4805a85974
$$ 118409 196413 299392 -90000 64016 90929 -73216 74581 158392 95051 129856 -185974
10890e586I0163K04910A40492E5216J52388b86967B9748L55287g025q5602A53364
$$ -5586 90163 295073 140492 55216 207604 -286967 29748 385035 -7025 -92627 153364
10878A3438P2960a13135C9048N9852m6679O1955p48M4198f135A65756b42364o9779
$$ 13438 86398 -113135 39048 98900 52221 114176 113428 157626 -6135 165756 -242364 -312143
10866c12143a49068A51846D2273a7190j09676j9893F5554i9469F2417c27203J40771
$$ -312143 -149068 151846 42273 -17190 -126866 -146759 65554 -99469 62417 -327203 -186432
10855a86432A20055b9091k63786C7120J57013q5456k7120B747b58534B8194a23163
$$ -186432 120055 -29091 -292877 37120 194133 108677 81557 2747 -258534 28194 -123163
10843i397A56629F2045a20240A70834B9155c2021R098l86210J27903A42206e5128
$$ -9397 156629 62045 -120240 170834 29155 -32021 -22923 -409133 -281230 142206 -55128
10831a62523e1898k57903D6400c44186a8388j85577A00107b2271A8663c5952C6073
$$ -162523 -51898 -309801 46400 -344186 -18388 -203965 100107 -22271 18663 -35952 36073
10819c6405B01643i5001K1464j09369f156j21055j17998B7868K9082g3771E7661
$$ -36405 201643 -95001 -73537 -182906 -6156 -127211 -245209 27868 56950 -73771 57661
10807b48547A3426R126g9810j11770C59735n2843a96839A89292b21790B35836
$$ -248547 13426 22552 -79810 -191580 359735 306892 -196839 189292 -221790 235836
10796d7336G3011b89841A62522A0141J39954m9711M328h0140B11379i8886J8243
$$ -47336 73011 -289841 162522 10141 150095 100384 104712 -80140 211379 -98886 -80643
10785h0643K722j5256D2871J29105C4390d7244q4239D1423c40857e849p9822k56769
$$ -80643 -77921 -93177 42871 171976 34390 -47244 -131483 41423 -340857 -5849 -85671 -342440
10773c42440J63341C0836b64739j24501A13400C0661b77803A94792F130i503A15738
$$ -342440 -179099 30836 -264739 -389240 113400 30661 -277803 194792 6130 -9503 115738
10761b73753c6654C54445h162I4151c2043l06933E632a7976j93926C5830h3269
$$ -273753 -36654 354445 -8162 94151 -32043 -338976 5632 -17976 -211902 35830 -83269
10749A19219n5676J22086e9476a3015j59260J6675A37850c7500A15714k164a10023
$$ 119219 63543 185629 -59476 -13015 -172275 -155600 137850 -37500 115714 113550 -110023
10737i8852B28343b27566B97181a99454e3615K0137B41179I7233m6644H346a96011
$$ -98852 228343 -227566 297181 -199454 -53615 -33478 241179 97233 50589 8346 -196011
10725b79973e8200k27170B38399A7281p359f0128A24291b14129d2360k60051a4164
$$ -279973 -58200 -285370 238399 17281 9922 -60128 124291 -214129 -42360 -302411 -14164
10713A48605a28744j66176I2205L12062d09718a19810A00218i9510L8618k2999
$$ 148605 -128744 -294920 92205 404267 -409718 -119810 100218 -99510 -60892 -83891
10703h3891b7444l0184K0691n4490D36647d3136H7147e2916o41k31304d2118A16940
$$ -83891 -27444 -57628 -36937 -91427 436647 -43136 87147 -52916 -53557 -284861 -42118 116940
10690d9316k73650h4394p9515M864F2905h0382A2289M4182f8164J5221C2492c73144
$$ -49316 -322966 -84394 -163909 -159045 62905 -80382 12289 56471 -68164 -52943 32492 -373144
10677a74723H9056K6769k3946K1944h0746m9054D46712G6310a35016D06376c20316
$$ -174723 89056 115825 91879 113823 -80746 -129800 446712 76310 -135016 406376 -320316
10665a14507r1480d6099p9485j8817n1068j277i7561q6570n3780K3166B01128
$$ -114507 -205987 -46099 -125584 -144401 -195469 -196746 -97561 -184131 -237911 -214745 201128
10653B87801b17305q1388j816D8504a42152P0074j50265j35081J42061e5088j55745
$$ 287801 -217305 -298693 -300509 48504 -142152 -72078 -222343 -357424 -215363 -55088 -210833
10642b10833l5119a01248n87249b10156m4154A10141K00371j21221a07449f707
$$ -210833 -245952 -101248 -688497 -210156 -254310 110141 310512 189291 -107449 -6707
10631A59223A720J78621G4294i7892b1484B6751N9931K50042i0786A07343N1372
$$ 159223 1720 180341 74294 -97892 -21484 26751 86682 336724 -90786 107343 158715
10620A58715b61599P5553J3445i564H3223K52067D4389M2914a63097L787c1562
$$ 158715 -261599 -186046 -172601 -9564 83223 335290 44389 87303 -163097 -159310 -31562
10608a28093l3201A69530O1933a84430A16184a86294h248k57234c1925k62099
$$ -128093 -161294 169530 231463 -184430 116184 -186294 -8248 -265482 -31925 -294024
10598b94024b8422C96895a31818B62366j08414b64996f0157l9747A44662b40520
$$ -294024 -28422 396895 -131818 262366 153952 -264996 -60157 -99904 144662 -240520
10587a75105D9516a69335H9123b98726a06490B7880a45522N3461A8871e2951j71659
$$ -175105 49516 -169335 89123 -298726 -106490 27880 -145522 -92061 18871 -52951 -224610
10576b24610c1703k81920B9240b4313A20350c1485n7555c5826l63514A649J75959
$$ -224610 -31703 -313623 29240 -24313 120350 -31485 -89040 -35826 -399340 1649 177608
10565A77608J0019a45981E8223c80776C02305d98683d8990F1233a04104k70376
$$ 177608 187627 -145981 58223 -380776 302305 -498683 -48990 61233 -104104 -374480
10555c74480d7913H7847i7761A02389A6613a06809I5311b75440h432p1514L2598
$$ -374480 -47913 87847 -97761 102389 16613 -106809 95311 -275440 -8432 -79946 -47348
10544d7348j2471A99309J01106E8228a70933m315D4540j5460M4808g5052o6708
$$ -47348 -59819 199309 300415 58228 -170933 -175248 44540 29080 73888 -75052 -141760
10533a41760C09367A7743a58813C01673F3601e2332A11564a23588j21771R3403
$$ -141760 309367 17743 -158813 301673 63601 -52332 111564 -123588 -245359 -151956
10523a51956n5859A35384c46222a04818G992a73041J2301o6871l3835C18559h3110
$$ -151956 -207815 135384 -346222 -104818 7992 -173041 -160740 -227611 -261446 318559 -83110
10511B94062a44034a6916j88254R9623O660j27959J09112j056k28896b6589C24673
$$ 294062 -144034 -16916 -205170 -105547 -98887 -226846 -117734 -118790 -347686 -26589 324673
10499c91013D0730N1060J10834e049B9962a3149I8393d7342J2982j8237a4859
$$ -391013 40730 91790 202624 -5049 29962 -13149 98393 -47342 -34360 -52597 -14859
10487b30550A24925m3306M9315c3366A63646q0684a25236A61730K82038j24526
$$ -230550 124925 81619 130934 -33366 163646 82962 -125236 161730 443768 319242
10477C19242b272B47021n5790b47397B69972q6130b02379b0302B10014A03045
$$ 319242 -2272 247021 191231 -247397 269972 183842 -202379 -20302 210014 103045
10466A64217k8667F4785d1292E04010j64507j25366a04708B18796a80599D5243
$$ 164217 135550 64785 -41292 504010 339503 214137 -104708 218796 -180599 45243
10455a08477H6276a08835n574d8420C54044A49272a75153A91337b2882j69062
$$ -108477 86276 -108835 -114409 -48420 354044 149272 -175153 191337 -22882 -191944
10445a91944B66383J66691B15619j06929C8452c9102I1126p402d9852j1809A09864
$$ -191944 266383 433074 215619 108690 38452 -39102 91126 83724 -49852 -61661 109864
10433B07525A8830b98020D6530J00595A4900a75955A35892K484C7593c00407J26009
$$ 207525 18830 -298020 46530 147125 14900 -175955 135892 138376 37593 -300407 -174398
10422a74398B75909h2480B86804h3362j3910k76681A89649g8876j5739A92965
$$ -174398 275909 -82480 286804 -83362 -97272 -373953 189649 -78876 -94615 192965
10411e4801J5502a4061C5133c52560a0528n7233L3618J3715C8038P4476a37271
$$ -54801 -39299 -14061 35133 -352560 -10528 -67761 -34143 -20428 38038 112514 -137271
10399B24567K1380D0018b42946a7748B32309G0571K61948f9862C19750j18680
$$ 224567 245947 40018 -242946 -17748 232309 70571 332519 -69862 319750 201070
10389B01070r3179R4440K07668q9490j58513A6739a51599D94426j78424a5281
$$ 201070 107891 202331 409999 320509 161996 16739 -151599 494426 316002 -15281
10378d1084g038C11231r6652J66874m072K38587B26361L57149A31908K60371A39050
$$ -41084 -7038 311231 214579 381453 377381 615968 226361 583510 131908 392279 139050
10366D46431J72037o9842o9323K62912C37635B9718L2524J15922J6644D0877J17185
$$ 446431 618468 548626 479303 742215 337635 29718 62242 178164 194808 40877 158062
10355A58062l6237K40113A53552M05963m1011q0350J58118B02469o9771E583M46241
$$ 158062 121825 361938 153552 559515 518504 438154 596272 202469 132698 5583 451824
10344D51824k03113J53589k5907j80988a82182A42621J33762a6853j98679O7668
$$ 451824 248711 402300 376393 195405 -182182 142621 276383 -16853 -215532 -147864
10334a47864c2212B21237N0428b01527H0756J36611H5123K41390A35076J00456
$$ -147864 -32212 221237 271665 -201527 80756 217367 85123 326513 135076 235532
10324B35532g7703I4084L07933E7666J41508R9096B8466J46468J87775j78753
$$ 235532 -77703 94084 402017 57666 199174 298270 28466 174934 362709 183956
10314A83956P8050a78053A79492H7323A6861b58165a10210e0827j73472P497A30983
$$ 183956 262006 -178053 179492 87323 16861 -258165 -110210 -50827 -224299 -216802 130983
10302b88407C93866c339A33602b24657A09935M7966J21435j15500J50183i5019
$$ -288407 393866 -3339 133602 -224657 109935 157901 279336 163836 314019 -95019
10291a05196C3048a20282l6265B04196K25391j87563G9099b56534K6622E9216
$$ -105196 33048 -120282 -156547 204196 429587 242024 79099 -256534 -229912 59216
10280b9126j09184d4350B5878P708e8878j58130B73954A1452b90248A53987h130
$$ -29126 -138310 -44350 25878 33586 -58878 -217008 273954 11452 -290248 153987 -8130
10268c46168N89A33977C5893b16472C55141a07974B86560G4167K37689j49458
$$ -346168 -345579 133977 35893 -216472 355141 -107974 286560 74167 311856 162398
10258A62398K69452A42471m1429g473B9320L88395j40736j221i1447B1005a54215
$$ 162398 431850 142471 101042 -7473 29320 417715 276979 275758 -91447 21005 -154215
10246B66680a10575j47697B16096b4611C78225d1529k71645b9910j99728q730
$$ 266680 -110575 -258272 216096 -24611 378225 -41529 -313174 -29910 -229638 -238368
10236b38368B38444a8002j66757E8887j3679a06260A02605a08180k31004I6701
$$ -238368 238444 -18002 -184759 58887 45208 -106260 102605 -108180 -339184 96701
10225B26540b50174C544b0327q838m0528A09685a69180C85287c7602j01846j19664
$$ 226540 -250174 3544 -20327 -29165 -69693 109685 -169180 385287 -37602 -139448 -259112
10214b59112M2147b2964j25646E8984b0575l3769A01717j7634K2565b78303d177
$$ -259112 -216965 -22964 -148610 58984 -20575 -54344 101717 84083 106648 -278303 -4177
10202g2026A6246g3602A04179d51348B55799c2839m00384a41904e6922B2978b26402
$$ -72026 16246 -73602 104179 -451348 255799 -32839 -433223 -141904 -56922 22978 -226402
10190a29230j68471j95929b10492p4869b8096A00788b26915d1943B0748b20641
$$ -129230 -297701 -493630 -210492 -285361 -28096 100788 -226915 -41943 20748 -220641
10179h9292p8712F8119f4659B9999a73633F1236b23157b9971I6324a16682j4241
$$ -89292 -168004 68119 -64659 29999 -173633 61236 -223157 -29971 96324 -116682 -130923
10168a30923c4159G7648d9876j01132R413C1754J07681d52526D2975J46666d55837
$$ -130923 -34159 77648 -49876 -151008 -141595 31754 139435 -452526 42975 189641 -455837
10156b32514a3070B37312n8163C9837a28223k97867b00478h700p095A15884D7165
$$ -232514 -13070 237312 179149 39837 -128223 -426090 -200478 -8700 -15795 115884 47165
10144b03066g7627j90292i4994D224a30685D0298a00963l884n0713L7827C0275
$$ -203066 -77627 -267919 -94994 4224 -130685 40298 -100963 -104847 -155560 -117733 30275
10132b85899b5594m6277j08275B35K15975c05666J32936E647J04847c99532c5742
$$ -285899 -25594 -71871 -180146 235 216210 -305666 -172730 5647 110494 -399532 -35742
10120a3641o9547B87454a71649N0391o1526A70547c18839D7182b84911b791j8765
$$ -13641 -83188 287454 -171649 -121258 -182784 170547 -318839 47182 -284911 -2791 -21556
10109b1556n8486j36249P9147j31355R9797m0480b9601p3598A6911g5881j2798
$$ -21556 -80042 -216291 -137144 -268499 -168702 -209182 -29601 -103199 16911 -75881 -88679
10098h8679I1810C2674b75619c5088a4147C89567A29318a70392o5491a17698A47943
$$ -88679 91810 32674 -275619 -35088 -14147 389567 129318 -170392 -235883 -117698 147943
10086C0355a1358C15964o8743r1627D8267C117a37782c4483j32243f5650k74689
$$ 30355 -11358 315964 247221 155594 48267 3117 -137782 -34483 -166726 -65650 -340339
10075c40339C5997A7618N1094d17469D7455a20032A99668L50994D8361A7809i4954
$$ -340339 35997 17618 68712 -417469 47455 -120032 199668 550662 48361 17809 -94954
10063a86101d8476F5080J32027a71396L4413o2544c5376n6307k15877L5183l5329
$$ -186101 -48476 65080 197107 -171396 -136983 -199527 -35376 -91683 -307560 -272377 -307706
10052c07706B20377f304D67873h5963p9381d6268j42770D43123a0312j88171L2354
$$ -307706 220377 -6304 467873 -85963 -165344 -46268 -189038 443123 -10312 -198483 -166129
10041a66129q1242k64j53857B11942J0237b68363a25600B17026c97241B30453
$$ -166129 -247371 -247635 -401492 211942 222179 -268363 -125600 217026 -397241 230453
10030A58898J15301F0254b22628b0657A70383e02335b08636K7342j76560N7594
$$ 158898 274199 60254 -222628 -20657 170383 -502335 -208636 -181294 -357854 -300260
10020c00260j3579G9929k279g8678O440j7049j06860k5077I235b03958C3115d2071
$$ -300260 -313839 79929 77650 -78678 -72238 -89287 -196147 -221224 9235 -203958 33115 -42071
10007a26659L6621b0666H8777D299J82500b06254O1176A21092R3089h0496j4429
$$ -126659 -90038 -20666 88777 4299 186799 -206254 -145078 121092 214181 -80496 -94925
9996i4925G9370K24699a49172A7089c00215M2441a06927b836j10542D8853o366
$$ -94925 79370 304069 -149172 17089 -300215 -257774 -106927 -2836 -113378 48853 42487
9985D2487a76073k40012G4813c28876a30758j19662K5224C46492F3581a73078
$$ 42487 -176073 -416085 74813 -328876 -130758 -250420 -225196 346492 63581 -173078
9974g0435A31262P7540G8453J91553F3182l881a13441j94951l6407J34951l653
$$ -70435 131262 208802 78453 270006 63182 59301 -113441 -308392 -344799 -209848 -213501
9963b13501P0990j08693b2131B00153l6238B5243a22085e7957a8035m24308J39264
$$ -213501 -142511 -251204 -22131 200153 163915 25243 -122085 -57957 -18035 -442343 -303079
9952c03079g3548l46834G3914e3745E3783a78700L730m6311B33020c8510A11831
$$ -303079 -73548 -420382 73914 -53745 53783 -178700 -174970 -221281 233020 -38510 111831
9940C20818d12207a45630P2713n8905c4645G7280d3832B36573C4660K06448a86919
$$ 320818 -412207 -145630 -72917 -131822 -34645 77280 -43832 236573 34660 241108 -186919
9928b18908i8875R42j60788k34889B61257e3212r1990B55408a24077A27374J73725
$$ -218908 -98875 -97933 -258721 -493610 261257 -53212 -145202 255408 -124077 127374 301099
9917C01099a6574A16359i2672A52765a05958k40467C09241b17855j18797J17398
$$ 301099 -16574 116359 -92672 152765 -105958 -346425 309241 -217855 -336652 -219254
9907b19254j793d0970A29755D4639g4768b3075B31645F5895j4861d65432a1716
$$ -219254 -221047 -40970 129755 44639 -74768 -23075 231645 65895 51034 -465432 -11716
9895A7025J3324b5896A03791b23107l2405c4251h930r9985e2304K5471k48552
$$ 17025 30349 -25896 103791 -223107 -255512 -34251 -8930 -108915 -52304 -26833 -275385
9884b75385I9025K05738I756a08162H1484N3265J23809b28808A74772a37805D56050
$$ -275385 99025 304763 9756 -108162 81484 134749 258558 -228808 174772 -137805 456050
9872a94423D4664a29779n170d7371F2390f0819A43400E8242a31847H1298O013
$$ -194423 44664 -129779 -134949 -47371 62390 -60819 143400 58242 -131847 81298 87311
9861H7311a38990j3909D2553K27785a75177B32479b8713p1233j50448b9392k09128
$$ 87311 -138990 -152899 42553 270338 -175177 232479 -28713 -99946 -250394 -29392 -238520
9850b38520R3111l1781c7499H8636a70020o661C5445A6568g5366j48631C7057
$$ -238520 -145409 -177190 -37499 88636 -170020 -176681 35445 16568 -75366 -223997 37057
9838D9141e3516j26249K1187l5723h9912A11751b48478c2871j75161E6223i0060
$$ 49141 -53516 -179765 -158578 -194301 -89912 111751 -248478 -32871 -208032 56223 -90060
9826a67832p4229N6445A6664f413j33539F2338b0761k43044c6258k22746A78479
$$ -167832 -242061 -185616 16664 -6413 -139952 62338 -20761 -263805 -36258 -259004 178479
9814e6947o3631l72491B9142e3313l26255J08994a32381E3331L668b57387a20190
$$ -56947 -120578 -493069 29142 -53313 -379568 -270574 -132381 53331 56999 -257387 -120190
9802a37139A31893d8453C1590g265j40639B84318a6904n02393a63040G172c6o7864
$$ -137139 131893 -48453 31590 -7265 -147904 284318 -16904 -519297 -163040 7172 -36 -67900
9790f7900A02907a80878m6891j39657A14312a18332I6131a88724O1598d5549q7370
$$ -67900 102907 -180878 -227769 -367426 114312 -118332 96131 -188724 -127126 -45549 -132919
9779a32919F1566L85251A18790P7748c59553a812C981c74970f6125b5805H7414
$$ -132919 61566 446817 118790 196538 -359553 -1812 3981 -374970 -66125 -25805 87414
9767a73359d0421k4077r2611h7j60512j61735a065A647a16103k53461J42851j51175
$$ -173359 -40421 -64498 -157109 -87 -160599 -322334 -1065 1647 -116103 -369564 -226713 -377888
9755c77888N5789F4153N5073b25267B12406C8180a81711A88499a49020E0809d4520
$$ -377888 -322099 64153 119226 -225267 212406 38180 -181711 188499 -149020 50809 -44520
9743A46605G0330b79924A77658c4609j96066N2588l9160H4805f1488k72561A2734
$$ 146605 70330 -279924 177658 -34609 -230675 -178087 -217247 84805 -61488 -334049 12734
9731g251k54368d5508j45803O8734B32678a42995d0832j23524n0002A68835a08621
$$ -7251 -261619 -45508 -191311 -122577 232678 -142995 -40832 -164356 -214358 168835 -108621
9719b97073A56895a75635c4565C5757b38354J270A08507b68683f8151o6943B86667
$$ -297073 156895 -175635 -34565 35757 -238354 -237084 108507 -268683 -68151 -135094 286667
9707A08017h7131l1785j16787J4607b3745q4785h244j30278F9738J99579a41655
$$ 108017 -87131 -118916 -235703 -221096 -23745 -108530 -8244 -138522 69738 269317 -141655
9695c02293j65271a83279B57372j17255c35292R5832k1068G3607a5324A48805
$$ -302293 -467564 -183279 257372 140117 -335292 -239460 -260528 73607 -15324 148805
9684a79241A83788h065p5537m35281A87112c9155A85818h0215A44922m4096b05213
$$ -179241 183788 -8065 -83602 -518883 187112 -39155 185818 -80215 144922 100826 -205213
9672c16114B08316a2253l00094K8184B09181b90285b1835k3037C8474a30868d8646
$$ -316114 208316 -12253 -312347 -284163 209181 -290285 -21835 -44872 38474 -130868 -48646
9660G7444i026k48111J08431o8271f9035K3920A23948A3842J59255g2674J1212
$$ 77444 -9026 -257137 -148706 -216977 -69035 -45115 123948 13842 173097 -72674 -61462
9649f1462R713j03023k3986K2287C50329A3185L56658b28488A12949C2146a74055
$$ -61462 -51749 -154772 -178758 -156471 350329 13185 369843 -228488 112949 32146 -174055
9637c3670F9675J98515a08387M6599n7521j8671A25296b84478R0976A59701n4637
$$ -33670 69675 268190 -108387 -61788 -119309 -137980 125296 -284478 -193502 159701 105064
9626A05064a71523B88546a58923L3477d3273A12845D562J94997G5105Q7864a34957
$$ 105064 -171523 288546 -158923 -125446 -43273 112845 4562 199559 75105 162969 -134957
9614d1295j35383F5533e0696k7536n8470N0467n1476r2752k8315A75170d46303
$$ -41295 -176678 65533 -50696 -78232 -136702 -86235 -137711 -230463 -258778 175170 -446303
9602B03557F660J98481B3R0477b37125a17291d2636k42164b8380D0332c8500B9697
$$ 203557 6660 205141 23 90500 -237125 -117291 -42636 -284800 -28380 40332 -38500 29697
9589i1908J9234B715c7804l42778M904D82089c62859b9761G5382l2607b36775
$$ -91908 -72674 2715 -37804 -380582 -375678 482089 -362859 -29761 75382 42775 -236775
9577d09530D0019a1614N261B7777c59710D4894c6654k47405g0022r125c6953J5225
$$ -409530 40019 -11614 -6353 27777 -359710 44894 -36654 -284059 -70022 -79147 -36953 -21728
9565b1728p0426c0165o215q9642K4431k44622i8305p3182j93858d8255r0391F4453
$$ -21728 -92154 -30165 -36380 -126022 -101591 -346213 -98305 -171487 -365345 -48255 -138646 64453
9552c84961J29110d4271l9727B6100e3357D59816A41946d38021A88346G4872p73
$$ -384961 -255851 -44271 -83998 26100 -53357 459816 141946 -438021 188346 74872 74099
9541G4099b32543P4751g1714j45375B41084a50719A18910b5091B9207h2857i451
$$ 74099 -232543 -157792 -71714 -217089 241084 -150719 118910 -25091 29207 -82857 -9451
9529C4551a2542q5935I5959g5872d550P0k21599G4389C3587a31701M4574o3043
$$ 34551 -12542 -98477 95959 -75872 -4550 -4480 -226079 74389 33587 -131701 -87127 -150170
9517a50170F594J09233B313i2311H5521b61774Q8147a0715k01158Q3888H2333
$$ -150170 6594 115827 2313 -92311 85521 -261774 -173627 -10715 -211873 -127985 82333
9505A59439e50628a49472B81856J2427C206K55375d77506A95151b48919b9655
$$ 159439 -550628 -149472 281856 294283 3206 258581 -477506 195151 -248919 -29655
9494c53303a59104A79220p2773P6271q0522i729J114k42645e5800A34490a53691
$$ -353303 -159104 179220 106447 182718 102196 -9729 -8615 -251260 -55800 134490 -153691
9482c43774I2209k3180e8784j88766B7645d1709k0288j58502a05172A03279D4567
$$ -343774 92209 69029 -58784 -247550 27645 -41709 -61997 -220499 -105172 103279 44567
9470c81644J55595A88833a2390k66394K66q642g6110K5673J0539C40326A08146
$$ -381644 -226049 188833 -12390 -278784 -278518 -287160 -76110 -50437 -39898 340326 108146
9458C23530A21935d7626k47786G1316b51767e261D95339D9130i3271J0840c9348
$$ 323530 121935 -47626 -295412 71316 -251767 -5261 495339 49130 -93271 -82431 -39348
9446d9130j15179j51083A2962O0895M9088j416b97484C12355p6433e65504G7566
$$ -49130 -164309 -315392 12962 73857 122945 121529 -297484 312355 235922 -565504 77566
9434c84434a32067k99689C99395j90179a83311E7146J35950a64718b3059j3721
$$ -384434 -132067 -431756 399395 209216 -183311 57146 193096 -164718 -23059 -36780
9424c6780A18127C1965a33456d4951k64144P9603m2026D3117c97895A80644b14703
$$ -36780 118127 31965 -133456 -44951 -309095 -229492 -271518 43117 -397895 180644 -214703
9412a63583m4343b469j63396P6239j60178B42483f9061J609j50186i2713n2164
$$ -163583 -207926 -2469 -165865 -89626 -249804 242483 -69061 -67452 -217638 -92713 -144877
9401a44877J6514l06544c6596j33319B49329d0174j28293P7865o7694b197A08065
$$ -144877 -128363 -434907 -36596 -169915 249329 -40174 -168467 -90602 -158296 -2197 108065
9389f6255j5342k99380J84875j38981J11137C6281J1519b33401k35725f1776B61978
$$ -66255 -81597 -380977 -196102 -335083 -223946 36281 47800 -233401 -469126 -61776 261978
9377E4665b68064B29180h8954A48220b46768h8655B19835e1363C83136f8455k1193
$$ 54665 -268064 229180 -88954 148220 -246768 -88655 219835 -51363 383136 -68455 -89648
9366h9648r7026K859o6421b7098k5513j869k81717a30034j66555g3529A23346
$$ -89648 -186674 -183815 -250236 -27098 -52611 -54480 -336197 -130034 -296589 -73529 123346
9354i4936C3448a62197C7771c73625J58858d6142E8745L2991b51660L5731N2542
$$ -94936 33448 -162197 37771 -373625 -214767 -46142 58745 91736 -251660 -215929 -163387
9343a63387J4426j06645Q9232O8949C53709A39362B8910f9672D8397M5743b04116
$$ -163387 -148961 -255606 -166374 -97425 353709 139362 28910 -69672 48397 94140 -204116
9331a53877B11646c60833R9552a7942k29989Q2626A34996B7872N7953b35978P3721
$$ -153877 211646 -360833 -261281 -17942 -247931 -165305 134996 27872 85825 -235978 -162257
9320a62257D7997c04342B9163m331a26031L010j6683A6106i9506k11307J50741
$$ -162257 47997 -304342 29163 24832 -126031 -123021 -139704 16106 -99506 -310813 -160072
9309a60072a6194A86017c61921E5927Q6678B2431c18165c2816k657j69127m9843
$$ -160072 -16194 186017 -361921 55927 142605 22431 -318165 -32816 -35473 -204600 -254443
9298b54443B16791e0608A42123a47731n477D8262b16549o5751h7655l22610C0300
$$ -254443 216791 -50608 142123 -147731 -153208 48262 -216549 -282300 -87655 -410265 30300
9286a79774A88862d0872E9023a75297c0429H1076c4975j39976p9789e539k83289
$$ -179774 188862 -40872 59023 -175297 -30429 81076 -34975 -174951 -254740 -5539 -288828
9275b88828R516R9768h4333l44511b10649C0912k899a309m6898q3285m3765K5690
$$ -288828 -279312 -179544 -84333 -428844 -210649 30912 28013 -1309 -48207 -131492 -175257 -149567
9263a49567E7378a96237k15493J41771F8587a33063C509b25628C16501h5162A45220
$$ -149567 57378 -196237 -411730 -269959 68587 -133063 3509 -225628 316501 -85162 145220
9251G895J8086a82221C18849a30555b7385F826b31298E8875K00314b3896j72528
$$ 7895 25981 -182221 318849 -130555 -27385 6826 -231298 58875 259189 -23896 -196424
9240a96424A06718a47466l8730e787G0075K1108a45247M0091B8973J71359H9022
$$ -196424 106718 -147466 -186196 -5787 70075 91183 -145247 -105156 28973 200332 89022
9228A85571B6098L5456O554L1067f8852j21577j71294B14392d4878C9425J19338
$$ 185571 26098 61554 68108 99175 -68852 -190429 -361723 214392 -44878 39425 158763
9217A58763E5399a03526A66303b51210A15893a32014N0369A34982J9888h6754
$$ 158763 55399 -103526 166303 -251210 115893 -132014 -81645 134982 154870 -86754
9206C2453e0776p5978n4907J1165Q35p4269l1691L7166d3676r356G8339N4534
$$ 32453 -50776 -126754 -181661 -170496 -169661 -243930 -275621 -238455 -43676 -53032 78339 132873
9194A32873E9656K43042q9887I5000l3826a56974K3533E766i7479j50961J16343
$$ 132873 59656 302698 212811 95000 61174 -156974 -133441 5766 -97479 -248440 -132097
9183a32097j95071E0305c05531H0878J34377d8992k5745j93897A52188c41539
$$ -132097 -327168 50305 -305531 80878 215255 -48992 -74737 -268634 152188 -341539
9172a23253e5932k65272E5136b84284k8259a29030D8336a39125k8711D6728b8543
$$ -123253 -55932 -321204 55136 -284284 -312543 -129030 48336 -139125 -167836 46728 -28543
9160H6277g0425j96284L6990A17044a44841A66125B6792M7511j7555a40163j189
$$ 86277 -70425 -266709 -229719 117044 -144841 166125 26792 74303 56748 -140163 -141352
9149a41352E51656b38516G6000J72405d0524C36110h3526j69772c5608A2735a07949
$$ -141352 551656 -238516 76000 248405 -40524 336110 -83526 -253298 -35608 12735 -107949
9137E7759a34122A45144a13782j68500O7805j69884A36598b4951o4452B6680h2997
$$ 57759 -134122 145144 -113782 -282282 -214477 -384361 136598 -24951 -89403 26680 -82997
9125a20192n4261C5629L6222a87588D542J38609O9893A3309a3944A32669e4130
$$ -120192 -174453 35629 71851 -187588 4542 143151 213044 13309 -13944 132669 -54130
9113g7677b9234k17544E7693J46270a9932m2480J7367F8514P6494a71581Q3515
$$ -77677 -29234 -246778 57693 203963 -19932 -62412 -45045 68514 145008 -171581 -88066
9102h8066m2332A66129b12611a0448E4619i2879B77162E7601Q939C690b57161
$$ -88066 -130398 166129 -212611 -10448 54619 -92879 277162 57601 66540 3690 -257161
9090a03760A13397b9862F0166a56754J3402M5288k694m9586D3148c601A69278
$$ -103760 113397 -29862 60166 -156754 -143352 -98064 -100758 -150344 43148 -3601 169278
9078b64172i2409n4055A69352p989c91074a20055A98282l6448c25840D7139a18283
$$ -264172 -92409 -146464 169352 161363 -391074 -120055 198282 161834 -325840 47139 -118283
9066a26357d8870F9674A3544b30527D9888M8319d3164j34013n9179P7494K3115
$$ -126357 -48870 69674 13544 -230527 49888 98207 -43164 -177177 -236356 -158862 -135747
9055a35747D296h3171H7027C6717c52552J72725B57830c18417c2382B61992a57335
$$ -135747 4296 -83171 87027 36717 -352552 -179827 257830 -318417 -32382 261992 -157335
9043a4606j21496A43936i2031c0043C1151b93036A14858i8910c9703a9500A22729
$$ -14606 -136102 143936 -92031 -30043 31151 -293036 114858 -98910 -39703 -19500 122729
9031c6040o2385I7437c15243A12622a74964A32343C1126K221b01784o9597i4455
$$ -36040 -98425 97437 -315243 112622 -174964 132343 31126 33347 -201784 -271381 -94455
9019a30686q0416g9440k872a8650j84806N606G9567d04633J76710a4020j7300
$$ -130686 -211102 -79440 -82312 -18650 -203456 -197850 79567 -404633 -227923 -14020 -31320
9008c1320H2929l3234b9420G2040a33828c1101j88706e61j7813j77709E8382O7187
$$ -31320 82929 49695 -29420 72040 -133828 -31101 -219807 -561 -18374 -196083 58382 125569
8996A25569a27126K3668H9957c33322a24442j55368E0199J78638B5523R6006b0802
$$ 125569 -127126 -103458 89957 -333322 -124442 -279810 50199 228837 25523 121529 -20802
8984d4522A29974a10756P644l6348B515L87345a6753m41348a48809j84277i0314
$$ -44522 129974 -110756 -103112 -139460 2515 389860 -16753 -458101 -148809 -333086 -90314
8972b45860C15372I6551d65603h8111J3189H6291g4543n12724D5753b39606j73953
$$ -245860 315372 96551 -465603 -88111 -74922 86291 -74543 -587267 45753 -239606 -413559
8961d13559C94644A20371i6896p4501B0944g1185j03537q1240J16478B27619c97187
$$ -413559 394644 120371 -96896 -171397 20944 -71185 -174722 -255962 -139484 227619 -397187
8949a58244c1475H7832a76270P9167j19013m5895h150j7330j67924R2955I3417
$$ -158244 -31475 87832 -176270 -97103 -216116 -262011 -8150 -25480 -193404 -100449 93417
8937c6442H4352L02373p0658L68088g6207A44134K02133E2458a46582A06938b46769
$$ -36442 84352 386725 316067 684155 -76207 144134 346267 52458 -146582 106938 -246769
8925E21270R52291K583337J260112O019401K507308D409854A781232E98799j10933
$$ 521270 1473561 4056898 5317010 11336411 13843719 4409854 1781232 598799 487866
8916D87866k42847m6025D3144c15153B13999G0272a4594F3870K62099b2987A36947
$$ 487866 245019 198994 43144 -315153 213999 70272 -14594 63870 325969 -22987 136947
8904b07778B93391a26870k15583I4379a6102B3839K22077f8676k5395b6716k79782
$$ -207778 293391 -126870 -342453 94379 -16102 23839 245916 -68676 -94071 -26716 -306498
8893c06498j16870a61818A18677b280A11699b284j527I2634d97082h061I8593
$$ -306498 -423368 -161818 118677 -2280 111699 -2284 -3811 92634 -497082 -8061 98593
8881A98429c84100A11508N456B011K58507h1623j077k00332d4312p2466j9314
$$ 198429 -384100 111508 116964 2011 260518 -81623 -82700 -283032 -44312 -116778 -136092
$$ [...]
##END NTUPLES=NMR SPECTRUM
##END=
