##TITLE=AC1522_ROEFFECT0005_8202157_LwNfmbabSr
##JCAMPDX= 6.0         $$ Bruker NMR JCAMP-DX V2.0
##DATA TYPE= NMR SPECTRUM
##DATA CLASS= NTUPLES
##ORIGIN= BRUKER
##OWNER= Administrator
$$ 1.72 TOPSPIN		Version 2.1
$$ 2013-09-26 22:26:21.856 -0700  Administrator@X
$$ Compression mode = diff/dup
##.OBSERVE FREQUENCY= 400.02188249412
##.OBSERVE NUCLEUS= ^1H
##.ACQUISITION MODE= SIMULTANEOUS (DQD)
##.ACQUISITION SCHEME= undefined
##.AVERAGES= 64
##.DIGITISER RES= 22
##SPECTROMETER/DATA SYSTEM= spect
##.PULSE SEQUENCE= noesygpps1d.comp
##.SOLVENT NAME= COFFEE_meoh
##.SHIFT REFERENCE= INTERNAL, COFFEE_meoh, 1, 14.96098
##AUDIT TRAIL= $$ (NUMBER, WHEN, WHO, WHERE, PROCESS, VERSION, WHAT)
$$ ##TITLE= Audit trail, TOPSPIN		Version 2.1
$$ ##JCAMPDX= 5.01
$$ ##ORIGIN= Bruker BioSpin GmbH
$$ ##OWNER= Administrator
$$ $$ E:\/data/COFFEE/nmr/AC1522_ROEFFECT0005_8202157_LwNfmbabSr/12/pdata/1/auditp.txt
$$ ##AUDIT TRAIL=  $$ (NUMBER, WHEN, WHO, WHERE, PROCESS, VERSION, WHAT)
(   1,<2013-09-26 22:26:16.888 -0700>,<Administrator>,<X>,<go>,<TOPSPIN 2.1>,
      <created by zg
	started at 2013-09-26 22:14:47.221 -0700,
	POWCHK enabled, PULCHK disabled,
       configuration hash MD5:
       C8 4E 4E 5D D3 5C D8 9E 9F 52 82 E0 59 8A DE 15
       data hash MD5: 64K
       CD 3F 9E 61 E1 86 3A A5 58 4A E9 6F E8 BC 11 FC>)
(   2,<2013-09-26 22:26:19.935 -0700>,<Administrator>,<X>,<proc1d>,<TOPSPIN 2.1>,
      <Start of raw data processing
       efp LB = 0.3 FT_mod = 6 PKNL = 1 PHC0 = 0 PHC1 = 0 SI = 128K 
       data hash MD5: 128K
       54 51 91 13 58 EB 09 10 72 C3 1D 1D F7 F2 4E AC>)
(   3,<2013-09-26 22:26:20.903 -0700>,<Administrator>,<X>,<proc1d>,<TOPSPIN 2.1>,
      <pk PHC0 = -84.08936 PHC1 = 0 
       data hash MD5: 128K
       0D 8C C4 CE DC 7A 39 88 22 D1 9B 83 F7 94 0A C4>)
(   4,<2013-09-26 22:26:21.294 -0700>,<Administrator>,<X>,<proc1d>,<TOPSPIN 2.1>,
      <abs ABSG = 1 
       data hash MD5: 128K
       BD AB 73 FE A5 ED 9D 80 BA E6 4B 26 21 05 DC EF>)
(   5,<2013-09-26 22:26:21.403 -0700>,<Administrator>,<X>,<proc1d>,<TOPSPIN 2.1>,
      <abs ABSG = 2 
       data hash MD5: 128K
       01 14 CD F3 94 58 67 BE 52 88 56 E7 56 CE 52 53>)
(   6,<2013-09-26 22:26:21.481 -0700>,<Administrator>,<X>,<proc1d>,<TOPSPIN 2.1>,
      <abs ABSG = 3 
       data hash MD5: 128K
       B1 FB 8F 9D 45 2F 11 2F 51 A9 AA 48 6E D5 C7 C9>)
(   7,<2013-09-26 22:26:21.560 -0700>,<Administrator>,<X>,<proc1d>,<TOPSPIN 2.1>,
      <abs ABSG = 4 
       data hash MD5: 128K
       5D 81 09 70 00 31 BB CE D3 B0 E5 91 9C 4C 92 A2>)
(   8,<2013-09-26 22:26:21.669 -0700>,<Administrator>,<X>,<proc1d>,<TOPSPIN 2.1>,
      <abs ABSG = 5 
       data hash MD5: 128K
       70 CA B9 31 B4 A1 DA 06 E5 B2 55 53 80 B1 F6 2F>)
$$ ##END=
$$ 
$$ $$ hash MD5
$$ $$ 8D 88 3B 07 D7 A7 AA 80 65 AA FB E7 D3 FB 67 A8
##$RELAX= 
##$RELAX= 
##$RELAX= 
##$RELAX= 
##$RELAX= 
##$RELAX= 
##$RELAX= 
##$RELAX= 
$$ Bruker specific parameters
$$ --------------------------
##$DU= <E:\>
##$EXPNO= 12
$$ [...]
##$TP07= 0
##$TPNAME0= <>
##$TPNAME1= <>
##$TPNAME2= <>
##$TPNAME3= <>
##$TPNAME4= <>
##$TPNAME5= <>
##$TPNAME6= <>
##$TPNAME7= <>
##$TPOAL= (0..7)
0.5 0.5 0.5 0.5 0.5 0.5 0.5 0.5
##$TPOFFS= (0..7)
0 0 0 0 0 0 0 0
##$TUNHIN= 0
##$TUNHOUT= 0
##$TUNXOUT= 0
##$USERA1= <user>
##$USERA2= <user>
##$USERA3= <user>
##$USERA4= <user>
##$USERA5= <user>
##$V9= 5
##$VALIST= <valist>
##$VCLIST= <CCCCCCCCCCCCCCC>
##$VD= 0
##$VDLIST= <DDDDDDDDDDDDDDD>
##$VPLIST= <PPPPPPPPPPPPPPP>
##$VTLIST= <TTTTTTTTTTTTTTT>
##$WBST= 1024
##$WBSW= 4
##$XGAIN= (0..3)
0 0 0 0
##$XL= 0
##$YL= 0
##$YMAX_a= 6776882
##$YMIN_a= -14109739
##$ZGOPTNS= <>
##$ZL1= 120
##$ZL2= 120
##$ZL3= 120
##$ZL4= 120
##$ABSF1= 14.96098
##$ABSF2= -5.597201
##$ABSG= 5
##$ABSL= 3
##$ALPHA= 0
##$AQORDER= 0
##$ASSFAC= 0
##$ASSFACI= 0
##$ASSFACX= 0
##$ASSWID= 0
##$AUNMP= <proc_prof1d_extract.lims>
##$AXLEFT= 0
##$AXNAME= <>
##$AXNUC= <1H>
##$AXRIGHT= 0
##$AXTYPE= 0
##$AXUNIT= <>
##$AZFE= 0.1
##$AZFW= 0.1
##$BCFW= 0
##$BC_mod= 0
##$BYTORDP= 0
##$COROFFS= 0
##$CY= 15
##$DATMOD= 1
##$DC= 0
##$DFILT= <>
##$DTYPP= 0
##$F1P= 0
##$F2P= 0
##$FCOR= 0.5
##$FTSIZE= 131072
##$FT_mod= 6
##$GAMMA= 0
##$GB= 0
##$INTBC= 1
##$INTSCL= 1
##$ISEN= 128
##$LB= 0.3
##$LEV0= 0
##$LPBIN= 0
##$MAXI= 10000
##$MC2= 0
##$MEAN= 0
##$ME_mod= 0
##$MI= 0
##$NCOEF= 0
##$NC_proc= -2
##$NLEV= 6
##$NOISF1= 0
##$NOISF2= 0
##$NSP= 0
##$NTH_PI= 0
##$NZP= 0
##$OFFSET= 14.96098
##$PC= 1
##$PHC0= -84.08936
##$PHC1= 0
##$PH_mod= 1
##$PKNL= yes
##$PPARMOD= 0
##$PPDIAG= 0
##$PPIPTYP= 0
##$PPMPNUM= 2147483647
##$PPRESOL= 1
##$PSCAL= 4
##$PSIGN= 0
##$PYNMP= <proc.py>
##$REVERSE= no
##$SF= 400.020009646537
##$SI= 131072
##$SIGF1= 0
##$SIGF2= 0
##$SINO= 400
##$SIOLD= 131072
##$SPECTYP= <>
##$SREGLST= <1H.CDCl3>
##$SSB= 0
##$STSI= 131072
##$STSR= 0
##$SW_p= 8223.68421052631
##$SYMM= 0
##$S_DEV= 0
##$TDeff= 65536
##$TDoff= 0
##$TI= <>
##$TILT= no
##$TM1= 0
##$TM2= 0
##$TOPLEV= 0
##$USERP1= <user>
##$USERP2= <user>
##$USERP3= <user>
##$USERP4= <user>
##$USERP5= <user>
##$WDW= 1
##$XDIM= 131072
##$YMAX_p= 346207099
##$YMIN_p= -13259
##$CURPLOT= <Network HP LaserJet P1505>
##$CURPRIN= <$Network HP LaserJet P1505>
##$DFORMAT= <normdp>
##$LAYOUT= <+/1D_H.xwp>
##$LFORMAT= <normlp>
##$PFORMAT= <normpl>
##$SURQMSG= 1
$$ End of Bruker specific parameters
$$ ---------------------------------
##NTUPLES= NMR SPECTRUM
##VAR_NAME=  FREQUENCY,     SPECTRUM/REAL,   SPECTRUM/IMAG
##SYMBOL=    X,             R,               I
##VAR_TYPE=  INDEPENDENT,   DEPENDENT,       DEPENDENT
##VAR_FORM=  AFFN,          ASDF,            ASDF
##VAR_DIM=   131072,        131072,          131072
##UNITS=     HZ,            ARBITRARY UNITS, ARBITRARY UNITS
##FACTOR=    0.0627417313425164, 1,          1
##FIRST=     8223.62146879497, -2012,        -74053
##LAST=      0,             1211,            -75112
##MIN=       0,             -13259,          0
##MAX=       8223.62146879497, 346207099,    0
$$ Real data points
##PAGE= N=1
##DATA TABLE= (X++(R..R)), XYDATA
$$ [...]
$$ plain form
63761 324378 323035 321494 320111 319086 318158 316994 315565 314050 312636 311593 311258 311669 312314 312573 312432 312510
63745 312510 313312 314654 315966 317015 318157 319860 322193 324837 327492 330128 332867 335791 338915 342210
63731 342210 345594 348944 352255 355687 359367 363225 367167 371300 375706 380072 383867 387011 390072 393574
63717 393574 397294 400521 402887 404708 406578 408792 411119 412915 413581 413090 411995 410720 409020 406506 403564
63702 403564 401259 400256 400304 400862 401681 402489 402634 401702 400287 399626 400378 402147 404213 406369 408882 411868
63686 411868 414952 417545 419367 420648 421788 422912 423921 424945 426420 428605 431269 434051 436880 439762
63672 439762 442447 444646 446405 447894 448961 449332 449198 449142 449450 449865 450083 450096 449911 449242 447685 445001 441266
63655 441266 436925 432694 429017 425591 421832 417841 414520 412580 411799 411417 410860 410015 409296 409679 412124 416521
$$ packed form
63761C24378j343j541j383j025r28j164j429j515j414j043l35M11O45K59j41P8
63745C12510Q02J342J312J049J142J703K333K644K655K636K739K924L124L295
63731C42210L384L350L311L432L680L858L942M133M406M366L795L144L061L502
63717C93574L720L227K366J821J870K214K327J796O66m91j095j275j700k514k942
63702D03564k305j003M8N58Q19Q08J45r32j415o61P52J769K066K156K513K986
63686D11868L084K593J822J281J140J124J009J024J475K185K664K782K829K882
63672D39762K685K199J759J489J067L71j34n6L08M15K18J3j85o69j557k684l735
63655D41266m341m231l677l426l759l991l321j940p81l82n57q45p19L83K445M397
$$ plain form
63639 416521 421621 426432 431275 437014 443628 450265 456461 462577 469051 475869 482865 489955 496880 503181
63625 503181 508757 514172 520239 527444 535831 545254 555685 567496 581345 597487 615257 633634 652393
63612 652393 672300 694122 717904 743333 770271 798522 827374 855831 883306 909930 936190
63601 936190 962198 987114 1009327 1027491 1041387 1051436 1057566 1059175 1056235 1049636 1040111 1027675
63589 1027675 1012631 996368 980259 964258 947471 929742 911642 893089 873111 851293 828547
63578 828547 806192 784958 765109 746736 729498 712854 697059 683360 672677 664666 658620 654673
63566 654673 653298 654039 655703 657733 660610 664857 670363 676848 684407 693385 704157 717224 733137 752101
63552 752101 773840 797981 824363 852979 883866 917011 952086 988328 1024947 1061653 1098507
$$ packed form
63639D16521N100M811M843N739O614O637O196O116O474O818O996P090O925O301
63625E03181N576N415O067P205Q387R423J0431J1811J3849J6142J7770J8377J8759
63612F52393J9907K1822K3782K5429K6938K8251K8852K8457K7475K6624K6260
63601I36190K6008K4916K2213J8164J3896J0049O130J609k940o599r525j2436
63589A027675j5044j6263j6109j6001j6787j7729j8100j8553j9978k1818k2746
63578H28547k2355k1234j9849j8373j7238j6644j5795j3699j0683q011o046l947
63566F54673j375P41J664K030K877M247N506O485P559Q978J0772J3067J5913J8964
63552G52101K1739K4141K6382K8616L0887L3145L5075L6242L6619L6706L6854
$$ plain form
63541 1098507 1135466 1172379 1209031 1244343 1275567 1299190 1313022 1317049 1312368 1300269 1282595 1261806
63529 1261806 1239715 1216626 1192339 1167374 1142473 1117474 1091654 1064863 1037331 1008690 978282
63518 978282 946444 914345 882473 850332 817991 786825 758112 731754 707080 684196 663707
63507 663707 645559 629004 613483 598886 585089 571892 559337 547592 536570 526133 516538 508167
63495 508167 500904 494280 488174 482849 478354 474473 471327 469383 468660 468516 468479 468774 469638 470601 471098 471534
63479 471534 473120 476576 481422 486673 491760 496548 500841 504362 507223 509941 512827 515621 517984 520112
63465 520112 522455 524891 526690 527415 527446 527379 527356 527339 527652 528669 530179 531634 532995 534790 537304 540280 543501
63448 543501 547130 551276 555791 560805 567046 575282 585805 598811 614805 634097 656121 679769 704359
$$ packed form
63541A098507L6959L6913L6652L5312L1224K3623J3832M027m681j2099j7674k0789
63529A261806k2091k3089k4287k4965k4901k4999k5820k6791k7532k8641l0408
63518I78282l1838l2099l1872l2141l2341l1166k8713k6358k4674k2884k0489
63507F63707j8148j6555j5521j4597j3797j3197j2555j1745j1022j0437r595q371
63495E08167p263o624o106n325m495l881l146j944p23j44l7K95Q64R63M97M36
63479D71534J586L456M846N251N087M788M293L521K861K718K886K794K363K128
63465E20112K343K436J799P25L1o7k3j7L13J017J510J455J361J795K514K976L221
63448E43501L629M146M515N014O241Q236J0523J3006J5994J9292K2024K3648K4590
$$ plain form
63435 704359 729925 756654 784473 813218 842950 874162 907759 944453 983620 1022802 1058812
63424 1058812 1089422 1113852 1132050 1144338 1151877 1156725 1160893 1165541 1171228 1178450 1187610 1198808 1212072
63411 1212072 1227558 1245084 1263594 1281451 1297189 1309752 1318253 1322023 1320922 1315193 1304969 1290291
63399 1290291 1271759 1250719 1228463 1205407 1181254 1155721 1128773 1100297 1070071 1038225 1005426
63388 1005426 972374 939359 906573 874642 844429 816345 790254 766139 744421 725386 708661
63377 708661 693726 680800 670779 664308 661240 660981 662973 666802 672261 679544 689208 701775 717482
63364 717482 736355 758161 782237 807835 834868 863970 895549 929147 964046 1000103 1037459
63353 1037459 1075640 1113512 1150122 1185104 1218264 1249164 1277194 1301709 1321985 1337345 1347372
$$ packed form
63435G04359K5566K6729K7819K8745K9732L1212L3597L6694L9167L9182L6010
63424A058812L0610K4430J8198J2288P539M848M168M648N687P222R160J1198J3264
63411A212072J5486J7526J8510J7857J5738J2563Q501L770j101n729j0224j4678
63399A290291j8532k1040k2256k3056k4153k5533k6948k8476l0226l1846l2799
63388A005426l3052l3015l2786l1931l0213k8084k6091k4115k1718j9035j6725
63377G08661j4935j2926j0021o471l068k59J992L829N459P283R664J2567J5707
63364G17482J8873K1806K4076K5598K7033K9102L1579L3598L4899L6057L7356
63353A037459L8181L7872L6610L4982L3160L0900K8030K4515K0276J5360J0027
$$ plain form
63342 1347372 1351765 1350175 1342673 1330446 1315435 1299017 1281328 1262025 1241202 1219232 1196124 1171536
63330 1171536 1145264 1117386 1088173 1058270 1028779 1000650 974016 948516 924267 902052 882417
63319 882417 864965 848814 833580 819727 808092 799100 792132 785345 776235 762787 744373 721674
63307 721674 695894 668224 639937 612590 587669 565893 547012 530377 515633 502770 491760
63296 491760 482445 474678 468224 462463 456638 450631 445165 440873 437419 433903 429991 426191 423032 420445
63282 420445 418107 416021 414429 413384 412697 412262 412216 412743 413844 415311 416872 418325 419585 420650 421624 422742
63266 422742 424289 426392 428935 431723 434681 437815 441096 444443 447737 450828 453729 456886 460976 466170
63252 466170 471834 477233 482329 487564 493103 498883 505240 512805 521613 530903 539995 548897 557851 566945
$$ packed form
63342A347372M393j590p502j2227j5011j6418j7689j9303k0823k1970k3108k4588
63330A171536k6272k7878k9213k9903k9491k8129k6634k5500k4249k2215j9635
63319H82417j7452j6151j5234j3853j1635q992o968o787r110j3448j8414k2699
63307G21674k5780k7670k8287k7347k4921k1776j8881j6635j4744j2863j1010
63296D91760r315p767o454n761n825o007n466m292l454l516l912l800l159k587
63282D20445k338k086j592j045o87m35m6N27J101J467J561J453J260J065R74J118
63266D22742J547K103K543K788K958L134L281L347L294L091K901L157M090N194
63252D66170N664N399N096N235N539N780O357P565Q808R290R092Q902Q954R094
$$ plain form
63238 566945 576534 587493 600469 615248 631258 648313 666284 684519 702351 719982 738094 756711
63226 756711 775304 794032 813916 835390 857457 878859 899518 920208 941174 961731 981101
63215 981101 999031 1015588 1030829 1044765 1057272 1067900 1075977 1081086 1083272 1082703 1079251 1072547 1062438
63202 1062438 1049317 1033944 1016888 998122 977342 954745 931415 908841 888131 869711 853655
63191 853655 840063 829190 821343 816707 815216 816537 820158 825485 832071 840131 850783 865239 883311
63178 883311 902985 921953 939535 956711 974379 992126 1008799 1023673 1036629 1047635 1056669 1064055
63166 1064055 1070245 1075046 1077501 1076863 1073442 1068097 1060975 1051217 1038023 1021628 1002878 982114 958939
63153 958939 933141 905417 876988 848758 821075 794101 768135 743620 721070 700854 682859
$$ packed form
63238E66945R589J0959J2976J4779J6010J7055J7971J8235J7832J7631J8112J8617
63226G56711J8593J8728J9884K1474K2067K1402K0659K0690K0966K0557J9370
63215I81101J7930J6557J5241J3936J2507J0628Q077N109K186n69l452o704j0109
63202A062438j3121j5373j7056j8766k0780k2597k3330k2574k0710j8420j6056
63191H53655j3592j0873p847m636j491J321L621N327O586Q060J0652J4456J8072
63178H83311J9674J8968J7582J7176J7668J7747J6673J4874J2956J1006R034P386
63166A064055O190M801K455o38l421n345p122r758j3194j6395j8750k0764k3175
63153I58939k5798k7724k8429k8230k7683k6974k5966k4515k2550k0216j7995
$$ plain form
63142 682859 666449 651065 636818 624237 613511 604315 596392 589843 584726 580731 577573 575368 574290
63129 574290 574072 574224 574620 575507 576969 578775 580809 583307 586483 590190 594122 598207 602614 607417 612414
63114 612414 617274 621802 626037 630072 633717 636467 638077 639213 641233 645024 650084 654916 658321 660238
63100 660238 661508 663070 665376 668278 671277 673964 676321 678631 681189 684227 687983 692474 697119 700972
63086 700972 703605 705603 707829 710301 712155 712610 711581 709340 706139 702499 699466 698061 698499 700300 703050
63071 703050 706740 711419 716997 723485 731106 740028 750309 762219 776293 792848 811642 832241 854466
63058 854466 878312 903742 930896 960275 992322 1026970 1063994 1103610 1146218 1191617 1239001
63047 1239001 1287782 1337896 1389199 1441206 1493706 1547055 1601356 1655781 1709279 1761660 1813375
$$ packed form
63142F82859j6410j5384j4247j2581j0726r196p923o549n117l995l158k205j078
63129E74290k18J52L96Q87J462J806K034K498L176L707L932M085M407M803M997
63114F12414M860M528M235M035L645K750J610J136K020L791N060M832L405J917
63100F60238J270J562K306K902K999K687K357K310K558L038L756M491M645L853
63086G00972K633J998K226K472J854M55j029k241l201l640l033j405M38J801K750
63071G03050L690M679N578O488P621Q922J0281J1910J4074J6555J8794K0599K2225
63058H54466K3846K5430K7154K9379L2047L4648L7024L9616M2608M5399M7384
63047A239001M8781N0114N1303N2007N2500N3349N4301N4425N3498N2381N1715
$$ plain form
63036 1813375 1864373 1913806 1960848 2005223 2046750 2084896 2119018 2148676 2173519 2193134 2207187
63025 2207187 2215396 2217164 2211565 2197995 2176608 2147918 2112303 2070266 2022973 1972072 1919039 1865072
63013 1865072 1811457 1759528 1710151 1663732 1620990 1583358 1552202 1527752 1509146 1495510 1486784
63002 1486784 1483423 1485595 1492899 1504755 1520764 1540535 1563364 1588314 1614634 1641859 1669416 1696382
62990 1696382 1721838 1745421 1767372 1788044 1807441 1825132 1840475 1852979 1862523 1869061 1872047 1870376
62978 1870376 1863199 1850680 1833624 1812449 1786834 1756324 1720871 1680737 1636399 1588786 1539273
62967 1539273 1489135 1439156 1389904 1342040 1296066 1252076 1210148 1170724 1134193 1100266 1068210
62956 1068210 1037680 1008868 981864 956358 932092 909213 887928 868102 849374 831413 813900
$$ packed form
63036A813375N0998M9433M7042M4375M1527L8146L4122K9658K4843J9615J4053
63025B207187Q209J768n599j3570k1387k8690l5615m2037m7293n0901n3033n3967
63013A865072n3615n1929m9377m6419m2742l7632l1156k4450j8606j3636q726
63002A486784l361K172P304J1856J6009J9771K2829K4950K6320K7225K7557K6966
62990A696382K5456K3583K1951K0672J9397J7691J5343J2504R544O538K986j671
62978A870376p177j2519j7056k1175k5615l0510l5453m0134m4338m7613m9513
62967A539273n0138m9979m9252m7864m5974m3990m1928l9424l6531l3927l2056
62956A068210l0530k8812k7004k5506k4266k2879k1285j9826j8728j7961j7513
$$ plain form
62945 813900 796566 779547 763465 748795 735237 722025 708851 696241 685009 675589 667880 661449
62933 661449 655674 649964 644156 638726 634388 631379 629253 627439 625850 624739 624091 623481 622631 621822 621553
62918 621553 621963 622828 623977 625333 626578 627197 627052 626701 626896 627925 629612 631791 634459 637458 640306 642539
62902 642539 644142 645412 646367 646548 645631 644070 642745 641865 640724 638831 636893 636087 636533 637103 636788 635642
62886 635642 634245 632882 631615 630603 629878 629138 628259 627712 627951 628605 628822 628314 627583 627138 626971 626775 626183
62869 626183 624753 622189 618744 615057 611454 607711 603627 599496 595874 593118 591261 590086 589240 588531 588168
62854 588168 588420 589047 589463 589527 589677 590127 590417 590165 589858 590368 591842 593439 594175 593764 592708 591778 591376 591247
62836 591247 590842 589989 589054 588431 588204 588407 589210 590531 591835 592721 593539 595051 597627 601061 604976 609066
$$ packed form
62945H13900j7334j7019j6082j4670j3558j3212j3174j2610j1232r420p709o431
62933F61449n775n710n808n430m338l009k126j814j589j111o48o10q50q09k69
62918F21553M10Q65J149J356J245O19j45l51J95J029J687K179K668K999K848K233
62902F42539J603J270R55J81r17j561j325q80j141j893j938q06M46N70l15j146
62886F35642j397j363j267j012p25p40q79n47K39O54K17n08p31m45j67j96n92
62869F26183j430k564l445l687l603l743m084m131l622k756j857j175q46p09l63
62854E88168K52O27M16O4J50M50K90k52l07N10J474J597P36m11j056r30m02j29
62836E91247m05q53r35o23k27K03Q03J321J304Q86Q18J512K576L434L915M090
$$ plain form
62820 609066 613082 616960 620875 624889 628732 632217 635593 639043 642170 644581 646757 649597 653155 656681
62806 656681 660003 664034 669525 676002 682441 688497 694611 701365 709233 718625 729581 741657 754570
62793 754570 768729 784705 802410 821340 841467 863380 887699 914881 945565 980453 1019742
62782 1019742 1063152 1110609 1162394 1218467 1278112 1340486 1405163 1471937 1540472 1610340 1680959
62771 1680959 1751173 1819345 1884240 1945427 2002405 2053739 2097709 2133484 2160834 2178849 2185978
62760 2185978 2181606 2166709 2142407 2108573 2064666 2011476 1951150 1885642 1815983 1743046 1668139
62749 1668139 1592545 1517210 1443310 1372508 1306042 1243902 1185453 1130602 1079778 1033054 990014
62738 990014 950561 915181 884141 856844 832273 809846 789680 772170 757399 744764 733130
$$ packed form
62820F09066M016L878L915M014L843L485L376L450L127K411K176K840L558L526
62806F56681L322M031N491O477O439O056O114O754P868R392J0956J2076J2913
62793G54570J4159J5976J7705J8930K0127K1913K4319K7182L0684L4888L9289
62782A019742M3410M7457N1785N6073N9645O2374O4677O6774O8535O9868P0619
62771A680959P0214O8172O4895O1187N6978N1334M3970L5775K7350J8015P129
62760B185978m372j4897k4302l3834m3907n3190o0326o5508o9659p2937p4907
62749A668139p5594p5335p3900p0802o6466o2140n8449n4851n0824m6724m3040
62738I90014l9453l5380l1040k7297k4571k2427k0166j7510j4771j2635j1634
$$ plain form
62727 733130 721607 710264 699970 691572 685476 681830 680583 681179 682746 684897 688043 692646 698533 705260
62713 705260 712814 721554 731730 743507 757257 773329 791613 811838 834267 859677 888586 920890
62701 920890 956262 994439 1035088 1077884 1122984 1170965 1221933 1274966 1328763 1382696 1436884
62690 1436884 1491258 1544884 1596246 1644042 1687598 1726581 1760338 1787617 1807041 1817847 1820006
62679 1820006 1813632 1798574 1774716 1742485 1702806 1656711 1605219 1549460 1490701 1430200 1369225
62668 1369225 1309090 1250884 1195102 1141749 1090877 1042816 997876 956058 917241 881404 848530
62657 848530 818504 791329 767272 746386 727926 710652 693828 677743 663210 650805 640597
62646 640597 632187 624717 617209 609280 601410 594269 588018 582578 578251 575501 574225 573765 573593 573493 573157
$$ packed form
62727G33130j1523j1343j0294q398o096l646j247N96J567K151L146M603N887O727
62713G05260P554Q740J0176J1777J3750J6072J8284K0225K2429K5410K8909L2304
62701I20890L5372L8177M0649M2796M5100M7981N0968N3033N3797N3933N4188
62690A436884N4374N3626N1362M7796M3556L8983L3757K7279J9424J0806K159
62679A820006o374j5058k3858l2231l9679m6095n1492n5759n8759o0501o0975
62668A369225o0135n8206n5782n3353n0872m8061m4940m1818l8817l5837l2874
62657H48530l0026k7175k4057k0886j8460j7274j6824j6085j4533j2405j0208
62646F40597q410p470p508p929p870p141o251n440m327k750j276m60j72j00l36
$$ plain form
62631 573157 572324 571447 571467 572597 573872 574214 573302 571095 567397 562629 558343 555951 555258 555117 555171 555904 557244
62614 557244 558430 559447 561351 564726 568825 572895 577422 583316 590563 598550 607175 616753 627212 638385
62600 638385 650912 665914 683659 703330 724292 746966 772180 800189 830534 862412 894885
62589 894885 927200 959273 991589 1024257 1056354 1086493 1113914 1138578 1160227 1177778 1189971
62578 1189971 1196442 1197781 1194441 1185979 1171725 1152015 1128237 1101631 1072532 1041053 1007998 974632
62566 974632 941828 909889 878996 849369 821116 794420 769747 747420 727038 707925 690159
62555 690159 674549 661448 650162 639828 630351 622152 615401 609931 605539 601978 598877 596103 593974
62542 593974 592694 591721 590197 588017 586027 585069 585152 585677 586178 586660 587430 588811 590953 593723 596828 600129
$$ packed form
62631E73157q33q77K0J130J275L42r12k207l698m768m286k392o93j41N4P33J340
62614E57244J186J017J904L375M099M070M527N894P247P987Q625R578J0459J1173
62600F38385J2527J5002J7745J9671K0962K2674K5214K8009L0345L1878L2473
62589H94885L2315L2073L2316L2668L2097L0139K7421K4664K1649J7551J2193
62578A189971O471J339l340q462j4254j9710k3778k6606k9099l1479l3055l3366
62566I74632l2804l1939l0893k9627k8253k6696k4673k2327k0382j9113j7766
62555F90159j5610j3101j1286j0334r477q199o751n470m392l561l101k774k129
62542E93974j280r73j524k180j990r58Q3N25N01M82P70J381K142K770L105L301
$$ plain form
62526 600129 603922 608835 615400 623717 633504 644501 656797 670782 686889 705368 726204 749119
62514 749119 773762 800007 827990 857725 888886 921249 955131 990912 1028129 1065522 1102062
62503 1102062 1137464 1171557 1203726 1233375 1260451 1285012 1306636 1324836 1339863 1352545 1363471
62492 1363471 1372950 1381753 1391295 1402780 1416530 1432246 1449588 1468393 1488681 1510609 1534214 1559129
62480 1559129 1584770 1610699 1636375 1660517 1681171 1696587 1705605 1707230 1700666 1686213 1665453 1639699
62468 1639699 1608405 1569756 1522776 1468402 1408753 1346079 1282474 1219726 1158846 1100006 1043294
62457 1043294 989334 939010 892913 851383 814711 782807 754834 729747 707351 688442 673745
62446 673745 663041 655445 650126 646442 643710 641464 639916 639662 640788 642600 644393 646096 647956 649937
$$ packed form
62526F00129L793M913O565Q317R787J0997J2296J3985J6107J8479K0836K2915
62514G49119K4643K6245K7983K9735L1161L2363L3882L5781L7217L7393L6540
62503A102062L5402L4093L2169K9649K7076K4561K1624J8200J5027J2682J0926
62492A363471R479Q803R542J1485J3750J5716J7342J8805K0288K1928K3605K4915
62480A559129K5641K5929K5676K4142K0654J5416R018J625o564j4453k0760k5754
62468A639699l1294l8649m6980n4374n9649o2674o3605o2748o0880n8840n6712
62457A043294n3960n0324m6097m1530l6672l1904k7973k5087k2396j8909j4697
62446F73745j0704p596n319l684k732k246j548k54J126J812J793J703J860J981
$$ plain form
62432 649937 651773 653297 654288 654163 652331 648870 644424 639420 633752 627284 620211 612813 605185 597376 589509
62417 589509 581632 573815 566486 560234 555093 550430 545796 541434 537593 533871 529858 526071 523585 522786
62403 522786 523043 523521 523814 523815 523586 523476 523903 524901 526232 527950 530418 533688 537342 541037 544813 548756 552825
62386 552825 557170 562123 567673 573404 579235 585680 593066 600909 608530 615902 623487 631540 640085 649329
62372 649329 659575 670840 682966 696012 710167 725447 741878 759882 780079 802825 828319
62361 828319 856974 889110 924395 962145 1002256 1045248 1091212 1139246 1188204 1237571 1287327
62350 1287327 1337210 1386389 1433589 1477228 1515690 1547851 1573380 1592308 1604355 1608838 1605298 1594109
62338 1594109 1576496 1553948 1527568 1497873 1465054 1429216 1390446 1349061 1306095 1263295 1222179
$$ packed form
62432F49937J836J524R91j25j832l461m446n004n668o468p073p398p628p809p867
62417E89509p877p817p329o252n141m663m634m362l841l722m013l787k486p99
62403E22786K57M78K93Jk29j10M27R98J331J718K468L270L654L695L776L943M069
62386E52825M345M953N550N731N831O445P386P843P621P372P585Q053Q545R244
62372F49329J0246J1265J2126J3046J4155J5280J6431J8004K0197K2746K5494
62361H28319K8655L2136L5285L7750M0111M2992M5964M8034M8958M9367M9756
62350A287327M9883M9179M7200M3639L8462L2161K5529J8928J2047M483l540j1189
62338A594109j7613k2548k6380k9695l2819l5838l8770m1385m2966m2800m1116
$$ plain form
62327 1222179 1183141 1145742 1109661 1074909 1041300 1008500 976799 947251 920669 896814 874809
62316 874809 853978 833967 814434 795058 775769 756742 738345 721171 705776 692160 679863
62305 679863 668828 659703 652887 647658 642800 637857 633243 629348 626203 623924 622780 622653 622907 623020 623026
62290 623026 623262 624029 625574 628049 631339 635153 639319 643692 647812 651082 653425 655460 657855 660804 664156
62275 664156 667628 670852 673642 676489 680399 686018 693264 702015 712659 725599 740675 757647 777045
62262 777045 799993 827251 858832 894375 933371 975039 1018561 1063699 1110905 1160640 1212700
62251 1212700 1266187 1319841 1372363 1422697 1470103 1513739 1552162 1583557 1606581 1620792 1626262
62240 1626262 1623175 1611934 1593305 1568044 1536590 1499339 1456994 1410396 1360265 1307487 1253482
$$ packed form
62327A222179l9038l7399l6081l4752l3609l2800l1701k9548k6582k3855k2005
62316H74809k0831k0011j9533j9376j9289j9027j8397j7174j5395j3616j2297
62305F79863j1035r125o816n229m858m943m614l895l145k279j144j27K54J13O
62290F23026K36P67J545K475L290L814M166M373M120L270K343K035K395K949L352
62275F64156L472L224K790K847L910N619P246Q751J0644J2940J5076J6972J9398
62262G77045K2948K7258L1581L5543L8996M1668M3522M5138M7206M9735N2060
62251A212700N3487N3654N2522N0334M7406M3636L8423L1395K3024J4211N470
62240A626262l087j1241j8629k5261l1454l7251m2345m6598n0131n2778n4005
$$ plain form
62229 1253482 1199807 1147381 1096505 1047654 1001801 959762 921668 887348 856901 830443 807478
62218 807478 786973 768103 750613 734483 719572 705710 692877 681168 670725 661772 654476 648704
62206 648704 644110 640591 638339 637282 636770 636168 635616 635837 637209 639360 641760 644423 647915 652831 659320
62191 659320 666952 674948 682749 690481 698814 708310 718944 730178 741337 752037 762581 773896 786683
62178 786683 800490 814083 826999 840332 855529 872726 890911 909632 929810 952702 978679
62167 978679 1007483 1039243 1074559 1113602 1155604 1199398 1244203 1289735 1335768 1381758 1426734
62156 1426734 1469329 1507915 1540928 1567232 1586179 1597356 1600378 1595120 1582145 1562742 1538356 1509951
62144 1509951 1477959 1442742 1404914 1365237 1324474 1283493 1243349 1205015 1169088 1135930 1105976
$$ packed form
62229A253482n3675n2426n0876m8851m5853m2039l8094l4320l0447k6458k2965
62218H07478k0505j8870j7490j6130j4911j3862j2833j1709j0443q953p296n772
62206F48704m594l519k252j057n12o02n52K21J372K151K400K663L492M916O489
62191F59320P632P996P801P732Q333R496J0634J1234J1159J0700J0544J1315J2787
62178G86683J3807J3593J2916J3333J5197J7197J8185J8721K0178K2892K5977
62167I78679K8804L1760L5316L9043M2002M3794M4805M5532M6033M5990M4976
62156A426734M2595L8586L3013K6304J8947J1177L022n258j2975j9403k4386k8405
62144A509951l1992l5217l7828l9677m0763m0981m0144l8334l5927l3158k9954
$$ plain form
62133 1105976 1079698 1057268 1038580 1023615 1012458 1004749 999437 995519 992971 992604 994968 999677 1005851
62120 1005851 1012888 1020628 1029004 1037872 1047152 1056809 1066594 1075870 1083870 1090197 1095132 1099307 1102933 1105427
62106 1105427 1106063 1104976 1103186 1101469 1099527 1096614 1092726 1088811 1085996 1085030 1086349 1090005 1095316 1101046
62092 1101046 1106341 1111253 1116184 1121178 1126163 1131581 1138199 1146256 1155226 1164639 1174756 1186173 1198918
62079 1198918 1212272 1225546 1238857 1253024 1268794 1286302 1305292 1325666 1347566 1370906 1395040
62068 1395040 1419050 1442313 1464734 1486521 1507895 1528936 1549547 1569498 1588615 1607013 1625088
62057 1625088 1643128 1660836 1677208 1690990 1701331 1707983 1710862 1709561 1703486 1692450 1676930 1657660
62045 1657660 1635042 1608919 1578765 1544078 1504802 1461568 1415514 1367788 1319192 1270177 1220992
$$ packed form
62133A105976k6278k2430j8688j4965j1157p709n312l918k548l67K364M709O174
62120A005851P037P740Q376Q868R280R657R785R276Q000O327M935M175L626K494
62106A105427O36j087j790j717j942k913l888l915k815r66J319L656N311N730
62092A101046N295M912M931M994M985N418O618Q057Q970R413J0117J1417J2745
62079A198918J3354J3274J3311J4167J5770J7508J8990K0374K1900K3340K4134
62068A395040K4010K3263K2421K1787K1374K1041K0611J9951J9117J8398J8075
62057A625088J8040J7708J6372J3782J0341O652K879j301o075j1036j5520j9270
62045A657660k2618k6123l0154l4687l9276m3234m6054m7726m8596m9015m9185
$$ plain form
62034 1220992 1171888 1123387 1076319 1031369 988623 947924 909679 874877 844099 816907 792439
62023 792439 770177 749835 731047 713768 698588 685902 674872 664014 652880 642476 633850 626913
62011 626913 620931 615561 610877 606763 602847 599031 595730 593620 593210 594485 596858 599668 602870 606967
61997 606967 612104 617592 622619 627135 631666 636393 640766 643964 645475 645377 644343 643258 642520 641694 640101
61982 640101 637602 634590 631381 627972 624336 620548 616640 612713 609250 606872 605548 604345 602226 598963
61968 598963 595128 591405 588112 585294 582938 580997 579277 577499 575565 573746 572480 571918 571829 572020 572677
61953 572677 574091 576219 578762 581588 584821 588590 593002 598270 604540 611598 619135 627328 636756 647600
61939 647600 659305 671209 683209 695605 708679 722646 737617 753168 768216 781782 793781
$$ packed form
62034A220992m9104m8501m7068m4950m2746m0699l8245l4802l0778k7192k4468
62023G92439k2262k0342j8788j7279j5180j2686j1030j0858j1134j0404q626o937
62011F26913n982n370m684m114l916l816l301k110m10J275K373K810L202M097
61997F06967N137N488N027M516M531M727M373L198J511r8j034j085p38q26j593
61982F40101k499l012l209l409l636l788l908l927l463k378j324j203k119l263
61968E98963l835l723l293k818k356j941j720j778j934j819j266n62q9J91O57
61953E72677J414K128K543K826L233L769M412N268O270P058P537Q193R428J0844
61939F47600J1705J1904J2000J2396J3074J3967J4971J5551J5048J3566J1999
$$ plain form
61928 793781 804653 814423 822635 829226 834801 839833 844034 846899 848561 849637 850372 850408 849458 847896 846476
61913 846476 845700 845731 846834 849603 854579 861713 870268 879275 888146 897018 906546 917183 928534 939533
61899 939533 949314 957705 964718 969841 972318 972029 969573 965438 959572 951993 943282 934062 924291 913558
61885 913558 901877 889730 877442 864979 852431 840270 828955 818600 809097 800328 792134 784332
61873 784332 776879 769833 763141 756734 750900 746234 743053 741186 740606 741931 745881 752326 760315 769095
61859 769095 778831 790260 803970 820185 838940 860071 882977 906748 930790 955292 980861 1007700
61847 1007700 1035253 1062674 1089440 1115374 1140292 1163862 1185733 1205503 1222581 1236423 1246994
61836 1246994 1254717 1259830 1262042 1261040 1257128 1251130 1243859 1236029 1228520 1222206 1217298 1213164 1209072 1205018
$$ packed form
61928G93781J0872R770Q212O591N575N032M201K865J662J076P35L6r50j562j420
61913H46476p76L1J103K769M976P134Q555R007Q871Q872R528J0637J1351J0999
61899I39533R781Q391P013N123K477k89k456m135n866p579q711r220r771j0733
61885I13558j1681j2147j2288j2463j2548j2161j1315j0355r503q769q194p802
61873G84332p453p046o692o407n834m666l181j867n80J325L950O445P989Q780
61859G69095R736J1429J3710J6215J8755K1131K2906K3771K4042K4502K5569K6839
61847A007700K7553K7421K6766K5934K4918K3570K1871J9770J7078J3842J0571
61836A246994P723N113K212j002l912n998p271p830p509o314m908m134m092m054
$$ plain form
61822 1205018 1201655 1199475 1198229 1197098 1195240 1192117 1187379 1180578 1171066 1158294 1142214 1123265 1101847
61809 1101847 1077974 1051693 1023837 996028 969693 945192 922040 899761 878297 857831 838696
61798 838696 821458 806544 793588 781605 770098 759648 750992 743886 737386 731052 725297 720598 717008
61785 717008 714480 713013 712205 711231 709713 708177 707202 706452 705088 703001 701003 699755 698969 697913 696403
61770 696403 695032 694533 695087 696246 697477 698747 700530 703236 706758 710640 714573 718571 722802 727414 732491
61755 732491 737997 743792 749790 756069 762668 769267 775141 779435 781610 781854 781147 780601 780530 780278 779172 777395
61739 777395 775678 774377 773248 771928 770150 767578 763996 759845 756107 753395 751416 749525 747557 745874
61725 745874 744817 744372 744279 744280 744241 744110 743775 743069 742045 741044 740204 739001 736722 733384 729682 725888 721441
$$ packed form
61822A205018l363k180j246j131j858l123m738o801r512j2772j6080j8949k1418
61809A101847k3873k6281k7856k7809k6335k4501k3152k2279k1464k0466j9135
61798H38696j7238j4914j2956j1983j1507j0450q656p106o500o334n755m699l590
61785G17008k528j467q08r74j518j536r75p50j364k087j998j248p86j056j510
61770F96403j371m99N54J159J231J270J783K706L522L882L933L998M231M612N077
61755G32491N506N795N998O279O599O599N874M294K175K44p07n46p1k52j106j777
61739G77395j717j301j129j320j778k572l582m151l738k712j979j891j968j683
61725G45874j057m45r3Jl9j31l35p06j024j001q40j203k279l338l702l794m447
$$ plain form
61708 721441 716033 710555 706307 703430 700727 696985 691919 685842 679085 672081 665510 659849 654920 650235
61694 650235 645686 641517 637666 633603 629070 624640 621142 618569 615924 612309 607868 603394 599254 595092
61680 595092 590574 585986 581851 578207 574591 570642 566488 562519 558977 555843 553004 550419 548136 546163
61666 546163 544387 542652 540923 539312 537906 536608 535279 534044 533405 533877 535386 537156 538417 539254 540502
61651 540502 542663 545221 547280 548611 549710 550991 552392 553772 555202 556782 558470 560182 561678 562398
61637 562398 561929 560759 560023 560194 560540 560171 559124 557941 556685 554987 552797 550387 547727 544509 540782
61622 540782 537052 533749 530989 528778 526891 524593 521107 516537 511843 507748 504165 500790 497678 494833
61608 494833 491782 487953 483204 477712 471729 465815 460856 457254 454338 451113 447508 444310 441934 439869
$$ packed form
61708G21441n408n478m248k877k703l742n066o077o757p004o571n661m929m685
61694F50235m549m169l851m063m533m430l498k573k645l615m441m474m140m162
61680E95092m518m588m135l644l616l949m154l969l542l134k839k585k283j973
61666E46163j776j735j729j611j406j298j329j235o39M72J509J770J261Q37J248
61651E40502K161K558K059J331J099J281J401J380J430J580J688J712J496P20
61637E62398m69j170p36J71L46l69j047j183j256j698k190k410k660l218l727
61622E40782l730l303k760k211j887k298l486m570m694m095l583l375l112k845
61608D94833l051l829m749n492n983n914m959l602k916l225l605l198k376k065
$$ plain form
61594 439869 437466 434737 432048 429414 426458 422946 419115 415510 412666 410771 409485 408134 406250 403875
61580 403875 401248 398385 395178 391829 388879 386724 385260 384055 382719 381073 379186 377368 375982 375126
61566 375126 374627 374416 374669 375386 376115 376444 376622 377287 378559 379810 380416 380378 380098 379908 380009 380498 381217 381848
61548 381848 382385 383258 384769 386696 388671 390608 392468 393969 394947 395699 396538 397337 398019 399119 401120 403426
61532 403426 404887 405345 405916 407529 409950 412445 414606 416073 416181 414559 411757 408740 406017 403678 401905
61517 401905 400801 399892 398355 395750 392258 388367 384716 382024 380663 380274 380184 380111 380134 380104 379600 378527 377302
61500 377302 376298 375485 374713 373986 373266 372292 370891 369328 368114 367523 367455 367726 368350 369409 370692 371585 371534
61483 371534 370680 369895 370084 371516 373864 376628 379351 381696 383654 385580 387750 390023 392159 394302 396646
$$ packed form
61594D39869k403k729k689k634k956l512l831l605k844j895j286j351j884k375
61580D03875k627k863l207l349k950k155j464j205j336j646j887j818j386q56
61566C75126m99k11K53P17P29L29J78O65J272J251O06l8k80j90J01M89P19O31
61548C81848N37Q73J511J927J975J937J860J501R78P52Q39P99O82J100K001K306
61532D03426J461M58N71J613K421K495K161J467J08j622k802l017k723k339j773
61517D01905j104r09j537k605l492l891l651k692j361l89r0p3K3l0n04j073j225
61500C77302j004q13p72p27p20r74j401j563j214n91o8K71O24J059J283Q93n1
61483C71534q54p85J89J432K348K764K723K345J958J926K170K273K136K143K344
$$ plain form
61468 396646 398733 399636 399140 398331 398661 400542 403040 404826 405235 404510 403336 402278 401550 401109 400845 400711 400868
61451 400868 401672 403311 405390 407181 408460 409775 411540 413234 413991 413826 413649 414117 415057 416170 417667 419884
61435 419884 422718 425842 429135 432552 435825 438666 441062 443103 444759 446141 447716 449786 451931 453405
61421 453405 454105 454772 456207 458601 461591 464645 467304 469358 470947 472318 473456 474191 474637 475196 475934 476228
61405 476228 475364 473412 471225 469458 467792 465392 462147 459165 457665 457544 457500 456658 455517 454902 454612 453825
61389 453825 452539 451665 451588 451539 450779 449682 449058 448993 449034 449168 449818 451035 452426 453873 455639 457638 459247
61372 459247 460158 460925 462330 464547 467209 469935 472468 474662 476734 479309 482766 486667 490168 492945 495437
61357 495437 498325 502113 507089 513246 520211 527624 535646 544708 554734 564954 574635 583672 592369 600968
$$ packed form
61468C96646K087R03m96q09L30J881K498J786M09p25j174j058p28m41k64j34J57
61451D00868Q04J639K079J791J279J315J765J694P57j65j77M68R40J113J497K217
61435D19884K834L124L293L417L273K841K396K041J656J382J575K070K145J474
61421D53405P00O67J435K394K990L054K659K054J589J371J138P35M46N59P38K94
61405D76228q64j952k187j767j666k400l245k982j500j21m4q42j141o15k90p87
61389D53825j286q74p7m9p60j097o24o5M1J34O50J217J391J447J766J999J609
61372D59247R11P67J405K217K662K726K533K194K072K575L457L901L501K777K492
61357D95437K888L788M976O157O965P413Q022R062J0026J0220R681R037Q697Q599
$$ plain form
61343 600968 609623 618461 627360 635872 643684 650965 657941 664302 669405 673034 675555 677288 678071 677676 676366
61328 676366 674802 673370 671799 669460 665984 661585 656866 652476 648972 646808 646190 646904 648519 650886 654242
61313 654242 658691 663807 669007 674195 679760 686078 693326 701763 711697 722949 734669 746019 756934
61300 756934 767968 779420 790844 801388 810327 817221 821836 824236 824803 823776 820752 815006 806589
61287 806589 796855 787491 779089 771049 762822 754775 747598 741377 735681 730341 725664 721997 719518 718473
61273 718473 719087 721077 723577 725816 727727 729792 732519 736234 741142 747237 754169 761436 768829 776600
61259 776600 785145 794496 804141 813344 821752 829726 838022 847119 856826 866473 875344 882901 888754 892597
61245 892597 894259 893839 891778 888671 884908 880455 875064 868663 861494 854058 847022 841075 836557 833192
$$ packed form
61343F00968Q655Q838Q899Q512P812P281O976O361N103L629K521J733P83l95j310
61328F76366j564j432j571k339l476m399m719m390l504k164o18P14J615K367L356
61313F54242M449N116N200N188N565O318P248Q437R934J1252J1720J1350J0915
61300G56934J1034J1452J1424J0544Q939O894M615K400N67j027l024n746q417
61287H06589r734r364q402q040q227q047p177o221n696n340m677l667k479j045
61273G18473O14J990K500K239J911K065K727L715M908O095O932P267P393P771
61259G76600Q545R351R645R203Q408P974Q296R097R707R647Q871P557N853L843
61245H92597J662m20k061l107l763m453n391o401p169p436p036n947m518l365
$$ plain form
61231 833192 830416 828052 826481 826147 827132 829394 833134 838616 845629 853374 860986 868184 875406 883347 892346
61216 892346 902123 912055 921601 930508 938730 946361 953570 960409 966706 972350 977655 983175 989162 995550
61202 995550 1002621 1011271 1022253 1035315 1049491 1064186 1079620 1096269 1114268 1133516 1154003 1175768
61190 1175768 1198675 1222473 1246941 1271791 1296461 1320251 1342667 1363414 1382007 1397705 1410055
61179 1410055 1419318 1426106 1430713 1433094 1433420 1432131 1429236 1423968 1415486 1403718 1389210 1372330 1353053
61166 1353053 1331441 1307830 1282508 1255655 1227779 1199846 1172640 1146161 1119833 1093221 1066487
61155 1066487 1040348 1015716 993179 972723 954113 937529 923555 912408 903506 895993 889449 883888
61143 883888 879369 875928 873659 872524 872215 872449 873216 874453 875736 876796 878226 881217 886495 893870 902861
$$ packed form
61231H33192k776k364j571l34R85K262L740N482P013P745P612P198P222P941Q999
61216H92346R777R932R546Q907Q222P631P209O839O297N644N305N520N987O388
61202I95550P071Q650J0982J3062J4176J4695J5434J6649J7999J9248K0487K1765
61190A175768K2907K3798K4468K4850K4670K3790K2416K0747J8593J5698J2350
61179A410055R263O788M607K381L26j289k895n268q482j1768j4508j6880j9277
61166A353053k1612k3611k5322k6853k7876k7933k7206k6479k6328k6612k6734
61155A066487k6139k4632k2537k0456j8610j6584j3974j1147q902p513o544n561
61143H83888m519l441k269j135l09K34P67J237J283J060J430K991N278P375Q991
$$ plain form
61128 902861 913502 926420 942382 961732 984083 1008597 1034860 1063453 1095337 1130740 1168951
61117 1168951 1209128 1250783 1293498 1336789 1380525 1424959 1469945 1514533 1557683 1599023 1638448
61106 1638448 1675326 1708662 1737887 1762928 1783584 1799421 1810317 1816560 1818232 1814980 1806539 1793040
61094 1793040 1774531 1750708 1721514 1687681 1650177 1609351 1565169 1518196 1469765 1421126 1372954
61083 1372954 1325822 1280578 1237796 1197247 1158406 1121342 1086708 1054993 1026175 1000076 976606
61072 976606 955628 936942 920526 906445 894436 883954 874819 867441 862157 858629 856193 854539 853722
61059 853722 853730 854554 856599 860628 867194 876323 887711 900944 915548 931200 948016 966458 986917
61046 986917 1009586 1034620 1062036 1091376 1121795 1152685 1184005 1215985 1248841 1282849 1318222
$$ packed form
61128I02861J0641J2918J5962J9350K2351K4514K6263K8593L1884L5403L8211
61117A168951M0177M1655M2715M3291M3736M4434M4986M4588M3150M1340L9425
61106A638448L6878L3336K9225K5041K0656J5837J0896O243J672l252q441j3499
61094A793040j8509k3823k9194l3833l7504m0826m4182m6973m8431m8639m8172
61083A372954m7132m5244m2782m0549l8841l7064l4634l1715k8818k6099k3470
61072I76606k0978j8686j6416j4081j2009j0482r135p378n284l528k436j654q17
61059H53722QQ24K045M029O566R129J1388J3233J4604J5652J6816J8442K0459
61046I86917K2669K5034K7416K9340L0419L0890L1320L1980L2856L4008L5373
$$ plain form
61035 1318222 1354606 1391049 1426870 1462342 1498112 1534095 1569387 1603176 1635364 1666312 1696467
61024 1696467 1726397 1756793 1788111 1820400 1853740 1888762 1926497 1967707 2012615 2061353 2114524
61013 2114524 2173271 2239004 2313436 2399132 2500000 2621097 2768017 2946537 3162777 3423422
61003 3423422 3735852 4108541 4551469 5075348 5689041 6396465 7195124 8076966 9030649
60994 9030649 10044365 11108864 12219565 13376754 14585021 15853744 17195438 18613772
60986 18613772 20079799 21512433 22787176 23778449 24409553 24675345 24628528 24351694 23937645
60977 23937645 23474963 23023598 22584946 22094031 21451513 20577503 19449258 18102504 16607805
60968 16607805 15045158 13488369 11997181 10613367 9360527 8247372 7272251 6427120
$$ packed form
61035A318222L6384L6443L5821L5472L5770L5983L5292L3789L2188L0948L0155
61024A696467K9930L0396L1318L2289L3340L5022L7735M1210M4908M8738N3171
61013B114524N8747O5733P4432Q5696J00868J21097J46920J78520K16240K60645
61003C423422L12430L72689M42928N23879O13693P07424P98659Q81842R53683
60994I030649J013716J064499J110701J157189J208267J268723J341694J418334
60986A8613772J466027J432634J274743R91273O31104K65792m6817k76834m14049
60977B3937645m62682m51365m38652m90915o42518q74010j128245j346754j494699
60968A6607805j562647j556789j491188j383814j252840j113155r75121q45131
$$ plain form
60960 6427120 5700787 5081215 4556243 4113289 3739663 3423789 3155865 2927375 2730663
60951 2730663 2559474 2409390 2277119 2159443 2053317 1956700 1868678 1788640 1715721 1649025
60941 1649025 1587779 1530928 1476960 1424607 1373630 1324585 1277866 1233294 1190652 1150247 1112701
60930 1112701 1078347 1047001 1018246 991715 967168 944487 923694 904876 888077 873324 860745
60919 860745 850481 842453 836293 831494 827490 823574 819122 814181 809657 806547 804965 804172 803498 802910 802582
60904 802582 802349 801825 800786 799099 796509 792898 788699 784611 780809 776677 771422 764727 756776 748028 739186
60889 739186 731091 724185 718073 711896 705237 698506 692415 687302 683122 679882 677816 677048 677234 677712 678020
60874 678020 678270 679002 680688 683332 686531 689915 693510 697612 702370 707662 713472 720145 727952 736438 744605
$$ packed form
60960F427120p26333o19572n24972m42954l73626l15874k67924k28490j96712
60951B730663j71189j50084j32271j17676j06126r6617q8022q0038p2919o6696
60941A649025o1246n6851n3968n2353n0977m9045m6719m4572m2642m0405l7546
60930A112701l4354l1346k8755k6531k4547k2681k0793j8818j6799j4753j2579
60919H60745j0264q028o160m799m004l916m452m941m524l110j582p93o74n88l28
60904H02582k33n24j039j687k590l611m199m088l802m132n255o695p951q748q842
60889G39186q095o906o112o177o659o731o091n113m180l240k066p68J86M78L08
60874F78020K50P32J686K644L199L384L595M102M758N292N810O673P807Q486Q167
$$ plain form
60859 744605 751897 758784 766177 774478 783402 792476 801383 809957 818203 826332 834457 842243 849125 854883
60845 854883 859714 863740 866871 869268 871504 873951 876269 877785 878220 877852 877105 876258 875407 874423 873048 871276
60829 871276 869618 868814 869353 871406 875023 880081 886163 892866 900280 908886 918910 930032 941816 954200
60815 954200 967456 981839 997422 1014211 1032299 1051879 1073008 1095326 1118158 1141083 1164335
60804 1164335 1188429 1213439 1238860 1264149 1289143 1313928 1338539 1362819 1386311 1408296 1428289
60793 1428289 1446568 1463766 1479695 1492944 1502080 1507026 1508827 1508262 1505212 1499429 1491248 1481175 1469137
60780 1469137 1454657 1437698 1418910 1398955 1377918 1355597 1332179 1308351 1284742 1261394 1237844
60769 1237844 1213625 1188697 1163479 1138567 1114372 1091002 1068449 1046811 1026202 1006492 987304
$$ packed form
60859G44605P292O887P393Q301Q924R074Q907Q574Q246Q129Q125P786O882N758
60845H54883M831M026L131K397K236K447K318J516M35l68p47q47q51r84j375j772
60829H71276j658q04N39K053L617N058O082O703P414Q606J0024J1122J1784J2384
60815I54200J3256J4383J5583J6789J8088J9580K1129K2318K2832K2925K3252
60804A164335K4094K5010K5421K5289K4994K4785K4611K4280K3492K1985J9993
60793A428289J8279J7198J5929J3249R136M946J801n65l050n783q181j0073j2038
60780A469137j4480j6959j8788j9955k1037k2321k3418k3828k3609k3348k3550
60769A237844k4219k4928k5218k4912k4195k3370k2553k1638k0609j9710j9188
$$ plain form
60758 987304 968373 949816 931958 914945 898633 882818 867489 852823 838949 825721 812821
60747 812821 800158 788085 777026 766892 757136 747447 738106 729461 721339 713263 705099 697088 689291
60734 689291 681413 673311 665358 658118 651792 646114 640733 635596 631066 627668 625626 624587 623853 622885 621537
60719 621537 619952 618496 617740 618075 619132 619812 619160 617137 614372 611246 607527 602893 597548 592091 586924
60704 586924 582013 577234 572677 568394 564050 559187 553885 548803 544412 540471 536435 532164 527940 524120
60690 524120 521108 519409 519123 519425 519105 517793 516241 515318 515179 515578 516455 517845 519544 521334 523332 525718
60674 525718 528274 530634 532918 535666 539006 542204 544275 544917 544710 544494 544723 545432 546686 548813 552081
60659 552081 556221 560448 564035 566792 569074 571511 574744 579196 584856 591250 597645 603315 607872 611582
$$ packed form
60758I87304j8931j8557j7858j7013j6312j5815j5329j4666j3874j3228j2900
60747H12821j2663j2073j1059j0134r756r689r341q645q122q076q164q011p797
60734F89291p878q102p953p240o326n678n381n137m530l398k042j039p34r68j348
60719F21537j585j456p56L35J057O80o52k023k765l126l719m634n345n457n167
60704E86924m911m779m557m283m344m863n302n082m391l941m036m271m224l820
60690E24120l012j699k86L02l20j312j552r23j39L99Q77J390J699J790J998K386
60674E25718K556K360K284K748L340L198K071O42k07k16K29P09J254K127L268
60659E52081M140M227L587K757K282K437L233M452N660O394O395N670M557L710
$$ plain form
60645 611582 615205 619176 623014 625896 627824 629683 631951 633886 634310 632850 630041 626586 622978 619562
60631 619562 616355 612883 608733 604271 600393 597470 594994 592359 589582 587066 584983 583155 581307 579199
60617 579199 576671 573815 571074 568963 567654 566843 565944 564419 562079 559219 556411 553983 551715 549140 546243
60602 546243 543696 542246 541865 541713 541012 539801 538571 537432 536041 534390 533155 532987 533724 534591 535015 535031
60586 535031 535103 535796 537375 539419 540960 541375 541106 541203 542256 544057 546200 548555 551101 553735 556525 559924
60570 559924 564489 570410 577365 584810 592383 600099 608142 616486 624919 633510 642731 652772 662886 671804
60556 671804 678766 683838 687333 689447 690497 690992 691088 690298 688075 684622 680928 678079 676624 676424 676961 677848
60540 677848 679240 681718 685735 691132 697184 703068 708398 713456 718882 725062 731856 738937 746089 752928
$$ packed form
60645F11582L623L971L838K882J928J859K268J935M24j460k809l455l608l416
60631F19562l207l472m150m462l878k923k476k635k777k516k083j828j848k108
60617E79199k528k856k741k111j309q11q99j525k340k860k808k428k268k575k897
60602E46243k547j450l81j52p01j211j230j139j391j651j235j68P37Q67M24J6
60586E35031P2O93J579K044J541M15k69R7J053J801K143K355K546K634K790L399
60570E59924M565N921O955P445P573P716Q043Q344Q433Q591R221J0041J0114Q918
60556F71804O962N072L495K114J050M95R6p90k223l453l694k849j455k00N37Q87
60540F77848J392K478M017N397O052N884N330N058N426O180O794P081P152O839
$$ plain form
60526 752928 758675 762663 765008 766336 766882 766339 764515 761631 757954 753758 749735 746757 744914 743342 741412
60511 741412 739539 738398 737929 737784 738316 740312 743897 748489 753880 760790 770162 782354 797118 813983
60497 813983 832544 852678 874554 898201 923137 948811 975317 1003109 1031897 1060328 1086945
60486 1086945 1110988 1131965 1148916 1160604 1166266 1165765 1159106 1146089 1126449 1100192 1068040 1031745
60474 1031745 993700 955784 918562 881898 846216 812808 782876 756695 733758 713346 694808
60463 694808 677743 662352 649332 638962 630357 622068 613456 605145 598042 592320 587552 583442 579996
60450 579996 577149 574603 572058 569302 566116 562387 558356 554470 550876 547313 543649 540253 537645 535922
60436 535922 534674 533354 531586 529283 526685 524230 522274 520977 520450 520729 521485 522108 522400 522914 524194 525818
$$ packed form
60526G52928N747L988K345J328N46n43j824k884l677m196m023k978j843j572j930
60511G41412j873j141m69j45N32J996L585M592N391O910R372J2192J4764J6865
60497H13983J8561K0134K1876K3647K4936K5674K6506K7792K8788K8431K6617
60486A086945K4043K0977J6951J1688N662n01o659j3017j9640k6257l2152l6295
60474A031745l8045l7916l7222l6664l5682l3408k9932k6181k2937k0412j8538
60463F94808j7065j5391j3020j0370q605q289q612q311p103n722m768m110l446
60450E79996k847k546k545k756l186l729m031l886l594l563l664l396k608j723
60436E35922j248j320j768k303k598k455j956j297n27K79P56O23K92N14J280J624
$$ plain form
60420 525818 526756 526699 526540 527329 529190 531475 533579 535236 536349 537008 537644 538766 540521 542697 545080 547528
60404 547528 549715 551141 551497 550904 549806 548811 548515 549060 549804 549856 549151 548700 549516 551588 554205 556965 560000
60387 560000 563355 566692 569689 572303 574556 576431 578148 580142 582600 585265 587922 590716 593718 596447
60373 596447 598213 598836 598737 598471 598401 598688 599243 599784 600235 601015 602628 605079 608017 611265 614809 618375 621610
60356 621610 624681 628108 631902 635520 638961 643220 649113 656117 662961 669081 674863 680678 686385 691853
60342 691853 697329 703029 708727 714006 718672 722761 726247 728831 729888 728686 724927 719202 712699 706416
60328 706416 700711 695491 690452 685165 679355 673356 667997 663868 660860 658554 656760 655454 654500 653882 654101
60313 654101 655902 659453 664079 668920 673780 679251 686147 694909 705424 717243 729865 742924 756326
$$ packed form
60420E25818R38n7j59P89J861K285K104J657J113O59O36J122J755K176K383K448
60404E47528K187J426L56n93j098r95k96N45P44N2p05m51Q16K072K617K760L035
60387E60000L355L337K997K614K253J875J717J994K458K665K657K794L002K729
60373E96447J766O23r9k66p0K87N55N41M51P80J613K451K938L248L544L566L235
60356F21610L071L427L794L618L441M259N893P004O844O120N782N815N707N468
60342F91853N476N700N698N279M666M089L486K584J057j202l759n725o503o283
60328G06416n705n220n039n287n810n999n359m129l008k306j794j306r54o18K19
60313F54101J801L551M626M841M860N471O896Q762J0515J1819J2622J3059J3402
$$ plain form
60300 756326 770351 785535 802139 819635 836817 852452 865666 875790 882279 885055 884609 881399
60288 881399 875345 866347 855084 842794 830228 817372 804197 791075 778147 764934 751203 737857
60276 737857 726265 716732 708224 699666 690964 682588 674662 666891 659167 651841 645413 640160 636071 632952
60262 632952 630549 628585 626807 625127 623822 623390 623958 624846 625063 624337 623410 623182 623814 624816 625760 626600 627465
60245 627465 628430 629494 630632 631788 632892 633769 634122 633796 633152 632873 633261 633954 634553 635224 636420 638295 640695
60228 640695 643527 646756 650288 654266 659206 665361 672063 678292 683821 689277 695109 701184 707476 714423
60214 714423 722283 730697 739212 747792 756438 764848 772851 780790 788990 797184 804933 812316 819678 826891
60200 826891 833364 838674 842782 845842 848231 850554 853026 854948 855378 854298 852559 850676 848344 845242
$$ packed form
60300G56326J4025J5184J6604J7496J7182J5635J3214J0124O489K776m46l210
60288H81399o054q998j1263j2290j2566j2856j3175j3122j2928j3213j3731j3346
60276G37857j1592r533q508q558q702q376p926p771p724p326o428n253m089l119
60262F32952k403j964j778j680j305m32N68Q88K17p26r27k28O32J002R44Q40Q65
60245F27465R65J064J138J156J104Q77L53l26o44k79L88O93N99O71J196J875K400
60228F40695K832L229L532L978M940O155O702O229N529N456N832O075O292O947
60214G14423P860Q414Q515Q580Q646Q410Q003P939Q200Q194P749P383P362P213
60200H26891O473N310M108L060K389K323K472J922M30j080j739j883k332l102
$$ plain form
60186 845242 841602 837663 833160 827890 822350 817246 812580 807787 802644 797536 792825 788426 784168 780193
60172 780193 776773 773944 771529 769397 767511 765809 764248 762982 762364 762695 763975 765878 767907 769641 770930
60157 770930 771929 772939 774232 776039 778575 781857 785494 788872 791722 794413 797576 801574 806453 812203
60143 812203 818720 825637 832615 839874 848074 857500 867655 877870 888028 898388 908884 918995 928298
60130 928298 936814 944753 952103 958568 963784 967561 969990 971360 971973 972074 971907 971678 971401 970934 970276 969689
60114 969689 969433 969514 969798 970198 970576 970640 970119 968860 966556 962673 957031 950310 943562 937210 930925 924462
60098 924462 918100 912155 906497 900953 895895 892122 890253 890429 892381 895526 899137 902816 906767 911316
60084 911316 916154 920458 923890 927083 930795 934837 938264 940514 941770 942079 940716 936915 930849 923325
$$ packed form
60186H45242l640l939m503n270n540n104m666m793n143n108m711m399m258l975
60172G80193l420k829k415k132j886j702j561j266o18L31J280J903K029J734J289
60157G70930R99J010J293J807K536L282L637L378K850K691L163L998M879N750
60143H12203O517O917O978P259Q200R426J0155J0215J0158J0360J0496J0111R303
60130I28298Q516P939P350O465N216L777K429J370O13J01j67k29k77m67o58n87
60114I69689k56Q1K84M00L78O4n21j259k304l883n642o721o748o352o285o463
60098I24462o362n945n658n544n058l773j869J76J952L145L611L679L951M549
60084I11316M838M304L432L193L712M042L427K250J256L09j363l801o066p524
$$ plain form
60070 923325 914676 904601 893114 880961 868847 856770 844462 832053 819927 808283 797293 787471
60058 787471 779350 772946 767872 763846 760691 757991 755321 752864 751328 751087 751729 752625 753765 755817 759411
60043 759411 764398 769910 775299 780941 787729 795615 803135 808773 812418 815001 817098 818564 819289 819464 819065
60028 819065 817729 815197 811298 805537 797488 787654 777116 766151 754117 741023 728224 716888 706615
60015 706615 696405 686317 677229 669458 662666 656899 652613 649673 647344 645473 644805 645813 647966 650573
60001 650573 653680 657583 661949 666058 669685 673227 677096 681385 686051 690984 695855 700222 703936 707281
59987 707281 710708 714548 718926 723708 728383 732208 734662 735774 735928 735351 733897 731342 727767 723551 719082
59972 719082 714605 710325 706423 702898 699575 696442 693822 691987 690701 689414 687981 686959 687082 688557
$$ packed form
60070I23325q649j0075j1487j2153j2114j2077j2308j2409j2126j1644j0990r822
60058G87471q121o404n074m026l155k700k670k457j536k41O42Q96J140K052L594
60043G59411M987N512N389N642O788P886P520N638L645K583K097J466P25J75l99
60028H19065j336k532l899n761q049r834j0538j0965j2034j3094j2799j1336j0273
60015G06615j0210j0088r088p771o792n767m286k940k329j871o68J008K153K607
60001F50573L107L903M366M109L627L542L869M289M666M933M871M367L714L345
59987G07281L427L840M378M782M675L825K454J112J54n77j454k555l575m216m469
59972G19082m477m280l902l525l323l133k620j835j286j287j433j022J23J475
$$ plain form
59958 688557 690936 693519 695767 697493 698889 700358 702119 703921 705278 706007 706400 706818 707237 707319 706815 705718
59942 705718 704131 702247 700452 699138 698216 697020 694882 691719 687953 684063 680417 677288 674659 672121
59928 672121 669360 666755 665047 664313 663683 662365 660670 659680 660066 661517 663245 664775 666205 667934 670253
59913 670253 673185 676727 681114 686614 692951 699173 704423 708833 713416 719036 725597 732264 738366 743991
59899 743991 749727 755901 762188 768075 773584 779236 785228 791031 796074 800543 805026 809483 813168 815806
59885 815806 818355 822136 827410 833258 838795 843985 849145 854167 858638 862428 865642 868095 869330 869267 868344
59870 868344 866765 863991 859343 852800 844860 835844 825873 815364 804979 794977 785173 775707 767395
59857 767395 760987 756407 753078 750665 749112 748125 747241 746566 747041 749582 754040 759277 764329 769331 775130
$$ packed form
59958F88557K379K583K248J726J396J469J761J802J357P29L93M18M19Q2n04j097
59942G05718j587j884j795j314r22j196k138l163l766l890l646l129k629k538
59928F72121k761k605j708p34o30j318j695r90L86J451J728J530J430J729K319
59913F70253K932L542M387N500O337O222N250M410M583N620O561O667O102N625
59899G43991N736O174O287N887N509N652N992N803N043M469M483M457L685K638
59885H15806K549L781N274N848N537N190N160N022M471L790L214K453J235o3r23
59870H68344j579k774m648o543p940r016r971j0509j0385j0002r804r466q312
59857G67395o408m580l329k413j553r87q84o75M75K541M458N237N052N002N799
$$ plain form
59842 775130 782163 790021 798103 806308 814826 823554 832111 840264 847909 854667 859915 863322 865091 865672
59828 865672 865523 865145 864861 864374 862857 859649 854583 847605 838532 827432 814955 801968 789059 776547
59814 776547 764653 753422 742742 732734 723908 716704 711043 706469 702556 699088 696180 694292 693671
59801 693671 693606 692819 690951 689067 688167 687770 686715 684911 683308 682233 680760 677926 673736 668716 663206
59786 663206 657561 652450 648347 645044 642133 639706 638069 636961 635636 633877 632452 632290 633362 634730
59772 634730 635632 636288 637445 639297 641179 642391 643072 644100 646245 649590 653660 657875 661911 665804 669845
59757 669845 674401 679775 686067 692952 699698 705728 711228 716916 723184 729873 736893 744420 752169 759090
59743 759090 764386 768405 771924 774960 777019 778237 779346 780534 781195 781005 780466 780105 779825 779426 779184 779390
$$ packed form
59842G75130P033P858Q082Q205Q518Q728Q557Q153P645O758N248L407J769N81
59828H65672j49l78k84m87j517l208n066o978r073j1100j2477j2987j2909j2512
59814G76547j1894j1231j0680j0008q826p204n661m574l913l468k908j888o21
59801F93671o5p87j868j884r00l97j055j804j603j075j473k834m190n020n510
59786F63206n645n111m103l303k911k427j637j108j325j759j425j62J072J368
59772F34730R02O56J157J852J882J212O81J028K145L345M070M215M036L893M041
59757F69845M556N374O292O885O746O030N500N688O268O689P020P527P749O921
59743G59090N296M019L519L036K059J218J109J188O61j90n39l61k80l99k42K06
$$ plain form
59727 779390 779780 779975 780191 780965 782281 783497 784137 784442 785068 786464 788532 790712 792398 793451 794320 795534
59711 795534 797095 798476 799232 799468 799596 799696 799336 798195 796768 796088 796610 797639 798115 797756 797100 796636 796339
59694 796339 796077 795969 796156 796526 796942 797573 798702 800211 801432 801677 800981 800228 800304 801136 801844 801932 801896 802342 802945
59675 802945 802810 801599 799650 797087 793537 788856 783561 778222 772832 766998 760443 753223 745767 738918
59661 738918 733572 730009 727744 726109 724781 723702 722850 722318 722437 723626 726149 729893 734270 738423 741828
59646 741828 744554 746722 748012 748141 747487 746574 745165 742739 739824 737876 737564 738032 738159 737692 736765 735249
59630 735249 733318 731916 731850 732814 733972 735030 736040 736664 736513 735944 735659 735699 735596 735402 735767 737007 738846
59613 738846 741083 743773 746579 748719 749911 750894 752671 755545 759117 762888 766576 770049 773215 775922
$$ packed form
59727G79390L90J95K16P74J316J216O40L05O26J396K068K180J686J053Q69J214
59711G95534J561J381P56K36J28J00l60j141j427o80N22J029M76l59o56m64k97
59694G96339k62j08J87L70M16O31J129J509J221K45o96p53P6Q32P08Q8l6M46O03
59675H02945j35j211j949k563l550m681n295n339n390n834o555p220p456o849
59661G38918n346l563k265j635j328j079q52n32J19J189K523L744M377M153L405
59646G41828K726K168J290J29o54r13j409k426k915j948l12M68J27m67r27j516
59630G35249j931j402o6R64J158J058J010O24j51n69k85M0j03j94L65J240J839
59613G38846K237K690K806K140J192R83J777K874L572L771L688L473L166K707
$$ plain form
59599 775922 777909 778900 778732 777350 774840 771648 768493 765734 762953 759489 755265 750787 746517 742654 739337
59584 739337 736488 733531 729842 725674 722135 720049 719145 718488 717364 715624 713509 711427 709717 708435 707401
59569 707401 706469 705669 705200 705393 706499 708247 709831 710751 711470 712782 714719 716642 718323 720226 722646 725237
59553 725237 727606 729724 731528 732793 733772 735337 737974 741186 744449 748252 753490 760155 767398 774786
59539 774786 782839 792289 803318 815560 828443 841575 855229 870303 887134 904351 919493 931048
59527 931048 939450 946012 951550 956342 960749 965167 969598 973778 977530 980517 981864 980656 976877 971412
59513 971412 965017 957628 948688 937752 924709 909933 894404 879311 865217 851890 839117 827309
59501 827309 817001 808136 800257 793214 787256 782575 779166 777068 776343 776851 778364 780858 784404 788884
$$ packed form
59599G75922J987R91j68j382k510l192l155k759k781l464m224m478m270l863l317
59584G39337k849k957l689m168l539k086r04o57j124j740k115k082j710j282j034
59569G07401r32q00m69J93J106J748J584R20P19J312J937J923J681J903K420K591
59553G25237K369K118J804J265R79J565K637L212L263L803N238O665P243P388
59539G74786Q053R450J1029J2242J2883J3132J3654J5074J6831J7217J5142J1555
59527I31048Q402O562N538M792M407M418M431M180L752K987J347j208l779n465
59513I71412o395p389q940j0936j3043j4776j5529j5093j4094j3327j2773j1808
59501H27309j0308q865p879p043n958m681l409k098p25N08J513K494L546M480
$$ plain form
59487 788884 794155 800355 807590 815427 823290 831339 840407 850924 862490 874645 887436 900903 914591
59474 914591 928006 941123 953975 966149 977186 987254 996896 1006244 1014852 1022213 1028213 1033323 1038634
59461 1038634 1045398 1054112 1064282 1075446 1088124 1103371 1121642 1142550 1165408 1189414 1213521 1236776
59449 1236776 1258756 1279167 1297256 1312323 1324758 1335677 1345230 1351798 1353142 1347922 1335971 1317712
59437 1317712 1293870 1265569 1234399 1202340 1171443 1143121 1117615 1094481 1073685 1055951 1042057
59426 1042057 1032202 1026120 1023357 1023377 1025950 1031645 1041400 1055333 1072371 1091259 1111430 1132516 1153588
59413 1153588 1173431 1191276 1206788 1219707 1230107 1238830 1246887 1254138 1258781 1258301 1250920 1236501 1216505
59400 1216505 1193176 1168478 1143721 1120092 1099107 1082095 1069219 1059199 1049872 1038875 1024261
$$ packed form
59487G88884N271O200P235P837P863Q049R068J0517J1566J2155J2791J3467J3688
59474I14591J3415J3117J2852J2174J1037J0068R642R348Q608P361O000N110N311
59461A038634O764Q714J0170J1164J2678J5247J8271K0908K2858K4006K4107K3255
59449A236776K1980K0411J8089J5067J2435J0919R553O568J344n220j1951j8259
59437A317712k3842k8301l1170l2059l0897k8322k5506k3134k0796j7734j3894
59426A042057r855o082k763K0K573N695R755J3933J7038J8888K0171K1086K1072
59413A153588J9843J7845J5512J2919J0400Q723Q057P251M643m80p381j4419j9996
59400A216505k3329k4698k4757k3629k0985j7012j2876j0020r327j0997j4614
$$ plain form
59389 1024261 1005293 982908 959112 935709 913676 893497 875503 859657 845531 832945 822414
59378 822414 814509 808923 804663 801300 799491 799899 801917 804060 805641 807526 811021 816397 822852 829549
59364 829549 836249 843173 850813 859828 870628 882970 896387 910983 927252 945137 963951 983490
59352 983490 1004547 1027883 1053197 1079599 1106580 1133871 1160777 1186441 1210647 1233655 1255259
59341 1255259 1274663 1291236 1304719 1314635 1320225 1321178 1317740 1309849 1296848 1278603 1256371 1231964
59329 1231964 1206289 1179221 1150624 1120955 1091032 1061794 1034254 1009140 986477 965937 947579
59318 947579 931790 918468 906853 896403 887362 880105 874395 869726 866086 863856 863060 863212 863876 864964
59304 864964 866513 868590 871454 875319 879844 884271 888267 892268 896761 901639 906583 911740 917545 924033
$$ packed form
59389A024261j8968k2385k3796k3403k2033k0179j7994j5846j4126j2586j0531
59378H22414p905n586m260l363j809M08K018K143J581J885L495N376O455O697
59364H29549O700O924P640R015J0800J2342J3417J4596J6269J7885J8814J9539
59352I83490K1057K3336K5314K6402K6981K7291K6906K5664K4206K3008K1604
59341A255259J9404J6573J3483R916N590R53l438p891j3001j8245k2232k4407
59329A231964k5675k7068k8597k9669k9923k9238k7540k5114k2663k0540j8358
59318I47579j5789j3322j1615j0450r041p257n710m669l640k230p96J52O64J088
59304H64964J549K077K864L865M525M427L996M001M493M878M944N157N805O488
$$ plain form
59290 924033 930730 937218 943424 949308 954488 958224 959640 958189 954300 949554 945875 944374 945055 947520
59276 947520 951633 957541 965440 975443 987353 1000484 1014012 1027682 1041820 1056380 1070205 1081599
59264 1081599 1089581 1094326 1096444 1096129 1093131 1087255 1078558 1067090 1052739 1035674 1016895 998060 980545
59251 980545 964772 950509 937615 926261 916638 908828 903017 899495 898353 899355 902137 906383 911860
59238 911860 918488 926396 935613 945647 955586 964622 972277 978169 981996 983863 984277 983540 981304 976865
59224 976865 969696 959633 946940 932463 917465 902914 888954 875246 861645 848352 835651 823893
59212 823893 813604 805206 798532 792935 787966 783726 780519 778435 777503 777939 779831 782561 785002 786551
59198 786551 787811 789896 793119 796684 799651 801755 803147 803949 804543 805854 808534 811935 814620 816058 817191
$$ packed form
59290I24033O697O488O206N884N180L736J416j451l889m746l679j501O81K465
59276I47520M113N908P899J0003J1910J3131J3528J3670J4138J4560J3825J1394
59264A081599P982M745K118l15k998n876q697j1468j4351j7065j8779j8835j7515
59251I80545j5773j4263j2894j1354r623p810n811l522j142J002K782M246N477
59238I11860O628P908R217J0034R939R036P655N892L827J867M14p37k236m439
59224I76865p169j0063j2693j4477j4998j4551j3960j3708j3601j3293j2701j1758
59212H23893j0289q398o674n597m969m240l207k084r32M36J892K730K441J549
59198G86551J260K085L223L565K967K104J392Q02N94J311K680L401K685J438J133
$$ plain form
59183 817191 819157 822104 825631 829725 834627 840138 845825 851857 859048 868006 878613 890353 902731
59170 902731 915331 927897 940586 953871 967968 982450 996553 1009725 1021770 1032599 1042018 1049719
59158 1049719 1055335 1058415 1058479 1055221 1048806 1039876 1029082 1016536 1001799 984577 965384 945497 926254
59145 926254 908386 891911 876570 862275 849145 837144 825910 815108 804859 795614 787590 780481
59133 780481 773751 767065 760512 754606 750053 747232 745892 745557 746176 748070 751246 755259 759928 765795 773512
59118 773512 782986 793473 804336 815408 826596 837490 847519 856509 864979 873778 883277 892962 901939
59105 901939 909726 916360 921915 926348 929775 932466 934546 936098 937508 939062 940102 939372 936632 933254
59091 933254 930608 928465 925713 922200 918857 916170 913475 909955 905477 900100 893464 885257 875951 866536
$$ packed form
59183H17191J966K947L527M094M902N511N687O032P191Q958J0607J1740J2378
59170I02731J2600J2566J2689J3285J4097J4482J4103J3172J2045J0829R419P701
59158A049719N616L080O4l258o415q930j0794j2546j4737j7222j9193j9887j9243
59145I26254j7868j6475j5341j4295j3130j2001j1234j0802j0249r245q024p109
59133G80481o730o686o553n906m553k821j340l35O19J894L176M013M669N867P717
59118G73512R474J0487J0863J1072J1188J0894J0029Q990Q470Q799R499R685Q977
59105I01939P787O634N555M433L427K691K080J552J410J554J040p30k740l378
59091I33254k646k143k752l513l343k687k695l520m478n377o636q207r306r415
$$ plain form
59077 866536 857534 848618 839202 829236 819361 810351 802454 795295 788397 781662 775282 769429 764192 759671
59063 759671 755882 752640 749782 747447 745910 745207 745072 745144 745035 744372 743155 741990 741602 742018 742544 742594 742265
59046 742265 741985 741858 741619 741139 740745 740928 741783 742897 743921 745189 747430 750833 754678 758157 761242 764503
59030 764503 768351 772880 778289 784981 793184 802784 813473 824784 836078 846870 857270 867755 878483
59017 878483 888996 898554 906432 912011 915086 916214 916406 916341 916177 916117 916614 917826 919402 921285 924366 929759
59001 929759 937544 946772 956724 967641 979955 993214 1006256 1018321 1029664 1040979 1052530 1063977
58989 1063977 1074816 1084698 1093324 1100237 1104801 1106386 1104725 1100291 1094315 1088178 1082728 1078182 1074603 1072261
58975 1072261 1071611 1073162 1077311 1084028 1092766 1103009 1114877 1128738 1144317 1160740 1177569 1195063
$$ packed form
59077H66536r002q916r416r966r875r010p897p159o898o735o380n853n237m521
59063G59671l789l242k858k335j537p03j35P2j09o63j217j165l88M16N26N0l29
59046G42265k80j27k39m80l94J83Q55J114J024J268K241L403L845L479L085L261
59030G64503L848M529N409O692Q203R600J0689J1311J1294J0792J0400J0485J0728
59017H78483J0513R558P878N579L075J128J92o5j64o0M97J212J576J883L081N393
59001I29759P785R228R952J0917J2314J3259J3042J2065J1343J1315J1551J1447
58989A063977J0839R882Q626O913M564J585j661m434n976o137n450m546l579k342
58975A072261o50J551M149O717Q738J0243J1868J3861J5579J6423J6829J7494
$$ plain form
58963 1195063 1213065 1230271 1245198 1257518 1267884 1276744 1283851 1288624 1290321 1287957 1280726 1268637
58951 1268637 1252382 1232659 1210073 1185580 1160462 1135655 1111449 1087868 1065090 1043452 1023398
58940 1023398 1005422 989847 976629 965605 956745 949883 944399 939602 935324 931723 928668 925813 923184
58927 923184 920998 918913 916069 912154 907945 904521 902320 901121 900519 900143 899736 899413 899693 901102 903842
58912 903842 907899 913247 919798 927379 935895 945385 955902 967528 980516 995212 1011762 1030055 1049959
58899 1049959 1071457 1094615 1119643 1146923 1176720 1208839 1242746 1277942 1314028 1350614 1387501
58888 1387501 1424857 1462930 1501643 1540680 1579589 1617348 1652087 1681833 1705463 1722498 1732330
58877 1732330 1734506 1729665 1719242 1703952 1683287 1656715 1624655 1588076 1547984 1505765 1463261 1421872
$$ packed form
58963A195063J8002J7206J4927J2320J0366Q860P107M773J697k364p231j2089
58951A268637j6255j9723k2586k4493k5118k4807k4206k3581k2778k1638k0054
58940A023398j7976j5575j3218j1024q860o862n484m797m278l601l055k855k629
58927I23184k186k085k844l915m209l424k201j199o02l76m07l23K80J409K740
58912I03842M057N348O551P581Q516R490J0517J1626J2988J4696J6550J8293J9904
58899A049959K1498K3158K5028K7280K9797L2119L3907L5196L6086L6586L6887
58888A387501L7356L8073L8713L9037L8909L7759L4739K9746K3630J7035R832
58877A732330K176m841j0423j5290k0665k6572l2060l6579m0092m2219m2504m1389
$$ plain form
58865 1421872 1382030 1344030 1308743 1276851 1247888 1220887 1195718 1173002 1152777 1134015 1115625
58854 1115625 1097434 1079996 1063817 1048918 1034876 1021201 1007821 995277 984191 974486 965326 955887
58842 955887 946008 935985 925969 915800 905431 895194 885491 876339 867438 858654 850219 842480 835761
58829 835761 830479 826964 824909 823436 822055 821283 821955 824319 828197 833561 840194 847106 853186 858486 864124
58814 864124 870790 877992 884821 890645 894881 896898 896703 895209 893337 891173 888347 884867 881156 877505
58800 877505 873820 869810 865318 860610 856296 852705 849399 845728 841739 838013 834685 831352 828048 825548
58786 825548 824417 824440 825327 827358 830825 835348 840180 844908 849523 854124 858724 862958 865870 866591 865442
58771 865442 863733 862224 860443 857852 854867 852181 849778 847262 844663 842290 840254 838675 837904 837928 838047
$$ packed form
58865A421872l9842l8000l5287l1892k8963k7001k5169k2716k0225j8762j8390
58854A115625j8191j7438j6179j4899j4042j3675j3380j2544j1086r705r160r439
58842I55887r879j0023j0016j0169j0369j0237r703r152q901q784q435p739o719
58829H35761n282l515k055j473j381p72O72K364L878N364O633O912O080N300N638
58814H64124O666P202O829N824M236K017j95j494j872k164k826l480l711l651
58800H77505l685m010m492m708m314l591l306l671l989l726l328l333l304k500
58786H25548j131K3Q87K031L467M523M832M728M615M601M600M234K912P21j149
58771H65442j709j509j781k591k985k686k403k516k599k373k036j579p71K4J19
$$ plain form
58756 838047 837766 837645 838667 841105 844586 848852 853802 859130 864583 870321 876479 882754 889023 895959 904284
58741 904284 913692 923218 932495 941907 951695 961570 971132 980058 988039 995128 1002029 1009518 1017724 1026448
58727 1026448 1035792 1045828 1056004 1065734 1075377 1085739 1096712 1107291 1116950 1126117 1135191 1143958 1152152
58714 1152152 1159812 1166795 1172620 1177081 1180409 1182483 1182476 1179708 1174391 1167143 1158049 1146587 1132256 1115089
58700 1115089 1095669 1074758 1052813 1029868 1006092 982237 959110 936706 914460 892426 871677
58689 871677 853317 837499 823656 811295 800274 790552 781918 773894 765880 757588 749383 742059 736315
58676 736315 732606 731257 732228 734791 738034 741885 747293 755085 764950 775752 786611 797444 808626
58663 808626 820423 832687 844907 856470 866969 876219 883903 889240 891250 889578 885044 879136 872808
$$ packed form
58756H38047k81j21J022K438L481M266M950N328N453N738O158O275O269O936Q325
58741I04284R408R526R277R412R788R875R562Q926P981P089O901P489Q206Q724
58727A026448R344J0036J0176R730R643J0362J0973J0579R659R167R074Q767Q194
58714A152152P660O983N825M461L328K074pk768n317p248r094j1462j4331j7167
58700A115089j9420k0911k1945k2945k3776k3855k3127k2404k2246k2034k0749
58689H71677j8360j5818j3843j2361j1021r722q634q024q014q292q205p324n744
58676G36315l709j349R71K563L243L851N408P792R865J0802J0859J0833J1182
58663H08626J1797J2264J2220J1563J0499R250P684N337K010j672m534n908o328
$$ plain form
58650 872808 866028 858601 851039 844119 837907 831880 825957 820688 816392 812880 810264 809206 809984 812005
58636 812005 814740 818416 823162 828182 832605 836688 841355 846825 852455 857659 862210 865901 868786 871714
58622 871714 875843 881566 888483 896340 905321 915415 926199 937361 948971 961167 974020 987622
58610 987622 1001655 1014853 1025441 1032403 1035981 1036916 1035556 1031715 1025105 1015914 1005181 994379 984243
58597 984243 974264 963778 953352 944477 938038 933741 931035 929908 930627 933260 937775 944255 952711 962798
58583 962798 973955 985874 998800 1013282 1029453 1046677 1064129 1081544 1098898 1115560 1130694
58572 1130694 1144637 1158953 1174689 1191451 1208702 1226904 1246585 1267126 1287573 1308080 1329535
58561 1329535 1352212 1375648 1399385 1422897 1445154 1465140 1482346 1496004 1504530 1506824 1503601 1496418
$$ packed form
58650H72808o780p427p562o920o212o027n923n269m296l512k616j058P78K021
58636H12005K735L676M746N020M423M083M667N470N630N204M551L691K885K928
58622H71714M129N723O917P857Q981J0094J0784J1162J1610J2196J2853J3602
58610I87622J4033J3198J0588O962L578R35j360l841o610r191j0733j0802j0136
58597I84243r979j0486j0426q875o439m297k706j127P19K633M515O480Q456J0087
58583I62798J1157J1919J2926J4482J6171J7224J7452J7415J7354J6662J5134
58572A130694J3943J4316J5736J6762J7251J8202J9681K0541K0447K0507K1455
58561A329535K2677K3436K3737K3512K2257J9986J7206J3658Q526K294l223p183
$$ plain form
58549 1496418 1485969 1472545 1457403 1442048 1426447 1409594 1391713 1374318 1358026 1341902 1325170
58538 1325170 1308075 1290675 1272203 1252217 1231356 1210529 1190313 1171446 1154873 1140966 1129596
58527 1129596 1121144 1116381 1115105 1115973 1117994 1121247 1125872 1131405 1137430 1143886 1150393 1156175 1160894 1164706
58513 1164706 1167399 1168540 1168513 1168230 1167601 1165537 1161684 1156822 1151221 1144041 1134966 1125117 1115654 1106640 1097946
58498 1097946 1090145 1083632 1077804 1071912 1065987 1060362 1055072 1050257 1046357 1043510 1041565 1040982 1042717 1046919
58484 1046919 1052776 1059886 1068444 1077801 1086504 1094479 1103625 1115216 1128051 1140167 1151056 1160979 1169283
58471 1169283 1174833 1177345 1177061 1173822 1167632 1159541 1150877 1142063 1133048 1124307 1116565 1110058 1104866 1101414
58457 1101414 1099950 1100120 1101691 1104960 1109877 1115625 1121660 1128184 1134829 1140024 1142639 1143276 1142858 1140906 1136369
$$ packed form
58549A496418j0449j3424j5142j5355j5601j6853j7881j7395j6292j6124j6732
58538A325170j7095j7400j8472j9986k0861k0827k0216j8867j6573j3907j1370
58527A129596q452m763j276Q68K021L253M625N533O025O456O507N782M719L812
58513A164706K693J141k7k83o29k064l853m862n601p180r075r849r463r014q694
58498A097946p801o513n828n892n925n625n290m815l900k847j945n83J735M202
58484A046919N857P110Q558R357Q703P975R146J1591J2835J2116J0889R923Q304
58471A169283N550K512k84l239o190q091q664q814r015q741p742o507n192l452
58457A101414j464J70J571L269M917N748O035O524O645N195K615O37m18j952m537
$$ plain form
58442 1136369 1129332 1120727 1111129 1101131 1092230 1085933 1082243 1080104 1079065 1079623 1082364 1087580 1095271 1104684
58428 1104684 1114359 1123481 1132656 1142672 1153149 1163254 1172973 1182710 1192267 1201131 1209133 1215882 1220242
58415 1220242 1221348 1219535 1215405 1208748 1199403 1188420 1177140 1165628 1153130 1139520 1125293 1110691
58403 1110691 1095967 1081984 1069495 1058201 1047464 1037423 1028550 1020770 1013983 1008750 1005409 1003219
58391 1003219 1001490 1000809 1001886 1003855 1005096 1005293 1005370 1005830 1006502 1007617 1009818 1013136 1017026 1021332 1026370
58376 1026370 1032234 1038742 1045810 1053280 1060877 1068806 1077699 1087464 1097181 1106778 1117586 1130349 1144001
58363 1144001 1157560 1171822 1187697 1204116 1219357 1233438 1247363 1260825 1272555 1282353 1290895 1297978
58351 1297978 1302744 1305339 1306696 1306983 1305859 1304046 1303167 1304151 1307020 1311827 1318491 1326203 1334307 1343358 1354034
$$ packed form
58442A136369p037q605r598r998q901o297l690k139j039N58K741N216P691R413
58428A104684R675R122R175J0016J0477J0105R719R737R557Q864Q002O749M360
58415A220242J106j813m130o657r345j0983j1280j1512j2498j3610j4227j4602
58403A110691j4724j3983j2489j1294j0737j0041q873p780o787n233l341k190
58391A003219j729o81J077J969J241J97P7M60O72J115K201L318L890M306N038
58376A026370N864O508P068P470P597P929Q893R765R717R597J0808J2763J3652
58363A144001J3559J4262J5875J6419J5241J4081J3925J3462J1730R798Q542P083
58351A297978M766K595J357K87j124j813q79R84K869M807O664P712Q104R051J0676
$$ plain form
58336 1354034 1365700 1377391 1389541 1403225 1418307 1433811 1449441 1465166 1480043 1493153 1505010
58325 1505010 1516406 1526576 1534268 1539918 1544923 1549465 1552984 1556108 1560028 1564451 1568252 1571747 1576332
58312 1576332 1582319 1589129 1597172 1607416 1619455 1632049 1645239 1659897 1675584 1691031 1706397 1722852
58300 1722852 1740151 1756864 1772848 1789359 1806857 1824785 1843351 1863352 1884285 1904752 1924709
58289 1924709 1945455 1967558 1990699 2015220 2041840 2070063 2098814 2128202 2158801 2189892 2220570
58278 2220570 2251886 2285584 2321468 2358377 2396931 2438592 2482747 2527610 2573430 2621911 2672935
58267 2672935 2724777 2777192 2831418 2887597 2945117 3004935 3068519 3134963 3202233 3270644 3341902
58256 3341902 3415412 3489012 3562813 3638796 3717146 3796630 3877992 3963242 4052174 4143559 4239163
$$ packed form
58336A354034J1666J1691J2150J3684J5082J5504J5630J5725J4877J3110J1857
58325A505010J1396J0170P692N650N005M542L519L124L920M423L801L495M585
58312A576332N987O810Q043J0244J2039J2594J3190J4658J5687J5447J5366J6455
58300A722852J7299J6713J5984J6511J7498J7928J8566K0001K0933K0467J9957
58289A924709K0746K2103K3141K4521K6620K8223K8751K9388L0599L1091L0678
58278B220570L1316L3698L5884L6909L8554M1661M4155M4863M5820M8481N1024
58267B672935N1842N2415N4226N6179N7520N9818O3584O6444O7270O8411P1258
58256C341902P3510P3600P3801P5983P8350P9484Q1362Q5250Q8932R1385R5604
$$ plain form
58245 4239163 4342384 4453395 4569890 4692095 4822653 4962081 5109100 5264983 5432672
58236 5432672 5611960 5800627 6000061 6214536 6445303 6690838 6952478 7233911 7535359
58227 7535359 7854567 8193643 8558727 8953013 9376804 9834494 10334433 10881704 11478294
58218 11478294 12130761 12850386 13645945 14524785 15501643 16598382 17835619 19234811 20829961
58209 20829961 22668975 24805837 27305550 30259948 33788431 38023160 43106462 49202651
58201 49202651 56495675 65168066 75383543 87264242 100831927 115942489 132293668
58194 132293668 149516946 167266929 185248889 203219511 220998554 238477715 255638663
58187 255638663 272606015 289613741 306663183 322942008 336541778 344965882 346207099
$$ packed form
58245D239163J03221J11011J16495J22205J30558J39428J47019J55883J67689
58236E432672J79288J88667J99434K14475K30767K45535K61640K81433L01448
58227G535359L19208L39076L65084L94286M23791M57690M99939N47271N96590
58218A1478294O52467P19625P95559Q78840R76858J096739J237237J399192J595150
58209B0829961J839014K136862K499713K954398L528483M234729N083302O096189
58201D9202651P293024Q672391J0215477J1880699J3567685J5110562J6351179
58194A32293668J7223278J7749983J7981960J7970622J7779043J7479161J7160948
58187B55638663J6967352J7007726J7049442J6278825J3599770Q424104J241217
$$ plain form
58180 346207099 339588598 325822491 306488233 283470290 258611248 233507415 209377992
58173 209377992 187038699 166951672 149256777 133785391 120153198 107941102 96841478
58166 96841478 86683137 77383134 68905919 61240147 54373168 48273761 42896235 38188124
58158 38188124 34086726 30519278 27416474 24721412 22382700 20348244 18571492 17016501
58150 17016501 15651972 14446777 13375233 12420115 11566251 10796572 10097332 9461005 8880706
58141 8880706 8347244 7854311 7400824 6985115 6602034 6248210 5924565 5630587 5361108
58132 5361108 5111510 4881323 4669966 4473617 4289018 4116083 3954111 3799603 3650368
58123 3650368 3507969 3373806 3246520 3125320 3011869 2906646 2807216 2712279 2623683 2542244
$$ packed form
58180C46207099o618501j3766107j9334258k3017943k4859042k5103833k4129423
58173B09377992k2339293k0087027j7694895j5471386j3632193j2212096j1099624
58166I6841478j0158341r300003q477215p665772o866979o099407n377526m708111
58158C8188124m101398l567448l102804k695062k338712k034456j776752j554991
58150A7016501j364529j205195j071544r55118q53864p69679o99240o36327n80299
58141H880706n33462m92933m53487m15709l83081l53824l23645k93978k69479
58132E361108k49598k30187k11357j96349j84599j72935j61972j54508j49235
58123C650368j42399j34163j27286j21200j13451j05223r9430r4937q8596q1439
$$ plain form
58113 2542244 2465267 2390595 2319613 2253777 2191453 2130628 2071857 2016208 1963056 1911908 1863746
58102 1863746 1818653 1774799 1731595 1690994 1653896 1618052 1581499 1545375 1511421 1479295 1448253
58091 1448253 1418972 1391831 1365757 1340471 1317469 1297132 1277376 1256835 1236837 1218503 1200562
58080 1200562 1182022 1164368 1148863 1133987 1117805 1100831 1084386 1068096 1051210 1034610 1019356
58069 1019356 1004752 989780 974924 960905 947264 933855 922058 912607 903881 894180 884224 875577
58057 875577 868090 860717 853505 846932 840391 833016 824985 816620 807400 797292 787767 780081 773669 767500
58043 767500 761704 756577 751361 745443 739529 734280 728940 722559 715347 707676 699097 689547 680118 671432
58029 671432 662674 653387 644664 637251 630063 621967 613458 605147 596300 586595 577698 571222 566401 561641
$$ packed form
58113B542244p6977p4672p0982o5836o2324o0825n8771n5649n3152n1148m8162
58102A863746m5093m3854m3204m0601l7098l5844l6553l6124l3954l2126l1042
58091A448253k9281k7141k6074k5286k3002k0337j9756k0541j9998j8334j7941
58080A200562j8540j7654j5505j4876j6182j6974j6445j6290j6886j6600j5254
58069A019356j4604j4972j4856j4019j3641j3409j1797r451q726r701r956q647
58057H75577p487p373p212o573o541p375q031q365r220j0108r525p686o412o169
58043G67500n796n127n216n918n914n249n340o381p212p671q579r550r429q686
58029F71432q758r287q723p413p188q096q509q311q847r705q897o476m821m760
$$ plain form
58015 561641 557083 553743 551297 548657 545847 543528 541597 539846 539034 539627 540557 540939 541910 544866 548837
58000 548837 551682 553090 554399 556065 557385 558366 559870 561997 563956 565475 566967 568522 570011 571855
57986 571855 574375 576773 578017 578296 578380 578031 576404 573612 570541 567534 564504 561915 560317 559259 557846
57971 557846 556031 554256 552319 549921 547865 547383 548545 550465 552738 555517 558544 561275 563758 566420
57957 566420 569344 572555 576376 580550 583797 585387 586339 587851 589438 590111 590499 592001 594422 596299 597289
57942 597289 598447 600291 602325 604463 607248 610508 613345 615692 618484 622012 625437 628229 630913 633954
57928 633954 636915 639129 640460 641113 641234 640764 639221 635868 630685 624759 619023 613149 606536 599719 593647
57913 593647 588132 582385 576767 572549 570024 568090 565709 562719 559310 555837 553022 551237 549668 547163
$$ packed form
58015E61641m558l340k446k640k810k319j931j751q12N93R30L82R71K956L971
58000E48837K845J408J309J666J320R81J504K127J959J519J492J555J489J844
57986E71855K520K398J244K79Q4l49j627k792l071l007l030k589j598j058j413
57971E57846j815j775j937k398k056m82J162J920K273K779L027K731K483K662
57957E66420K924L211L821M174L247J590R52J512J587O73L88J502K421J877R90
57942E97289J158J844K034K138K785L260K837K347K792L528L425K792K684L041
57928F33954K961K214J331O53J21m70j543l353n183n926n736n874o613o817o072
57913E93647n515n747n618m218k525j934k381k990l409l473k815j785j569k505
$$ plain form
57899 547163 543680 539863 535658 530717 525808 522234 519869 517247 513671 509818 506163 502281 497991 493859
57885 493859 490165 486602 483292 480845 479083 476893 473789 470476 467450 464105 459776 454714 449556 444619
57871 444619 440047 435853 431596 426860 422202 418653 416152 413629 410867 409038 408841 409298 409069 408064 407101
57856 407101 406830 407636 409808 413074 416561 419842 423521 428275 433838 439470 444959 450633 456695 462925 468783
57841 468783 473658 477392 480559 483776 486708 488423 488750 488581 488739 489372 490583 492728 495651 498479 500647
57826 500647 502476 504252 505480 505666 505339 505632 507068 509163 510977 511759 511311 510035 508467 506693 504469
57811 504469 501821 499082 496288 493026 488972 484155 478635 472387 465516 458196 450435 442419 434924 428703
57797 428703 423501 418329 412808 407581 403363 400231 397896 396064 394512 393423 393590 395549 398570 401353
$$ packed form
57899E47163l483l817m205m941m909l574k365k622l576l853l655l882m290m132
57885D93859l694l563l310k447j762k190l104l313l026l345m329n062n158m937
57871D44619m572m194m257m736m658l549k501k523k762j829j97M57k29j005r63
57856D07101k71Q06K172L266L487L281L679M754N563N632N489N674O062O230N858
57841D68783M875L734L167L217K932J715L27j69J58O33J211K145K923K828K168
57826E00647J829J776J228J86l27K93J436K095J814P82m48j276j568j774k224
57811E04469k648k739k794l262m054m817n520o248o871p320p761q016p495o221
57797D28703n202n172n521n227m218l132k335j832j552j089J67J959L021K783
$$ plain form
57783 401353 403741 406785 411051 415860 420513 425304 430864 437253 444140 451194 457874 463437 467528 470350
57769 470350 472154 473069 473391 473266 472162 469542 466105 463199 460782 457194 451417 444389 437488 430829 423915
57754 423915 416932 410344 403946 397381 391137 386046 382181 379012 376330 374214 372341 370199 367865 365934
57740 365934 364729 364044 363564 363056 362247 360900 359014 356755 354361 352199 350607 349532 348617 347759 347160 346763
57724 346763 346164 345257 344380 343650 342763 341705 340944 340560 339914 338648 337323 336464 335598 333852 331045 327603 323892
57707 323892 320296 317486 315874 315003 314033 312613 310825 308693 306360 304501 303876 304502 305687 306773 307539
57692 307539 308089 308673 309475 310351 311059 311871 313556 316518 320538 325669 332790 342768 355578 370802 388552
57677 388552 409324 433334 460532 490846 523734 557897 592133 626307 660881 695784 730404
$$ packed form
57783D01353K388L044M266M809M653M791N560O389O887P054O680N563M091K822
57769D70350J804R15L22j25j104k620l437k906k417l588n777p028o901o659o914
57754D23915o983o588o398o565o244n091l865l169k682k116j873k142k334j931
57740C65934j205o85m80n08q09j347j886k259k394k162j592j075r15q58n99l97
57724C46763n99r07q77p30q87j058p61l84o46j266j325q59q66j746k807l442l711
57707C23892l596k810j612q71r70j420j788k132k333j859o25O26J185J086P66
57692C07539N50N84Q02Q76P08Q12J685K962M020N131P121R978J2810J5224J7750
57677C88552K0772K4010K7198L0314L2888L4163L4236L4174L4574L4903L4620
$$ plain form
57666 730404 764459 798006 830301 858989 880461 890962 887862 870676 841073 801762 755506 705198
57654 705198 654120 605307 560702 521199 487123 458144 433183 411235 392224 376483 363608
57643 363608 352562 342845 334817 328707 323918 319610 315592 312417 310731 310566 311052 310890 309395 307077 304962
57628 304962 303412 301908 299932 297664 295703 294369 293549 293103 293148 293730 294305 293952 292337 290112 287973 285690
57612 285690 282791 279857 278074 277376 276183 273513 270404 268525 268148 268293 268261 268060 267714 267136 266545 266184 265705
57595 265705 264473 262435 260134 257993 256180 254936 254323 253727 252325 250095 247773 245795 243871 241644 239211
57580 239211 236813 234517 232383 230608 229349 228554 228020 227429 226517 225363 224284 223200 221458 218764 215943
57565 215943 214133 213464 213170 212820 212614 212462 211662 209883 207854 206661 206708 207654 209044 210604 212138 213499
$$ packed form
57666G30404L4055L3547L2295K8688K1472J0501l100j7186k9603l9311m6256n0308
57654G05198n1078m8813m4605l9503l4076k8979k4961k1948j9011j5741j2875
57643C63608j1046r717q028o110m789m308m018l175j686j65M86j62j495k318k115
57628C04962j550j504j976k268j961j334q20m46M5N82N75l53j615k225k139k283
57612B85690k899k934j783o98j193k670l109j879l77J45l2k01l46n78n91l61m79
57595B65705j232k038k301k141j813j244o13n96j402k230k322j978j924k227k433
57580B39211k398k296k134j775j259p95n34n91r12j154j079j084j742k694k821
57565B15943j810o69k94l50k06j52q00j779k029j193M7R46J390J560J534J361
$$ plain form
57549 213499 214699 215925 217354 219016 220804 222652 224537 226163 226840 226153 224785 224089 224598 225485 225899 226165
57533 226165 227031 228190 228452 227278 225429 224016 223477 223504 223453 222734 221282 219710 218694 218242 217932 217693 217874
57516 217874 218643 219835 221347 223127 224768 225693 225837 225699 225671 225806 226282 227453 229180 230654 231177 230775 229851
57499 229851 228647 227368 226446 226167 226206 225902 225005 223871 222853 221736 219992 217569 215160 213531 212675 211954
57483 211954 210964 209887 208965 208118 207313 206762 206460 205972 205129 204490 204559 204873 204434 202879 200701 198568 196968
57466 196968 196262 196377 196557 196058 195082 194472 194585 195094 195746 196539 197152 197023 196242 195662 195762 195966 195478 194343
57448 194343 193322 193013 193413 194095 194573 194666 194635 194771 194878 194472 193528 192641 192317 192482 192786 193110 193601 194468 195804
57429 195804 197363 198467 198495 197586 196604 196313 196793 197653 198468 198919 198841 198321 197688 197354 197701 198834 200188 200733
$$ packed form
57549B13499J200J226J429J662J788J848J885J626O77o87j368o96N09Q87M14K66
57533B26165Q66J159K62j174j849j413n39K7n1p19j452j572j016m52l10k39J81
57516B17874P69J192J512J780J641R25J44j38k8J35M76J171J727J474N23m02r24
57499B29851j204j279r22k79L9l04q97j134j018j117j744k423k409j629q56p21
57483B11954r90j077r22q47q05n51l02m88q43o39O9L14m39j555k178k133j600
57466A96968p06J15J80m99r76o10J13N09O52P93O13j29p81n80J00K04m88j135
57448A94343j021l09M00O82M78R3l1J36J07m06r44q87l24J65L04L24M91Q67J336
57429A95804J559J104K8r09r82k91M80Q60Q15M51p8n20o33l34L47J133J354N45
$$ plain form
57411 200733 200006 198747 198039 198058 198305 198818 200179 202256 203890 204297 204038 204120 204651 204978 204733 204200 203856 204013
57393 204013 204796 206043 207324 208329 209215 210361 211837 213305 214378 214968 215370 216097 217563 219767 222295
57378 222295 224588 226194 226944 227070 227095 227345 227636 227585 227039 225939 224012 221120 217857 215289 213952 213472 213174
57361 213174 212758 212311 212065 212271 213020 214052 214879 215149 214744 213736 212557 211993 212485 213547 214318 214622 214942
57344 214942 215449 215742 215632 215556 215930 216607 217220 217610 217694 217302 216354 214954 213262 211583 210500 210407 210880 211153
57326 211153 211259 212047 213889 216101 217948 219492 220961 221925 221793 220776 219788 219609 220606 222944 226460 230382
57310 230382 233681 235861 237211 238289 239299 240011 240237 240395 241340 243397 245762 247362 248216 249365 251428
57295 251428 253916 256151 258158 260259 262304 263863 264869 265665 266616 267906 269446 270867 272001 273498 276413
$$ packed form
57411B00733p27j259p08J9K47N13J361K077J634M07k59Q2N31L27k45n33l44J57
57393B04013P83J247J281J005Q86J146J476J468J073N90M02P27J466K204K528
57378B22295K293J606P50J26K5K50K91n1n46j100j927k892l263k568j337m80k98
57361B13174m16m47k46K06P49J032Q27K70m05j008j179n64M92J062P71L04L20
57344B14942N07K93j10p6L74O77O13L90Q4l92r48j400j692j679j083r3M73K73
57326B11153J06P88J842K212J847J544J469R64j32j017r88j79R97K338L516L922
57310B30382L299K180J350J078J010P12K26J58R45K057K365J600Q54J149K063
57295B51428K488K235K007K101K045J559J006P96R51J290J540J421J134J497K915
$$ plain form
57280 276413 280929 286056 290988 296172 302625 310762 320466 331743 344476 357819 370613 382367 393302
57267 393302 403606 413177 422024 430291 437909 444702 450890 456996 463222 469243 474641 479241 483106 486608
57253 486608 490456 495205 500635 505998 510951 515932 521514 527729 534247 541020 548491 557151 566980 577354
57239 577354 587511 597199 606885 617382 629268 642580 656916 671815 687177 703339 720638 738952
57227 738952 757825 776895 795975 814843 833438 852308 872440 894488 918428 943959 970748
57216 970748 998239 1025819 1053554 1082284 1112583 1143951 1175381 1206380 1237069 1267667 1298469
57205 1298469 1330095 1363136 1397457 1432252 1466841 1501171 1535578 1570336 1605472 1640872 1676581
57194 1676581 1713080 1751137 1791245 1833386 1877404 1923227 1970453 2017980 2064518 2109418 2152752
$$ packed form
57280B76413M516N127M932N184O453Q137R704J1277J2733J3343J2794J1754J0935
57267C93302J0304R571Q847Q267P618O793O188O106O226O021N398M600L865L502
57253D86608L848M749N430N363M953M981N582O215O518O773P471Q660R829J0374
57239E77354J0157R688R686J0497J1886J3312J4336J4899J5362J6162J7299J8314
57227G38952J8873J9070J9080J8868J8595J8870K0132K2048K3940K5531K6789
57216I70748K7491K7580K7735K8730L0299L1368L1430L0999L0689L0598L0802
57205A298469L1626L3041L4321L4795L4589L4330L4407L4758L5136L5400L5709
57194A676581L6499L8057M0108M2141M4018M5823M7226M7527M6538M4900M3334
$$ plain form
57183 2152752 2194867 2236393 2278575 2322921 2370161 2419867 2471364 2524791 2580990 2640540 2703335
57172 2703335 2769073 2837619 2908555 2980728 3052954 3125235 3198731 3274253 3351276 3428759 3506443
57161 3506443 3584669 3663159 3740715 3816149 3888857 3958326 4023533 4083088 4135692 4180479 4217303
57150 4217303 4246889 4270505 4289468 4305226 4319787 4335718 4355717 4382463 4418508 4465509 4523295
57139 4523295 4589909 4662435 4737456 4811202 4880468 4943805 5001360 5053437 5099659 5139483 5172759
57128 5172759 5199681 5221118 5239371 5257853 5279328 5304520 5332426 5361373 5389692 5416295 5441490
57117 5441490 5467217 5496311 5531636 5575870 5631600 5701427 5788088 5894317 6022361 6174349 6354367
57106 6354367 6570611 6835290 7162833 7568907 8070658 8686440 9434610 10332371 11394316
$$ packed form
57183B152752M2115M1526M2182M4346M7240M9706N1497N3427N6199N9550O2795
57172B703335O5738O8546P0936P2173P2226P2281P3496P5522P7023P7483P7684
57161C506443P8226P8490P7556P5434P2708O9469O5207N9555N2604M4787L6824
57150D217303K9586K3616J8963J5758J4561J5931J9999K6746L6045M7001N7786
57139D523295O6614P2526P5021P3746O9266O3337N7555N2077M6222L9824L3276
57128E172759K6922K1437J8253J8482K1475K5192K7906K8947K8319K6603K5195
57117E441490K5727K9094L5325M4234N5730O9827Q6661J06229J28044J51988J80018
57106F354367K16244K64679L27543M06074N01751O15782P48170Q97761J061945
$$ plain form
57097 11394316 12629535 14038105 15609081 17321212 19148514 21074198 23110568 25311950
57089 25311950 27767421 30572942 33791167 37405007 41275572 45132367 48623553 51414926
57081 51414926 53283633 54158488 54104963 53282591 51893617 50130314 48136936 46004115 43788371
57072 43788371 41528123 39242406 36927597 34568624 32158110 29706760 27241492 24799418
57064 24799418 22422446 20151813 18023437 16065739 14297875 12726542 11344818 10136667
57056 10136667 9083802 8168941 7375113 6685283 6083640 5556458 5091887 4679959 4312888
57047 4312888 3984561 3689566 3422992 3180769 2959628 2756939 2570747 2399383 2240637
57038 2240637 2091971 1952035 1821286 1700542 1589528 1487444 1394274 1310796 1237787 1175771
$$ packed form
57097A1394316J235219J408570J570976J712131J827302J925684K036370K201382
57089B5311950K455471K805521L218225L613840L870565L856795L491186K791373
57081E1414926J868707Q74855n3525q22372j388974j763303j993378k132821k215744
57072D3788371k260248k285717k314809k358973k410514k451350k465268k442074
57064B4799418k376972k270633k128376j957698j767864j571333j381724j208151
57056A0136667j052865r14861p93828o89830o01643n27182m64571m11928l67071
57047D312888l28327k94995k66574k42223k21141k02689j86192j71364j58746
57038B240637j48666j39936j30749j20744j11014j02084r3170q3478p3009o2016
$$ plain form
57028 1175771 1124936 1084513 1052626 1027379 1007727 992976 982267 975327 973182 977331 988523 1006693
57016 1006693 1030915 1057837 1080414 1089891 1080222 1050859 1005804 950670 890466 828920 768693 711589
57004 711589 658464 609241 563669 522237 485942 455089 428875 406394 387460 372085 359802
56993 359802 350101 343051 338868 337094 336740 337039 337662 338411 339206 340242 341807 343932 346321 348377 349214 348037
56977 348037 344701 339608 333037 325089 316353 307983 300810 295054 291139 289981 291875 295805 300473 305549
56963 305549 311322 317786 324889 333219 343480 355452 368182 381012 393634 405195 414086 418799 418602
56950 418602 413477 404024 391471 377223 362208 346972 332535 320719 313298 310815 312319 316299 321874
56937 321874 329062 337914 347775 357778 367833 378567 390283 402597 414978 426727 436136 440602
$$ packed form
57028A175771n0835m0423l1887k5247j9652j4751j0709o940k145M149J1192J8170
57016A006693K4222K6922K2577R477r669k9363m5055n5134o0204o1546o0227n7104
57004G11589n3125m9223m5572m1432l6295l0853k6214k2481j8934j5375j2283
56993C59802r701p050m183j774l54K99O23P49P95J036J565K125K389K056Q37j177
56977C48037l336n093o571p948q736q370p173n756l915j158J894L930M668N076
56963C05549N773O464P103Q330J0261J1972J2730J2830J2622J1561Q891M713j97
56950D18602n125r453j2553j4248j5015j5236j4437j1816p421k483J504L980N575
56937C21874P188Q852R861J0003J0055J0734J1716J2314J2381J1749R409M466
$$ plain form
56925 440602 438296 429310 414811 395770 373135 348477 323475 299011 275527 254024 235770 221058
56913 221058 208965 198505 189499 182294 177155 174088 172805 172727 173261 174230 175893 178573 182448 187634 194207
56898 194207 202128 211329 221869 233886 247381 262035 277135 291763 305378 318272 331254 344866
56886 344866 359073 373558 387786 400786 411397 418936 423210 423904 420658 414014 405640 397231 389675
56873 389675 383603 380124 380394 384750 392709 403632 417106 432988 451327 472005 494337 517413 540986
56860 540986 565560 591530 618661 646232 672673 694791 708529 711465 704278 689575 670086 648445
56848 648445 627578 610104 597621 591174 591838 600128 615344 636286 662208 692444 725759 761024
56836 761024 798140 837465 878751 921453 965410 1009809 1051347 1084385 1103334 1104737 1087798 1054274
$$ packed form
56925D40602k306q986j4499j9041k2635k4658k5002k4464k3484k1503j8254j4712
56913B21058j2093j0460r006p205n139l067j283p8N34R69J663K680L875N186O573
56898A94207P921R201J0540J2017J3495J4654J5100J4628J3615J2894J2982J3612
56886C44866J4207J4485J4228J3000J0611P539M274O94l246o644q374q409p556
56873C89675o072l479K70M356P959J0923J3474J5882J8339K0678K2332K3076K3573
56860E40986K4574K5970K7131K7571K6441K2118J3738K936p187j4703j9489k1641
56848F48445k0867j7474j2483o447O64Q290J5216K0942K5922L0236L3315L5265
56836G61024L7116L9325M1286M2702M3957M4399M1538L3038J8949J403j6939l3524
$$ plain form
56824 1054274 1008198 954923 899690 846729 799014 758182 724881 699660 683233 675554 675193 680388
56812 680388 690299 704590 722354 742415 764374 788447 814358 840969 866476 887881 900719 900722
56800 900722 886231 858570 820508 775339 727062 679833 636497 598250 565687 539317 518963
56789 518963 503744 493130 487317 486242 488893 493940 500484 507977 516041 524715 534307 544387 553062
56776 553062 557493 555137 544707 526384 501401 471477 438638 405192 373007 342522 313274 285763
56764 285763 261840 242489 226271 211180 197271 186020 177621 170632 164148 158634 154359 150509 146356
56751 146356 142127 138218 134589 131363 129014 127508 126130 124559 123304 122714 122467 122341 122567 122974 122804 121902
56735 121902 121208 121457 122095 122121 121352 120394 119916 120374 121813 123560 124714 125256 125995 127177 128017 128037 127958 128671
$$ packed form
56824A054274m6076n3275n5233n2961m7715m0832l3301k5221j6427p679l61N195
56812F80388R911J4291J7764K0061K1959K4073K5911K6611K5507K1405J2838L
56800I00722j4491k7661l8062m5169m8277m7229m3336l8247l2563k6370k0354
56789E18963j5219j0614n813j075K651N047O544P493Q064Q674R592J0080Q675
56776E53062M431k356j0430j8323k4983k9924l2839l3446l2185l0485k9248k7511
56764B85763k3923j9351j6218j5091j3909j1251q399o989o484n514m275l850m153
56751A46356m229l909l629l226k349j506j378j571j255n90k47j26K26M07j70r02
56735A21902o94K49O38K6p69r58m78M58J439J747J154N42P39J182Q40K0p9P13
$$ plain form
56717 128671 130110 131718 133306 134812 135911 136510 137033 137618 137692 136984 136269 136374 137000 137346 137405 137821 138845
56700 138845 140250 141963 144019 146023 147308 147604 147130 146257 145473 145383 146236 147619 148905 149760 149985 149358 148029
56683 148029 146634 145613 144879 144493 144991 146416 147655 147579 146476 145541 145252 145085 144637 144124 143701 143115 142291
56666 142291 141776 142242 143786 145888 147946 149783 151595 153354 154472 154515 154162 154728 156520 158359 159215 159560
56650 159560 160482 162089 163672 165020 166583 168457 170145 171471 172951 175054 177547 179785 181255 181812 181818
56635 181818 182095 183324 185325 187319 188950 190630 192644 194353 194736 193644 192133 191414 191653 192044 191944 191525
56619 191525 191156 190588 189299 187430 185728 184570 183661 182832 182486 182882 183514 183604 182880 181606 180192 179088 178648
56602 178648 178740 178822 178628 178376 178033 176970 174827 172244 170157 168739 167685 167147 167579 168759 169776 170163 170484
$$ packed form
56717A28671J439J608J588J506J099N99N23N85P4p08p15J05O26L46N9M16J024
56700A38845J405J713K056K004J285K96m74q73p84r0Q53J383J286Q55K25o27j329
56683A48029j395j021p34l86M98J425J239p6j103r35k89j67m48n13m23n86q24
56666A42291n15M66J544K102K058J837J812J759J118M3l53N66J792J839Q56L45
56650A59560R22J607J583J348J563J874J688J326J480K103K493K238J470N57O
56635A81818K77J229K001J994J631J680K014J709L83j092j511p19K39L91j00m19
56619A91525l69n68j289j869j702j158r09q29l46L96O32R0p24j274j414j104m40
56602A78648R2Q2j94k52l43j063k143k583k087j418j054n38M32J180J017L87L21
$$ plain form
56585 170484 171530 173319 175134 176331 176898 177328 178061 179082 180093 181054 182354 184326 186712 188749 189782
56570 189782 189880 189990 191406 194806 199770 205392 211248 217436 223914 230373 236763 243344 250104 256664 262819
56555 262819 268609 273787 277876 280909 283396 285301 285867 284837 283048 281309 279405 276886 274147 271889
56541 271889 269980 267629 264484 260893 257349 254226 251827 250134 248713 247218 245678 243938 241458 238331
56527 238331 235856 235146 235502 235121 233282 230895 228954 227414 225725 223687 221417 219052 216766 214646 212377
56512 212377 209495 206155 203219 201348 200325 199481 198500 197581 197038 197013 197544 198603 199915 200873 200942 200286 199704
56495 199704 199617 199401 198176 196060 193977 192333 190733 189163 188424 188911 189824 190309 190766 192181 194620 197191
56479 197191 199228 200733 201805 202418 202774 203253 203928 204491 204692 204515 204080 203651 203591 204030 204714 205414 206144 206770
$$ packed form
56585A70484J046J789J815J197N67M30P33J021J011R61J300J972K386K037J033
56570A89782R8J10J416L400M964N622N856O188O478O459O390O581O760O560O155
56555B62819N790N178M089L033K487J905N66j030j789j739j904k519k739k258
56541B71889j909k351l145l591l544l123k399j693j421j495j540j740k480l127
56527B38331k475p10L56l81j839k387j941j540j689k038k270k365k286k120k269
56512B12377k882l340k936j871j023q44r81r19n43k5N31J059J312R58O9o56n82
56495A99704q7k16j225k116k083j644j600j570p39M87R13M85M57J415K439K571
56479A97191K037J505J072O13L56M79O75N63K01j77m35m29o0M39O84P00P30O26
$$ plain form
56461 206770 206857 206250 205410 204768 204229 203752 203841 204799 205953 206404 206271 206443 207263 208202 208759 208991 209124 209235 209442
56442 209442 209977 211005 212583 214685 216967 218716 219415 219275 219008 219238 220263 221987 223799 224927 225191 225049
56426 225049 224744 224005 222902 222243 222615 223641 224729 225881 227130 227927 227855 227372 227007 226481 225520 224887 225517
56409 225517 227046 228290 228857 229266 229791 230247 230693 231285 231627 231277 230725 230868 231722 232696 233859 235723 237930
56392 237930 239479 240313 241461 243403 245506 247200 248533 249294 248908 247702 247122 247978 249407 250210 250480 251228
56376 251228 253024 255641 258514 261031 262764 263797 264441 264422 262994 260266 257802 257280 258825 261103 262786
56361 262786 263550 263879 264375 265317 266625 268085 269514 270741 271707 272648 273907 275330 276266 276468 276608 277496 279158
56344 279158 281112 283121 285163 287140 289198 291917 295501 299256 302509 305548 308836 311933 314197 316023
$$ packed form
56461B06770Q7o07q40o42n39m77Q9R58J154M51j33J72Q20R39N57K32J33J11K07
56442B09442N35J028J578K102K282J749O99j40k67K30J025J724J812J128K64j42
56426B25049l05p39j103o59L72J026J088J152J249P97p2m83l65n26r61o33O30
56409B25517J529J244N67M09N25M56M46N92L42l50n52J43Q54R74J163J864K207
56392B37930J549Q34J148J942K103J694J333P61l86j206n80Q56J429Q03K70P48
56376B51228J796K617K873K517J733J033O44j9j428k728k464n22J545K278J683
56361B62786P64L29M96R42J308J460J429J227R66R41J259J423R36K02J40Q88J662
56344B79158J954K009K042J977K058K719L584L755L253L039L288L097K264J826
$$ plain form
56330 316023 318215 320544 322162 323198 324611 326603 328488 330139 332193 334665 336619 337530 337867 338104 338273
56315 338273 338767 340364 342952 345256 346357 346710 347286 348528 350484 353115 356070 358863 361578 364753 368430
56300 368430 372112 375779 380028 384972 389870 394159 398040 401782 405247 408417 411652 415223 419170 423670
56286 423670 428800 434078 439125 444658 451679 459786 467613 475046 483547 493907 505090 515919 526644
56273 526644 538107 550388 563098 576226 590073 605013 621709 640808 662072 684646 708482
56262 708482 734650 764028 796730 833057 873868 919557 969804 1024868 1086068 1154430 1229771
56251 1229771 1311614 1399992 1494917 1596101 1703667 1818119 1939077 2064890 2193726 2323932
56241 2323932 2453291 2579481 2701671 2819943 2932375 3034419 3122166 3194731 3252343 3293658
$$ packed form
56330C16023K192K329J618J036J413J992J885J651K054K472J954R11L37K37J69
56315C38273M94J597K588K304J101L53N76J242J956K631K955K793K715L175L677
56300C68430L682L667M249M944M898M289L881L742L465L170L235L571L947M500
56286D23670N130N278N047N533P021Q107P827P433Q501J0360J1183J0829J0725
56273E26644J1463J2281J2710J3128J3847J4940J6696J9099K1264K2574K3836
56262G08482K6168K9378L2702L6327M0811M5689N0247N5064O1200O8362P5341
56251A229771Q1843Q8378R4925J01184J07566J14452J20958J25813J28836J30206
56241B323932J29359J26190J22190J18272J12432J02044Q7747P2565N7612M1315
$$ plain form
56231 3293658 3316475 3319865 3304067 3269222 3215790 3145582 3061007 2963794 2855542 2738897 2617036
56220 2617036 2492379 2366674 2241759 2119322 2000474 1886313 1778217 1676805 1581439 1491616
56210 1491616 1408017 1331256 1260610 1195131 1135143 1081247 1032536 987257 944930 906498 872518
56199 872518 842273 814619 788869 764917 743165 724217 708135 694249 681951 671194 661881 653445
56187 653445 645489 638133 631378 624895 618833 613885 610067 606453 602597 599151 596508 594044 591435 589452
56173 589452 588594 588149 587533 587355 588124 589094 589535 590052 591508 593698 596230 599617 604263 609440 614469 619926
56157 619926 626500 633786 641407 650121 660455 671463 682363 694197 708275 724132 740839 759292
56145 759292 781231 806849 835336 867121 903484 944352 988445 1035423 1086180 1141201 1200190
$$ packed form
56231C293658K2817L390j5798l4845n3432p0208q4575r7213j08252j16645j21861
56220B617036j24657j25705j24915j22437j18848j14161j08096j01412r5366q9823
56210A491616q3599p6761p0646o5479n9988n3896m8711m5279m2327l8432l3980
56199H72518l0245k7654k5750k3952k1752j8948j6082j3886j2298j0757r313q436
56187F53445p956p356o755o483o062m948l818l614l856l446k643k464k609j983
56173E89452q58m45o16j78P69R70M41N17J456K190K532L387M646N177N029N457
56157F19926O574P286P621Q714J0334J1008J0900J1834J4078J5857J6707J8453
56145G59292K1939K5618K8487L1785L6363M0868M4093M6978N0757N5021N8989
$$ plain form
56134 1200190 1263150 1330399 1401714 1476634 1555104 1636462 1718262 1797513 1872618 1942864 2006747
56123 2006747 2062450 2109544 2148804 2180826 2206130 2225755 2239959 2246826 2243903 2230893 2209413 2180827
56111 2180827 2145998 2106467 2063793 2017920 1967786 1913213 1854705 1792061 1725198 1656038 1587755
56100 1587755 1522232 1459811 1401136 1347491 1299515 1257182 1220780 1190352 1164604 1142012 1122567
56089 1122567 1106853 1094070 1082900 1073760 1068105 1065791 1065127 1065323 1066823 1069362 1071770 1073864 1076749 1081023
56075 1081023 1086224 1092073 1098835 1106538 1115114 1124984 1136225 1147811 1159137 1171501 1186351 1202866
56063 1202866 1219095 1234724 1250787 1267420 1284006 1300803 1318277 1335485 1351280 1366412 1382280
56052 1382280 1398450 1413701 1428610 1444587 1461248 1477465 1494168 1513199 1534071 1554931 1576209
$$ packed form
56134A200190O2960O7249P1315P4920P8470Q1358Q1800P9251P5105P0246O3883
56123B006747N5703M7094L9260L2022K5304J9625J4204O867k923j3010k1480k8586
56111B180827l4829l9531m2674m5873n0134n4573n8508o2644o6863o9160o8283
56100A587755o5523o2421n8675n3645m7976m2333l6402l0428k5748k2592j9445
56089A122567j5714j2783j1170r140n655k314o64J96J500K539K408K094K885M274
56075A081023N201N849O762P703Q576R870J1241J1586J1326J2364J4850J6515
56063A202866J6229J5629J6063J6633J6586J6797J7474J7208J5795J5132J5868
56052A382280J6170J5251J4909J5977J6661J6217J6703J9031K0872K0860K1278
$$ plain form
56041 1576209 1600109 1626774 1654132 1681435 1709889 1739854 1770482 1802041 1835623 1870602 1905406
56030 1905406 1940733 1978994 2020646 2064072 2108877 2156062 2205140 2254514 2304744 2358094 2414770
56019 2414770 2472944 2532495 2595285 2661649 2730115 2800667 2874791 2952246 3031385 3112675 3198310
56008 3198310 3288428 3381471 3478126 3580871 3689757 3802784 3920355 4045081 4177270 4315149
55998 4315149 4459451 4613107 4776543 4948242 5129896 5325665 5536297 5759427 5995870
55989 5995870 6249839 6522697 6812547 7120546 7451547 7808080 8190241 8602161 9051862
55980 9051862 9544027 10079903 10665113 11310466 12024658 12814279 13692044 14677139 15787377
55971 15787377 17040975 18467990 20111808 22020669 24251244 26884540 30028501 33804470
$$ packed form
56041A576209K3900K6665K7358K7303K8454K9965L0628L1559L3582L4979L4804
56030A905406L5327L8261M1652M3426M4805M7185M9078M9374N0230N3350N6676
56019B414770N8174N9551O2790O6364O8466P0552P4124P7455P9139Q1290Q5635
56008C198310R0118R3043R6655J02745J08886J13027J17571J24726J32189J37879
55998D315149J44302J53656J63436J71699J81654J95769K10632K23130K36443
55989E995870K53969K72858K89850L07999L31001L56533L82161M11920M49701
55980I051862M92165N35876N85210O45353P14192P89621Q77765R85095J110238
55971A5787377J253598J427015J643818J908861K230575K633296L143961L775969
$$ plain form
55963 33804470 38344241 43802249 50355456 58184658 67459817 78323423 90838202 104917312
55955 104917312 120311407 136675355 153646957 170885305 188095344 205061809 221664817
55948 221664817 237883026 253827134 269717603 285594387 300777775 313551674 321565917
55941 321565917 322824753 316530311 303215407 284292647 261522917 236677720 211334697
55934 211334697 186724123 163668493 142637583 123843283 107311043 92941156 80572303
55927 80572303 70017705 61066629 53490624 47072349 41626087 36991945 33028441 29619608
55919 29619608 26677378 24128406 21905499 19954494 18237786 16723937 15380642 14181325
55911 14181325 13109567 12151402 11289646 10509567 9803025 9162627 8577708 8039848 7546468
$$ packed form
55963C3804470M539771N458008O553207P829202R275159J0863606J2514779J4079110
55955A04917312J5394095J6363948J6971602J7238348J7210039J6966465J6603008
55948B21664817J6218209J5944108J5890469J5876784J5183388J2773899Q014243
55941C21565917J258836o294442j3314904j8922760k2769730k4845197k5343023
55934B11334697k4610574k3055630k1030910j8794300j6532240j4369887j2368853
55927H0572303j0554598q951076p576005o418275n446262m634142l963504l408833
55919B9619608k942230k548972k222907j951005j716708j513849j343295j199317
55911A4181325j071758r58165q61756p80079p06542o40398n84919n37860m93380
$$ plain form
55902 7546468 7095184 6679851 6295467 5941757 5618316 5320786 5044981 4790429 4556767
55893 4556767 4340676 4139198 3952363 3780043 3619784 3469992 3331653 3204739 3086351
55884 3086351 2974410 2869765 2772837 2681667 2595174 2514874 2441412 2372602 2306715 2244539 2186470
55873 2186470 2130796 2076523 2024690 1975101 1924962 1872606 1819559 1767214 1714561 1661171 1609319
55862 1609319 1560935 1515055 1470347 1427696 1388288 1351503 1316590 1284198 1254500 1226003 1197858
55851 1197858 1171164 1146471 1122370 1098166 1075521 1055524 1036340 1015692 993789 972014 950640
55840 950640 929662 910005 892075 874690 857142 840726 826625 813835 800757 787410 774637
55829 774637 762529 750999 740542 731220 722228 713450 705806 699102 691440 681985 672408 664268 656845
$$ packed form
55902G546468m51284m15333l84384l53710l23441k97530k75805k54552k33662
55893D556767k16091k01478j86835j72320j60259j49792j38339j26914j18388
55884C086351j11941j04645r6928r1170q6493q0300p3462o8810o5887o2176n8069
55873B186470n5674n4273n1833m9589n0139n2356n3047n2345n2653n3390n1852
55862A609319m8384m5880m4708m2651l9408l6785l4913l2392k9698k8497k8145
55851A197858k6694k4693k4101k4204k2645j9997j9184k0648k1903k1775k1374
55840I50640k0978j9657j7930j7385j7548j6416j4101j2790j3078j3347j2773
55829G74637j2108j1530j0457r322q992q778p644o704p662r455r577q140p423
$$ plain form
55816 656845 649063 641684 635877 631224 626888 623369 621444 620662 620438 621381 623990 627268 630101 632926 636637
55801 636637 640992 645392 650020 654838 658596 660240 660272 659460 657336 653177 647308 640148 631153 620008 607771
55786 607771 595568 583291 570782 559068 549073 540335 532351 525908 521567 518079 513916 509396 505606
55773 505606 502301 498584 494762 491741 489269 486546 484078 483218 484116 485474 485976 484791 481177 474952 467052
55758 467052 458487 449159 438704 427892 418012 409323 401236 393582 386631 380322 374410 368929 363670 357922
55744 357922 351624 345982 341954 338947 336041 333496 331738 329858 326778 323253 321013 320238 319425 317611 315341
55729 315341 313440 312035 310782 309114 306315 302196 297553 293297 289561 286187 283375 281005 278234 274898
55715 274898 272477 272326 273672 274780 275506 277100 279876 282783 285213 287721 290782 294068 297023 299073 299309
$$ packed form
55816F56845p782p379n807m653m336l519j925p82k24R43K609L278K833K825L711
55801F36637M355M400M628M818L758J644L2q12k124m159n869p160q995j1145j2237
55786F07771j2203j2277j2509j1714r995q738p984o443m341l488m163m520l790
55773E05606l305l717l822l021k472k723k468q60Q98J358N02j185l614o225p900
55758D67052q565r328j0455j0812r880q689q087p654o951o309n912n481n259n748
55744C57922o298n642m028l007k906k545j758j880l080l525k240p75q13j814k270
55729C15341j901j405j253j668k799m119m643m256l736l374k812k370k771l336
55715B74898k421j51J346J108P26J594K776K907K430K508L061L286K955K050K36
$$ plain form
55700 299309 297105 293105 288645 284248 279628 274904 270594 266544 262154 257760 254567 252992 252137 251159 250267
55685 250267 250087 250858 252478 254647 256825 258684 260622 263253 266472 269666 272619 275448 277785 278956 278885
55670 278885 278087 276819 275006 272906 271073 269716 268809 268582 269229 270341 271509 273167 275871 279034 281462
55655 281462 282990 284511 286465 288439 290229 292050 293569 293926 293079 292039 291371 290395 288262 284952 280828
55640 280828 276015 270631 264911 258734 251735 244205 237148 231120 225743 220732 216593 213685 211318 208520
55626 208520 205389 202950 201789 201297 200374 198645 196841 195907 195761 195277 193709 191728 190598 190667 191224 191549
55610 191549 191370 190529 189016 187345 186146 185358 184449 183370 182513 181808 180787 179615 179062 179156 178795 177208 175009
55593 175009 173282 172263 171535 170976 170771 170710 170170 168821 167014 165398 164396 164069 164370 165437 167461 170197
$$ packed form
55700B99309k204m000m460m397m620m724m310m050m390m394l193j575q55r78q92
55685B50267j80P71J620K169K178J859J938K631L219L194K953K829K337J171p1
55670B78885p98j268j813k100j833j357r07k27O47J112J168J658K704L163K428
55655B81462J528J521J954J974J790J821J519L57q47j040o68r76k133l310m124
55640B80828m813n384n720o177o999p530p057o028n377n011m139k908k367k798
55626B08520l131k439j161m92r23j729j804r34j46m84j568j981j130O9N57L25
55610A91549j79q41j513j671j199p88r09j079q57p05j021j172n53R4l61j587k199
55593A75009j727j019p28n59k05o1n40j349j807j616j002l27L01J067K024K736
$$ plain form
55577 170197 172860 174775 175919 176570 176722 176327 175911 176335 177887 180042 182068 183513 184258 184613 185329 186996
55561 186996 189385 191734 193563 194774 195193 194635 193398 192079 190898 189659 188307 186961 185512 183792 182055
55546 182055 180661 179355 177522 175164 172958 171359 170322 169848 170016 170430 170508 170498 171403 173566 176052 177702
55530 177702 178155 177577 176180 174454 173205 172774 172628 172087 171074 169825 168329 166450 164268 161986 159768
55515 159768 157843 156405 155264 153998 152588 151415 150484 149233 147424 145658 144632 144311 144195 143973 143552
55500 143552 142897 142266 142300 143365 144994 146341 147128 147832 149078 150967 152877 153864 153547 152694 152635 153917 155778
55483 155778 157035 157152 156333 155008 153567 152382 151720 151631 151912 152144 151836 150785 149303 147951 147150 147167 148098
55466 148098 149487 150346 150118 149415 149141 149168 148722 147894 147668 148245 148431 147229 145244 143833 143460 143573 143666 143779
$$ packed form
55577A70197K663J915J144O51J52l95m16M24J552K155K026J445P45L55P16J667
55561A86996K389K349J829J211M19n58j237j319j181j239j352j346j449j720j737
55546A82055j394j306j833k358k206j599j037m74J68M14P8j0R05K163K486J650
55530A77702M53n78j397j726j249m31j46n41j013j249j496j879k182k282k218
55515A59768j925j438j141j266j410j173r31j251j809j766j026l21j16k22m21
55500A43552o55o31L4J065J629J347P87P04J246J889J910R87l17q53n9J282J861
55483A55778J257J17q19j325j441j185o62q9K81K32l08j051j482j352q01J7R31
55466A48098J389Q59k28p03k74K7m46q28k26N77J86j202j985j411l73J13R3J13
$$ plain form
55448 143779 144034 144194 143819 142787 141748 141818 143433 145563 146615 146156 145162 144622 144624 144964 145745 146906 147888 148311
55430 148311 148489 148790 148971 148652 147996 147413 146979 146614 146519 146965 147891 149081 150429 151728 152571 152782 152630 152305
55412 152305 151635 150648 149916 149881 150229 150469 150781 151692 153133 154331 154564 153690 152086 150368 149022 148062 147167
55395 147167 146223 145427 144762 143923 143010 142759 143667 145317 146931 148172 149011 149291 148987 148490 148171 147955 147754 147853
55377 147853 148366 148675 148088 146776 145499 144663 144217 144156 144518 145013 145333 145694 146479 147412 147661 146810 145302 143922
55359 143922 143205 143281 143885 144497 144753 144633 144157 143278 142382 142361 143568 145079 145706 145564 145823 146987 148215 148450
55341 148450 147520 145882 143967 142133 140797 140148 139880 139560 139142 139019 139589 140827 142226 143190 143576 143728 143890
55324 143890 143839 143322 142605 142278 142598 143357 144259 145089 145608 145629 145197 144482 143544 142504 141817 142062 143334 145004
$$ packed form
55448A43779K55J60l75j032j039P0J615K130J052m59r94n40KL40P81J161R82M23
55430A48311J78L01J81l19o56n83m34l65r5M46R26J190J348J299Q43K11j52l25
55412A52305o70r87p32l5L48K40L12R11J441J198K33q74j604j718j346r60q95
55395A47167r44p96o65q39r13k51R08J650J614J241Q39K80l04m97l19k16k01R9
55377A47853N13L09n87j312j277q36m46o1L62M95L20L61P85R33K49q51j508j380
55359A43922p17P6O04O12K56j20m76q79q96k1J207J511O27j42K59J164J228K35
55341A48450r30j638j915j834j336o49k68l20m18j23N70J238J399R64L86J52J62
55324A43890n1n17p17l27L20P59R02Q30N19K1m32p15r38j040o87K45J272J670
$$ plain form
55306 145004 146110 146007 144902 143788 143604 144320 145112 145511 145848 146383 146649 146237 145671 145838 146837 148095 149303
55289 149303 150463 151112 150437 148404 146198 145188 145707 146901 147530 147016 146003 145804 146937 148423 148915 148274
55273 148274 147455 147108 147044 147015 147118 147233 146852 145901 145148 145370 146458 147722 148727 149506 150160 150659 150904 150804
55255 150804 150334 149671 149165 149071 149378 149862 150242 150374 150497 151134 152528 154185 155268 155323 154463 153089 151838 151524
55237 151524 152479 153939 154648 154182 153226 152451 151687 150503 149111 148241 148257 148734 148938 148607 148213 148427 149364 150536
55219 150536 151547 152466 153349 153903 154045 154336 155172 155936 155766 155000 154946 156144 157708 158605 158755 158556 158069 157226
55201 157226 156328 155811 155798 156165 156707 157059 156857 156214 155640 155293 154783 153934 153141 152683 152301 151903 152082 153311 155055
55182 155055 156330 156812 156842 156639 156181 155600 155004 154016 152220 150100 148850 149041 150026 150870 151470 152402 153979
$$ packed form
55306A45004J106j03j105j114j84P16P92L99L37N35K66m12n66J67R99J258J208
55289A49303J160O49o75k033k206j010N19J194O29n14j013j99J133J486M92o41
55273A48274q19l47o4k9J03J15l81r51p53K22J088J264J005P79O54M99K45j00
55255A50804m70o63n06r4L07M84L80J32J23O37J394J657J083N5q60j374j251l14
55237A51524R55J460P09m66r56p75p64j184j392q70J6M77K04l31l94K14R37J172
55219A50536J011R19Q83N54J42K91Q36P64j70p66n4J198J564Q97J50j99m87q43
55201A57226q98n17j3L67N42L52k02o43n74l47n10q49p93m58l82l98J79J229J744
55182A55055J275M82L0k03m58n81n96r88j796k120j250J91R85Q44O00R32J577
$$ plain form
55165 153979 155829 157343 158242 158623 158618 158232 157569 157027 156954 157186 157274 157235 157663 158896 160449 161596 162171 162398 162228
55146 162228 161387 160015 158773 158207 158307 158642 158634 157737 155761 153164 150804 149330 148895 149366 150486 151840 152965
55129 152965 153598 153704 153303 152522 151736 151292 151014 150295 148863 147202 146107 145949 146509 147320 148086 148921 150233
55112 150233 152180 154199 155399 155557 155419 155842 156917 158169 159304 160323 161178 161836 162596 163809 165198 166038
55096 166038 166170 166332 167156 168282 168915 168898 168732 168717 168662 168394 168029 167613 167020 166401 166345 167264 168788 170018 170285
55077 170285 169613 168555 167709 167224 166750 166001 165268 165126 165677 166490 167298 168258 169432 170480 171155 171618 171972 171919
55059 171919 171246 170209 169010 167370 165189 163244 162477 162780 163182 163193 163267 163908 164964 165961 166614 166834 166666
55042 166666 166404 166434 166831 167417 168150 169090 169951 170209 169743 168965 168249 167674 167358 167534 168074 168420 168232 167742 167297
$$ packed form
55165A53979J850J514Q99L81nl86o63n42p3K32Q8l9M28J233J553J147N75K27j70
55146A62228q41j372j242n66J00L35qq97j976k597k360j474m35M71J120J354J125
55129A52965O33J06m01p81p86m44k78p19j432j661j095j58N60Q11P66Q35J312
55112A50233J947K019J200J58j38M23J075J252J135J019Q55O58P60J213J389Q40
55096A66038J32J62Q24J126O33j7j66j5n5k68l65m16n93o19n6R19J524J230K67
55077A70285o72j058q46m85m74p49p33j42N51Q13Q08R60J174J048O75M63L54n3
55059A71919o73j037j199j640k181j945p67L03M02J1P4O41J056R97O53K20j68
55042A66666k62L0L97N86P33R40Q61K58m66p78p16n75l16J76N40L46j88m90m45
$$ plain form
55023 167297 166991 166860 166933 166860 166032 164494 163282 163365 164503 165606 166023 166047 166284 166954 167815 168491 168802 168901 169107
55004 169107 169570 170208 170988 171975 173101 174127 174947 175677 176338 176780 177033 177399 178002 178538 178695 178522 178193 177756
54986 177756 177385 177535 178440 179655 180399 180258 179370 178198 177391 177519 178541 179695 180292 180458 180739 181141 181068 180214
54968 180214 179071 178392 178386 178595 178473 178000 177712 178133 179181 180243 180818 180893 180774 180866 181690 183659 186534 189362
54950 189362 191283 192273 192887 193495 194043 194360 194351 193981 193369 192876 192880 193431 194237 194957 195478 196012 196902 198181 199367
54931 199367 199968 200235 201070 203130 206401 210683 215921 221799 227539 232541 236839 240615 243748 246364 249317
54916 249317 253399 258217 262429 264998 265728 264776 262331 258776 254572 249848 244481 238625 232768 227247 222087
54901 222087 217371 213339 210025 207121 204354 201771 199609 198039 197066 196532 196290 196483 197467 199316 201629
$$ packed form
55023A67297l06j31P3p3q28j538j212Q3J138J103M17K4K37O70Q61O76L11R9K06
55004A69107M63O38P80R87J126J026Q20P30O61M42K53L66O03N36J57j73l29m37
54986A77756l71J50R05J215P44j41q88j172q07J28J022J154N97J66K81M02p3q54
54968A80214j143o79oK09j22m73k88M21J048J062N75P5j19R2Q24J969K875K828
54950A89362J921R90O14O08N48L17rl70o12m93MN51Q06P20N21N34Q90J279J186
54931A99367O01K67Q35K060L271M282N238N878N740N002M298L776L133K616K953
54916B49317M082M818M212K569P30r52k445l555m204m724n367n856n857n521n160
54901B22087m716m032l314k904k767k583k162j570r73n34k42J93R84J849K313
$$ plain form
54886 201629 204121 207056 210742 214923 219142 223443 228056 232618 236481 239791 243438 247714 251695 254373
54872 254373 255870 257111 258628 260067 260690 259992 257933 254806 250862 246059 240289 233871 227539 221872 216921
54857 216921 212489 208537 205237 202734 200931 199426 197699 195544 193237 191126 189207 187339 185700 184612
54843 184612 184041 183696 183554 183770 184067 183789 182762 181600 180950 180813 180858 180952 181059 181017 180857 181043 181935 183107 183716
54824 183716 183552 183328 183744 184539 184803 184105 182999 182307 182210 182399 182876 183957 185425 186352 186247 185834 186045 186661
54806 186661 186722 186112 185814 186503 187698 188573 188865 188650 187929 187005 186737 187678 189171 189916 189442 188585 188465 189350
54788 189350 190609 191526 191947 192143 192276 192305 192449 193362 195449 198232 200850 203068 205292 207737 210220 212927
54772 212927 216596 221574 227217 232597 237439 241969 246258 250227 253997 257802 261678 265563 269488 273290
$$ packed form
54886B01629K492K935L686M181M219M301M613M562L863L310L647M276L981K678
54872B54373J497J241J517J439O23o98k059l127l944m803n770o418o332n667m951
54857B16921m432l952l300k503j803j505j727k155k307k111j919j868j639j088
54843A84612n71l45j42K16K97k78j027j162o50j37M5R4J07m2j60J86Q92J172O09
54824A83716j64k24M16P95K64o98j106o92r7J89M77J081J468R27j05m13K11O16
54806A86661O1o10k98O89J195Q75K92k15p21r24k68R41J493P45m74q57j20Q85
54788A89350J259R17M21J96J33K9J44R13K087K783K618K218K224K445K483K707
54772B12927L669M978N643N380M842M530M289L969L770L805L876L885L925L802
$$ plain form
54758 273290 276391 278182 278528 277601 275428 271927 267227 261569 255099 248113 241424 235998 232152 229378 226931
54743 226931 224406 221793 219319 217327 216087 215567 215408 215214 214914 214881 215577 216978 218509 219753 221093 223245
54727 223245 226275 229565 232760 236175 240100 244318 248566 252880 257052 260370 262425 263755 265011 265919
54713 265919 265720 264373 262497 260206 256831 251947 246065 240111 234687 230036 226288 223407 221108 218980
54699 218980 216626 213745 210399 207118 204475 202485 200725 199021 197674 196988 196873 196978 196894 196176 194534 192191
54683 192191 189880 188351 187955 188620 189979 191468 192580 193162 193419 193658 194151 195062 196192 196818 196135 194066
54667 194066 191469 189502 188836 189324 190194 190606 190311 189870 190037 190956 192096 192888 193164 193030 192658 192298 192235 192559
54649 192559 193078 193531 193797 193953 194192 194584 194915 194920 194742 194865 195373 195646 195117 194040 193092 192518 192150 192012 192293
$$ packed form
54758B73290L101J791L46r27k173l501m700n658o470o986o689n426l846k774k447
54743B26931k525k613k474j992j240n20j59j94l00l3O96J401J531J244J340K152
54727B23245L030L290L195L415L925M218M248M314M172L318K055J330J256R08
54713B65919j99j347j876k291l375m884n882n954n424m651l748k881k299k128
54699B18980k354k881l346l281k643j990j760j704j347o86j15J05q4p18j642k343
54683A92191k311j529l96O65J359J489J112N82K57K39M93R11J130O26o83k069
54667A94066k597j967o66M88Q70M12k95m41J67R19J140P92K76j34l72l60o3L24
54649A92559N19M53K66J56K39L92L31Nj78J23N08K73n29j077r48n74l68j38K81
$$ plain form
54630 192293 192846 193320 193727 194272 194664 194327 193336 192479 192230 192311 192483 192981 193867 194575 194629 194283 194046 194023 194180 194787
54610 194787 196023 197430 198255 198166 197313 195974 194537 193484 192948 192548 192058 191936 192720 194171 195519 196294 196430
54593 196430 195818 194450 192889 191912 191645 191546 191268 191024 191114 191631 192722 194566 196903 198979 200136 200174 199165
54576 199165 197429 195743 194975 195177 195460 195094 194323 193848 193861 193992 193919 193647 193342 193200 193393 193898 194474 194957 195393
54557 195393 195769 195893 195738 195563 195413 194832 193522 192016 191171 191111 191239 191222 191430 192247 193491 194794 196146 197656
54539 197656 199053 199840 199920 199784 199983 200595 201329 202040 202913 204037 205015 205350 205270 205724 207242 209124 210208 210185
54521 210185 209665 209143 208595 208011 207501 206681 204871 202358 200623 200610 201411 201528 200887 200581 200982 201365 201451 202018
54503 202018 203522 205152 205900 205832 205543 204999 203772 202100 200922 200840 201615 202543 202879 201978 199690 196784 194613
$$ packed form
54630A92293N53M74M07N45L92l37r91q57k49Q1J72M98Q86P08N4l46k37k3J57O07
54610A94787J236J407Q25q9q53j339j437j053n36m00m90j22P84J451J348P75J36
54593A96430o12j368j561r77k67r9k78k44R0N17J091J844K337K076J157L8j009
54576A99165j736j686p68K02K83l66p71m75J3J31p3k72l05j42J93N05N76M83M36
54557A95393L76J24j55j75j50n81j310j506q45o0J28j7K08Q17J244J303J352J510
54539A97656J397P87Q0j36J99O12P34P11Q73J124R78L35q0M54J518J882J084k3
54521B10185n20n22n48n84n10q20j810k513j735j3Q01J17o41l06M01L83Q6N67
54503B02018J504J630P48o8k89n44j227j672j178q2P75R28L36r01k288k906k171
$$ plain form
54486 194613 194196 195657 198375 201386 203792 205226 206022 206774 207784 209002 210217 211076 211258 210956 210879 211335
54470 211335 211665 211150 210152 209641 209823 210053 210034 210167 210606 210919 211025 211583 212946 214390 215027 214891 214520 214000
54452 214000 213133 212167 211568 211223 210599 209638 208884 208674 208733 208627 208192 207504 206795 206378 206240 205792 204530 202966
54434 202966 202314 203044 204263 204859 204871 205293 206737 208729 210339 211230 211930 213154 214902 216292 216358 214994 213093
54417 213093 211767 211554 212299 213540 214937 216382 217834 219052 219587 219153 217944 216484 215206 214319 213954 214188
54401 214188 214896 215827 216891 218167 219583 220787 221520 221933 222360 222882 223275 223399 223407 223503 223542 223074 221843 220181
54383 220181 218733 217780 217040 216262 215852 216598 218736 221453 223430 223900 223216 222497 222674 223775 225045 225722 225650
54366 225650 225241 225017 225253 225898 226716 227592 228695 230168 231715 232833 233508 234256 235212 235725 235289 234425 233969
$$ packed form
54486A94613m17J461K718L011K406J434P96P52J010J218J215Q59J82l02p7M56
54470B11335L30n15r98n11J82K30j9J33M39L13J06N58J363J444O37j36l71n20
54452B14000q67r66n99l45o24r61p54k10N9j06m35o88p09m17j38m48j262j564
54434B02966o52P30J219N96J2M22J444J992J610Q91P00J224J748J390O6j364j901
54417B13093j326k13P45J241J397J445J452J218N35m34j209j460j278q87l65K34
54401B14188P08R31J064J276J416J204P33M13M27N22L93J24QR6L9m68j231j662
54383B20181j448r53p40p78m10P46K138K717J977M70o84p19J77J101J270O77p2
54366B25650m09k24K36O45Q18Q76J103J473J547J118O75P48R56N13m36q64m56
$$ plain form
54349 233969 233808 233145 231901 230957 230817 230876 230411 229622 229186 229288 229668 230214 230960 231769 232598 233888 236138 239124
54331 239124 242056 244524 246916 249897 253812 258584 263802 268815 273005 276119 278271 279723 280790 281740
54317 281740 282461 282351 280915 278401 275507 272574 269485 266254 263103 259909 256202 252062 248460 246236 245027
54302 245027 243682 241556 238974 236520 234366 232389 230598 229172 228218 227652 227295 227005 226743 226574 226646 227110
54286 227110 227936 228787 229214 229103 228809 228691 228727 228831 229335 230605 232273 233438 233801 234001 234580 235210 235386 235310
54268 235310 235379 235261 234329 232836 231810 231725 232127 232710 233849 235666 237373 238190 238322 238370 238273 237635 236805 236699
54250 236699 237554 238598 239085 238962 238397 237421 236420 236253 237253 238493 238688 237614 236089 234794 233787 233165
54234 233165 233401 234689 236457 238014 239324 240701 241962 242417 241765 240586 239795 239780 240198 240447 240263 239990 240263
$$ packed form
54349B33969j61o63j244r44j40N9m65p89m36J02L80N46P46Q09Q29J290K250K986
54331B39124K932K468K392K981L915M772N218N013M190L114K152J452J067R50
54317B81740P21j10j436k514k894k933l089l231l151l194l707m140l602k224j209
54302B45027j345k126k582k454k154j977j791j426r54n66l57k90k62j69P2M64
54286B27110Q26Q51M27j11k94j18L6J04N04J270J668J165L63K00N79O30J76p6
54268B35310O9j18r32j493j026q5M02N83J139J817J707Q17J32M8r7o38q30j06
54250B36699Q55J044M87j23n65r76j001j67J000J240J95j074j525j295j007o22
54234B33165K36J288J768J557J310J377J261M55o52j179p91j5M18K49j84k73K73
$$ plain form
54217 240263 241249 242248 242346 241560 240935 241251 241991 242012 241041 239959 239605 239842 239987 239717 239177 238471 237489 236245 235021
54198 235021 234147 233749 233752 234020 234499 235284 236520 238135 239768 241000 241577 241383 240425 238975 237520 236391 235585
54181 235585 235140 235343 236187 236924 236767 235981 235615 236029 236351 235771 234742 234377 235017 236052 236944 237715 238426 238939
54163 238939 239424 240474 242198 243585 243460 242015 240876 241386 243184 244699 244860 243930 242774 241748 240577
54148 240577 239026 237256 235497 233732 231938 230433 229724 230010 231002 232218 233338 234242 234864 235088 234787 233896
54132 233896 232495 230874 229505 228889 229269 230398 231681 232644 233284 233900 234648 235406 236072 236769 237703 238976 240610
54115 240610 242546 244517 246074 246938 247214 247173 246988 246881 247287 248543 250379 252022 252862 252954 252872 253193 254099 255279
54097 255279 256191 256508 256315 255861 255260 254557 253924 253574 253563 253855 254401 254960 255050 254453 253669 253454 253930 254511 254693
$$ packed form
54217B40263R86R99R8p86o25L16P40K1r71j082l54K37J45k70n40p06r82j244j224
54198B35021q74l98LK68M79P85J236J615J633J232N77j94r58j450j455j129q06
54181B35585m45K03Q44P37j57p86l66M14L22n80j029l65O40J035Q92P71P11N13
54163B38939M85J050J724J387j25j445j139N10J798J515J61r30j156j026j171
54148B40577j551j770j759j765j794j505p09K86R92J216J120R04O22K24l01q91
54132B33896j401j621j369o16L80J129J283R63O40O16P48P58O66O97R34J273J634
54115B40610J936J971J557Q64K76m1j85j07M06J256J836J643Q40R2q2L21R06J180
54097B55279R12L17j93m54o01p03o33l50j1K92N46N59R0n97p84k15M76N81J82
$$ plain form
54078 254693 254475 254027 253470 253090 253227 253745 254174 254641 255998 258571 261304 262832 263018 262744 262511 262094 261486
54061 261486 261264 261751 262557 263252 264004 265155 266637 268145 269536 270751 271723 272744 274566 277626 281381 284858
54045 284858 287695 290214 292687 295151 297907 301529 306118 311039 315712 320327 325466 331391 338040 345417
54031 345417 353492 361874 370161 378699 388463 399957 412585 425356 437894 450379 462767 474607
54019 474607 485614 495956 505826 515135 523851 532282 540538 547803 552520 553430 550275 543464 533320 519842
54005 519842 503184 484218 464536 445736 428575 412871 398297 385139 374105 365486 358798 353254
53993 353254 348287 343554 338815 334087 329714 325996 322842 320014 317547 315613 314047 312355 310268 307978
53979 307978 305738 303490 301124 298831 296934 295472 294191 292949 291878 291127 290652 290301 289927 289327 288278
$$ packed form
54078B54693k18m48n57l80J37N18M29M67J357K573K733J528J86k74k33m17o08
54061B61486k22M87Q06O95P52J151J482J508J391J215R72J021J822L060L755L477
54045B84858K837K519K473K464K756L622M589M921M673M615N139N925O649P377
54031C45417Q075Q382Q287Q538R764J1494J2628J2771J2538J2485J2388J1840
54019D74607J1007J0342R870R309Q716Q431Q256P265M717R10l155o811j0144j3478
54005E19842j6658j8966j9682j8800j7161j5704j4574j3158j1034q619o688n544
53993C53254m967m733m739m728m373l718l154k828k467j934j566j692k087k290
53979C07978k240k248k366k293j897j462j281j242j071p51m75l51l74o00j049
$$ plain form
53964 288278 286834 285481 284807 285004 285800 286823 287901 289021 290238 291658 293333 295072 296557 297743 299070
53949 299070 301031 303666 306603 309515 312335 315091 317802 320563 323532 326717 329983 333339 337059 341380
53935 341380 346186 351095 355770 360052 363904 367346 370410 373121 375601 378203 381384 385264 389446 393418
53921 393418 397094 400869 405199 410199 415527 420619 425144 429353 433826 438826 444044 449124 454132 459255
53907 459255 464267 468725 472592 476238 479753 482639 484314 484665 483986 482602 480726 478457 475777 472670 469308
53892 469308 465944 462563 458836 454570 449951 445207 440160 434386 427856 421295 415766 411776 408744 405530
53878 405530 401659 397884 395329 394305 394262 394680 395401 396184 396678 397019 397790 399044 400061 400536 401389 403713 407382
53861 407382 411512 416014 421721 429009 437178 445451 453951 463272 473523 484096 494077 502680 509589 515167
$$ packed form
53964B88278j444j353o74J97P96J023J078J120J217J420J675J739J485J186J327
53949B99070J961K635K937K912K820K756K711K761K969L185L266L356L720M321
53935C41380M806M909M675M282L852L442L064K711K480K602L181L880M182L972
53921C93418L676L775M330N000N328N092M525M209M473N000N218N080N008N123
53907D59255N012M458L867L646L515K886J675L51o79j384j876k269k680l107l362
53892D69308l364l381l727m266m619m744n047n774o530o561n529l990l032l214
53878D05530l871l775k555j024m3M18P21P83M94L41P71J254J017M75Q53K324L669
53861D07382M130M502N707P288Q169Q273Q500R321J0251J0573R981Q603O909N578
$$ plain form
53847 515167 520244 525581 531591 538431 545988 553712 560663 565634 567035 563028 552562 536425 516760
53834 516760 495500 473695 452227 432182 414147 397893 383287 370903 361129 353266 346246 339917
53822 339917 334893 331367 328821 326773 325101 323712 322557 322017 322569 323869 324811 324869 324946 326499 330007 334542
53806 334542 338690 341689 343778 345665 347720 349773 351662 353735 356583 360396 364854 369475 373823 377529
53792 377529 380546 383327 386379 389649 392688 395285 397480 399000 399315 398440 397190 396357 396027 395863 395586 394860
53776 394860 393158 390196 386293 381938 377176 371802 366012 360475 355714 351688 348006 344438 341153 338537
53762 338537 336766 335579 334548 333469 332352 331127 329712 328319 327256 326376 325182 323632 322364 321859 321856
53747 321856 321935 322188 322804 323344 323078 321932 320624 319888 319906 320352 320602 320068 318830 317833 318007 319221 320548 321424
$$ packed form
53847E15167N077N337O010O840P557P724O951M971J401m007j0466j6137j9665
53834E16760k1260k1805k1468k0045j8035j6254j4606j2384r774p863p020o329
53822C39917n024l526k546k048j672j389j155n40N52J300R42N8P7J553L508M535
53806C34542M148K999K089J887K055K053J889K073K848L813M458M621M348L706
53792C77529L017K781L052L270L039K597K195J520L15q75j250q33l30j64k77p26
53776C94860j702k962l903m355m762n374n790n537m761m026l682l568l285k616
53762C38537j771j187j031j079j117j225j415j393j063q80j194j550j268n05l
53747C21856P9K53O16N40k66j146j308p36J8M46K50n34j238r97J74J214J327Q76
$$ plain form
53729 321424 321949 322134 321631 320476 319448 319297 320016 321234 322897 325097 327535 329710 331596 333697 336312
53714 336312 339040 341144 342328 343059 344123 345881 348062 350328 352848 356023 359742 363307 366191 368581
53700 368581 371014 373798 376951 380412 384039 387582 390925 394211 397504 400526 402963 404865 406447 407668
53686 407668 408330 408567 408877 409637 410830 412238 413626 414649 414877 414076 412414 410330 408299 406681 405570 404688
53670 404688 403612 402257 401019 400337 400250 400426 400548 400473 400131 399503 398723 397985 397198 395903 393803 391381 389671
53653 389671 389232 389504 389434 388700 388063 388481 390122 392337 394337 395642 396039 395443 393981 392157 390821 390824 392429
53636 392429 394985 397358 398922 400092 401773 404370 407482 410504 413292 416178 419479 423056 426415 429279
53622 429279 431996 435233 439240 443632 447974 452247 456505 460408 463580 466284 469183 472434 475559 478321
$$ packed form
53729C21424N25J85n03j155j028j51P19J218J663K200K438K175J886K101K615
53714C36312K728K104J184P31J064J758K181K266K520L175L719L565K884K390
53700C68581K433K784L153L461L627L543L343L286L293L022K437J902J582J221
53686D07668O62K37L10P60J193J408J388J023K28q01j662k084k031j618j111q82
53670D04688j076j355j238o82q7J76J22p5l42o28p80p38p87j295k100k422j710
53653C89671m39K72p0p34o37M18J641K215K000J305L97n96j462j824j336LJ605
53636C92429K556K373J564J170J681K597L112L022K788K886L301L577L359K864
53622D29279K717L237M007M392M342M273M258L903L172K704K899L251L125K762
$$ plain form
53608 478321 481172 484503 487926 490779 493042 495323 498053 501180 504534 508019 511373 514172 516260 517946
53594 517946 519601 521225 522476 522922 522255 520554 518521 517128 516751 516743 516071 514284 511669 508682 505572 502565
53578 502565 500002 498061 496470 494732 492621 490406 488560 487292 486312 485060 483192 480877 478589 476694
53564 476694 475296 474473 474425 475294 476915 478863 480770 482531 484250 486044 487991 490276 493305 497458 502600
53549 502600 508004 513007 517692 522634 528034 533490 538792 544526 551465 559534 567750 575137 581406 586802
53535 586802 591674 596253 600563 604466 608003 611743 616474 622443 629189 636319 644157 653373 664176 676170
53521 676170 688950 702513 717078 732710 749279 766704 785144 804858 825880 847946 870858
53510 870858 894749 919720 945293 970669 995620 1020706 1046407 1072449 1098298 1123932 1149606
$$ packed form
53608D78321K851L331L423K853K263K281K730L127L354L485L354K799K088J686
53594E17946J655J624J251M46o67j701k033j393l77qo72j787k615k987l110l007
53578E02565k563j941j591j738k111k215j846j268r80j252j868k315k288j895
53564D76694j398q23m8Q69J621J948J907J761J719J794J947K285L029M153N142
53549E02600N404N003M685M942N400N456N302N734O939Q069Q216P387O269N396
53535E86802M872M579M310L903L537L740M731N969O746P130P838R216J0803J1994
53521F76170J2780J3563J4565J5632J6569J7425J8440J9714K1022K2066K2912
53510H70858K3891K4971K5573K5376K4951K5086K5701K6042K5849K5634K5674
$$ plain form
53499 1149606 1175107 1199801 1223465 1246664 1270163 1294178 1318182 1341213 1362546 1382339 1401590
53488 1401590 1421172 1441066 1460818 1480453 1500301 1520075 1538853 1556194 1572665 1589014 1605301
53477 1605301 1621056 1635722 1648600 1658870 1666196 1671052 1674104 1675556 1675393 1673788 1670737 1665608 1657712
53464 1657712 1647195 1634825 1621016 1605637 1588730 1570851 1552494 1533659 1514167 1494112 1473845
53453 1473845 1453672 1433654 1413490 1392608 1370614 1347764 1324874 1302863 1282450 1263995 1247238
53442 1247238 1231350 1215721 1200679 1187049 1175102 1164460 1154980 1147113 1141241 1137254 1134990 1134568 1135888
53429 1135888 1138270 1141056 1144337 1148792 1155103 1163767 1175094 1188876 1204263 1220418 1237243 1255251
53417 1255251 1274958 1296696 1320664 1346605 1373604 1400824 1428554 1458080 1490423 1525505 1562605
$$ packed form
53499A149606K5501K4694K3664K3199K3499K4015K4004K3031K1333J9793J9251
53488A401590J9582J9894J9752J9635J9848J9774J8778J7341J6471J6349J6287
53477A605301J5755J4666J2878J0270P326M856L052J452j63j605l051n129p896
53464A657712j0517j2370j3809j5379j6907j7879j8357j8835j9492k0055k0267
53453A473845k0173k0018k0164k0882k1994k2850k2890k2011k0413j8455j6757
53442A247238j5888j5629j5042j3630j1947j0642r480p867n872l987k264m22J320
53429A135888K382K786L281M455O311Q664J1327J3782J5387J6155J6825J8008
53417A255251J9707K1738K3968K5941K6999K7220K7730K9526L2343L5082L7100
$$ plain form
53406 1562605 1601180 1641075 1682262 1724683 1768291 1813170 1859654 1908272 1959280 2012228 2066236
53395 2066236 2120847 2176380 2233297 2291443 2350085 2408541 2466568 2524115 2580913 2636389 2690002
53384 2690002 2741572 2791187 2838739 2883680 2925405 2963777 2998992 3030882 3058596 3081129 3098074
53373 3098074 3109727 3116624 3119130 3117321 3110958 3099492 3082343 3059395 3031136 2998157 2960593 2918377
53361 2918377 2872030 2822767 2771504 2718113 2662189 2604395 2546382 2489186 2432369 2375139 2317866
53350 2317866 2261879 2208020 2156055 2105497 2056386 2009044 1963518 1919625 1877326 1836715 1797683
53339 1797683 1759844 1722920 1687163 1653314 1622024 1593345 1566854 1542226 1519405 1498250 1478380
53328 1478380 1459606 1442178 1426287 1411590 1397560 1384036 1371042 1358315 1345539 1332966 1321266
$$ packed form
53406A562605L8575L9895M1187M2421M3608M4879M6484M8618N1008N2948N4008
53395B066236N4611N5533N6917N8146N8642N8456N8027N7547N6798N5476N3613
53384B690002N1570M9615M7552M4941M1725L8372L5215L1890K7714K2533J6945
53373C098074J1653O897K506j809o363j1466j7149k2948k8259l2979l7564m2216
53361B918377m6347m9263n1263n3391n5924n7794n8013n7196n6817n7230n7273
53350B317866n5987n3859n1965n0558m9111m7342m5526m3893m2299m0611l9032
53339A797683l7839l6924l5757l3849l1290k8679k6491k4628k2821k1155j9870
53328A478380j8774j7428j5891j4697j4030j3524j2994j2727j2776j2573j1700
$$ plain form
53317 1321266 1310860 1301868 1294606 1289434 1286021 1283420 1281143 1279656 1279597 1281031 1283750 1287888 1293871 1302029
53303 1302029 1312458 1324901 1338632 1352962 1368130 1385220 1404880 1426606 1449557 1473472 1498271
53292 1498271 1523373 1548244 1573249 1599126 1625712 1651897 1676799 1700343 1722677 1743636 1762919
53281 1762919 1780297 1795478 1808203 1818579 1826958 1833412 1837664 1839500 1838820 1835303 1828541 1818642 1806217
53268 1806217 1791680 1774964 1756089 1735434 1713194 1689056 1662842 1635143 1606843 1578193 1548771
53257 1548771 1518300 1487185 1456136 1425448 1394770 1363598 1331955 1300404 1269269 1238180 1206750
53246 1206750 1175494 1145505 1117222 1090103 1063625 1037976 1013438 989730 966517 944167 923364
53235 923364 904210 886231 869131 852955 837647 823061 809448 797315 786540 776123 765170
$$ packed form
53317A321266j0406q992p262n172l413k601k277j487n9J434K719M138N983Q158
53303A302029J0429J2443J3731J4330J5168J7090J9660K1726K2951K3915K4799
53292A498271K5102K4871K5005K5877K6586K6185K4902K3544K2334K0959J9283
53281A762919J7378J5181J2725J0376Q379O454M252J836o80l517o762r899j2425
53268A806217j4537j6716j8875k0655k2240k4138k6214k7699k8300k8650k9422
53257A548771l0471l1115l1049l0688l0678l1172l1643l1551l1135l1089l1430
53246A206750l1256k9989k8283k7119k6478k5649k4538k3708k3213k2350k0803
53235I23364j9154j7979j7100j6176j5308j4586j3613j2133j0775j0417j0953
$$ plain form
53224 765170 753908 743345 734016 725322 716132 705831 694693 683327 671930 660190 647882 635328
53212 635328 623132 611626 600739 590272 580112 570226 560723 551891 543903 536425 528792 520657 512294
53199 512294 504169 496497 489347 482869 476998 471122 464542 457333 450379 444386 439196 434315 429740 425810
53185 425810 422488 419335 416200 413385 410984 408670 406412 404891 404646 405157 405398 405080 404797 405038 405698 406578
53169 406578 407658 408744 409487 410060 411237 413413 415954 417920 418986 419258 418683 417288 415711 414759 414441 413981
53153 413981 412771 410850 408536 406163 404208 403030 402280 401081 399144 397258 396324 396285 396359 396003 395163 393816
53137 393816 391869 389522 387236 385240 383389 381649 380309 379450 378579 377178 375494 374400 374515 375778 377920
53122 377920 380866 384446 388039 390897 392772 393970 394884 395663 396266 396592 396565 396253 395817 395177 393961 392063
$$ packed form
53224G65170j1262j0563r329q694r190j0301j1138j1366j1397j1740j2308j2554
53212F35328j2196j1506j0887j0467j0160r886r503q832p988p478p633q135q363
53199E12294q125p672p150o478n871n876o580p209o954n993n190m881m575l930
53185D25810l322l153l135k815k401k314k258j521k45N11K41l18k83K41O60Q80
53169D06578J080J086P43N73J177K176K541J966J066K72n75j395j577r52l18m60
53153D13981j210j921k314k373j955j178p50j199j937j886r34l9P4l56q40j347
53137C93816j947k347k286j996j851j740j340q59q71j401j684j094J15J263K142
53122C77920K946L580L593K858J875J198R14P79O03L26k7l12m36o40j216j898
$$ plain form
53106 392063 390047 388518 387230 385394 382885 380537 379005 377926 376497 374467 372212 370243 368969 368513
53092 368513 368380 367686 366153 364524 363537 362883 361733 359904 357824 355628 353138 350673 349051 348621 348863 349104
53076 349104 349042 348513 347433 346278 346056 347370 349762 352169 353788 354427 354475 354692 355661 357272 359057 360970
53060 360970 363299 365776 367525 368178 368421 369036 369986 370914 371969 373523 375431 377147 378314 378762 378282 376968
53044 376968 375528 374676 374354 374021 373458 372764 371797 370348 368773 367702 367072 366094 364336 362263 360527 359252
53028 359252 358264 357551 357081 356522 355513 354110 352739 351761 351233 351008 350931 351020 351440 352218 353045 353508 353501 353228 352888
53009 352888 352533 352154 351650 350864 349927 349397 349704 350498 351002 350981 350915 351191 351662 352133 352790 353816 354980 355943 356718
52990 356718 357520 358358 359071 359668 360400 361543 363157 364973 366481 367298 367487 367420 367360 367443 367928 369077 370787 372730
$$ packed form
53106C92063k016j529j288j836k509k348j532j079j429k030k255j969j274m56
53092C68513j33o94j533j629r87o54j150j829k080k196k490k465j622m30K42K41
53076C49104o2n29j080j155k22J314K392K407J619O39M8K17R69J611J785J913
53060C60970K329K477J749O53K43O15R50R28J055J554J908J716J167M48m80j314
53044C76968j440q52l22l33n63o94r67j449j575j071o30r78j758k073j736j275
53028C59252r88p13m70n59j009j403j371r78n28k25p7Q9M20P78Q27M63pk73l40
53009C52888l55l79n04p86r37n30L07P94N04k1o6K76M71M71O57J026J164R63P75
52990C56718Q02Q38P13N97P32J143J614J816J508Q17J89o7o0Q3M85J149J710J943
$$ plain form
52972 372730 374864 377306 379706 381436 382590 384115 386488 388881 390187 390427 390565 391338 392842 394883 396984
52957 396984 398298 398339 397742 397568 397824 397379 395462 392570 389695 387292 385305 383633 382095 380295 377982 375408
52941 375408 373049 371141 369693 368719 368202 367891 367383 366373 364788 362846 361048 359934 359675 360009 360577 361190
52925 361190 361699 361902 361668 361090 360447 360108 360370 361154 361894 362099 362027 362446 363636 364969 365641 365504 365017 364690
52907 364690 364768 365125 365295 364927 364325 364154 364431 364343 363422 362385 362253 362987 363604 363401 362495 361306 360199 359563
52889 359563 359630 360077 360268 359981 359478 358956 358429 358129 358340 358730 358485 357423 356341 355954 356093 356422 357341 359445
52871 359445 362412 365222 367450 369663 372495 375868 379297 382519 385532 388351 390959 393364 395516 397295
52857 397295 398643 399526 399713 398849 396926 394458 391986 389542 386807 383681 380408 377192 373959 370606 367248
$$ packed form
52972C72730K134K442K400J730J154J525K373K393J306K40J38P73J504K041K101
52957C96984J314M1n97j74K56m45j917k892k875k403j987j672j538j800k313k574
52941C75408k359j908j448r74n17l11n08j010j585j942j798j114k59L34N68O13
52925C61190N09K03k34n78o43l39K62P84P40K05p2M19J190J333O72j37m87l27
52907C64690P8L57J70l68o02j71K77q8r21j037j32P34O17k03r06j189j107o36
52889C59563O7M47J91k87n03n22n27l00K11L90k45j062j082l87J39L29R19K104
52871C59445K967K810K228K213K832L373L429L222L013K819K608K405K152J779
52857C97295J348Q83J87q64j923k468k472k444k735l126l273l216l233l353l358
$$ plain form
52842 367248 364066 361098 358339 355944 354115 352841 351929 351300 351010 350887 350377 348979 346789 344490 342808
52827 342808 342071 342211 343037 344461 346448 348759 350817 352026 352259 351826 350980 349828 348848 348967 350601 352905
52811 352905 354638 355676 357053 359414 362125 364176 365343 366050 366544 366820 367055 367547 368212 368539 368077 366745
52795 366745 364773 362617 360832 359713 359087 358637 358312 358150 357871 357060 355724 354338 353257 352343 351263 349942
52779 349942 348647 347702 347164 346789 346461 346681 348255 351251 354550 356824 357731 357792 357439 356752 356045 355942 356747
52762 356747 358150 359614 360634 360685 359595 358079 357307 357654 358394 358738 358615 358254 357715 357201 357160 357535 357511 356584
52744 356584 355350 354623 354279 353727 353091 353006 353444 353686 353457 353321 353895 355306 357411 359798 361598 362080 361642
52727 361642 361386 361582 361403 360503 359890 360587 362138 363159 362893 361524 359536 357548 356411 356496 356932 356456 355033
$$ packed form
52842C67248l182k968k759k395j829j274r12o29k90j23n10j398k190k299j682
52827C42808p37J40Q26J424J987K311K058J209K33m33q46j152r80J19J634K304
52811C52905J733J038J377K361K711K051J167P07M94K76K35M92O65L27m62j332
52795C66745j972k156j785j119o26m50l25j62k79q11j336j386j081r14j080j321
52779C49942j295r45n38l75l28K20J574K996L299K274R07O1l53o87p07j03Q05
52762C56747J403J464J020N1j090j516p72L47P40L44j23l61n39n14m1L75k4r27
52744C56584j234p27l44n52o36q5M38K42k29j36N74J411K105K387J800M82m38
52727C61642k56J96j79r00o13O97J551J021k66j369j988j988j137Q5M36m76j423
$$ plain form
52710 355033 353919 354025 354973 355944 356694 357283 357420 356706 355305 353887 353023 352870 353282 353900 354254 354155 353961 354211
52692 354211 355033 356029 356722 356917 356793 356820 357495 358827 360147 360728 360654 360747 361555 362732 363602 364077 364689 365843
52674 365843 367387 368955 370436 371938 373434 374693 375521 375992 376328 376620 376682 376255 375347 374358 373791 373857 374391
52657 374391 375082 375698 376092 376194 376138 376260 376794 377596 378307 378802 379339 380214 381405 382565 383291 383321 382674 381692 380870
52638 380870 380478 380398 380436 380675 381328 382280 383102 383596 384093 385054 386505 388054 389390 390554 391787 393267 394982
52621 394982 396665 397896 398418 398351 397909 396940 395010 392041 388610 385500 383147 381640 380961 380938 381203 381455 381706
52604 381706 382009 382157 382014 381971 382614 383904 385107 385663 385732 385772 385959 386246 386656 387242 387996 388973 390255 391582
52586 391582 392358 392344 392112 392418 393312 394282 395111 396144 397722 399745 401842 403683 405088 406092 406940 407827 408644
$$ packed form
52710C55033j114J06R48R71P50N89J37p14j401j418q64j53M12O18L54r9j94K50
52692C54211Q22R96O93J95j24K7O75J332J320N81p4R3Q08J177Q70M75O12J154
52674C65843J544J568J481J502J496J259Q28M71L36K92O2m27r08r89n67O6N34
52657C74391O91O16L94J02n6J22N34Q02P11M95N37Q75J191J160P26L0o47r82q22
52638C80870l92q0L8K39O53R52Q22M94M97R61J451J549J336J164J233J480J715
52621C94982J683J231N22o7m42r69j930k969l431l110k353j507o79k3K65K52K51
52604C81706L03J48j43m3O43J290J203N56O9M0J87K87M10N86P54R77J282J327
52586C91582P76j4k32L06Q94R70Q29J033J578K023K097J841J405J004Q48Q87Q17
$$ plain form
52569 408644 409133 409204 408852 407989 406714 405579 405110 405068 404678 403627 402416 401664 401504 401788 402406 403200 403915 404368
52551 404368 404388 403644 402032 400278 399385 399326 398973 397688 396194 395363 394906 394103 393175 392973 393592 394287 394550 394356
52533 394356 393537 391990 390608 390862 393070 395885 397864 398829 399325 399723 400426 402139 405005 408009 410058 411350
52517 411350 412887 414995 417209 419414 422030 424933 427198 428398 429463 431607 434770 437728 439587 440617
52503 440617 441531 442344 442237 440477 437235 433372 429538 425713 421674 417625 414079 411325 409319 408042 407552
52488 407552 407615 407623 407079 406053 405043 404554 404844 405895 407462 409240 411042 412751 414124 414909 415238 415698 416837
52471 416837 418715 421062 423758 426945 430646 434375 437310 439019 440062 441644 444426 447778 450426 451662
52457 451662 451561 450209 447467 443665 439802 436500 433207 429062 424290 420043 416938 414441 411866 409365
$$ packed form
52569D08644M89P1l52q63j275j135m69m2l90j051j211p52j60K84O18P94P15M53
52551D04368K0p44j612j754q93n9l53j285j494q31m57q03r28k02O19O95K63j94
52533C94356q19j547j382K54K208K815J979R65M96L98P03J713K866L004K049J292
52517D11350J537K108K214K205K616K903K265J200J065K144L163K958J859J030
52503D40617R14Q13j07j760l242l863l834l825m039m049l546k754k006j277m90
52488D07552O3Qn44j026j010m89K90J051J567J778J802J709J373P85L29M60J139
52471D16837J878K347K696L187L701L729K935J709J043J582K782L352K648J236
52457D51662j01j352k742l802l863l302l293m145m772m247l105k497k575k501
$$ plain form
52443 409365 407547 406540 405844 404966 403830 402616 401450 400378 399521 399132 399378 400073 400731 400993 400951 400919 401006 401066
52425 401066 400901 400299 399030 397234 395736 395538 396909 399304 402154 405265 408408 411192 413770 417125 422078
52410 422078 428264 434629 440736 447027 453945 461372 468975 476571 484061 491424 498937 506976 515402 523415
52396 523415 530174 535230 538203 538430 535310 528950 520266 510546 500992 492433 485125 478833 473193 468037
52382 468037 463427 459620 457050 456041 456325 457094 457757 458516 459964 462315 465317 468774 472718 477000 481076
52367 481076 484410 486886 488664 489773 490020 489235 487477 485014 482214 479496 477270 475808 475161 475204 475760 476653
52351 476653 477646 478476 479027 479463 480080 481059 482417 484095 486013 488074 490262 492702 495501 498639 502176 506463
52335 506463 511883 518413 525736 533767 542697 552492 562777 573367 584537 596466 608758 620831 632540
$$ packed form
52443D09365j818j007o96q78j136j214j166j072q57l89K46O95O58K62m2l2Q7O0
52425D01066j65o02j269j796j498j98J371K395K850L111L143K784K578L355M953
52410D22078O186O365O107O291O918P427P603P596P490P363P513Q039Q426Q013
52396E23415O759N056K973K27l120o360q684r720r554q559p308o292n640n156
52382D68037m610l807k570j009K84P69O63P59J448K351L002L457L944M282M076
52367D81076L334K476J778J109K47p85j758k463k800k718k226j462o47M3N56Q93
52351D76653R93Q30N51M36O17R79J358J678J918K061K188K440K799L138L537M287
52335E06463N420O530P323Q031Q930R795J0285J0590J1170J1929J2292J2073J1709
$$ plain form
52322 632540 644150 655973 668338 681544 695441 709286 722501 735303 748128 760843 773284
52311 773284 786346 801441 818680 836559 853883 871170 889481 908595 927252 944845 961938
52300 961938 979221 996749 1014251 1031400 1047476 1061444 1072784 1081896 1089355 1095164 1099104 1101493
52288 1101493 1103050 1104116 1104470 1103926 1102645 1100781 1098206 1094916 1091426 1088403 1085955 1083556 1080776 1077840
52274 1077840 1075396 1073919 1073531 1074253 1076165 1079240 1083281 1088151 1093957 1100855 1108748 1117362 1126626 1136759
52260 1136759 1147870 1159578 1171224 1182486 1193721 1205664 1218788 1232876 1247062 1260331 1272199
52249 1272199 1283047 1293632 1304126 1313749 1321545 1327375 1331865 1335408 1337650 1338136 1337137 1335516 1333880 1332087
52235 1332087 1329491 1325517 1320090 1313697 1306980 1300137 1292858 1284959 1276857 1269169 1262044 1255269 1248807 1242739
$$ packed form
52322F32540J1610J1823J2365J3206J3897J3845J3215J2802J2825J2715J2441
52311G73284J3062J5095J7239J7879J7324J7287J8311J9114J8657J7593J7093
52300I61938J7283J7528J7502J7149J6076J3968J1340R112P459N809L940K389
52288A101493J557J066L54n44j281j864k575l290l490l023k448k399k780k936
52274A077840k444j477l88P22J912L075M041M870N806O898P893Q614R264J0133
52260A136759J1111J1708J1646J1262J1235J1943J3124J4088J4186J3269J1868
52249A272199J0848J0585J0494R623P796N830M490L543K242M86r99j621j636j793
52235A332087k596l974n427o393o717o843p279p899q102p688p125o775o462o068
$$ plain form
52221 1242739 1236753 1230273 1223277 1216490 1210538 1205370 1200853 1197441 1195694 1195413 1195821 1196528 1197801 1199848 1202399
52206 1202399 1205213 1208591 1213026 1218558 1224758 1231191 1237620 1243840 1249687 1255283 1261025 1267162 1273517 1279747
52192 1279747 1285734 1291557 1297168 1302312 1306775 1310517 1313561 1315921 1317653 1318755 1318950 1317840 1315340 1311727
52178 1311727 1307141 1301411 1294606 1287354 1280218 1273089 1265775 1258926 1253644 1250151 1247528 1244966 1242653 1241170
52164 1241170 1240615 1240762 1241659 1243533 1246320 1249641 1253119 1256453 1259449 1262216 1265067 1267965 1270384 1271989 1273048
52149 1273048 1273852 1274197 1273978 1273867 1274683 1276339 1278148 1280032 1282620 1286097 1289763 1292952 1295711 1298313 1300720
52134 1300720 1302909 1305200 1307863 1310800 1314039 1318180 1323884 1331116 1339333 1348285 1358334 1370091 1383968
52121 1383968 1399986 1417683 1436299 1455270 1474567 1494457 1515075 1536357 1558194 1580381 1602435
$$ packed form
52221A242739n986o480o996o787n952n168m517l412j747k81M08P07J273K047K551
52206A202399K814L378M435N532O200O433O429O220N847N596N742O137O355O230
52192A279747N987N823N611N144M463L742L044K360J732J102J95j110k500l613
52178A311727m586n730o805p252p136p129p314o849n282l493k623k562k313j483
52164A241170n55J47Q97J874K787L321L478L334K996K767K851K898K419J605J059
52149A273048Q04L45k19j11Q16J656J809J884K588L477L666L189K759K602K407
52134A300720K189K291K663K937L239M141N704P232Q217Q952J0049J1757J3877
52121A383968J6018J7697J8616J8971J9297J9890K0618K1282K1837K2187K2054
$$ plain form
52110 1602435 1623642 1643394 1661609 1679003 1696756 1715486 1734439 1752185 1768314 1784018 1800687
$$ packed form
52110A602435K1207J9752J8215J7394J7753J8730J8953J7746J6129J5704J6669
$$ [...]
##END NTUPLES=NMR SPECTRUM
##END=
