##TITLE=AC1523_ROEFFECT0005_8213680_K0FjOfw7f2
##JCAMPDX= 6.0         $$ Bruker NMR JCAMP-DX V2.0
##DATA TYPE= NMR SPECTRUM
##DATA CLASS= NTUPLES
##ORIGIN= BRUKER
##OWNER= Administrator
$$ 1.72 TOPSPIN		Version 2.1
$$ 2013-10-04 18:18:44.893 -0700  Administrator@X
$$ Compression mode = diff/dup
##.OBSERVE FREQUENCY= 400.02188249412
##.OBSERVE NUCLEUS= ^1H
##.ACQUISITION MODE= SIMULTANEOUS (DQD)
##.ACQUISITION SCHEME= undefined
##.AVERAGES= 8
##.DIGITISER RES= 22
##SPECTROMETER/DATA SYSTEM= spect
##.PULSE SEQUENCE= zg30
##.SOLVENT NAME= COFFEE_meoh
##.SHIFT REFERENCE= INTERNAL, COFFEE_meoh, 1, 14.98509
##AUDIT TRAIL= $$ (NUMBER, WHEN, WHO, WHERE, PROCESS, VERSION, WHAT)
$$ ##TITLE= Audit trail, TOPSPIN		Version 2.1
$$ ##JCAMPDX= 5.01
$$ ##ORIGIN= Bruker BioSpin GmbH
$$ ##OWNER= Administrator
$$ $$ E:\/data/COFFEE/nmr/AC1523_ROEFFECT0005_8213680_K0FjOfw7f2/10/pdata/1/auditp.txt
$$ ##AUDIT TRAIL=  $$ (NUMBER, WHEN, WHO, WHERE, PROCESS, VERSION, WHAT)
(   1,<2013-10-04 18:18:38.472 -0700>,<Administrator>,<X>,<go>,<TOPSPIN 2.1>,
      <created by zg
	started at 2013-10-04 18:17:32.722 -0700,
	POWCHK enabled, PULCHK disabled,
       configuration hash MD5:
       C8 4E 4E 5D D3 5C D8 9E 9F 52 82 E0 59 8A DE 15
       data hash MD5: 64K
       9F 5A A7 A0 B7 0B E0 6D 49 30 4A 22 33 22 8D 5C>)
(   2,<2013-10-04 18:18:41.362 -0700>,<Administrator>,<X>,<proc1d>,<TOPSPIN 2.1>,
      <Start of raw data processing
       efp LB = 0 FT_mod = 6 PKNL = 1 PHC0 = 0 PHC1 = 0 SI = 32K 
       data hash MD5: 32K
       23 9A 94 2D A0 51 DD 12 90 99 2A 11 96 BD DB 3F>)
(   3,<2013-10-04 18:18:41.643 -0700>,<Administrator>,<X>,<proc1d>,<TOPSPIN 2.1>,
      <pk PHC0 = 96.49292 PHC1 = 0 
       data hash MD5: 32K
       75 67 5C D6 44 AC 01 C2 C1 E8 79 DF 08 CF 07 9E>)
(   4,<2013-10-04 18:18:41.722 -0700>,<Administrator>,<X>,<proc1d>,<TOPSPIN 2.1>,
      <abs ABSG = 1 
       data hash MD5: 32K
       DA A7 6B D4 EA 15 D4 AD 6B 18 A7 27 61 F9 88 DA>)
(   5,<2013-10-04 18:18:41.800 -0700>,<Administrator>,<X>,<proc1d>,<TOPSPIN 2.1>,
      <abs ABSG = 2 
       data hash MD5: 32K
       65 51 01 79 8B F3 75 BA A7 4C 4A 56 50 50 3A 10>)
(   6,<2013-10-04 18:18:41.847 -0700>,<Administrator>,<X>,<proc1d>,<TOPSPIN 2.1>,
      <abs ABSG = 3 
       data hash MD5: 32K
       E6 57 5F 4C E8 84 3D 77 EA D1 BC ED 35 75 6A 22>)
(   7,<2013-10-04 18:18:41.893 -0700>,<Administrator>,<X>,<proc1d>,<TOPSPIN 2.1>,
      <abs ABSG = 4 
       data hash MD5: 32K
       F3 79 66 1D 5D EF C6 84 57 F1 6B 22 3A A3 4C DB>)
(   8,<2013-10-04 18:18:41.940 -0700>,<Administrator>,<X>,<proc1d>,<TOPSPIN 2.1>,
      <abs ABSG = 5 
       data hash MD5: 32K
       22 41 5C 3B 4A B0 A9 2C 58 7F 20 8A 95 80 8C E4>)
$$ ##END=
$$ 
$$ $$ hash MD5
$$ $$ 16 6B 20 A8 BE 62 98 1F D4 56 52 3A 93 F5 94 60
##$RELAX= 
##$RELAX= 
##$RELAX= 
##$RELAX= 
##$RELAX= 
##$RELAX= 
##$RELAX= 
$$ Bruker specific parameters
$$ --------------------------
##$DU= <E:\>
##$EXPNO= 10
$$ [...]
150 150 150 150 150 150 150 150
##$TP07= 0
##$TPNAME0= <>
##$TPNAME1= <>
##$TPNAME2= <>
##$TPNAME3= <>
##$TPNAME4= <>
##$TPNAME5= <>
##$TPNAME6= <>
##$TPNAME7= <>
##$TPOAL= (0..7)
0.5 0.5 0.5 0.5 0.5 0.5 0.5 0.5
##$TPOFFS= (0..7)
0 0 0 0 0 0 0 0
##$TUNHIN= 0
##$TUNHOUT= 0
##$TUNXOUT= 0
##$USERA1= <user>
##$USERA2= <user>
##$USERA3= <user>
##$USERA4= <user>
##$USERA5= <user>
##$V9= 5
##$VALIST= <valist>
##$VCLIST= <CCCCCCCCCCCCCCC>
##$VD= 0
##$VDLIST= <DDDDDDDDDDDDDDD>
##$VPLIST= <PPPPPPPPPPPPPPP>
##$VTLIST= <TTTTTTTTTTTTTTT>
##$WBST= 2048
##$WBSW= 25
##$XGAIN= (0..3)
0 0 0 0
##$XL= 0
##$YL= 0
##$YMAX_a= 642985
##$YMIN_a= -546572
##$ZGOPTNS= <>
##$ZL1= 120
##$ZL2= 120
##$ZL3= 120
##$ZL4= 120
##$ABSF1= 14.98509
##$ABSF2= -5.573092
##$ABSG= 5
##$ABSL= 3
##$ALPHA= 0
##$AQORDER= 0
##$ASSFAC= 0
##$ASSFACI= 0
##$ASSFACX= 0
##$ASSWID= 0
##$AUNMP= <proc_prof1d_extract_pilot.lims>
##$AXLEFT= 0
##$AXNAME= <>
##$AXNUC= <1H>
##$AXRIGHT= 0
##$AXTYPE= 0
##$AXUNIT= <>
##$AZFE= 0.1
##$AZFW= 0.1
##$BCFW= 0
##$BC_mod= 0
##$BYTORDP= 0
##$COROFFS= 0
##$CY= 15
##$DATMOD= 1
##$DC= 0
##$DFILT= <>
##$DTYPP= 0
##$F1P= 0
##$F2P= 0
##$FCOR= 0.5
##$FTSIZE= 32768
##$FT_mod= 6
##$GAMMA= 0
##$GB= 0
##$INTBC= 1
##$INTSCL= 1
##$ISEN= 128
##$LB= 0
##$LEV0= 0
##$LPBIN= 0
##$MAXI= 10000
##$MC2= 0
##$MEAN= 0
##$ME_mod= 0
##$MI= 0
##$NCOEF= 0
##$NC_proc= -8
##$NLEV= 6
##$NOISF1= 0
##$NOISF2= 0
##$NSP= 0
##$NTH_PI= 0
##$NZP= 0
##$OFFSET= 14.98509
##$PC= 1
##$PHC0= 96.49292
##$PHC1= 0
##$PH_mod= 1
##$PKNL= yes
##$PPARMOD= 0
##$PPDIAG= 0
##$PPIPTYP= 0
##$PPMPNUM= 2147483647
##$PPRESOL= 1
##$PSCAL= 4
##$PSIGN= 0
##$PYNMP= <proc.py>
##$REVERSE= no
##$SF= 400.02
##$SI= 32768
##$SIGF1= 0
##$SIGF2= 0
##$SINO= 400
##$SIOLD= 32768
##$SPECTYP= <>
##$SREGLST= <1H.CDCl3>
##$SSB= 0
##$STSI= 32768
##$STSR= 0
##$SW_p= 8223.68421052631
##$SYMM= 0
##$S_DEV= 0
##$TDeff= 65536
##$TDoff= 0
##$TI= <>
##$TILT= no
##$TM1= 0
##$TM2= 0
##$TOPLEV= 0
##$USERP1= <user>
##$USERP2= <user>
##$USERP3= <user>
##$USERP4= <user>
##$USERP5= <user>
##$WDW= 1
##$XDIM= 32768
##$YMAX_p= 449881962
##$YMIN_p= -665299
##$CURPLOT= <Network HP LaserJet P1505>
##$CURPRIN= <$Network HP LaserJet P1505>
##$DFORMAT= <normdp>
##$LAYOUT= <+/1D_H.xwp>
##$LFORMAT= <normlp>
##$PFORMAT= <normpl>
##$SURQMSG= 1
$$ End of Bruker specific parameters
$$ ---------------------------------
##NTUPLES= NMR SPECTRUM
##VAR_NAME=  FREQUENCY,     SPECTRUM/REAL,   SPECTRUM/IMAG
##SYMBOL=    X,             R,               I
##VAR_TYPE=  INDEPENDENT,   DEPENDENT,       DEPENDENT
##VAR_FORM=  AFFN,          ASDF,            ASDF
##VAR_DIM=   32768,         32768,           32768
##UNITS=     HZ,            ARBITRARY UNITS, ARBITRARY UNITS
##FACTOR=    0.250966925370066, 1,           1
##FIRST=     8223.43324360094, -85017,       -227468
##LAST=      0,             3588,            -59907
##MIN=       0,             -665299,         0
##MAX=       8223.43324360094, 449881962,    0
$$ Real data points
##PAGE= N=1
##DATA TABLE= (X++(R..R)), XYDATA
$$ [...]
$$ plain form
19558 -127379 233147 105195 -33924 -93320 -148827 -587561 -67190 102007 178323 -41267 99342
19546 12365 -303476 129967 152972 102607 -12667 25462 -251128 -116391 -239994 59999 -73712
19534 -227604 39346 -142725 59394 -219774 168287 3567 -5443 91605 117644 -118141 -4603
19522 162818 -142648 -103160 123335 -74732 112117 -39836 -100295 57020 -22016 9493 -109941
19510 -223589 118473 109502 -146787 165255 -199874 13455 171629 -142638 101695 -76553
19499 -73761 -48380 -276899 146291 -216929 -275470 -201306 -123141 16101 234292 50346 -49719
19487 -48725 -101022 -193484 -101408 39074 324342 -264543 -246579 107821 -7080 19644 -120247
19475 -409526 74262 -18967 -181959 123812 -126148 -70694 255537 -153193 -53998 -25484
$$ packed form
19558a27379B33147A05195c3924n9396n5507m38734f7190A02007P6316d1267I9342
19546A2365c03476A29967K3005n0365a2667B5462b51128a16391j23603E9999g3712
19534b27604C9346a42725E9394b19774A68287C567e443I1605K6039a18141d603
19522A62818a42648L9488A23335g4732A12117c9836o0459E7020b2016I493a09941
19510b23589A18473q971a46787A65255a99874A3455J58174a42638A01695g6553
19499g3761K5381k28519A46291b16929n8541P4164P8165A6101K18191E0346d9719
19487d8725n2297r2462R2076C9074K85268b64543J7964A07821g080A9644a20247
19475d09526G4262a8967j62992A23812a26148N5454B55537a53193e3998b5484
$$ plain form
19464 -196408 -43685 266416 -80615 204584 13713 110689 -177622 -63732 189353 -206730
19453 143208 106656 31998 -180099 -20237 -9046 216147 -3591 -1841 -161017 -121102 -47207
19441 -160871 -261681 436124 70816 172470 -47803 -139078 -44042 -204774 -226771 97293 -162099
19429 -44316 106979 -369350 40371 -1357 127681 -114079 93689 -42570 62393 57154 -37936
19417 -135951 -57179 -298174 -173684 33419 -94677 -371591 -167191 -149757 214155 -230970
19406 331574 -52749 -99272 28161 -173089 61378 -216932 156536 18493 -392568 -21082 -83891
19395 -83891 19515 -113096 -72737 -281894 283899 194035 168833 24717 -48243 39075 43670
19384 43670 -196692 54296 157177 -57406 163151 -209134 25177 88465 14402 -277542 -456721
$$ packed form
19464a96408d3685B66416h0615B04584A3713R6976a77622f3732A89353b06730
19453A43208l6552C1998a80099b0237i046B16147c591J750j59176L9915d7207
19441a60871j00810D36124G0816J01654d7803r1275d4042j60732k1997I7293a62099
19429d4316A06979c69350D0371a357A27681a14079I3689d2570F2393n239c7936
19417a35951e7179k40995J24490C3419i4677k76914a67191J7434B14155b30970
19406C31574e2749m6523B8161a73089F1378b16932A56536A8493c92568b1082o2809
19395h3891A9515a13096M0359k09157B83899q9864k5202B4717d8243C9075M595
19384D3670a96692E4296J02881e7406A63151b09134B5177O3288A4402b77542j79179
$$ plain form
19373 -456721 49324 -169523 -438489 -133562 -239923 8285 -177245 -174059 -180527 38904 -115195
19361 96881 199764 -88304 -203422 -453380 -67346 332693 -57178 233703 5781 68326 -258684
19349 -124140 -32186 -176690 -76733 -154922 69622 -28034 -46434 -349647 -223567 -76210 -228471
19338 -228471 -274241 -457144 -168184 -262217 63973 -170692 -95643 -335576 227926 -160261
19327 20495 115010 17737 -240581 -81190 -154410 -374019 -45243 -290614 -65663 143022 312820
19316 312820 62957 -81452 -294005 95167 -330951 167628 117357 -38440 124474 -109296
19305 -13770 -174397 -160311 -154649 210179 -90356 37545 -225480 -218453 -467833 -4444 -184334
19294 -184334 -53118 -249294 51950 495303 141649 -124735 -6108 -14552 -87846 -283648 -229271
$$ packed form
19373d56721D9324a69523k68966a33562j06361H285a77245L186o468C8904a15195
19361I6881J02883h8304j15118k49958f7346C32693e7178B33703E781O2545b58684
19349a24140c2186j44504g6733p8189F9622b8034j8400l03213J26080g6210j52261
19338b28471m5770j82903a68184r4033F3973a70692P5049k39933B27926a60261
19327B0495R4515A7737b40581h1190p3220k19609d5243k45371f5663A43022J69798
19316C12820F2957h1452k12553I5167c30951A67628n0271c8440A24474a09296
19305a3770j60627J4086N662B10179i0356C7545b25480P027k49380d444j79890
19294a84334e3118j96176E1950M43353A41649a24735f108q444p3294j95802N4377
$$ plain form
19283 -229271 -184439 -8140 11711 -89551 159599 -165566 -343555 144938 -25164 6075 7331
19272 7331 32260 92038 -221812 -262979 53604 -78535 -127264 -196917 -85015 163767 373678
19261 373678 -123029 -44809 -205604 -124720 -52238 -331492 -196957 167397 257563 191703
19251 191703 74753 -209773 -320170 96663 150441 353817 -240283 -114003 -99568 -139181
19241 -139181 -121768 -110160 166377 -92272 -86748 -187493 -111186 229680 -258265 -81589 -102146
19230 -102146 -94259 -28580 3013 55036 8715 56921 -139920 -355947 111100 251144 -225602
19218 -144758 -180324 -363535 -67918 -81586 245901 -184450 196279 -336108 -393320 44506
19207 -223663 42111 -33188 224458 -267145 -198502 82193 -414285 -81162 -13274 -60291 263900
$$ packed form
19283b29271M4832h140A1711h9551A59599a65566j77989A44938b5164F075J256
19272G331K4929N9778b21812m1167E3604g8535m8729o9653h5015A63767K09911
19261C73678a23029d4809j60795Q0884e2238k79254J34535A67397R0166o5860
19251A91703G4753b09773j10397I6663N3778K03376b40283a14003J4435l9613
19241a39181J7413J1608A66377i2272N524j00745P6307B29680b58265h1589k0557
19230a02146P887b8580C013N2023H715M8206a39920k16027A11100J40044b25602
19218a44758l5566j83211f7918j3668B45901a84450A96279c36108n7212D4506
19207b23663D2111c3188B24458b67145O8643H2193d14285h1162a3274m7017B63900
$$ plain form
19195 122532 28565 -159694 -789 -207097 -59871 -290050 110816 -210585 31630 -306012 -140087
19183 191849 -110590 70643 -25013 -215797 -288409 -84244 -270350 301027 76068 -56271 -72339
19172 -72339 -89671 53624 32501 26947 -238563 70147 -289950 -17287 -32481 -85823 -87706 -21371
19159 -144680 93702 -105129 -72558 -306415 230554 -156840 -5298 -126019 65920 -261934
19148 115527 -338587 -463851 45379 65376 -171069 -204965 -91449 36072 -68530 -4062 367679
19136 163015 -147409 -110416 168060 168805 244206 51861 -32103 -223808 -111148 187188 -109674
19124 -127760 278886 -240816 98687 38071 -190043 -262586 -163479 -26106 -191853 209430
19113 -120629 -43782 -122565 126730 49745 -162613 62086 30974 -138990 90001 -171843 34252
$$ packed form
19195A22532B8565a59694g89k06308e9871k30179A10816b10585C1630c06012a40087
19183A91849a10590G0643b5013j90784p2612h4244j86106C01027G6068e6271j6068
19172g2339j7332E3624k1123n554b38563G0147b89950a7287j5194n3342j883b1371
19159a44680I3702a05129L2571k33857B30554a56840e298j20721F5920b61934
19148A15527c38587j25264D5379J9997a71069l3896i1449C6072f8530d062C67679
19136A63015a47409L6993A68060P45P5401E1861c2103j91705a11148A87188a09674
19124a27760B78886b40816I8687C8071a90043p2543R9107b6106j65747B09430
19113a20629d3782p8783A26730D9745a62613F2086C0974a38990I0001a71843C4252
$$ plain form
19101 -79284 -311488 75037 261454 310592 -61308 -129109 17263 -47472 -5968 64152 -202781
19089 39674 -64959 -69413 303713 84029 -21265 -273017 4202 43408 96438 14569 2935 -137557
19076 -508946 -138539 -125324 -127388 -359824 -15849 -252842 -219824 61295 -240661 -276829 -107289
19064 110891 -62632 -187452 -438824 -174267 -56628 310568 -21642 -396322 -232312 -198800
19054 -198800 -230222 -189872 -195727 -120926 -14217 266421 56895 184314 -107971 86915 -115964
19042 -71443 -141209 -177573 318646 -60212 170936 32076 22632 -119030 104695 -144031 312039
19030 -36243 -103154 161941 112622 -171080 45495 -169645 -12244 -166921 -164152 -26791 -111081
19019 -111081 88587 131440 -92082 52570 -64120 -246128 -8978 199332 -341807 -109794 183519
$$ packed form
19101g9284k32204G5037J86417M9138f1308o7801A7263d7472e968F4152b02781
19089C9674f4959m454C03713H4029b1265k51752D202L9206N3030A4569B935a37557
19076e08946a38539J3215k064k32436a5849k36993L3018F1295b40661l6168a07289
19064A10891f2632j24820k51372a74267e6628C10568b1642l74680J64010L3512
19054a98800l1422M0350n855P4801a4217B66421E6895J27419a07971H6915a15964
19042g1443o9766l6364C18646f0212A70936C2076r444a19030A04695a44031C12039
19030c6243o6911A61941m9319a71080D5495a69645a2244j54677K769b6791q4290
19019a11081H8587M2853i2082E2570f4120j82008h978A99332c41807a09794A83519
$$ plain form
19007 -33003 -234851 -199981 -17153 -85674 185582 97751 41613 174303 -37445 -1133 -71348
18996 -71348 18129 -247165 78134 -35504 -87077 139565 -296726 189895 55383 -46889 -94485
18985 -94485 -34167 -207913 -93512 -191982 -37424 126605 304613 -125118 168999 -91750 32816
18973 -52196 228311 7841 30721 330542 -182571 -268803 -149035 -144410 104726 85805 -171889
18961 -384473 -75656 -248485 63584 -152028 1756 4230 161691 90320 116724 179887 416588
18950 416588 -134431 -20778 53854 52425 50138 -73675 -131837 -43420 152159 77566 -162259
18938 -137873 -445069 264595 174983 12711 34282 -114752 -196963 -38719 19222 120065 -228289
18926 -119842 -115299 -23339 -132153 407735 76588 169865 -47541 -81273 106175 104100 43222
$$ packed form
19007c3003k01848L4870a7153o8521A85582q7831D1613J32690c7445a133p0215
18996g1348A8129b47165G8134c5504n1573A39565b96726A89895E5383d6889m7596
18985i4485c4167j73746i3512r8470c7424A26605J78008a25118A68999i1750C2816
18973e2196B28311G841K2880K99821a82571q6232J19768M625A04726j8921a71889
18961c84473g5656j72829F3584a52028A756K474J57461p1371K6404O3163K36701
18950D16588a34431b0778E3854j429k287g3675n8162d3420A52159p4593a62259
18938a37873l07196B64595q9612A2711K1571a14752q2211c8719A9222J00843b28289
18926a19842M543b3339j08814D07735G6588R3277d7541l3732A06175k075D3222
$$ plain form
18914 -94501 -198388 -174193 224873 -5727 -49139 -250015 -382557 -70371 -65730 198497 334814
18903 334814 154112 90601 82131 -131461 -332983 52102 -117372 -282205 -121448 -104620
18893 -104620 -48538 -195016 55813 126669 50492 -339457 -43624 -295124 82300 -70674 -628065
18882 -628065 43636 -198597 38562 -107681 208024 -16939 245131 150158 -139566 172119
18871 -132300 -469454 -345051 -85838 -300532 -293449 254722 -23648 206408 70779 101163 -274949
18859 -19243 274618 91794 273318 -64309 -33004 -118873 -304488 66047 37198 120941 -101130
18847 74902 29226 -220177 -193423 -163358 84423 24740 -90758 -98712 -119256 -137112 -118466 -52682
18834 -346068 130304 -38015 -221809 -68466 -225879 32929 305357 52296 -70361 -163174 280069
$$ packed form
18914i4501j03887K4195B24873e727m3412k00876j32542g0371M641A98497J36317
18903C34814A54112o3511q470a31461k01522E2102a17372j64833a21448J6828
18893a04620d8538j46478E5813P0856E0492c39457d3624k51500H2300g0674n57391
18882f28065D3636a98597C8562a07681B08024a6939B45131r4973a39566A72119
18871a32300l37154J24403h5838k14694P083B54722b3648B06408G0779L0384b74949
18859a9243B74618I1794J81524f4309L1305q5869j85615F6047k8849Q3743a01130
18847G4902B9226b20177K6754L0065H4423B4740i0758p954k0544j7856J8646e2682
18834c46068A30304c8015j83794f8466j57413C2929K72428E2296g0361r2813B80069
$$ plain form
18822 -96866 31748 309481 -36501 -24462 -159263 301500 148340 -28456 36781 122480 187196
18811 187196 403477 244087 134869 149349 -74819 -90492 -292135 200368 -91956 -137981
18801 -137981 -78483 234125 -223261 -393082 48958 86836 -25535 -254316 -33477 -153789
18791 -153789 -303701 978 -168130 -85390 -331058 -46300 272886 196742 19934 53410 188385
18780 188385 -296210 -190750 -162246 -39703 250971 92783 -194686 98552 146321 -294180
18769 -164773 4722 -59004 -109134 -244946 317157 -214678 -123013 -107543 -184262 83369 21033
18757 269871 -92288 -283844 63124 -148949 -51317 -141623 8195 -13401 -44730 -54154 -93730
18746 -93730 -430715 49777 -24050 -36505 11753 -235736 -11634 -23624 261088 -313745 -178955
$$ packed form
18822i6866C1748K77733c6501J2039j34801C01500A48340b8456C6781Q5699O4716
18811A87196K16281j59390j09218J4480g4819j5673k01643B00368i1956m6025
18801a37981N9498B34125b23261j69821D8958L7878b5535k28781c3477j20312
18791a53789j49912I78a68130Q2740k45668d6300B72886p6144A9934L3476J34975
18780A88385b96210J05460K8504c9703B50971I2783a94686I8552M7769b94180
18769a64773D722e9004n0130j35812C17157b14678R1665J5470p6719H3369B1033
18757B69871i2288j91556F3124a48949e1317r0306H195a3401l1329r424l9576
18746i3730l36985D9777b4050j2455A1753b35736a1634j1990B61088c13745J34790
$$ plain form
18735 -178955 30944 33975 249066 -311569 103350 14532 -275492 -22244 49482 -206835 305671
18723 -89667 -153995 204137 -110702 248075 -85017 114968 275828 1970 -67493 82200 -255
18711 27109 53279 -233748 -107218 -144208 -126793 -307496 -359565 189801 -61743 -172868 116681
18699 -198045 178070 -262835 -110454 122733 -101231 -274675 -36887 -224861 -369790 12521
18688 8709 -34262 -425787 12818 -12785 -115307 226034 -266053 -304271 31498 252357 -28932
18676 6815 16822 6725 93809 -200895 -35452 -133160 -142397 -83379 60987 39782 -380734 -1797
18663 -129603 -46248 -150045 47067 -296186 437426 77043 167257 114775 102816 41301 -112084
18651 -134447 -195439 322749 -272989 -136248 -113162 -199561 59376 164678 -241779 -45992
$$ packed form
18735a78955C0944L031K15091c11569A03350A4532b75492b2244D9482b06835C05671
18723h9667o4328B04137a10702B48075h5017A14968J60860A970f7493H2200b55
18711B7109K6170b33748a07218l6990J7415j80703n2069A89801f1743j11125A16681
18699a98045A78070b62835a10454A22733a01231j73444c6887j87974j44929A2521
18688H709c4262l91525A2818a2785j02522B26034b66053l8218C1498K20859b8932
18676F815J0007F725Q7084b00895c5452r7708r237N9018F0987k1205c80734a797
18663a29603d6248j03797D7067b96186D37426G7043R0214n2482j1959D1301a12084
18651a34447o0992C22749b72989a36248K3086q6399E9376J05302b41779d5992
$$ plain form
18640 -271565 -6964 -290774 39780 -221390 -147031 -98452 -57533 -197146 4068 -264593 191602
18628 -168919 -10617 -154382 9430 -39092 -97599 -249777 -285385 92540 -123528 -88756 -32971
18616 230817 -92385 112550 -150749 -76033 266986 -234330 43459 -4357 -225081 331187
18605 -41877 91686 -28221 -162159 -8155 242800 -6163 -139123 6529 -23986 -28669 14801 218052
18593 218052 -219159 -6421 -57455 94023 -156611 -11890 273069 261690 27615 -184024 -150479
18582 -150479 -350461 -37249 47523 -350598 -272837 -323357 207245 371228 -182089 -62774
18571 174451 446772 -146572 -119636 -44316 28394 -122439 -194073 43281 -185808 -178414 -23374
18559 -224437 -206439 -82419 -143733 55774 -362466 13748 -261327 -162212 16126 -5478 144906
$$ packed form
18640b71565f964k83810C9780b21390P4359M8579M0919j39613D068b64593A91602
18628a68919a0617j43765I430c9092n8507j52178l5608I2540a23528L4772c2971
18616B30817i2385A12550a50749P4716B66986b34330D3459d357k20724C31187
18605d1877I1686b8221j33938h155B42800f163j32960F529b3986m683A4801K03251
18593B18052b19159f421n1034I4023a56611a1890B73069j1379B7615a84024L3545
18582a50479j99982c7249D7523c50598P7761n0520B07245J63983a82089f2774
18571A74451K72321a46572K6936d4316B8394a22439p1634D3281a85808P394b3374
18559b24437J7998h2419o1314E5774c62466A3748b61327R9115A6126e478A44906
$$ plain form
18547 39900 -313466 -115042 91607 55802 -52282 112416 -68986 -113503 -133798 -127645 54984
18535 -183263 -143841 -7859 131453 -130514 -272251 -129920 -316473 -68154 242631 166806
18525 166806 -96130 77784 89152 -148194 -43695 292029 137533 -204079 -37919 -378183
18515 -378183 -279427 -3854 249631 -100530 -250348 -226791 -299306 8303 -338300 -82914 -49176
18504 -49176 278975 -28095 -399955 -17499 87203 59711 205669 161557 -183453 84339 -250746
18492 -72046 -5143 76508 232237 -120041 -47362 -28966 86305 -135235 -21042 -94186 51204
18480 -222038 -487346 -90028 -138700 286473 -212977 29670 -10442 39902 -271170 -25955 -189764
18469 -189764 148345 -157578 -153021 -75952 87826 7156 -107229 -93358 -37436 -193942 120686
$$ packed form
18547C9900c13466a15042I1607l5805e2282A12416f8986m4517k0295O153E4984
18535a83263L9422g859A31453a30514j41737a29920j86553f8154B42631p5825
18525A66806i6130G7784J1368a48194d3695B92029A37533b04079c7919l40264
18515c78183R8756c854B49631a00530j49818K3557p2515H303c38300h2914L3738
18504d9176B78975b8095l71860a7499H7203k7492J45958m4112a83453H4339b50746
18492g2046e143G6508J55729a20041d7362J8396H6305a35235b1042p3144E1204
18480b22038k65308i0028m8672B86473b12977B9670a0442C9902b71170b5955j63809
18469a89764A48345a57578M557g5952H7826G156a07229J3871c7436j56506A20686
$$ plain form
18457 346726 134894 -158490 -310047 -287531 -18326 9058 155894 44377 -163543 -30879 77636
18445 -284493 187728 -112136 -149160 145752 -79971 -146883 -207098 92337 -162260 225179
18434 -232375 -52973 -266521 233983 211815 21154 -232930 -117464 22555 -137879 -100739
18424 -100739 -41180 -131572 42041 -26714 -214909 137697 -169970 -123045 -304209 305183
18413 5108 -247177 -104258 -22916 -273916 -426961 -79105 -52368 -316233 -2774 -216950 -41031
18401 60991 -28571 163095 -172001 -133379 -208509 199066 -299427 23137 -309916 -253297 -122206
18389 -264697 173551 -197257 -53305 -59322 -250546 184099 -159933 -19515 75266 161842 88791
18378 88791 2152 344517 -67889 69395 -30837 124260 -164243 -186675 58858 35690 40701
$$ packed form
18457C46726A34894a58490j51557K2516a8326I058J46836D4377a63543c0879G7636
18445b84493A87728a12136l7024A45752g9971o6912o0215I2337a62260B25179
18434b32375e2973k13548B33983k2168B1154b32930J15466B2555a37879L7140
18424a00739d1180r0392D2041b6714j88195A37697a69970M6925j81164C05183
18413E108b47177a04258b2916k51000j53045g9105K6737k63865b774k14176d1031
18401F0991b8571A63095a72001L8622p5130A99066b99427B3137c09916N6619a22206
18389b64697A73551a97257e3305o017j91224A84099a59933a9515G5266Q6576p3051
18378H8791B152L42365f7889F9395c0837A24260a64243k2432E8858k3168N011
$$ plain form
18367 40701 -342334 31009 -142010 148991 41035 264224 190625 -150284 -87998 -41960 -175240
18356 -175240 -43164 87700 67250 -173232 -334707 47659 20963 -3691 -103042 -200484 -77251
18344 -113948 239763 -111542 134058 344272 -121429 -250361 -37150 -34924 -102951 190631
18333 75934 -74444 -102078 -245249 326735 306235 6421 38618 -23980 -212540 -30283 76235
18321 37132 -188783 29224 -331980 -206851 -10959 -14134 -5156 -142433 121163 -259799 97757
18309 -207935 -125445 -129339 204920 111716 -78134 -165898 117929 -22080 -86344 -104695 -96332
18298 -96332 -393460 -111279 -109513 148954 -16554 123194 190494 351 -98639 -144257 26638
18286 -22370 2174 -132524 -277924 -302982 33904 -14664 -26704 135533 -34310 -333989 293665
$$ packed form
18367D0701c42334C1009a42010A48991D1035K23189p3599a50284O2286d1960j33280
18356a75240d3164H7700k0450a73232j61475D7659B0963c691r9351r7442g7251
18344a13948B39763a11542A34058K10214a21429j28932c7150K226o8027A90631
18333G5934g4444k7634j43171C26735k0500F421L2197b3980j88560c0283G6235
18321C7132a88783B9224c31980J25129a0959l175e156j37277A21163b59799I7757
18309b07935Q2490l894B04920r3204g8134q7764A17929b2080o4264j8351Q363
18298i6332k97128a11279J766A48954a6554A23194O7300C51i8639m5618B6638
18286b2370B174a32524j45400k5058C3904a4664j2040A35533c4310k99679B93665
$$ plain form
18274 310845 -51344 -18112 266918 232124 -189911 -27761 -278088 -172477 67343 -171391
18263 -5111 -1541 -62901 -135584 -68119 -89071 -5085 123399 19752 -14736 -75234 -55548 169902
18250 1964 -50867 36944 32833 -220179 93662 -27005 -90177 91090 -380987 -26784 45718 -119202
18237 -161300 -328279 -277999 44847 22342 -66295 -947 33585 10235 -118044 -107810 2346 461565
18225 461565 -23317 250920 -51932 -108630 11105 27225 -39646 -122223 95685 46652 6704
18213 -20070 231641 258407 -397936 -80199 -16699 -251872 -294064 61592 26394 -124616 -38972
18201 55877 182692 242114 24226 54192 197195 -151224 128660 144426 -122407 -151630 154181
18189 -116346 229831 -73109 119395 66532 -78692 37243 -195855 42901 -95893 98732 1092
$$ packed form
18274C10845e1344a8112B66918l4794a89911b7761k50327J05611F7343a71391
18263e111a541o1360p2683O7465k0952e085A23399A9752a4736o0498J9686A69902
18250A964e0867C6944m111b20179I3662b7005o3172I1090c80987b6784D5718a19202
18237a61300j66979N0280D4847B2342f6295i47C3585A0235a18044J0234B346M59219
18225D61565b3317B50920e1932n6698A1105J6120c9646q2577I5685D6652F704
18213b0070B31641K6766c97936h0199a6699k35173m2192F1592B6394a24616c8972
18201E5877J26815N9422B4226K9966J43003a51224A28660J5766a22407k9223A54181
18189a16346B29831g3109A19395n2863g8692C7243a95855D2901i5893I8732A092
$$ plain form
18177 -159136 137522 -240825 187788 63306 -51935 55499 -160802 -3389 -142 -174233 -471931
18166 -471931 -45940 -152174 -54360 -256519 13726 257858 149313 18317 283551 -191058
18155 70594 96800 -38532 -1980 -19599 61194 -20954 -27605 50167 37136 102646 36889 71622
18143 71622 -163649 186021 255819 -122780 -33072 503875 3724 -160558 -56496 68735 -263717
18131 325234 -80775 -116554 214480 228170 75753 64861 68867 -304225 115004 -256471 -420872
18120 -420872 -200570 -19590 68592 -420684 -15063 -21141 122513 66803 102196 -151399 30837
18108 -218600 54480 -3624 -178252 138192 -126757 -26570 85004 39125 -347471 127360 -256029
18096 3823 108423 -55556 -48017 -101742 307977 -397278 151496 290540 -27209 -146550 76202
$$ packed form
18177a59136A37522b40825A87788F3306e1935E5499a60802c389a42j74091k97698
18166d71931d5940j06234e4360k02159A3726K44132j08545A8317K65234a91058
18155G0594K6206c8532a980j7619F1194b0954o651E0167j3031O5510C6889L4733
18143G1622a63649A86021O9798a22780c3072E03875C724a60558e6496F8735b63717
18131C25234h0775l5779B14480J3690G5753j0892M006c04225A15004b56471j64401
18120d20872b00570a9590F8592d20684a5063o078A22513n5710L5393a51399C0837
18108b18600E4480c624j74628A38192a26757b6570H5004C9125c47471A27360b56029
18096C823J04600e5556P539n3725C07977c97278A51496J39044b7209j19341G6202
$$ plain form
18084 -96681 -20867 -8609 92608 -6757 -153567 91579 71342 225145 -87762 -40796 -129306 -343031
18072 -343031 -81070 -175189 -102646 -332515 -291886 25970 19403 -181977 65856 -313886 284591
18060 -107676 3555 -174763 -255585 37091 299427 -220252 172544 182853 -143133 -38827 212859
18048 139377 218939 -174828 94228 -146615 -106014 -188667 315845 -224412 -288494 -474530
18038 -474530 136872 -266118 -98709 72252 337084 100695 365943 -65921 -103452 90932
18027 146500 152287 101184 -215354 -75988 64306 151510 -93053 -96155 -68018 141077 220036
18016 220036 -143711 -152873 -151067 117049 257498 -139787 -84574 291625 97596 -100780 56442
18004 141472 87627 -77551 -5376 26178 106545 49577 -10825 -39607 188268 -42962 157803
$$ packed form
18084i6681b0867h609I2608f757j46810I1579k0237J53803h7762d0796q8510k13725
18072c43031h1070r4119P2543k29869M0629B5970o567a81977F5856c13886B84591
18060a07676C555a74763q0822C7091K62336b20252A72544J0309a43133c8827B12859
18048A39377P9562a74828I4228a46615M0601q2653C15845b24412o4082j86036
18038d74530A36872b66118i8709G2252K64832A00695K65248f5921l7531I0932
18027A46500N787n1103b15354g5988F4306Q7204i3053l102K8137A41077P8959
18016B20036a43711r162J806A17049J40449a39787N5213B91625I7596a00780E6442
18004A41472n3845g7551e376B6178Q0367D9577a0825k8782A88268d2962A57803
$$ plain form
17992 73582 166923 75722 -4197 -51376 92397 210257 -100013 -65260 -132813 98685 -140170
17980 309544 -277770 -26736 151616 -73802 -24346 -184197 -83532 228122 1680 -195131 8933
17968 -160289 72151 -80875 12665 -95647 -140372 -19023 -52057 136349 195052 38461 292784
17957 292784 172008 -21009 -123144 39821 -87443 222438 -52385 510 293243 -51413 39699
17945 337877 -1043 -63236 -137951 -67927 -255637 -401848 -180023 319719 -130282 293507
17934 -262414 144111 -299282 104638 -271965 -35141 -128267 -77696 336429 52677 208912
17924 208912 94443 -90037 -199101 93592 12640 107065 -381424 -135056 270975 62553 -77664
17912 -97284 60499 73290 -71113 -16367 -107350 249611 -220949 158807 -308390 -49191 -570237
$$ packed form
17992G3582R3341G5722d197m7179I2397J17860a00013L4753o7553I8685a40170
17980C09544b77770b6736A51616g3802b4346j59851h3532B28122A680a95131H933
17968a60289G2151h0875A2665i5647m4725a9023l3034A36349N8703C8461K54323
17957B92784j20776b1009j02135C9821h7443B22438e2385E10K92733e1413C9699
17945C37877a043o2193p4715f7927j87710j46211a80023C19719a30282B93507
17934b62414A44111b99282A04638b71965c5141r3126N0571C36429E2677J56235
17924B08912I4443i0037j09064I3592A2640R4425c81424a35056B70975F2553g7664
17912i7284F0499J2791g1113a6367r0983B49611b20949A58807c08390d9191n21046
$$ plain form
17901 -570237 -31719 -263389 -209832 -88936 -117668 -245091 -285489 -53146 253968 -162091 -438243
17890 -438243 -100381 -142193 -236163 -124162 83586 -50876 401496 -171065 -32337 42861 223535
17879 223535 -1997 39851 -107360 -48052 -55163 -114162 162214 -79081 -166981 355697 -129274
17867 260702 -99027 -187566 59956 -99985 196627 27583 -181411 244443 -255056 -159328 194869
17855 -121146 -336595 -122664 -70099 -162503 -82677 -83622 259460 -124492 416780 -59720 114571
17843 -85998 84649 -195213 -41810 -384150 111078 9961 -192325 -28847 -265050 -7478 -119340
17832 -119340 178149 197298 198420 -251239 290123 -37939 -64543 -162685 408139 72365 31315
17820 -117683 -102416 -7136 -91366 -1694 -99802 31572 307935 -78544 158910 113902 234455
$$ packed form
17901e70237c1719k31670N3557h8936k8732j27423m0398e3146B53968a62091k76152
17890d38243a00381m1812r3970J12001H3586e0876D01496a71065c2337D2861J80674
17879B23535a997C9851a07360d8052p111n8999A62214g9081q7900C55697a29274
17867B60702i9027q8539E9956i9985A96627B7583a81411B44443b55056R5728A94869
17855a21146k15449a22664N2565r2404P9826r45B59460a24492D16780e9720A14571
17843h5998H4649a95213d1810l42340A11078I961a92325b8847k36203g478j11862
17832a19340A78149J9149J122b51239B90123c7939k6604r8142D08139G2365C1315
17820a17683J5267g136q4230a694r8108C1572K76363g8544A58910m5008J20553
$$ plain form
17809 234455 19254 87233 190696 22106 -67454 -129747 -209180 -13521 -61170 -40836 -285310
17798 -285310 -97174 -38453 -46514 8472 -63256 -7940 110536 -1058 164108 40481 214011 126698
17786 126698 167229 132053 116014 132229 -169931 234200 133679 -1411 119720 -74073 -9089
17774 148383 -129759 141784 -277180 -82144 153266 262804 70860 31901 -52368 -359072
17764 -359072 -111228 76693 -114403 -17426 263118 -228458 138806 140953 -228429 177798
17753 -9409 -231204 360230 -73160 122036 -282397 137452 -171427 153278 -253047 98847
17742 13658 -31362 14747 -396777 16920 183418 150316 123923 -231464 -223107 -141691 169084
17730 107536 73288 102758 -285069 -213435 134940 -236146 37531 -132129 -329849 -33760
$$ packed form
17809B34455A9254O7979J03463B2106f7454o2293p9433a3521m7649K0334k44474
17798b85310i7174c8453q061H472f3256g940A10536a058A64108D0481J73530q7313
17786A26698M0531l5176j6039J6215a69931B34200j00521a411A19720g4073i089
17774A48383a29759A41784b77180h2144A53266J09538G0860C1901e2368l06704
17764c59072a11228G6693a14403a7426B63118b28458A38806K147b28429A77798
17753i409k21795C60230g3160A22036b82397A37452a71427A53278b53047I8847
17742A3658c1362A4747c96777A6920J66498l3102k6393b31464Q357Q1416A69084
17730A07536l4248K9470b85069P1634A34940b36146C7531a32129j97720c3760
$$ plain form
17719 -27313 119229 -53961 -63552 100296 101732 115037 -206927 -297076 -54896 255197 212664
17708 212664 146111 15508 -205446 86383 -266011 171893 -326115 -448915 52584 -85122
17697 -190169 34050 -117422 -48005 -113576 58541 11402 133187 299787 47020 -78620 -311228
17686 -311228 18399 -55200 -74665 -251180 236649 74165 -150892 -339442 -120641 216200
17675 211137 295803 36297 -55899 73066 -43272 818 -125518 83186 126744 -103430 41785
17663 227736 -185877 -263184 -59361 143929 73006 5614 9820 238359 93679 -131526 -258124
17652 -258124 -70228 -81840 -14751 -59428 -7561 68784 -139380 -216722 -175800 271595 235837
17641 235837 193018 340746 -207974 184131 252655 -62674 131511 180267 205141 51774 23208
$$ packed form
17719b7313A19229e3961r591A00296J436J3305b06927r0149e4896B55197m2533
17708B12664o6553A5508b05446H6383b66011A71893c26115j22800E2584h5122
17697a90169C4050a17422d8005o5571E8541A1402J21785J66600D7020g8620k32608
17686c11228A8399e5200j9465j76515B36649G4165a50892j88550a20641B16200
17675B11137Q4666C6297e5899G3066d3272H18a25518H3186M3558a03430D1785
17663B27736a85877p7307e9361A43929p0923E614M206K28539I3679a31526j26598
17652b58124g0228j1612a4751m4677g561F8784a39380p7342M0922B71595l5758
17641B35837m2819J47728b07974A84131O8524f2674A31511M8756K4874E1774B3208
$$ plain form
17629 -144569 -143726 -201393 51186 -360563 206699 260001 165518 -91381 571608 112664 -300933
17617 81587 -116247 -213629 281471 -199096 392633 131803 113480 238989 142444 217826
17607 217826 -251125 -69542 -361688 -19677 -107793 220119 166644 7603 -67186 226049 -54679
17595 233804 42349 -256651 -161282 243030 178018 -68227 27172 145713 -68313 -4279 -54122
17584 -54122 65250 184172 420041 12175 93809 -138870 -103746 108523 128572 93844 87690
17573 87690 -75293 56729 -252001 -52786 110914 18615 -186136 -24800 -110032 88724 354150
17562 354150 -120427 14460 73017 105798 427914 -125413 54969 265325 -216437 168463
17551 -183110 -66775 70112 -286862 190211 -190362 -183140 322221 -146216 224740 -96999
$$ packed form
17629a44569Q43n7667E1186c60563B06699N3302r4483i1381E71608A12664c00933
17617H1587a16247r7382B81471a99096C92633A31803j8323J25509r6545P5382
17607B17826b51125f9542k92146a9677q8116B20119n3475G603f7186B26049e4679
17595B33804D2349b56651R5369B43030o5012f8227B7172J18541f8313d279m9843
17584e4122F5250J18922K35869A2175Q1634a38870L5124A08523K0049l4728o154
17573H7690g5293E6729b52001e2786A10914A8615a86136b4800q5232H8724K65426
17562C54150a20427A4460N8557L2781L22116a25413E4969K10356b16437A68463
17551a83110f6775G0112b86862A90211a90362P222C22221a46216B24740i6999
$$ plain form
17540 150379 -23972 -125033 10975 347332 -18277 90803 37935 146852 -9550 59488 -185144
17528 -85234 -59331 246397 275039 -131545 272872 272028 65188 341484 -159033 87091 243343
17517 243343 147502 135434 -228823 222659 41738 56155 85957 13800 -257690 63176 783002
17506 783002 114121 -107891 197104 174772 152754 -242699 -138842 -136265 -269293 -83704
17495 33746 172788 371143 87410 222536 -16003 -8164 -99386 -198648 160324 -149621 -290732
17484 -290732 -105527 377094 63315 -281014 81244 -38810 44625 -178058 95988 339507
17474 339507 178247 387088 136074 464900 124989 -149161 96348 101687 115216 250300
17464 250300 62282 172331 244753 -78975 223108 15267 243214 334218 518076 -157434
$$ packed form
17540A50379b3972j01061A0975L36357a8277I0803C7935J08917i550E9488a85144
17528h5234K5903B46397K8642a31545B72872q44F5188K76296a59033H7091J56252
17517B43343r5841j2068b28823B22659D1738J4417K9802A3800b57690F3176P19826
17506G83002A14121a07891A97104k2332k2018b42699J03857K577j33028h3704
17495C3746J39042J98355H7410J35126a6003P839r1222r9262A60324a49621j41111
17484b90732a05527C77094F3315b81014H1244c8810D4625a78058I5988K43519
17474C39507j61260K08841A36074L28826A24989a49161I6348N339J3529J35084
17464B50300F2282J10049P2422g8975B23108A5267K27947R1004J83858a57434
$$ plain form
17453 -56392 392907 625323 1369 59965 338645 213862 426866 445382 43298 296064 143894
17441 121763 128029 356036 323447 -104955 178361 -33009 148682 -21384 320861 357222 321589
17430 321589 61013 466970 -66292 -106404 347648 175553 146441 359525 254667 271101
17420 271101 237570 285769 264979 273150 191299 195282 321336 -52963 465304 287576 -74062
17408 359523 257222 553542 20165 279979 -43235 163121 217470 -130574 100332 174953
17398 174953 199395 -57521 388632 -24621 179235 210084 181832 348892 440070 143763 -116313
17386 505799 179282 305383 105210 434983 -45560 53170 239935 208178 -398482 -89202
17375 -233382 136918 198519 -142673 40934 303906 -59408 153757 294834 66086 -16501
$$ packed form
17453e6392C92907K32416A369N8596K78680j24783K13004J8516D3298K52766A43894
17441A21763O266K28007l2589a04955A78361c3009A48682b1384C20861L6361l5633
17430C21589F1013M05957f6292m0112C47648j72095k9112K13084j04858J6434
17420B71101l3531M8199k0790Q171q1851L983J26054e2963D65304j77728g4062
17408C59523j02301K96320B0165K59814d3235A63121N4349a30574A00332P4621
17398A74953K4442e7521C88632b4621A79235L0849k8252J67060R1178A43763a16313
17386E05799A79282J26101A05210L29773d5560E3170J86765l1757c98482h9202
17375b33382A36918O1601a42673D0934K62972e9408A53757J41077F6086a6501
$$ plain form
17364 323774 438708 190208 206810 50383 314252 21915 12300 321501 208124 164979 68922
17352 41 71991 232654 121382 -16982 340943 239129 7263 -183626 365473 192270 -4574
17340 77892 270526 -47441 -2306 53443 343518 275698 397958 330145 -100818 171240 211321
17329 211321 6208 120669 -126974 182048 313128 -14058 123091 25115 -181548 -60392
17318 422960 102153 -156250 310225 167185 300389 371758 200722 -53884 408984 220914
17308 220914 151667 371523 218675 86217 109622 77990 75595 -171437 343911 91320 96345
17297 96345 -55241 190844 124858 222660 72690 454985 -97493 6970 184071 352813 340592
17286 340592 188818 -94725 163998 113133 -87235 -65790 156532 299291 376600 -26575 298200
$$ packed form
17364C23774J14934A90208J6602E0383K63869B1915r615L09201j13377m3145F8922
17352D1P1950J60663j11272a6982C40943j01814G263a83626C65473j73203d574
17340G7892J92634d7441b306E3443K90075o7820J22260o7813a00818A71240M0081
17329B11321F208J14461a26974A82048J31080a4058A23091B5115a81548f0392
17318D22960A02153a56250C10225j43040J33204P1369j71036e3884D08984j88070
17308B20914o9247K19856j52848H6217K3405l1632k395a71437C43911I1320N025
17297I6345e5241A90844o5986R7802G2690L82295i7493F970J77101J68742j2221
17286C40592j51774i4725A63998n0865h7235K1445A56532J42759P7309b6575B98200
$$ plain form
17274 212143 55293 128741 365741 115829 -33115 189463 257167 187102 31004 83087 -72114
17262 250034 274361 380281 626443 188716 -130861 110401 144347 203270 73472 270517
17252 270517 332339 -25982 136266 224208 212799 453923 39519 422704 56241 36579 -16808
17240 409748 71311 269183 100631 241508 -54785 -121453 317453 414272 153246 -78438
17229 232390 15454 19068 127369 250806 310344 159826 23646 342294 229017 407716
17219 407716 88974 70437 165864 231050 -152040 76794 8778 148732 88134 325186 233412
17208 233412 319855 305880 228167 7486 409641 375817 356127 -15793 357913 421774 123026
17196 79937 75443 570821 368606 314282 187896 517898 221716 434904 72782 269653
$$ packed form
17274B12143E5293P3448K37000A15829c3115A89463O7704p0065C1004N2083g2114
17262B50034K4327J05920K46162A88716a30861A10401L3946N8923G3472J97045
17252B70517O1822b5982A36266Q7942j1409K41124C9519L83185E6241j9662a6808
17240D09748G1311J97872A00631J40877e4785o6668C17453R6819A53246g8438
17229B32390A5454L614J08301J23437N9538j50518B3646L18648j13277J78699
17219D07716H8974j8537R5427O5186a52040G6794H778J39954o0598K37052r1774
17208B33412Q6443j3975p7713G486M02155l3824j9690a5793C57913O3861A23026
17196G9937m494M95378k02215n4324j26386L30002B21716K13188G2782J96871
$$ plain form
17186 269653 31167 -65419 121950 193569 141521 78009 231587 121748 175589 336092 168291
17175 168291 520083 -178424 146535 228485 241295 130303 247206 358439 105497 190971
17165 190971 243308 257354 454828 122470 122944 466035 578924 273483 338980 83360 176856
17154 176856 314136 670670 -207587 315821 318948 229673 -205938 314739 289117 211742
17144 211742 242956 69355 230127 464621 295480 243098 377115 316603 486245 -75338
17133 591710 324003 68476 291559 204312 24130 237308 520854 246033 451101 720867
17123 720867 575116 197256 510582 414173 207957 243209 331136 333724 392602 29674 342127
17112 342127 262537 707523 436448 278965 363724 532733 318757 103931 204292 407897
$$ packed form
17186B69653C1167f5419A21950P1619n2048o3512J53578j09839N3841J60503j67801
17175A68291L51792a78424A46535Q1950J2810j10992J16903J11233A05497Q5474
17165A90971N2337J4046J97474A22470M74L43091J12889B73483O5497H3360R3496
17154A76856J37280L56534b07587C15821L127q9275b05938C14739k5622p7375
17144B11742L1214F9355J60772K34494j69141n2382J34017o0512J69642g5338
17133E91710k67707F8476K23083q7247B4130K13178K83546B46033K05068K69766
17123G20867j45751A97256L13326r6409k06216L5252Q7927K588N8878B9674L12453
17112C42127p9590M44986k71075j57483Q4759J69009k13976A03931J00361K03605
$$ plain form
17102 407897 304664 533823 552060 440993 316264 431228 228763 228529 356031 296379
17092 296379 490355 417825 306537 431412 627487 477389 475521 607871 589001 597707 332656
17081 332656 723206 398036 187160 391627 267023 554122 590753 444214 370454 312858
17071 312858 206753 502505 329282 445872 302830 424601 162956 606364 401059 380507
17061 380507 523279 671203 507336 660334 635081 634747 643745 599933 649410 615949 647660
17050 647660 604531 683923 594643 392132 461142 324563 614890 695189 591906 735997
17040 735997 548185 778024 640407 346226 477348 977758 477661 379139 319828 621339
17030 621339 370973 529094 1027147 445794 518036 606325 541626 509386 510784 551467 719653
$$ packed form
17102D07897j03233K29159J8237j11067j24729J14964k02465k34J27502n9652
17092B96379J93976p2530j11288J24875J96075j50098j868J32350j8870Q706k65051
17081C32656L90550l25170A87160K04467j24604K87099L6631j46539p3760n7596
17071C12858j06105K95752j73223J16590j43042J21771A62956M43408k05305k0552
17061C80507J42772J47924j63867J52998k5253l34Q998m3812M9477l3461L1711
17050F47660m3129P9392q9280k02511O9010j36579K90327Q0299j03283J44091
17040G35997j87812K29839j37617k94181J31122N00410D77661r8522n9311L01511
17030F21339k50366J58121M98053D45794P2242Q8289o4699l2240J398M0683J68186
$$ plain form
17019 719653 592660 563545 703560 701037 978035 797971 563275 370941 398897 445222
17009 445222 545224 485783 615843 809329 931361 879310 338890 722609 613373 629046
16999 629046 648735 754583 746600 880580 855727 745873 495841 480229 419857 590256 774356
16988 774356 581282 479642 770663 916073 526380 1297056 804796 739920 481386 1006511
16978 1006511 447735 476916 784058 650905 646628 749512 958306 799857 1140934 1038648
16968 1038648 829058 630730 778267 1119069 952655 1140604 942163 1100085 1403910
16959 1403910 1052118 703510 955161 1029477 922605 961817 676322 982462 1377997 1011526
16949 1011526 981907 919380 1223072 1197857 977142 850770 1336712 913863 1382297 1241601
$$ packed form
17019G19653j26993k9115J40015k523K76998j80064k34696j92334K7956M6325
17009D45222J00002n9441J30060J93486J22032n2051C38890L83719j09236J5673
16999F29046J9689J05848p983J33980k4853j09854k50032j5612o0372J70399J84100
16988G74356j93074j01640K91021J45410l89693P70676m92260o4876k58534N25125
16978A006511D47735K9181L07142j33153m277J02884K08794j58449L41077j02286
16968A038648k09590j98328J47537L40802j66414J87949j98441J57922L03825
16959A403910l51792l48608K51651P4316j06872L9212k85495L06140L95535l66471
16949A011526k9619o2527L03692k5215k20715j26372M85942m22849M68434j40696
$$ plain form
16939 1241601 1040667 1193919 1182720 962662 1127012 1192585 1216545 1128764 1188387 1058685
16929 1058685 1239351 1522224 1206827 1356492 1353362 1426243 1420805 1125037 1360160 1167410
16919 1167410 1367307 1278451 1275845 1263291 1703019 1145120 1261647 1548882 1678435 1290614
16909 1290614 1484504 1170124 1515457 1156568 1550266 1824453 1909697 1750864 1536119 1210000
16899 1210000 1740188 1564868 1855255 1591655 1715475 1983541 1855757 1575586 1754934
16890 1754934 2017089 2097914 1736569 1962267 1792174 2228459 2322788 1793091 2448334 2011843
16880 2011843 2113819 1931196 2163270 1932505 2376351 1856534 2355274 1979348 2025239 2404878
16870 2404878 2396660 2288427 2721287 2362594 2746631 2662586 2538047 2419505 2831211 2731817
$$ packed form
16939A241601k00934J53252j1199k20058J64350O5573K3960q7781N9623j29702
16929A058685J80666K82873l15397J49665l130P2881n438k95768K35123j92750
16919A167410J99897q8856k606j2554M39728n57899J16527K87235J29553l87821
16909A290614J93890l14380L45333l58889L93698K74187Q5244j58833k14745l26119
16899A210000N30188j75320K90387k63600J23820K68066j27784k80171J79348
16890A754934K62155Q0825l61345K25698j70093M36285R4329n29697O55243m36491
16880B011843J01976j82623K32074k30765M43846n19817M98740l75926M5891L79639
16870B404878q218j08233M32860l58693L84037q4045j24539j18542M11706r9394
$$ plain form
16860 2731817 2821586 2658717 2895437 2683081 2444442 3022796 2929244 3091060 2711850 2947958
16850 2947958 3156121 2939459 3374697 3174500 2989528 3342726 3201701 3250927 3187741 3366992
16840 3366992 3731045 3583988 3557092 3886156 3868887 3832264 3760988 4017255 4203223 3960491
16830 3960491 4189468 4417851 4282166 4406535 4727773 4596529 4794616 4735623 4800044 4657757
16820 4657757 5041758 5425402 5239780 5198484 5384925 5529123 5432105 5709113 5877439 6019082
16810 6019082 6120289 6231296 6218450 6636824 6866894 6599649 6599349 6869711 7028478 7433158
16800 7433158 7434501 7882345 7853641 8021588 8184682 8456912 8856830 8886103 8965322 9494114
16790 9494114 9552903 9963701 10194720 10403965 10421207 10740441 11596716 11226860 11637433 12092982
$$ packed form
16860B731817Q9769j62869K36720k12356k38639N78354r3552J61816l79210K36108
16850B947958K08163k16662M35238k00197j84972L53198j41025M9226o3186J79251
16840C366992L64053j47057k6896L29064j7269l6623p1276K56267J85968k42732
16830C960491K28977K28383j35685J24369L21238j31244J98087n8993O4421j42287
16820D657757L84001L83644j85622m1296J86441J44198r7018K77008J68326J41643
16810F019082J01207J11007j2846M18374K30070k67245l00K70362J58767M04680
16800G433158J343M47844k8704J67947J63094K72230L99918K9273P9219N28792
16790I494114N8789M10798K31019K09245J7242L19234Q56275l69856M10573M55549
$$ plain form
16780 12092982 12691880 12985701 13232050 14224395 14441728 14840771 15089567 15751348 15953647
16771 15953647 16677482 17145264 17959755 18387249 19020266 19998977 20308553 21048279 22118040
16762 22118040 23139386 24244629 24863698 25994279 27118208 28210789 29311775 30722460
16754 30722460 31953722 33677061 35466362 36803294 38559777 40345752 42714812 44900244
16746 44900244 46849021 49466415 52093792 54947582 58147389 61699342 64985840 69062860
16738 69062860 73112900 77763844 82533358 87573059 93141472 98903658 105487226 112000250
16730 112000250 118885329 126581657 134142493 142071913 149599812 157709329 165657107 172719594
16722 172719594 179664440 185477740 190632145 194812975 197917771 198898912 199287377 197749620
$$ packed form
16780A2092982N98898K93821K46349R92345K17333L99043K48796O61781K02299
16771A5953647P23835M67782Q14491M27494O33017R78711L09576P39726J069761
16762B2118040J021346J105243O19069J130581J123929J092581J100986J410685
16754C0722460J231262J723339J789301J336932J756483J785975K369060K185432
16746D4900244J948777K617394K627377K853790L199807L551953L286498M077020
16738F9062860M050040M650944M769514N039701N568413N762186O583568O513024
16730A12000250O885079P696328P560836P929420P527899Q109517P947778P062487
16722A72719594O944846N813300N154405M180830L104796R81141L88465j537757
$$ plain form
16714 197749620 195006917 191123862 186202894 180449772 173808639 166186591 158667165 150513702
16706 150513702 142822073 134898488 127039522 119622105 112578463 105623356 98984907 92957510
16698 92957510 87408785 82178576 77182584 72342584 68100069 64210812 60250455 57346015
16690 57346015 53805606 50966954 48279329 45694748 43461805 41012970 38924472 37013742
16682 37013742 35014399 33437956 31610940 30544564 28810865 27557052 26462133 25576089
16674 25576089 24189062 23221938 22394147 21334944 20332474 19901856 18942514 18104811 17684505
16665 17684505 17145206 16096169 15537427 15318141 14970568 14783562 13654995 13418651 13151855
16656 13151855 12470571 12286610 11740086 11348911 10999892 10910028 10526227 10346967 10145429
$$ packed form
16714A97749620k742703l883055m920968n753122o641133p622048p519426q153463
16706A50513702p691629p923585p858966p417417p043642o955107o638449o027397
16698I2957510n548725n230209m995992m840000m242515l889257l960357k904440
16690E7346015l540409k838652k687625k584581k232943k448835k088498j910730
16682C7013742j999343j576443j827016j066376j733699j253813j094919q86044
16674B5576089j387027r67124q27791j059203j002470m30618r59342q37703m20306
16665A7684505n39299j049037n58742k19286l47573j87006j128567k36344k66796
16656A3151855o81284j83961n46524l91175l49019q9864l83801j79260k01538
$$ plain form
16647 10145429 9913824 8936936 9151558 8936346 8533311 8470101 8120280 7725175 7694413 7461083
16637 7461083 7436811 7271432 6819942 6761262 6552162 6783353 6418085 6134765 5756545 5939117
16627 5939117 5659706 5606293 5494141 5257511 5115391 5090457 4984682 5029725 5125206 4751516
16617 4751516 4280798 4720446 4210360 4148595 3958414 4081835 4335376 4168360 3830259 4003327
16607 4003327 3873882 3721793 3171575 3572962 3117578 3379225 3578413 3599764 3075086 3547016
16597 3547016 3335680 3084855 2995524 3059908 2853944 3162315 2582514 2906857 2683475 3018918
16587 3018918 2466658 2567724 2429067 2588030 2436413 2324955 2448794 2612218 2384218
16578 2384218 2371417 2250646 2188196 1963557 2304134 2024575 2076076 1753980 1948020 2390271
$$ packed form
16647A0145429k31605r76888K14622k15212m03035o3210l49821l95105l0762k33330
16637G461083k4272j65379m51490n8680k09100K31191l65268k83320l78220J82572
16627E939117k79411n3413j12152k36630j42120k4934j05775M5043R5481l73690
16617D751516m70718M39648n10086o1765j90181J23421K53541j67016l38101J73068
16607D003327j29445j52089n50218M01387m55384K61647J99188K1351n24678M71930
16597C547016k11336k50825q9331O4384k05964L08371n79801L24343k23382L35443
16587C018918n52260J01066j38657J58963j51617j11458J23839J63424k28000
16578B384218j2801j20771o2450k24639L40577k79559N1501l22096J94040M42251
$$ plain form
16568 2390271 1997098 2082223 1714121 1938474 1860269 1762873 1895045 2100864 1843837 1634954
16558 1634954 1786771 1590757 1653626 1621095 1542557 1832332 1499066 2016972 1496014 1196120
16548 1196120 1431142 1255210 1605838 1580437 1412305 1273065 1486877 1455787 1425783 1049154
16538 1049154 1271205 1337159 1203634 1175565 978500 1168460 1466829 1190321 979879 1203339
16528 1203339 1018093 1113731 1179156 1116264 1138751 888871 1170991 872537 1351739 891208
16518 891208 1132839 917685 1222775 960643 1057985 1123005 961221 1028940 985275 867871
16508 867871 958198 1118841 729572 1165004 637865 1217972 902675 866984 764344 616906
16498 616906 732938 857596 1087511 639677 478009 900986 694371 563755 717874 836293
$$ packed form
16568B390271l93173Q5125l68102K24353p8205r7396J32172K05819k57027k08883
16558A634954J51817j96014O2869l2531p8538K89775l33266N17906n20958k99894
16548A196120K35022j75932L50628k5401j68132j39240K13812l1090l0004l76629
16538A049154K22051O5954j33525k8069j97065J89960K98369k76508k10442K23460
16528A203339j85246R5638O5425o2892K2487k49880K82120k98454M79202m60531
16518H91208K41631k15154L05090k62132R7342O5020j61784O7719m3665j17404
16508H67871R0327J60643l89269M35432n27139N80107l15297l5691j02640j47438
16498F16906J16032J24658K29915m47834j61668M22977k06615j30616J54119J18419
$$ plain form
16488 836293 813186 669422 589837 701498 536450 1006386 380577 459288 708609 748573
16478 748573 845413 945447 566575 413860 279388 574664 676600 766571 602678 917589
16468 917589 543876 634062 543461 293275 766256 520858 475404 489113 471466 624524
16458 624524 355151 978965 171232 578742 665812 625434 615541 527838 678860 526894
16448 526894 382051 327706 495336 690551 623864 395471 474352 649559 546849 483681
16438 483681 426511 492511 675117 747708 486477 254857 657591 435437 607276 597728
16428 597728 490857 839575 448228 257379 537433 214205 550618 270868 443329 347104
16418 347104 91443 242578 492505 585570 175431 427159 430682 296090 376597 353584 549687
$$ packed form
16488H36293k3107j43764p9585J11661j65048M69936C80577P8711K49321L9964
16478G48573R6840J00034l78872j52715j34472K95276J01936Q9971j63893L14911
16468I17589l73713R0186r0601k50186M72981k45398m5454J3709j7647J53058
16458F24524k69373O23814A71232M07510Q7070m0378r893q7703J51022j51966
16448E26894j44843n4345J67630J95215o6687k28393P8881J75207j02710o3168
16438D83681n7170O6000J82606P2591k61231k31620M02734k22154J71839r548
16428E97728j06871L48718l91347j90849K80054B14205L36413B70868J72461r6225
16418C47104I1443J51135K49927R3065A75431K51728L523j34592Q0507k3013J96103
$$ plain form
16407 549687 871175 451610 437983 513694 365423 636247 607098 337658 168855 461001
16397 461001 732708 253131 310974 167474 332682 207531 34778 167551 109632 377071
16387 377071 166164 452931 314571 474478 304312 203404 553829 418827 499835 674314
16377 674314 477259 514711 466234 -39305 231008 233274 316299 188404 395329 118798 118301
16366 118301 543718 266866 375832 519290 152088 246833 597718 259321 390667 445528
16356 445528 420822 136231 264869 162903 108096 147416 -76015 -115198 114285 243054
16346 243054 97875 388425 306752 166574 156760 508944 267960 -71631 160940 238035 356688
16335 356688 186371 270440 237625 539931 381899 -162910 -207294 362885 132178 210734
$$ packed form
16407E49687L21488m19565j3627P5711j48271K70824k9149k69440j68803K92146
16397D61001K71707B53131N7843j43500J65208j25151C4778J32773n7919K67439
16387C77071A66164K86767j38360J59907j70166j00908L50425j35002Q1008J74479
16377F74314j97055L7452m8477c9305B31008K266Q3025j27895K06925A18798m97
16366A18301M25417B66866J08966J43458A52088R4745L50885B59321J31346N4861
16356D45528k4706A36231J28638j01966n4807L9320g6015l9183A14285J28769
16346B43054I7875K90550q1673j40178r814L52184k40984g1631A60940P7095J18653
16335C56688j70317Q4069l2815L02306j58032a62910m4384C62885A32178P8556
$$ plain form
16325 210734 441380 362754 -32386 330133 373243 187515 383071 201567 -112639 42702
16314 117660 77678 309644 174660 -17500 -1242 302772 90709 600191 445392 140001
16303 69518 186522 239790 434570 -117509 182850 201663 -80973 -37810 29918 165361 109158
16292 109158 513138 20489 100083 -23446 160886 361643 -115222 254264 155485 104865
16282 104865 -8630 -79837 -179771 44536 542301 -89409 -63705 -32352 232197 -148915 -212942
16271 -212942 -72860 340834 256956 283845 391454 68187 -12866 87055 137477 -54015 35557
16259 223468 89171 -65504 -40891 98723 61837 -100774 -55568 125325 289466 30510 590
16247 716964 277827 332220 119769 -27713 -35157 181222 -53644 94931 -10578 140112 14515
$$ packed form
16325B10734K30646p8626c2386C30133M3110j85728J95556j81504a12639D2702
16314A17660l9982K31966j34984a7500a242C02772I0709N09482j54799A40001
16303F9518J17004N3268J94780a17509A82850J8813h0973c7810B9918J35443n6203
16292A09158M03980B0489P9594b3446A60886K00757a15222B54264r8779n0620
16282A04865h630p1207r9934D4536M97765h9409K5704L1353B32197a48915o4027
16271b12942g2860C40834q3878K6889J07609F8187a2866H7055N0422e4015C5557
16259B23468H9171f5504K4613I8723l6886a00774M5206A25325J64141C0510E90
16247G16964B77827N4393A19769b7713p444A81222e3644I4931a0578A40112A4515
$$ plain form
16235 57803 -131788 282515 262026 138340 13807 -186355 92959 -416066 -219680 174905
16224 175245 -38925 64765 185478 71523 155707 -2501 164619 117056 -62023 -193479 181651
16212 103636 -120818 249748 -60177 68318 -144926 -184333 54407 -130908 -19993 137607
16201 181864 156951 129771 152788 16540 -25041 174821 80619 -111617 -66560 83934 247481
16190 247481 -115788 -8099 27843 201489 -33110 111040 80826 1539 312529 -323297 2154
16178 66924 87525 -89030 280931 -188710 -153350 67962 189524 63722 66060 -36257 38870
16166 280922 -36473 -35068 181722 236718 94254 -124101 166537 -285290 141599 -273017
16155 168747 31952 357569 143802 175898 -43381 -28356 -5219 -302615 139939 103214 201235
$$ packed form
16235E7803a31788B82515k0489j23686A3807a86355I2959d16066J96386A74905
16224A75245c8925F4765J20713G1523Q4184b501A64619m7563f2023j31456A81651
16212A03636a20818B49748f0177F8318a44926l9407E4407a30908a9993A37607
16201A81864k4913k7180K3017A6540b5041A74821H0619a11617M5057H3934J63547
16190B47481a15788h099B7843J73646c3110A11040l0214A539L10990c23297B154
16178F6924K0601h9030B80931a88710L5360F7962J21562F3722K338c6257C8870
16166B80922c6473J405A81722N4996I4254a24101A66537b85290A41599b73017
16155A68747C1952L25617A43802L2096d3381J5025e219k97396A39939l6725R8021
$$ plain form
16144 201235 47182 211519 115702 216972 -118530 75315 -19196 -17944 51521 -153664 205739
16132 305219 20572 -138861 -37623 -274397 94589 50010 -229947 22497 28776 -168896 50723
16120 -36152 -183008 -27694 33785 -169997 185115 6729 55928 -187560 -68080 -25233 18923
16108 33280 -218977 -303838 -115259 -205294 190919 182824 122116 155911 243780 82756 153315
16097 153315 200574 173327 173927 130809 199435 227051 -7415 123547 197557 222331 159087 39336
16084 -125043 -143838 522 -37455 -41602 -42391 131024 106471 10055 -80579 279341 41434 -122047
16071 -54062 -136213 -103830 -78117 -371706 28258 -38212 192346 -192133 -45676 13428 -292991
16059 -82194 57508 101741 180123 -62641 -237572 88487 -422145 276580 151879 85404 -289247
$$ packed form
16144B01235D7182J64337r5817J01270a18530G5315a9196J252E1521a53664B05739
16132C05219B0572a38861c7623k36774I4589m4579b29947B2497O279a68896E0723
16120c6152j46856b7694C3785a69997A85115F729M9199a87560f8080b5233A8923
16108C3280b18977q4861a15259r0035A90919q095o0708L3795Q7869H2756P0559
16097A53315M7259k7247O00m3118O8626K7616g415A23547P4010K4774o3244C9336
16084a25043j8795E22c7455m147p89A31024k4553A0055h0579B79341D1434a22047
16071e4062q2151L2383K5713k93589B8258c8212A92346a92133d5676A3428b92991
16059h2194E7508M4233P8382f2641j74931H8487d22145B76580j24701o6475b89247
$$ plain form
16047 223406 -333111 -114250 133892 78165 160686 280444 -13881 -18435 -74734 53609 -199317
16035 97194 42814 64071 263976 -187850 273998 70687 188154 66267 -117141 153912
16024 -178681 -30051 -146588 -34725 257263 71149 223103 -273225 26571 12224 -82041 -242427
16013 -242427 -126667 229011 -55488 -11521 -58523 -76507 -57011 80919 -214371 -189479 258594
16001 -383145 -408293 3348 182907 -282537 -255116 -163809 77344 -189441 -136283 -31003 -120595
15990 -120595 -24863 -132064 296195 -137999 34338 -158082 -115278 147370 259416 118420
15979 167193 131996 183385 247811 29652 -6620 -138925 -71517 80230 -267924 -177983 -34632
15967 121216 -189592 33628 108437 108103 397435 149183 -265437 -68392 -371009 32684 324873
$$ packed form
16047B23406c33111a14250A33892n5727Q2521J19758a3881m554n6299E3609a99317
16035I7194D2814K1257J99905a87850B73998G0687J17467F6267a17141A53912
16024a78681c0051j16537c4725B57263G1149J51954b73225B6571A2224h2041j60386
16013b42427J15760B29011e5488a1521m7002j7984J9496H0919b14371K4892B58594
16001c83145k5148C348J79559b82537K7421R1307G7344a89441N3158c1003q9592
15990a20595b4863j07201B96195a37999C4338a58082M2804A47370J12046A18420
15979A67193l5197N1389O4426B9652f620j32305O7408H0230b67924Q9941c4632
15967A21216a89592C3628P4809l34K89332A49183b65437f8392l02617C2684K92189
$$ plain form
15956 324873 152637 -312098 89825 -79269 92752 -165221 67799 -243294 -60645 132217
15945 -69496 8006 44595 74523 196622 -63889 213720 -79331 86559 -95169 -54372 -236911
15934 -236911 -349885 -240168 -171595 84479 -69546 -13276 -140240 -87454 -12593 -376344 -178262
15922 -80033 -200634 -66135 128278 -60516 -251536 -344120 -241807 86207 64740 -90440 -132336
15911 -132336 236292 -26486 -420941 -106232 -18828 -81301 -354274 -80500 132072 -99227
15900 158243 42396 -155219 -37616 60063 -118833 -100492 162705 188816 348198 -313906
15889 86455 5392 64472 132778 -61705 219385 440554 79038 -203925 34605 -22770 -256905
15878 -256905 -148348 -144320 -19667 -5667 265509 -104199 -385557 -372912 2908 139034 -136854
$$ packed form
15956C24873A52637c12098H9825g9269I2752a65221F7799b43294f0645A32217
15945f9496H006L6589K9928J22099f3889B13720g9331H6559i5169M0797j82539
15934b36911j12974J09717O8573H4479f9546a3276j26964N2786a2593l63751a78262
15922h0033j20601f6135A28278f0516j91020r2584J02313H6207k1467i0440m1896
15911a32336B36292b6486l94455a06232a8828o2473k72973h0500A32072i9227
15900A58243D2396a55219c7616F0063a18833J8341A62705K6111J59382c13906
15889H6455E392N9080O8306f1705B19385K21169G9038b03925C4605b2770k34135
15878b56905J08557M028a9667e667B65509a04199k81358J2645B908J36126a36854
$$ plain form
15866 -247612 -20498 -155746 -321101 -46340 311260 -17793 -56953 41919 -267087 -288500 107542
15854 -225175 10441 23957 342587 -86438 -152080 255940 -17025 -14581 -118759 203089 -146139
15842 -112052 -75301 -82144 -2556 43751 -299153 -15484 -66491 -357439 108438 158215 -7914
15830 137377 -34832 -98834 -116654 -270959 -370282 260119 -185445 -64092 -4394 -48677 -88806
15819 -88806 52059 -206608 -266258 -175466 -248562 -7083 -59402 -59279 172788 139740 155543 -98614
15806 267037 -177530 -86549 52813 -98836 -55487 35184 -248707 -246345 -88787 -52662 -186610
15795 -186610 -81715 19876 -162928 139466 -210388 5410 -28679 -3654 32387 -295217 170630
15783 61618 23769 -32134 122859 -480228 -48934 47184 241282 186994 -52338 21657 -242912
$$ packed form
15866b47612b0498j35248j65355d6340C11260a7793l9160D1919b67087k1413A07542
15854b25175A0441J3516L18630h6438o5642B55940a7025K444j04178B03089a46139
15842a12052L6751o843b556D3751b99153a5484n1007k90948A08438M9777g914
15830A37377c4832o4002j7820j54305r9323B60119a85445f4092d394m4283m0129
15819h8806E2059b06608n9650R0792p3096g083n2319J23A72788l3048J5803i8614
15806B67037a77530h6549E2813i8836M3349C5184b48707K362h8787L6125j33948
15795a86610h1715A9876a62928A39466b10388E410b8679c654C2387b95217A70630
15783F1618B3769c2134A22859d80228d8934D7184J94098n4288e2338B1657b42912
$$ plain form
15771 277267 -13740 346841 -367766 -196774 -76810 190328 15467 149514 -81122 -318552
15761 -318552 52598 211517 122478 -7231 36195 152865 -154226 -71483 10971 8035 -141416
15749 167933 -106234 11372 200333 87049 -62149 163502 52307 -69355 -25680 313520 -1399
15737 86306 -150143 -210801 80620 -177107 -81989 212897 -75819 -81751 284278 26172 -46941
15725 105180 49624 98694 -486600 -182267 -303274 -176490 -183549 -62167 -170689 67519 -195932
15713 30317 -26612 -204306 26033 -156958 -363306 -135234 -165975 -202720 -144392 12108 -90950
15701 177306 309043 83847 -102097 -3126 -244224 -156548 -78091 88548 20196 -182414 -177726
15690 -177726 174182 238295 270973 303312 -198583 -142470 -272544 -426568 -275659 -226050
$$ packed form
15771B77267a3740C46841c67766J70992g6810A90328A5467J34047h1122k37430
15761c18552E2598J58919q9039g231C6195J16670a54226g1483A0971k936a41416
15749A67933a06234A1372J88961H7049f2149A63502E2307f9355b5680C13520a399
15737H6306a50143o0658H0620a77107h1989B12897g5819n932B84278B6172d6941
15725A05180D9624M9070d86600a82267j21007J26784p059f2167j08522F7519a95932
15713C0317b6612j77694B6033a56958k06348a35234l0741l6745N8328A2108i0950
15701A77306J31737H3847a02097c126k41098Q7676g8091H8548B0196a82414M688
15690a77726A74182O4113L2678L2339a98583N6113j30074j54024J50909M9609
$$ plain form
15680 -226050 165049 18445 -22436 267558 105778 -165712 -12529 125049 62722 -22771
15669 -36610 -59740 300837 284935 -276515 47463 1625 -159929 -117019 170670 -137606 -92776
15658 -92776 -132707 -76199 -528891 -103031 -81016 -92275 -76809 -52909 -155991 -47695 161226
15646 -36327 212226 37941 -30749 -227176 -27030 -238854 219604 -59240 -211166 -158147 117954
15634 -74458 264001 -106497 121868 58727 43080 -207975 22690 -44976 -322044 266058
15623 36874 29750 75711 98346 -261189 -132575 -202961 257379 339118 52965 68307 -345702
15611 7695 77423 -74295 -286165 -22694 -120833 -68605 166162 43070 101816 139134 -305680
15599 -137462 125449 -209196 20721 -90515 -48568 38524 4936 100085 20955 -147008 -53215
$$ packed form
15680b26050A65049A8445b2436B67558A05778a65712a2529A25049o2327b2771
15669c6610k3130C00837j5902b76515D7463A625a59929M2910A70670a37606M4830
15658i2776l9931N6508m52692a03031K2015j1259J5466K3900j03082d7695A61226
15646c6327B12226C7941c0749j96427b7030k11824B19604e9240j51926N3019A17954
15634g4458B64001a06497A21868E8727j5647b07975B2690d4976k77068B66058
15623C6874p124M5961K2635b61189J28614p0386B57379Q1739E2965J5342c45702
15611G695O9728g4295k11870b2694r8139N2228A66162D3070N8746L7318c05680
15599a37462A25449b09196B0721i0515M1947C8524D936R5149B0955a47008e3215
$$ plain form
15587 -147792 150541 78682 311539 109314 43112 105220 -50677 21777 -217614 32695 -79756
15575 -105584 -87570 146282 -255760 -130431 165731 66110 203397 72245 -157774 -179095
15565 -179095 232415 54404 -96364 -28711 -152109 -84023 -187721 -191133 -143682 -201298 -210776
15554 -210776 40324 34112 50081 -14914 105856 77386 4498 276603 -63883 77729 -41827
15542 -31773 -123279 372254 103106 -94376 317668 -164312 -31656 131540 132372 126348 -12686
15530 56630 278455 76833 272116 -143786 248678 -74981 -214274 -47612 -238421 -139424
15520 -139424 16285 101700 9488 57691 -120143 99596 172839 58973 16048 -274461 -119113
15508 106421 -28307 -46418 -232132 -119648 -56783 -63203 -321927 -147388 151171 41480 95955
$$ packed form
15587a47792A50541p1859K32857A09314D3112O2108e0677B1777b17614C2695g9756
15575a05584J8014A46282b55760J25329A65731F6110J37287G2245a57774k1321
15565a79095B32415E4404i6364b8711j23398O8086j03698l412M7451n7616r478
15554b10776D0324o212J5969a4914A05856k8470D498K72105f3883G7729d1827
15542c1773r1506C72254A03106i4376C17668a64312c1656A31540Q32o024a2686
15530E6630K21825G6833J95283a43786B48678g4981j39293d7612j90809R8997
15520a39424A6285Q5415I488M8203a20143I9596P3243E8973A6048b74461a19113
15508A06421b8307j8111j85714J12484e6783o420k58724a47388A51171D1480N4475
$$ plain form
15497 95955 -29310 252386 -199979 85210 41565 -65345 64679 33632 -38304 -13425 -35177
15486 -35177 153172 -273255 -92662 -57611 84118 185400 59775 131272 -11557 -126183 -105022
15475 -105022 -294298 -36291 198530 161505 110779 -263725 84679 -134907 -80240 14006 147590
15464 147590 -31892 -256049 -203587 -149577 -82577 -91671 345582 61359 -216279 45647 170705
15453 170705 -13306 -26720 -99000 154 258138 -33953 -15457 89850 223086 -229136 -213696
15442 -213696 -31978 -98088 -547990 -124640 -27414 -109400 173959 115641 -70574 -79444 12550
15430 -225131 6080 175387 17152 256430 -148122 -58899 -276102 81950 -5390 87360 -48491
15418 168561 -52243 -227782 182816 -140838 192581 158282 223278 -232547 59657 101344
$$ packed form
15497I5955b9310B52386a99979H5210D1565f5345F4679l1047c8304a3425k1752
15486c5177A53172b73255i2662L5051H4118J01282E9775P1497a1557j14626K1161
15475a05022j89276c6291A98530l7025n0726b63725H4679a34907N4667A4006J33584
15464A47590c1892k24157N2462N4010O7000r094C45582F1359b16279D5647J25058
15453A70705a3306j3414p2280A54K57984c3953a5457H9850J33236b29136J5440
15442b13696c1978o6110m49902a24640b7414q1986A73959n8318g0574q870A2550
15430b25131F080J69307A7152K39278a48122e8899k17203H1950e390H7360d8491
15418A68561e2243j75539A82816a40838A92581l4299O4996b32547E9657M1687
$$ plain form
15408 101344 220799 -230922 26876 -281371 -58427 -126502 265758 -67067 179848 79121
15397 50187 272891 -2706 -3633 -455722 208853 -73567 72243 22114 -59018 324475 2957 -165383
15384 -108799 -433822 -134133 -1533 -234311 -9259 258138 -84865 139259 161656 140545 -29313
15372 228830 -23864 -17401 -97109 -202506 -248163 -147938 149596 -341118 143448 153912 230271
15361 230271 -351130 87300 92025 -117684 -161281 256643 -184227 -77086 32117 109358 63098
15350 63098 74779 -177517 -44209 126865 256130 85489 -56313 -194655 48259 -100797 -33148
15338 438421 28651 151424 380719 -177993 168982 68463 -143733 116088 -141564 448618
15327 -158263 -150720 -181234 -27053 -85469 -129746 -27181 54309 280997 299912 -108128 -14744
$$ packed form
15408A01344J19455b30922B6876b81371e8427o8075B65758f7067A79848G9121
15397E0187K22704b706r27m52089B08853g3567G2243B2114e9018C24475B957a65383
15384a08799l25023a34133a533k32778i259B58138h4865A39259K2397k1111b9313
15372B28830b3864O463p9708j05397m5657J00225A49596c41118A43448J0464P6359
15361B30271c51130H7300M725a17684m3597B56643a84227g7086C2117P7241m6260
15350F3098J1681a77517d4209A26865J29265H5489e6313j38342D8259a00797c3148
15338D38421B8651J22773K29295a77993A68982F8463a43733A16088a41564D48618
15327a58263P543l0514b7053n8416m4277b7181E4309K26688J8915a08128a4744
$$ plain form
15315 -161485 -146388 -321308 62596 -41276 -69521 162033 -41597 256603 -93081 -128896 -82896
15304 -82896 -288360 -64846 -139035 -40689 145501 170076 -120255 36961 167840 190853 -170224
15292 215726 256612 -33642 230338 46435 389399 177950 43832 175705 208637 517185
15282 517185 14152 -165868 204630 76395 30352 -44900 -322355 266001 207651 -108594
15271 313969 108732 191245 82168 52949 -67303 -39684 177559 -158919 227473 -48585 -2806
15259 394236 129485 -62681 83620 109697 101979 18592 342431 -16618 -21885 318357 463514
15248 463514 816539 1486844 1234775 1349969 1225793 468537 314745 220984 133036 -36613
15237 131370 37818 352708 -111103 415666 -121511 26379 -1952 -82885 -121008 -181903 -230246
$$ packed form
15315a61485J5097j74920F2596d1276k8245A62033d1597B56603i3081l5815M6000
15304h2896k05464f4846p4189d0689A45501K4575a20255C6961J30879K3013a70224
15292B15726M0886c3642B30338D6435L42964A77950D3832J31873L2932L08548
15282E17185A4152a65868B04630G6395C0352d4900k77455B66001n8350a08594
15271C13969A08732Q2513H2168k9219f7303K7619A77559a58919B27473d8585b806
15259C94236A29485f2681H3620K6077p718A8592L23839a6618n267C18357J45157
15248D63514L53025O70305k52069J15194j24176D68537j53792r3761q7948c6613
15237A31370C7818L14890a11103D15666a21511B6379a952q0933l8123o0895m8343
$$ plain form
15226 -230246 294009 -206165 -60756 306208 -262300 -107855 29996 54447 -106290 152942
15215 140058 -41875 -48357 -121785 11521 97480 43476 42371 -470 87907 92732 189934 -91626
15202 -42943 422667 206381 -73023 29185 158915 277087 -160315 30214 284331 -354765
15191 -165118 38785 293577 9896 -78357 247989 316622 93496 20156 -142164 34864 -451477
15179 -14543 26010 91728 20249 428133 196871 -285846 161544 32191 148538 -104164
15168 250723 -80197 27377 80784 86095 284765 -86844 132629 -53295 -102237 -286605 -118292
15156 -16388 297178 337114 31295 409168 420549 428129 40834 86869 182069 219076 206609
15145 206609 -179964 234360 16863 249317 -61373 226452 377150 250934 318406 -7541
$$ packed form
15226b30246B94009b06165f0756C06208b62300a07855B9996K4451a06290A52942
15215A40058d1875o482p3428A1521Q5959D3476j105d70H7907M825R7202i1626
15202d2943D22667B06381g3023B9185J29730J18172a60315C0214K54117c54765
15191a65118C8785K54792I896g8357B47989O8633I3496B0156a42164C4864d51477
15179a4543B6010O5718B0249M07884A96871b85846A61544C2191J16347a04164
15168B50723h0197B7377N3407N311J98670h6844A32629e3295m8942j84368a18292
15156a6388B97178L9936C1295L77873J1381P580D0834M6035R5200L7007j2467
15145B06609a79964B34360A6863K32454f1373B26452J50698j26216O7472g541
$$ plain form
15134 82220 4701 -117038 68407 153933 55640 210096 247984 -98477 -46807 -410651 213889
15122 230021 118152 190697 213512 243750 -125685 76565 96540 235958 -210045 18868 -207123
15110 -106103 137156 218779 359997 281721 87843 92941 -173044 -257499 202046 41295 -114979
15098 52248 370466 230973 466997 163485 123780 270936 430163 432097 446484 212728
15087 67240 266088 -152993 -4955 271705 466794 -205676 104737 313707 243283 345891
15077 345891 158740 102184 141747 154843 61819 168286 194264 192536 37181 274092 261202
15066 261202 371809 250403 85477 17425 312427 95567 287657 375795 -12913 76208 223002
15055 223002 272358 -114454 65052 176166 93839 76952 177041 119127 -49484 114949 232130
$$ packed form
15134H2220D701a17038F8407Q5526E5640J54456L7888i8477d6807l63844B13889
15122B30021j11869P2545K2815L0238a25685G6565J9975J39418b10045A8868b07123
15110a06103A37156Q1623J41218p8276H7843N098a73044q4455B02046D1295a14979
15098E2248L18218j39493K36024A63485l9705J47156J59227J934J4387B12728
15087F7240J98848a52993d955B71705J95089b05676A04737K08970p0424J02608
15077C45891A58740n6556L9563J3096F1819J06467K5978j728C7181K36911j2890
15066B61202J10607j21406H5477A7425K95002I5567J92090Q8138a2913G6208J46794
15055B23002M9356a14454F5052J11114q2327j6887J00089n7914d9484A14949J17181
$$ plain form
15044 232130 138662 279855 126342 189625 -180660 67643 -23838 194330 204717 240026 216577
15033 216577 288755 -199444 481244 79772 199998 158417 155791 264898 -147801 10281 466361
15022 466361 57334 388724 -6092 643 296164 291840 274791 103732 223511 331559 185785
15011 185785 93348 163528 91970 411014 182427 -240720 -64729 314963 267924 40081 228299
15000 228299 362210 163854 488442 106536 195925 86700 181360 98054 133788 460388
14990 460388 189049 258243 73264 160634 439796 464182 252929 482252 560595 393813
14980 393813 159013 143035 483471 361003 301322 488487 82896 595150 493025 -36427
14969 62762 255756 335506 185142 163227 346361 634946 323642 14510 342068 652913
$$ packed form
15044B32130r3468J41193A26342O3283a80660F7643b3838A94330J0387L5309k3449
15033B16577P2178a99444D81244G9772J20226m1581k626J09107a47801A0281M56080
15022D66361E7334L31390f092F43K95521m324j7049A03732J19779J08048j45774
15011A85785r2437P0180p1558L19044A82427b40720f4729C14963m7039D0081J88218
15000B28299J33911A63854L24588A06536Q9389H6700R4660q3306L5734L26600
14990D60388A89049O9194G3264Q7370K79162K4386k11253K29323P8343j66782
14980C93813A59013j5978L40436j22468n9681J87165H2896N12254j02125c6427
14969F2762J92994P9750j50364k1915J83134K88585l11304A4510L27558L10845
$$ plain form
14959 652913 455509 -48703 142446 -72898 167288 53703 215014 225419 99727 362118
14949 362118 261512 413385 308383 143596 -14234 352692 7029 365130 267673 289212
14939 289212 128811 129080 194363 218512 493399 294826 489781 224959 307460 306643 -154915
14927 249537 214299 348871 748157 278687 267078 -12544 330593 439899 294974 83705
14916 68621 256720 139531 349970 275788 522628 189249 227071 169610 362191 336293
14906 336293 85652 236575 278422 391165 501860 225415 672211 462777 481436 396231
14896 396231 785693 99122 233230 385190 273434 380326 416898 557443 292440 249372
14886 249372 499276 -156262 171847 305319 248826 241017 322882 526882 240116 383326
$$ packed form
14959F52913j97404d8703A42446g2898A67288E3703J61311J0405I9727K62391
14949C62118j00606J51873j05002A43596a4234C52692G029L58101r7457K1539
14939B89212A28811K69O5283K4149K74887j98573J94955B24959Q2501q17a54915
14927B49537l5238J34572L99286B78687j1609a2544C30593J09306j44925H3705
14916F8621J88099j17189K10439p4182K46840A89249L7822n7461J92581k5898
14906C36293H5652J50923M1847J12743J10695B25415M46796k09434J8659q5205
14896C96231L89462I9122J34108J51960j11756J06892L6572J40545k65003m3068
14886B49372K49904a56262A71847J33472n6493p809Q1865K04000B40116J43210
$$ plain form
14876 383326 454690 264831 118157 246009 244423 397179 261209 672192 503712 245818
14865 397196 267846 259763 441363 143007 564173 55447 733458 251948 234681 264711
14855 264711 290629 545393 467743 397605 339266 289078 408239 257755 227070 181122 343452
14844 343452 614776 441324 320658 399668 480135 322428 356003 146862 531895 333358
14834 333358 353732 575147 533030 513057 429844 -51604 401321 677862 560569 498397 622171
14823 622171 620651 218336 369583 555918 651046 523178 356470 255544 674304 377514
14813 377514 555009 450923 525914 608735 346010 425926 241048 304109 563789 395649
14803 395649 719673 247801 242526 642116 466161 483101 561854 487754 558370 689977 408806
$$ packed form
14876C83326P1364j89859A18157J27852j586J52756j35970M10983j68480B45818
14865C97196j29350q083J81600A43007M21166E5447O78011B51948j7267L0030
14855B64711K5918K54764p7650p0138n8339n0188J19161j50484l0685m5948J62330
14844C43452K71324j73452j20666P9010Q0467j57707L3575A46862L85033j98537
14834C33358K0374K21415m2117j9973q3213e1604D01321K76541j17293o2172J23774
14823F22171j520B18336J51247J86335R5128j27868j66708j00926M18760k96790
14813C77514J77495j04086P4991Q2821k62725P9916j84878O3061K59680j68140
14803C95649L24024B47801n275L99590j75955J6940P8753p4100P0616J31607k81171
$$ plain form
14792 408806 735283 496874 174747 280652 632490 598731 576262 427353 543211 627225
14782 627225 579307 72546 867733 460450 505175 500826 496275 647222 556652 623719 728871
14771 728871 480707 518071 447806 868098 544960 699024 670822 579699 498273 422791 813468
14760 813468 766710 710311 1002378 529006 543199 549541 847901 648080 763798 714069 857368
14749 857368 736605 700830 663964 270400 464174 434565 271049 913998 733437 707571
14739 707571 894496 702333 779752 471429 756728 853459 729695 805655 647745 744275
14729 744275 670549 669640 490926 1008498 788627 827566 772791 686418 743565 717766 755795
14718 755795 641759 843258 610273 916377 677359 733931 845498 571894 897405 671738
$$ packed form
14792D08806L26477k38409A74747J05905L51838l3759k2469j48909J15858Q4014
14782F27225m7918G2546P95187m07283M4725m349m551J50947r0570O7067J05152
14771G28871k48164L7364p0265M20292l23138J54064k8202r1123q1426p5482L90677
14760H13468m6758n6399K92067m73372J4193O342K98360j99821J15718m9729J43299
14749H57368j20763l5775l6866B70400J93774k9609j63516O42949j80561k5866
14739G07571J86925j92163P7419l08323K85299R6731j23764P5960j57910R6530
14729G44275p3726r09j78714N17572k19871L8939n4775q6373N7147k5799L8029
14718G55795j14036K01499k32985L06104k39018N6572J11567k73604L25511k25667
$$ plain form
14708 671738 781751 626003 1044260 867085 669227 910526 780363 1076729 898858 648000
14698 648000 657632 820172 708056 920900 863701 940641 936321 983887 1121193 938576 771683
14687 771683 879140 1076762 918308 1283531 739415 1074949 1164237 901144 1213766 1010142
14677 1010142 1094122 972723 959961 1480046 910299 983948 902989 971213 1384766 1032790
14667 1032790 881778 1062098 766119 996405 1112607 1179438 1137659 984240 1339146 939876
14657 939876 1142534 1226541 1363104 1178331 1285673 1071367 936730 1236251 953437 1235498
14647 1235498 1236103 1173740 890595 1071502 1140750 1249728 1618717 1215507 1222406 1126985 1486980
14636 1486980 1230407 1354987 722634 1478112 1867625 1565060 1354227 1403124 1519301 1408719
$$ packed form
14708F71738J10013j55748M18257j77175j97858K41299j30163K96366j77871k50858
14698F48000R632J62540j12116K12844n7199P6940m320M7566J37306j82617j66893
14687G71683J07457J97622j58454L65223n44116L35534Q9288k63093L12622k03624
14677A010142Q3980j21399j2762N20085n69747P3649q0959O8224M13553l51976
14667A032790j51012J80320k95979K30286J16202O6831m1779j53419L54906l99270
14657I39876K02658Q4007J36563j84773J07342k14306j34637K99521k82814K82061
14647A235498O05o2363k83145J80907O9248J08978L68989m03210O899r5421L59995
14636A486980k56573J24580o32353P55478L89513l02565k10833M8897J16177j10582
$$ plain form
14626 1408719 1275250 1367814 1268160 1461629 1291086 1191172 1284065 1419597 1781018 1393446
14616 1393446 1270190 1507285 1526953 1638587 1503855 1489871 1810882 1538030 1281847 1593278
14606 1593278 1783183 1930537 1636341 1666493 1668566 1495016 1555146 1619296 1557153 1539247 1750166
14595 1750166 1889352 1689351 1426898 1688828 1787342 1705506 2058915 1899521 2225529 1696332
14585 1696332 1849392 1671236 1944260 2032956 2085679 1996874 1759758 2150705 1874329 2203536
14575 2203536 2188139 1901403 1858266 1984302 1989771 2330901 2014930 1950480 2230147 2232469 2241204
14564 2241204 2356078 2422116 2444787 2468663 2707446 2700311 2668560 2853917 3205255 3225078 3488241
14553 3488241 3840379 3741706 4182444 5744687 7972603 11681332 22534102 36390368
$$ packed form
14626A408719j33469R2564r9654J93469j70543r9914R2893J35532L61421l87572
14616A393446j23256K37095J9668J11634j34732j3984L21011k72852k56183L11431
14606A593278J89905J47354k94196L0152K073j73550O0130O4150o2143j7906K10919
14595A750166J39186k00001k62453K61930R8514q1836L53409j59394L26008n29197
14585A696332J53060j78156K73024Q8696N2723q8805k37116L90947k76376L29207
14575B203536j5397k86736m3137J26036N469L41130l15971o4450K79667K322Q735
14564B241204J14874O6038K2671K3876K38783p135l1751J85357L51338J9823K63163
14553C488241L52138r8673M40738J562243K227916L708729J0852770J3856266
$$ plain form
14545 36390368 38176881 24441122 12244985 6448810 3707003 2764504 2284457 2379765
14537 2379765 2211787 2117554 2114470 2223733 2216768 1882335 2435895 1862992 2168756 2186963
14527 2186963 2354411 2182953 2321848 2468507 2355980 2321846 2399186 2062149 2750337 2856726
14517 2856726 2414858 2620627 2602906 2598112 2567576 2531495 2835302 2994717 2987856 2722967 3246205
14506 3246205 2632293 2946324 2759043 3097709 3319704 3116625 3261482 3166911 3306509 3112060
14496 3112060 3387905 3240171 3095557 3470606 3459836 3497238 3685135 3458197 3447748 3608915
14486 3608915 3526831 3557158 3807916 3716844 3622313 3784911 3812284 3781323 3844370 3874261 3924589
14475 3924589 4002312 4020798 4298970 4511015 4127065 4591479 4289820 4387988 4107502 4479312
$$ packed form
14545C6390368J786513j3735759j2196137n796175k741807r42499m80047R5308
14537B379765j67978r4233l084J09263o965l34433N53560n72903L05764J8207
14527B186963J67448j71458J38895J46659j12527l4134P7340l37037O88188J06389
14517B856726m41868K05769j7721m794l0536l6081L03807J59415o861k64889N23238
14506C246205o13912L14031j87281L38666K21995k03079J44857r4571J39598j94449
14496C112060K75845j47734j44614L75049j0770L7402J87897k26938j0449J61167
14486C608915q2084L0327K50758r1072r4531J62598K7373l0961O3047K9891N0328
14475C924589P7723J8486K78172K12045l83950M64414l01659R8168k80486L71810
$$ plain form
14465 4479312 4838548 4532408 4670359 4614612 4763537 4518138 4987355 5111940 5143428 5103343
14455 5103343 5041873 5290258 5140449 5115230 5427164 5414878 5511012 5594784 5548224 6056606
14445 6056606 5692944 5786700 5796389 5683695 5750167 6317239 6266518 6431185 6598428 6785507
14435 6785507 6523780 6676457 7086105 6789962 6898175 7160125 7121501 7454108 7283166 7792981
14425 7792981 7767455 7547857 7726966 7771624 7843801 7656671 7941876 8103179 8232683 8238308
14415 8238308 8484592 8427891 8778643 9003041 9083208 9248343 9379959 9764866 9721677 9784616
14405 9784616 9961691 10107723 10334517 10390869 10660887 10680837 10913345 11124730 11191212 11570243
14395 11570243 11442176 11514588 11797285 12382617 12228094 12296023 12909364 13157780 13130334 13460995
$$ packed form
14465D479312L59236l06140J37951n5747J48925k45399M69217J24585L1488m0085
14455E103343o1470K48385j49809k5219L11934j2286R6134Q3772m6560N08382
14445F056606l63662R3756R689j12694O6472N67072n0721J64667J67243J87079
14435F785507k61727J52677M09648k96143J08213K61950l8624L32607j70942N09815
14425G792981k5526k19598J79109M4658P2177j87130K85205J61303J29504N625
14415H238308K46284n6701L50752K24398Q0167J65135J31616L84907m3189O2939
14405I784616J77075J46032K26794N6352K70018J9950K32508K11385O6482L79031
14395A1570243j28067P2412K82697N85332j54523O7929O13341K48416k7446L30661
$$ plain form
14385 13460995 13515200 13827916 14147162 14416205 14585243 14988606 15307476 15503321 15607006
14376 15607006 16095314 16386720 16873949 16857013 17284096 17547348 17983771 18174102 18595091
14367 18595091 19335201 19539915 19994181 20205464 20587272 21046300 21754681 22288377 22699036
14358 22699036 22876229 23794393 24303603 24647162 25073832 25640730 26425175 27008348 27704818
14349 27704818 28398858 28865644 29517421 30370579 31265930 31990430 32776899 33554542 34624038
14340 34624038 35467129 36590076 37176276 38535531 39396190 40402338 42250801 43321430
14332 43321430 44466881 45988006 47328353 48448134 50239712 51696675 53756247 55245400
14324 55245400 57239682 59011107 61003521 63196038 65212868 67916417 69883050 72465534
$$ packed form
14385A3460995N4205L12716L19246K69043J69038M03363L18870J95845J03685
14376A5607006M88308K91406M87229j6936M27083K63252M36423J90331M20989
14367A8595091P40110K04714M54266K11283L81808M59028P08381N33696M10659
14358B2699036J77193R18164N09210L43559M26670N66898P84445N83173O96470
14349B7704818O94040M66786O51777Q53158Q95351P24500P86469P77643J069496
14340C4624038Q43091J122947N86200J359255Q60659J006148J848463J070629
14332D3321430J145451J521125J340347J119781J791578J456963K059572J489153
14324E5245400J994282J771425J992414K192517K016830K703549J966633K582484
$$ plain form
14316 72465534 75284870 78012786 80880582 84297870 87568421 91134673 94743356 98525160
14308 98525160 102557545 107067012 111861801 116583700 121721995 127245225 132734717 139086008
14300 139086008 145458726 152334478 159385989 167176581 175190934 183989843 193310706 202910194
14292 202910194 213158896 223967217 235232240 247286283 259514418 272300134 285881596
14285 285881596 299801733 314152286 328645280 343384639 358088073 372422635 386836709
14278 386836709 400569535 413053590 424537749 434706515 442566071 447822925 449881962
14271 449881962 448446945 444407453 444197782 443860967 439613115 433619259 427478910 419553791
14263 419553791 409678322 398477973 386245368 373109998 358380702 343515275 328437651
$$ packed form
14316G2465534K819336K727916K867796L417288L270551L566252L608683L781804
14308I8525160M032385M509467M794789M721899N138295N523230N489492O351291
14300A39086008O372718O875752P051511P790592Q014353Q798909R320863R599488
14292B02910194J0248702J0808321J1265023J2054043J2228135J2785716J3581462
14285B85881596J3920137J4350553J4492994J4739359J4703434J4334562J4414074
14278C86836709J3732826J2484055J1484159J0168766P859556N256854K059037
14271D49881962j435017m039492k09671l36815m247852n993856o140349p925119
14263D19553791r875469j1200349j2232605j3135370j4729296j4865427j5077624
$$ plain form
14256 328437651 313570855 298944944 285211233 271785963 258677196 246230104 233872944
14249 233872944 222506196 211835544 201158675 191278240 182368296 174076547 166156230
14242 166156230 157858776 150818633 143967324 137371933 131333412 125670570 120471884 115008990
14234 115008990 110510002 105536949 101487746 97464246 93604291 89979752 86268945 83052524
14226 83052524 79856581 76695432 74462521 71548160 69158710 66394112 64235084 62328439
14218 62328439 60059989 57865170 56205128 54183625 53120309 51534874 49793778 48103932
14210 48103932 46570461 45387296 44270699 43465661 42388793 40791127 39427341 38506815
14202 38506815 37440341 36539429 35827433 34643443 33752641 32526815 31623896 31071805 30833716
$$ packed form
14256C28437651j4866796j4625911j3733711j3425270j3108767j2447092j2357160
14249B33872944j1366748j0670652j0676869r880435q909944q291749p920317
14242A66156230q297454p040143o851309o595391o038521n662842n198686n462894
14234A15008990m498988m973053m049203m023500l859955l624539l710807l216421
14226H3052524l195943l161149k232911k914361k389450k764598k159028j906645
14218F2328439k268450k194819j660042k021503j063316j585435j741096j689846
14210D8103932j533471j183165j116597q05038j076868j597666j363786r20526
14202C8506815j066474r00912p11996j183990q90802j225826r02919n52091k38089
$$ plain form
14193 30833716 29768197 29195976 28180718 27724400 26694167 26276956 25534950 25040919 24370066
14184 24370066 24200638 23356107 22663517 22293091 22223949 21148910 21076312 20692582 19925790
14175 19925790 19359989 19185861 18748307 18113395 18131804 17706682 17556033 16898078 16916063 16563156
14165 16563156 16332485 15732473 15801785 15508198 14959732 14752527 14634870 14348662 14191751
14156 14191751 14105896 13481092 13397726 13118498 13046281 13018106 12219441 12432112 12206320 11964336
14146 11964336 11987469 11291216 11320828 11131810 11067543 11104814 10650539 10523136 10683361 10395589
14136 10395589 10215080 9873990 9684592 9758085 9276009 9364293 9070489 9137876 8737976 8948326
14126 8948326 8609058 8202361 8551141 8134173 8033438 8344475 7719363 8063487 7521944
$$ packed form
14193C0833716j065519n72221j015258m56318j030233m17211p42006m94031o70853
14184B4370066j69428q44531o92590l70426o9142j075039p2598l83730p66792
14175A9925790n65801j74128m37554o34912J8409m25122j50649o57955J7985l52907
14165A6563156k30671o00012O9312k93587n48466k07205j17657k86208j56911
14156A4191751q5855o24804q3366k79228p2217k8175p98665K12671k25792k41984
14146A1964336K3133o96253K9612j89018o4267L7271m54275j27403J60225k87772
14136A0395589j80509l41090j89398P3493m82076Q8284k93804O7387l99900K10350
14126H948326l39268m06697L48780m16968j00735L11037o25112L44124n41543
$$ plain form
14117 7521944 7539848 8041349 7221222 7194905 7212746 7118549 7136119 6952259 6830320 6677055
14107 6677055 6928479 6949208 6479049 6508760 6302169 6425116 6348627 6199000 6248567 6118240
14097 6118240 5937333 6132842 6036285 5531164 5905840 5599768 5606301 5771279 5448132 5169595
14087 5169595 5191675 5195260 5135027 5132391 5009274 5076692 5265774 4925050 5027107 4895001 4779724
14076 4779724 4856108 4804590 4195954 4701395 4370949 4604599 4452776 4363012 4342901 4107202
14066 4107202 4613502 4289403 4456991 4313467 3988280 4211345 4152276 4271805 4128891 4219072
14056 4219072 4146479 4093690 3711927 3773646 4049136 3688830 3910798 3765346 3496645 3749293
14046 3749293 3496667 3839442 3631965 3279499 3791882 3347881 2844224 3527887 3350260
$$ packed form
14117G521944J7904N01501q20127k6317J7841r4197J7570j83860j21939j53265
14107F677055K51424K0729m70159K9711k06591J22947p6489j49627M9567j30327
14097F118240j80907J95509r6557n05121L74676l06072O533J64978l23147k78537
14087E169595K2080L585o0233k636j23117O7418J89082l40724J02057j32106j15277
14076D779724P6384n1518o08636N05441l30446K33650j51823q9764k0111k35699
14066D107202N06300l24099J67588j43524l25187K23065n9069J19529j42914R0181
14056D219072p2593n2789l81763O1719K75490l60306K21968j45452k68701K52648
14046C749293k52626L42775k07477l52466N12383m44001n03657O83663j77627
$$ plain form
14037 3350260 3417181 3412812 3034651 3508141 3124002 3254412 3039442 3058567 2851155 3005307
14027 3005307 2955929 3125270 3015337 2960571 2829685 2384272 2936589 2964642 2608140 2705284
14017 2705284 3161426 2885489 2911927 2617649 2339518 2782483 2575739 2338966 2851859 2166248
14007 2166248 2481362 2379049 2104081 2508645 2452750 2170124 2102449 2135278 2593811 2249601
13997 2249601 2060226 1898833 1988851 2228296 1846836 2205527 2493311 2751687 3871094
13988 3871094 6858013 15655969 31785366 38489979 28032717 15631629 9740740 6893650
13980 6893650 5810420 4579630 4037511 3617379 3402265 3149582 2737918 2927485 2839992
13971 2839992 2868612 2869004 2729195 2379275 2392067 2633620 2262738 2564306 2498991 2213134
$$ packed form
14037C350260O6921m369l78161M73490l84139J30410k14970J9125k07412J54152
14027C005307m9378J69341j09933n4766j30886m45413N52317K8053l56502R7144
14017B705284M56142k75937K6438k94278k78131M42965k06744k36773N12893o85611
14007B166248L15114j02313k74968M04564n5895k82626o7675L2829M58533l44210
13997B249601j89375j61393R0018K39445l81460L58691K87784K58376J119407
13988C871094K986919Q797956J6129397O704613j0457262j2401088n890889k847090
13980F893650j083230j230790n42119m20132k15114k52683m11664J89567q7493
13971B839992K8620L92j39809l49920J2792K41553l70882L01568o5315k85857
$$ plain form
13961 2213134 2252598 2422911 2052429 2095551 1780715 1951820 1936230 1732587 2232910 2156488
13951 2156488 2048128 2148058 1890080 1924611 2107989 1976604 1916134 1979048 1796175 2121986
13941 2121986 2078358 1798051 1778007 1544309 2134983 1956641 1585701 1770014 1700581 1801305
13931 1801305 1880828 1548530 1529192 1496792 1471496 1576318 1303307 1518229 1380752 1512590
13921 1512590 1602365 1492029 1639350 1668468 1449793 1405382 1616001 1573019 1543977 1403599
13911 1403599 1513648 1514635 1793391 1538692 1678327 1424420 1722248 1745723 1616076 1553745
13901 1553745 1188429 1392779 1701989 1578796 1375484 1594758 1238145 1245076 1173592 1345498
13891 1345498 1151257 1554945 1356863 1139752 1484070 1413288 1420023 1152876 1265986 1481295
$$ packed form
13961B213134L9464J70313l70482M3122l14836J71105j5590k03643N00323p6422
13951B156488j08360R9930k57978L4531J83378j31385o0470O2914j82873L25811
13941B121986m3628k80307k0044k33698N90674j78342l70940J84313o9433J00724
13931A801305P9523l32298j9338l2400k5296J04822k73011K14922j37477J31838
13921A512590Q9775j10336J47321K9118k18675m4411K10619m2982k9042j40378
13911A403599J10049R87K78756k54699J39635k53907K97828K3475j29647o2331
13901A553745l65316K04350L09210j23193k03312K19274l56613O931p1484J71906
13891A345498j94241M03688j98082k17111L44318p0782O735k67147J13110K15309
$$ plain form
13881 1481295 1401004 869267 1151561 1397870 1199527 996831 1424438 1109622 1047176 969995
13871 969995 1346640 1034512 1328033 1368346 1180941 1067161 1123372 1099597 1199866 1261887
13861 1261887 1368190 1179802 906690 1233249 1275140 1235935 1154822 1439849 1250632 946492
13851 946492 1151930 971426 1232726 874333 1024959 921225 844581 1006430 879665 1245032
13841 1245032 1035970 981007 883861 816976 933768 879725 1001881 1133952 817764 1025962
13831 1025962 894973 919304 1170948 1072330 864263 1091036 927228 888648 1035272 600115
13821 600115 917111 976734 823645 677628 876495 791456 924554 983948 1121319 783525
13811 783525 1079359 984787 856282 884363 1188879 766641 994018 1044248 940477 881004
$$ packed form
13881A481295q0291n31737K82294K46309j98343k02696M27607l14816o2446p7181
13871I69995L76645l12128K93521M0313j87405j13780N6211k3775J00269O2021
13861A261887J06303j88388k73112L26559M1891l9205q1113K85027j89217l04140
13851I46492K05438j80504K61300l58393J50626j03734p6644J61849j26765L65367
13841A245032k09062n4963r7146o6885J16792n4043J22156J32071l16188K08198
13831A025962j30989K4331K51644r8618k08067K26773j63808l8580J46624m35157
13821F00115L16996N9623j53089j46017J98867q5039J33098N9394J37371l37794
13811G83525K95834r4572j28505K8081L04516m22238K27377N0230j03771n9473
$$ plain form
13801 881004 739608 621768 774677 917425 753638 907870 677632 797245 800560 1196112
13791 1196112 771897 874804 1024014 773423 602526 900480 556847 796682 601426
13782 601426 834162 513474 751000 577084 673088 662502 833624 696615 889853 760285
13772 760285 643340 969730 547425 566592 970042 847116 542265 710200 703209 426005
13762 426005 807105 672783 337717 654469 777761 826432 593365 733088 747442 633003
13752 633003 584167 684147 611419 768358 520541 706744 735551 689240 919353 589326
13742 589326 564340 781961 582892 1044274 720916 526060 366835 605568 587598 501045
13732 501045 616474 803392 296371 842464 610829 751577 301799 957957 311056 573499
$$ packed form
13801H81004j41396j17840J52909J42748j63787J54232k30238J19613L315L95552
13791A196112m24215J02907J49210k50591j70897K97954l43633K39835j95256
13782F01426K32736l20688K37526j73916R6004j0586J71122j37009J93238j29568
13772G60285j16945L26390m22305J9167M03450j22926l04851J67935o991k77204
13762D26005L81100j34322l35066L16752J23292M8671k33067J39723J4354j14439
13752F33003m8836R9980p2728J56939k47817J86203K8807m6311K30113l30027
13742E89326k4986K17621j99069M61382l23358j94856j59225K38733j7970q6553
13732E01045J15429J86918B96371N46093k31635J40748C01799O56158C11056K62443
$$ plain form
13722 573499 425765 456991 500733 571439 520101 446398 517661 705760 1021503 465003 745450
13711 745450 660491 479597 920346 709782 684764 639444 414540 621001 631176 622512 413724
13700 413724 497169 491633 813981 591500 671047 660449 446282 529749 727885 417615 475294
13689 475294 465277 723462 572732 598032 271192 664817 581090 619375 380181 426227
13679 426227 677207 240003 577633 609880 309141 522009 716528 371638 518526 446371
13669 446371 413952 319805 186559 555688 566965 402590 378414 573173 322370 423712
13659 423712 535310 562887 613495 482642 570994 307089 347390 535243 216585 610242
13649 610242 341374 628264 370722 262609 333021 588284 542652 230157 170234 644840
$$ packed form
13722E73499j47734L1226M3742P0706n1338p3703P1263J88099L15743D65003K80447
13711G45450q4959j80894M40749k10564k5018m5320k24904K06461J0175q664k08788
13700D13724Q3445n536L22348k22481P9547j0598k14167Q3467J98136l10270N7679
13689D75294j0017K58185j50730K5300B71192L93625q3727L8285k39194M6046
13679D26227K50980B40003L37630L2247l00739K12868J94519l44890J46888p2155
13669D46371l2419r4147j33246L69129J1277j64375k4176J94759k50803J01342
13659D23712J11598K7577N0608j30853Q8352k63905M0301J87853B16585L93657
13649F10242k68868K86890k57542j08113P0412K55263m5632B30157n9923M74606
$$ plain form
13639 644840 555428 491665 501093 523902 487009 204931 306053 698057 324563 461923 557279
13628 557279 255836 756244 460040 487367 356102 507952 378916 631761 326286 835791
13618 835791 598043 779322 439548 716176 698156 631298 45696 325320 427493 267871
13608 267871 97667 560771 172854 565311 617467 265675 384228 -36292 494891 93306
13597 207320 597687 357751 521518 524472 158742 118665 517172 247088 394606 313242
13587 313242 100503 535998 139485 284827 605686 242917 77697 232559 358904 313000
13577 313000 381457 608873 427002 222768 878190 281856 373183 266874 248258 312839
13567 312839 522375 309285 98187 362242 -86531 293725 25672 468960 326560 585030
$$ packed form
13639F44840q9412o3763R428K2809l6893B04931J01122L92004C24563J37360R5356
13628E57279B55836N00408k96204K7327j31265J51850j29036K52845l05475N09505
13618H35791k37748J81279l39774K76628j8020o6858D5696K79624J02173j59622
13608B67871I7667M63104A72854L92457N2156B65675J18553c6292D94891I3306
13597B07320L90367k39936J63767K954A58742m0077L98507B47088J47518q1364
13587C13242A00503M35495A39485J45342L20859B42917G7697J54862J26345m5904
13577C13000O8457K27416j81871k04234O55422B81856R1327j06309j8616O4581
13567C12839K09536k13090I8187K64055h6531B93725B5672M43288j42400K58470
$$ plain form
13557 585030 548873 316568 487391 501313 519810 43382 474861 302391 23793 275674
13547 275674 255903 336987 212762 505386 370437 357046 493748 426914 272856 163168
13537 163168 351902 339064 629206 182605 381164 -59493 100914 241326 290692 441052
13527 441052 343996 205064 517557 -103519 245751 516446 -64515 263764 543984 188135
13516 -88048 178925 254174 -225678 311217 639931 391397 390592 146271 242955 144113 550181
13505 550181 438366 619060 -27651 430149 513535 77420 56618 450129 139185 175182
13495 175182 45228 27065 187364 508100 -170008 409266 637532 135623 197060 692520
13485 692520 396826 236493 167463 486944 323005 89816 186550 555366 311990 213176
$$ packed form
13557E85030l6157k32305J70823J3922J8497D3382M31479j72470B3793K51881
13547B75674j9771Q1084j24225K92624j34949j3391J36702o6834j54058j09688
13537A63168J88734j2838K90142A82605J98559e9493A00914J40412M9366J50360
13527D41052r7056j38932L12493a03519B45751K70695f4515B63764K80220A88135
13516h8048A78925P5249b25678C11217L28714k48534q05A46271R6684r8842M06068
13505E50181j11815J80694b7651D30149Q3386G7420k0802L93511A39185L5997
13495A75182D5228j8163J60299L20736a70008D09266K28266A35623O1437M95460
13485F92520k95694j60333o9030L19481j63939H9816R6734L68816k43376r8814
$$ plain form
13475 213176 394111 303242 333479 442340 476084 141159 423522 616876 -37716 385767
13464 238664 155656 -92646 40018 304233 224357 -193810 165487 375015 135051 -10303
13453 208308 111760 455480 309849 594955 184769 103455 284975 60129 199902 290566
13443 290566 303980 46149 464277 -109927 -64637 102131 279316 78664 200311 254028
13433 254028 568221 429279 56196 509819 207335 33178 252016 -299226 463554 47366
13422 221230 377481 427078 547172 370846 -36567 77240 141104 -100680 113119 168388
13412 168388 74425 123149 79752 124427 110516 17712 62813 123276 102683 -19265 305137
13400 122228 375590 406654 -68649 239511 203715 15740 142638 141181 145029 442048 456630
$$ packed form
13475B13176J80935r0869L0237J08861L3744A41159K82363J93354c7716C85767
13464B38664q3008i2646D0018K64215p9876a93810A65487K09528A35051a0303
13453B08308r6548L43720j45631K85106A84769q1314J81520F0129J39773R0664
13443B90566J3414D6149M18128a09927M5290A02131J77185G8664J21647N3717
13433B54028L14193j38942E6196M53623B07335C3178K18838b99226D63554D7366
13422B21230J56251M9597J20094j76326c6567G7240O3864a00680A13119N5269
13412A68388G4425M8724m3397M4675j3911A7712M5101O0463k0593a9265C05137
13400A22228K53362L1064f8649B39511l5796A5740J26898j457L848K97019J4582
$$ plain form
13389 456630 301502 44310 -41586 190861 580327 157781 183378 -158080 164722 278985
13379 278985 85293 176795 246374 -153902 315969 49666 -65860 343430 335184 107085 -115697
13367 179883 276332 298447 254625 206380 481000 114800 598788 274171 319754 383456 157670
13355 267098 33224 159700 176161 85963 213709 145059 305388 345190 406774 122017 271806
13344 271806 469363 646102 221118 563022 364785 176323 52993 22506 87246 369441
13334 369441 328230 508173 135124 240568 224024 260104 -14348 81014 123418 528802 45330
13322 462845 220330 111186 295525 -41722 149947 473453 153614 -39001 135638 82829
13312 82829 154136 236806 17285 258615 387769 175456 -177177 200096 653507 310106
$$ packed form
13389D56630j55128D4310d1586A90861L89466A57781K5597a58080A64722J14263
13379B78985H5293R1502O9579a53902C15969D9666f5860C43430q246A07085a15697
13367A79883R6449K2115m3822m8245K74620A14800M83988B74171M5583O3702A57670
13355B67098C3224J26476J6461H5963J27746o8650J60329L9802O1584A22017J49789
13344B71806J97557J76739B21118L41904j98237A76323E2993B2506O4740K82195
13334C69441m1211J79943A35124J05444j6544L6080a4348H1014M2404M05384D5330
13322D62845B20330j09144J84339d1722A49947L23506A53614c9001A35638n2809
13312H2829P1307Q2670A7285K41330J29154A75456a77177B00096M53411C10106
$$ plain form
13301 317930 74764 105805 -129113 239878 183251 107350 352676 127583 182212 122295 148439
13290 148439 -208207 -65984 19193 -207830 155494 270866 390583 334716 108219 84946
13280 84946 112818 62582 29973 70633 125465 214744 229140 124729 -101049 359415 284143
13269 284143 37607 9591 58605 113033 264250 179234 36312 185127 378462 332797 56855
13257 355640 99275 189012 119365 124368 -32026 75851 228529 566018 -83500 33449 92828
13246 92828 191846 295133 37191 26269 -46616 -138649 121295 -85606 325122 399151 -1948
13234 249520 419883 62502 239087 223090 240585 229810 296864 1514 109759 43840 -1118
13222 -80192 -108695 296890 186220 390678 16122 -13511 37444 58578 110021 189802 34580
$$ packed form
13301C17930G4764L1041a29113B39878n6627p5901K45326A27583N4629n9917K6144
13290A48439b08207f5984A9193b07830A55494J15372J19717n5867A08219k3273
13280H4946K7872n0236B9973M0660N4832Q9279J4396j04411a01049C59415p5272
13269B84143C7607I591M9014N4428J51217q5016C6312J48815J93335m5665E6855
13257C55640I9275Q9737o9647N003c2026G5851J52678L37489h3500C3449N9379
13246I2828R9018J03287C7191j0922d6616r2033A21295h5606C25122P4029a948
13234B49520J70363F2502J76585j5997J7495j0775O7054A514J08245D3840a118
13222h0192k8503B96890j10670K04458A6122a3511C7444K1134N1443P9781C4580
$$ plain form
13210 30292 362888 262475 89177 155291 274839 503805 162960 195134 -281843 -64252
13199 -129214 111161 -90192 178612 -118490 -150998 -96481 87668 -12261 95546 -25054 144798
13187 -201855 157548 244119 304038 184925 204312 12007 81842 80087 436844 -107214 86694
13175 -25741 84370 -108596 -117856 38126 263151 -132212 81856 480104 -70424 146044 129241
13164 129241 323030 -13876 159842 -25630 55719 266474 436703 90690 -83827 256410
13153 179308 71952 -16937 211240 65559 58438 20912 340765 40270 -66658 -66295 -1192 358533
13140 -297725 52971 -275906 32458 -8169 180450 -132739 78991 171657 43738 91767 166912
13129 166912 -267572 -3131 -182918 197563 158539 84176 159724 335532 251553 157775 377561
$$ packed form
13210C0292L32596j00413H9177O6114J19548K28966A62960L2174b81843f4252
13199a29214A11161i0192A78612a18490l2508N4517H7668a2261I5546b5054A44798
13187b01855A57548Q6571N9919j19113J9387A2007O9835j755L56757a07214H6694
13175b5741H4370a08596r260C8126K25025a32212H1856L98248g0424A46044j6803
13164A29241J93789a3876A59842b5630E5719K10755J70229I0690h3827B56410
13153A79308G1952a6937B11240F5559p121B0912L19853D0270f6658L63a192C58533
13140b97725E2971b75906C2458h169A80450a32739G8991R2666D3738M8029P5145
13129A66912b67572c131j79787A97563l9024p4363P5548J75808q3979r3778K19786
$$ plain form
13118 377561 159729 66358 68210 40415 -31647 -18677 63836 290118 157014 145190 -52262
13106 -140779 346904 134213 192735 5602 75471 -207676 116313 228728 -91123 157479
13095 -38258 303787 10374 -43599 108728 42235 -189450 83522 -348452 -80792 -87372 235289
13083 59772 -1598 259993 210983 182401 -175983 -196121 286449 -43925 187598 26900 -39624
13071 17070 192250 182859 478283 453315 48676 52477 48096 143866 557798 -9045 194331 -436160
13058 -57559 126641 39196 214848 215496 231977 239665 104640 45472 45753 50608 127875 109567
13046 109567 -2654 141719 32941 144390 -132078 -36113 129062 264883 171799 330435
13036 330435 -69913 -248639 463794 122041 300280 230374 220546 -27929 438916 157276
$$ packed form
13118C77561A59729F6358J852k7795c1647J2970F3836K26282j33104j1824e2262
13106a40779C46904A34213N8522E602O9869b07676A16313J12415i1123A57479
13095c8258C03787A0374d3599A08728D2235a89450H3522c48452h0792o580B35289
13083E9772a598B59993m9010k8582a75983k0138B86449d3925A87598B6900c9624
13071A7070J75180r391K95424k4968D8676L801m381R5770M13932i045A94331d36160
13058e7559A26641C9196J75652O48J6481P688A04640D5472K81M855P7267j8308
13046A09567b654A41719C2941J11449a32078c6113A29062J35821r3084J58636
13036C30435f9913j78726D63794A22041J78239o9906r828b7929D38916A57276
$$ plain form
13025 99851 306407 -99209 218382 170697 82830 -64883 308002 115956 133627 182674 62515
13013 173212 -119247 165803 194405 -66629 106429 168335 224365 489459 152685 379308
13003 379308 118448 168546 -169932 -7404 12153 133414 -91634 64547 213220 -193700 -75362
12991 28517 219285 284147 198895 -351869 -79320 -191222 47348 -106341 -197935 297110 228285
12980 228285 -140066 56646 67426 -25684 182642 290264 136732 374565 279488 11598
12969 -379964 168967 148757 552038 166282 103132 97457 44823 224889 -86859 -243191 146072
12957 262296 30680 345084 165873 540984 100482 106523 262874 49140 42555 127333 106300
12946 106300 -170785 37141 156212 281131 -43971 -140698 79136 15121 63857 135413 64675
$$ packed form
13025I9851K06556i9209B18382m7685H2830f4883C08002A15956J7671M9047F2515
13013A73212a19247A65803K8602f6629A06429O1906N6030K65094A52685K26623
13003C79308A18448N0098a69932g404A2153J21261i1634F4547J48673a93700g5362
12991B8517J90768O4862q5252c51869g9320j11902D7348a06341r1594B97110o8825
12980B28285a40066E6646J0780b5684A82642J07622A36732K37833r5077A1598
12969c79964A68967k0210M03281A66282o3150n675D4823J80066h6859j56332A46072
12957B62296C0680L14404A65873L75111A00482O041J56351D9140o585Q4778k1033
12946A06300a70785C7141J19071J24919d3971r6727G9136A5121M8736P1556F4675
$$ plain form
12934 81145 480313 -144909 -30313 -173836 380602 99133 -56581 -116862 176635 546 -109018
12922 259588 -7173 37599 -93196 176503 24098 258715 143731 11888 -124041 -16913 229506
12910 -139386 133857 73228 157475 -205014 120197 304010 45335 26779 269080 323972
12900 323972 346444 108126 -175604 -9519 267387 199727 303527 -3379 308752 208863 234780
12889 234780 225988 417729 304656 -9945 254192 26488 57498 -47540 65188 -27405 -129414
12878 -129414 -64210 37556 -121380 -325804 173603 265075 276088 257217 48275 288148 166594
12867 166594 -36302 -66172 -11327 -6516 -381174 32214 74977 218895 310751 -134514 46165
12855 31476 -7298 -48581 -108029 48331 -11502 -181048 87660 83736 38274 -16362 4104 135999
$$ packed form
12934H1145L99168a44909c0313j43523C80602I9133e6581o0281A76635E46a09018
12922B59588g173C7599i3196A76503B4098K34617j14984A1888a24041a6913B29506
12910a39386A33857o0629Q4247b05014A20197J83813D5335j8556K42301N4892
12900C23972K2472A08126a75604i519B67387o7660J03800c379C08752r9889K5917
12889B34780q792J91741j13073i945B54192B6488L1010d7540F5188b7405j02009
12878a29414f4210C7556a21380k04424A73603R1472J1013j8871D8275K39873j21554
12867A66594c6302k9870a1327M811l74658C2214M2763J43918R1856a34514D6165
12855C1476g298m1283n9448D8331a1502j69546H7660l924C8274a6362D104J31895
$$ plain form
12843 135999 -43020 -252630 230682 130350 -95466 222300 -114037 142239 45248 209146
12833 209146 79948 209400 -230743 91695 9835 -15156 71814 -119981 305885 228885 142064
12822 142064 -261039 -153377 23827 343498 -106136 -173057 -154166 -235577 -44878 -147531
12812 -147531 -109133 142095 -8262 -14452 2821 97210 286399 127099 157583 -103148 -145348
12801 -145348 159181 287902 9365 -101847 23141 356236 -15425 -74862 143392 200964 117923
12790 117923 145494 135157 158837 32034 171249 61943 -257633 117947 31942 21569 -287001
12778 79121 -34073 -71048 -4649 30943 -311464 -40600 78807 -87871 -80852 18108 -252409 -99969
12765 157761 112853 138344 6818 6395 -113281 77728 -227102 -103075 330639 -313116 144574
$$ packed form
12843A35999d3020k09610B30682j00332i5466B22300a14037A42239D5248J63898
12833B09146G9948J29452b30743I1695I835a5156G1814a19981C05885p7000q6821
12822A42064b61039J07662B3827L19671a06136o6921J8891q1411d4878j02653
12812a47531L8398A42095h262o190B821R4389J89189A27099L0484a03148m2200
12801a45348A59181J28721I365a01847B3141L33095a5425n9437A43392N7572q3041
12790A17923K7571j0337K3680C2034J39215F1943b57633A17947C1942j0373b87001
12778G9121c4073l6975d649C0943c11464d0600G8807h7871P019A8108b52409i9969
12765A57761m4908K5491F818m23a13281G7728b27102a03075C30639c13116A44574
$$ plain form
12753 49954 59025 47829 282220 -95516 -96601 -78711 -15940 -43261 -107580 -252521 438150
12741 -86582 126767 355523 532812 571541 114546 -265773 164439 36735 65436 -174649
12730 85921 15941 151118 -106080 -72870 150592 -289284 88236 -130207 -46351 57331 332828
12719 332828 -121027 246856 211209 -96707 160368 -47710 -187389 78006 218747 89212
12708 66857 244421 218495 -30898 157520 132892 9301 28298 256421 72231 -56782 52667
12696 233835 221559 -75563 8591 140791 133485 1126 42124 84821 164158 -249188 164838
12684 179798 -41524 36816 -94995 384259 57170 -144595 -99177 360295 153205 -31974 -48496
12673 -48496 161841 151497 -13059 96555 167119 -42703 88418 113877 -108403 86988 398390
$$ packed form
12753D9954R071j1196K34391i5516j085J7890a5940k7321o4319j44941D38150
12741h6582A26767K28756J77289L8729A14546b65773A64439C6735K8701a74649
12730H5921A5941J35177a06080L3210A50592b89284H8236a30207d6351E7331K75497
12719C32828a21027B46856l5647i6707A60368d7710j39679G8006J40741H9212
12708F6857J77564k5926c0898A57520k4628I301J8997K28123G2231e6782E2667
12696B33835j2276g5563H591J32200p306A126M0998M2697P9337b49188A64838
12684A79798d1524C6816i4995C84259E7170a44595M5418C60295A53205c1974j6522
12673d8496A61841j0344a3059I6555P0564d2703H8418K5459a08403H6988L11402
$$ plain form
12662 398390 147023 25775 -9094 300377 52511 -153597 -51088 -11110 40902 247167 268004
12651 268004 271559 -152880 98465 125845 -158514 -103071 59961 -96869 -152001 -2986 -95623
12640 -95623 140595 -1047 95311 376568 281064 182944 2477 -3282 352504 -193952 185417
12628 217202 119142 576427 414330 -59313 -5540 243904 193629 380267 330505 -23770 -33349
12617 -33349 348558 11206 42252 -153775 83100 260211 -53773 184060 -7286 334791 154618
12605 176009 170977 -107390 -139357 229529 39343 56531 254644 -38578 119965 19107 161768
12594 161768 284889 248295 382113 289000 -67487 61039 92222 -156422 -196298 -187305 90441
12582 -19638 123668 -2152 264085 157421 -120055 96519 -192506 -279166 -117275 150090
$$ packed form
12662C98390A47023B5775i094C00377E2511a53597e1088a1110D0902K06265K0837
12651B68004L555a52880I8465K7380a58514N5443E9961i6869n5132b986r2637
12640i5623A40595a047I5311K81257r5504r8120B477c282C52504a93952A85417
12628B17202r8060M57285j62097e9313e540B43904n0275J86638m9762b3770r579
12617c3349C48558A1206L1046a53775H3100J77111e3773A84060g286C34791A54618
12605A76009n032a07390l1967B29529C9343J7188J98113c8578A19965A9107J42661
12594A61768J23121l6594J33818r3113f7487F1039L1183a56422l9876Q993I0441
12582a9638A23668b152B64085j06664a20055I6519a92506q6660a17275A50090
$$ plain form
12571 -20402 177080 202659 18289 -60589 59887 470056 -276976 -227468 -155119 -331622 130412
12559 -211707 191694 -133838 -84330 159495 68738 -319906 168772 -45962 -161015 -174095
12549 -174095 200335 359409 255877 222635 -138645 -297340 -170736 -36643 194285 261382
12539 261382 311726 16663 -107713 104628 60559 -59564 142524 375949 -81642 107621
12528 -251190 24312 17551 64219 -177568 -92157 301055 141770 -61494 98327 -38327 291357
12516 97989 -49397 -349126 413186 1811 -91947 68904 159520 -26219 108333 52662 56818
12505 56818 -81549 170187 29548 151841 192569 401063 306075 231837 143694 38428 249266
12494 249266 -59351 157266 -69822 236869 -64612 264110 -223183 26641 101617 236268
$$ packed form
12571b0402A77080K5579A8289f0589E9887M10169b76976M9508P2349j76503A30412
12559b11707A91694a33838M9508A59495F8738c19906A68772d5962j15053j3080
12549a74095B00335J59074j03532l3242a38645j58695J26604c6643A94285O7097
12539B61382N0344A6663a07713A04628m4069e9564A42524K33425h1642A07621
12528b51190B4312o761M6668a77568Q5411C01055A41770f1494I8327c8327B91357
12516I7989d9397k99729D13186A811i1947F8904R0616b6219A08333E2662M156
12505E6818h1549A70187B9548J22293M0728K08494r4988p4238q8143C8428K10838
12494B49266e9351A57266f9822B36869f4612B64110b23183B6641P4976J34651
$$ plain form
12484 236268 51052 154478 -79683 -145678 -191035 -48597 153248 -65062 -152712 134458 -63954
12472 -20710 -274753 37636 171836 69730 -132475 130613 100754 160136 -225304 114420
12461 94323 47392 -20062 -122353 -168295 -131396 206710 -175875 202647 -229738 -36867 481496
12449 125567 207304 127599 126945 -39400 -165428 -5352 73021 -127200 -57244 -110939 -256510
12438 -256510 -54918 -62220 -81010 71686 -208575 -190765 -232611 91242 2185 161903 406738
12427 406738 243037 -103441 -38849 164974 2848 131086 160834 428221 -250647 162811
12416 -13986 -59287 60099 27169 -76963 154870 -216723 -73464 -415313 -75059 72153 -276619
12404 55119 -102418 223705 118621 190751 349304 -118367 -479151 55126 4817 73482 205752
$$ packed form
12484B36268E1052J03426g9683o5995m5357d8597A53248f5062q7650A34458f3954
12472b0710k54043C7636J34200F9730a32475A30613k9859N9382b25304A14420
12461I4323m6931b0062j02291m5942L6899B06710a75875B02647b29738c6867D81496
12449A25567Q1737p9705o54c9400j26028e352G3021a27200e7244n3695j45571
12438b56510e4918p302j8790G1686b08575J7810m1846I1242B185J59718K44835
12427D06738j63701a03441c8849A64974B848J28238K9748K67387b50647A62811
12416a3986m5301F0099B7169g6963A54870b16723g3464l41849g5059G2153b76619
12404E5119a02418B23705j05084P2130J58553a18367l60784E5126D817O8665J32270
$$ plain form
12393 205752 116819 8036 -181859 44064 41783 -169571 167272 -16790 19207 -176298 -55510
12381 116310 -186365 -303773 135732 49474 -111988 -89204 -88555 -193459 262350 -150811
12370 -14475 -29067 128540 21447 224966 137607 44661 24489 72308 75233 204897 -45953
12358 -35393 -213768 490005 241203 1085 173576 213120 147094 -272868 218050 56163 -362545
12346 -201413 -85113 149518 -168758 376691 -176269 -168249 -204461 147219 -115840 87908
12335 -302874 263484 -127755 2114 198830 141822 -114143 109707 -70740 1303 183176 -400717
12323 320629 53182 66907 51792 400092 135813 180408 -4549 98080 -155581 176566 99801
12312 99801 -59287 -128616 61347 -30354 -101120 -101893 8194 114306 12253 166626 179896 -5297
$$ packed form
12393B05752q8933H036a81859D4064k281a69571A67272a6790A9207a76298e5510
12381A16310a86365j17408A35732D9474a11988K2784O49j04904B62350a50811
12370a4475j4592A28540B1447K03519q7359D4661k0172M7819K925J29664d5953
12358c5393j78375D90005B41203A085J72491L9544o6026b72868B18050E6163c62545
12346b01413h5113A49518a68758C76691a76269Q020l6212A47219a15840H7908
12335c02874B63484a27755B114J96716n7008a14143A09707g0740A303J81873d00717
12323C20629E3182J3725j5115L48300A35813M4595d549I8080a55581A76566p6765
12312I9801e9287o9329F1347c0354p0766p73H194J06112A2253J54373J3270e297
$$ plain form
12299 207282 104214 -100669 192246 -56106 -82338 -4452 -243820 -141250 41429 189023
12289 189023 146187 120314 112183 -99485 52974 -64721 101438 -282895 310697 176038 367410
12278 367410 85014 -73173 430219 197321 490858 45420 535636 224023 38234 13621
12267 167638 -294286 -178311 -98394 271916 135496 44931 -250328 111292 202654 -82294
12256 324082 -18418 95721 52310 333716 -250485 -56126 106025 71580 74712 -148116 349565
12244 136287 335331 6739 182526 344081 261627 92441 76379 207914 -148335 -8496 508991
12232 307 75809 -211956 242389 249632 101278 73197 228424 91093 339049 131310 -56869
12220 252260 -70013 376943 262382 32791 -317872 239621 -34090 143224 160597 255704
$$ packed form
12299B07282j03068a00669A92246e6106k6232d452k39368J02570D1429J47594
12289A89023m2836k5873q131i9485E2974f4721A01438b82895C10697j34659J91372
12278C67410H5014g3173D30219A97321K93537D5420M90216B24023C8234A3621
12267A67638b94286J15975P9917B71916A35496D4931b50328A11292R1362h2294
12256C24082a8418I5721m3411K81406b50485e6126A06025l4445L132a48116C49565
12244A36287J99044F739J75787J61555q2454I2441j6062J31535a48335h496E08991
12232C07P5502b11956B42389P243A01278k8081J55227I1093K47956A31310e6869
12220B52260g0013C76943j14561C2791c17872B39621c4090A43224J7373R5107
$$ plain form
12210 255704 -67179 85358 -77327 237085 440567 401774 265170 324562 261390 175116 570182
12199 570182 174028 84135 220899 31799 464882 122484 166696 23071 209124 -31279
12188 102800 -45725 146459 118151 166139 -265430 267480 -79948 41333 -106676 159383
12177 322593 50505 -62521 63905 364367 33610 439793 379830 33433 -91038 -54566 307704
12165 -115804 203531 34567 69568 357136 -255805 45471 114499 -16345 -66993 112842 261709
12154 261709 -22398 341248 33424 158030 257264 254912 291718 24104 66961 -192034 182545
12142 20937 148896 214136 -85964 -62551 28459 146159 -220945 991 -155693 -42018 248226
12130 473183 219296 268378 325743 27627 -108838 -137123 -139813 224914 80168 156978 -233985
$$ packed form
12210B55704f7179H5358g7327B37085K03482l8793j36604N9392o3172q6274L95066
12199E70182A74028H4135J36764C1799M33083A22484M4212B3071J86053c1279
12188A02800d5725A46459k8308M7988b65430B67480g9948D1333a06676A59383
12177C22593E0505f2521F3905L00462C3610M06183n9963C3433i1038L6472C07704
12165a15804B03531C4567L5001K87568b55805D5471O9028a6345n0648A12842J48867
12154B61709b2398C41248C3424J24606R9234k352L6806B4104M2857a92034A82545
12142B0937J27959O5240h5964K3413B8459J17700b20945I91a55693d2018B48226
12130D73183B19296M9082N7365B7627a08838k8285k690B24914H0168P6810b33985
$$ plain form
12118 9017 -188678 -268392 215812 -151725 -46601 344594 -126983 158917 30468 -7081 -396923
12107 -396923 68521 -263858 151017 -202151 73579 -152106 282697 -9510 200389 206406 -93201
12095 -68756 -154826 -29362 79993 88236 -52789 58239 -119577 -2090 201989 41982 3908 153714
12083 153714 -46968 -23102 163086 -114477 -26233 -44748 157384 254104 -171273 23164 33377
12072 33377 137409 77136 124417 -183493 200597 39522 -227293 -259879 454939 216277
12061 978144 1510873 1400590 574592 330056 -200741 26513 119529 42388 -48832 -112411
12051 -112411 -222379 -211791 -245161 49341 -118132 184853 268857 180003 15878 160322 -378923
12039 -37058 24166 43565 -98819 -41586 -75594 -266772 -275490 22945 303781 86067 21903
$$ packed form
12118I017a88678p9714B15812a51725d6601C44594a26983A58917C0468g081l89842
12107c96923F8521b63858A51017b02151G3579a52106B82697i510B00389O017i3201
12095f8756q6070b9362G9993Q243e2789E8239a19577b090B01989D1982C908J49806
12083A53714d6968b3102A63086a14477b6233j8515A57384R6720a71273B3164J0213
12072C3377J04032o0273M7281a83493B00597C9522b27293l2586D54939B16277
12061I78144N32729j10283E74592k44536b00741B6513R3016D2388d8832o3579
12051a12411j09968J0588l3370D9341a18132A84853Q4004q8854A5878J44444c78923
12039c7058B4166J9399i8819d1586l4008j91178q718B2945K80836H6067B1903
$$ plain form
12027 88578 4086 288574 -11357 -62081 95261 88029 -1945 98789 30705 14617 -409326 146589
12014 -153928 -73622 154755 68699 215423 51281 -70641 -205233 118391 99633 -96608 -88335
12003 -88335 -159768 -259237 -1450 -363401 85372 -62544 -184429 -119292 -100685 85540 -7911 138157
11990 41976 88357 -150600 -280606 -53522 138939 -130059 -43340 -212490 -75136 -164360 -88309
11979 -88309 -1530 -234551 -133418 -222202 -84785 -63614 74357 -430341 -160161 -169659 -112172
11968 -112172 242305 -13391 18910 -56950 196636 68869 91701 271516 -58250 195661 62250
11956 254563 14848 -289876 112956 -85863 -41528 -143487 -74126 -94081 2514 -24108 27764
11944 321750 136246 -20585 279216 164081 51466 65436 -48733 -294308 104735 173363
$$ packed form
12027H8578D086K84488a1357n0724I5261p232a945I8789C0705A4617d09326A46589
12014a53928g3622A54755F8699J46724E1281g0641j34592A18391j8758i6608Q273
12003h8335p1433r9469a450l61951H5372f2544j21885O5137J8607H5540g911A38157
11990D1976M6381a50600j30006e3522A38939a30059d3340j69150g5136q9224P6051
11979h8309a530k33021J01133q8784h4785K1171G4357d30341a60161r498N7487
11968a12172B42305a3391A8910e6950A96636F8869K2832J79815e8250A95661F2250
11956B54563A4848b89876A12956h5863d1528j01959O9361j9955B514b4108B7764
11944C21750A36246b0585B79216j15135E1466J3970d8733k45575A04735O8628
$$ plain form
11934 173363 -85170 -68718 509983 -90583 27076 -83651 -29603 5368 318851 243655 -96704
11922 42654 77132 -245161 -214690 -90903 -197603 -28749 -167929 248437 106579 -2047 -41015
11911 -41015 -140272 193435 324919 -348453 178672 69114 17878 -284610 -40093 -89595 -48084
11900 -48084 -48561 94127 -148452 11988 85791 -33102 -40450 -211284 -179984 -88093 -264431 -156818
11888 -156818 217662 117029 -57898 414675 -199447 44160 174715 -165367 -33565 41470
11877 -170227 -152398 -147911 -90477 -265409 78843 158813 -156015 197590 -7299 39110 -161444
11865 -221932 61243 -293404 306695 -152653 -56082 -54963 117104 -70544 223900 -319690
11854 -215245 -179930 31079 -149283 -12435 -218580 32222 279012 -69453 -364934 -278665 -280548
$$ packed form
11934A73363h5170J6452E09983i0583B7076h3651b9603E368L13483p5196i6704
11922D2654L4478b45161L0471i0903j06700b8749j39180B48437A06579b047l8968
11911d1015r9257A93435J31484c48453A78672F9114A7878b84610d0093m9502M1511
11900d8084m77I4127a48452A1988P3803c3102p348j70834L1300h8093j76338J07613
11888a56818B17662j00633e7898D14675a99447D4160J30555a65367c3565D1470
11877a70227J7829M487N7434j74932G8843P9970a56015A97590g299C9110a61444
11865b21932F1243b93404C06695a52653e6082J119A17104g0544B23900c19690
11854b15245L5315C1079a49283a2435k06145C2222K46790f9453k95481Q6269j883
$$ plain form
11843 -280548 265889 215616 -81399 299914 -184102 -50867 -212004 -40233 -25018 156054
11832 -64712 -92334 24951 -142148 14821 12741 149264 143245 55325 -89403 -88897 -168990 -355004
11820 -355004 15216 -133776 -274531 47353 -20406 -46284 -255249 306808 218110 39618 -392534
11808 116249 -170703 42896 -68587 -151152 -99885 -162175 -263267 166844 149848 -30465 -201230
11797 -201230 346257 262958 -63533 269101 51165 99140 -222339 -126884 -213088 -72006 373976
11785 -327764 -19319 -120655 261601 -74918 -127782 -76929 76471 -144871 43540 15477 -386597
11773 24731 -127349 -122980 -47436 -6197 -182828 24345 -30058 261490 254889 -268423 -289813
11762 -289813 -107322 -244327 41812 191268 -229640 -52569 15861 107322 -5510 120260 271805
$$ packed form
11843b80548B65889n0273h1399B99914a84102e0867j61137d0233J5215A56054
11832f4712k7622B4951a42148A4821k080J36523o019E5325h9403N06q0093j86014
11820c55004A5216a33776j40755D7353b0406k5878k08965C06808q8698C9618c92534
11808A16249a70703D2896f8587q2565N1267o2290j01092A66844j6996c0465j70765
11797b01230C46257q3299f3533B69101E1165M7975b22339R5455q6204g2006C73976
11785c27764a9319j01336B61601g4918n2864N0853G6471a44871D3540A5477c86597
11773B4731a27349M369d7436f197j76631B4345c0058B61490o601b68423k1390
11762b89813a07322j37005D1812J49456b29640e2569A5861R1461e510A20260J51545
$$ plain form
11751 271805 -92595 -360198 -40166 -18426 224464 20599 -174337 156456 29436 -160378
11740 -136125 -18780 -179462 382718 -72285 -260794 203476 48574 150138 -13449 -44836
11730 -44836 -13107 -69674 116352 160477 -239942 -275141 -374809 -276219 -144066 415427 -52163
11718 -64221 -155735 127328 -205766 429111 107435 101219 -82657 -256013 -25048 -17695 176320
11706 117880 86040 158989 -155831 34805 226765 21593 87164 67141 65254 -215232 75918
11694 -128068 -255956 327205 -91144 377318 -90471 -143029 4967 31213 63589 -48784 105424
11682 -341315 283304 207360 -74003 29723 -48315 93084 -173504 -90860 -129164 150461 -54557
11670 176074 -4629 297982 -442267 -98209 -43614 210333 57236 -194344 -136146 -74747 136590
$$ packed form
11751B71805i2595k67603d0166a8426B24464B0599a74337A56456B9436a60378
11740a36125a8780j60682C82718g2285j88509B03476D8574J01564a3449l1387
11730d4836a3107n6567A16352M4125b39942l5199r9668R8590J32153D15427e2163
11718f4221r1514A27328b05766D29111A07435o216h2657j73356b5048P353A76320
11706A17880l1840P2949a55831C4805J91960B1593O5571k0023j887b15232G5918
11694a28068j27888C27205i1144C77318i0471n2558D967K6246L2376d8784A05424
11682c41315B83304p5944g4003B9723d8315I3084a73504Q2644l8304A50461e4557
11670A76074d629B97982d42267i8209d3614B10333E7236a94344N8198O1399A36590
$$ plain form
11658 37001 18445 133545 62853 64550 160459 194678 -111775 179558 -76576 244328 38662
11646 39363 -61260 -24445 232799 -83311 -299236 -217745 -218465 260172 47251 199684 -295833
11634 47521 253795 68224 -77043 139630 -35515 238290 449203 -245676 168348 122766
11624 122766 234050 116810 141834 119182 93343 186279 -152860 -153959 -35342 -106803 183306
11612 -82942 -56928 41631 -288487 -188 -1642 244085 51958 123037 -170293 -89002 72232 230062
11600 230062 -93841 130336 -48278 437299 224841 -23402 360009 125297 165057 -92377
11589 82612 292513 -196453 206066 219964 68379 -380331 381565 402495 127017 99750
11579 99750 5195 -154104 107702 27715 141016 -1640 165120 131785 -51569 259891 309377
$$ packed form
11658C7001A8445J15100F2853J697R5909L4219a11775A79558g6576B44328C8662
11646C9363f1260b4445B32799h3311k15925Q1491p20B60172D7251J52433b95833
11634D7521K06274F8224g7043A39630c5515B38290K10913b45676A68348m5582
11624A22766J11284A16810K5024k2652k5839R2936a52860j099c5342p1461A83306
11612h2942K6014D1631b88487a88j454B44085E1958P1079a70293Q1291G2232J57830
11600B30062i3841A30336d8278D37299k12458b3402C60009A25297L9760i2377
11589H2612K09901a96453B06066J3898F8379c80331C81565K0930A27017k7267
11579I9750E195a54104A07702B7715J13301a640A65120l3335e1569B59891M9486
$$ plain form
11568 309377 48332 1512 -19708 -2797 67067 273145 -96583 -54542 144514 -106900 49954
11556 -37889 -148824 371720 374525 423957 -3905 62191 206277 229413 124864 -142036 120980
11544 -19428 -116144 -320510 145523 -231054 -183974 15285 168442 115592 181448 101627 110228
11533 110228 -278101 48812 331437 74519 -54899 382431 98026 204111 -158092 32658
11522 369490 136628 62693 51611 116383 337058 233197 61627 -76424 120414 225162
11512 225162 276799 616 22250 218293 71768 187888 144053 -140929 -335560 267829 -12695
11500 180350 -62198 -89769 127832 -250267 274577 137175 94235 -63189 225082 270421
11490 270421 -42842 132610 454881 95403 205079 -23012 35341 126680 269808 109591
$$ packed form
11568C09377D8332A512a9708b797F7067K06078i6583M2041A44514a06900D9954
11556c7889j10935C71720K805M9432c905F2191J44086K3136j04549a42036A20980
11544a9428r6716k04366A45523b31054M7080A5285J53157n2850O5856p9821Q601
11533A10228b78101D8812K82625G4519e4899C82431I8026J06085a58092C2658
11522C69490A36628F2693j1082O4772K20675j03861F1627g6424A20414J04748
11512B25162N1637F16K1634J96043G1768J16120m3835a40929j94631B67829a2695
11500A80350f2198k7571A27832b50267B74577A37175m2940f3189B25082M5339
11490B70421d2842A32610L22271I5403J09676b3012C5341R1339J43128A09591
$$ plain form
11479 -39425 106405 375103 105374 225637 115848 176908 -150753 47205 81209 -102401
11468 60339 99848 113533 -111607 166148 204579 -818 107013 267 102389 -11189 -99322 64864
11455 24219 136849 90721 -95134 23783 325497 -132969 -120036 254158 177441 213071 27816
11443 54831 15233 -197497 312747 -363527 20579 -100038 418766 104053 80266 79156 111306
11432 111306 213506 45870 97227 -116865 -144475 -29029 -105047 -133793 -346527 319209 47521
11420 218238 -205827 62609 -132737 -44713 244952 125653 129979 13470 188749 119952 -91054
11408 22118 12415 -206505 117509 25821 -21663 10328 198446 136903 188542 198805 -69447
11396 33035 61136 -231707 70186 -43236 -168476 148292 221124 245142 112492 109379 153359
$$ packed form
11479c9425A06405K68698A05374J20263j09789O1060a50753D7205L4004a02401
11468F0339L9509J3685a11607A66148L8431h18A07013B67J02122a1189q8133F4864
11455B4219J12630m6128i5134B3783L01714a32969J2933B54158p6717L5630B7816
11443E4831A5233a97497C12747c63527B0579a00038D18766A04053k3787j110L2150
11432A11306J02200D5870N1357a16865k7610b9029p6018k8746k12734C19209D7521
11420B18238b05827F2609a32737d4713B44952j19299M326A3470J75279o8797i1054
11408B2118r703b06505A17509B5821b1663A0328J88118o1543N1639J0263f9447
11396C3035K8101b31707G0186d3236j25240A48292P2832K4018A12492l113M3980
$$ plain form
11385 153359 34020 274931 -187850 100756 232516 91031 90536 53495 -19396 -54116 280644
11373 296156 153921 -344714 -45001 -8769 -185039 72967 242859 286591 -275141 5162 41108
11362 41108 -313857 -44353 39581 -409983 254056 -232002 258917 -6328 -49040 58309 286534
11351 286534 255638 -213458 87907 -44393 -84053 -119492 -364427 184023 -142886 594506
11340 57904 310443 228165 8544 -213562 5287 -137464 -211191 105780 -4519 -198757 -167313
11329 -167313 -18196 -12664 -223217 102930 33589 -99358 117221 133239 -102017 -144674 -119557
11318 -119557 132433 -154162 2977 77210 33393 -205630 -156834 -290489 -101252 -8897 34671
11306 -61363 245551 -102286 -126241 -99268 -3356 -377526 271304 7703 167943 -217794 -15847
$$ packed form
11385A53359C4020K40911a87850A00756J31760I1031m95l7041a9396l4720B80644
11373B96156j42235c44714d5001h769j76270G2967J69892M3732b75141E162L5946
11362D1108c13857d4353C9581d09983B54056b32002B58917f328m2712E8309K28225
11351B86534l0896b13458H7907d4393l9660l5439k44935A84023a42886E94506
11340E7904K52539q2278H544b13562E287a37464p3727A05780d519j94238L1444
11329a67313a8196N532k10553A02930C3589i9358A17221J6018a02017m2657K5117
11318a19557A32433a54162B977P4233C3393b05630M8796j33655a01252h897C4671
11306f1363B45551a02286k3955K6973c356l74170B71304G703J60240b17794a5847
$$ plain form
11294 -171436 182059 310177 89574 36143 -118688 19232 32691 -231608 159541 139430
11284 139430 233000 98793 -160066 -202183 176389 406701 387948 -138994 -102223 54436 -361714
11272 -25823 115562 -340887 38604 -244610 146919 -338112 -100161 -94360 -159817 -307603
11262 -307603 -6975 -77989 184114 -125962 6445 -129027 -385791 -109911 -82943 -467242 72630
11250 91358 177779 -353554 292455 -13943 -483317 379867 -301196 -145467 222244 24623
11239 -123282 -256690 -141906 306792 -98673 242355 -22308 313614 -7692 68123 -231515
11228 118414 33249 -194975 12108 -133711 -143587 43401 -166831 22827 -345510 27539 -408550
11216 -367906 464393 189963 -250789 252227 152718 -155252 86943 88136 54237 -3975 -201678
$$ packed form
11294a71436A82059J28118H9574C6143a18688A9232J3459b31608A59541k0111
11284A39430R3570I8793a60066m2117A76389K30312j8753a38994L6771E4436c61714
11272b5823A15562c40887C8604b44610A46919c38112a00161N801o5457j47786
11262c07603f975p1014A84114a25962F445a29027k56764a09911K6968l84299G2630
11250I1358Q6421c53554B92455a3943m69374C79867c01196a45467B22244B4623
11239a23282j33408J14784C06792i8673B42355b2308C13614g692F8123b31515
11228A18414C3249a94975A2108a33711r876D3401a66831B2827c45510B7539d08550
11216c67906D64393A89963b50789B52227r9509a55252H6943J193l3899c975j97703
$$ plain form
11205 -201678 -359706 328661 -46347 -9847 87581 -208290 -124228 121768 -43385 -55526 150623
11193 -8320 13637 -41390 -239153 -28527 -102563 246065 -976 -25071 128092 200133 -255507
11181 110046 -80632 35876 90704 -21293 167114 82946 -119235 93480 60974 -212047 -116876
11170 -116876 -2541 -83092 252165 -114134 -169510 22409 -25870 -19666 103388 312205 74139
11158 -24370 182325 56110 -83826 19286 -129447 29267 -167020 235175 212982 122561 -123610
11146 -168538 71843 -390406 -75247 -21849 104793 -177114 -173484 -109308 -75272 -66148 -55278
11135 -55278 128581 204812 21950 -26966 -27640 -183723 111336 -133550 123077 -4789 447113
11123 171634 21227 187595 -83265 38473 -106627 185629 110590 126445 -81130 177018 480439
$$ packed form
11205b01678j58028C28661d6347i847H7581b08290Q4062A21768d3385j2141A50623
11193h320A3637d1390j97763b8527p4036B46065i76k4095A28092P2041b55507
11181A10046h0632C5876N4828b1293A67114H2946a19235I3480l2506b12047R5171
11170a16876b541q0551B52165a14134n5376B2409b5870O204A03388K08817G4139
11158b4370A82325E6110h3826A9286a29447B9267a67020B35175k2193r0421a23610
11146a68538G1843c90406g5247b1849A04793a77114L630O4176L4036R124J0870
11135e5278A28581P6231B1950b6966o74j56083A11336a33550A23077d789D47113
11123A71634B1227J66368h3265C8473a06627A85629p5039J5855h1130A77018L03421
$$ plain form
11112 480439 21943 80146 158366 -154598 -9109 -101378 459069 437189 183773 11930 100228
11101 100228 247946 21093 -50653 103478 -167409 200822 -126816 149973 -54740 64 340778
11090 340778 90026 -147683 138337 32301 208170 238077 125806 -75877 125324 360007
11080 360007 -151630 125141 288066 401702 212171 147351 311054 387839 415891 419064
11070 419064 249461 181834 315078 273737 396433 514950 487744 104459 840058 541603
11060 541603 370137 492879 597924 492759 609744 551686 418110 664823 604599 687148
11050 687148 798209 165378 791529 508288 656097 1017798 546377 851549 515547 571425
11040 571425 653698 549555 626417 587699 697365 529107 776136 389957 734332 848405
$$ packed form
11112D80439B1943N8203P8220a54598i109r2269D59069k1880A83773A1930Q8298
11101A00228J47718B1093e0653A03478a67409B00822a26816A49973e4740F4L40714
11090C40778I0026a47683A38337C2301J75869K9907j12271g5877A25324K34683
11080C60007a51630A25141J62925J13636j89531o4820J63703P6785K8052L173
11070D19064j69603o7627J33244m1341J22696J18517k7206A04459P35599k98455
11060E41603j71466J22742J05045j05165J16985n8058j33576K46713o0224Q2549
11050F87148J11061A65378O26151k83241J47809L61701m71421L05172l36002N5878
11040E71425Q2273j04143P6862l8718J09666j68258K47029l86179L44375J14073
$$ plain form
11030 848405 665494 527540 663519 534130 990274 1026888 472563 760456 421890 770304
11020 770304 523077 454016 428171 465071 804198 649847 689947 684842 668045 596320 646750
11009 646750 319590 162912 615691 755233 777622 700024 554160 479939 571823 727325
10999 727325 641279 560139 584529 878092 560877 582870 647255 731077 739398 691080 637645
10988 637645 831689 914011 842412 1269890 1013628 930683 1255471 1042338 1112325 1255113
10978 1255113 1541148 1541307 1693323 2089922 2239021 2495602 2798136 2958878 2546076 2522222
10968 2522222 2771916 2132877 2084243 1703407 1566876 1673337 1628342 1436819 1441180 1085363
10958 1085363 1820391 1534830 1569652 1278499 1051951 1433970 1176039 827011 891741 552036
$$ packed form
11030H48405j82911j37954J35979j29389M56144L6614D72563K87893l38566L48414
11020G70304k47227o9061k5845L6900L39127j54351M0100n105j6797p1725N0430
11009F46750C19590j56678M52779J39542K2389p7598j45864p4221R1884J55502
10999G27325q6046q1140K4390K93563l17215K1993O4385Q3822Q321m8318n3435
10988F37645J94044Q2322p1599M27478k56262q2945L24788k13133O9987J42788
10978A255113K86035J59J52016L96599J49099K56581L02534J60742m12802k3854
10968B522222K49694o39039m8634l80836j36531J06461m4995j91523M361l55817
10958A085363P35028k85561L4822k91153k26548L82019k57931l49028O4730l39705
$$ plain form
10948 552036 764782 371677 123232 154191 398024 405135 4999 359317 63810 55021 257675
10937 257675 138881 241410 138060 62955 -87764 163013 23391 -30525 280622 52507
10926 565532 -61168 -9699 242155 69846 -30420 314497 140044 -115868 -75770 154727 85533
10915 85533 -67027 189739 -213599 94843 -209864 -98506 -295158 152416 144119 -44800 -159820
10904 -159820 -130016 238815 41681 -23008 -258334 105244 156334 -121064 24222 -95920 29216
10892 -321804 300206 -47757 119107 -49835 142917 44566 133597 168740 -140715 93291 -226990
10880 -203517 -87701 408750 -149151 185558 -163917 278028 102542 -149952 -447988 115727
10869 -78746 -181586 -107145 256322 -185803 181008 -244980 -44794 256264 -111555 -180106
$$ packed form
10948E52036K12746C71677A23232L0959K43833P111D999L54318F3810q789K02654
10937B57675j18794J02529j03350F2955h7764A63013B3391c0525B80622E2507
10926E65532f1168i699B42155F9846c0420C14497A40044a15868M0098A54727o9194
10915H5533f7027A89739b13599I4843b09864i8506j96652A52416q297d4800j15020
10904a59820K9804B38815D1681b3008k35326A05244N1090a21064B4222i5920B9216
10892c21804C00206d7757A19107d9835A42917D4566Q9031L5143a40715I3291b26990
10880b03517h7701D08750a49151A85558a63917B78028A02542a49952k98036A15727
10869g8746j02840P4441B56322a85803A81008b44980d4794B56264a11555o8551
$$ plain form
10859 -180106 167020 240219 298296 194001 224443 -180227 20931 24948 203389 -97096 116075
10847 214729 -146989 -7044 -3705 304620 -181954 -49764 -323774 280734 87142 59959 -367983
10835 -229471 -64592 180794 -87105 51316 -335694 90734 -176834 -196348 -127120 -256768 -86552
10823 -177119 52993 -198923 179881 -99842 -206111 217350 -160581 361387 288855 -77253
10812 -30882 -278142 -209089 121460 -166559 42578 20601 -75323 111752 -318555 -96555 -176241
10801 -176241 33365 126410 -196487 307779 48232 222590 -42292 363105 -5573 -238002 37506
10789 -161622 -70476 -44218 230463 56696 27766 -28332 -71123 18009 410958 -210477 205749
10777 86431 33044 -121736 234827 5359 -195828 -16142 -271808 -61446 -290953 200261 -179901
$$ packed form
10859a80106A67020P3199N8077j04295L0442a80227B0931M017J78441i7096A16075
10847B14729a46989g044L339C04620a81954d9764k74010B80734H7142k7183c67983
10835b29471f4592A80794h7105E1316c35694I0734a76834j9514O9228j29648h6552
10823a77119E2993a98923A79881i9842j06269B17350a60581C61387p2532g7253
10812c0882k47260O9053A21460a66559D2578B0601g5323A11752c18555i6555p9686
10801a76241C3365R3045a96487C07779D8232J74358d2292C63105e573k32429C7506
10789a61622g0476K6258B30463E6696B7766b8332m2791A8009L92949b10477B05749
10777H6431C3044a21736B34827E359a95828a6142k55666f1446k29507B00261a79901
$$ plain form
10765 129148 -209405 -333898 -249459 -41744 -356438 -252629 11558 -3362 127842 15225 -8604
10753 -216882 -57474 110505 -204176 -65559 32260 -362778 -67986 88155 107697 245007 -26064
10741 44943 80159 43578 -205051 -453073 179024 39384 -68253 448732 46459 -153280 -18295
10729 446672 -398769 -122537 -148405 -274193 364977 26077 -67554 -301155 13057 -5697 158603
10717 -114327 -131197 -22311 -55081 66476 -122395 -132160 -106749 4466 63698 -502134 -320640
10706 -320640 -173524 -80153 -74333 -1047 -51328 15360 -117845 -52705 -220063 60323 -86408
10694 -58860 -57162 -46149 150460 -150443 122875 -251159 -183792 -180376 -209018 -10105 78253
10682 28003 -38278 -88412 -281953 -169820 42629 -148571 -450708 -148747 -503 -150376 36982
$$ packed form
10765A29148b09405j24493Q4439d1744l14694J03809A1558c362A27842A5225h604
10753b16882e7474A10505b04176f5559C2260c62778f7986H8155J9542J37310b6064
10741D4943L5216l6581b05051k48022A79024C9384f8253D48732D6459a53280a8295
10729D46672c98769a22537k5868j25788C64977B6077f7554k33601A3057e697A58603
10717a14327j6870b2311l2770F6476a22395r765K5411D466N9232e02134J81494
10706c20640J47116h0153N820a047n0281A5360a17845e2705j67358F0323h6408
10694e8860J698J1013A50460a50443A22875b51159O7367L416k8642a0105G8253
10682B8003c8278n0134j93541J12133D2629a48571l02137a48747e03j49873C6982
$$ plain form
10670 129758 120653 -178564 103261 109853 -121554 37651 142974 137142 -126717 110553 -16655
10658 -172319 2562 56857 100857 109141 149036 -65028 89295 -467293 177404 -148617 -100585
10647 -100585 373751 -141946 -125641 -188871 13775 -574964 -152843 227676 -46059 37575
10636 -198747 -177244 -117747 -251354 37424 456624 -134179 192682 -160922 90628 -307043
10625 -311186 -28242 -348394 -242964 -97371 -254621 282622 -304554 -59492 -158701 -54752
10614 -95109 -35782 174612 174272 -107096 -259122 -11795 41342 47530 -136868 -140209 -280547
10603 -280547 193898 -150750 -97880 -145520 1738 88646 169957 -94424 192142 -132541 259779
10591 -169090 52506 -234667 83189 210153 10131 -257330 -114714 -8869 -2188 110209 -393724
$$ packed form
10670A29758r105a78564A03261O592a21554C7651J05323n832a26717A10553a6655
10658a72319B562N4295M4000Q284L9895f5028H9295d67293A77404a48617M8032
10647a00585C73751a41946J6305o3230A3775e74964a52843B27676d6059C7575
10636a98747K1503N9497j33607C7424M19200a34179A92682a60922I0628c07043
10625c11186b8242l20152J05430i7371j57250B82622c04554e9492r9209e4752
10614i5109c5782A74612l40a07096j52026a1795D1342O188a36868l341j40338
10603b80547A93898a50750N2870m7640A738Q6908Q1311i4424A92142a32541B59779
10591a69090E2506b34667H3189J26964A0131b57330a14714h869b188A10209c93724
$$ plain form
10579 -51408 -135816 -55276 -87414 -33416 -280964 189367 7305 -67404 44435 92093 -68811
10567 -224035 95404 349016 242340 -56206 -155387 205481 -226427 -26812 -162832 34304
10556 -314642 -119807 93474 286186 157343 167307 -61340 -38254 -17997 -44860 60709 13254
10544 -224805 73453 -102901 -238642 3343 -291581 -130722 86471 -117072 85500 -363358
10533 142412 -33618 25778 -200395 -90438 -60413 -58202 -183820 46591 16359 89321 42874
10521 -123108 -82170 -208202 34058 -59048 155547 19808 -51049 59753 74046 35998 28319
10510 28319 -192689 -20203 -153049 78291 96013 -402718 17811 33143 135530 -86129 -379869
10499 -379869 -471316 81212 41366 -55839 124454 173899 202110 -170318 34707 18772 70118
$$ packed form
10579e1408q4408e5276l2138c3416k47548A89367G305f7404D4435M7658f8811
10567b24035I5404K53612j06676e6206r9181B05481b26427b6812j36020C4304
10556c14642a19807I3474J92712j28843R964f1340K3086a7997k6863F0709A3254
10544b24805G3453a02901j35741C343b91581a30722H6471a17072H5500c63358
10533A42412c3618B5778b00395i0438L0025K211j25618D6591A6359P2962D2874
10521a23108M0938j26032C4058e9048A55547A9808e1049E9753J4293C5998p679
10510B8319a92689b0203j32846G8291J7722d02718A7811J5332J02387h6129k93740
10499c79869r1447H1212l9846e5839A24454M9445K8211a70318C4707j5935N1346
$$ plain form
10488 70118 -363538 107122 -106921 -35649 22831 228520 360977 154040 616368 543394
10478 543394 81386 281650 -123411 -280766 -138471 16406 56324 -122928 136630 -63600
10467 -232581 126754 -48258 176208 29234 112132 116007 -301353 67459 -227823 143949 -71811
10455 135480 159301 -209274 69841 53758 200744 62700 101555 -123925 -55729 86157 -143039
10443 -81760 -309511 -60820 -217396 -34912 -214200 -172712 -88030 -73541 59971 -49088 -123298
10432 -123298 63773 -166801 -43169 147762 334055 42871 -38036 27277 3036 61011 -125328
10420 -125280 194666 76396 146086 -198133 -176228 -294850 -113165 -31690 -229599 -226043 147264
10408 -147383 186024 -23432 83270 13080 -215455 -130783 134170 222048 -117960 2396 53826
$$ packed form
10488G0118c63538A07122a06921c5649B2831K05689J32457A54040M62328p2974
10478E43394H1386K00264a23411j57355a38471A6406L9918a22928A36630f3600
10467b32581A26754d8258A76208B9234Q2898L875c01353F7459b27823A43949g1811
10455A35480K3821b09274F9841j6083J46986F2700L8855a23925e5729H6157a43039
10443h1760k27751f0820j56576c4912j79288M1488Q4682J4489E9971d9088p4210
10432a23298F3773a66801d3169A47762J86293D2871c8036B7277C036N7975a25328
10420a25280A94666G6396O9690a98133K1905j18622a13165c1690j97909L556A47264
10408a47383A86024b3432H3270A3080b15455Q4672A34170Q7878a17960B396N1430
$$ plain form
10397 53826 122571 -64591 -98894 268397 214037 36798 396030 204208 4133 65638 295727
10386 295727 48487 164956 96134 68867 -166815 71985 107968 -155597 305414 196527
10376 196527 354688 318164 52117 55131 297253 58624 408907 44833 481407 112884 375245
10365 375245 374611 246278 269799 377779 210113 155622 238137 446453 62972 178165 344642
10354 344642 582373 338887 551048 756245 105624 454349 44462 456683 231632 106895
10343 21978 251280 257740 82422 298453 182908 527667 272862 -6433 -19536 246692 320624
10332 320624 93762 333241 -168205 79894 77824 -12816 93302 365797 305127 269798 226969
10321 226969 599795 81386 369194 -34367 140309 -35570 387107 86314 -22095 31939 -97756
$$ packed form
10397E3826O8745f4591l4303B68397n4360C6798L59232j91822D133O1505K30089
10386B95727D8487J16469o8822k7267a66815G1985L5983a55597C05414j08887
10376A96527J58161l6524E2117L014K42122E8624L50283D4833M36574A12884K62361
10365C75245o34j28333K3521J07980j67666n4491Q2515K08316F2972J15193J66477
10354C44642K37731k43486K12161K05197A05624L48725D4462M12221k25051A06895
10343B1978K29302O460H2422K16031j15545L44759k54805f433j3103B46692P3932
10332C20624I3762K39479a68205G9894k070a2816I3302K72495o0670l5329m2829
10321B26969L72826H1386K87808c4367A40309c5570C87107H6314b2095C1939i7756
$$ plain form
10309 -25396 -2929 -91610 1721 160481 -417330 -74811 432775 -64917 -182808 -233698 -244903
10298 -244903 -157032 -131775 17200 43384 158620 217589 -37461 -153661 -115445 165177 -202877
10286 -78332 -227937 191776 235280 -523630 -298357 77087 -369255 42645 -141145 -75421
10276 -75421 -61221 119824 -205130 1523 -73022 33045 24699 -43613 177903 480052 -147277
10264 8380 -184395 -16757 239181 193259 90149 121127 342383 81052 350013 385614 496920
10253 496920 -17758 102188 80952 135200 -298643 -225543 113819 -155015 31430 170147
10243 170147 100459 15252 -57446 3820 19110 4456 241141 -107411 -9061 4961 93057 -35841
10230 -67995 -162388 -41721 -113905 -316292 130575 -71773 -331637 -60636 65319 248850 -123170
$$ packed form
10309b5396b929q8681A721J58760d17330g4811D32775f4917j17891n0890j1205
10298b44903Q7871K5257A7200K6184J15236N8969c7461j16200L8216A65177b02877
10286g8332j49605A91776M3504e23630K25273G7087c69255D2645a41145O5724
10276g5421J4200A19824b05130A523g3022C3045q346d3613A77903L02149a47277
10264H380a84395a6757B39181m5922I0149L0978K21256H1052K68961L5601J11306
10253D96920a7758A02188k1236N4248b98643P3100A13819a55015C1430J38717
10243A70147o9688A5252e7446C820J5290D456K36685a07411i061D961Q8096c5841
10230f7995r4393d1721p2184k02387A30575g1773k59864f0636F5319J83531a23170
$$ plain form
10218 -345521 -157910 -78732 -6431 91537 -280224 -129526 -400892 -21755 -197473 -32204 94314
10206 -121024 112228 -265635 149934 -113170 66251 82564 174872 -8738 91852 -38811 6832
10194 -197471 -429052 -361146 51811 -2555 339597 293421 134508 -64727 202989 177706 -67427
10182 -90080 163896 104754 -308752 -208949 -344650 -107528 -14724 -35287 -23864 -280784 -41668
10170 -85218 25933 -244377 119809 105903 50718 -60230 -31389 -393585 -183508 -214031 -38581
10158 -161560 296654 -296674 99841 -86005 47519 87626 -95082 -280258 -147973 -53465 -258406
10147 -258406 140872 -48171 -402293 78894 -426412 1070 -71234 81566 4592 55728 -187608
10135 -277414 -186734 62790 196881 -281946 -219966 50537 -66846 135378 -325930 60544 -86261
$$ packed form
10218c45521a57910g8732f431I1537b80224a29526k71366b1755j75718c2204I4314
10206a21024A12228b65635A49934a13170F6251J6313R2308h738I1852c8811F832
10194a97471k31581O7906E1811b555C39597m6176A34508f4727B02989k5283f7427
10182i0080A63896n9142c08752R9803j35701a07528a4724k0563J1423k56920d1668
10170h5218B5933b44377A19809j3906E0718f0230K8841l62196a83508l0523c8581
10158a61560B96654b96674I9841h6005D7519M0107i5082j85176J32285e3465k04941
10147b58406A40872d8171l54122G8894d26412A070g1234H1566D592N1136a87608
10135b77414R0680F2790J34091b81946O1980E0537f6846A35378c25930F0544h6261
$$ plain form
10123 -8233 18368 -360184 -184430 -70432 -72511 -156442 -459678 144304 63192 12367 -188180
10111 -135342 -634 -150166 78242 200228 -11355 74469 -333170 105505 -95821 -96410 97417
10099 28889 -38182 -347512 -73810 -163320 -36927 -6778 -273934 -369946 -181731 212336 117718
10088 117718 -342228 -175337 178277 202878 -97605 -14729 85535 -216730 -111700 -276807
10078 -276807 -357966 -16254 -143088 124361 -137864 -124258 -27762 -54604 -83772 115241 21508
10066 -59070 77625 163593 183734 -155123 108319 -198200 504703 -13133 314453 250561 -116095
10054 -236529 -168978 95003 176610 226423 -342964 -218475 -233892 -43525 163898 -53772 -217600
10043 -217600 200084 54804 81750 238711 -154984 17752 -286069 -480405 -12456 233494
$$ packed form
10123h233A8368c60184J75754g0432k079q3931l03236A44304F3192A2367a88180
10111a35342f34j49532G8242J21986a1355G4469c33170A05505i5821n89I7417
10099B8889c8182l09330g3810q9510c6927f778k67156r6012a81731B12336r4618
10088A17718c42228J66891A78277K4601i7605a4729H5535b16730J05030j65107
10078b76807q1159a6254j26834A24361a37864J3606b7762k6842k9168A15241B1508
10066e9070G7625Q5968K0141a55123A08319a98200E04703a3133C14453o3892a16095
10054b36529O7551I5003Q1607M9813c42964J24489j5417d3525A63898e3772j63828
10043b17600B00084E4804K6946J56961a54984A7752b86069j94336a2456B33494
$$ plain form
10032 -12347 -109637 -121155 40198 4154 -371324 -126339 -60363 -240179 -247302 94540 -39116
10020 -166344 -200947 -145997 140220 -171879 25534 -3275 136693 -211114 56005 178026 293158
10009 293158 -253674 141568 -35368 33788 -75537 -205542 -166059 -327047 -140774 -48298
9998 -119782 -209496 -52313 2367 67959 -221530 316865 -49167 -54639 24765 -120809 -10589
9986 -265789 -371482 -135422 -206839 27213 89339 110903 -27852 -117064 -279324 55260 -71477
9974 40652 8821 -215598 72268 -46012 57410 -348256 -178101 -288173 -106309 -9706 28561
9962 76893 43898 -301958 -80931 19685 -175923 40489 -56833 106637 -27747 -31831 -13680
9950 -259273 -37131 -277578 -234478 189003 6180 -111026 -391051 127099 -64610 -21057 -145274
$$ packed form
10032a2347r7290j1518D0198D154c71324a26339f0363j79816p123I4540c9116
10020a66344l4603N4950A40220a71879B5534c275A36693b11114E6005J22021J15132
10009B93158b53674A41568c5368C3788g5537j30005L9483j60988a40774d8298
9998a19782q9714e2313B367O5592b21530C16865d9167n472B4765a20809a0589
9986b65789j05693a35422p1417B7213O2126K1564b7852q9212j62260E5260g1477
9974D0652H821b15598G2268d6012E7410c48256J70155j10072a06309i706B8561
9962G6893l2995c01958h0931A9685a75923D0489e6833A06637b7747m084a3680
9950b59273c7131k40447M3100A89003F180a11026k80025A27099f4610b1057j24217
$$ plain form
9939 -145274 -522933 -252602 -140200 -198286 74924 -47313 -85571 -333517 160155 -36935 -140972
9928 -140972 -250445 1542 -103894 -315922 -404840 -190119 88318 6356 -250866 -367548 -103523
9916 -293836 -375454 -126705 180330 15298 56772 -53072 -226048 -401429 -12380 -34202 -296342
9905 -296342 23152 317680 124346 -317731 -92764 61628 89241 -402508 -120568 -292582
9895 -292582 -62614 -242236 127639 208625 -171362 1562 -139114 -147780 22871 156228 53847
9883 -320706 -155171 -531729 -162880 376140 -227561 -150832 -266648 372498 -340142 24544
9872 34579 -344308 -282688 6316 188179 -76153 -47405 -188591 96662 149296 -358392 -216718
9861 -216718 249779 -158955 199519 124069 -192088 20910 -936 103737 -402416 -313504 -69493
$$ packed form
9939a45274l77659b52602J12402n8086G4924d7313l8258k47946A60155c6935j04037
9928a40972j09473A542a03894k12028q8918a90119H8318F356b50866j16682a03523
9916b93836q1618a26705A80330A5298M1474e3072j72976j75381a2380k1822k62140
9905b96342B3152K94528A24346c17731i2764F1628K7613d02508a20568j72014
9895b92582f2614j79622A27639Q0986a71362A562a39114q666B2871J33357E3847
9883c20706a55171l76558a62880C76140b27561P6729j15816C72498c40142B4544
9872C4579c44308O1620F316J81863g6153K8748j41186I6662N2634c58392J41674
9861b16718B49779a58955A99519p5450a92088B0910i36A03737d02416Q8912f9493
$$ plain form
9849 97581 -285091 -122376 201178 98883 -246086 -126992 117675 -275894 188900 -100592
9838 -86767 -97057 -161963 128013 -25192 92527 -383539 -21796 27289 163623 46865 -148421
9826 224154 -88623 -332289 -28601 -45677 61051 -268559 -93450 -18274 -157902 -66937 -29519
9814 -141280 290459 40159 -203865 55303 152100 -123934 -170881 -201865 -314123 -42054 -274536
9803 -274536 64688 -213634 -69821 32407 23369 -171216 -107264 -54972 -11850 -289652 -51627
9791 254113 -104457 150233 -192358 64114 7128 -353201 65082 40398 -17629 -111483 43539
9779 -349662 -136647 -188186 -201043 6528 -127695 -243595 -84913 -197249 257607 108987 -167670
9767 62852 -109620 -97777 139126 -158283 34981 -232186 -456522 -154723 -49639 -93068 -111356
$$ packed form
9849I7581b85091a22376B01178I8883b46086J19094A17675b75894A88900a00592
9838h6767j0290o4906A28013b5192I2527c83539b1796B7289J36334D6865a48421
9826B24154h8623k43666b8601j7076F1051b68559i3450a8274j39628f6937b9519
9814a41280B90459D0159b03865E5303R6797a23934m6947l0984j12258d2054k32482
9803b74536F4688b13634f9821C2407r038a71216O3952N2292a1850k77802e1627
9791B54113a04457A50233a92358F4114G128c53201F5082k4684a7629r3854D3539
9779c49662a36647n1539j2857F528a27695j15900h4913j12336B57607A08987a67670
9767F2852a09620J1843A39126a58283C4981b32186k24336a54723d9639m3429j8288
$$ plain form
9756 -111356 -126841 -213415 -67584 90378 411355 101140 88441 33574 -477939 -252194 -264390
9745 -264390 85749 -56427 -306612 -116017 250991 -108568 175242 -98623 54994 -2570 -53715
9734 -53715 367652 -16470 -34514 95481 -118209 119759 -108404 20717 -49888 193487 101200
9723 101200 171814 -261742 -268671 -63405 227286 75396 20983 90665 -154255 -345340 -226867
9712 -226867 -124353 -288352 221550 -204260 75623 147459 51039 82740 -221014 -168850 26565
9700 -246077 -135606 119298 -207412 -9020 83017 -252720 -48202 -80421 156041 8 150309
9689 150309 -155720 -18582 269738 249446 151829 25077 -225265 182207 -164761 -77951 374530
9677 -146981 -11406 -184093 -41999 12380 222359 -205697 -226766 53244 -212110 -51762 -102117
$$ packed form
9756a11356j5485q6574f7584I0378L20977A01140j2699C3574d77939K25745j2196
9745b64390H5749e6427k50185a16017B50991a08568A75242i8623E4994b570n1145
9734e3715C67652a6470j8044I5481a18209A19759a08404B0717d9888A93487r2287
9723A01200P0614b61742o929f3405B27286G5396B0983O9682a54255j91085J18473
9712b26867J02514j63999B21550b04260G5623P1836E1039L1701b21014N2164B6565
9700b46077J10471A19298b07412i020H3017b52720d8202l2219A56041HJ50301
9689A50309a55720a8582B69738k0292r7617B5077b25265A82207a64761g7951C74530
9677a46981a1406j72687d1999A2380K09979b05697k1069E3244b12110e1762n0355
$$ plain form
9666 -102117 -161407 -226453 -51938 59385 -11126 396669 255766 -232273 52416 -279200 -134240
9654 -96850 -40035 -221097 -70094 183098 186478 -2402 105567 27301 -258801 -210899 -165021
9643 -165021 -266432 -61272 55468 -87607 -162107 -180044 -69331 144289 244295 192735 -319641
9631 -95751 -23838 -93039 -167945 -340019 -198634 -222755 170431 -75351 -354267 -290245 -165413
9620 -165413 -18053 -267017 -40350 -222401 -284072 -136765 -65166 1801 -288363 -112107 108123
9608 174128 -134131 101154 -60063 -23544 -419058 -128660 -381198 -183365 17513 -43579
9597 -130431 213759 -60960 16230 -295420 -35618 -149335 182087 -89733 110312 -327526
9586 29933 -264758 125673 -359276 -241731 -28865 -108538 -233685 -50000 -5542 -101610 -33270
$$ packed form
9666a02117n9290o5046e1938E9385a1126C96669j40903b32273E2416b79200a34240
9654i6850d0035j81062g0094A83098L380b402A05567B7301b58801M7902M5878
9643a65021j01411f1272E5468h7607p4500j7937f9331A44289J00006n1560c19641
9631i5751b3838o9201p4906j72074J41385k4121A70431g5351k78916O4022J24832
9620a65413a8053k48964d0350j82051o1671a36765f5166A801b88363a12107A08123
9608A74128a34131A01154f0063b3544l95514a28660k52538a83365A7513d3579
9597a30431B13759f0960A6230b95420c5618j13717A82087h9733A10312c27526
9586B9933b64758A25673c59276J17545b8865p9673j25147e0000e542r6068c3270
$$ plain form
9574 -33801 23694 -41140 40184 179176 -324645 197308 -248404 -114901 91075 -11475 61703
9562 47121 -127309 -53593 129187 -12976 58585 6429 49291 137988 165836 -74068 276573
9550 -181895 -309652 -31107 -65172 -186004 -110232 -87464 -28914 210603 -326536 177664 78819
9538 -342354 -218196 24402 -82687 174348 87108 -153789 221649 184220 -31076 -19195 -79504
9527 -79504 -79416 46360 41400 -307841 302322 -8018 -59593 -174965 -279448 -77720 -112703 -237057
9515 -237057 -142039 -57725 -26662 -60248 73671 -292669 -27515 -266625 -112428 108039 -73494
9503 -15870 46354 164730 15567 12304 -147979 102577 -321930 352295 43652 -208748 -152981
9492 -152981 -120355 90621 -231583 -262147 -97949 -109416 234859 -149332 -247157 143685 -40078
$$ packed form
9574c3801B3694d1140D0184J38992c24645A97308b48404a14901I1075a1475F1703
9562D7121a27309e3593A29187a2976E8585F429M2862Q8697K7848g4068B76573
9550a81895j27757c1107l4065j20832P5772K2768b8914B10603c26536A77664G8819
9538c42354J24158B4402h2687A74348H7108a53789B21649l7429c1076J1881o0309
9527g9504Q8D6360m960c07841C02322h018n1575j15372j04483g7720l4983j24354
9515b37057R5018e7725b6662l3586G3671b92669b7515k39110a12428A08039g3494
9503a5870D6354J18376A5567l263a47979A02577c21930C52295D3652b08748N5767
9492a52981L2626I0621b31583l0564i7949j1467B34859a49332r7825A43685d0078
$$ plain form
9480 -97426 -206073 112416 -160127 -109164 125861 -310060 -115291 -80922 -229738 -66313
9469 97989 -159892 -156324 60603 45768 -105829 94594 -180802 -330065 -180323 120183 31398
9457 106703 26231 -143631 -222028 -201098 -213712 153686 24166 -325181 -62050 -286731 -395369
9446 -395369 -247336 33152 -112890 80682 -231278 229027 2397 183724 -19020 -68326 -186420
9435 -186420 241072 -41776 -70486 277303 -124381 -203622 -29033 286745 -18778 166660 94074
9424 94074 -23317 -56899 15105 -249090 78220 335819 -105863 343422 17215 -44500 -14794
9412 -297607 6482 192200 67299 25367 -100142 -189501 229681 -63652 -282141 -87278 -127071
9401 -127071 376870 -474246 -137140 128487 -227144 208736 -355181 -72697 -167889 -107056
$$ packed form
9480i7426j08647A12416a60127N0963A25861c10060a15291L4369j48816f6313
9469I7989a59892L568F0603j4835a05829I4594a80802j49263J49742A20183C1398
9457A06703B6231a43631p8397K0930j2614A53686B4166c25181f2050k24681j08638
9446c95369J48033C3152a12890H0682b31278B29027B397J81327a9020m9306j18094
9435a86420B41072d1776k8710B77303a24381p9241b9033B86745a8778A66660p2586
9424I4074b3317l3582A5105b49090G8220K57599a05863C43422A7215d4500a4794
9412b97607F482J85718F7299B5367a00142q9359B29681f3652k18489h7278l9793
9401a27071C76870d74246a37140A28487b27144B08736c55181g2697r5192O0833
$$ plain form
9391 -107056 191321 104808 62139 -462796 -247579 -54206 211210 -219830 -493339 -11706
9380 -237886 119751 -49611 -137219 -21217 -179617 76222 -79135 -85108 7097 242258 328492
9369 328492 59574 144847 118138 225145 145406 134482 94197 45421 260792 94313 -230780
9357 -146239 81841 135194 174324 218503 -57712 -211243 -131151 123786 113220 271 -270713
9345 132688 -85089 194126 238714 -54633 35094 -138472 98590 22881 20004 -71737 67169
9333 -40122 -120539 -127293 -88086 -43423 312873 85934 34454 -208767 -52514 -335140 -129206
9321 -180801 61393 -78409 -83417 -41803 -22565 -49586 100324 -149974 49530 -77796 -170572
9310 -170572 -64030 -149657 -306024 -228150 138012 14791 28968 7949 56471 16005 -209083
$$ packed form
9391a07056A91321q6513m2669d62796K15217e4206B11210b19830k73509a1706
9380b37886A19751d9611q7608b1217j58400G6222g9135n973G097K35161Q6234
9369C28492E9574Q5273k6709J07007p9739j0924m0285D5421K15371I4313b30780
9357a46239H1841N3353L9130M4179e7712j53531Q0092A23786j0566B71b70713
9345A32688h5089A94126M4588e4633C5094a38472I8590B2881k877g1737F7169
9333d0122q0417o754L9207d3423C12873H5934C4454b08767e2514k82626a29206
9321a80801F1393g8409n008M1614J9238k7021A00324a49974D9530g7796r2776
9310a70572f4030q5627j56367P7874A38012A4791J4177G949M8522A6005b09083
$$ plain form
9298 -367897 -204733 156175 -441695 -70920 -237978 42500 -185140 -148011 -7746 187854 146552
9287 146552 -54726 -162377 -336137 -37053 -89952 -235065 -225173 -77299 -134944 41725 -153486
9275 182215 -258085 -4879 -176524 -71832 72334 159254 -141616 -79693 108113 57052 128136
9264 128136 94919 341414 145794 -368502 -448911 -135375 -110850 179592 56031 -28560 -242858
9253 -242858 13126 -65207 -21343 -394740 -214431 171637 254591 -221622 -210830 -356049 160202
9241 -12875 -131685 -5144 -298447 -222873 -48611 78204 67413 -297369 -45190 -286219 -76364
9229 -87963 -56960 -244282 68767 -76289 -198501 230026 -228420 -191094 46819 -391869 -50993
9217 -105328 -207999 -140580 -193276 -72653 -236181 65853 -147085 -176826 -114963 170416 -71248
$$ packed form
9298c67897J63164A56175d41695g0920j67058D2500a85140L7129g746A87854m1302
9287A46552e4726j07651j73760c7053n2899j45113R892g7299n7645D1725a53486
9275A82215b58085d879j71645g1832G2334Q6920a41616O1923A08113n1061P1084
9264A28136l3217K46495A45794c68502q0409a35375K4525A79592E6031b8560k14298
9253b42858A3126f5207b1343l73397J80309A71637Q2954b21622J0792j45219A60202
9241a2875j18810e144k93303P5574d8611G8204j0791b97369d5190k41029g6364
9229h7963L1003j87322F8767g6289j22212B30026b28420L7326D6819c91869e0993
9217a05328j02671O7419n2696g2653j63528F5853a47085k9741O1863A70416g1248
$$ plain form
9205 -164807 55509 37314 95362 -191430 -23555 24954 -95050 -51384 -224794 18847 83267
9194 83267 -31795 -114990 252152 37231 1094 477754 119371 182739 -5058 26651 30150 413889
9182 413889 -18666 72046 173507 -33877 458065 83014 271117 -13363 -170428 9657 -158154
9170 -172485 117147 -90126 -54147 -24613 -105163 -184211 -391698 -54251 -331196 7992 -459983
9158 -75230 65686 -124026 -40617 -274133 -218256 -271437 -50115 -152689 54163 -173822 -123711
9147 -123711 155656 116519 -51853 27067 325931 171624 144033 74635 101003 -71505 -357932
9136 -357932 35763 -81389 -106491 114363 32300 -259864 -30253 -665299 -51332 12753 -426763
9124 -80205 -54149 82447 123348 -285203 -34016 -75007 125813 -168270 68830 75965 -155969
$$ packed form
9205a64807E5509j8195N8048a91430b3555B4954i5050M3666j73410A8847O4420
9194H3267c1795q3195B52152C7231A094M76660A19371O3368e058B6651L499L83739
9182D13889a8666G2046J01461c3877D58065H3014J88103a3363j57065I657a58154
9170a72485A17147i0126L5979b4613q0550p9048k07487e4251k76945G992d59983
9158g5230F5686a24026d0617k33516N5877n3181e0115j02574E4163a73822N0111
9147a23711A55656l9137e1853B7067K98864j54307k7591o9398K6368g1505k86427
9136c57932C5763h1389k5102A14363C2300b59864c0253o35046e1332A2753d26763
9124h0205K6056H2447M0901b85203c4016m0991A25813a68270F8830P135a55969
$$ plain form
9112 -230083 -198111 -34892 150448 85078 -12455 -230346 -276182 -302342 -41070 -96704 -205140
9101 -205140 83072 136181 -51449 -120227 222659 -356038 214768 57499 -270651 -177942 -223977
9090 -223977 -232021 295392 -184944 -155360 -288488 -1938 -78391 37312 70121 -9743 -175479
9079 -175479 72986 -437590 29293 -51593 -335059 -153928 -242297 -206544 60226 360025 -396018
9067 -241200 221980 -142448 -50715 -51497 -157211 280829 40297 -358406 -172407 -37245 -198525
9056 -198525 342114 55219 -211379 -259048 -130117 81291 12783 64139 15436 -151465 -174746
9045 -174746 -267492 -130369 -47511 -74355 -231479 27142 242176 -13602 78652 132759 142995
9034 142995 96710 -95199 -17487 120996 107745 -22833 33303 -363434 -390290 129899 330050
$$ packed form
9112b30083L1972c4892A50448o5370a2455k17891m5836k6160d1070n5634j08436
9101b05140H3072N3109e1449o8778B22659c56038B14768E7499b70651R2709m6035
9090b23977q044B95392a84944K9584j33128a938p6453C7312L2809i743j65736
9079a75479G2986d37590B9293e1593k83466a53928q8369L5753F0226K99799c96018
9067b41200B21980a42448e0715p82j05714B80829D0297c58406a72407c7245j61280
9056a98525C42114E5219b11379m7669J28931H1291A2783N1356A5436a51465k3281
9045a74746r2746a30369d7511k6844j57124B7142K15034a3602G8652N4107J0236
9034A42995m6285i5199a7487A20996j3251b2833C3303c63434k6856A29899K00151
$$ plain form
9023 330050 -371484 -103421 -26823 79046 124460 -96054 -434195 37233 -92628 238 -179335
9011 -164587 -126741 117353 -90343 125447 -186304 137759 195619 -83162 -602218 113261
9000 9178 -197188 -18290 -67761 -193231 -40177 308690 88552 -379787 83538 35117 -90054
8988 84104 69685 -193167 -137015 -14154 142372 -122894 54262 105214 -32283 -293094 53928
8976 -268501 32938 21763 79735 2581 -29430 -279678 -127818 -62169 71649 -126730 179567
8964 -32718 53546 -28784 -255613 -287299 -110472 -228394 155 4126 229991 110719 -354362
8952 -127807 -138131 114648 -144959 -8251 -137310 -197587 125997 -6393 -215176 48735 56065
8941 56065 -91652 34666 -87853 77736 184295 19164 581279 117851 227191 178349 93844
$$ packed form
9023C30050c71484a03421b6823G9046M5414i6054l38141C7233i2628B38a79335
9011a64587L7846A17353i0343A25447a86304A37759N7860h3162n19056A13261
9000I178a97188a8290m9471j25470d0177C08690H8552c79787H3538C5117i0054
8988H4104j4419a93167N6152a4154A42372a22894E4262N0952c2283k60811E3928
8976b68501C2938j1175N7972B581b9430k50248a27818f2169G1649a26730A79567
8964c2718E3546b8784k26829l1686a10472j17922A55L971K25865A10719c54362
8952a27807j0324A14648a44959h251j29059o0277A25997f393k08783D8735P330
8941E6065i1652C4666h7853G7736J06559A9164N62115A17851J09340m8842q4505
$$ plain form
8930 93844 -54824 165861 -53245 309321 400980 1000366 1794360 6598023 12757816 11589020
8920 11589020 4383520 1932547 1030263 1012024 277418 358195 123781 237837 57545 84563
8910 84563 25088 338550 282208 106422 214701 -214660 128304 60257 -159302 64101 -91515
8898 -81635 -237 -96493 34895 11211 -43320 -133504 -327637 58096 55631 115960 128807 -70359
8885 -146170 -320380 -9455 -46668 -186869 -5688 42839 -174383 -5431 7108 -18238 -126206 -190948
$$ packed form
8930I3844e4824A65861e3245C09321R1659N99386P93994M803663O159793j168796
8920A1589020D383520A932547r02284j8239B77418Q0777A23781J14056E7545K7018
8910H4563B5088L13462n6342A06422J08279b14660A28304F0257a59302F4101i1515
8898h1635b37r6256C4895A1211d3320r0184j94133E8096k465O0329J2847g0359
8885a46170j74210i455l7213j40201e688D2839a74383e431G108a8238j07968o4742
$$ [...]
##END NTUPLES=NMR SPECTRUM
##END=
