##TITLE=AC1523_ROEFFECT0005_8213680_K0FjOfw7f2
##JCAMPDX= 6.0         $$ Bruker NMR JCAMP-DX V2.0
##DATA TYPE= NMR SPECTRUM
##DATA CLASS= NTUPLES
##ORIGIN= BRUKER
##OWNER= Administrator
$$ 1.72 TOPSPIN		Version 2.1
$$ 2013-10-04 18:31:43.880 -0700  Administrator@X
$$ Compression mode = diff/dup
##.OBSERVE FREQUENCY= 400.02188249412
##.OBSERVE NUCLEUS= ^1H
##.ACQUISITION MODE= SIMULTANEOUS (DQD)
##.ACQUISITION SCHEME= undefined
##.AVERAGES= 64
##.DIGITISER RES= 22
##SPECTROMETER/DATA SYSTEM= spect
##.PULSE SEQUENCE= noesygpps1d.comp
##.SOLVENT NAME= COFFEE_meoh
##.SHIFT REFERENCE= INTERNAL, COFFEE_meoh, 1, 14.96082
##AUDIT TRAIL= $$ (NUMBER, WHEN, WHO, WHERE, PROCESS, VERSION, WHAT)
$$ ##TITLE= Audit trail, TOPSPIN		Version 2.1
$$ ##JCAMPDX= 5.01
$$ ##ORIGIN= Bruker BioSpin GmbH
$$ ##OWNER= Administrator
$$ $$ E:\/data/COFFEE/nmr/AC1523_ROEFFECT0005_8213680_K0FjOfw7f2/12/pdata/1/auditp.txt
$$ ##AUDIT TRAIL=  $$ (NUMBER, WHEN, WHO, WHERE, PROCESS, VERSION, WHAT)
(   1,<2013-10-04 18:31:39.083 -0700>,<Administrator>,<X>,<go>,<TOPSPIN 2.1>,
      <created by zg
	started at 2013-10-04 18:20:09.362 -0700,
	POWCHK enabled, PULCHK disabled,
       configuration hash MD5:
       C8 4E 4E 5D D3 5C D8 9E 9F 52 82 E0 59 8A DE 15
       data hash MD5: 64K
       1D 5E 4E 2E EA 34 4E 2C D9 10 29 AC A9 B0 25 3B>)
(   2,<2013-10-04 18:31:42.036 -0700>,<Administrator>,<X>,<proc1d>,<TOPSPIN 2.1>,
      <Start of raw data processing
       efp LB = 0.3 FT_mod = 6 PKNL = 1 PHC0 = 0 PHC1 = 0 SI = 128K 
       data hash MD5: 128K
       79 75 DE 67 23 EE 37 87 4D F8 C9 18 B1 35 4C 8D>)
(   3,<2013-10-04 18:31:42.989 -0700>,<Administrator>,<X>,<proc1d>,<TOPSPIN 2.1>,
      <pk PHC0 = -81.53503 PHC1 = 0 
       data hash MD5: 128K
       D3 F3 A9 43 F5 27 56 DE 40 80 C7 AB 64 86 1D C6>)
(   4,<2013-10-04 18:31:43.380 -0700>,<Administrator>,<X>,<proc1d>,<TOPSPIN 2.1>,
      <abs ABSG = 1 
       data hash MD5: 128K
       4D 59 E7 41 26 DD F8 94 E6 AA 39 5A 99 B9 F7 7D>)
(   5,<2013-10-04 18:31:43.489 -0700>,<Administrator>,<X>,<proc1d>,<TOPSPIN 2.1>,
      <abs ABSG = 2 
       data hash MD5: 128K
       F3 05 0E EF F9 A5 D8 3C 99 B7 58 B4 2F DE 8A 1E>)
(   6,<2013-10-04 18:31:43.567 -0700>,<Administrator>,<X>,<proc1d>,<TOPSPIN 2.1>,
      <abs ABSG = 3 
       data hash MD5: 128K
       0A AC A7 A8 54 77 7B 30 C5 0D 5E 6E 44 84 EE 35>)
(   7,<2013-10-04 18:31:43.645 -0700>,<Administrator>,<X>,<proc1d>,<TOPSPIN 2.1>,
      <abs ABSG = 4 
       data hash MD5: 128K
       4B C3 4E D4 67 4A B1 99 2E 4D DE 03 07 69 4E 13>)
(   8,<2013-10-04 18:31:43.723 -0700>,<Administrator>,<X>,<proc1d>,<TOPSPIN 2.1>,
      <abs ABSG = 5 
       data hash MD5: 128K
       93 AE F5 51 EC 00 62 C7 6F 7B 5E 0E B7 7A 46 1B>)
$$ ##END=
$$ 
$$ $$ hash MD5
$$ $$ 9F 0E 75 27 5D FA 28 D3 59 A1 53 C2 3D 08 89 1A
##$RELAX= 
##$RELAX= 
##$RELAX= 
##$RELAX= 
##$RELAX= 
##$RELAX= 
##$RELAX= 
##$RELAX= 
$$ Bruker specific parameters
$$ --------------------------
##$DU= <E:\>
##$EXPNO= 12
$$ [...]
##$TP07= 0
##$TPNAME0= <>
##$TPNAME1= <>
##$TPNAME2= <>
##$TPNAME3= <>
##$TPNAME4= <>
##$TPNAME5= <>
##$TPNAME6= <>
##$TPNAME7= <>
##$TPOAL= (0..7)
0.5 0.5 0.5 0.5 0.5 0.5 0.5 0.5
##$TPOFFS= (0..7)
0 0 0 0 0 0 0 0
##$TUNHIN= 0
##$TUNHOUT= 0
##$TUNXOUT= 0
##$USERA1= <user>
##$USERA2= <user>
##$USERA3= <user>
##$USERA4= <user>
##$USERA5= <user>
##$V9= 5
##$VALIST= <valist>
##$VCLIST= <CCCCCCCCCCCCCCC>
##$VD= 0
##$VDLIST= <DDDDDDDDDDDDDDD>
##$VPLIST= <PPPPPPPPPPPPPPP>
##$VTLIST= <TTTTTTTTTTTTTTT>
##$WBST= 2048
##$WBSW= 25
##$XGAIN= (0..3)
0 0 0 0
##$XL= 0
##$YL= 0
##$YMAX_a= 6500002
##$YMIN_a= -12704738
##$ZGOPTNS= <>
##$ZL1= 120
##$ZL2= 120
##$ZL3= 120
##$ZL4= 120
##$ABSF1= 14.96082
##$ABSF2= -5.597362
##$ABSG= 5
##$ABSL= 3
##$ALPHA= 0
##$AQORDER= 0
##$ASSFAC= 0
##$ASSFACI= 0
##$ASSFACX= 0
##$ASSWID= 0
##$AUNMP= <proc_prof1d_extract.lims>
##$AXLEFT= 0
##$AXNAME= <>
##$AXNUC= <1H>
##$AXRIGHT= 0
##$AXTYPE= 0
##$AXUNIT= <>
##$AZFE= 0.1
##$AZFW= 0.1
##$BCFW= 0
##$BC_mod= 0
##$BYTORDP= 0
##$COROFFS= 0
##$CY= 15
##$DATMOD= 1
##$DC= 0
##$DFILT= <>
##$DTYPP= 0
##$F1P= 0
##$F2P= 0
##$FCOR= 0.5
##$FTSIZE= 131072
##$FT_mod= 6
##$GAMMA= 0
##$GB= 0
##$INTBC= 1
##$INTSCL= 1
##$ISEN= 128
##$LB= 0.3
##$LEV0= 0
##$LPBIN= 0
##$MAXI= 10000
##$MC2= 0
##$MEAN= 0
##$ME_mod= 0
##$MI= 0
##$NCOEF= 0
##$NC_proc= -2
##$NLEV= 6
##$NOISF1= 0
##$NOISF2= 0
##$NSP= 0
##$NTH_PI= 0
##$NZP= 0
##$OFFSET= 14.96082
##$PC= 1
##$PHC0= -81.53503
##$PHC1= 0
##$PH_mod= 1
##$PKNL= yes
##$PPARMOD= 0
##$PPDIAG= 0
##$PPIPTYP= 0
##$PPMPNUM= 2147483647
##$PPRESOL= 1
##$PSCAL= 4
##$PSIGN= 0
##$PYNMP= <proc.py>
##$REVERSE= no
##$SF= 400.020009710259
##$SI= 131072
##$SIGF1= 0
##$SIGF2= 0
##$SINO= 400
##$SIOLD= 131072
##$SPECTYP= <>
##$SREGLST= <1H.CDCl3>
##$SSB= 0
##$STSI= 131072
##$STSR= 0
##$SW_p= 8223.68421052631
##$SYMM= 0
##$S_DEV= 0
##$TDeff= 65536
##$TDoff= 0
##$TI= <>
##$TILT= no
##$TM1= 0
##$TM2= 0
##$TOPLEV= 0
##$USERP1= <user>
##$USERP2= <user>
##$USERP3= <user>
##$USERP4= <user>
##$USERP5= <user>
##$WDW= 1
##$XDIM= 131072
##$YMAX_p= 396049238
##$YMIN_p= -11540
##$CURPLOT= <Network HP LaserJet P1505>
##$CURPRIN= <$Network HP LaserJet P1505>
##$DFORMAT= <normdp>
##$LAYOUT= <+/1D_H.xwp>
##$LFORMAT= <normlp>
##$PFORMAT= <normpl>
##$SURQMSG= 1
$$ End of Bruker specific parameters
$$ ---------------------------------
##NTUPLES= NMR SPECTRUM
##VAR_NAME=  FREQUENCY,     SPECTRUM/REAL,   SPECTRUM/IMAG
##SYMBOL=    X,             R,               I
##VAR_TYPE=  INDEPENDENT,   DEPENDENT,       DEPENDENT
##VAR_FORM=  AFFN,          ASDF,            ASDF
##VAR_DIM=   131072,        131072,          131072
##UNITS=     HZ,            ARBITRARY UNITS, ARBITRARY UNITS
##FACTOR=    0.0627417313425164, 1,          1
##FIRST=     8223.62146879497, -1253,        -65112
##LAST=      0,             971,             -65361
##MIN=       0,             -11540,          0
##MAX=       8223.62146879497, 396049238,    0
$$ Real data points
##PAGE= N=1
##DATA TABLE= (X++(R..R)), XYDATA
$$ [...]
67722 74234 74100 73115 72225 71780 71248 70212 68920 67812 67022 66503 66183 65836 65100 63889 62630 61917 62013 62749
67704 62749 63728 64534 64923 64998 65166 65734 66577 67248 67415 67125 66697 66436 66451 66625 66702 66444 65764 64794 63800 62961
67684 62961 62174 61130 59724 58408 58006 59028 61129 63312 64696 65076 64880 64675 64771 65132 65567 66029 66769
67667 66769 68076 69826 71441 72512 73277 74155 74914 74784 73569 72182 71729 72354 73408 74440 75437 76246
67651 76246 76495 76254 76125 76385 76573 76312 76048 76429 77327 78094 78523 78885 79120 78730 77634 76437 75608 74897
67633 74897 73912 72851 72253 72348 73030 74247 75961 77866 79510 80686 81432 81775 81793 81863 82525 83980 85877
67616 85877 87594 88637 88869 88598 88356 88398 88432 88026 87196 86414 86065 86093 86156 85929 85367 84809 84694 84926 84744 83584
67596 83584 81947 80985 81187 81897 82152 81585 80432 79053 77627 76049 74054 71707 69774 69149 69804 70779
67580 70779 71348 71644 71884 71641 70483 68886 67839 67667 67793 67571 66924 66175 65704 65737 66198 66733 67114 67454
67562 67454 67799 67820 67330 66808 66853 67264 67326 66946 66769 67079 67297 66886 66139 65581 65079 64117 62696 61433 60817
67543 60817 60806 61196 61979 63152 64372 65056 64904 64219 63588 63214 62772 62010 61225 60859 60828 60707 60480 60572 61048
67524 61048 61355 61128 60798 61047 61986 63229 64431 65351 65604 64885 63446 61952 60863 60203 59859 59761 59763 59714 59742
67505 59742 60205 61164 62141 62547 62222 61427 60488 59653 59245 59630 60896 62626 64170 65151 65646 65874 65891 65711
67487 65711 65552 65693 66086 66332 66101 65437 64595 63772 63042 62377 61609 60510 59075 57650 56678 56341 56451 56635
67469 56635 56615 56469 56663 57662 59373 61016 61706 61215 60194 59637 60062 61156 62252 63110 64013 65133 66203
67452 66203 67056 68018 69248 70031 69480 67845 66359 65719 65528 65421 65795 66842 67650 67146 65554 64125 63612
67435 63612 63707 63826 63782 63608 63355 63206 63378 63834 64368 64944 65568 65912 65566 64707 64070 64133 64676 65205 65426 65229
67415 65229 64577 63616 62652 61922 61590 61870 62799 63905 64540 64654 64802 65257 65596 65373 64766 64161 63434 62162
67397 62162 60380 58717 57826 57930 58920 60485 62057 62913 62656 61615 60655 60423 60778 61006 60588 59651 58658
67380 58658 57915 57521 57610 58280 59315 60203 60486 59994 58916 57856 57627 58561 60050 61162 61705 62283 63272 64253
67362 64253 64600 64198 63337 62336 61500 61124 61176 61287 61344 61719 62592 63369 63363 62868 62955 64176 65978 67468 68303
67343 68303 68594 68366 67543 66335 65286 64846 65024 65466 65783 65781 65491 65119 64957 65270 66205 67750 69724 71713
67325 71713 73125 73601 73505 73731 74744 75968 76436 75938 75121 74522 74051 73552 73279 73423 73555 73080 72073 71218
67307 71218 70946 70962 70693 69872 68694 67616 67099 67337 68147 69182 70205 71068 71553 71491 71008 70446 70046 69869
67289 69869 69999 70550 71385 72016 71928 71009 69685 68710 68709 69668 70850 71423 71260 70980 71129 71529 71541 70885 69990 69568
67269 69568 69936 70760 71458 71845 72342 73501 75294 77026 77989 78126 77955 77947 78100 78151 78043 78074 78587 79610 80815
67250 80815 81771 82198 82062 81514 80714 79662 78201 76324 74444 73174 72782 72970 73274 73516 73715 73718 73241 72305
67232 72305 71396 71048 71349 71937 72365 72413 72145 71787 71489 71143 70495 69565 68870 69000 69919 70917 71359 71321 71323 71598
67212 71598 71907 72039 72171 72634 73525 74703 75992 77249 78345 79162 79605 79599 79287 79216 79972 81423 82583 82545
67194 82545 81393 79947 78811 78005 77383 76987 76937 77254 77815 78295 78263 77565 76511 75454 74448 73660 73727 75002
67176 75002 76649 77335 76871 76371 76600 77075 77171 77214 77761 78528 78863 78862 79136 79754 80252 80559 81126 82133 83245
67157 83245 84194 84996 85581 85872 86267 87327 88817 89777 89856 89904 90816 92312 93451 93931 94243 94723 95057 94767
67139 94767 93771 92387 91114 90469 90708 91524 92226 92439 92520 93108 94294 95446 95940 95907 96019 96664 97603 98451
67121 98451 99099 99507 99522 99241 99291 100190 101547 102378 102273 101836 101908 102763 104168 105767 107170 107999 108194 108087 108028
67102 108028 108154 108599 109592 111048 112405 113189 113558 113931 114320 114423 114251 114170 114314 114432 114476 114945 116301 118325
67084 118325 120349 122032 123503 124736 125190 124380 122638 120955 120091 120100 120725 121928 123757 125951 128023 129706
67068 129706 131101 132438 133932 135833 138270 140970 143338 144947 145833 146366 146988 148069 149719 151624 153235
67053 153235 154277 154978 155771 156913 158345 159768 160857 161571 162252 163222 164388 165509 166726 168403 170489
67038 170489 172539 174465 176687 179316 181741 183441 184763 186422 188560 190787 192893 194975 197007 198818
67024 198818 200446 202035 203436 204376 205076 206288 208575 211841 215525 218952 221547 223189 224436 226039 228132
67009 228132 230260 232234 234486 237399 240754 244149 247543 251027 254370 257281 259965 262926 266263 269579
66995 269579 272604 275548 278721 282203 286077 290708 296360 302631 308594 313627 317866 321742 325380 328740
66981 328740 332135 336090 340650 345305 349884 355028 361318 368188 374365 379434 384409 390559 398130 406398
66967 406398 414545 422095 428838 434901 440835 447252 454308 461795 469684 478182 487202 496118 504330 511944
66953 511944 519710 528304 537841 548041 558654 569585 580640 591430 601721 611860 622636 634629
66941 634629 647806 661761 676151 690752 705325 719751 734326 749651 766056 783277 800804
66930 800804 818462 836539 855345 874719 894079 913019 931849 951439 972463 994863 1018114
66919 1018114 1041879 1066234 1091313 1117033 1143265 1170124 1197907 1226786 1256656 1287257 1318389
66908 1318389 1350045 1382370 1415463 1449234 1483527 1518383 1554035 1590597 1627895 1665755 1704365
66897 1704365 1744077 1784809 1825784 1866088 1905502 1944700 1984527 2025098 2065649 2105207 2143294
66886 2143294 2179984 2215538 2250178 2284047 2317050 2348721 2378537 2406405 2432549 2456794 2478373
66875 2478373 2496700 2512062 2525089 2535747 2543332 2547435 2548408 2546710 2542237 2534568 2523632 2509849 2493788
66862 2493788 2475842 2456079 2434162 2409568 2382211 2352797 2322384 2291514 2259897 2226812 2191723
66851 2191723 2154636 2116113 2076931 2037595 1998171 1958589 1918936 1879304 1839622 1799922 1760584
66840 1760584 1721967 1683901 1645975 1608257 1571235 1534966 1498822 1462342 1425909 1390253 1355636
66829 1355636 1321920 1289101 1257280 1226307 1196003 1166637 1138591 1111568 1084789 1058164 1032643
66818 1032643 1008935 986388 963740 940707 918162 896804 876345 856208 836390 817220 798675
66807 798675 780470 762655 745620 729494 713936 698545 683174 667731 652045 636186 620734
66796 620734 606461 593753 582383 571717 561063 549968 538404 526703 515314 504644 494985 486301
66784 486301 478071 469652 460935 452350 444100 435760 426931 417940 409499 401894 394930 388485 382566 376954
66770 376954 371354 365874 360781 355773 350185 344100 338531 334084 330014 325201 319649 314351 309904 305932
66756 305932 301828 297418 292764 287855 282814 278089 274145 271040 268391 265634 262312 258349 254162 250324
66742 250324 246999 243840 240494 237086 234104 231910 230410 229097 227347 224828 221788 218883 216548 214551
66728 214551 212288 209549 206836 204786 203325 201654 199151 196144 193591 192072 191309 190581 189360 187559 185477
66713 185477 183605 182180 180788 178717 175882 173047 170882 169143 167207 165138 163631 162908 162280 160984 159037
66698 159037 157030 155355 153915 152456 150927 149484 148270 147233 146288 145606 145505 145780 145480 143778 141037
66683 141037 138540 137118 136482 135966 135342 134624 133622 132202 130716 129666 129028 128340 127404 126513 125932 125519 124973
66666 124973 124216 123416 122807 122595 122871 123471 123942 123763 122716 121132 119693 118864 118471 118013 117397 117050 117186 117278
66648 117278 116646 115396 114347 114026 114102 113904 113160 112138 111251 110710 110382 109947 109291 108791 108933 109598 109950 109211
66630 109211 107387 105117 103054 101525 100544 99837 98954 97643 96117 94825 94019 93711 93858 94342 94837 95034
66614 95034 94972 94837 94507 93695 92632 92110 92586 93537 94011 93551 92313 90674 89217 88836 90049 92087 93307
66597 93307 92836 91422 90306 89647 88573 86528 84054 82160 81418 81768 82836 84139 85132 85407 84922 83997
66581 83997 83033 82268 81768 81525 81440 81186 80273 78530 76575 75514 75976 77531 79209 80410 81143 81561 81656 81444
66563 81444 81141 81026 81277 81951 82908 83731 83902 83198 81879 80494 79639 79705 80539 81374 81473 80963 80670 81020 81532
66544 81532 81581 81185 80646 79897 78835 78035 78340 79695 81026 81483 81241 80841 80329 79478 78435 77567 76897 76232
66526 76232 75711 75683 76040 76236 76085 76009 76268 76413 75926 75085 74700 75088 75693 75758 75086 74115 73446 73341 73550 73667
66506 73667 73699 74064 74829 75296 74788 73640 72838 72702 72611 72144 71732 71794 71892 71373 70410 69691 69359 68989 68480 68218
66486 68218 68315 68432 68541 69178 70526 71794 72066 71493 71147 71732 72806 73334 72737 71355 69998 69188 68861 68728
66468 68728 68699 68841 69146 69569 70114 70584 70437 69385 68081 67607 68211 69049 69351 69263 69297 69510 69680 69856 70202
66449 70202 70553 70595 70350 70078 69893 69779 69784 69881 69889 69874 70288 71251 72049 71957 71344 71232 71897 72647 73029 73432 74245 75078
66427 75078 75248 74567 73273 71600 69800 68315 67517 67439 67982 69131 70710 72154 72865 72718 72058 71381 71167
66410 71167 71699 72731 73522 73508 72853 72107 71554 71226 71317 72090 73314 74235 74242 73355 71982 70518 69284 68601 68600
66391 68600 69055 69618 70225 71085 72213 73141 73231 72292 70799 69492 68856 68984 69758 70915 72033 72730 73028 73378
66373 73378 74160 75239 76080 76277 75883 75300 74912 74808 74803 74726 74667 74845 75249 75514 75262 74527 73831 73770 74450 75254
66353 75254 75313 74366 73105 72531 73010 74038 74803 74776 73980 73040 72914 74053 75758 76728 76388 75335 74428 73911
66335 73911 73634 73537 73450 72863 71503 69912 68883 68450 67995 67269 66705 66702 67181 68031 69392 71120 72423 72503 71398
66316 71398 69827 68389 67272 66611 66619 67232 67951 68354 68597 69149 70090 70979 71492 71927 72818 74173 75401 75988
66298 75988 75945 75509 74728 73585 72306 71279 70783 70987 72041 73833 75757 77067 77460 77127 76296 75048 73573
66281 73573 72263 71373 70814 70416 70197 70323 70912 71924 73054 73763 73725 73322 73352 74010 74479 73885 72499 71554
66263 71554 71824 72730 73051 72298 71090 70255 69950 69810 69699 69898 70633 71767 73050 74271 75034 74871 73961 73356
66245 73356 73956 75414 76622 77111 77373 77816 78116 77818 77007 76053 75164 74508 74399 74994 76130 77699 79765
66228 79765 81983 83413 83465 82728 82301 82488 82695 82469 82064 81944 82160 82264 81565 79602 76750 74234 73110
66211 73110 73283 73959 74841 76218 77993 79452 80220 80740 81411 81890 81729 81234 81103 81498 82034 82513 83085 83696
66193 83696 83834 83051 81608 80477 80640 82190 84062 84901 84342 83228 82470 82129 81865 81809 82399 83531 84540
66176 84540 85004 85099 85089 84950 84693 84599 84830 85089 84962 84527 84347 84863 85928 86953 87482 87592 87662 87812 87807 87569
66156 87569 87482 87867 88440 88760 89048 89937 91322 92127 91554 90074 88791 88167 87888 87694 87753 88203 88810 89262 89576
66137 89576 90048 90946 92182 93210 93361 92507 91369 90921 91503 92664 93755 94397 94496 94213 93994 94272 95019 95859
66119 95859 96646 97525 98326 98372 97243 95432 93813 92710 91922 91502 91910 93301 95107 96560 97343 97586 97465
66102 97465 97088 96634 96352 96430 96906 97668 98486 99192 99880 100825 102146 103687 105279 106923 108527 109629 109640 108418
66084 108418 106527 104920 104374 105047 106378 107520 108034 108120 108075 107747 106802 105474 104581 104649 105259 105470 104755 103400
66066 103400 102076 101226 100819 100584 100386 100341 100525 100751 100823 100938 101475 102373 103112 103454 103865 104851 106126 106878 106758
66047 106758 106252 106062 106435 107122 107698 107831 107493 106992 106626 106270 105562 104538 103784 103801 104403 104949 105044 104911 105200
66028 105200 106521 108934 111830 114435 116507 118326 119954 120928 120958 120585 120672 121400 122171 122440 122264 122054 122232
66011 122232 123166 124994 127313 129386 130848 131961 133065 134114 135002 136009 137512 139386 141089 142286 143148
65996 143148 144077 145393 147278 149697 152344 154887 157363 160124 163286 166359 168574 169527 169516 169312 169567 170296
65980 170296 170918 170860 170051 168723 166934 164586 161823 158981 156117 153068 150072 147815 146520 145453 143848
65965 143848 141918 140352 139086 137431 135423 134132 134230 134957 135114 134627 134458 135189 136412 137521 138508 139727
65949 139727 141317 143158 145202 147590 150507 153978 157743 161300 164268 166705 168971 171275 173605 176054
65935 176054 178839 181783 184087 185032 184829 184538 185072 186451 187969 188917 189154 189210 189985 192193 195867 200266
65919 200266 204338 207408 209595 211588 214039 217128 220700 224601 228762 233032 237169 240971 244257 246781
65905 246781 248464 249710 251110 252726 254038 254797 255474 256499 257475 257672 257112 256500 256155 255633 254510 252904
65889 252904 250897 248021 243790 238485 232953 227798 223091 218697 214497 210316 206036 201826 198040 194874
65875 194874 192272 190086 188076 185912 183530 181484 180545 180847 181705 182404 182840 183234 183603 183887 184333 185277 186458
65858 186458 186961 186006 183671 180736 177992 175811 174171 172864 171689 170659 170053 170078 170407 170238 169053 167292
65842 167292 166029 165875 166351 166471 165795 164738 163949 163736 164160 165336 167312 169782 172266 174599 176968 179404
65826 179404 181550 183202 184896 187613 191846 197209 202964 208687 214318 219852 225250 230510 235545 240012
65812 240012 243500 245873 247204 247421 246376 244390 242363 240993 240021 238607 236428 234139 232696 232400 232695
65797 232695 232697 231814 230041 227893 226129 225398 225896 227225 228589 229379 229724 230414 232202 235266 239481 244995
65781 244995 252137 260708 269783 278527 287068 296332 307080 319292 332367 345633 358593 370890 382194
65768 382194 392034 399663 404161 404877 401839 395736 387417 377390 365842 353153 340293 328550 318870
65755 318870 311565 306614 304037 303895 306196 310994 318404 328278 340065 353329 368379 385995 406433
65742 406433 429009 452730 476928 500986 523799 543955 560406 572665 580453 583585 582244 576967
65730 576967 568175 555938 540364 521946 501343 479040 455530 431648 408347 386124 364916 344606
65718 344606 325406 307669 291560 277068 264193 252947 243257 234940 227681 221040 214661 208660 203591
65705 203591 199836 197123 194870 192890 191440 190592 189943 189045 187837 186529 185338 184585 184728 185910 187605
65690 187605 189046 189958 190587 191125 191587 192288 193900 196714 200178 203530 206737 210468 215220 220827 226833
65675 226833 233125 240216 249068 260588 274959 291437 309059 327645 347883 370395 395085 421497
65663 421497 449399 478504 507874 536153 562493 586870 609319 629207 645540 657791 666202 671434
65651 671434 674282 675639 676315 676631 676374 675342 673887 672803 672717 673648 675021 675931 675351 672283 665886 655576
65635 655576 641093 622539 600351 575186 547805 518982 489435 459812 430754 402937 376865
65624 376865 352582 329819 308563 289315 272541 258039 245227 233910 224350 216550 209981 204236
65612 204236 199496 195944 193096 190175 186996 183988 181422 179106 176875 174939 173569 172751 172272 171916 171450
65597 171450 170742 170045 169899 170512 171412 171878 171652 171173 171295 172817 175943 179995 183876 187076 190155 194099
65581 194099 199465 206268 214338 223364 232888 242806 253902 267425 283980 303086 323837 345718 368712
65568 368712 392919 418211 444073 469625 493932 516310 536178 552700 564930 572400 575188 573225
65556 573225 565902 552764 534458 512649 488996 464440 439370 414098 389036 364656 341517 320219
65544 320219 301150 284289 269340 256065 244392 234242 225453 217987 212145 208335 206495 205832 205247
65531 205247 204124 202711 201744 201617 201879 201551 199999 197489 194760 192185 189542 186569 183342 179963 176228
65516 176228 171975 167537 163574 160561 158738 158263 158924 159809 159945 159422 159402 160736 162973 165019 166358 167275
65500 167275 168165 169157 170274 171491 172542 172997 172676 171804 170765 169955 169919 171296 174340 178523 182887 186898
65484 186898 190889 195513 200840 206197 210909 214909 218368 221002 222200 221868 220710 219493 218297 216664
65470 216664 214231 211003 207192 203023 198591 193816 188718 183787 179770 176888 174537 172011 169306 166921
65456 166921 165087 163629 162442 161685 161438 161512 161700 162011 162573 163420 164444 165491 166489 167448 168256 168596 168457
65439 168457 168714 170681 174623 179090 182217 183583 184382 185956 188592 191651 194397 196625 198766 201337 204051
65424 204051 205732 205514 203864 201895 199939 197523 194605 191912 189894 188252 186819 186146 186687 188018 189344
65409 189344 190309 190831 190683 189826 188755 187895 187035 185950 185254 185902 187957 190514 192806 194811 196759 198698
65393 198698 200639 202654 204682 206547 208248 209908 211426 212491 212936 212741 211751 209836 207341 204915 202836
65378 202836 200896 199000 197405 196214 195168 194162 193585 193827 194745 195951 197316 198887 200518 201959 203227
65363 203227 204608 206372 208716 211857 215957 220935 226516 232478 238805 245699 253456 262126 271256 280151
65349 280151 288533 296690 304795 312366 318636 323261 326368 328106 328553 327951 326595 324433 321103 316469 310852
65334 310852 304641 297927 290669 282955 274896 266443 257566 248600 240243 233175 227670 223523 220276 217622
65320 217622 215641 214554 214223 214036 213430 212388 211219 209898 207917 204879 201032 197111 193741 191099 188995
65305 188995 187111 185197 183220 181359 179793 178536 177561 177056 177403 178852 181291 184339 187596 190842 194137
65290 194137 197674 201355 204568 206619 207413 207470 207180 206424 205086 203578 202408 201439 200065 198101 196031 194341
65274 194341 193031 191987 191432 191643 192425 193237 193851 194609 195946 197806 199699 201341 203120 205725 209305 213177
65258 213177 216581 219528 222628 226185 229866 233288 236403 239104 240836 240999 239478 236499 232180 226696
65244 226696 220759 215368 210869 206596 201713 196281 191322 187854 185989 184993 184139 183351 182970 183091 183453 183978
65228 183978 185004 186671 188420 189438 189488 188952 188186 187310 186562 186343 186703 187201 187469 187595 187700 187501 186637 185252
65210 185252 183912 183112 183130 184178 186239 188755 190897 192252 193023 193500 193673 193502 193185 192853 192212 190809 188632
65193 188632 186215 184199 182964 182595 182904 183522 184218 185207 186882 189167 191438 193211 194593 195828 196724 196943
65177 196943 196643 196378 196419 196642 197059 197968 199338 200518 200855 200309 199219 197872 196591 195865 195840 195900 195336 194382
65159 194382 194067 195022 196896 199004 201063 203099 205070 206921 208712 210466 212090 213647 215442 217670 220227
65144 220227 223131 226884 232186 239429 248615 259454 271240 282943 293899 304321 314864 325847
65132 325847 337178 348734 360264 371045 380300 388053 395049 401719 407775 413060 418139 423566 428963
65119 428963 433452 436683 438812 439557 438046 433803 427298 419188 409497 398062 385461 372844 360800
65106 360800 348934 336714 324298 312188 300419 288590 276625 265093 254662 245592 237850 231447
65094 231447 226428 222615 219556 216707 213681 210455 207400 204949 203150 201686 200375 199443 199164 199460 199990
65079 199990 200470 200743 200742 200515 200103 199280 197732 195732 194223 193843 194179 194523 195012 196416 198912 201778 204336
65062 204336 206460 208094 208968 209136 209195 209664 210606 212109 214454 217360 219666 220395 219791 218753 217658 216353
65046 216353 214957 213879 213115 212186 210803 209100 207224 205206 203252 201674 200525 199696 199291 199374 199385 198413
65030 198413 196159 193135 189842 186340 182731 179476 176910 174911 173298 172149 171485 171076 170833 170969 171506
65015 171506 172094 172573 173289 174507 175972 177463 179354 182112 185586 189278 193062 197126 201482 206027 210857
65000 210857 215978 220931 225232 228974 232450 235367 237155 237958 238557 239265 239647 239559 239740 240976 243142 245541
64984 245541 247839 250342 253564 257800 262900 268178 272720 275956 277869 278634 278330 277047 274874 271634 267015
64969 267015 261172 254883 248864 243203 237689 232358 227433 223039 219280 216352 214256 212636 211211 210122
64955 210122 209557 209286 208943 208471 207883 206854 205112 203110 201709 201222 201214 201291 201525 201983 202360 202342 202029 201766 201765
64936 201765 201989 202218 202148 201715 201376 201791 203134 204945 206711 208256 209511 210303 210586 210507 210034 208798 206551
64919 206551 203613 200681 198420 197305 197462 198403 199280 199756 200295 201361 202704 203913 205245 207286 209965
64904 209965 212637 215115 218053 222145 227510 233966 241408 249633 258259 267095 276350 286208 296417 306454
64890 306454 315844 324216 331483 338242 345694 354755 365310 376450 387220 396910 404955 410953 414722
64877 414722 416073 414644 410221 403124 394044 383660 372694 362119 352858 345238 339010 333862 329639
64864 329639 326144 323111 320438 318084 315682 312604 308518 303596 298052 291773 284597 276754 268817 261313
64850 261313 254478 248186 242047 235718 229269 223132 217650 212856 208685 205160 202269 199962 198380 197789
64836 197789 198116 198798 199376 199956 200826 201870 202704 203184 203342 202945 201639 199639 197923 197517 198737 201113 203826
64819 203826 206209 208115 209961 212298 215304 218872 223082 228227 234311 240872 247519 254307 261446 268939
64805 268939 276792 285243 294298 303112 310299 315039 317627 318852 319108 318225 315956 312383 307871 302790 297314
64790 297314 291484 285515 280030 275827 273318 272211 271786 271438 270986 270668 270929 272066 273871 275690 276983
64775 276983 277797 278584 279690 281294 283771 287644 293013 299353 306160 313592 322192 332049 342563 353028
64761 353028 363184 373137 382935 392332 400895 408325 414776 420792 426834 432978 439204 445786 453071 461003
64747 461003 469179 477301 485105 491803 496177 497453 495717 491230 483797 473216 460071 445571 430781
64734 430781 416330 402728 390445 379718 370611 363252 357670 353423 349742 346125 342578 339341 336679
64721 336679 334895 334215 334607 335944 338363 342168 347395 353730 360827 368407 376164 383972 392128 400829 409257
64706 409257 415724 419005 419146 416736 411853 404161 393724 381233 367574 353553 339962 327435 316176
64693 316176 306018 296781 288470 281186 275008 269908 265678 262125 259445 258158 258422 259573 260678 261467
64679 261467 262427 264079 266498 269546 273182 277372 281963 286914 292592 299560 307935 317028 325797 333697
64665 333697 340858 347255 351985 353884 352860 350053 346473 342003 336166 329414 322963 317520 312782 308276
64651 308276 304169 301090 299528 299557 300826 302629 304261 305620 307381 310430 315104 320969 327261 333559 340135
64636 340135 347659 356560 366824 378475 391874 407196 423823 440644 456779 471519 483783 492421
64624 492421 497230 499001 498256 494466 486897 475691 461665 445550 428084 410533 394251 379648 366159
64611 366159 353384 341802 332166 324586 318485 313219 308496 304380 301101 298748 296989 295143 292725 289905
64597 289905 287324 285468 284310 283600 283413 284257 286489 289707 292991 295979 299523 304927 312533 321362 330282
64582 330282 339239 349130 360700 373920 388355 403746 420030 436971 453997 470402 485615 499320
64570 499320 511371 521593 529642 535081 537540 536722 532289 524002 512183 497868 482212 465720 448341
64557 448341 430308 412531 395931 380679 366414 353103 341296 331549 323903 318030 313588 310278
64545 310278 307779 305845 304406 303425 302801 302615 303325 305413 308733 312380 315304 316948 317209 315950 312846
64530 312846 307863 301701 295535 290213 285802 281916 278257 274713 271188 267679 264544 262380 261520 261790 262748
64515 262748 263954 264953 265375 265317 265441 266396 268218 270483 272945 275705 278852 282269 285882 289849 294360 299496
64499 299496 305379 312228 320035 328374 336767 345191 353944 362990 371623 378871 384084 387091 388009 387132 385049
64484 385049 382668 380946 380423 380989 382144 383541 385283 387592 390251 392509 393522 392741 389931 385165 379063
64469 379063 372736 367108 362283 357846 353736 350470 348522 347914 348571 350661 354226 358757 363466 367735 371010
64454 371010 372560 371935 369593 366510 363115 359113 354506 350218 347322 346024 345836 346471 348070 350680 354115
64439 354115 358517 364572 372745 382448 392468 402335 413029 426057 442034 460565 481413 505214
64427 505214 532807 564442 600312 641558 689916 746290 810511 882800 964752 1058260 1163818
64416 1163818 1280250 1405472 1536663 1669991 1801268 1927333 2046422 2157076 2257149
64407 2257149 2343989 2415079 2468254 2501829 2515065 2508439 2483174 2440526 2381499 2306897 2217388
64396 2217388 2113751 1997543 1871531 1739355 1604766 1471249 1342079 1220263 1108162
64387 1108162 1007088 917167 837647 767582 706518 654449 611026 574988 544616 518665 496669
64376 496669 478413 463431 451042 440668 432029 425099 419820 415673 411583 406483 400063 392819 385366
64363 385366 377905 370342 362631 354791 346807 338763 330973 323811 317464 311986 307539 304391 302699 302396
64349 302396 303308 305294 308299 312309 317160 322309 326957 330546 333058 334648 335147 334199 331710 327819 322523
64334 322523 315895 308785 302648 298195 294637 290825 286853 283926 282783 283022 284015 285641 287670 289210 289605
64319 289605 289608 290772 293625 297091 299919 302134 304724 308324 312689 317182 321266 324457 326208 326065 323918
64304 323918 320025 314904 309035 302550 295224 287015 278579 271011 264963 260146 255753 251202 246433 241774
64290 241774 237687 234517 232278 230742 229833 229757 230600 232108 234168 237246 241845 247595 253463 258938 264476
64275 264476 270555 276880 282959 289035 295835 303570 311672 319383 326075 331113 334118 335505 336232 336771 336769
64260 336769 335892 334474 332989 331435 329806 328783 329198 330749 331791 330608 326640 320515 313293 305797 298294
64245 298294 290498 282049 273153 264706 257640 252262 248260 245172 242710 240806 239563 239131 239446 240082 240494
64230 240494 240485 240367 240582 241226 242039 242842 243806 245152 246663 247777 248216 248298 248457 248636 248446 247835 247245 246961 246606
64211 246606 245497 243442 240928 238531 236374 234275 232297 230889 230424 230768 231490 232372 233464 234649 235494
64196 235494 235722 235640 235934 237175 239656 243473 248465 254268 260824 268778 278936 291207 304508 317866
64182 317866 331237 344869 358142 369518 377742 382717 385087 385147 382464 376528 367593 356715 345015
64169 345015 333133 321449 310556 301098 293114 285862 278558 271140 264150 258007 252653 247897 243812
64156 243812 240630 238405 236978 236250 236257 236882 237732 238570 239810 242191 245809 249819 253425 256935 261358 267024
64140 267024 273065 278363 282554 285853 288337 289801 290107 289229 287044 283515 279149 274933 271601 269138 267139
64125 267139 265525 264730 265156 266581 268279 269754 271326 273813 277668 282579 288023 293969 300874 309082 318392
64110 318392 328179 337781 346820 355320 363463 371126 377742 382820 386529 389573 392531 395571 398761 402323
64096 402323 406473 411298 416916 423521 430967 438465 444909 449517 452038 452520 451153 448306 444329 439153
64082 439153 432312 423609 413664 403499 393619 383781 373756 363993 355222 347591 340605 333879 327523 321737
64068 321737 316554 312270 309607 308851 309100 308986 308165 307507 307774 308767 309992 311497 313505 315691 317486 318941
64052 318941 320640 322828 325204 327676 330736 334774 339401 343844 347908 352260 357759 364677 372505 380439
64038 380439 388045 395476 403004 410486 417415 423377 428115 431204 432116 430827 428014 424418 420241 415440
64024 415440 410348 405698 402149 400060 399508 400209 401591 403319 405538 408165 410115 409908 407080 402442 396830
64009 396830 390320 382946 375447 368589 362214 355744 349463 344500 341359 339130 336496 333153 329871 327411
63995 327411 325785 324567 323639 323407 324325 326291 328615 330617 332143 333479 334937 336713 339005 341887 345096
63980 345096 348178 350986 353797 356930 360422 364164 368163 372525 377344 382684 388530 394653 400666 406402
63966 406402 412107 418168 424732 431773 439444 448160 458307 470000 483188 497928 514440 532867 553087
63953 553087 575031 599274 627082 659561 696855 738572 785044 837827 898767 968927 1048678
63942 1048678 1138495 1239128 1350948 1473449 1605486 1745823 1893365 2047026 2205423 2366602
63932 2366602 2528029 2686863 2840170 2984735 3116859 3232739 3329271 3404459 3457086 3486227
63922 3486227 3491272 3472297 3430132 3365912 3280723 3175956 3054111 2918995 2774716 2624357
63912 2624357 2469867 2313283 2157650 2006324 1861599 1724479 1595737 1476661 1368503
63903 1368503 1271593 1185382 1109214 1042739 985617 937179 896488 862578 834466 811034 791091
63892 791091 773693 758397 745110 733549 722883 712075 700719 689441 679288 670731 663468 657222
63880 657222 652455 650016 650147 652108 654909 658294 662994 670206 680915 695531 713854 735386 759796
63867 759796 787113 817418 850486 886022 924151 965310 1009543 1056183 1104433 1154030 1205090
63856 1205090 1257369 1309903 1361305 1410285 1456000 1498164 1536809 1571813 1602573 1628152 1647632
63845 1647632 1660268 1665548 1663374 1654113 1638313 1616468 1589120 1556890 1520014 1478066 1430654 1378406
63833 1378406 1322818 1265073 1205501 1144444 1083107 1023086 965323 910016 857478 808600 764260
63822 764260 724486 688333 654568 622519 592472 565229 541181 519769 499971 481300 464189
63811 464189 449381 437046 426514 416761 407077 397358 387903 379035 370919 363678 357523 352655 349019
63798 349019 346174 343429 340178 336268 332133 328487 325625 322971 319401 314255 308121 302512 298577 296113
63784 296113 293967 291409 288825 286950 285762 284589 283148 281878 281099 280357 279011 277137 275364 273964 272611
63769 272611 271069 269646 268767 268392 268098 267546 266687 265637 264554 263569 262663 261621 260225 258495 256672 255040
63753 255040 253851 253373 253787 254948 256324 257256 257382 256835 256142 255898 256450 257737 259417 261174 262924 264732
63737 264732 266610 268496 270414 272502 274771 276964 278869 280702 283026 286208 290092 294225 298244 301956
63723 301956 305281 308349 311507 315018 318808 322701 326795 331287 335953 340127 343302 345418 346424 345984
63709 345984 344027 341403 339440 338711 338469 337439 335013 331623 328203 325440 323464 322065 321143 320913 321567
63694 321567 322839 324175 325449 327235 330186 334249 338694 342729 345941 348319 350220 352176 354336 356065
63680 356065 356509 355745 355056 355782 358075 360957 363362 364882 365725 366378 367361 368999 371275 373920 376627 379101
63664 379101 381017 382226 382984 383758 384663 385157 384330 381549 376939 371382 365941 361118 356708 352434 348484
63649 348484 345150 342172 338953 335453 332422 330591 329995 330287 331348 333291 336124 339723 344020 348949 354333
63634 354333 360033 366044 372254 378321 384078 389835 395886 401875 407135 411687 416418 422092 428566 435216
63620 435216 441849 448928 457045 466505 477357 489581 503183 518288 535167 554093 575094 597966
63608 597966 622569 649044 677573 707906 739267 770748 801636 831220 858462 882187 901586
63597 901586 916287 925963 930373 929888 925527 918173 908184 896131 883383 871181 859308 846367 831350
63584 831350 814231 795076 773533 749655 724535 699478 674999 651170 628594 608320 590885
63573 590885 576004 563205 552287 543154 535712 530101 526692 525661 526744 529451 533386 538365 544452
63560 544452 551864 560605 570213 580048 589883 600027 610988 623212 637070 652826 670714 691304
63548 691304 715627 744572 778288 816694 860348 909881 964104 1019279 1070766 1115112 1150263
63537 1150263 1174520 1186492 1186332 1176340 1159924 1140074 1118855 1097845 1078427 1061446 1046641 1032618
63525 1032618 1017524 999887 978930 954382 926352 895427 862553 828577 794101 759878 726972
63514 726972 696158 667410 640378 615210 592460 572244 554021 537290 522076 508594 496798
63503 496798 486458 477343 469088 461193 453462 446206 439730 433696 427322 420189 412633 405363 398916 393530
63489 393530 389342 386463 384801 383938 383332 382820 382871 384179 386982 390804 394855 398588 401963 405385 409409
63474 409409 414293 419734 425165 430239 434812 438517 440758 441346 440865 440175 439714 439423 439086 438505 437554 436384
63458 436384 435419 434929 434742 434662 434941 435913 437291 438317 438720 439049 439939 441464 443463 446205 450332 456256 463945
63441 463945 473214 483949 495977 509074 523389 539824 559786 584486 614508 649995 690836 736220
63429 736220 783962 830645 872709 907448 933152 948990 955341 954115 948199 940428 933192 928693 928881
63416 928881 934884 946838 964499 987653 1015660 1046851 1078706 1108628 1134535 1155065 1169561 1177845
63404 1177845 1179936 1176182 1167718 1156352 1143604 1129944 1115211 1099369 1082335 1063318 1041113 1015326
63392 1015326 986766 956362 924173 889949 854386 819217 785954 754866 725322 696895 669951
63381 669951 645268 623283 603853 586699 571943 560041 551277 545554 542709 542676 545110 549138 553920
63368 553920 559413 566261 575040 585997 599425 615662 634498 655227 677650 702566 730740 761817
63356 761817 794951 830189 868300 909187 951360 993271 1034348 1074212 1111518 1144203 1170509
63345 1170509 1189294 1199933 1202810 1199727 1192971 1183835 1172519 1159312 1145092 1130546 1115530 1099384
63333 1099384 1081314 1060348 1035619 1007136 975927 943215 909944 877196 846299 817954 791879
63322 791879 767965 747335 731558 721182 715770 714880 717828 722355 724662 721378 711121 694048 670826
63309 670826 642728 612133 581904 554047 529197 507180 487630 470194 454665 441155 429882
63298 429882 420709 413090 406458 400437 394671 388827 382955 377615 373373 370212 367593 365029 362422 359891
63284 359891 357487 355164 352891 350669 348505 346506 344923 343977 343624 343605 343761 344143 344776 345465 345996 346420 346974
63267 346974 347731 348501 349146 349860 351093 353214 356221 359722 363177 366309 369322 372661 376564 380922 385489
63252 385489 390047 394350 398260 402098 406625 412364 419050 425983 432813 439658 446564 453382 460398 468617
63238 468617 478962 491350 504933 519147 534141 550120 566722 583291 599626 616257 634008
63227 634008 653273 673561 693713 712784 730850 748821 767357 786186 804636 822636 840827
63216 840827 859743 879138 898197 916191 932810 947938 961261 972113 979654 983141 982116 976573
63204 976573 967099 954595 939494 921359 899659 874982 848981 823047 797614 773051 750494 731144
63192 731144 715132 701805 690890 682680 677243 674305 673971 676813 683045 692175 703622 717084 732150
63179 732150 748214 764996 782553 800484 817813 834021 849533 864727 879085 891938 903505
63168 903505 914432 924614 933197 939595 943888 946347 947015 945585 941198 932632 919241 901614 880880
63155 880880 857636 832083 804858 776891 748589 719971 691648 664916 640702 619056 599742
63144 599742 582652 567436 553423 540307 528425 518101 509134 501182 494186 488172 483053 478869 475819
63131 475819 473782 472154 470409 468515 466664 465004 463827 463533 464154 465368 467195 470201 474685 480174 486049
63116 486049 492130 498210 503627 507954 511672 515438 519010 521656 523441 525271 527666 530212 532369 534162
63102 534162 535829 537389 538904 540760 543275 546220 549065 551593 554133 557268 561435 566603 572214 577502
63088 577502 581988 585641 588529 590528 591428 591196 589982 587948 585229 582079 578931 576238 574309 573321 573408
63073 573408 574593 576613 579111 582196 586563 592754 600432 608829 617848 628228 640477 654206 668784
63060 668784 684233 701122 719981 741200 765162 791962 821150 852226 885257 920651 958535
63049 958535 998797 1041520 1086801 1134140 1182584 1231516 1280884 1330534 1379886 1428420 1476084
63038 1476084 1523023 1569278 1614958 1660389 1705789 1750988 1795632 1839402 1881809 1921868 1958187
63027 1958187 1989263 2013707 2030401 2038613 2037824 2027464 2007082 1976877 1937825 1891196 1838211 1780301
63015 1780301 1719379 1657549 1596623 1538104 1483405 1433805 1390158 1352804 1321751 1296983 1278728
63004 1278728 1267425 1263171 1265154 1271962 1282625 1297097 1315492 1337189 1361070 1386394 1412881 1439952
62992 1439952 1466433 1491312 1514544 1536810 1558655 1580115 1601109 1621704 1641643 1659752 1674287
62981 1674287 1684126 1689413 1690709 1687624 1678628 1662261 1638202 1607141 1570029 1527800 1481506 1432352
62969 1432352 1381528 1330171 1279361 1229942 1182396 1137066 1094383 1054740 1018239 984741 954055
62958 954055 925850 899567 874750 851410 829805 809866 791158 773340 756301 739770 723292
62947 723292 706888 691387 677598 665232 653079 640380 627732 616396 606905 598581 590367 581875
62935 581875 573529 565996 559682 554653 550629 547018 543229 539187 535348 532088 529353 527091 525716 525621 526380
62920 526380 526960 526805 526207 525495 524465 523009 521780 521582 522308 523113 523544 523875 524280 524390 524002 523624 523775 524069
62902 524069 523545 521861 519668 517886 517076 517509 519295 522110 525163 527755 529732 531241 532310 532963 533479
62887 533479 534060 534274 533302 530932 528029 525808 524828 524842 525427 526388 527568 528635 529281 529569 529898 530575 531409
62870 531409 531743 530923 528822 525939 522910 519954 516827 513311 509598 506147 503278 501038 499336 498030 496943
62855 496943 496024 495517 495753 496641 497616 498233 498665 499327 500143 500534 500226 499783 500059 501210 502459 502899 502424 501731
62837 501731 501459 501510 501336 500763 500313 500686 502152 504457 507056 509330 510856 511726 512470 513470 514641 515860
62821 515860 517398 519534 522013 524399 526791 529649 532940 536054 538640 540901 542945 544520 545731 547426
62807 547426 550322 554135 558046 561755 565644 570180 575597 581911 588819 595819 602847 610537 619427 629276
62793 629276 639710 651177 664480 679563 695680 712803 731946 753904 778557 805865 836806
62782 836806 872656 913764 959628 1009839 1064435 1123542 1187214 1255508 1328201 1404377 1482591
62771 1482591 1561469 1639862 1716452 1789433 1856697 1916273 1966651 2006804 2035862 2052718 2056186
62760 2056186 2045745 2022126 1987022 1942284 1889349 1829231 1762911 1691790 1617790 1542847 1468264
62749 1468264 1394726 1322893 1253627 1187496 1124502 1064716 1008963 958469 913770 874179 838289
62738 838289 804926 773771 745254 719856 697465 677590 660085 645252 633050 622698 613381 604996
62726 604996 597785 591593 586054 581274 577643 575084 573119 571793 571908 574059 577907 582634 587771 593300
62712 593300 599364 606296 614759 625392 638280 653029 669442 687967 709357 733951 761405 791251
62700 791251 823669 859500 899379 943063 989789 1039085 1090912 1145201 1201686 1260172 1320398
62689 1320398 1381373 1441196 1497779 1549563 1595404 1634081 1664249 1684782 1694994 1694671 1684005 1663354
62677 1663354 1633015 1593491 1546074 1492791 1435484 1375245 1313050 1250549 1189622 1131260 1075418
62666 1075418 1021974 971332 923949 879869 839021 801669 768155 738385 711844 688007 666484
62655 666484 646915 629057 612985 598954 586981 576685 567526 559004 550622 541901 532650 523184 514204
62642 514204 506406 500103 495148 491179 488000 485620 483836 482038 479812 477740 477130 478598 481216 483359
62628 483359 484188 483932 482998 481459 479506 477766 476737 476219 475665 474898 474169 473738 473746 474357 475625 477270 479018
62611 479018 481163 484432 489148 494876 501023 507439 514174 521029 527820 535028 543700 554532 567306 581453
62597 581453 596968 614527 634728 657558 682716 710186 740190 772649 807113 843249 880947
62586 880947 919609 957680 993339 1025574 1054115 1078366 1096973 1108620 1112876 1110046 1100629 1085222
62574 1085222 1064660 1039829 1011501 980618 948395 915705 882553 848703 814749 782007 751297
62563 751297 722398 695000 669673 647427 628467 611819 596198 581104 567109 555191 545718 538001
62551 538001 530928 524076 517988 513275 509738 506555 503115 499374 495666 492500 490403 489534 489469 489690 490264
62536 490264 491611 493663 495664 496963 497573 497761 497531 496899 496370 496760 498568 501802 506271 511746 517988 525034
62520 525034 533473 544161 557502 573165 590550 609421 630122 653379 679872 709728 742298 776523
62508 776523 811610 847329 883692 920442 956896 992097 1025096 1055125 1081559 1103664 1120569
62497 1120569 1131701 1137273 1138153 1135199 1128870 1119550 1108125 1096167 1085586 1078013 1074288 1074405 1078009
62484 1078009 1084959 1095366 1109255 1126528 1147318 1172033 1200711 1232307 1264704 1295438 1322525
62473 1322525 1344847 1361938 1373372 1378347 1375880 1365323 1346518 1319632 1285209 1244460 1199014 1150082
62461 1150082 1098168 1043911 988987 935676 885561 838964 795619 755498 718890 686107 657434
62450 657434 633129 613113 596651 582642 570375 559873 551388 544742 539384 535101 532342 531625 532805
62437 532805 535185 538290 542205 547082 552591 557978 562543 565890 567863 568354 567152 563958 558687 551770
62423 551770 544003 536095 528474 521385 514834 508421 501694 494785 488308 482487 476891 471358 466560 463072
62409 463072 460303 457069 453028 448899 445396 442691 440817 439754 438957 437609 435764 434537 434743 435848 436831
62394 436831 437586 438900 441353 444803 448785 452827 456525 459801 463033 466489 469801 472506 474981 478188
62380 478188 482507 487474 492744 498564 505048 511794 518718 526622 536198 546909 557652 568260 579494
62367 579494 591656 604207 616988 630918 646965 665048 684668 706276 731328 760995 795263
62356 795263 833293 874316 918196 965441 1016646 1071626 1128958 1186439 1241840 1293173 1338694
62345 1338694 1377195 1408180 1431331 1445913 1451235 1447671 1436664 1419610 1397180 1369753 1337955 1302527
62333 1302527 1264162 1223762 1182475 1141276 1100795 1061682 1024626 989928 957613 928211 902607
62322 902607 880611 860335 839749 818424 797054 775781 754035 731805 710013 689414 669945
62311 669945 651420 634172 618640 604807 592290 580619 569278 558003 547288 538224 531512 526831
62299 526831 523278 520081 516844 513608 510916 509423 509174 509555 510116 511066 512720 514837 516853 518548 520248
62284 520248 522520 525757 529796 533871 537291 540281 543748 548105 552811 557213 561237 564953 568162 571008
62270 571008 574452 579455 586004 593577 602172 612167 623470 635775 649632 666374 686784 710584 737513
62257 737513 768175 803369 843122 886974 934891 987297 1044145 1104277 1165714 1226407 1284637
62246 1284637 1338791 1386884 1426677 1456642 1476757 1487964 1490756 1484723 1469623 1446322 1416248 1380236
62234 1380236 1338462 1291385 1240243 1186572 1131688 1076817 1023328 972460 924913 880960 840862
62223 840862 804882 772861 744125 718069 694749 674574 657396 642178 627807 614097 601693
62212 601693 591028 581679 572888 564454 556840 550491 545287 540742 536523 532637 529192 526135 523329 520802
62198 520802 518901 518133 518812 520808 523667 527078 531221 536559 543207 550635 558144 565574 573405 582196 592083
62183 592083 602827 614063 625414 636548 647333 657819 667976 677551 686386 694704 702861 710979
62171 710979 719156 728029 738729 752096 768234 787096 809262 835773 867240 903359 943329 986497
62159 986497 1032455 1080643 1129898 1178317 1223573 1263664 1297526 1324876 1345499 1359021 1365564 1366212
62147 1366212 1362327 1354408 1342068 1325064 1303828 1278848 1250179 1218093 1183868 1149336 1115733 1083465
62135 1083465 1052985 1025280 1001183 980512 962272 945696 930885 918465 908743 901320 895576 891435
62123 891435 889441 890060 893170 898378 905483 914296 924252 934707 945542 956949 968561 979225 987721
62110 987721 993282 995374 993568 988048 979921 970663 961402 952843 945404 938984 932932 926755 920838 916093
62096 916093 912952 911121 910332 910934 913562 918408 925039 932858 941564 951063 961010 970737 979799 988421 997063
62081 997063 1005710 1014026 1022271 1031511 1042726 1056118 1071512 1088981 1108569 1129770 1151762 1174046
62069 1174046 1196441 1218626 1240139 1260760 1280545 1299535 1317749 1335423 1353007 1371005 1390016
62058 1390016 1410614 1432718 1455147 1476228 1494812 1510413 1522659 1531152 1535785 1536554 1533037 1524656
62046 1524656 1511516 1494280 1472943 1446429 1413874 1375875 1333939 1289081 1241632 1192242 1142315
62035 1142315 1093169 1045187 998131 952117 907995 866771 828929 794443 763252 735413 710690
62024 710690 688399 667920 649210 632509 617707 604379 592324 581558 571689 561831 551438 540938
62012 540938 531230 522809 515651 509635 504637 500324 496331 492810 490562 490469 492794 496989 502053 507120 511931
61997 511931 516821 522120 527539 532263 535717 538096 539996 541646 542706 542845 542222 541145 539407 536320 531520
61982 531520 525555 519537 514354 510242 506844 503511 499797 495988 493023 491549 491128 490741 490024 489623 490185
61967 490185 491436 492530 493046 493279 493620 494011 494116 493853 493519 493342 493054 492131 490481 488719 487583 487243 487428
61950 487428 488105 489619 492133 495279 498667 502514 507502 514030 521780 530035 538368 547076 557035 569068
61936 569068 583257 598796 614499 629512 643695 657446 671226 685089 698540 710794 721222
61925 721222 729632 736211 741259 744975 747337 748114 746995 743882 739171 733702 728224 722832 717187 711487
61911 711487 707041 705451 707274 711834 718313 726562 736699 748487 761465 775289 789497 803169 815273
61898 815273 825226 832822 837830 840030 839424 836015 829661 820706 810540 800834 792114 783561 774281 764240
61884 764240 753909 743674 733879 724947 717023 709747 702620 695367 687834 679907 671793 663985 656585 648984
61870 648984 640680 632288 625287 620685 618161 616590 615184 614036 613781 615007 618038 622960 629539 637226
61856 637226 645706 655586 668120 683907 702214 721984 743156 766420 791885 818745 846344 874876
61844 874876 904733 935565 966212 995318 1021862 1045383 1065768 1082605 1094839 1101535 1103021 1100800
61832 1100800 1096247 1089825 1081660 1072304 1062691 1053796 1046562 1041745 1039536 1039655 1041957 1046625 1053584 1062078
61818 1062078 1070819 1078140 1082048 1080976 1074812 1064595 1050879 1033038 1010541 984208 955651 926091
61806 926091 896311 867117 839063 812078 786099 761762 739766 719929 701637 685013 670761
61795 670761 658910 648518 638737 629501 621007 613157 605779 599003 593133 588333 584508 581366 578633 576353
61781 576353 574738 573556 572000 569561 566671 563995 561451 558615 555797 553818 552739 551685 550127 548561
61767 548561 547643 547372 547540 548341 549894 551593 552589 552849 553195 554297 556057 558105 560527 563783 568020 572800
61751 572800 577646 582616 588053 593891 599612 604891 609833 614407 618169 620916 623174 625502 627591 628667
61737 628667 628657 628388 628609 629328 630151 630816 631234 631346 631141 630632 629753 628424 626672 624593 622340 620275 618910
61720 618910 618416 618412 618521 618877 619728 620867 621895 622804 623745 624394 624041 622219 618799 613795 607660 601474 596004
61703 596004 590699 584419 577120 569997 563908 558561 553445 548641 544313 540218 536232 532775 530198 528201
61689 528201 526251 524137 521796 519081 516104 513322 510878 508250 504924 501004 496822 492419 487894 483804
61675 483804 480620 478042 475315 472000 468078 463640 459020 454960 452128 450452 449299 448160 446880 445418
61661 445418 443763 442002 440216 438441 436928 436111 435973 435800 434988 433917 433557 434370 435997 437888 439785 441688
61645 441688 443808 446531 449985 453582 456363 457931 458860 460109 462181 464834 467386 469229 470138 470152 469263
61630 469263 467451 465001 462448 460069 457693 455173 452628 450013 446896 443114 439316 436371 434458 433194
61616 433194 432411 432156 432060 431409 429998 428367 426942 425397 423074 419730 415596 410970 406076 401210 396703
61601 396703 392643 388769 384778 380785 377324 374736 372573 369932 366472 362822 359804 357505 355367 352962
61587 352962 350311 347591 344932 342474 340296 338223 335929 333245 330216 326939 323570 320455 317975 316290
61573 316290 315313 314871 314653 314192 313192 311885 310837 310428 310653 311298 312065 312600 312712 312504 312122 311496 310581 309693
61555 309693 309246 309267 309542 310097 311110 312380 313432 314252 315373 317040 318786 320118 321216 322538 324049 325307
61539 325307 326156 326869 327646 328458 329444 331047 333416 335951 337795 338771 339521 340650 341931 342562 342025 340481
61523 340481 338394 336088 333722 331484 329591 328127 326946 325741 324280 322758 321798 321848 322527 322820 322044 320450
61507 320450 318862 317958 317915 318333 318369 317313 315325 313277 311714 310327 308715 307199 306393 306274 306237 305921 305468
61490 305468 305129 305126 305786 307253 308970 309957 309750 308787 307854 307465 307748 308511 309352 310036 310804 312023 313591 315037
61472 315037 316170 317178 318119 318878 319690 321097 323089 324775 325275 324646 323665 323023 323005 323635 324714 325856 326769
61455 326769 327449 327928 328056 327730 327212 326995 327417 328487 329936 331373 332557 333617 334801 335992 336787 337127
61439 337127 337482 338183 339014 339829 341222 343976 347927 351911 354966 357230 359442 361928 364392 366572 368675
61424 368675 370961 373115 374450 374836 375064 375980 377569 379359 381530 384875 389437 393864 396685 397906 398816
61409 398816 400418 402541 404385 405285 404805 402655 399004 394728 390973 388323 386513 384907 383145 381235 379199
61394 379199 376902 374348 371894 369923 368403 367013 365693 364738 364325 364267 364363 364705 365434 366437 367467 368313
61378 368313 368721 368474 367835 367637 368512 370220 372097 374002 376335 379158 381811 383588 384436 384841 385334 386266
61362 386266 387787 389779 391954 394199 396712 399714 403193 407093 411550 416687 422246 427685 432712 437578
61348 437578 442852 449037 456388 464881 474189 483795 493276 502492 511423 519910 527699 534741 541259 547400
61334 547400 552965 557605 561161 563615 564819 564566 562991 560624 557909 554876 551474 547946 544639 541581
61320 541581 538614 535882 533851 532799 532593 533065 534277 536250 538716 541449 544628 548573 553294 558654 564886
61305 564886 572434 581230 590601 600115 610089 620934 632354 643680 654703 665529 675694 684094 689980
61292 689980 693421 694521 692816 688038 681048 673310 665563 657617 649385 641316 633669 626025 618034 610164
61278 610164 603250 597550 592776 588868 586185 584863 584478 584581 585249 586870 589580 593165 597365 601999 606822
61263 606822 611555 616154 620885 626023 631582 637466 643780 650868 659143 668977 680593 693694 707198
61250 707198 719654 730124 738528 745057 749615 752078 752768 752214 750519 747350 742620 736756 730204 723068
61236 723068 715498 708098 701614 696293 691855 688038 684891 682511 680796 679685 679484 680686 683441 687319
61222 687319 691748 696582 702152 708796 716471 724874 733776 743117 752817 762589 771931 780331 787559 793780
61208 793780 799284 804121 808170 811602 815004 818860 823095 827346 831497 835776 840536 846298 853838 863758
61194 863758 875955 889851 905211 922365 941567 962527 984714 1007757 1031221 1054212 1075520
61183 1075520 1094132 1109577 1121990 1132098 1140973 1149413 1157356 1163933 1168201 1169952 1169839 1168605 1166167
61170 1166167 1161632 1154417 1145039 1134405 1122539 1108672 1092553 1074880 1056138 1035783 1013215 989083
61158 989083 964863 941364 918368 895631 873481 852319 832268 813618 797021 782811 770536
61147 770536 759643 750290 743002 737744 733947 731367 730225 730242 730097 728404 725030 721034 717364 714055 710791
61132 710791 707803 705857 705553 706963 709930 714439 720647 728774 739096 751927 767419 785430 805705
61119 805705 828214 853200 880818 910790 942567 975909 1011173 1048812 1088563 1129261 1169543
61108 1169543 1208643 1246488 1283192 1318589 1352166 1383257 1411334 1436139 1457573 1475473 1489584
61097 1489584 1499647 1505263 1505743 1500437 1489339 1473035 1451903 1425854 1395154 1361019 1324807 1286939
61085 1286939 1247276 1206433 1165994 1127259 1090359 1054795 1020294 986904 954777 924333 896254
61074 896254 870843 847575 825721 805390 787558 772974 761308 751535 742953 735608 729757 725261
61062 725261 721745 719167 717815 717725 718564 720251 723174 727473 732650 738383 745203 753658 763166 772682 782369
61047 782369 793665 807599 824036 842705 863868 887484 912678 938850 966616 996849 1029239
61036 1029239 1062667 1096637 1131498 1167358 1203565 1239465 1275184 1311552 1349502 1389513 1431377
61025 1431377 1474473 1518263 1562335 1606043 1648737 1690692 1733370 1778360 1826555 1878819 1936936
61014 1936936 2003143 2079053 2165698 2264527 2377876 2508915 2661922 2842503 3056832 3310765
61004 3310765 3610231 3962159 4374473 4856174 5419577 6083453 6873548 7820163 8955111
60995 8955111 10305750 11878968 13636010 15475553 17246033 18787964 19982235 20778423
60987 20778423 21198417 21327071 21294776 21243319 21273938 21401314 21546068 21572802 21346669 20775549
60977 20775549 19827573 18532788 16974978 15271310 13542389 11885985 10365960 9014975
60969 9014975 7841998 6839599 5991102 5277028 4678555 4177943 3758418 3404944 3105007
60960 3105007 2848666 2628122 2437119 2270255 2122801 1991354 1874293 1770908 1680029 1599903
60950 1599903 1529239 1467561 1414223 1367579 1325532 1286493 1249378 1213035 1176394 1139327 1102772
60939 1102772 1067681 1034227 1002327 972426 944943 919087 893206 866720 840976 817548 796333
60928 796333 776113 756584 738679 722888 708344 694030 680049 667148 655679 645685 637491 631332
60916 631332 626549 621973 617291 613452 611506 611416 612265 613310 614442 615753 617065 618095 618888 619836 621264
60901 621264 623121 625080 626731 627634 627429 626089 623925 621183 617792 613685 609119 604424 599603 594497 589188
60886 589188 583891 578561 572972 567087 560984 554604 548042 541943 537039 533258 529850 526461 523534 521554
60872 521554 520494 520219 520827 522289 524232 526496 529501 533631 538558 543564 548351 553207 558559 564656 571533
60857 571533 579023 586867 594871 602774 610074 616381 622013 627762 633930 640123 646091 652129 658270 663771
60843 663771 667961 671105 673809 675998 677136 677105 676169 674307 671332 667570 663713 659977 656035 651798 647701
60828 647701 644104 641000 638447 636778 636143 636232 636660 637369 638497 640071 641929 643742 645141 646161 647603
60813 647603 650625 655845 663015 671476 680549 689532 698002 706444 716185 728232 742375 757716 773875
60800 773875 791269 810259 830475 851185 872030 893108 914416 935573 956323 977139 999000
60789 999000 1022419 1046861 1071197 1094552 1116610 1137287 1156409 1173735 1189073 1202325 1213459
60778 1213459 1222439 1229174 1233560 1235577 1235266 1232620 1227624 1220339 1210782 1198781 1184313 1167981 1150712
60765 1150712 1132833 1113844 1093357 1071917 1050538 1029765 1009467 989253 968688 947457 925781
60754 925781 904396 883674 863095 842173 821610 802772 786110 770881 756454 743072 731095
60743 731095 720221 709889 699875 690032 679840 668761 656817 644490 632195 620193 608840 598536
60731 598536 589394 581056 572888 564420 555834 548025 541863 537308 533524 529930 526696 524063 521710 519241
60717 519241 516942 515487 515068 515238 515538 515749 515519 514294 511860 508693 505498 502531 499535 496233 492690
60702 492690 489246 486192 483466 480579 476875 472021 466327 460550 455355 450992 447418 444529 442098 439629
60688 439629 436605 432989 429295 425991 423070 420376 418159 416980 417119 418330 420128 422067 423750 424920
60674 424920 425648 426255 426945 427717 428620 429782 431037 431830 431836 431517 431757 432903 434416 435542 436182 436931 438317
60657 438317 440223 442145 443872 445674 447875 450543 453742 457752 462778 468609 474834 481253 487744 493866
60643 493866 499009 502962 506016 508475 510373 511675 512407 512498 511824 510531 509066 507706 506304 504574 502432
60628 502432 500012 497588 495454 493545 491206 487847 483969 480978 479646 479184 478188 476129 473474 470799 468357
60613 468357 466313 464743 463383 461813 459897 457782 455564 453326 451348 449848 448556 447014 445223 443535
60599 443535 441929 439986 437657 435519 434049 433121 432460 432118 432173 432367 432433 432467 432601 432622 432340 432115 432483 433375
60581 433375 434149 434458 434650 435303 436639 438449 440324 441914 443285 445044 447822 451658 456169 461318 467519
60566 467519 474901 482995 491435 500492 510443 520728 530293 538622 545893 552151 556831 559242 559154 556786
60552 556786 552614 547391 542039 537215 533113 529805 527492 526261 525879 526186 527535 530488 535158 541094 547807
60537 547807 555101 562915 571157 579778 588671 597347 604863 610349 613602 615125 615635 615547 614802 613098 610332
60522 610332 606929 603668 601106 599159 597321 595249 593086 591260 590063 589463 589212 589062 588936 588957 589350 590251
60506 590251 591606 593339 595606 598805 603283 609193 616719 626270 638190 652442 668892 687933 710455
60493 710455 737067 767620 801526 838031 875754 912270 944718 970922 989686 1000257 1002094 995262
60481 995262 980556 958951 931260 898576 862705 825707 789056 753513 719667 688207 659612
60470 659612 633898 610844 590302 572147 556089 541734 528826 517293 507097 498160 490408 483713
60458 483713 477824 472526 467910 464247 461518 459269 457099 455079 453409 451902 450134 448021 445794 443441
60444 443441 440702 437761 435430 434223 433610 432564 430658 428238 425728 423240 420808 418597 416747 415256
60430 415256 414078 413192 412635 412644 413597 415492 417602 418991 419352 419011 418247 417097 415878 415301 415758 416857 417998
60413 417998 419137 420676 422807 425315 427885 430241 432022 432905 432949 432665 432626 433100 434024 435125 435985 436184 435716
60396 435716 435270 435834 437733 440109 441678 442109 442456 444060 447233 451143 454714 457331 458922 459875 460935
60381 460935 462653 464762 466355 466904 466869 467136 468093 469444 470703 471632 472313 473014 473984 475220 476509 477770
60365 477770 479236 481208 483696 486422 489074 491449 493497 495392 497454 499810 502149 503963 505058 505854
60351 505854 507205 509939 514373 520092 526283 532472 538924 546209 554427 563078 571653 580054 588227 595540
60337 595540 600836 603191 602504 599308 594222 587778 580580 573260 566158 559254 552564 546411 541142 536666
60323 536666 532483 528135 523597 519294 515827 513525 512167 511238 510564 510539 511645 513922 517095 520952 525338
60308 525338 530046 535072 540898 548199 557398 568803 582914 599992 619326 639464 659254 678135
60296 678135 695283 709114 718191 722369 722664 720066 714863 707074 697241 686556 676155 666301 656384
60283 656384 645844 634981 624660 615387 606996 599083 591303 583284 574812 566293 558505 551649 545026
60270 545026 538019 531014 524988 520388 516810 513606 510415 507167 503937 500883 498142 495745 493707 492155
60256 492155 491191 490697 490411 490255 490470 491434 493249 495478 497365 498476 499104 499851 500957 502247 503531 504667
60240 504667 505309 505132 504437 504005 504188 504557 504660 504653 504920 505552 506539 508091 510293 512783 515206 517735 520718
60223 520718 524036 527302 530512 533982 537733 541381 544683 547844 551310 555508 560631 566385 572097 577462
60209 577462 583029 589565 597059 604811 612356 619714 626758 633037 638534 644025 650230 656869 662936 667743
60195 667743 671385 674348 676961 679181 680633 680918 680174 679309 679336 680282 680964 680063 677276 673183 668171 662042
60179 662042 654780 647236 640574 635217 630660 626180 621375 616233 611176 607036 604423 602971 601647 599950
60165 599950 598441 597983 598870 600833 603372 605816 607554 608625 609784 611617 613853 615816 617243 618323 619264
60150 619264 620211 621352 622772 624423 626533 629674 634065 639120 644168 649341 655253 662029 669221 676621
60136 676621 684621 693702 703873 714567 724857 733924 741637 748490 754697 759613 762431 763203 762668 761309
60122 761309 759106 756117 752805 749761 747490 746300 746066 746304 746931 748562 751505 754793 757056 758180 759190
60107 759190 760480 761079 759996 757510 754704 752294 750269 748224 745679 742393 738586 734560 730120 724919
60093 724919 719499 715261 713020 712136 711530 711066 711477 713300 716449 720569 725294 730303 735551 741328 747686
60078 747686 753919 758984 762398 764408 765271 764701 762129 757336 750727 743026 734665 725464 714994 703360
60064 703360 691485 680464 670642 661431 652050 642410 633267 625509 619334 614144 609166 604004 598695 593597
60050 593597 589350 586534 585050 584182 583623 584145 586719 591155 596258 601239 606379 612178 618468 624649 630437
60035 630437 636112 642141 648676 655196 660704 664497 666684 667686 667440 665534 661985 657321 651847 645353
60021 645353 637573 628400 617712 605650 593189 581730 571807 562763 554017 546033 539643 534870 530949
60008 530949 527196 523467 519990 517169 515407 514867 515478 517154 519733 522644 525170 527245 529595 532855 536870
59993 536870 541048 544963 548415 551416 554418 558153 562878 568102 573232 578044 582264 585320 587017 587986
59979 587986 588949 589807 589889 588782 586480 583077 578846 574374 570110 565947 561653 557478 553926 551141 548968
59964 548968 547437 546757 546908 547549 548226 548545 548481 548784 550539 553850 557333 559466 560111 560214 560423 560762 561339
59947 561339 562454 563921 565033 565375 565169 564722 564079 563327 562716 562182 561109 558824 555202 550798 546466 542764
59931 542764 539500 536027 532236 528956 526973 525951 524940 523731 522989 523026 523296 523351 523577 524555 526163 527782
59915 527782 529107 530310 531627 533187 535139 537579 540354 543159 545858 548571 551493 554823 558858 563905
59901 563905 569947 576484 582938 589192 595544 602017 607977 612765 616509 619940 623445 626695 629294 631361
59887 631361 633389 635898 639340 643864 648989 653920 658451 663122 668317 673768 679208 684776 690305 694892
59873 694892 697870 699611 700548 699979 696874 691600 685724 680134 674320 667597 660040 651981 643474 634687 626169
59858 626169 618394 611573 606090 602413 600247 598479 596492 595022 595285 597731 602102 608184 615862 624690
59844 624690 634000 643404 652756 661706 669578 675641 679377 680784 680676 680457 681216 683070 685476 687906 689943
59829 689943 691045 690735 689088 686626 683694 680018 674902 667769 658656 648307 637675 627231 616903
59816 616903 606733 597275 589052 581901 575281 569122 563904 559845 556474 553285 550522 548895 548554 548704
59802 548704 548410 547580 546898 546910 547448 547955 548072 547718 546838 545368 543433 541338 539313 537265 534728 531167 526597
59785 526597 521941 518393 516229 514578 512623 510522 508705 506767 503912 500411 497689 496802 497457 498808 500492
59770 500492 502408 504082 504969 505214 505584 506617 508232 510075 511920 513731 515642 518010 521279 525615 530628
59755 530628 535482 539391 542230 544771 548164 553006 558922 565077 570979 576673 582283 587613 592306 596296
59741 596296 599973 603807 607838 611600 614563 616551 617721 618302 618465 618342 618026 617612 617290 617232 617311 617180 616809
59724 616809 616650 617002 617472 617487 617194 617381 618500 620180 621785 623093 624289 625577 626947 628191 629078 629604
59708 629604 630016 630437 630660 630512 630209 630012 629713 628950 627870 627014 626561 626214 625803 625401 624782 623389 621146 618776
59690 618776 616988 615796 614961 614662 615255 616580 617996 619025 619718 620387 621212 622067 622679 623002 623376 624099 624848
59673 624848 624840 623527 620820 616636 610912 604300 598284 593947 590830 587464 583008 578025 573731 570816 568969
59658 568969 567321 565245 562883 560970 560141 560464 561622 563427 566086 569936 574832 579749 583300 584982 585766
59643 585766 586988 588750 589873 589423 587711 585651 583794 582332 581412 580887 580111 578617 576901 576036 576578 578189
59627 578189 580252 582350 584117 585067 584919 583940 582776 581943 581590 581697 582266 583099 583515 582738 580787 578672 577413
59610 577413 577134 577470 578535 580881 584631 589291 594385 599606 604334 607795 609947 611507 612735 612886 611325
59595 611325 608597 605793 603354 601088 598983 597330 596159 595107 593768 591818 589036 585597 582114 578961
59581 578961 575822 572373 569112 566883 565711 564719 563216 561320 559450 557710 555974 554219 552594 551353
59567 551353 550803 551173 552506 554809 558136 562255 566357 569481 571293 572220 572854 573460 574016 574391 574464 574371 574704
59550 574704 576170 578864 582010 584642 586531 588304 590658 593560 596410 598989 601976 606421 612991 622122
59536 622122 634491 650537 669325 688528 705856 720052 730421 736234 737437 735507 732790 730959
59524 730959 730550 731767 734978 740282 747072 754310 761041 766623 770727 773231 773957 772543 768718 762635 754777
59509 754777 745547 735087 723432 710777 697683 685026 673507 663155 653520 644346 635748 627766
59497 627766 620310 613656 608396 604570 601419 598422 596029 594868 594720 594926 595382 596444 598169 600404 603427
59482 603427 607755 613395 619844 626766 634123 641820 649802 658335 667574 677038 686159 695136 704420 713483
59468 713483 721051 726607 730785 734113 736349 737445 738268 739784 742134 745106 748979 754295 761202 769627
59454 769627 779812 792095 806307 821895 838575 856409 875169 894016 911939 928378 943192
59443 943192 955995 965567 970086 968164 959673 945587 927265 906130 883720 861500 840444 821063
59431 821063 803741 788682 775607 764063 754148 746486 741345 738286 736950 737784 741619 748799 759036
59418 759036 771905 787147 804578 823977 845051 867469 891005 915677 941413 967314 991257
59407 991257 1010407 1022230 1025273 1019396 1005556 985474 961525 936831 914918 898620 888957 884956
59395 884956 884262 883797 880432 872026 858185 839814 817981 793577 767833 742397 718557 696844 677588
59382 677588 661391 648742 639549 633331 629507 627268 625599 623953 622729 622682 623924 625735 627258 628206
59368 628206 628964 630255 632628 636110 640294 644727 649121 653352 657610 662559 669003 677279 687151 698274
59354 698274 710427 723336 736821 751329 767766 786456 806661 827564 849345 872701 897493
59343 897493 922454 946337 968905 990615 1011569 1030987 1047600 1060348 1068653 1072129 1070320 1062955
59331 1062955 1050460 1033949 1014626 993325 970558 946708 922050 896856 871669 847319 824497
59320 824497 803376 783813 765809 749675 735850 724618 715894 709117 703524 698674 694747 692275 691547
59307 691547 692286 693843 695715 697849 700470 703732 707791 713199 720786 730902 742978 756076 769518
59294 769518 782578 793806 801284 803629 800516 792455 780599 766678 752497 739190 727189 716792
59282 716792 708343 701914 697369 694855 694768 697113 701338 706889 713576 721394 730569 741840 756037 773012
59268 773012 791375 809553 826737 842640 856879 868948 878441 884962 888142 887948 884640 878220 868406
59255 868406 855449 840484 824666 808336 791492 774695 758964 744975 732858 722676 714611 708627
59243 708627 704335 701335 699602 699500 701440 705464 711135 717963 725884 735074 745384 756256 767127 777473
59229 777473 786425 792913 796410 797173 795591 791706 785529 777344 767433 755879 742906 729090 715004
59216 715004 701010 687533 675135 664125 654530 646466 639941 634154 627873 620959 614860 611060 609615
59203 609615 609637 610485 611756 612807 613268 613709 615006 617274 620050 623206 626835 630532 633692 636441 639501
59188 639501 643115 646785 650045 652771 654748 655753 656230 657157 658887 660698 661836 662621 664172 667280 671858
59173 671858 677368 683555 690695 699147 708770 719040 729758 741265 753756 766827 780048 793547
59161 793547 807506 821375 834152 845177 854109 860359 863220 862508 858533 851535 841691 829575 816027
59148 816027 801609 786673 771811 757586 743925 730441 717389 705598 695369 686079 677016 667989
59136 667989 659035 650169 641666 634018 627360 621421 616171 611963 608840 606337 604281 603142 603230 604065 605049
59121 605049 606400 608898 613000 618617 625512 633455 642085 651028 660157 669573 679406 689691 700200 710279
59107 710279 719129 726556 733221 739924 746754 753119 758411 762469 765578 768234 770786 773095 774586 774778
59093 774778 773716 771891 769940 768451 767788 767857 768121 767955 766915 764757 761437 757145 752100 746248 739387
59078 739387 731579 723101 713985 704061 693613 683522 674437 666091 657801 649396 641298 633959 627581 622239
59064 622239 617842 614013 610448 607383 605325 604258 603463 602323 600987 600004 599487 598966 598049 596896 595829
59049 595829 594735 593165 591081 589216 588426 588761 589403 589540 589137 588794 589018 589789 590752 591640 592438 593201 593872
59032 593872 594326 594573 594874 595752 597900 601877 607652 614558 621983 630162 639937 651681 664775 678299
59018 678299 691850 705342 718337 730006 739657 746959 751783 754240 754823 754153 752527 749984 746794 743633
59004 743633 741242 740181 740873 743574 748208 754434 761986 770806 780903 792190 804404 817010 829297
58991 829297 840821 851647 861888 871151 878845 884921 889746 893170 894277 892377 887867 881731 874511
58978 874511 866285 857570 849674 843900 840627 839454 840050 842594 847422 854635 864280 876526 891241 907501
58964 907501 924073 940487 957203 974539 991881 1008309 1023524 1037593 1049933 1059132 1063898 1063872
58952 1063872 1059419 1050944 1038602 1022549 1003319 981843 959049 935567 911963 889133 868023 848868
58940 848868 831198 814817 800412 788857 780179 773530 767929 762787 758042 754091 751286 749214 746832
58927 746832 743694 740575 738402 736994 735410 733154 730378 727260 724046 721541 720631 721152 721871 721745 720754
58912 720754 719569 719016 719912 722714 727106 732321 737961 744165 751134 759133 768889 781213 796007 812311
58898 812311 829506 847854 867572 888057 908539 929070 950389 973060 997172 1022741 1050120
58887 1050120 1079948 1112758 1148555 1186760 1226503 1266651 1305365 1340212 1369357 1392508 1410138
58876 1410138 1421982 1426934 1424267 1414199 1397238 1373801 1344592 1310771 1273573 1234374 1195103 1157798
58864 1157798 1123516 1092273 1064046 1039055 1016965 996829 978210 961502 946657 932487 917831
58853 917831 902710 887736 873075 858741 845278 833244 822375 812080 802520 794339 787461 780899
58841 780899 773821 766187 758293 750286 742337 734772 727707 720779 713579 706318 699818 694639 690375 686034
58827 686034 681163 676281 672085 668700 666090 664739 665223 667333 670331 673999 678708 684505 690951 697842
58813 697842 705241 712669 719215 724740 730079 735619 740529 743890 745755 746559 746301 745062 743574 742337 740656
58798 740656 737391 732380 726434 720264 714102 708055 702114 695982 689551 683400 678237 674108 670705 668261
58784 668261 667463 668572 671192 674827 679144 683786 688474 693282 698370 703483 708043 711591 713803 714307 713026
58769 713026 710518 707370 703363 697861 691129 684634 679706 676245 673015 669081 664735 661076 658940 658349
58755 658349 658939 660594 663385 667075 671184 675562 680431 685727 690872 695442 699709 704264 709391 715030
58741 715030 721043 727339 733986 741270 749271 757357 764580 770674 776173 781517 786731 792032 797972 804656
58727 804656 811640 818943 827307 836941 846867 856084 864554 872381 878951 883956 888522 894137 900866 907724
58713 907724 914493 922019 930779 940245 949708 958732 966635 972378 975327 975558 973265 968291 960313 949010
58699 949010 934058 915515 894256 871560 848197 824328 800269 776886 755175 735773 718870
58688 718870 704242 691381 679863 669572 660404 651975 643903 636183 629060 622733 617378 613046 609315
58675 609315 605531 601750 598932 597802 598082 599313 601783 605973 611743 618900 628035 639793 653634 668264
58661 668264 683029 697899 712226 724550 733747 739619 742375 742322 740089 736460 731834 726316 720178 713657
58647 713657 706558 698790 691046 684153 677983 671915 666198 661873 659322 657922 657241 657609 659284 661976 665513
58632 665513 670192 676067 682511 688798 694553 699482 703252 705936 708023 709796 711180 712323 713817 716252
58618 716252 720016 725554 733192 742688 753573 766028 780684 797326 814356 829762 842243 851455
58606 851455 857733 861617 863038 861079 855190 846554 837323 828492 819494 809949 800619 792167 784077 775608
58592 775608 767080 759383 752809 747210 742971 740978 741710 744920 750212 757498 766832 778067 790706 804013
58578 804013 817393 830669 843842 856595 868284 878461 887216 895086 902896 911559 921582 932784
58566 932784 944860 958154 973472 991239 1011378 1033857 1058610 1084845 1111143 1136542 1160956
58555 1160956 1184237 1205293 1222487 1234624 1241387 1243137 1240571 1234364 1225022 1213256 1200389 1187961
58543 1187961 1176771 1166549 1156527 1145998 1134333 1120925 1105393 1087768 1068474 1048197 1027624
58532 1027624 1007190 987297 968854 953047 940257 929798 921236 915306 912787 913031 914589 916991 920831
58519 920831 926277 932606 939269 946333 953595 960144 965196 968729 971047 972286 972552 971999 970514 967761 963608
58504 963608 958214 951762 944553 937196 930233 923671 917361 911502 906165 900711 894463 887718 881294 875338
58490 875338 869489 863919 859218 855425 852180 849783 849050 850145 852597 856422 862183 869872 878870 889083
58476 889083 901080 914872 929506 943958 957448 968860 976964 981482 982969 981551 976847 969227 959954
58463 959954 949806 938743 927273 917014 909335 904356 901635 901000 902402 905874 911946 921197 933053
58450 933053 945766 957674 967690 974717 977919 977774 975667 972147 966676 959258 951028 942887 934818 926944
58436 926944 920097 914928 911531 910198 911273 914016 917013 920145 924808 931766 940212 949436 959887 971858
58422 971858 984596 997485 1010836 1024646 1037757 1049010 1058080 1064553 1067501 1066750 1063385 1058302 1051496
58409 1051496 1043317 1034889 1026392 1016395 1003912 989830 975434 960924 946441 933119 921907 912497
58397 912497 904540 898678 895309 893623 892974 893859 896308 898714 899753 900212 901359 902615 902569 901371 900339
58382 900339 899851 899340 898947 899628 901680 904281 906323 906988 906031 904316 903509 904493 906743 909805 914323 920801
58366 920801 928502 936696 945990 957239 970059 983563 997784 1013219 1029733 1046945 1064960 1083595
58354 1083595 1101538 1117206 1129852 1139201 1144902 1147150 1147008 1145464 1143084 1140945 1140452 1141591 1142978 1144412
58340 1144412 1147695 1153930 1161931 1170552 1180704 1193454 1207803 1222205 1236890 1252967 1270410 1288541
58328 1288541 1307166 1325686 1342361 1356119 1367838 1378363 1386758 1392170 1395847 1399421 1402595 1404495
58316 1404495 1405901 1408192 1411380 1415177 1420688 1428908 1438708 1448326 1457819 1468239 1479697 1492132 1506553
58303 1506553 1523458 1541348 1558825 1576699 1595964 1615349 1633232 1650351 1668105 1685782 1702168
58292 1702168 1718438 1736576 1756180 1775711 1795683 1817668 1841162 1864378 1887261 1910942 1935149
58281 1935149 1958944 1983074 2008804 2035331 2061144 2086923 2114339 2143073 2171827 2201188 2232555
58270 2232555 2265457 2298922 2334375 2374105 2418030 2464962 2515728 2571803 2632213 2695162 2761352
58259 2761352 2832201 2906210 2980742 3055981 3133318 3211248 3286934 3360619 3434468 3508407 3581351
58248 3581351 3655187 3733175 3815601 3901399 3992547 4092043 4198883 4310054 4426297 4550828
58238 4550828 4683664 4822679 4969117 5126428 5294675 5471875 5659933 5863275 6082404
58229 6082404 6314891 6561970 6828102 7114870 7421641 7751255 8108480 8493986 8906862
58220 8906862 9352023 9837841 10367937 10943401 11571904 12266060 13034077 13881375 14820616
58211 14820616 15870762 17047770 18367469 19857609 21557023 23505007 25744953 28339011
58203 28339011 31367611 34916937 39081656 43976813 49726337 56437254 64205166 73152115
58195 73152115 83450242 95324708 109077836 125129554 144011406 166296804 192494746
58188 192494746 222847581 256925072 293135052 328573476 359535982 382494919 394988117
58181 394988117 396049238 386210017 367237296 341670070 312229099 281299535 250670598
58174 250670598 221523213 194534661 170017594 148068425 128678185 111764665 97163054
58167 97163054 84643728 73958350 64866474 57135858 50550051 44926536 40117479 35993711
58159 35993711 32440413 29366381 26702076 24385120 22356352 20568488 18986420 17577013
58151 17577013 16307423 15153661 14101648 13138766 12252029 11434434 10684617 9999036 9370944
58142 9370944 8796655 8275376 7802548 7370216 6974093 6613582 6284768 5980140 5695530
58133 5695530 5430781 5183294 4947639 4722425 4511171 4315198 4131364 3957872 3796491
58124 3796491 3647589 3508176 3376368 3253138 3138396 3029791 2926481 2829789 2739210 2652083
58114 2652083 2568132 2490036 2418486 2350805 2285493 2224089 2167316 2113250 2060582 2010146 1962057
58103 1962057 1914692 1867614 1822303 1779026 1735983 1692325 1649066 1606524 1564026 1522588 1484566
58092 1484566 1450034 1416737 1384186 1354429 1328123 1303302 1278853 1255864 1234592 1213446 1192013
58081 1192013 1171878 1153290 1134137 1113364 1092390 1072034 1051145 1029555 1009276 991253 973787
58070 973787 955747 938642 923906 910734 898230 887177 877881 868617 858110 847635 838866 831380
58058 831380 823821 815918 807895 799430 790511 781903 773698 764882 755283 746287 738685 731520 724003 716825
58044 716825 710534 704405 698069 692556 688516 684910 680629 675917 671201 665996 660106 654456 649595 644660
58030 644660 638753 632052 624683 615901 605357 593923 582377 570596 558813 548281 539773 532693 526449
58017 526449 521408 517800 515002 512620 510851 509220 506552 502929 499987 498423 496892 494360 491801 490392
58003 490392 489693 488914 488496 488990 489731 490029 490506 491837 493197 493305 492105 490110 486995 482257 476635 471646
57987 471646 468051 465611 463854 462337 460801 459684 459888 461553 463760 465690 467159 467860 467413 466537 466644
57972 466644 467663 467873 466625 465602 466332 468044 469270 470066 471178 472280 472692 472926 474000 475879 477913
57957 477913 480113 482718 485162 486757 487870 489206 490468 490836 490324 489539 488544 487016 485240 483972 483524
57942 483524 483670 484090 484368 484049 483342 483204 484203 485926 488043 491105 495577 500889 506196 511359 516375 520615
57926 520615 523454 525036 525670 525160 523382 520705 517153 512028 505198 497890 491294 485228 479090 473246 468401
57911 468401 464357 460546 457165 454743 453130 451902 451189 451122 451078 450457 449600 448946 447921 445710 442583 439329
57895 439329 435942 431958 427625 423546 419574 415185 410661 406750 403410 399945 396204 392639 389382 386212
57881 386212 383285 380919 378832 376486 374069 372254 371075 369862 368225 366265 363865 360567 356325 351791
57867 351791 347749 344555 341959 339194 335528 331161 327258 324766 323539 322936 322656 322624 322751 323395 325439 329251
57851 329251 334092 339082 344052 348861 352789 355569 358318 362337 367438 372373 376489 379990 382976 385231
57837 385231 386726 387547 387584 386988 386517 386697 387002 386644 385742 385066 385114 386113 388270 391171 393633 395121 396669
57820 396669 399323 402342 404136 404429 404168 403744 402808 401580 400842 400478 399308 396609 392765 388252 382907 376483
57804 376483 369185 361540 354266 348089 343054 338225 332777 327120 322209 318230 314851 312252 310772 309860
57790 309860 308659 307415 307045 307475 307742 307765 308627 310832 313578 316126 318801 322142 326060 330333 335150 340622
57774 340622 346370 352000 357474 362751 367505 371391 374158 375475 375138 373483 371183 368632 365898 362916
57760 362916 359244 354084 347265 339854 332960 326405 319532 312829 307488 303612 300229 297050 294814 293763
57746 293763 293132 292503 292425 293167 293945 293948 293233 292091 290322 287703 284543 281324 278289 275683 273863 272975 272980 273917
57728 273917 275497 276663 276527 275782 276086 277887 279898 280936 281168 281162 280802 279782 278304 276718 275128 273822
57712 273822 273308 273441 273188 271773 269509 267194 265281 263867 262699 260969 257981 254408 252052 251845 252854
57697 252854 253669 253911 253899 253771 253668 254041 254993 255831 255910 255400 254661 253479 251591 249491 248106 248046 249621 253111
57679 253111 258473 265310 273600 283995 296961 312265 329871 350767 376246 406931 443196 485966
57667 485966 535990 592190 651051 707393 755368 789411 805431 801818 779562 741824 693337 639330
57655 639330 584158 530869 481885 439193 403451 373729 348865 328528 312424 299303 287795
57644 287795 277764 269823 263830 258897 254674 251537 249439 247528 245238 243000 241522 240849 240443 239769 238614
57629 238614 237108 235664 234664 234078 233572 232963 232313 231549 230285 228183 225400 222619 220594 219519 218788 217609
57613 217609 215949 214611 214205 214368 214288 213725 213109 212799 212679 212428 211831 210832 209522 208116 206738 205295 203728
57596 203728 202307 201395 200888 200092 198264 195269 191698 188383 185710 183427 181132 178833 176815 175064 173151
57581 173151 170800 168266 166031 164353 163225 162566 162219 161856 161044 159481 157238 154837 152933 151780 151090
57566 151090 150491 149903 149331 148718 148277 148487 149324 149947 149801 149549 150067 150909 150904 150093 149802 150650 151789 152530 153529
57547 153529 155560 158086 159957 160853 161165 160947 159908 158168 156285 154629 153302 152553 152770 154038 155952
57532 155952 157735 158511 157890 156501 155527 155482 155846 156006 155878 155407 154334 153000 152557 153589 155109 155736 155450
57515 155450 155407 156365 158115 160165 162184 163850 164984 165848 166796 167789 168695 169770 171192 172371 172437 171366
57499 171366 170001 169010 168391 167878 167200 165901 163582 160494 157474 155197 153804 153164 153042 152965 152479 151636 150868
57482 150868 150268 149406 148006 146454 145422 145179 145437 145763 146003 146254 146442 146051 144487 141710 138268 134705
57466 134705 131255 128141 125728 124162 123252 122900 123223 124042 124745 124936 124769 124384 123567 122378 121494 121322 121195
57449 121195 120085 117830 115189 112965 111573 111080 111082 110913 110515 110765 112335 114625 116438 117276 117256 116269 114305
57432 114305 112375 111904 113068 114647 115683 116383 117197 117971 118471 119008 119896 120722 120727 119753 118473 117720 117757 118066
57414 118066 117841 116826 115624 115017 115181 115845 116941 118528 120201 121234 121480 121586 122105 122794 123023 122516 121467
57397 121467 120214 119108 118498 118582 119216 119972 120522 121031 122083 123989 126185 127637 127994 128029 128801 130726 133606
57380 133606 137011 140262 142575 143780 144509 145182 145190 143729 141117 138550 136729 135411 134180 132949 131753
57365 131753 130662 129966 129911 130229 130403 130293 130065 129634 128808 127894 127529 127882 128604 129559 130960 132767 134578 136260
57347 136260 138073 140001 141432 141749 140931 139481 138056 137129 136639 136024 134944 133845 133391 133542 133753 133911
57331 133911 134363 135053 135355 134942 134254 133948 134267 135012 135710 135831 135235 134360 133574 132602 131114 129600 128889 128958
57313 128958 129065 128976 129197 129967 130910 131803 132793 133714 134128 134302 135170 136862 138152 137977 136842 136090 136343 137214
57295 137214 138130 138845 139394 140052 141196 142875 144666 146040 146732 146754 146396 146163 146265 146282 145873 145637 146495 148311
57277 148311 150101 151679 154004 157504 161142 163785 165559 167090 168248 168598 168579 169192 170649 172097 172636
57262 172636 172140 171129 170276 169910 169759 169366 168883 169019 169991 171053 171447 171317 171256 171379 171385 171143 170764 170390 170338
57243 170338 171094 172692 174477 175898 177175 178703 180225 181236 181894 182867 184408 186138 187705 189178 190876
57228 190876 193132 196099 199357 201898 202958 202857 202637 202980 203774 204667 205586 206606 207631 208403 208859 209405
57212 209405 210692 212972 215809 218673 221623 225008 228746 232520 236589 241562 247237 252530 256809 260482
57198 260482 263885 266514 268034 269218 271034 273419 275824 278488 282130 286635 291086 295201 299923 306478
57184 306478 315418 326634 339697 353997 368985 384497 400642 417368 434346 451281 468159 485194
57172 485194 502544 519835 536047 550327 563072 575627 588673 601636 614092 626994 641736
57161 641736 658531 676632 695817 716697 739666 764470 790859 818854 848214 878338 908914
57150 908914 940096 971803 1003332 1033950 1063497 1092117 1119665 1145621 1169515 1191341 1211628
57139 1211628 1231145 1250434 1269641 1288721 1307545 1325724 1342718 1358362 1373064 1387219 1400768
57128 1400768 1413675 1426610 1440782 1457142 1475998 1497183 1520274 1544754 1570310 1597020 1625245
57117 1625245 1655527 1688610 1725219 1765755 1810632 1861132 1919591 1988686 2071080 2170079 2290178
57106 2290178 2436625 2614822 2830264 3088410 3394226 3752514 4169472 4653827 5216055
57097 5216055 5866317 6612424 7458348 8404161 9448332 10591159 11835977 13187001 14646020
57088 14646020 16209426 17864268 19583132 21320821 23014901 24589518 25963432 27064650
57080 27064650 27846968 28295446 28414632 28212088 27695505 26884777 25822512 24570092 23193509
57071 23193509 21750739 20286219 18831045 17406482 16028444 14710157 13462295 12292856
57063 12292856 11207970 10211905 9305582 8486021 7748187 7087039 6497502 5973631 5509011
57054 5509011 5097835 4735130 4416417 4137589 3894576 3682480 3495305 3326827 3171404
57045 3171404 3023893 2879682 2735623 2590723 2445647 2301843 2161187 2025659 1896782
57036 1896782 1775572 1663060 1560224 1467223 1383427 1308554 1243185 1187837 1142295 1106417 1081035
57025 1081035 1067366 1065546 1073631 1087355 1100663 1107252 1102427 1083725 1050369 1003226 945349 881332
57013 881332 815306 749963 687451 629989 578838 533580 493186 457188 425282 396696 370756
57002 370756 347409 326404 306608 287022 267888 249972 233276 217358 202421 189140 177815
56991 177815 168670 162593 160415 161560 164473 168522 174632 183909 196286 210568 225042 237882 247628
56978 247628 253669 256139 255436 252186 247468 242457 237778 233561 230000 227397 225757 224893 224921 226218 228942
56963 228942 233076 238903 246964 257460 270100 284566 300663 317833 334766 349600 360423 365762
56951 365762 364982 358399 346935 331827 314708 297525 281869 268407 257194 248354 242156 238673 237815
56938 237815 239647 244344 251985 262735 277064 295269 316752 340101 363828 386664 407097 423029
56926 423029 432186 432968 425158 410095 390115 367551 344054 320634 297977 276585 256929 239690
56914 239690 225512 214255 204749 195706 186824 178792 172365 167665 164199 161273 158461 155825 153675 152204
56900 152204 151536 151950 153596 156007 158500 161172 164960 170533 177740 186333 196543 208677 222858 239505
56886 239505 259167 281203 303286 322894 338785 350537 357527 359345 356619 350554 342106 332455 323564
56873 323564 317026 312675 309495 307710 308805 313653 321895 333274 348435 368168 392786 422436 457062
56860 457062 495834 537321 580135 622280 659700 686897 699947 698562 685124 662704 634434 603628
56848 603628 573280 545548 522062 504218 492720 487397 488083 495370 510110 532606 562772 600726
56836 600726 646818 701306 764098 833991 907399 978039 1038443 1081979 1103906 1101924 1076981 1033426
56824 1033426 977474 915032 850765 788339 730624 679652 636970 603898 580907 566924 560099
56813 560099 559596 566235 581273 605154 637687 678725 727578 781433 834795 880940 914118 930650
56801 930650 928764 908411 871645 822691 766924 709382 653946 603259 558756 520717 488794 462791
56789 462791 442912 429328 421836 419996 423433 431953 445522 464108 487295 513824 541372 566598
56777 566598 585537 594679 592391 579386 557619 528983 495260 458804 422335 387917 356562 328739
56765 328739 304633 283822 265329 248370 232864 219233 208006 199490 193260 188042 182672 177237
56753 177237 172704 169413 166650 163769 160900 158225 155409 152229 149123 146507 144090 141505 139161 137775
56739 137775 137376 137383 137444 137607 137801 137783 137513 137096 136429 135448 134697 135043 136667 138697 140081 140587 140834 141508 142663
56720 142663 143708 144083 143944 144030 144785 145854 146663 147228 148076 149476 151175 152781 154040 154679 154430 153420 152302
56703 152302 151685 151576 151545 151335 151063 150753 150066 148761 147326 146716 147316 148414 148955 148584 147704 146742 145837 145146
56685 145146 144925 145106 145219 144978 144731 145053 146069 147284 147964 147683 146742 146128 146733 148413 150024 150555 150023
56668 150023 149165 148599 148510 148901 149749 150945 152330 153802 155263 156556 157568 158368 159117 159911 160778 161711 162633
56651 162633 163421 164103 164949 166254 167983 169681 170800 171200 171345 171887 173030 174519 176247 178481 181178 183517
56635 183517 184680 184959 185484 186872 188683 190259 191531 192849 194493 196513 198630 200120 200300 199344 198216
56620 198216 197507 196804 195509 193840 192631 192391 192917 193612 193838 193233 192052 191080 190870 191153 191123 190177 188266
56603 188266 185812 183504 181869 180770 179575 178042 176753 176379 176820 177417 177793 178065 178460 179163 180427 182287
56587 182287 184135 185021 184590 183455 182527 182181 182155 182029 181621 181037 180608 180796 181909 183753 185652 187084 188301
56570 188301 190069 192723 195741 198387 200466 202273 204234 206982 211348 217595 224827 231851 238620 246169
56556 246169 255042 264358 272589 278678 282195 283067 281673 278935 275903 273242 271109 269264 267313 265139
56542 265139 263058 261229 259070 255842 251736 247743 244441 241633 239199 237409 236140 234647 232552 230415
56528 230415 228820 227582 226345 225301 224718 224214 223124 221262 218893 216403 214349 213351 213371 213529 213099 212323
56512 212323 211845 211758 211636 211058 209792 207936 206221 205544 205779 205774 204937 204088 204108 204660 204994 205219 205769 206388 206706
56493 206706 207168 208194 208940 208242 206468 205081 204581 204260 203840 203864 204307 204328 203868 204160 205930 208208 209703
56476 209703 210516 211663 213513 215478 216831 217200 216633 215742 215522 216512 218284 220083 221726 223517 225544 227438
56460 227438 228749 229231 228874 227898 226730 225808 225367 225329 225337 224978 224179 223310 222724 222326 221801 221149 220677 220590 220874
56441 220874 221454 222123 222460 222291 222124 222640 223729 224493 224306 223520 223031 223449 224774 226546 228208 229493 230517
56424 230517 231346 231655 231104 229974 229090 229057 229762 230625 231145 231300 231538 232301 233424 234190 234054 233151 232043 231357
56406 231357 231669 233103 234834 235623 235198 234523 234362 234410 234389 235031 236960 239311 240648 240821 240830 241133 241301 241237 241557
56387 241557 242620 244095 245572 246817 247502 247575 247802 249003 250734 251758 251825 251977 252943 254319 255546 256671
56371 256671 257812 258788 259685 260943 262516 263767 264542 265534 267179 268965 270264 271134 271843 272291 272378 272380 272566
56354 272566 272938 273568 274646 275967 276973 277575 278255 279243 280284 281438 283178 285390 287208 288310 289555
56339 289555 291697 294288 296483 298330 300564 303579 307218 311171 315061 318488 321433 324247 326967 329123
56325 329123 330567 331936 333834 336036 337939 339375 340539 341470 341990 341868 340912 339250 337614 336775 336623 336450
56309 336450 336212 336667 338101 339850 341426 343157 345275 347336 349192 351654 355435 360146 365019 369869 374628
56294 374628 378704 381751 384497 387890 391859 395737 399447 403348 407341 411070 414779 419088 424060 429238
56280 429238 434512 440242 446648 453734 461697 470750 480544 490367 500000 509937 520738 532494 544912
56267 544912 557691 570952 585466 602235 621585 642966 665832 690395 717264 746742 778931
56256 778931 814222 853351 897130 946295 1001399 1062690 1130404 1205196 1287863 1378647 1477400
56245 1477400 1584422 1700201 1824031 1953730 2087113 2222933 2359860 2495349 2626173
56236 2626173 2749420 2862313 2961740 3044815 3109503 3154098 3176651 3175800 3151946 3106968 3042976
56225 3042976 2961851 2865751 2757541 2640677 2518671 2394196 2268586 2142767 2018786 1899634
56215 1899634 1787281 1681779 1582705 1490501 1405734 1327889 1255840 1189031 1127545 1071486 1020914
56204 1020914 975898 936117 900819 869441 841627 816477 792827 770694 751305 735042 720494
56193 720494 706297 692738 680535 669248 658161 647797 639151 632104 625806 620030 614884 609853 604457
56180 604457 599370 595618 593035 590679 588367 586593 585327 584104 582995 582358 581937 581347 581133 582199 584363
56165 584363 586627 588709 591272 594772 599021 603715 608545 613066 617386 622608 629661 638002 646353 654412
56151 654412 662935 672619 683822 696907 711805 727725 744312 762601 783797 807746 833832 862767
56139 862767 896105 934347 976985 1024129 1076720 1135210 1199184 1267999 1340491 1414216 1486239
56128 1486239 1554611 1618250 1675967 1727060 1772574 1814457 1853432 1888685 1919231 1944184 1962023
56117 1962023 1971195 1971686 1964910 1952156 1934147 1911646 1884988 1853045 1813986 1767113 1713067 1652666
56105 1652666 1587008 1518569 1450775 1386291 1326582 1272786 1225828 1185866 1152704 1126355 1106212
56094 1106212 1090277 1076562 1064808 1055672 1048904 1043741 1040299 1038887 1038539 1037935 1037267 1037505 1038415 1039133 1040076
56079 1040076 1042360 1045792 1049474 1053929 1060544 1069245 1078744 1088712 1099630 1110925 1121550 1132124 1144225
56066 1144225 1157861 1171919 1186747 1203694 1222281 1240536 1258191 1276908 1297163 1317588 1337548
56055 1337548 1357672 1377444 1395056 1410302 1425098 1440549 1455879 1470783 1486321 1502824 1519319
56044 1519319 1535647 1552846 1570960 1588855 1606673 1626014 1647184 1668753 1690330 1713172 1737579
56033 1737579 1762325 1787250 1813738 1842029 1870801 1900060 1931745 1966868 2004793 2045758 2091080
56022 2091080 2140219 2190832 2242561 2297633 2356883 2418364 2480808 2545206 2611894 2679436 2747585
56011 2747585 2818239 2892297 2968706 3047568 3130818 3218756 3309406 3402513 3500669 3605296 3715124
56000 3715124 3829774 3951168 4080130 4215417 4357316 4508299 4668926 4837190 5013136
55991 5013136 5199921 5399281 5610610 5835584 6078642 6341502 6622426 6922365 7246317
55982 7246317 7597225 7974623 8381174 8824215 9308854 9836231 10410901 11042994 11740903
55973 11740903 12509601 13359040 14306427 15367748 16556427 17894396 19415976 21158414
55965 21158414 23160421 25475806 28178771 31352500 35085649 39483989 44667378 50744549
55957 50744549 57806389 65957321 75345716 86168351 98684497 113257695 130371534
55950 130371534 150577987 174400710 202167224 233655015 267585918 301342831 331329208
55943 331329208 353918324 366436142 367677027 357926437 338736213 312568890 282289327
55936 282289327 250596380 219617202 190778767 164871253 142178278 122630902 105967378
55929 105967378 91851146 79925491 69841664 61290299 54018427 47817936 42510493
55922 42510493 37948865 34018279 30623892 27680616 25117493 22880820 20924724 19204035
55914 19204035 17679988 16324616 15113797 14022143 13029129 12123707 11298064 10542106 9847558
55905 9847558 9211185 8629491 8095229 7602595 7150485 6737037 6356227 6003348 5678638
55896 5678638 5381763 5107736 4852048 4615009 4397127 4194798 4004701 3828132 3666773
55887 3666773 3517859 3377687 3246469 3125760 3014249 2910058 2814287 2728232 2649341 2573519
55877 2573519 2499395 2427239 2355916 2284168 2212939 2143486 2075026 2006955 1941405 1880756 1824390
55866 1824390 1770503 1719282 1671599 1626265 1581448 1537566 1496340 1458058 1421871 1387545 1354926
55855 1354926 1322894 1290773 1259595 1230322 1202088 1173703 1145436 1117785 1089986 1061415 1033070
55844 1033070 1006096 980219 954977 930910 908115 885341 862125 840253 821484 805287 790307
55833 790307 776460 764011 752161 740275 729197 719813 711519 703440 695730 688403 680399 671129 661454
55820 661454 651963 641949 631265 621266 612483 603381 593011 582877 574414 566646 558415 551028 546339
55807 546339 543749 541448 539352 538586 539197 540528 542848 546615 551158 555990 562260 570843 580050 587298 592095
55792 592095 595438 597322 597066 595195 592643 588685 581897 572775 563476 555268 547968 541325 535078 528040
55778 528040 519007 508350 497209 485617 473116 460758 450699 443991 440242 439057 440219 442753 445375
55765 445375 447713 449777 450728 449594 446800 443463 439607 434537 428509 422396 415966 408110 398730 388954
55751 388954 379501 370056 360143 349503 337951 325962 315019 306201 298876 291906 285565 280904 277832
55738 277832 275373 273398 272519 272494 272252 271449 270713 270444 270482 270707 270822 269955 267650 264842 262608 260482 257348
55721 257348 253410 249778 246537 242886 238892 235522 233149 231532 231032 232219 234425 236301 237785 239958
55707 239958 243026 246019 248526 251097 253715 255394 255561 254538 252438 248936 244329 239570 235058 230495
55693 230495 226018 222175 218760 215005 211059 207944 205889 204029 201974 200396 199852 200264 201813 205007 209533
55678 209533 214203 218342 222127 225350 227171 227454 227142 226893 226362 225191 223678 222112 220439 218822 217597
55663 217597 216519 215107 213883 214095 215989 218494 220808 223125 225571 227770 229797 232342 235461 238372
55649 238372 240899 243818 247275 250201 251929 253163 254508 255227 254346 251999 248759 244486 238884 232582 226671
55634 226671 221479 216501 211263 205805 200654 196582 193962 192175 190226 188037 186351 185294 184051 182321
55620 182321 180981 180663 180617 179772 178216 176862 176231 176250 176680 177035 176510 174710 172156 169572 166978 163934 160332
55603 160332 156501 152794 149494 146872 145030 143864 143312 143365 143749 143986 143875 143510 142892 142029 141417 141678 142587
55586 142587 143110 142641 141585 140533 139533 138489 137707 137660 138552 140251 142290 144032 145381 147286 150811 155728
55570 155728 160739 165079 169109 173314 177690 182185 186746 190637 192754 193020 192576 192185 191294 189117 185798
55555 185798 181914 177596 172765 167682 162793 158422 154888 152361 150414 148325 145990 143868 142007 140081
55541 140081 138517 138405 139844 141455 142149 142363 142964 143884 144634 145285 146086 146757 146959 146913 146899 146702 146119 145451
55523 145451 144845 143800 141951 139784 137983 136597 135334 134075 132630 130703 128595 127142 126371 125046 122293
55508 122293 118898 116232 114681 114010 114371 115791 117247 117508 116669 115856 115646 115733 115876 116254 116893 117550 118110
55491 118110 118555 118703 118554 118608 119252 120110 120587 120762 121094 121557 121740 121573 121348 121221 121239 121599 122336 123075 123593
55472 123593 124207 125064 125510 124890 123558 122372 121570 120844 120132 119540 118877 118125 118015 119173 120963 122116 122319
55455 122319 122220 121997 121082 119464 118183 118117 118977 119904 120487 120857 121233 121689 122114 122284 122085 121672 121225 120747 120371
55436 120371 120498 121178 121674 121260 120236 119530 119476 119633 119706 119851 120056 119988 119687 119769 120638 121885 122768 123028 123006 123164
55416 123164 123675 124406 125173 125931 126645 127138 127340 127626 128436 129543 130300 130710 131508 132879 133919 133876 133133 132267
55398 132267 130914 128543 125785 123803 122638 121294 119362 117543 116502 116116 116047 116219 116535 116817 117226 118188
55382 118188 119705 121215 122271 122933 123424 123806 124077 124202 124038 123546 122961 122468 121902 121121 120374 119841 119104 117693
55364 117693 115905 114477 113745 113742 114743 116861 119256 120675 120852 120593 120512 120463 120276 120193 120352 120513 120501 120336 119844
55345 119844 118764 117385 116401 115967 115536 114816 114273 114419 115104 115767 115998 115723 115235 115159 115890 116986 117575 117450
55327 117450 117299 117737 118569 119153 119047 118252 117156 116322 115967 115746 115351 115073 115256 115483 115048 114123 113611 113880
55309 113880 114467 115057 115891 116909 117392 116826 115581 114402 113725 113683 114192 114840 115177 115330 115841 116816 117796 118550
55291 118550 119325 120185 120824 121218 121775 122576 123173 123429 123846 124728 125652 126069 125868 125073 123675 122056 120905 120328
55273 120328 119716 118891 118619 119477 120863 121716 121733 121308 120808 120420 120283 120199 119660 118632 117899 118154 119180 120377
55255 120377 121569 122759 123560 123592 123135 122869 123191 124199 125891 127805 128908 128528 127179 125920 125197 124822
55239 124822 124703 124850 124882 124262 123052 121915 121422 121775 122960 124659 126123 126723 126587 126309 126185 126212 126552 127354
55221 127354 128203 128417 127907 127184 126514 125660 124537 123516 122921 122688 122755 123290 124315 125429 126174 126438 126324 125921
55203 125921 125379 124941 124702 124533 124440 124793 125912 127518 128782 128948 127818 125757 123430 121536 120613 120810 121756
55186 121756 122741 123243 123336 123551 124244 125209 125937 126143 125954 125650 125377 125157 125120 125584 126775 128486 130113 131097
55168 131097 131209 130419 128804 126783 125164 124556 124855 125578 126591 128065 129847 131361 132197 132443 132408 132381 132657
55151 132657 133342 134078 134338 134087 133749 133522 133221 132804 132497 132239 131639 130715 130039 129821 129445 128423 127263 126782
55133 126782 126978 127237 127395 127907 128950 129983 130359 130026 129495 129330 129710 130361 130813 130786 130343 129771 129447 129638
55115 129638 130110 130080 129039 127636 127128 127917 129231 130451 131896 133779 135198 135081 133837 133154 134154 136337
55099 136337 138294 138960 138171 136553 135130 134695 135313 136441 137464 138044 138199 138293 138784 139702 140487 140560 139971 139289
55081 139289 138937 138874 138816 138661 138720 139508 141104 142792 143745 144024 144380 145017 145218 144507 143427 142668 142035 140996
55063 140996 139775 139109 139134 139264 139089 138760 138544 138574 138994 139798 140540 140724 140496 140502 141031 141752 142337 142898 143656 144492
55043 144492 144951 144566 143180 141170 139292 138144 137820 138168 139042 140100 140746 140685 140296 140067 139960 139729 139552
55026 139552 139772 140194 140234 139649 138674 137524 136339 135541 135636 136518 137430 137718 137377 136872 136738 137263 138165 138604 137858
55007 137858 136042 134056 132950 133411 135381 137801 139180 138960 138087 137830 138428 139408 140601 142020 143199 143675
54991 143675 143941 144883 146408 147609 148220 148751 149158 148642 147172 146029 146214 147203 147898 147994 147692 146778 144864
54974 144864 142196 139587 137770 137196 138005 139696 141226 141950 142186 142493 142859 143065 143359 144130 145195 146035 146491
54957 146491 146759 146875 146799 146811 147292 148129 148777 148870 148428 147653 146834 146327 146243 146312 146403 146953 148429 150564 152588 154090
54937 154090 155128 155680 155675 155528 155916 156794 157294 156985 156647 157283 158765 160099 160849 161693 163501 166405 169996
54920 169996 174031 178585 183734 189442 195630 202015 207949 212767 216310 218800 220152 219924 218106 215439
54906 215439 212528 209003 204163 198239 192381 187363 182937 178599 174417 170737 167527 164523 161869 160127
54892 160127 159612 159987 160615 161164 161715 162384 163025 163452 163810 164464 165448 166341 166901 167598 169251 172273 176519 181637
54874 181637 187205 192676 197711 202636 208128 214268 220115 224271 225698 224151 220179 214837 209091 203419
54860 203419 198016 193167 189061 185419 181728 177802 173774 169768 166062 163388 162305 162209 161670 159957 157659
54845 157659 155626 153948 152345 150927 150003 149481 148943 148216 147572 147427 147906 148572 148690 148086 147587 148085 149305
54828 149305 150193 150458 150833 151696 152492 152961 153873 155743 157620 158064 156858 154969 153308 152291 152108 152482 152477
54811 152477 151525 150430 150475 151661 152771 153137 153353 154127 155347 156578 157718 158748 159444 159756 159991 160302 160405
54794 160405 160085 159602 159321 159245 159147 158897 158466 157937 157660 158094 159329 161014 162822 164569 165831 166057 165423 165047
54776 165047 165843 167462 168907 169940 171265 173367 175830 178047 180102 182602 185896 189852 194298 199304
54762 199304 204940 211034 217248 223192 228377 232305 234825 236180 236448 235120 231664 226436 220660 215407
54748 215407 210909 206842 202828 198545 193850 189133 185156 182251 179973 177815 175892 174531 173556 172543
54734 172543 171571 171165 171562 172476 173574 174739 175901 177005 178187 179697 181610 183854 186443 189432 192796
54719 192796 196667 201447 207230 213267 218545 222768 226224 228734 229462 227902 224462 219838 214404 208450
54705 208450 202509 197043 192149 187845 184266 181305 178490 175642 173325 172160 171948 171877 171478 170906 170377 169792
54689 169792 168973 167926 166757 165570 164532 163852 163589 163583 163628 163605 163405 162820 161676 160101 158562 157520 156988
54672 156988 156600 156180 156048 156541 157425 158115 158474 158975 159946 160978 161334 160748 159655 158757 158524 158972 159734 160361
54654 160361 160675 160826 161014 161291 161615 161881 161875 161385 160451 159350 158349 157689 157754 158830 160539 161947 162533 162778
54636 162778 163442 164559 165531 166086 166572 167309 168042 168197 167460 165958 164071 162227 160773 159955 159910 160629 161887
54619 161887 163355 164910 166669 168544 169875 169832 168233 165796 163564 162221 161899 162328 163009 163435 163374 162961
54603 162961 162509 162267 162320 162574 162797 162796 162606 162449 162484 162785 163492 164724 166181 167105 166971 166127 165428 165194 164919
54584 164919 164105 163051 162504 162736 163367 163957 164340 164331 163674 162587 161910 162219 162972 163063 162155 160995 160352 160147 159858
54565 159858 159358 159003 159141 159837 160921 162034 162704 162644 161949 160932 159937 159452 160030 161723 163731 165037 165334
54548 165334 165050 164600 164064 163533 163235 163171 163058 162816 162782 163228 164043 165028 166144 167177 167638 167425 167271 167986 169400
54529 169400 170574 170933 170664 170069 169188 168193 167570 167560 167825 167990 168168 168606 169109 169281 169170 169197 169453 169470 168856
54510 168856 167884 167258 167356 167819 167874 167096 165876 165083 165200 165849 166242 166056 165734 166035 167292 169056 170362 170495
54492 170495 169609 168521 167865 167656 167711 168098 168863 169640 169991 169975 169945 169907 169593 169187 169351 170327 171479 172020 171835
54473 171835 171310 170704 170100 169763 170094 171251 173011 174955 176544 177225 176867 176137 176101 177217 178852 179946 180061
54456 180061 179658 179357 179180 178689 177761 176856 176430 176358 176249 176085 176160 176505 176802 176861 176721 176241 175166 173790 173062
54437 173062 173614 175035 176410 177269 177644 177581 177140 176685 176630 176924 177206 177432 177939 178834 179808 180610 181344 182094 182535
54418 182535 182203 181091 179807 179150 179480 180404 181151 181299 181054 180775 180475 180043 179710 179870 180503 181171 181642 182173
54400 182173 183043 184050 184652 184527 183971 183856 184974 187201 189385 190456 190583 190839 191737 192606 192620 191915 191290
54383 191290 191104 190973 190438 189508 188510 187770 187540 187976 188940 189919 190371 190223 189939 190031 190520 190985 191123 191108 191307
54364 191307 191788 192295 192631 192875 193146 193337 193243 192884 192590 192670 193005 193039 192361 191256 190537 190731 191598 192490 192975
54345 192975 192970 192560 191991 191674 191829 192126 191972 191202 190317 189953 190294 190987 191514 191648 191663 192068 193110 194670 196677
54326 196677 199339 202745 206595 210637 215158 220492 226225 231412 235611 239234 242794 246178 248704 249498
54312 249498 247829 243616 237857 232100 227220 222978 218858 214888 211422 208577 206304 204694 203788 203256 202602
54297 202602 201616 200403 199138 197998 197146 196540 195910 195103 194237 193353 192261 191050 190446 191116 192739 194180
54281 194180 194617 194161 193433 192972 193102 193942 195264 196537 197276 197319 196778 195924 195136 194748 194783 194985 195218 195697 196662
54262 196662 197898 198729 198616 197719 196834 196667 197198 197794 197988 197948 198057 198287 198275 197967 197743 197787 197680 196946 195834
54243 195834 195116 195131 195409 195406 195249 195403 195743 195474 194079 192070 190588 190399 191462 193319 195598 198057 200316
54226 200316 201771 201954 201025 199772 198949 198660 198501 198129 197451 196393 195025 193976 194131 195609 197402 198385
54210 198385 198395 197992 197592 197240 196932 196625 196092 195263 194529 194248 194217 194170 194458 195520 196884 197554 197416 197424 198194 199256
54190 199256 199946 200285 200547 200635 200367 199857 199142 197984 196492 195450 195445 196083 196618 196993 197667 198744 199886 200883
54172 200883 201698 202091 201795 201041 200410 200097 199747 199032 198083 197360 197312 198087 199228 199810 199216 197786 196465 195920
54154 195920 196216 197050 197884 198034 197168 195764 194699 194337 194345 194329 194277 194348 194611 195130 195996 197081 197969 198277 198030
54135 198030 197728 198050 199332 201228 203045 204495 205851 207191 207890 207295 205700 204161 203410 203335 203456 203485 203385
54118 203385 203272 203337 203684 204264 205119 206459 208206 209747 210627 211273 212499 214338 215963 216747 216814 216478 215775
54101 215775 214784 213838 213074 212166 210839 209338 208137 207464 207339 207758 208509 209055 208942 208262 207549 207384 208148 209794
54083 209794 211619 212583 212243 211273 210756 211099 211888 212655 213366 214174 215069 215948 216832 217836 218989 220188 221317
54066 221317 222359 223359 224252 224807 224826 224429 224013 223833 223721 223330 222645 222170 222539 223901 225659 226903 227164
54049 227164 226822 226733 227475 228983 230848 232830 235005 237539 240460 243783 247724 252549 258133 263913 269483
54034 269483 275036 280920 286946 292620 297967 303468 309082 313968 317587 320493 323596 327120 330850 334885
54020 334885 339342 343583 346639 348498 350228 352732 355973 359515 363142 366770 370440 374765 380877 389493
54006 389493 400354 412768 426116 439362 450542 457420 458703 454329 444874 431213 414729 397214
53994 397214 380158 364195 349342 335687 323690 313761 305685 298668 292065 285900 280521 275944 271869
53981 271869 268185 265045 262459 260256 258533 257640 257459 257145 255929 253988 252189 251139 250733 250473 249881 248715
53965 248715 247125 245688 245048 245361 246072 246311 245606 244318 243340 243293 244034 245066 246223 247690 249423 250986
53949 250986 252053 252799 253644 254851 256452 258355 260422 262646 265284 268594 272390 276204 279878 283649 287587
53934 287587 291388 294925 298557 302576 306704 310465 313769 316794 319543 321911 324023 326204 328774 332111
53920 332111 336640 342358 348510 354199 359279 364317 369750 375478 381275 387175 393265 399377 405166 410353
53906 410353 414757 418226 420719 422458 423848 425136 426130 426347 425501 423722 421238 418030 414035 409530 404950
53891 404950 400321 395254 389563 383539 377549 371678 365874 360055 354003 347568 341173 335650 331350 327822
53877 327822 324600 321770 319393 316979 314179 311488 309517 307925 305940 303734 302279 301782 301187 299576 297261
53862 297261 294999 292800 290220 287439 285253 284040 283310 282438 281487 281100 281824 283744 286712 290670 295659
53847 295659 301608 308347 315864 324425 334353 345901 359550 376217 396768 421159 448171 475879
53835 475879 502049 524080 539226 545645 543461 534594 521388 505408 487437 468201 448663 429605
53823 429605 411316 393937 377902 363731 351478 340738 331205 322914 315857 309688 304087 299173 295376
53810 295376 292982 291973 292112 292990 294154 295424 297046 299368 302434 305958 309560 312951 316097 319298 322846
53795 322846 326409 329096 330422 331039 332158 334401 337466 340688 343527 345657 347048 348043 349024 349946 350382
53780 350382 349938 348382 345544 341499 336808 332184 327891 323770 319732 315801 311703 307037 302024 297581
53766 297581 294304 291773 289197 286467 284127 282478 281164 279700 278082 276684 275679 274725 273320 271386
53752 271386 269398 267822 266606 265453 264500 264356 265415 267361 269514 271394 272794 273480 273192 271968 270307
53737 270307 268912 268227 268151 268135 267626 266524 265238 264311 264034 264368 265189 266483 268339 270707 273221 275359 276827
53720 276827 277758 278521 279449 280759 282519 284579 286681 288798 291186 293950 296714 298975 300604 301836 302873
53705 302873 303823 304872 306180 307608 308891 310061 311470 313402 315953 319214 323178 327487 331676 335717
53691 335717 339936 344248 347965 350576 352361 353888 355193 355815 355483 354433 353082 351690 350331 349023 347752
53676 347752 346424 344843 342860 340661 338815 337770 337260 336536 335278 334111 334021 335397 337676 339720 340433
53661 340433 339365 337054 334658 333011 332039 331144 330020 328912 328264 328303 328919 329813 330800 332007 333600 335287
53645 335287 336366 336477 336075 335900 336170 336596 336969 337305 337544 337585 337690 338422 340026 342196 344599 347275 350233
53628 350233 353007 355008 356228 357274 358736 360835 363582 366881 370384 373657 376663 379811 383288 386697
53614 386697 389712 392828 396908 402045 407354 411969 415811 419273 422706 426442 430800 435617 440116 443697
53600 443697 446609 449338 451701 453195 454026 454959 456068 456525 456015 455594 456478 458390 459774 459500 457850 455904
53584 455904 454470 453613 452791 451309 448890 445961 443223 440912 438647 435996 432973 429941 427221 424868 422743
53569 422743 420707 418816 417274 416105 414988 413648 412355 411755 412129 413076 414069 415023 416111 417235 418068 418541
53553 418541 419023 419997 421769 424545 428482 433543 439503 446195 453579 461494 469579 477588 485479 492962 499272
53538 499272 503813 506844 509044 510556 511101 511048 511654 513879 517513 521845 526768 532725 539946 548325 557840
53523 557840 568509 580042 592072 604743 618527 633453 648939 664529 680375 696916 714491
53512 714491 733319 753448 774571 796290 818738 842529 867875 894119 920380 946314 971942
53501 971942 997071 1021321 1044559 1066899 1088318 1108605 1127701 1145923 1163829 1181916 1200358
53490 1200358 1218866 1236967 1254566 1272147 1290263 1308958 1327796 1346298 1364104 1380925 1396713
53479 1396713 1411866 1426948 1442025 1456469 1469474 1480591 1489665 1496484 1500803 1502721 1502745 1501264 1497991
53466 1497991 1492175 1483480 1472554 1460563 1448194 1435193 1420856 1404864 1387665 1370116 1352731 1335184
53454 1335184 1316654 1296738 1275926 1254983 1234046 1212678 1190821 1169289 1149073 1130397 1112686
53443 1112686 1095422 1078788 1063440 1049801 1037766 1027145 1018218 1011498 1006923 1003619 1000737 998296
53431 998296 996904 996872 998043 1000360 1004109 1009495 1016380 1024506 1033666 1043660 1054477 1066599 1080733 1097098
53417 1097098 1115257 1134719 1155357 1177127 1199789 1223105 1247102 1272040 1298487 1327403 1359615
53406 1359615 1394937 1432180 1470282 1509094 1549002 1590339 1633486 1678962 1726845 1776422 1826861
53395 1826861 1877983 1929996 1982792 2036067 2089872 2144463 2199676 2254857 2309331 2362544 2413878
53384 2413878 2462859 2509540 2554305 2597251 2637980 2675801 2709785 2738862 2762558 2781656 2797618
53373 2797618 2811083 2821305 2827076 2827754 2823193 2813181 2797444 2776046 2749333 2717441 2680146 2637363
53361 2637363 2589704 2538393 2484689 2429516 2373651 2317993 2263336 2209955 2157701 2106544 2056759
53350 2056759 2008550 1961865 1916652 1872894 1830291 1788266 1746554 1705410 1665016 1625196 1586046
53339 1586046 1548432 1513341 1480984 1450961 1422950 1396732 1371955 1348545 1327221 1308891 1293507
53328 1293507 1280095 1267775 1256178 1244873 1233167 1220738 1207934 1195203 1182660 1170449 1159089
53317 1159089 1149175 1140924 1134187 1128692 1124155 1120436 1117704 1116250 1116181 1117513 1120471 1125183 1131132 1137467
53303 1137467 1144095 1152008 1162272 1175033 1189731 1205904 1223496 1242604 1263287 1285504 1309062 1333677
53291 1333677 1359138 1385271 1411771 1438285 1464587 1490395 1515060 1537907 1558874 1578334 1596213
53280 1596213 1611814 1624648 1634898 1642814 1648204 1650867 1650978 1648569 1643114 1634269 1622744 1609767 1595778
53267 1595778 1580157 1562194 1541805 1519290 1494950 1469154 1442445 1415336 1388087 1360768 1333343
53256 1333343 1305684 1277618 1249087 1220223 1191266 1162461 1134019 1106142 1079085 1053092 1028112
53245 1028112 1003598 978879 953873 929188 905440 882744 860994 840275 820692 802089 784334
53234 784334 767721 752701 739291 727046 715505 704368 693429 682774 672914 664243 656305 648117
53222 648117 639268 630221 621345 612190 602095 591126 579954 568983 558065 546969 535762 524707
53210 524707 514109 504324 495654 488166 481728 476168 471162 466096 460466 454443 448639 443161 437332 430612
53196 430612 423376 416378 409771 403215 396749 390871 385739 380878 375913 371091 366885 363512 361056 359537
53182 359537 358526 357130 354832 352043 349424 347053 344749 342843 341892 341770 341770 341638 341825 342581 343396 343628 343245
53165 343245 342640 342129 341925 342290 343317 344673 345791 346252 345943 345041 344021 343487 343805 344876 346238 347290
53149 347290 347541 346857 345464 343539 341020 338139 335840 335020 335341 335426 334382 332547 330618 328766 327007 325816
53133 325816 325649 326195 326646 326550 325954 324946 323593 322213 321218 320685 320408 320355 320770 321808 323328 324988 326406
53116 326406 327385 328160 329278 330946 332702 333906 334395 334376 333990 333336 332647 331992 330995 329322 327303 325505 323744
53099 323744 321176 317548 313835 311316 310338 310204 309996 309264 308124 306952 305983 305136 304255 303383 302653 301984 301191
53082 301191 300353 299785 299584 299484 299222 298800 298286 297617 296709 295601 294426 293416 292871 292843 292856 292381 291731 292017
53064 292017 293857 296429 298249 298753 298747 299359 300971 303193 305467 307426 308932 310067 311093 312239 313501
53049 313501 314755 316055 317609 319357 320698 320906 319907 318464 317427 316869 316137 314728 312832 310949 309156
53034 309156 307072 304491 301784 299509 297769 296235 294787 293804 293602 293827 293756 293198 292719 292844 293350 293575 293250
53017 293250 292721 292463 292657 293229 293989 294647 294914 294807 294761 295258 296300 297352 297837 297685 297332 297203 297272 297208 296872
52998 296872 296492 296347 296442 296627 296904 297437 298221 298919 299131 298849 298572 298859 299776 300878 301838 302894 304468 306470
52980 306470 308289 309465 310077 310409 310601 310776 311189 311959 312864 313594 314101 314535 315028 315740 316884 318433 319957
52963 319957 321057 321920 323166 325166 327667 330038 331711 332520 332787 333022 333363 333412 332780 331579 330140 328453
52947 328453 326272 323626 320855 318179 315640 313421 311776 310549 309198 307493 305829 304648 303856 303109 302412
52932 302412 302027 301924 301657 300928 300018 299568 299968 301030 302143 302675 302297 301123 299670 298585 298182 298161 297974
52915 297974 297506 297227 297540 298231 298783 299067 299392 299953 300542 300844 300769 300394 299855 299413 299452 300160 301236 302006 301909
52896 301909 300928 299619 298719 298624 299174 299882 300327 300367 300163 300034 300121 300086 299324 297627 295481 293613 292406 291822
52878 291822 291612 291363 290698 289793 289471 290354 292035 293478 294114 294127 293828 293381 293151 293681 295029 296571 297777
52861 297777 298852 300352 302462 304970 307707 310606 313443 315803 317390 318249 318684 319004 319267 319246 318692 317578
52845 317578 315889 313342 309672 305216 300783 296816 293144 289786 287480 286894 287558 288191 288077 287597 287357 287334
52829 287334 287154 286820 286692 286897 287132 287087 286722 286095 285278 284597 284604 285419 286291 286332 285620 285122 285404 285980 286213 286357
52809 286357 287204 289026 291390 293865 296373 298911 301421 303928 306303 307906 307950 306372 303884 301029 297682
52794 297682 293685 289553 286165 284075 283401 284048 285625 287356 288523 289058 289432 289970 290525 290801 290823 290946 291490
52777 291490 292455 293669 295169 297218 299824 302444 304476 305945 307438 309313 311274 312680 313042 312207 310408
52762 310408 308125 305617 302692 299290 296164 294367 294000 294062 293744 293233 293038 293187 293541 294245 295239 295806 295377
52745 295377 294527 294435 295448 296773 297550 297660 297484 297463 297973 299088 300281 300819 300618 300359 300615 301227 301760 302197
52727 302197 302877 303924 305037 305834 306163 306113 305842 305484 305202 305194 305469 305654 305231 304119 302785 301627 300538 299351
52709 299351 298419 298268 298796 299327 299521 299794 300688 302183 303832 305243 306190 306518 306250 305755 305573 306064 307245
52692 307245 308832 310395 311570 312261 312582 312590 312274 311859 311904 312852 314540 316284 317472 317954 317918 317552 316917 316125
52674 316125 315542 315692 316887 318890 320999 322490 323044 322799 322135 321402 320864 320725 321076 321685 321987 321523 320461
52657 320461 319468 318938 318550 317806 316843 316362 316750 317580 318179 318439 318827 319635 320502 320782 320244 319256 318358 317767 317314
52638 317314 316701 315822 314904 314358 314334 314460 314316 314216 315106 317359 320085 322153 323621 325502 328179 330830 332598
52621 332598 333591 334314 334704 334279 332902 330873 328482 325930 323552 321726 320645 320406 321021 322040 322548 322022
52605 322022 320971 320233 319867 319270 318161 316857 315714 314957 315010 316267 318418 320559 322170 323489 324851 326233
52589 326233 327589 329031 330439 331406 331852 332163 332479 332415 331914 331776 332807 334772 336809 338528 340133 341671
52573 341671 342757 343051 342538 341409 340069 339179 339210 339946 340736 341198 341295 340855 339658 338087 337120 337290 337972 338025
52555 338025 336972 335339 333989 333387 333355 333376 333077 332486 331793 330971 329882 328704 327856 327394 326888 326128 325561 325660
52537 325660 326200 326709 327397 328955 331351 333476 334278 333811 332873 332026 331372 330952 330828 330867 330896 331028 331451 331976
52519 331976 332195 332191 332613 333912 335829 337836 339835 342131 344910 347983 351006 353853 356767 360148 364005
52504 364005 367706 370457 371976 372322 371251 368367 364117 359936 356943 354873 352755 350216 347545 344853
52490 344853 341972 339152 337159 336466 336790 337498 338059 338134 337720 337389 337863 339164 340502 341171 341210 341097 341297 342282
52472 342282 344474 347733 351146 353748 355315 356328 357423 359145 361875 365488 369187 372027 373699 374634
52458 374634 375453 376480 377625 378421 378231 376691 374023 370813 367560 364492 361563 358431 354661 350316 346236
52443 346236 343365 341814 340896 340073 339470 339324 339363 339082 338486 338144 338487 339268 339892 340109 340218 340595 341252 341943
52425 341943 342568 343256 344013 344489 344258 343331 342328 342039 342767 344101 345455 346810 348738 351561 354814 357903
52409 357903 361137 365628 372092 380224 389409 399632 411265 424251 437798 450703 461564 468920 471795
52396 471795 470327 465540 458383 449215 438384 426955 416457 407902 401273 396031 391909 388963 386985
52383 386985 385284 383262 380998 378949 377240 375725 374750 375216 377532 380883 384032 386689 389628 393562 398405
52368 398405 403643 408931 414085 418854 422997 426377 428793 429896 429502 427908 425677 423187 420542 417879
52354 417879 415598 414249 414163 415138 416476 417506 418138 418797 419734 420664 421243 421707 422714 424673 427546 431218
52338 431218 435613 440390 445032 449517 454559 460805 468092 475887 484275 493912 505036 517035 529223
52325 529223 541612 554659 568554 583033 597762 612609 627653 643035 658696 674229 689235
52314 689235 703920 718989 734760 750767 766488 782047 797786 813568 829071 844483 860208
52303 860208 876045 891345 905947 920221 934155 947227 959392 971324 983150 993551 1000750 1004045
52291 1004045 1003963 1001389 997076 991688 985620 978869 971519 964100 957044 950078 942805 935706 929887 925785
52277 925785 922787 920262 918408 917831 918732 920784 923520 926716 930686 936318 944484 955136 967170 979315
52263 979315 991009 1002434 1014081 1026378 1039357 1052465 1064997 1076925 1089022 1101938 1115442
52252 1115442 1128770 1141353 1152869 1162959 1171485 1178916 1185818 1191850 1195671 1196104 1193105 1187526 1180283
52239 1180283 1172065 1163526 1155269 1147488 1139890 1132148 1124347 1116815 1109604 1102303 1094497 1086307 1078337 1071036
52225 1071036 1064284 1057660 1051018 1044683 1039109 1034464 1030533 1026942 1023489 1020342 1017960 1016764 1016863 1018045
52211 1018045 1019980 1022437 1025407 1029160 1034055 1040145 1046973 1053892 1060550 1066920 1072941 1078460 1083553 1088555
52197 1088555 1093496 1097833 1101111 1103769 1106830 1110782 1115153 1119285 1123097 1126842 1130497 1133875 1137124 1140630
52183 1140630 1144356 1147575 1149350 1149039 1146352 1141287 1134280 1126128 1117514 1108625 1099424 1090209 1081668 1074425
52169 1074425 1068691 1064389 1061432 1059748 1059145 1059308 1060052 1061538 1064200 1068387 1074022 1080522 1086960 1092397 1096263
52154 1096263 1098686 1100415 1102244 1104335 1106166 1107174 1107369 1107274 1107373 1107774 1108421 1109392 1110771 1112291 1113406 1113862
52138 1113862 1114060 1114591 1115476 1116130 1116127 1115780 1115883 1117054 1119431 1122800 1127032 1132610 1140701 1152213 1166622 1182287
52122 1182287 1198350 1215851 1236396 1260107 1285629 1311890 1338840 1366379 1393527 1419171 1442961
52111 1442961 1464993 1485157 1503365 1520022 1535642 1550236 1563520 1575533 1586546 1596595 1605592
52100 1605592 1613834 1621862 1629844 1637526 1644778 1651762 1658459 1664409 1668993 1671615 1671529 1667856 1660117 1648621
52086 1648621 1634211 1617746 1599970 1581681 1563740 1546906 1531792 1518991 1508983 1501729 1496516 1492558
52074 1492558 1489866 1489194 1490929 1494424 1498829 1504280 1511584 1520853 1531185 1541888 1553269 1565811 1579183
52061 1579183 1592589 1605552 1617838 1629053 1639070 1648528 1658195 1667953 1677015 1684963 1691861 1697464 1701152
52048 1701152 1702791 1702941 1701908 1699136 1693796 1685562 1674609 1661345 1646467 1630883 1615243 1599733 1584537
52035 1584537 1570176 1557144 1545425 1534589 1524243 1514283 1504863 1496188 1488084 1479801 1470536 1460251
52023 1460251 1449669 1439412 1429477 1419623 1409814 1400069 1390249 1380286 1370385 1360821 1351745 1343273 1335478
52010 1335478 1328195 1321200 1314672 1308970 1303738 1297738 1289978 1280556 1270000 1258159 1244319 1228186 1210207
51997 1210207 1191035 1171110 1150755 1130322 1110278 1091323 1074213 1059139 1045492 1032584 1020379
51986 1020379 1009037 997999 986229 973422 960352 947760 935387 922461 908829 895230 882386
51975 882386 870039 857028 842426 826627 811130 797169 784877 774051 765292 759699 757535 757885
51963 757885 759805 763199 768355 775150 783134 791951 801178 810020 817622 823478 827098 827531 823905 816493
51949 816493 806712 795851 784277 772141 760347 750337 743072 738697 737154 738547 742734 748964 756362
51936 756362 764674 774165 784739 795394 804719 811774 816371 818596 818322 815249 809238 800416 788996 775220
51922 775220 759580 742947 726250 710008 694344 679431 665686 653388 642306 632014 622520 614349
51910 614349 607993 603493 600648 599365 599637 601289 604036 607841 613089 620286 629610 640823 653569 667557
51896 667557 682284 696679 709284 718827 724409 725207 720544 710703 697370 682718 668080 653886 640724
51883 640724 629744 621793 616701 613852 613145 615121 620406 629381 642138 658441 677815 699885 724394
51870 724394 750637 777169 802461 825638 846158 862941 874351 879008 876287 866275 849931 829310
51858 829310 806880 784228 761831 740242 720794 704661 691794 681477 673582 668416 665443 663074
51846 663074 660012 656194 652068 647549 642194 636035 629612 623298 617106 611072 605356 599988 594986 590793
51832 590793 588143 587316 587920 589550 592214 595832 599794 603396 606376 608516 609069 607229 603123 597816 592240
51817 592240 586637 581092 576104 572377 570396 570360 572190 575458 579625 584467 589870 595050 598524 599265 597553
51802 597553 594327 590059 584710 578509 572165 566311 561188 556854 553277 550190 547216 544261 541530 539152
51788 539152 537028 535070 533288 531638 530085 528851 528271 528325 528585 528685 528529 527982 526823 525241 523978 523609
51772 523609 523949 524529 525446 527319 530570 535269 541624 550012 560268 571435 582598 593645 604786 615523
51758 615523 624550 630625 633169 632043 627320 619515 609660 598808 587589 576383 565615 555570 546164
51745 546164 537349 529597 523570 519389 516712 515566 516535 519872 524877 530626 537074 545031 555117 567051
51731 567051 579883 592541 604021 613394 619973 623581 624660 624100 622897 621800 621073 620497 619560 617748
51717 617748 614728 610389 604901 598894 593434 589436 586950 585305 584075 583566 584101 585298 586654 588600 592277
51702 592277 598205 605799 614211 622988 631664 639330 645081 648565 649861 649291 647645 646133 645607 646120 647410
51687 647410 649373 651624 653134 652855 650399 645672 638364 628510 617218 606102 596152 587860 582113 579911
51673 579911 581072 584045 587327 590451 593415 595908 597566 598552 599534 601313 604528 609215 614399 618588 620948
51658 620948 621621 620803 618141 613474 607645 602028 597599 594906 594562 597036 602024 608531 615599 622509 628322
51643 628322 631712 631487 627133 618860 607427 593982 579790 565817 552503 539878 527840 516434
51631 516434 506077 497512 491319 487351 484743 482617 480760 479557 479284 479656 480147 480596 481281 482451 484054
51616 484054 485961 488061 489922 490772 490234 488879 487604 486646 485640 484509 483619 483168 483095 483729 485735 489064
51600 489064 492687 495945 499678 505338 513325 522874 533426 545359 559175 574425 589575 602679 612210
51587 612210 617621 619352 618194 614772 609763 604402 600271 598436 598997 601537 605868 612423 622180 636247
51573 636247 655227 678840 706210 736471 769080 803743 840354 878936 919362 961155 1003762
51562 1003762 1046890 1090335 1133639 1176534 1219794 1265186 1314244 1367176 1422812 1478920 1532243
51551 1532243 1578739 1614467 1636456 1642808 1632522 1605829 1564557 1511582 1449663 1380990 1307737
51540 1307737 1232579 1158373 1087504 1021574 961486 907562 859714 817677 781143 749673 722641
51529 722641 699344 679128 661370 645511 631255 618589 607496 597739 589048 581400 574915 569558
51517 569558 565152 561589 558798 556495 554264 551966 549840 548064 546412 544496 542142 539343 536008 532024
51503 532024 527566 523174 519450 516763 515125 514224 513622 513096 512791 512975 513725 514970 516712 518928 521244 522955
51487 522955 523536 523095 522303 521867 521995 522235 521853 520483 518365 515874 513035 509701 506097 502755 499909 497288
51471 497288 494631 492124 490105 488642 487626 487159 487536 488941 491329 494553 498330 502084 505033 506580 506628
51456 506628 505529 503789 501830 499932 498291 497079 496444 496532 497563 499838 503603 508875 515502 523485 533287
51441 533287 545790 561748 580968 601885 622064 639336 652570 661542 666522 668260 668017 667087 666117
51428 666117 664987 663115 659652 653624 644544 633002 620321 607589 595329 584016 574306 566529 560484
51415 560484 556003 553256 552217 552278 552898 554197 556420 559065 561241 562826 564610 567142 569991 572417 574373
51400 574373 576399 578668 580578 581451 581428 581533 582930 586267 591741 599499 609723 622465 637697 655575
51386 655575 676429 700531 728203 760166 797433 840693 890098 945782 1008222 1077843 1154554
51375 1154554 1237836 1326772 1419432 1512338 1600981 1680888 1748081 1799042 1831064 1842908 1834840
51364 1834840 1808007 1764091 1705539 1635606 1557734 1474857 1389264 1302938 1217913 1136275 1059792
51353 1059792 989438 925454 867977 817408 773981 737194 706048 679700 657484 638455 621446
51342 621446 605727 591237 578051 565995 554942 545097 536678 529481 523078 517380 512774 509681 508009
51329 508009 507115 506321 505485 504941 504849 504834 504515 504142 504261 504766 504796 503725 501877 500043 498644 497700 497360 497989
51311 497989 499738 502264 504965 507359 509262 510766 512073 513247 514092 514343 513981 513286 512537 511682 510336 508063
51295 508063 504703 500466 495805 491180 486759 482271 477267 471765 466594 462823 460892 460552 461652 464461
51281 464461 469007 474609 480531 486790 493793 501389 508900 515988 522935 529959 536809 543172 549021 554321
51267 554321 558799 562321 565161 567630 569651 570861 570903 569461 566395 562088 557353 552665 547694 541940 535600
51252 535600 529408 523741 518287 512617 506811 501427 497057 493923 491751 490051 488579 487497 487010 486974 486982 486678
51236 486678 485823 484311 482404 480832 480319 480968 482313 483842 485184 485941 485844 485217 484871 485257 486018 486582 486898
51219 486898 487280 487781 488182 488576 489503 491319 493725 496106 498150 500013 502050 504595 507828 511590 515361
51204 515361 518603 521221 523568 525981 528408 530452 531741 532264 532384 532474 532495 532035 530886 529356 527834 526324
51188 526324 524782 523743 523948 525296 526719 527446 527918 529019 530761 532230 532700 532336 531866 531985 533050 534990
51172 534990 537377 539744 541888 543737 545070 545599 545216 543926 541667 538567 535245 532465 530454 528862 527361
51157 527361 525967 524737 523524 522104 520253 517736 514565 511295 508625 506586 504474 501713 498481 495360
51143 495360 492774 490949 490034 489965 490406 491082 492054 493530 495567 498039 500634 502808 504023 504279 504227 504565 505425
51126 505425 506383 506880 506621 505882 505504 506269 508134 510375 512546 514967 518154 522214 526982 532285 537786 542976
51110 542976 547617 551837 555479 557838 558435 557657 556206 554297 551937 549555 547654 546086 544370 542597 541285
51095 541285 540315 538772 536068 532706 529733 527800 526885 526561 526389 526350 526946 528573 530807 532751 534064 535150
51079 535150 536323 537419 538451 539962 542302 545060 547670 550154 552773 555317 557392 559175 561257 563787
51065 563787 566464 569386 573255 578545 585044 592618 601888 613518 627027 640882 653767 665257 675207
51052 675207 683154 688886 693354 698475 705843 715749 727418 739902 752647 765415 777892 789467 799513
51039 799513 807871 814786 820125 822950 822422 819112 814761 810408 805156 797084 785011 769083 750198 729569
51025 729569 708666 688757 670331 653344 638097 625399 615757 608891 604286 601838 601715 603859 607913
51012 607913 613397 619733 626340 633045 640302 648710 658325 668617 679060 689522 700115 710867 721614
50999 721614 732122 742220 751909 761384 770933 780813 791203 802283 814331 827717 842693 859066
50987 859066 876131 893060 909475 925636 942080 959126 976668 994282 1011488 1028002 1043799
50976 1043799 1058833 1072668 1084468 1093500 1099737 1104019 1107708 1112228 1118852 1128741 1142917 1162041 1186228
50963 1186228 1215223 1248789 1286836 1329161 1375273 1424607 1476736 1531176 1586990 1642732 1696786
50952 1696786 1747771 1794802 1837508 1875734 1909169 1937424 1960540 1979155 1993988 2005417 2013844
50941 2013844 2020172 2025355 2029500 2031818 2031425 2027846 2020808 2010105 1995883 1978676 1959008 1937285 1914161
50928 1914161 1890419 1866128 1840318 1811883 1780585 1746802 1710669 1671981 1630841 1587782 1543227
50917 1543227 1497310 1450392 1403357 1357165 1312424 1269651 1229650 1193196 1160378 1130558 1103082
50906 1103082 1077850 1055084 1034731 1016290 999221 983343 968841 955960 944751 935005 926375 918688
50894 918688 912146 907037 903180 899873 896617 893699 891747 890855 890495 890254 890229 890639 891472 892760 894871 898221
50878 898221 902827 908319 914197 919979 925395 930738 936784 944043 952316 961311 971443 983458 997384
50865 997384 1012440 1028138 1044957 1063658 1084404 1106999 1131776 1159731 1191788 1228244 1268968
50854 1268968 1313821 1362850 1416355 1474986 1539692 1611375 1690572 1777408 1871685 1972954 2080656
50843 2080656 2194409 2314000 2438903 2567789 2698736 2829857 2959400 3085156 3204100
50834 3204100 3312969 3409173 3490987 3557070 3606178 3637578 3651671 3650247 3636121 3612329 3581400
50823 3581400 3545351 3506331 3467050 3430232 3397792 3370752 3349663 3334415 3323461 3313827 3302377
50812 3302377 3286918 3265906 3237528 3199652 3150672 3090029 3017948 2935043 2842361 2741607 2635148
50801 2635148 2525705 2415855 2307659 2202741 2102680 2009040 1922854 1844362 1773578 1710934
50791 1710934 1656974 1611511 1573545 1541970 1516024 1495122 1478832 1467172 1460292 1457420 1456515 1455562
50779 1455562 1454040 1452661 1451748 1450421 1447499 1442671 1436447 1429206 1420681 1410395 1398335 1385087 1371337
50766 1371337 1357274 1342439 1326125 1308023 1288496 1268307 1248057 1227898 1207805 1188100 1169624
50755 1169624 1153233 1139158 1127010 1116469 1107766 1101371 1097454 1095947 1097023 1101122 1108399 1118435 1130763
50742 1130763 1145484 1163160 1184218 1208742 1236875 1269118 1306008 1347505 1392899 1441443 1493092
50731 1493092 1548488 1608148 1671766 1738483 1807636 1878884 1951537 2024263 2095865 2166111 2235299
50720 2235299 2302984 2367513 2426845 2479399 2523879 2558650 2581853 2592174 2589385 2574189 2547931
50709 2547931 2512582 2470806 2425634 2379866 2335766 2295249 2260097 2231581 2209772 2193511 2181385
50698 2181385 2172726 2167427 2164802 2162857 2158706 2149547 2133321 2108843 2075700 2034201 1985427 1931282
50686 1931282 1874130 1816011 1758168 1701623 1648112 1599885 1558395 1523549 1494579 1471363 1454565
50675 1454565 1444743 1441759 1445049 1454069 1468444 1487862 1511857 1539555 1569698 1601066 1632789 1664127
50663 1664127 1694092 1721632 1746212 1768041 1787722 1805846 1822876 1839187 1855055 1870597 1885718
50652 1885718 1900223 1914129 1927879 1942003 1956625 1971611 1987313 2004724 2024759 2047815 2074364
50641 2074364 2105417 2141744 2182883 2227562 2275020 2325278 2378247 2433216 2489397 2546361 2603738
50630 2603738 2660991 2717865 2774797 2832506 2891026 2948780 3002134 3045902 3074886 3085417 3075799
50619 3075799 3046104 2998485 2937613 2869840 2801249 2736446 2678718 2630233 2591666 2562276 2540840
50608 2540840 2526224 2517004 2511269 2507208 2503324 2497761 2488135 2472488 2449799 2419084 2378888 2328592
50596 2328592 2269718 2205024 2136591 2065605 1993493 1922050 1852354 1784609 1719269 1657536 1600515
50585 1600515 1548628 1502032 1460861 1424752 1392885 1364940 1341419 1322627 1307968 1296793 1289447
50574 1289447 1286722 1288481 1293471 1300446 1308890 1318547 1328721 1338403 1346978 1354639 1362036 1369562 1377048 1384271
50560 1384271 1391704 1400553 1412003 1426572 1444210 1464710 1487938 1513903 1542776 1574550 1608524 1643323
50548 1643323 1677710 1711220 1743787 1774999 1804139 1830929 1855963 1880389 1905426 1932123 1961314
50537 1961314 1993634 2029773 2070606 2116856 2168638 2225727 2288424 2357822 2434908 2519658 2611322
50526 2611322 2709468 2814300 2925972 3043987 3167284 3294444 3423550 3552277 3678477 3800466
50516 3800466 3916383 4023545 4118942 4200286 4266082 4314779 4344510 4353954 4342981 4312279 4262892
50505 4262892 4196568 4116104 4024694 3925057 3819754 3712349 3607691 3510806 3425563 3354299 3298271
50494 3298271 3258213 3234565 3227215 3234930 3255092 3284215 3318677 3354677 3387511 3411389 3420510 3410588
50482 3410588 3379599 3327409 3255084 3164616 3059078 2942644 2819996 2695423 2572172 2452407
50472 2452407 2337428 2227969 2124593 2028049 1939101 1857945 1784067 1716805 1655770 1600500 1550099
50461 1550099 1503776 1461556 1424024 1391353 1363057 1338699 1318358 1302239 1290171 1281714 1276524 1274360
50449 1274360 1274845 1277377 1281303 1286259 1292406 1300256 1310048 1321352 1333405 1345723 1358151 1370459 1382200
50436 1382200 1392889 1402061 1409298 1414681 1419157 1423977 1429679 1435965 1442515 1449442 1456889 1464814 1473453 1483485
50422 1483485 1495452 1509442 1525645 1544787 1567574 1594045 1623884 1657087 1693887 1734274 1778075
50411 1778075 1825408 1876645 1932056 1991805 2056091 2124713 2196489 2269574 2342392 2413869 2482740
50400 2482740 2547170 2605339 2656130 2699007 2733383 2758192 2771899 2772800 2759645 2732342 2692040 2640376
50388 2640376 2578695 2508183 2430722 2349379 2267832 2189211 2115484 2047922 1988020 1937722 1898601
50377 1898601 1870926 1853718 1845681 1845882 1853471 1866927 1883760 1900882 1915207 1924030 1925183 1917193 1899475
50364 1899475 1872412 1837208 1795512 1748970 1698853 1646016 1591248 1535774 1481304 1429409 1380828
50353 1380828 1335479 1293122 1253808 1217630 1184305 1153315 1124407 1097741 1073480 1051461 1031425
50342 1031425 1013455 997914 984943 974154 964951 957015 950352 944985 940793 937625 935389 934047 933672
50329 933672 934420 936129 937992 939160 939807 941169 944178 948497 953298 958527 964691 971652 978502 984728 990748
50314 990748 997082 1003596 1009880 1015778 1021142 1025581 1029082 1032647 1037751 1045160 1054622 1065612 1078040 1092244
50300 1092244 1108554 1126869 1146504 1166465 1185901 1204109 1220012 1232089 1239231 1241595 1240257 1236191
50288 1236191 1229934 1222217 1214401 1208074 1204330 1203398 1204535 1206074 1205816 1201836 1193234 1180327 1164226 1146224
50274 1146224 1127428 1108803 1091338 1075965 1063274 1053415 1046299 1041722 1039262 1038269 1038109 1038318 1038504 1038310
50260 1038310 1037661 1036927 1036718 1037584 1039793 1043129 1046906 1050553 1054281 1058709 1063692 1068115 1071225 1073577 1076024
50245 1076024 1078239 1079120 1078467 1077236 1076060 1074470 1072057 1069645 1068584 1069251 1070804 1072173 1072694 1071855 1069180
50230 1069180 1064724 1059460 1054790 1051541 1049386 1047255 1044334 1040710 1037014 1033638 1030547 1027902 1026466 1027073
50216 1027073 1029866 1034479 1040918 1049855 1061919 1077025 1094666 1114584 1136769 1160849 1185919 1211115
50204 1211115 1236061 1260652 1284703 1308126 1331226 1354445 1377871 1401206 1424021 1445590 1464427
50193 1464427 1478413 1485626 1484964 1476119 1459355 1435441 1405480 1370678 1332542 1293274 1255442 1220976
50181 1220976 1190737 1165162 1144770 1129703 1119202 1111962 1106686 1101884 1095584 1085995 1072491 1055627
50169 1055627 1036330 1015494 994088 973071 953178 935141 919916 908147 899485 892980 888162 885188
50157 885188 883963 883736 883816 884215 885384 887712 891456 896729 903236 910231 916859 922368 926074 927461 926471
50142 926471 923327 918120 910924 902300 893136 883899 874576 865530 857819 852358 849239 848197 849200 852154
50128 852154 856462 861385 866550 871703 876312 879973 883001 886096 889576 893343 897425 901953 906674 911038
50114 911038 914956 919110 924359 931055 939015 947956 957893 969171 982041 996198 1010993 1026309 1042917
50101 1042917 1061590 1082156 1103980 1127313 1153544 1183952 1218672 1257091 1298834 1343970 1392521
50090 1392521 1444148 1498316 1554462 1611963 1670157 1728623 1787504 1847425 1908844 1971252 2032990
50079 2032990 2091920 2146164 2193973 2233026 2260361 2273405 2271125 2254119 2223745 2181419 2128722
50068 2128722 2067790 2001229 1931504 1860484 1789565 1720047 1653242 1590290 1531930 1478420 1429648
50057 1429648 1385455 1345897 1311041 1280387 1252830 1227461 1204161 1183055 1163746 1145710 1129243
50046 1129243 1115171 1103576 1093644 1085080 1078796 1075646 1075212 1076597 1079791 1085308 1092784 1100989 1109216 1117751
50032 1117751 1126882 1136217 1145272 1154103 1163001 1172009 1180880 1189079 1195728 1200129 1202516 1203778 1204244 1203308
50018 1203308 1200482 1196100 1190583 1183691 1175121 1165260 1154585 1142757 1129187 1114283 1099302 1085044
50006 1085044 1071525 1058929 1047871 1038383 1029516 1020593 1012402 1006646 1004640 1007065 1014417 1026779 1043151
49993 1043151 1061789 1081437 1101676 1121935 1140842 1157106 1170737 1182839 1194297 1205000 1214321
49982 1214321 1221903 1227866 1232594 1236494 1239831 1242714 1245441 1248952 1254692 1263785 1276466 1292480 1311785
49969 1311785 1334468 1360020 1387116 1414385 1441247 1467923 1494853 1522359 1550738 1580264 1610792
49958 1610792 1641323 1669921 1694145 1711725 1721232 1722360 1715635 1701778 1681433 1655561 1625963 1595030
49946 1595030 1564693 1535643 1507642 1480484 1454428 1429825 1406646 1384527 1362980 1341404 1319060
49935 1319060 1295295 1269746 1242150 1212073 1179098 1143393 1105960 1068311 1031941 997936 966760
49924 966760 938279 912161 888380 867334 849465 834901 823492 815011 809215 805815 804511 805004 806899
49911 806899 809666 812803 816032 819415 823416 828876 836634 846936 859298 873177 888613 905986 925247
49898 925247 945795 967104 989006 1011153 1032533 1051869 1068208 1080803 1088751 1091388 1089104 1083208
49886 1083208 1074765 1063934 1050506 1034601 1016510 996350 974363 951345 928235 905384 882633
49875 882633 860052 838214 817802 799400 783558 770493 759671 750192 741839 735260 730990 728743
49863 728743 727961 728560 730753 734542 739799 746559 754794 764241 774960 787765 803509 822032 842334
49850 842334 863622 885529 907321 927690 945633 961020 973979 984146 990884 993964 993664 990395
49838 990395 984507 976302 965930 953340 938574 922075 904613 887014 870051 854413 840591 828849
49826 828849 819407 812536 808319 806489 806706 808946 813466 820444 829816 841404 855137 871116 889487
49813 889487 910090 932170 954514 976027 996145 1014640 1031175 1045210 1056291 1064298 1069400 1071845
49801 1071845 1071807 1069339 1064416 1056979 1046929 1034253 1019311 1002893 985768 968193 950108 931773
49789 931773 913894 897056 881367 866795 853546 841907 831974 823737 817144 811874 807339 803210 799674
49776 799674 796887 794494 792155 790303 789856 791328 794748 800317 808446 819003 831063 843639 856238
49763 856238 868586 880290 891034 900650 908781 914965 919399 923066 926508 928771 928144 923741 915793 904617
49749 904617 890124 872529 852920 832769 813134 794565 777474 762319 749560 739552 732318 727339
49737 727339 723751 720871 718354 715924 713377 710995 709572 709687 711148 713364 715987 718955 722257 726075
49723 726075 730919 737167 744605 752876 762287 773670 787411 803106 820106 837816 855250 870900
49711 870900 883505 892676 898557 901280 901080 898510 894036 887676 879516 870285 860758 850737 839394 826781
49697 826781 814280 803254 793769 785063 776792 769267 762800 757469 753457 751037 750101 750181 751137 753421 757455
49682 757455 763108 770055 778378 788315 799584 811442 823563 836586 851646 869441 889705 911221
49670 911221 932208 950976 966536 978663 987430 992939 995614 996359 996104 995318 994280 993573 993796 994688 994847
49655 994847 992462 986124 975087 959267 939265 916181 891230 865685 841075 818879 799726 783222
49643 783222 768825 756556 746564 738420 731412 725391 720800 717865 716192 715238 714812 714936 715396 715551 714563
49628 714563 711911 707833 703169 698608 694162 689455 684245 678453 672055 665407 659384 654626 650755 646967
49614 646967 643320 640727 639558 639016 638252 637456 637345 638031 639019 640094 641556 643606 645890 647790 648931 649394
49598 649394 649569 649790 650059 650188 650171 650190 650251 650169 650054 650387 651333 652355 652892 653118 653595 654411 655250 656156 657643
49579 657643 659903 662507 665056 667731 670933 674720 678933 683653 689162 695563 702766 710923 720662 732780
49565 732780 747654 764879 783280 801227 817160 830147 840109 847480 852538 855041 854536 850969 844914
49552 844914 837285 828965 820699 813073 806403 800723 795982 792299 789947 789053 789295 789951 790416 790684 791150 791905
49536 791905 792524 792834 793489 795292 798131 801270 804731 809642 816892 826004 835822 845981 857258 870699
49522 870699 886732 904930 924252 943650 962626 981031 998120 1012276 1022171 1028074 1031653 1034693
49510 1034693 1038291 1043037 1049371 1057589 1067611 1078561 1088470 1094937 1096556 1093503 1086398 1075129 1059464
49497 1059464 1040357 1019736 999043 978824 959640 942312 926987 912868 899463 887488 878009
49486 878009 871112 865876 861362 857176 853351 850105 847634 845861 844417 843003 841672 840748 840706 842063 845017
49471 845017 849100 853518 857994 862960 868896 875819 883445 891409 899240 906690 914255 922770 932121 940792
49457 940792 947062 950343 951142 950186 947938 944520 939626 932791 924077 914175 903615 892369 880582 869095
49443 869095 858681 849286 840647 833208 827596 823501 819954 816696 814486 814010 815245 818030 822590 829134
49429 829134 837369 846719 856835 867778 879953 893909 909975 928069 948046 970064 994203 1019701
49417 1019701 1044800 1067197 1084419 1094186 1095286 1088379 1075646 1059640 1042771 1027585 1016598 1011351
49405 1011351 1011891 1017284 1026373 1038095 1051719 1067123 1084576 1104042 1124854 1146079 1166946 1186959
49393 1186959 1206013 1224382 1242079 1258177 1271289 1280811 1287121 1290378 1289822 1284740 1275632 1263937 1250875
49380 1250875 1237027 1222783 1208684 1195355 1183381 1173206 1164936 1158360 1153321 1149898 1148079 1147500 1147792
49367 1147792 1149025 1151502 1155054 1158671 1160861 1160490 1157427 1152250 1145154 1135462 1122713 1108036 1093624
49354 1093624 1080711 1068726 1056630 1044334 1032396 1021128 1010688 1001542 994054 987941 982800 978876
49342 978876 976600 975558 974602 972960 970677 968088 965427 962918 960628 958176 955048 951320 947692 944834
49328 944834 943026 942268 942230 942180 941563 940760 940810 942383 945442 949784 955178 960917 965996 970111 973945 978132
49312 978132 982431 986345 990070 994253 998966 1003427 1006821 1009151 1011226 1013849 1017007 1019891 1021840 1023138
49298 1023138 1024674 1026972 1030004 1033868 1039059 1045811 1053641 1061836 1070066 1078242 1086107 1093342 1099940 1106125
49284 1106125 1112012 1117526 1122619 1127407 1132173 1137274 1142978 1149408 1156741 1165309 1175237 1186098 1197370
49271 1197370 1209115 1221657 1234617 1246958 1258200 1269015 1280341 1292499 1305414 1318939 1332447
49260 1332447 1344710 1354880 1363134 1369788 1374449 1376927 1378637 1382050 1388758 1398925 1412529 1430067 1451559
49247 1451559 1475484 1499047 1519127 1532914 1538379 1534794 1522701 1503272 1477981 1448870 1418464 1388924
49235 1388924 1361453 1336707 1315424 1298352 1285723 1276984 1270866 1265773 1260569 1255318 1250998 1248321 1247139
49222 1247139 1247144 1248652 1252203 1257723 1264517 1271969 1279859 1288184 1297080 1306824 1317504 1328681 1339717 1350349
49208 1350349 1360544 1369824 1377313 1382681 1386652 1390297 1394147 1398337 1403366 1410130 1419069 1429612 1440703
49195 1440703 1451654 1462243 1472129 1480644 1487268 1492099 1495599 1498067 1499625 1500619 1501656 1503114 1504864 1506720
49181 1506720 1509154 1513410 1520878 1532308 1547572 1566237 1588416 1615047 1647319 1686021 1731668 1784951
49169 1784951 1846321 1914660 1986423 2056181 2117956 2166297 2197136 2208712 2202116 2180817 2149560
49158 2149560 2113508 2077660 2045979 2020518 2001455 1988044 1979399 1974492 1972019 1970744 1969927 1969242 1968431
49145 1968431 1967405 1966668 1967276 1970092 1975076 1981400 1988250 1995481 2003528 2012768 2023041 2033792 2044581 2055384
49131 2055384 2066454 2078076 2090525 2104010 2118409 2133113 2147423 2161215 2174987 2189150 2203523
49120 2203523 2217801 2232327 2248048 2265719 2285454 2307128 2330861 2357020 2386091 2418837 2456409
49109 2456409 2500113 2551289 2611624 2683214 2767665 2864727 2971684 3084069 3197358 3308844
49099 3308844 3418368 3526599 3631570 3726666 3802583 3851621 3870371 3859298 3821221 3760459 3682122
49088 3682122 3590840 3489948 3382074 3270199 3157927 3049128 2947685 2857040 2779257 2714476
49078 2714476 2661488 2618624 2583979 2555527 2531788 2512184 2496122 2482034 2468066 2453590 2439252
49067 2439252 2425568 2412324 2399496 2387787 2377708 2368756 2360149 2352009 2345180 2340022 2335827 2331478 2326375
49054 2326375 2320725 2315168 2310163 2305682 2301492 2297696 2294774 2293103 2292615 2292923 2293584 2294275 2295136 2297001 2300916
49039 2300916 2307296 2315897 2326724 2340466 2357864 2379157 2404428 2433835 2466792 2501247 2534394 2564009
49027 2564009 2588742 2607515 2619530 2624826 2624165 2618261 2607749 2594015 2579289 2565410 2552820 2541002
49015 2541002 2529557 2518549 2508274 2499184 2491869 2486645 2483170 2480747 2479001 2478084 2478303 2479741 2482158 2485110
49001 2485110 2488239 2491583 2495476 2500003 2504738 2509206 2513360 2517275 2520473 2521972 2521095 2517962 2513234 2507685
48987 2507685 2502033 2496779 2491932 2487112 2482041 2476778 2471399 2465780 2459999 2454651 2450392 2447237 2444670 2442419
48973 2442419 2440744 2439863 2439368 2438454 2436591 2433893 2430942 2428309 2426128 2424087 2421980 2420287 2419932 2421374 2424199
48958 2424199 2427855 2432513 2438842 2447067 2456709 2467323 2479111 2492627 2508123 2525351 2543881 2563506
48946 2563506 2584411 2607040 2631623 2657788 2684838 2712496 2741169 2771363 2803058 2835850 2869491
48935 2869491 2904073 2939877 2977336 3017021 3059264 3103756 3149771 3196837 3244981 3294436 3345376
48924 3345376 3397937 3452048 3507146 3562469 3617990 3674769 3733981 3795631 3858375 3920412 3980252
48913 3980252 4036796 4089225 4137065 4180261 4219164 4254620 4287962 4320483 4352650 4384003 4414004
48902 4414004 4442751 4470634 4497495 4522524 4545026 4565057 4583189 4599838 4614972 4628312 4639728
48891 4639728 4649410 4657689 4664581 4669530 4671787 4671139 4668112 4663347 4656913 4648368 4637310 4623553 4606829
48878 4606829 4586765 4563405 4537555 4510214 4481550 4450522 4415587 4375728 4330781 4280960 4226357
48867 4226357 4167143 4104164 4039092 3973771 3909480 3846854 3786308 3728298 3673323 3622018 3575169
48856 3575169 3533172 3495320 3460090 3426541 3395206 3367195 3342679 3320764 3300804 3283205 3268790
48845 3268790 3257873 3250315 3246025 3244910 3246569 3250596 3257134 3266596 3278659 3291981 3305181 3317952 3330973
48832 3330973 3344939 3359954 3375706 3391887 3408337 3425017 3442025 3459573 3477864 3496986 3516918
48821 3516918 3537649 3559261 3581917 3605707 3630414 3655468 3680264 3704530 3728296 3751571 3774231
48810 3774231 3796345 3818417 3841106 3864667 3888794 3913092 3937644 3963115 3990306 4019634 4051025
48799 4051025 4084193 4118864 4154682 4191101 4227597 4263947 4299985 4335024 4367812 4397316 4423365
48788 4423365 4446327 4466290 4482898 4495908 4505534 4512085 4515439 4514963 4509892 4499709 4484278 4463656
48776 4463656 4437779 4406577 4370518 4330812 4288586 4243902 4196097 4145245 4092802 4040420 3988458
48765 3988458 3936104 3882758 3828789 3774971 3721672 3668856 3616593 3565289 3515487 3467674 3422347
48754 3422347 3380052 3341108 3305249 3271863 3240903 3213353 3190237 3171069 3153844 3136927 3120541
48743 3120541 3105978 3093725 3083117 3073745 3066423 3062421 3062130 3064803 3069298 3074703 3080333 3085445 3089156
$$ [...]
##END NTUPLES=NMR SPECTRUM
##END=
