##TITLE=AC1524_ROEFFECT0006_8202296_HPoOqEx9dn
##JCAMPDX= 6.0         $$ Bruker NMR JCAMP-DX V2.0
##DATA TYPE= NMR SPECTRUM
##DATA CLASS= NTUPLES
##ORIGIN= BRUKER
##OWNER= Administrator
$$ 1.72 TOPSPIN		Version 2.1
$$ 2013-09-26 22:47:41.698 -0700  Administrator@X
$$ Compression mode = diff/dup
##.OBSERVE FREQUENCY= 400.02188249412
##.OBSERVE NUCLEUS= ^1H
##.ACQUISITION MODE= SIMULTANEOUS (DQD)
##.ACQUISITION SCHEME= undefined
##.AVERAGES= 8
##.DIGITISER RES= 22
##SPECTROMETER/DATA SYSTEM= spect
##.PULSE SEQUENCE= zg30
##.SOLVENT NAME= COFFEE_meoh
##.SHIFT REFERENCE= INTERNAL, COFFEE_meoh, 1, 14.98509
##AUDIT TRAIL= $$ (NUMBER, WHEN, WHO, WHERE, PROCESS, VERSION, WHAT)
$$ ##TITLE= Audit trail, TOPSPIN		Version 2.1
$$ ##JCAMPDX= 5.01
$$ ##ORIGIN= Bruker BioSpin GmbH
$$ ##OWNER= Administrator
$$ $$ E:\/data/COFFEE/nmr/AC1524_ROEFFECT0006_8202296_HPoOqEx9dn/10/pdata/1/auditp.txt
$$ ##AUDIT TRAIL=  $$ (NUMBER, WHEN, WHO, WHERE, PROCESS, VERSION, WHAT)
(   1,<2013-09-26 22:47:34.787 -0700>,<Administrator>,<X>,<go>,<TOPSPIN 2.1>,
      <created by zg
	started at 2013-09-26 22:46:28.134 -0700,
	POWCHK enabled, PULCHK disabled,
       configuration hash MD5:
       C8 4E 4E 5D D3 5C D8 9E 9F 52 82 E0 59 8A DE 15
       data hash MD5: 64K
       30 8D 16 8F B5 FD A8 69 17 E5 D5 0A 9A C9 4B F6>)
(   2,<2013-09-26 22:47:37.698 -0700>,<Administrator>,<X>,<proc1d>,<TOPSPIN 2.1>,
      <Start of raw data processing
       efp LB = 0 FT_mod = 6 PKNL = 1 PHC0 = 0 PHC1 = 0 SI = 32K 
       data hash MD5: 32K
       8B 41 01 F4 8A 1C 3C 46 A5 06 04 A4 45 2C 0B 1D>)
(   3,<2013-09-26 22:47:38.046 -0700>,<Administrator>,<X>,<proc1d>,<TOPSPIN 2.1>,
      <pk PHC0 = 95.03174 PHC1 = 0 
       data hash MD5: 32K
       18 6D 2D E2 93 83 CF 07 54 2A 5A 6C 23 13 D9 A4>)
(   4,<2013-09-26 22:47:38.228 -0700>,<Administrator>,<X>,<proc1d>,<TOPSPIN 2.1>,
      <abs ABSG = 1 
       data hash MD5: 32K
       52 8C 99 D5 0E 42 80 AB 9E 95 CB 26 37 E3 EC B2>)
(   5,<2013-09-26 22:47:38.350 -0700>,<Administrator>,<X>,<proc1d>,<TOPSPIN 2.1>,
      <abs ABSG = 2 
       data hash MD5: 32K
       6F BE E9 56 D8 35 DF 05 35 98 D4 BB 69 C2 73 0C>)
(   6,<2013-09-26 22:47:38.395 -0700>,<Administrator>,<X>,<proc1d>,<TOPSPIN 2.1>,
      <abs ABSG = 3 
       data hash MD5: 32K
       60 DD 9F 4D 44 05 B7 73 DF A4 52 AF F5 F8 03 12>)
(   7,<2013-09-26 22:47:38.486 -0700>,<Administrator>,<X>,<proc1d>,<TOPSPIN 2.1>,
      <abs ABSG = 4 
       data hash MD5: 32K
       68 AF C6 42 86 03 BC C8 B6 BE C5 B1 32 4B B6 3F>)
(   8,<2013-09-26 22:47:38.532 -0700>,<Administrator>,<X>,<proc1d>,<TOPSPIN 2.1>,
      <abs ABSG = 5 
       data hash MD5: 32K
       38 BD AA DC F9 BC 91 EF 58 26 66 20 7D 74 5D 8B>)
$$ ##END=
$$ 
$$ $$ hash MD5
$$ $$ A5 87 B6 B8 35 22 CA C3 40 87 6A BB 9C 6F B5 2D
##$RELAX= 
##$RELAX= 
##$RELAX= 
##$RELAX= 
##$RELAX= 
##$RELAX= 
##$RELAX= 
$$ Bruker specific parameters
$$ --------------------------
##$DU= <E:\>
##$EXPNO= 10
$$ [...]
##$TP= (0..7)
150 150 150 150 150 150 150 150
##$TP07= 0
##$TPNAME0= <>
##$TPNAME1= <>
##$TPNAME2= <>
##$TPNAME3= <>
##$TPNAME4= <>
##$TPNAME5= <>
##$TPNAME6= <>
##$TPNAME7= <>
##$TPOAL= (0..7)
0.5 0.5 0.5 0.5 0.5 0.5 0.5 0.5
##$TPOFFS= (0..7)
0 0 0 0 0 0 0 0
##$TUNHIN= 0
##$TUNHOUT= 0
##$TUNXOUT= 0
##$USERA1= <user>
##$USERA2= <user>
##$USERA3= <user>
##$USERA4= <user>
##$USERA5= <user>
##$V9= 5
##$VALIST= <valist>
##$VCLIST= <CCCCCCCCCCCCCCC>
##$VD= 0
##$VDLIST= <DDDDDDDDDDDDDDD>
##$VPLIST= <PPPPPPPPPPPPPPP>
##$VTLIST= <TTTTTTTTTTTTTTT>
##$WBST= 1024
##$WBSW= 4
##$XGAIN= (0..3)
0 0 0 0
##$XL= 0
##$YL= 0
##$YMAX_a= 671059
##$YMIN_a= -570037
##$ZGOPTNS= <>
##$ZL1= 120
##$ZL2= 120
##$ZL3= 120
##$ZL4= 120
##$ABSF1= 14.98509
##$ABSF2= -5.573092
##$ABSG= 5
##$ABSL= 3
##$ALPHA= 0
##$AQORDER= 0
##$ASSFAC= 0
##$ASSFACI= 0
##$ASSFACX= 0
##$ASSWID= 0
##$AUNMP= <proc_prof1d_extract_pilot.lims>
##$AXLEFT= 0
##$AXNAME= <>
##$AXNUC= <1H>
##$AXRIGHT= 0
##$AXTYPE= 0
##$AXUNIT= <>
##$AZFE= 0.1
##$AZFW= 0.1
##$BCFW= 0
##$BC_mod= 0
##$BYTORDP= 0
##$COROFFS= 0
##$CY= 15
##$DATMOD= 1
##$DC= 0
##$DFILT= <>
##$DTYPP= 0
##$F1P= 0
##$F2P= 0
##$FCOR= 0.5
##$FTSIZE= 32768
##$FT_mod= 6
##$GAMMA= 0
##$GB= 0
##$INTBC= 1
##$INTSCL= 1
##$ISEN= 128
##$LB= 0
##$LEV0= 0
##$LPBIN= 0
##$MAXI= 10000
##$MC2= 0
##$MEAN= 0
##$ME_mod= 0
##$MI= 0
##$NCOEF= 0
##$NC_proc= -8
##$NLEV= 6
##$NOISF1= 0
##$NOISF2= 0
##$NSP= 0
##$NTH_PI= 0
##$NZP= 0
##$OFFSET= 14.98509
##$PC= 1
##$PHC0= 95.03174
##$PHC1= 0
##$PH_mod= 1
##$PKNL= yes
##$PPARMOD= 0
##$PPDIAG= 0
##$PPIPTYP= 0
##$PPMPNUM= 2147483647
##$PPRESOL= 1
##$PSCAL= 4
##$PSIGN= 0
##$PYNMP= <proc.py>
##$REVERSE= no
##$SF= 400.02
##$SI= 32768
##$SIGF1= 0
##$SIGF2= 0
##$SINO= 400
##$SIOLD= 32768
##$SPECTYP= <>
##$SREGLST= <1H.CDCl3>
##$SSB= 0
##$STSI= 32768
##$STSR= 0
##$SW_p= 8223.68421052631
##$SYMM= 0
##$S_DEV= 0
##$TDeff= 65536
##$TDoff= 0
##$TI= <>
##$TILT= no
##$TM1= 0
##$TM2= 0
##$TOPLEV= 0
##$USERP1= <user>
##$USERP2= <user>
##$USERP3= <user>
##$USERP4= <user>
##$USERP5= <user>
##$WDW= 1
##$XDIM= 32768
##$YMAX_p= 487086380
##$YMIN_p= -682098
##$CURPLOT= <Network HP LaserJet P1505>
##$CURPRIN= <$Network HP LaserJet P1505>
##$DFORMAT= <normdp>
##$LAYOUT= <+/1D_H.xwp>
##$LFORMAT= <normlp>
##$PFORMAT= <normpl>
##$SURQMSG= 1
$$ End of Bruker specific parameters
$$ ---------------------------------
##NTUPLES= NMR SPECTRUM
##VAR_NAME=  FREQUENCY,     SPECTRUM/REAL,   SPECTRUM/IMAG
##SYMBOL=    X,             R,               I
##VAR_TYPE=  INDEPENDENT,   DEPENDENT,       DEPENDENT
##VAR_FORM=  AFFN,          ASDF,            ASDF
##VAR_DIM=   32768,         32768,           32768
##UNITS=     HZ,            ARBITRARY UNITS, ARBITRARY UNITS
##FACTOR=    0.250966925370066, 1,           1
##FIRST=     8223.43324360094, -87549,       52390
##LAST=      0,             124069,          106827
##MIN=       0,             -682098,         0
##MAX=       8223.43324360094, 487086380,    0
$$ Real data points
##PAGE= N=1
##DATA TABLE= (X++(R..R)), XYDATA
$$ [...]
23822 417720 -204047 288670 16548 -209819 122111 -78181 -102462 146178 448720 -58499
23811 -177871 1364 291609 -25163 377227 417911 -77765 -51479 335269 -107612 137170 -144432
23799 -69651 145552 -251098 -314354 -255089 -144173 39560 -23298 -16159 10457 -34330 -47707
23788 -47707 -309485 47262 81282 56340 24246 52927 85585 -125926 -75953 375112 426269
23777 426269 3562 187370 -132620 -21657 92111 -158741 84459 -132306 -239301 324605
23766 46890 195801 18808 200786 324307 -178841 -165142 -369139 -76744 -22687 -157086
23756 -157086 -6281 -66904 -34524 18288 22769 78276 116643 205866 -121736 105804 -166167
23744 -237476 81522 -291824 -297115 -269881 144787 -73190 11563 112058 187688 -32511 92948
23732 44396 -165885 45122 -135095 -79730 83708 237609 26235 -62377 7838 26640 -45049
23720 -90081 -171992 -209610 -172006 -415568 -271633 -76467 16247 -31738 -5934 -78098 2723 -37277
23707 50767 -281873 -114106 275414 1416 -61740 -22288 -200654 -10639 -116150 -234456 -154872
23696 -154872 -113899 -28025 -235363 -203096 8976 82596 -80478 -115936 37917 -259873 -356861
23685 -356861 60497 61179 86361 -70348 264701 -10071 206725 -231542 -69561 160413 -130694
23673 -369658 161273 1844 -239767 -271169 -67234 -163769 -351855 -101824 57496 654058 -115407
23661 -375201 73657 341539 155018 188236 -55935 176367 85927 -120171 52711 -172055
23650 24016 -272975 292716 -112353 -124335 -133006 -73767 326363 -74106 2617 216125 250829
23639 250829 -277342 12172 -149199 19847 200384 -125142 38618 38869 -155625 231501 -130979
23627 -472831 -70829 -36542 148352 -87857 122980 257079 -53708 274554 -248876 -81252
23616 32259 -102295 -34695 -240781 -93441 65598 82315 -104010 -135203 -61061 -56638 -97249
23605 -97249 -138108 39598 42946 -60749 125622 -58871 -92956 184562 74840 -26067 -142329
23594 -142329 -53568 71148 235861 7500 22870 125767 -50532 -137144 208309 94964 -406733
23582 46009 -172774 105223 -55302 -233627 14342 -210240 255891 -48009 15124 102920 73184
23571 73184 277762 -93535 40042 89947 162260 -143620 -192595 27872 72507 126707 117411
23560 117411 291009 196166 -340627 -118582 -195448 -12576 22685 -146030 227909 159817
23550 159817 210143 -166991 12920 28292 213068 -142961 -12945 86157 51990 -32297 44376
23538 394409 -10642 87282 215571 10793 223928 213531 -271012 268950 -278444 173132
23527 -124564 -121282 -112639 -7595 -4988 -195806 -230716 -56124 194401 -98112 168502 -270916
23515 -87689 29754 -212826 40510 -160700 229435 269575 208686 -27568 365636 -48612 -45285
23504 -45285 -492430 -65891 -64012 157504 -37221 -225994 22974 -119270 -306657 -235113 -214233
23493 -214233 231896 199518 -368793 24920 -428102 129887 210328 -34137 -57538 -275601
23483 -275601 -344486 25246 230951 217522 220671 -207902 212006 -141989 -43163 -75981 -568022
23472 -568022 85437 -68070 -236169 -156649 52128 -14002 14596 67825 24917 190152 -143747
23460 98282 -207022 -207824 1501 -252714 303165 35443 -317483 239815 -99906 326826 404073
23449 404073 -5314 142704 -119022 -223993 234267 -257167 149895 -70595 72838 214701
23439 214701 32533 -25019 -112827 -4462 120534 181067 -284092 -180902 -235603 70789 -29858
23427 327627 467769 -297436 -128654 148851 -5721 208050 -237970 179022 -89491 2582
23416 118360 -125428 -95466 145153 -164003 18380 -232110 -208415 237311 -81254 -65633
23406 -65633 -132704 -46314 246870 -64552 48992 116172 -47713 -3721 -115909 -41315 220164
23394 -162226 -168730 -254944 -140024 99811 -211744 -471830 -271025 -251169 -197596 -291323 -218131
23383 -218131 -318420 -494783 -284734 144633 -51037 -109102 8498 315380 235472 179522 276185
23372 276185 -412555 88529 226958 90888 4747 56077 -17614 -316180 409479 -74930 -394515
23361 -394515 -116851 88511 86706 310668 516376 19753 -195930 -94916 141379 203704 -401779
23349 229875 -301276 -6049 138480 -185552 103306 -157962 136482 154426 20442 48450
23339 48450 197888 -261361 -105619 -146777 -58564 408791 -229712 254887 78320 -236586
23328 -143111 64490 -155807 -64261 64237 127285 12529 186029 -79497 -11648 -116647 59982
23316 26585 171095 -2062 -45036 223476 -111038 115742 -52250 -46230 -351 174169 -25417
23304 -211648 -497600 197093 193649 186000 404584 256904 -101642 69847 -129431 -14845 -199423
23293 -199423 -20136 -6126 -249395 186633 70105 -45279 -106846 -126791 240229 -318479 172754
23281 -65044 144837 -116532 8981 12754 174650 61139 213182 -84393 -225778 -21173 -152072
23270 -152072 85527 -48635 -43936 122828 333528 -210460 67331 -181410 219022 233047 145878
23259 145878 -287421 -77040 -155115 -76977 -297659 -40518 101109 -364957 -92497 173300
23248 -107220 -196831 -178926 -14936 -104324 4311 -94735 -90305 59549 337318 374242 -22518 -80907
23236 -80907 -101144 -48951 -252881 298643 8415 117998 97916 -169332 -193479 -47578 -273765
23225 -273765 544687 39175 -134002 537219 163736 -368572 -93000 -198950 -100572 32 306592
23214 306592 -212938 -63839 -39977 256386 -314909 -292940 216603 -17104 126647 -77657
23203 -497642 148112 152491 -46916 5837 -17300 108273 29211 -445503 -208432 103698 -152555
23191 -14676 -100377 -2131 262912 408422 -269319 -172718 -198433 168130 -109814 18347 54531
23180 54531 169398 69215 -29010 172746 -36634 135726 -195670 -97879 -228875 -142249 -21396
23168 66098 61452 92474 -145474 6963 -160439 62023 183650 5492 179437 158202 -242546
23156 -13118 22545 -68068 -77677 -153801 -169821 -69651 -38432 9229 -71686 299290 12515 -143221
23143 58293 152338 -150295 112348 -209751 -92484 -181044 -80521 45010 106740 -71264 -55452
23132 -55452 112176 -175116 -205131 26559 234953 304532 169798 -33107 -359962 -505962
23122 -505962 281884 -307776 170338 373727 -164990 -146696 -229275 212252 -102514 -19679
23111 245036 154247 -250592 -210097 39887 54173 8566 171849 -77509 54463 186996 121508
23100 121508 -273942 113137 131407 97074 -258874 -74072 -45255 -188200 71412 16178 49412
23089 49412 64511 181190 -110463 -226996 148477 82678 -347614 -61040 21476 1326 13477
23078 13477 344010 -39647 -405219 93565 103881 -29610 147817 -66884 -63942 102916 -49325
23066 -79364 -334571 123412 -109549 -132948 -310990 -75832 -141623 -81168 204604 -20475 25959
23054 -283610 -131903 120627 -54683 -25686 76496 -259702 2626 106409 -40259 76490 -21297
23042 204843 -99199 74395 -16717 86559 -264383 70284 -208188 -217705 86038 87961 -101410
23030 92484 155781 -146244 9067 139176 -352137 -192046 -192256 107171 141187 -89541 162338
23018 -17599 -169634 25412 331465 -5608 40525 8613 -22076 58569 -36242 -211421 196264
23006 189354 -124682 -104124 191962 189055 -286823 -265823 -9708 -29087 -82797 -79257 -190871
22995 -190871 265792 75006 140966 196409 -443393 120659 464404 -233563 57538 -96896
22984 -3281 -310727 167573 -139857 -49600 79435 -176411 -230758 -257207 -125140 290610 -37827
22972 -102449 -135788 279618 119180 7350 -119045 -39591 -618524 -12317 89423 -165972 337995
22960 -278040 66533 98152 203948 -115168 307722 -5430 -191860 -42482 119214 1400 229236
22949 229236 -307173 322641 -14465 -609910 -65471 41527 54266 -184421 97401 34226 32451
22938 32451 -70694 -72057 90296 -101505 256855 -100389 277295 -234251 352345 151373
22927 -391948 -132749 185108 393357 -23476 -122685 -117401 19035 58576 248398 177388 -24846
22915 14086 32891 -118042 -229272 -151611 -159534 75230 15739 -100227 -33717 -425150 296446
22903 548909 -577765 -41396 -361822 -93503 -5662 -148873 -280056 -195822 -88066 -189349 -59153
22891 177050 156933 -106115 54355 -160908 -541029 -37749 5360 -67640 116302 -234432 -285973
22880 -285973 2520 -164556 250939 -83813 189200 103794 -221021 -10780 72949 25700 -29517
22868 291293 51021 8068 62591 319197 -67024 -20016 -115684 -19115 -72454 88862 -378899
22856 -319944 -143844 -67625 -140067 -182277 132176 197493 -96598 -165950 -122244 -142053 129675
22844 88633 -2538 -27113 -130164 -57130 -60753 -111389 -42766 -363467 -146634 133595 -426294
22832 -201175 -77031 392899 41474 143011 120724 -155809 -124876 74492 -161360 -42925 -186773
22821 -186773 -74855 -58466 81419 382773 -36984 18229 305404 175289 264418 189791 -66949
22809 12861 120840 118127 -97351 -5254 -446096 -120180 279024 -108936 110667 -71457 -63600
22798 -63600 1822 54154 134699 109222 79657 291444 -88704 -83014 -210690 -109378 -58016
22787 -58016 231642 143059 -150988 29401 125653 127592 -82482 -341596 -143604 38483 252900
22776 252900 -139539 98081 -28055 393 -130652 332400 91333 -49324 251639 102750 -218766
22764 -276873 23381 -221633 -71006 -14154 -109957 307779 -195157 130637 -29067 344152
22753 108023 -117324 -40758 90419 -140785 -449665 -191489 155176 186169 99121 109733
22743 109733 154309 -155807 -100957 74270 -258507 -20609 -12191 40095 4626 -272035 39280
22731 -138944 24219 -46170 77442 64031 -32881 -91848 -160195 87926 -47103 102913 -250178
22719 85251 -63925 -59834 -431031 98140 367522 1467 -202585 -77456 -131683 100771 -76952
22707 92961 78488 -38955 -235101 140795 118429 -159184 385171 -191486 12233 183988
22697 183988 30620 99446 11832 -6225 81071 -78298 -70765 52240 203817 97252 -244465
22685 -147551 -19384 -208688 182605 55918 302232 -76675 -62293 155418 12762 198667
22675 198667 -99787 -193096 -75902 -110776 -151302 -29752 -56376 256711 145181 204909 -107366
22663 59888 -227282 -134958 -339957 134777 -412350 -160470 -178876 -94932 216697 -81480
22652 -68542 -113293 -344477 -15529 81722 -28974 -129249 -58574 -211307 200426 268707 134596
22641 134596 -218869 -299951 -67130 119715 -247078 -68300 -106924 -103194 37867 102239 101058
22630 101058 -223621 -226862 -25369 -27342 -11299 84401 12792 30278 44903 -147298 -47141
22618 255462 175766 -103837 37953 -155572 17883 -219238 -372156 -4356 -28709 -136286 74369
22606 -220645 -291218 -109757 -133597 -112432 -276127 21868 -154585 -40799 -243590 -98084 254780
22594 64473 254869 -234939 -90672 -206014 165140 203044 -79596 85192 -130726 -249233
22584 -249233 93413 -479352 -164631 139676 -130457 -49569 -204759 -98056 216628 -202506
22573 -158893 192898 193708 -213382 15776 58221 59970 53962 199635 79484 -159309 -87363
22562 -87363 -140748 -149523 82119 -89516 -1058 152888 -27411 261129 -369546 108240 72005
22551 72005 124734 -280356 126914 140434 165369 20699 30278 76475 10767 151853 -98413
22539 -57043 -326633 -11417 -24463 159703 17731 -96302 -337711 -265998 37865 7439 93278
22528 93278 39634 -71029 53404 92879 135789 286723 249557 -306836 -163686 154634 -64159
22516 -91199 317686 -175842 -12972 135978 -107888 20852 -27686 347070 106243 105543 -9606
22504 86904 162815 -212109 49973 -285399 -88463 -374622 73888 -29820 -101137 246904 157365
22493 157365 30808 215485 -164680 -232603 -48257 -190155 79674 65137 -362945 174227
22482 -43099 104541 -40212 -78748 -590033 -153192 -129513 -176482 49524 2372 129580 227074
22471 227074 -176167 -77826 -221160 -298104 -271198 -31954 -164127 84957 -209144 -118704 -5170
22459 -153550 -124344 -453730 93131 -102533 -9665 -273318 81906 102926 -157497 -271256 38779
22447 -184315 44601 -171820 -19557 409332 167677 -272216 80244 -398404 -157035 71179
22436 61173 -44302 53276 146041 336452 -337178 69791 291702 28839 220116 106395 -219118
22424 157011 -303137 140845 -188213 -153313 -122436 -146690 126285 -354850 78783 -4012 -281062
22413 -281062 123880 -366008 -198085 -156425 -118842 32755 -148127 -94494 -52270 -301465
22403 -301465 61920 -149286 31830 210335 145755 -84214 91903 -83550 106265 -318267 -39618
22391 -272886 99286 -239498 -196695 -69486 -109722 -356800 114293 79916 255476 263731 484792
22380 484792 -118758 130342 -241834 83209 -319122 -71715 334329 -70186 24629 391949
22370 391949 99366 -194446 -159722 -274185 -176667 108958 26131 -348011 43312 153117
22360 153117 -178072 -151907 14718 -30113 -29457 249352 -122125 -80316 173939 -66020 181278
22348 122930 -292407 -197440 -193427 269205 -361228 38588 -27760 126441 -43891 -125750 -173087
22337 -173087 -125521 -59857 -200150 19623 -188459 267711 1127 -144764 -265662 184252
22326 41376 -92566 -178435 -404955 -269126 114895 -63732 -168523 -15737 -136923 -42292 -69063
22315 -69063 -260344 20637 -360993 181578 24469 -348220 -201189 -96180 24150 -157870
22304 28112 -125859 -319314 284985 53599 -109123 -78638 -97860 -6039 158742 71365 -112116
22292 -89372 81631 -96736 -65062 -84260 -203367 -134045 -233001 -420811 -18712 -348290 45601
22280 471238 -38434 -17893 243592 -425193 177579 153376 74041 269445 21092 -16816 143828
22268 -323869 10027 19402 23362 -85889 20582 -58409 -176041 -6021 -121224 -7830 143281 101504
22256 101504 -106174 179352 105584 -169942 78604 7461 -346628 -107488 -33986 -179103
22246 -179103 -74725 202218 -152928 29482 -115889 192628 107488 -241916 -81897 186011
22235 -144184 -352415 19766 -191188 44890 77513 -165361 -391106 -82819 3624 -133887 -211647
22224 -211647 210958 -244309 -152619 -141751 83662 -10648 118567 -120755 -102117 -159719 99354
22212 -198591 -370125 244607 143547 117507 -17560 117920 -46361 -318113 292335 37186
22201 198936 129428 -175993 85096 -42575 -266737 40761 -256423 -372751 -204318 -210001 -230458
22190 -230458 -120520 -19747 11951 -94040 -9288 90525 -115119 -30457 -23820 -14125 220677
22178 123136 135547 -219867 319510 263683 -286374 -151015 420914 151314 -351025 82755
22167 -353060 54276 -127976 -24049 -230367 -70318 191335 -75422 -140558 -28965 32137 120701
22156 120701 261117 123583 52829 -206842 104186 153381 -34936 -507604 -256417 -62175
22145 36479 -12485 30252 -135766 45232 -50935 -141585 -97136 121934 -373069 -9408 60899
22133 61720 -164897 -198160 -259725 46488 11299 46915 -114996 -2489 -86790 44236 -102386
22121 -298906 29384 14534 -268999 -19888 100287 77385 -292411 143158 302334 -119234
22110 -260227 205850 -199572 -42801 -10089 -34255 -75394 353846 -332149 -186239 -280108
22100 -280108 -225005 -79971 98876 -224746 -237465 -57351 15768 265552 -120807 -2737 169884
22088 -146966 -55550 180383 218392 99874 -147084 112466 -209600 -39577 135587 -181778
22077 122237 222941 -100367 -264251 -68650 -56311 -345392 152719 -86173 -132039 -180582
22067 -180582 -21245 14480 -291565 -212457 -87729 72143 5935 -241601 -87615 -188316 7944
22055 -176433 -57199 75950 -38941 121980 -78230 96577 -131651 -17301 -251233 -43198 -119138
22044 -119138 393615 -145628 12346 -133027 -55664 140804 -72243 107530 -70506 -5249 68750
22032 244849 -168054 -543597 -336638 -38677 -320083 -194672 211043 -82703 57732 59102
22022 59102 -17789 136804 -12568 -110422 -173233 -185768 -44324 14024 384947 -334398 -183932
22011 -183932 196031 69218 -235652 26517 9782 68509 -122806 -245092 -276812 -218576 -8389
21999 -4854 -136218 117334 31631 -121382 -56243 -75506 342086 67253 -146408 -243062 42155
21987 297239 -130656 168185 -231224 64230 -74703 226606 -42464 40453 -71411 -168378 13055
21975 -228888 -116490 -82237 -15476 23242 -204085 8035 201534 -21201 -241496 -112303 169965
21963 42214 -125343 83984 -16811 -1565 1833 -119000 -454202 -181770 69372 114259 133481
21952 133481 -66091 -290590 209442 75274 -385889 -134958 -130987 -277985 76655 182995
21942 182995 166415 -264848 155010 3893 40546 238420 25770 -211031 108672 -13597 27708
21930 351280 171416 22481 -121360 -114652 284514 -324738 -332179 5835 -32035 98154 6314
21918 -156226 72073 -150291 -87800 1089 -97203 100587 -49051 132744 -364383 107702 -147895
21906 -132004 106002 72909 -114914 152989 7762 -451966 -313388 208785 173007 -172780
21895 64200 -42616 190433 -126073 -164685 -279875 -23146 20360 -196852 -88202 13927 -32503
21883 218133 301348 -83679 -171547 -149478 27067 57951 67607 76588 108213 -38103 28380 163802
21871 163802 53710 -140024 167007 -100329 3240 241863 166383 202555 -221224 -163653 61279
21859 -92177 15424 -54984 -16248 75443 -48214 -206650 -76132 330007 -41712 136121 51034
21847 356937 26201 61211 -445694 -70170 7170 -362943 -506854 122448 -63099 -469541 -42504
21835 218172 -109733 -93685 -529312 310489 166038 80854 -105773 167863 -126195 4778
21824 -79258 211428 186776 177322 -39201 -69395 -109297 5394 -108123 -413695 120783 168940
21813 168940 -283 17262 -218907 -70545 -111763 -10881 -56571 119184 -227814 1024 -124951
21801 -118571 -347788 -269648 23847 -194873 79296 119397 -5763 170190 -270430 -297432 321625
21789 -350350 295 44994 -38292 -286737 -60505 -1339 198042 192177 244021 -155247 -383227
21778 -383227 -132380 12488 70538 -139414 -138372 -188034 109973 111976 -158311 -105155 -258603
21767 -258603 -95711 213976 198774 314676 120093 357591 -233037 -170528 180541 -83279
21756 -153329 -42345 -264910 101794 -181842 95137 -57819 -21871 -153676 327542 -318635
21745 315797 -79613 89509 227449 34105 -204031 51449 -294813 -196555 -49130 208710 -77830
21733 6950 -166158 -85225 45593 -168922 -401118 -28338 68141 -425649 12220 -84106 123140
21721 30515 416788 -148746 138738 23933 53557 160127 107686 56107 -49004 -169996 71060
21709 -188267 -147807 174143 61747 -338679 179749 -60932 -59539 -53454 -145395 -93763 73175
21697 266203 127962 -102284 -23999 187213 300383 -166039 -51653 -106386 -218488 33062
21686 -100269 9206 -153262 6014 73929 -23693 -5342 21543 -538191 -24671 36385 86566 -141936
21673 -362980 94135 -107962 -148025 66468 -312097 158937 58722 8930 -231591 168424 80451
21661 300278 65051 25089 -99644 -8591 -41715 -72322 -437883 73510 250528 -240208 -33230
21649 27398 101082 175867 -94810 57852 -217273 -215858 -244210 42772 92427 -75006 217915
21637 65792 -7628 243793 -35712 -92785 67575 118022 -15694 11320 49504 228708 103639
21625 -58610 -90272 23716 -136108 -249965 -181955 -49683 -131732 132449 -244632 -15875 -205001
21614 -205001 -63557 -85587 -283712 -479843 -250812 77995 -134744 -137000 -289050 -424911
21604 -424911 93158 58462 164084 162078 243578 -22095 40938 215982 -324122 374594 -33019
21592 -156311 -34619 -41276 -26391 203945 113366 82451 -1968 -636128 -190183 39775 -207237
21580 -266571 21853 23731 94694 -130900 -108900 -193387 122601 7779 28590 -176031 -57201
21568 -297282 -278098 -214829 245633 132831 -441874 -1052 36113 -342594 -52649 -8323 -106081
21557 -106081 -214968 138111 -60913 -352347 204311 -133070 190248 -197321 -204087 157583
21546 -162067 188121 -220747 253510 -8509 -179204 -272038 -96274 224006 171672 -132892
21535 -55569 167572 -76724 215555 190256 324333 -1201 59717 154937 -36462 219267 156711
21524 156711 367894 -286391 -271169 -159577 -17304 233913 -267185 30521 -235060 -162395
21514 -162395 115623 -26264 380498 55617 -298244 227745 -257419 117427 186104 -98459
21503 18753 -210532 -36929 -187309 -437643 92516 -46419 114519 -39450 -125460 -255524 -45899
21491 302804 109030 345931 -14422 -130128 250969 -39351 -78378 -277032 -10727 -133428
21481 -133428 -49337 18807 -227715 28508 -31910 -14773 -264473 15738 -132041 72828 -63366
21469 -272491 -210170 -69209 -190693 91797 230535 -133159 -256875 150136 -164334 331380
21458 219270 -192617 -176163 -233761 -32068 -259123 -1775 -18327 135580 86154 -147480 141277
21446 170665 -21494 64618 161544 98034 -31215 160978 249936 -110566 185959 145161 129450
21435 129450 391195 88916 132193 -7589 -88542 340321 422531 279839 -166758 -163236 8354
21423 63336 -158950 -148549 5175 -147259 -10126 -192630 -131090 -255574 209490 -189965 -27442
21411 -48734 -119478 -75575 51355 -182438 58870 -189170 2889 9477 -203105 143391 689 308604
21399 308604 -217825 -126435 -109507 -311117 -70916 -240686 -451551 -229626 124994 -13949
21388 -146855 -243517 -201614 -281737 -209974 -126273 -477983 -221266 66906 163861 -324871 16115
21376 208438 -128184 33629 158686 -111769 65510 -369777 -205878 8738 -201830 -69261
21365 20822 13925 -330833 297643 387722 53007 -84819 -68841 110262 404271 50 122589
21354 122589 -50456 38260 -49477 116254 113665 -167492 -327030 -172702 -88268 37582 26949
21343 26949 54527 423715 -71036 -631 18754 58550 -107491 115399 -174462 7736 -286611
21331 -19027 237797 311664 -181624 -56565 -202565 70941 65004 -133641 -208686 -43298 -83820
21320 -83820 -91639 -132848 -199447 3297 -26919 191321 -52587 55604 143501 -10913 -120711 -23865
21307 -39058 -150358 -121661 -354196 -151925 -159509 -94244 56778 286369 100944 -83074 -220109
21296 -220109 95217 73902 73251 -77374 27707 -350732 -218283 -260650 84866 -243074 -14180
21284 118628 -5615 -165389 -91395 -178010 -30346 6135 40808 -370801 -14883 11552 -408772
21272 -446071 -115969 -62713 -48083 165575 177500 -195624 209283 -318091 12140 -287113
21261 121573 -308613 129955 68769 107989 -16851 -106434 -263491 -320138 -230561 251741 -127276
21249 63397 -81987 8137 -59026 249262 -419141 226310 -207777 129255 -170173 -31441 63786
21237 19832 71405 20956 -153635 -73890 218331 34484 -80179 71625 -195178 -369066 113967
21225 154291 -195215 -163084 -168105 -12674 -249696 -98800 -340248 -41569 -132818 -298310 32574
21213 184913 -119921 26754 -24194 40875 -136633 -68339 -77455 -63373 59464 -196034 -80161
21201 -32604 237159 125723 59510 -334480 -104548 -65641 -354803 -36720 -62417 -85275 105246
21189 81393 68785 -226220 184404 -36580 -179614 37201 -85285 70081 -133000 248241 -188735
21177 165683 -179174 -245902 -250289 -91591 164788 -214799 69210 14017 -433256 -102492 -6883
21165 -7504 -81600 153886 -205579 188653 13276 94079 322309 266373 36908 -457444 -238938
21154 -238938 132950 116411 -42283 -202886 62300 -132259 -327304 -27548 -199228 68924
21143 -54207 176014 264377 -78793 -401391 23337 268210 168901 -227344 -93112 -216356 -84437
21131 185645 177810 -185569 83219 217639 -211901 -97251 -127660 243702 -1798 -239553 155963
21119 -27510 -382135 59310 -299186 83280 -327864 -206263 55397 -131486 -55596 -105519 215919
21107 248954 -142473 -125196 119494 -174715 -7584 237 202081 -5397 -183192 -226826 -157128
21096 -157128 1712 71274 -374998 -188839 -17102 -110621 364566 174756 -199879 9124 376501
21085 376501 10906 -87489 -336350 -118001 -238063 -102335 -47516 -116220 -333203 186395
21074 102567 -22111 -83101 48165 40634 79716 -27433 108756 20984 182790 166005 -203611
21062 229445 -54409 -209360 -35697 102851 81544 -94211 110050 -183141 99543 279949
21052 279949 -92522 77008 -387976 -82859 -37007 -29829 -122737 -328190 67023 -54334 -302505
21041 -302505 -67454 -36746 155373 -110622 -159605 199484 -128129 -150724 -33392 77567 -196085
21029 -175404 -198197 -104361 120651 -253260 -247220 -22447 58041 -327605 -29444 -212860 -87518
21017 162378 -281099 -168661 -20104 395029 -173686 -85879 -125485 -371548 -279725 -82441
21006 -234968 136466 164539 -110436 -391010 -19193 237896 -14877 13275 -268260 -96816
20995 27186 10391 135203 157656 -63204 115275 -265149 -206878 -266527 -382474 56814 -106840
20983 -385080 105137 -299584 111977 -13955 -343514 210088 83192 130690 -173214 254169
20972 -33949 15525 -141610 -155072 -49568 -172393 -290729 -181104 -217733 -74477 231629 -469359
20960 -135126 -53395 15839 68065 -27155 119419 -193843 4436 -343707 -347323 185264 -181011
20948 -46630 -6166 -12053 -125988 -50738 -40037 -481367 20122 -193243 -218091 44279 -116846
20936 71302 -189407 -144639 291583 -88412 90092 87511 670 -247066 218081 -73531 -297515
20925 -297515 -27665 13828 131119 -72325 -239900 156659 -191700 151996 -280953 -113923
20914 117249 19109 -108395 155946 374986 41248 46310 81454 -48404 -185132 -393002 267413
20902 151551 -134776 144632 13427 -16975 -133817 -130567 -44084 -296902 49896 -319726 144505
20890 -257000 -126409 -56006 -103440 122246 44237 -26207 -168664 -107153 -163486 31642 60404
20879 60404 -465930 -279636 -84843 118898 -199589 280984 -233 241716 -35067 -99083 132276
20867 -42061 -82056 169376 -113426 -24781 150373 221030 247669 -56764 101701 -168195 -1454
20855 126450 -235383 -70551 372537 32973 44563 -31380 -181980 -351037 63448 -9839 -103899
20844 -103899 72856 -178908 89293 -17222 -274813 -77636 143198 104432 -16020 -6282 -103142
20833 -103142 -105147 -299638 2527 -312583 33458 66858 -441588 189486 -362393 41143 -56925
20821 -128553 3524 43254 -14529 -87904 -61079 -94357 -139 53605 104232 137423 136074 -149312
20808 99763 -217942 -73541 88189 81589 -65087 -25326 -46061 -102612 -95570 241191 -8774 -100590
20796 -100590 -185979 252838 -176506 -23209 -192034 -9748 34845 121521 -170505 197799 186111
20785 186111 18783 -99815 -290375 -19239 162458 15554 85036 3528 -106958 32668 54697
20774 54697 90450 72938 499237 148823 -72068 -177101 -115100 -11790 -175784 180185 53514
20762 40973 -193565 -85918 -11210 43381 -290935 144322 -518133 -52044 -107256 -189529 -158911
20751 -158911 -115170 -33950 -26913 102748 99884 -208504 -121013 37225 -278605 -235099 -358354
20740 -358354 -33272 -213766 -17998 -167771 -88854 -148476 126439 -293572 42109 -261172
20729 -323060 85707 -133244 -156316 -69668 36720 306927 -180802 -4741 203456 3343 -239252
20717 39200 94197 -129743 -369845 79968 -76410 -190392 -196692 -62845 -371812 -259301 351526
20705 -359334 -480290 -28800 172173 -283820 -124159 -27835 158119 233083 -162343 115036
20694 -10631 117650 -131830 -328072 -185463 -230691 -108726 -133647 26519 80337 -335707
20683 -313414 129224 84896 -155051 -218425 152517 -423407 -178563 -126073 -181745 -112305
20673 -112305 -396185 28962 -172086 65405 -189943 7570 -164034 65580 259465 -352149
20662 -183246 -117857 -213565 -5533 -27552 -63710 118742 -72650 -172821 -194435 150197 63505
20650 131515 -173049 -188922 -200658 115896 244582 -224090 59818 32868 -55173 -60551 32443
20638 50370 -212913 -92454 2845 -195793 -131413 -230685 224257 62390 -221404 -241568 -67849
20626 169332 3783 103061 -398099 137759 113722 -110226 153796 5793 77099 159820 -58122
20614 235547 -61291 227748 -92508 55140 -155490 -214161 -443635 -64738 240202 -187306
20603 -151632 -79516 38041 7631 -84439 -491044 -125862 277303 167694 24597 230359 -75001
20591 -339269 -181377 -296181 -71608 -65690 -174043 62963 290814 282068 25651 16150 -89274
20579 126993 -5463 255796 -125560 208547 62669 -138967 212142 153414 -87567 -156720 -290854
20568 -290854 -209195 -393190 -26095 -116173 -174619 91671 227564 156599 -81948 -51142 -35139
20557 -35139 215615 -11092 -324945 89274 -32033 -51079 -140523 -33355 -209904 251570 104332
20545 -116469 -73950 -199384 -63838 -280541 -20502 107863 -137871 68918 -216203 1256 -121061
20533 -235444 149157 -192327 -219433 -91496 -156110 195617 -19414 -159021 129515 182422
20523 182422 -556306 -74350 70291 45508 -112151 49821 94446 16044 65261 125409 26216
20511 16195 418250 312586 -1952 30013 67717 -105670 -415158 262816 -79173 -114382 30142
20499 -11661 -87298 68204 -206993 -211923 190117 138921 -383469 -253902 -158588 -92930 -290456
20488 -290456 -126903 49563 -54933 264655 88066 119455 154406 -76431 -108318 116406 -56570
20476 248623 40921 -220086 -129950 -96974 -125701 -66729 77488 11633 8561 220246 -272085
20464 -204540 -250201 75075 -152463 270519 -99516 105538 -109044 -13456 -37903 44993 145209
20453 145209 199089 -127810 -143797 36206 226184 -207509 -139878 -111211 -250425 -95376 -116332
20442 -116332 -248729 -117675 -154466 -117294 30695 -72971 -292894 -260300 -31403 -33512 87627
20430 106283 -128757 -200196 -152856 103251 -8012 -353660 211903 259783 -204283 -166822 -271866
20419 -271866 -95753 -85623 -11715 94257 -394567 -49038 50975 -113429 -394608 -193142 -2128
20407 158062 -31023 198483 -199980 -44440 -177932 42858 -87724 158112 11185 -304793
20396 -198240 12148 -30429 331072 -6791 45643 -89234 -197311 83511 -296376 137597 -123230
20384 -30738 7457 249771 -87540 48699 -76740 12835 66335 -8824 58004 -144876 -47669 -296530
20372 -296530 -87650 -133317 138116 -406388 -125558 -268002 180756 829 -196795 -440251
20362 -440251 -220757 161556 -203753 77068 -109053 -156831 -206120 -28551 14587 111052 -135199
20350 -334572 82333 -66556 114408 71428 -69862 75760 155753 57676 180601 -99428 -16061
20338 -272450 141778 224331 -8248 101396 -204462 77314 -169343 -107508 -302867 -235239 407480
20326 -359119 -326631 -217817 -20062 -337956 -300724 156470 -145764 -125531 65340 -117328
20315 -255207 331988 19387 122704 109415 -216699 -209401 -316907 -115288 171985 231985
20305 231985 -109585 -110626 306626 130542 -26204 -13006 117594 -113952 -112554 -64737 -91851
20294 -91851 147133 -143872 261517 -163805 59560 50363 74550 89841 -103591 -245153 -30638
20282 56086 136834 118309 -282665 -16244 -102905 -133360 234642 -104268 -170164 -32793 127750
20270 68015 -356608 -353983 85885 -48145 -41585 65227 -19497 -45780 -212253 -227639 -125394
20259 -125394 91322 96647 -54829 -53066 256380 293754 -184339 23751 -42341 61811 45866
20248 45866 110925 127810 275763 302502 -126362 110828 73717 -46395 -248326 -223512 -5906
20236 -279336 282177 -112087 83603 -251726 -113428 -452843 228751 -124423 -217627 -328308
20226 -328308 68507 -112497 -111986 -198075 152423 184796 -349026 -227688 12121 222162 24568
20214 -54325 90582 -140704 -57599 17698 123186 72295 238634 -149619 -175681 -351950 5491
20202 -16126 -464283 -63754 68894 -299911 -364849 -240995 -132488 -3847 -113120 -257961 90205
20190 -277103 65149 122904 125055 -12643 -34896 18848 318924 -43067 -211080 -10541 205480
20178 137538 105178 -97874 -242778 105489 -186362 -166718 12285 440226 -96209 97060 -282543
20166 278687 -326159 -162231 -62149 -11022 -21190 55123 -306666 -86335 -209061 30207 -338405
20154 108651 -218612 258536 -30882 -3760 -2969 -120008 -40627 -359675 -161565 -209097 261923
20142 -156049 60313 56565 55704 119653 -339011 -101095 -341691 -68455 -77368 1329 -77573 -230968
20130 -230968 65682 56240 61193 -303786 78368 255862 -220434 52692 114980 -201403 -258576
20119 -258576 -182867 -322795 -420878 -57972 -165222 81617 -209071 -336087 -58401 45412 -118791
20107 23237 386493 -110690 -158587 94512 -125715 60150 -245011 220607 -50462 -18161 -108248
20096 -108248 -38241 135373 9154 -140741 145093 77711 4954 -53493 -176163 -161357 -205897
20085 -205897 151887 -208959 -172206 15989 78988 -98465 -137118 -65467 -133433 -45926 -310179
20074 -310179 -38569 209592 -184459 -48789 -377647 -32843 -147415 -88004 -87304 -21538 -179282
20063 -179282 -99153 -264538 -112043 -201397 27561 137025 -190873 -124613 143024 -9677 41543
20051 -150961 234734 94257 -174891 -223451 -65186 -105158 -161563 -5230 -42048 -86757 87806
20039 -255504 149019 -2160 -13758 -128664 108869 100734 -122243 -298022 207460 -226681
20028 -19055 -292699 -242324 -302036 -63551 55964 -233035 100648 138691 -91818 -55916 136410
20016 -43834 190179 105366 -224904 -38907 30988 -56817 230384 121105 -337225 68809 141541
20005 141541 157021 -28890 -298712 -341877 77154 -284 -297380 8528 208966 -221946 -65324
19993 -205386 -223676 -269227 113946 206298 -307670 240870 -179636 77568 306860 -269007
19982 232498 -59048 295261 -403121 -248159 64910 -47167 -141507 -71690 -2666 -204303 261083
19970 -37939 25221 -20874 273400 -92691 -74793 80883 -74369 19878 96722 228359 -181790
19958 -489785 42639 -134141 -22105 186878 378423 -200461 82297 -13425 -196584 36257
19947 143240 -125280 -25198 228954 -122537 9239 -264266 -123570 176137 -310792 -336629
19937 -336629 -97676 -140331 51850 -250984 -176839 153318 29937 -209757 3647 8524 -77943
19925 -36279 111904 -17626 -466779 -158523 32433 231030 71718 -208611 217996 -431035
19914 10624 -152354 -27035 137640 25571 -86831 102035 -80850 -217238 -452415 254336
19903 -34897 -136261 -435575 82116 -437812 -655361 1574 -484142 -220767 -195488 -5651 -556041
19892 -556041 -214150 39593 -9068 -10967 57667 18643 46935 -309051 -87168 -244992 25767
19880 2835 -42875 -278186 -82345 -283549 -202986 119148 -163584 36717 -165513 -193808 -129178
19869 -129178 -20275 18705 -92224 -1346 -287811 -425818 114628 -247946 -122319 -69690 -115609
19858 -115609 36345 -12156 -150152 162335 -355011 4931 -27599 24631 144020 65548 65366
19847 65366 -159835 96340 -41323 104213 -44464 217758 -174336 90569 186004 -107864 -14911
19835 -99242 227410 -19704 187099 -314358 78923 105312 85459 -144056 387838 26431 -250615
19823 -218447 39853 -306294 -277115 -96548 -249217 97261 -5146 -41790 5084 4887 73790 -607775
19810 -438990 145914 -40192 -72279 135986 -6871 -201516 -7431 -92107 -51556 -296113 176900
19798 49435 112512 85184 -475058 285082 -164639 -53920 -447189 -93478 -276901 -429693
19788 -429693 -278483 63944 -22110 22811 45390 -362664 -311821 67027 66819 71736 -297196
19776 173409 -11064 -118073 -359286 -273277 -62081 30175 -431549 -319818 198270 -68169
19765 -191477 -94921 -56614 9640 -343363 -77200 160605 18825 -200344 212397 -70332 -34565
19753 -160693 122848 -5109 -81518 -38232 -179348 -146886 109192 137674 107514 -361909 -118240
19741 -144388 -77630 11592 402969 -27889 97559 237361 -27005 -87365 -94739 78561 -84022
19729 -213166 -293348 22947 -446317 35551 212124 -21742 -181031 -164611 80509 62937 108697
19718 108697 307017 -279039 -67960 -217230 -104158 55546 185726 -100647 138523 -173022
19707 -70672 -63877 -167228 118251 -118276 -18399 235633 10460 -149309 146936 158187 60722
19695 -116979 8227 -208495 166586 -171889 -484544 -293063 -259992 -10997 6052 -5036 82797
19683 288662 42327 47860 -156000 55804 -17437 189464 -136723 235904 -84137 -122064 -127880
19672 -127880 52597 -48889 -51173 -283061 23837 180670 -134011 256152 89284 75966 115319
19661 115319 89566 -12130 152542 18757 -64013 -377876 -203035 -379788 -24602 -238828
19651 -238828 146334 119316 103433 198528 204947 49075 -2748 114372 -193893 -195365 -32742
19639 42310 176340 -309089 -1110 264223 50083 -21155 -221546 128623 -407933 32273 -130386
19627 -198860 -73593 -83790 -91082 146655 -8926 -60865 -130235 -11308 -364309 -82657 -201348
19616 -201348 -3494 20248 -40256 -147398 -17656 20434 -24065 -10481 -280279 -19819 -201093
19605 -201093 30917 257744 -14657 -76223 -5125 -243291 218820 239423 -364266 -143883 -139207
19594 -139207 -272211 237785 187568 -399490 191861 -201686 86930 80044 -101655 1406 -311389
19582 -93741 194587 -184445 181002 -11646 -294779 -100455 105879 -241636 6688 96149
19572 96149 -127049 268931 20397 -153751 -167379 -57167 82626 62013 -177583 43532 -267677
19560 -186591 -74594 -139681 -60946 86147 -4940 229661 -232809 -164456 -4146 -35960 261462
19548 59500 -58195 -169265 -10920 -68054 -147533 -57683 -62906 -59813 -92365 -104444 -44127 -70432
19536 -70432 200921 -109429 372576 -314707 291850 -79563 14242 64831 117791 123385 110428
19525 110428 -164567 142749 69158 50574 -56406 38390 -61621 -218979 32168 -112796 31447
19513 -138174 -172615 -64225 35347 91671 -257846 -333672 116295 -398354 45587 -65535 122492
19501 100829 -310014 -174749 48127 -88222 95878 101823 -227531 -170131 -5001 -223256 -148154
19490 -148154 174404 -340260 -24150 114120 -288434 -88022 -35619 -315743 60690 42817
19480 42817 73697 -166192 -418427 112483 46635 -78915 -282897 197468 -218673 90603
19469 110453 -47235 152417 36603 -305446 -108450 178088 122299 -33461 -243259 50892
19458 177787 -79544 -58341 11072 -90266 -59746 -345712 -53412 -107512 18494 -11770 -146978
19447 -146978 -374304 402 34796 -213506 -157416 444142 -59810 -187376 -149688 -26926 456690
19435 -57197 32253 -97039 -249954 -203594 -144277 369821 95228 -17944 -202521 -373614 387069
19423 79792 -198090 -70273 -221152 -92183 -269027 -424040 -408128 149695 -58324 -192317
19413 -192317 -383660 -279658 220147 -150670 -36182 -54968 -185510 -158861 187213 266365
19403 266365 -32713 -119044 182063 2988 -274983 -261235 -300513 -63568 -90513 447241 -259311
19391 39662 255316 151835 -178336 -225591 -373033 48834 24866 -168119 82360 -19546 10361
19379 -40619 -78679 36138 19487 69930 220490 -80557 -598725 107588 -214202 -439907 25487
19367 54616 -85986 -28138 14878 -290326 204900 178712 -153947 -220783 -418510 -229195 -53079
19355 -317687 4778 -442649 -263312 -166066 77370 -172023 58433 -113190 139261 54902 -219686
19343 -407378 -25222 258086 -219703 -118472 -239061 -78873 333482 -165980 83407 12515
19332 -197104 -311375 -120894 157901 -76173 -10399 20852 -368323 -101913 -233590 -129252
19322 -129252 427582 -17967 -39479 167176 -167592 290203 -131793 -294365 -150103 -268353
19312 -268353 68590 -77896 -66539 -238176 -329238 -166812 -367625 -162307 -188530 6451 2619
19300 -42995 214385 -181678 63854 -393763 -41104 -332006 394256 -55684 -46916 -46500 215469
19288 204334 103476 81747 -30483 190350 317987 -77773 -161943 -280130 362171 57418
19277 7994 46839 -150372 -232903 136909 -343410 54449 119950 -119131 -5541 -238343 -53484
19265 -49002 -268338 -459436 -248214 -261066 -245786 -171567 -13040 -395939 -158834 19783 -161488
19253 226790 -420291 -75422 104341 -121924 66766 -240901 -173804 244385 -20498 -199069
19243 -199069 41502 70602 176056 -59418 -460926 -19637 20816 29042 -118954 346946 -443567
19231 -352633 -224410 -129184 -95603 -135013 88158 -118687 -396281 -97267 -388219 -164283
19220 4490 275132 -59610 -350416 -2272 -129422 -48710 -121034 103819 121276 194028 -137882
19208 101389 -340777 88507 78027 -388010 -103821 72871 86841 -13454 -34768 150969 -297440
19196 -169452 -60299 -194537 -221757 -166586 -180148 71716 -68563 16153 -215213 -298748 15192
19184 62593 151731 44714 124492 36635 -193444 -446626 139571 104096 153519 -57348 311453
19172 192245 -107279 -101105 -477901 -16749 -86272 -100858 61099 -155126 -179995 56817 -72757
19160 152334 -266921 41009 -92862 50972 -27852 368171 -205362 -111580 -328117 -137640
19149 180711 -178495 -197308 -85013 -140753 141235 -106468 86869 168725 16849 -303402 118941
19137 139116 -47939 -131233 -162196 -198254 224590 1080 66402 -120627 -212158 89071 286390
19126 286390 -256597 -176702 -14458 133505 -373049 61512 -51572 -331734 110519 -84987
19115 -307659 -12917 215928 -37093 53422 -321 99967 -164254 28060 16211 -246185 242595
19103 -113307 47656 -126906 282495 -13378 -147946 -176048 -82434 -228247 82282 -121655
19092 -260870 -215741 -102856 -158363 31714 242378 120160 -256523 -418794 -18836 -418778
19082 -418778 -187888 -175668 239005 -163624 -114887 60190 -185761 114725 38061 -161900
19071 -201780 -59932 -155175 -171425 -463201 -112430 -168242 -225514 -110043 -86590 370906 64221
19059 235416 -22922 -28891 -189177 -268997 -183329 -24903 223045 -84277 64947 -92538 -189984
19048 -189984 -7836 -123634 -3697 196318 -101795 7481 -88648 101929 67907 171682 -79622
19036 -552020 -173505 -171857 -191766 -192275 -236894 -211507 19049 -211565 265513 -87198 136164
19024 -158912 158864 -17977 313536 71231 -34300 118455 110015 37289 -38118 -329127 -49643
19012 -39880 -204847 108298 46456 -97694 46427 50957 -120538 -62421 -143936 -45631 82764
19000 257124 -148425 -254994 -17119 -157803 17637 -79750 24921 -147265 82732 -179271
18989 -64552 -412771 -143959 -32784 46998 -243980 231832 -135829 -459176 -213060 185346
18978 -47671 -71875 -143009 -36357 -223025 38561 -119170 121861 -32456 -63308 60059 278824
18967 278824 -190706 -132021 -51115 -42434 104532 -197935 -37248 -400035 -219816 54771 -244903
18955 -74832 326183 -27589 210310 -38156 4628 288962 -259702 77722 243396 -3638 104363
18943 -106868 17600 -255957 3554 192410 -78554 187638 -101590 -339050 108043 119951
18933 119951 -120584 315260 -100239 -310573 96386 -82275 -34902 299821 191645 -222960
18922 111129 125186 318879 14853 -98291 -99183 -250026 171725 -253475 84898 19245 102536
18911 102536 38448 55398 29383 83343 149079 107490 52855 -73938 2821 -263273 -81965
18899 -41840 65533 -248822 -135563 -299065 -103831 -239650 -71934 -211989 -28341 -137430
18889 -137430 -339253 -296804 -78798 -251193 -157934 -287204 -133343 166572 -73328 328060
18878 -17069 -413289 6684 -199623 -209963 -16369 -161452 -61360 -290297 -158032 -77176 44635
18866 -69657 -21967 54086 84297 193542 34839 54341 66676 -268391 -12988 45250 -198562
18854 -47872 -6539 -85992 -209447 -66855 425245 506507 233858 47962 248831 -250456 -288006
18843 -288006 102057 -290793 61090 -168006 102513 -212568 108472 -109114 -863 105600
18832 344162 -191492 -117020 -129345 -83954 -160478 -31919 -310482 -307929 13407 81902 55527
18821 55527 26438 54617 -72652 42207 -148035 -22807 -61052 -174732 184967 316475 286885
18810 286885 229834 128286 340738 162398 191218 7741 24776 108111 -216828 -24530 -312092
18799 -312092 -64815 -216604 -340700 -9706 123858 198394 26609 -542213 132365 -103560
18788 -64228 176196 17708 127618 33421 -73907 -150798 -256312 -47543 35928 -86420 143806
18776 -35875 -91733 -139040 -106110 -433431 128268 -212876 229620 -276512 25504 -8188 -88701
18765 -88701 -229560 66373 -288765 130541 -106743 -145892 -24201 -26635 -127157 58387 53701
18754 53701 -25674 -7780 40784 78167 157528 -39075 -426205 -320821 -29671 10975 21874
18743 21874 -202676 31300 429383 -222869 -241661 -272959 255869 -71931 -58775 -277004 -210276
18732 -210276 64048 168967 -80226 89606 -339857 113964 164026 -303160 -15183 -102214 -101613
18721 -101613 91793 -79124 -230997 14933 236555 -63796 44109 480102 -69903 -105215 -36189
18709 -89184 29658 -69721 62175 -49406 -355181 -247497 46965 -34622 -132261 114848 -217899
18697 -133931 74463 156952 21544 -165138 -107019 -95308 -178129 -64514 226561 -229706 131412
18685 406310 -111161 -196754 -139812 -419078 -23782 -159341 -28184 81723 107852 -8597 -142054
18674 -142054 -98524 -288858 -46116 -49737 -198536 218350 39458 130576 -61320 -230447 56615
18662 77548 -148315 -139022 -365500 -142037 8591 -129621 206041 142926 -156130 -38120 -90045
18651 -90045 -258011 -96154 61592 -199051 -1216 -342196 -7183 -67789 -12308 153972 -2535
18639 -157460 108019 -62601 -188731 -265459 -265443 -247510 -352309 -291188 -366854 -146610 -170005
18628 -170005 11737 52801 -84046 -12340 -329276 -152696 18358 -205386 220588 106144
18617 -342427 186543 -204664 407337 -301538 -11202 -79456 -10231 -309704 142400 8608
18606 -198281 -18962 -3603 99457 -366077 138992 -76141 -282385 -196265 -107578 -160161 -15475
18594 82423 183880 -469413 -95816 -20088 -279483 157590 127597 -133749 200297 19310
18583 -22121 1842 -57796 -468706 44207 138603 -253745 -158505 -86240 -200582 -20897 74574
18571 183747 -145675 -124512 -477259 -356503 296997 -100757 -112426 90582 119122 -249094
18560 45210 -68339 94507 261831 72058 -74730 -109133 -108402 -150732 -262717 300 -262570 -323081
18548 -323081 136574 -76291 -144105 -87545 -35577 -394244 -411373 -150677 -37062 -99673 53748
18536 -37920 64409 -27972 25217 -103937 -61891 -179743 287929 -73571 24650 -155932 -78808
18525 -78808 216578 -174412 -6274 154512 63667 189135 -92746 52531 -386022 -288957 65571
18513 -338490 115162 -158006 172200 -228984 373683 251795 -44603 372353 -209103 -363495
18503 -363495 298601 -128215 89292 -204879 -112180 15356 98758 94085 99868 -110939 -289819
18492 -289819 -50743 -276042 -291110 -323624 -907 210602 5817 -1047 -124942 -125242 -92101 -360009
18480 -360009 -77511 -70792 76057 -119001 -153737 154934 96716 49345 -163857 -69881 -47823
18469 -47823 -49840 15327 20577 58561 90355 6392 59722 107930 -139050 232199 -161478 374870
18456 -53346 -100330 -46129 57545 -88938 143245 -304918 -18187 50503 -258162 264506 -243456
18444 -49566 223497 136595 -12047 74439 -386802 -69463 -81165 -166357 -296757 11643 96987
18433 96987 -102026 -464390 -145851 -64660 73756 -42403 -100892 -84948 -147416 -11064 210353
18421 208879 651226 23885 -76134 11232 284722 129279 151628 -36076 -224900 -81839 -56627
18410 -56627 202270 135663 251245 368719 97088 181703 142661 -27590 -132736 99566 133897
18399 133897 216435 -209509 -137403 180062 185446 -112106 -321611 -110176 -131924 -120285 -46019
18387 -169905 226581 -249855 36206 -98427 179933 -179612 280714 -187814 -302092 -325303
18377 -325303 -113949 -114493 -113520 -158731 -99013 182724 41808 -346423 -197028 109805 -133451
18365 -31800 -152315 -195087 -137707 -422191 407137 34794 -47669 444072 -196807 44064 -108105
18353 -201830 170297 126756 -7077 -353464 7390 -250863 -88960 -346020 340440 -171302 -329334
18342 -329334 -116744 179205 -71041 -215283 26638 -236413 121485 85762 -315676 137675
18331 -93215 -185835 125673 -63907 79572 1481 -210779 -53862 -209164 -227483 64522 -167248
18319 -190481 -42533 104058 48078 384275 88122 95226 246669 76141 279298 -48244 43502
18307 246194 -69804 -35389 -187582 87293 -214107 269674 -78225 292734 124671 -73948
18296 193367 -279712 200041 -317020 -138870 -275454 231538 -13816 -358958 258902 -54028
18285 178329 -36855 24485 -118394 -88176 254005 -76423 -123449 -106387 134098 -274374 -161709
18274 -161709 76107 -168942 -404497 16026 -344151 -285410 -154039 258094 -120978 187682
18263 90324 183107 -63475 12682 -407971 169616 -97981 74263 8715 -210438 -158092 -51869
18251 -205639 -114801 -128625 -78653 -172543 -81883 88559 -18759 5659 -57978 117321 9665 162735
18239 162735 -307029 -363090 -81245 -432455 -276489 183109 -222468 103424 -113572 -29223
18228 46865 -118772 314287 -113429 -467665 -107329 -99738 -389969 -140736 -36617 -67947
18218 -67947 -4568 -255499 -251512 115723 -46101 -164017 124766 -6906 227383 200995 209856
18207 209856 -151195 36735 102224 -109916 128023 59563 -109865 134689 -139255 158722
18196 80452 17733 -469484 -259980 81878 90697 131630 37407 -163128 534325 -92077 91923
18184 23255 -121632 373316 -99830 114148 143213 -83647 -97281 95587 -82198 -135791 -11255
18172 -110483 64563 -76580 12262 311899 3471 -102876 174378 -125700 -27255 -194570 -34094
18160 48790 -310020 -6626 -254631 28223 -224784 -211850 148011 -152306 95724 199060 18071
18148 -137537 -125957 -184952 96990 -197204 -384355 -81253 -212774 25754 18168 -63098 -242467
18137 -242467 -120492 282308 -40507 -4868 -110368 -60812 -197108 138961 220168 46059 158895
18126 158895 -220817 -342844 -51475 -73247 150687 -182734 152925 92189 -299071 3412
18115 79173 108619 -227009 98989 6926 -43224 -184942 -30206 -188643 -55073 -558142 -104210
18103 -31177 -113371 -7569 -121375 55879 -19336 -100208 50799 275983 242361 -123966 -169889
18092 -169889 -247203 -132904 4537 -231930 -449441 161926 -38359 -214707 97803 68152 -365703
18080 315462 220815 -71836 -429364 104757 -52340 -156969 2521 -77061 6899 -180705 -285750
18069 -285750 50201 -17565 -27340 138526 76626 -30584 163955 115453 24810 176360 -122081
18057 16689 114293 101382 163762 -209191 -203378 -192252 82345 214510 -208009 -25800 15336
18045 -98134 -7781 -57767 -27191 -371413 -21307 -159142 -26803 33753 21666 -64916 -28731
18033 -47656 -347145 -65837 -103593 -19838 -248071 -108605 180571 -79906 -220065 236598
18022 -199556 -418723 -16388 33585 157667 -464426 -60971 262741 -128537 -118461 52051
18011 -341 -110448 -211260 47737 -18216 216922 -198615 62313 -103620 118060 -89690 -117684
18000 -117684 53712 71757 -55674 82687 207175 196753 50726 413531 -363279 -138907 -385299
17989 -385299 -8301 -119091 -291787 -61879 -127231 242708 27634 -16696 -18298 -23346 -285370
17978 -285370 55069 57390 -266678 -157394 48610 164892 83425 -60424 -164391 30417 -127014
17966 131970 358435 3748 265192 281079 215993 178608 -124522 211864 -281375 67909 -357702
17954 -150804 -53372 41095 -170933 -335179 -102942 -6711 283498 68823 78454 23926 -310550
17942 -203114 392813 38052 8239 -17749 -63365 80735 -81546 -44978 144598 -137197 -84024
17931 -84024 -257703 -168775 -2079 209998 -113447 -145992 -114087 119448 125379 86082 -176797
17919 147794 60523 165095 19954 346357 -78189 -227738 -86703 -65062 -251422 33283 -184930
17907 49489 -109614 -59163 229025 34205 -202569 -257375 12970 19957 169170 -315978 210891
17895 -60535 66998 -286359 169751 227960 -204337 167905 -394426 331786 317125 31176
17884 -139436 -37552 25144 201785 -129244 -277122 -50050 -139092 -53404 -442765 46501 -190853
17872 98057 181849 -124342 -140779 136481 -32443 70893 13938 -97722 -271235 133887 217633
17861 217633 -42091 319620 -132544 -153079 88163 194373 -315017 5857 159495 -132659
17850 -120813 126660 -133825 -358138 335182 -265337 -5352 15316 -94468 -111790 -119940 -234682
17839 -234682 270912 68771 -116560 -61937 -254794 -209035 214914 156258 133384 -73948 -47296
17828 -47296 -366669 10839 56735 -230565 24654 -13774 246161 280060 34539 -148466 -471116
17817 -471116 80385 -176453 91665 149066 141165 6974 -12977 537563 98947 154515 -233146
17805 43464 82952 83345 234716 96411 249222 -112756 -90330 149440 -371584 -51544 76833
17793 -191565 -141099 13443 148751 111027 105342 -205206 -101254 103226 -330117 198124
17782 170370 -239294 -79576 181085 182136 -90482 -282006 -196778 -277554 74159 -208410 -52590
17770 108857 -18596 89503 -253427 -227688 69748 103698 -268669 292582 -90979 -3120 -241261
17759 -241261 -94756 -236837 -18916 -34682 126393 177611 -179430 -5550 170036 196531 398126
17748 398126 -59945 35027 100882 18950 172148 122766 34567 -136529 45604 -151500 341359
17736 144337 -112468 -79311 63592 98583 -60902 320120 130806 53748 273340 13270 -61766
17724 -89219 -132704 348578 -113161 153914 171800 -316272 317569 125303 29551 35519 -109702
17712 -363 -210004 -168587 59387 -245698 14479 -246947 81947 -346981 17513 -176807 -115891
17701 -115891 -55806 -213484 -86114 -137317 -103023 -175020 -58358 -416043 -168412 35761 51761
17690 51761 232822 209593 185893 -98765 168807 -121904 179371 -82704 32758 -20524 -17433
17679 -17433 -125369 99493 109534 438065 -114631 151997 -50599 86729 -172552 41049 220767
17668 220767 95605 -105437 -71236 27089 -77487 40637 201943 220039 465287 29642 -296402
17656 72465 433184 -230490 68921 13597 78333 -134866 -104476 139092 -87196 -23005 150701
17644 366150 281429 182398 -185821 215320 50243 -250541 269162 -102623 121640 120804 -151575
17632 139924 -330771 148018 221998 -172927 78566 -348039 -113657 97121 131992 48734
17621 282153 226802 -1857 -74911 143099 169312 82617 253751 110506 276385 265325 -108804
17609 286566 -5688 330494 -13319 198587 187198 172755 156402 -243490 28527 23384 -155519
17597 -251324 13890 -252440 69643 153342 297053 -94303 142413 276186 40222 332550
17587 332550 27675 -53279 -367159 97172 23856 104317 95243 -214860 202360 -197051 -245836
17576 -245836 16469 -41874 -134584 -328898 205172 99843 148531 411921 -69994 -13881 127916
17564 142992 -288399 130074 77151 64306 56358 146346 -135473 78336 344438 19048 -232653
17552 -292392 91553 542537 213818 244958 43478 128773 -1804 -344675 -240039 -170295 21747
17540 291867 56569 262605 37291 217092 -109342 27239 378860 -152114 -116652 13059
17529 9050 -257620 215140 116099 -176872 77412 253490 327044 193221 133198 203661 56724
17517 77363 44780 -149460 -30270 -85853 72995 193052 -90263 -247720 -48697 117871 201867
17506 201867 -114857 138834 -147516 69384 -344070 -58564 113534 54537 184712 106921
17496 106921 262667 288675 476988 -131078 163833 1786 201955 49101 59300 270801
17486 270801 -112715 -56933 31138 182820 185481 397109 15855 324055 -88863 96500 170037
17475 170037 86870 129759 183305 528385 13935 424754 -147315 391071 44410 267410
17465 267410 -8533 41054 -240921 60318 -4112 288226 327122 42613 105880 38433 385010
17454 385010 496994 204257 -196536 469425 345545 58150 559961 221226 522876 446199
17444 446199 497376 347290 117447 289146 236456 65315 523836 270051 15256 160186
17434 160186 488859 195535 311912 200831 334932 232817 360689 345286 282158 508931
17424 508931 -66693 84697 247371 -114488 109897 353259 458055 -7119 -30136 121719
17413 363107 307235 122966 181066 182290 -29134 299663 127560 -139258 249294 -109908
17402 -118517 -10835 199797 -269181 272700 234161 437378 163677 181773 66499 -381044
17391 396927 118285 62634 379748 516358 -53333 1567 103858 133067 51729 32567 -96411
17379 112189 154269 188003 115099 -344953 105188 103213 -193816 -26151 207611 141090 61071
17367 -56126 206819 267041 158784 -160866 -108530 -258835 394159 -21444 -61490 -140377 372850
17355 114492 -10250 169906 143432 -239152 566705 26444 237752 303269 6719 3356 347979
17344 347979 145207 41203 243259 350971 -15030 49724 96162 422032 -181043 59233
17333 385936 -13637 106871 221320 135912 49760 123690 -163282 -126712 217779 357525
17323 357525 -104189 209861 475977 396594 -131065 242281 340798 214468 100001 230223
17313 230223 243527 -104342 4900 127896 308438 301731 -169357 153126 21698 494119 151500
17301 -47706 118317 294917 -3253 52562 294871 297848 394170 -79013 -27365 -134910 76523
17289 294339 170573 420468 432937 55205 -12445 33143 6420 180325 -31182 388724 214407
17278 214407 54396 -169258 270100 326998 466070 242508 383704 164051 83437 142455
17268 142455 333580 32510 415645 45998 466559 376403 40856 472667 181667 356077
17258 356077 232258 147149 414641 -17980 24232 217664 164149 6673 478628 -39523 249640
17246 -291092 431676 354171 -141685 -193497 365420 335919 49263 432447 418334 288275
17236 288275 12741 370446 147442 218359 9917 518057 46886 114908 501470 255724 8210
17224 138327 473187 189206 -58069 242067 429104 -232196 30701 389655 115304 106431
17214 106431 444565 81383 -11211 66166 164810 298857 349135 226975 85656 371385 121615
17202 45012 608742 -63622 50212 77214 68986 304232 222713 243860 275420 60214 306519
17191 306519 273340 134490 92322 168802 296955 320849 564084 67931 435943 333717
17181 333717 427012 83613 235645 31311 333723 58891 155610 116773 84488 104751 375126
17170 375126 31856 -81050 155987 308312 771741 179424 89379 122115 15494 318002
17160 318002 127166 86716 522721 397802 292801 236075 462572 356582 -28807 460647
17149 219676 110319 354056 128614 309465 146741 397566 42417 398295 253582 227074
17139 227074 307332 64910 159392 382354 509457 326181 607708 369622 -24784 642353
17128 288122 268142 113614 96669 248669 375212 204222 486705 479614 152796 361513
17118 361513 369522 303807 309689 425683 216072 588884 391375 387089 358339 404511 568302
17107 568302 404469 323253 400586 343601 137517 706506 202449 314863 424594 379681
17097 379681 607198 365822 287127 682751 372036 330433 437693 97831 179735 524148
17087 524148 306958 296935 366793 353799 258480 287128 504680 554155 486039 235313 101275
17075 275919 436084 456036 481354 277238 218261 668249 342943 716091 213858 550666
17065 550666 345343 396672 762918 563547 406973 801247 373758 532344 678238 936351
17055 936351 532476 98098 275876 625553 583244 540031 585817 450131 710455 550964
17045 550964 481820 756536 456233 408216 292752 458492 299101 283168 632619 546517
17035 546517 645350 830445 89535 452649 692115 396318 491675 471593 678936 609026
17025 609026 701780 722623 166947 485994 739862 669185 634957 647185 352254 696748
17015 696748 763634 479634 430522 741909 508279 708724 734828 347476 663760 487459
17005 487459 195838 430816 770082 613644 659935 1005208 1178348 578512 868609 540677
16995 540677 875042 510264 730911 677931 816235 469676 986209 826320 1016267 836397
16985 836397 911489 681340 470288 1036636 870549 288078 863883 765951 977243 770504
16975 770504 743169 1178765 917411 1070591 925343 885619 778442 659511 578860 881797
16965 881797 888584 853406 1087436 995049 698762 458963 698546 835513 788457 821563 868005
16954 868005 1034499 1425331 1076834 1030776 981205 1277571 1154411 973761 1272977 956240
16944 956240 736979 1107907 1137882 1170678 1113461 1481558 1049361 1392988 1351497 1405195
16934 1405195 1104204 1051009 1101911 1538408 1424682 1402365 1442606 1235215 936596 965048
16924 965048 1350525 1353156 1552141 1288955 1370538 1431925 1725696 1366341 1554107 1430720
16914 1430720 1498730 1291645 986042 1788445 1589109 1430446 1605456 1200462 1658622 1797838
16904 1797838 1381969 1686665 1261518 2038263 1345523 1448097 1533831 2077539 1601890 1917211
16894 1917211 1707209 1968167 1773024 1513340 1961201 2211639 1956779 2022764 2030397 2042346
16884 2042346 1758752 1989489 2056317 2089189 2063734 2088653 2178560 2161644 2270096 2299186 2411627
16873 2411627 2288890 2140032 2353464 1927187 2167060 2658381 2300349 2531715 2548544 2535969
16863 2535969 2583202 2509716 2663077 2611959 2738538 2377400 2497440 2767000 3058741 2942274
16853 2942274 3147635 3166935 2883310 3070262 3099316 3367867 3289130 3223732 3585862 3665298
16843 3665298 3491584 3846854 3732653 3650237 3740897 3501850 3567746 3733904 3979552 3960840
16833 3960840 4072891 3749534 4377669 4470758 4110144 4544262 4272044 4609075 4593117 4469237
16823 4469237 4653681 4944544 5154943 5206884 5018792 5278549 5307881 5614413 5504733 5746612
16813 5746612 5979182 5756459 5987967 6354115 6505482 6567723 6722400 6651917 7147955 7250394
16803 7250394 7409500 7331434 7309332 7556004 7938061 8361678 8092262 8398944 8798154 8785993
16793 8785993 8858377 9424003 9435593 9723841 9737098 10560242 10407456 10554305 11399361 11307660
16783 11307660 11915710 12224743 12733242 12777144 13194291 13811217 14099843 14574067 14986482
16774 14986482 15545619 15773068 16449330 17186050 17768107 18116166 19199463 19523055 20324762
16765 20324762 21245275 21837304 22970450 23631144 24653836 25569833 26869588 27850473 29244028
16756 29244028 30223948 31764578 33366986 34561732 36466179 38207693 40326898 42402847
16748 42402847 44036214 46772575 49275103 51869753 54809057 57921664 61193137 64769351
16740 64769351 68470509 73072185 77021700 82135740 87241648 92714007 98423216 104988818
16732 104988818 111578755 118853053 126578869 134360655 142832607 151447815 159946206 168403090
16724 168403090 177127891 185271145 192851026 199621382 205372558 209777844 212512751 214227347
16716 214227347 213897229 212050774 208733437 204156973 198143725 191068431 183472417 175312146
16708 175312146 165954514 157398074 148667369 140072184 131499274 123486045 115589349 108385207
16700 108385207 101811025 95264480 89352819 83945886 78579837 74104791 69475725 65620541
16692 65620541 61706060 58075338 55029636 51882618 49206050 46581625 44250602 41552047
16684 41552047 39699367 37559446 35489017 34156141 32374678 31017007 29915933 28305523
16676 28305523 27464793 25672206 24719892 23896653 22868226 22372221 21282190 20551911 19844833
16667 19844833 18647443 17981005 17249750 16826238 16159803 15756181 15205656 14887157 14197342
16658 14197342 13396237 13254703 13003055 12414709 12065906 11962765 11362336 10688920 10699118
16649 10699118 10437799 10016080 9781469 9318911 9515463 8956752 9072979 8266934 8518567
16640 8518567 7948185 8063501 7650256 7241738 7096393 6940642 6832132 6781200 6751504 6424466
16630 6424466 6215781 6317182 5827471 5916350 5707172 5631546 5711688 5197234 5131297 5032258
16620 5032258 5059982 4863084 4866352 4463528 4680174 4590233 4401842 4350570 4389174 4154937
16610 4154937 4148921 3922607 3873664 4076547 3908489 3534237 3980299 3529125 3642267 3385716
16600 3385716 3615276 3461369 3222238 3083943 3530106 3115897 3168909 3294518 2890132 2911079
16590 2911079 2797312 2829362 2668355 3047624 2634784 2319255 2487692 2501180 2554823 2341342
16580 2341342 2782207 2483679 2154701 2248513 2236086 2195038 2568854 2065013 2100732 2114233
16570 2114233 1952385 1909008 1878988 1813211 1689053 1901109 2096666 2243946 1834707 1716649
16560 1716649 1592776 1820793 1958939 1636871 1807112 1711659 1549277 1465770 1280700 1582666
16550 1582666 1607612 1532640 1751776 1469570 1618226 1726075 1295259 1168479 1303820 1551917
16540 1551917 1444735 1459400 1322912 1471633 1389458 1270402 1293169 966033 1191856 1462254
16530 1462254 1555650 1020853 1140198 1090050 1061398 1353430 1088584 1158575 1281587 1213187
16520 1213187 1242371 963398 858394 1130037 932464 956912 1059326 975856 1072185 1073359
16510 1073359 1072051 939214 1075612 735939 983884 1199444 910175 962605 800567 801482
16500 801482 874778 1204697 852181 799507 941365 685340 1225249 678376 1085716 806176
16490 806176 770104 612036 883654 587199 434582 694720 742144 1012376 716708 667019
16480 667019 1089088 532763 797608 447124 633768 590542 777502 898260 588549 830009
16470 830009 381172 530460 685840 536740 630371 701085 603466 577078 446556 659618
16460 659618 312884 769654 563842 364826 710636 670258 729766 380997 906878 565344
16450 565344 876450 499035 727267 726566 317260 454091 479591 662495 524327 749397
16440 749397 432029 479557 230843 800628 671881 840925 467252 357080 595506 784629
16430 784629 367226 389469 77760 418176 636271 403367 414152 618401 525556 318025
16420 318025 687520 512957 238005 784518 399888 612091 452301 579162 256401 402899
16410 402899 177938 557523 497718 412679 424176 184481 262536 29381 180314 619296
16400 619296 416030 -72509 264830 443948 342800 356879 136820 92719 213441 359440
16390 359440 343467 433888 500920 297027 259060 134778 282450 240099 382273 306284 210832
16379 210832 333676 -76981 286199 139199 603856 321384 208924 390545 508405 259513
16369 259513 440044 389978 149381 237794 511159 357958 197088 423616 171879 83776
16358 114675 152232 467841 -26043 159010 341465 555940 764967 224632 337193 415158
16348 415158 158222 492551 12254 300432 350033 304089 437791 334507 133042 336367
16338 336367 360490 267112 144985 -168902 487022 6101 428438 408049 252168 454432
16328 454432 289545 447965 96756 420294 250858 143232 300223 258833 541579 11138
16317 274526 169965 385082 329346 202061 404289 -117101 312802 576015 23280 456218
16307 456218 207857 396414 468341 115058 107110 74621 -62753 92719 32033 89697 180417
16296 180417 -195011 279360 41024 189691 -69657 274601 50362 11227 237411 277372
16286 277372 212607 305201 482584 133742 36827 205018 93604 375335 370077 183672 -47232
16274 141076 375867 -28006 177139 180877 178914 231785 93328 94011 206899 57950 -119717
16262 209204 191750 128124 141023 90282 240558 504905 -114827 161484 368319 41345
16251 108259 79763 292481 270992 16770 58181 -74961 74493 542253 79176 379649 -207118
16239 71183 -63935 438747 336263 172331 414771 439834 -85263 376469 84516 -365169
16228 6382 -51332 -3354 134723 -51898 71837 588547 298793 209551 169222 121030 -234275
16216 -129390 -167446 -8313 -102160 85730 -228644 -33727 99591 306653 -151964 253412 -169037
16204 -32857 -200538 -121546 -45824 33653 -104523 11560 53479 -33391 85157 92395 -238933
16192 -127913 98463 244784 134168 223273 -61755 75595 137669 459456 -104921 232752
16181 249566 -75978 -102501 151777 187571 -26664 223631 96826 -146611 254503 1172 -256562
16169 232882 -230016 -193240 -116803 -56975 129919 185762 -14255 126575 -42952 201083 4384
16157 -314851 384441 -378078 7483 67713 187106 -117062 -255032 168202 184974 -13852
16146 -240081 211281 -84950 33304 -26449 -132524 90558 109652 -111437 135326 105376 -170099
16134 -72312 391554 -16525 307322 9278 -205776 157448 -226729 -125274 136965 -51191
16123 265239 215026 -41926 -286233 111326 -273884 -190490 -116480 -379715 205957 -8990 59545
16111 -156629 -219955 -89692 -20029 93856 -3368 -87740 -205599 339404 155940 283804 -46821
16099 308566 -70790 144913 -211652 221237 -72667 -76079 164393 -223578 -231742 98122 -193485
16087 -446458 79047 -131264 -234136 -163151 -42282 -57678 -263424 50827 -206296 -240996 73549
16075 133971 178995 184583 -252240 -95634 -227518 -310468 -74199 40801 -216256 160210 161739
16064 161739 55308 92996 -46109 325049 -7277 -172212 242047 67093 -97239 -65687 17595
16052 -241976 -48144 -221393 162675 81137 135484 317654 50540 -68519 -52603 -220051 -175929
16041 -175929 36597 116062 -42987 176306 228060 -36100 -21819 32864 -100460 13507 -39338
16029 116313 447608 -55591 95807 -102899 97800 -311577 246446 -5621 47192 5635 63754
16018 63754 210882 155301 255150 10977 25968 -320949 -205197 185640 170191 199510 -280084
16006 -121739 238369 -207463 122996 -257670 131852 -242951 85440 -244579 64608 64119
15996 64119 168365 -219652 -220866 177572 193063 -120577 -352998 67958 108035 41276 247811
15985 247811 26403 385962 -110373 265761 258226 148543 325915 -9895 258972 -46375 -130246
15974 -130246 -84848 211957 160611 139055 -2075 -79827 -86548 -208381 30512 -81278 -26069
15962 -124897 223262 -86496 150645 -22337 118101 109808 -284402 -181569 -195077 -164089 -29478
15950 -160910 -249777 58153 -284450 -245748 -236377 -206407 289057 86423 130255 18456 284966
15939 284966 -143461 -21245 -153863 103171 -330764 -130487 -181992 755 -489870 89051 -75590
15927 93119 -18079 20151 -372921 74683 -94025 14086 -80580 -30112 -213226 25504 -72516
15915 -243366 51381 -119268 -283961 -106121 209387 168049 -72764 -77865 -99458 -120705 65578
15903 -21230 -404582 -143548 1956 -55416 368924 16260 99372 -128874 -375254 238848 -70343
15891 250458 -85265 106867 -180949 127650 191397 -243011 -130569 104341 -164547 87144
15880 93476 -82653 254366 133954 -103810 13612 128035 91102 -122410 -106623 -241601
15870 -241601 -132547 -119962 -103633 59470 -1155 -93552 -107888 24924 13858 43641 294105
15859 294105 175647 103945 159703 -239886 -77932 -39053 -76290 -51265 -16852 -217500 99791
15847 291180 -45423 -240612 -144657 281 -3916 -304002 -112902 81337 -353531 -476768 -176443
15835 165354 97591 132147 -117416 -398474 113729 181410 212891 45834 26247 127513 -117271
15823 -166103 -226465 -163214 -30831 75987 -114997 -52125 -147255 -226769 -191928 -268789 337246
15811 -14381 -5614 -185606 163437 -112950 -185372 38653 -1876 117563 480489 -28862 -20973
15800 -20973 257346 -107246 -52581 -4161 -116752 -221964 -254406 -95051 -222584 -59641 -129735
15789 -129735 -100547 311372 68460 124214 -16943 73198 -5223 -314308 266961 210612 -100857
15777 91563 7146 153396 168917 60938 -309671 -407485 -377173 115620 -209025 -201375 -68000
15765 -216204 125387 397229 -328487 -19773 -77195 85785 443225 6562 -35311 -211029 -304021
15754 -304021 29583 -124937 -191736 409761 518760 -77860 285518 -115153 21762 124999
15744 124999 79273 8311 -138738 -61361 5363 -92324 -1148 81484 -165490 -87851 -218155
15733 -218155 -80507 -574535 -139643 -246773 -242000 -197887 -151104 -109122 -96907 -293343 166318
15721 -182801 113994 4145 -182937 55764 -242216 -136291 -220359 18217 -297271 89450 163336
15710 163336 -287916 -285771 126371 -12262 -296305 79633 -324046 153805 29391 -94506 37967
15698 -53230 -3129 -211455 30251 -179307 -98109 28381 56176 37737 -200658 273293 308990
15687 308990 -218320 -166633 125082 -223046 -221471 58950 -6766 -120226 -30549 -163643 -259328
15676 -259328 44721 -63449 191593 338485 -31164 183448 -57525 -20516 191869 -59662 38673
15664 22126 -8351 133908 262027 6898 48885 -71741 -465926 6090 87251 48582 -101746
15652 -207691 -181945 -56371 56886 -122193 -173852 37827 120289 -38489 170839 -46698 -121767
15641 -121767 100481 -33828 -164693 -9833 43274 148404 -97411 141544 -132621 -95013 -94140
15630 -94140 -93609 -181645 247819 -305447 13878 -64454 -263736 -72633 138785 81492 -92484
15618 -127044 -86295 161149 127768 93139 159628 36287 81952 -230627 91728 -108897 -381422
15607 -381422 129957 -202421 211053 -24212 -35121 -249957 67192 14984 -78663 -201820
15597 -201820 127931 -156343 -73483 29213 -30358 -341561 128825 -131916 -210928 5836 -28080
15585 50874 40717 247549 592714 -55344 -194811 85965 185191 -242439 156693 -271959
15574 -326942 23029 183297 76949 -95872 -112061 -187854 64295 -109771 -157705 217453 -124505
15562 -327693 63030 -36500 174253 -49941 224078 147607 -108700 151738 -26631 -32902 -106720
15551 -106720 280819 -102416 -17552 -174661 -221803 57369 162897 -129980 -247276 135782
15540 -421061 237237 -30105 -10319 191562 -28624 -53297 -35742 190072 161729 -234873 64026
15528 -173494 -13077 17139 -430219 -418 416150 87290 264639 -260357 -96863 90460 -33456
15516 84292 -102078 -157715 55132 8155 -10821 104642 57973 -85125 210376 -128496 67422
15504 -8368 -279024 158462 -178483 163387 86266 215974 -441807 -24512 -564398 -206112
15493 -103200 -175953 -35581 -123328 -90402 -191577 -159905 -119764 21536 374799 -32866 -217825
15482 -217825 270797 -68814 -17976 29470 -355634 -382376 -168365 -111927 77996 429444 158885
15470 -221887 137653 -17403 -26091 106607 113817 163514 87284 -38497 -97649 326059 74946
15458 140516 237758 -34602 -151139 -176861 74320 245524 137472 73453 73711 362546 -365756
15446 -44696 -44276 254214 -14384 215230 -236177 121282 14684 -55073 -162984 -228588 -135088
15435 -135088 -199377 -244235 55793 86525 147107 573306 -187153 -40449 -160960 59305 262435
15424 262435 -80805 61383 241391 132484 116894 -156332 -56405 -71883 -143740 82560 154420
15413 154420 153178 229340 55799 47545 -75852 352191 157928 30949 305933 50583 83574
15402 83574 -4170 392020 29336 61813 -620835 -170505 120114 -62936 158566 -98142 -195160
15391 -195160 101779 -158777 41654 -186944 -139587 -30430 -218919 -73329 244981 -339459
15380 -25028 -207916 -297380 -223541 -109124 35426 196668 25812 148801 2297 -58465 388979
15368 53988 -118944 255073 326833 70994 102852 -137629 -262754 120278 -100829 -17102
15357 -34557 487948 -126407 -99251 144754 -37261 77184 155533 -269236 -129208 -299652
15347 -299652 -46714 -133372 132454 -114564 126064 -123215 78972 -109211 -409783 214038
15336 203400 145094 -16497 -378941 275664 -151184 223085 100505 279905 325812 -324782
15325 -4284 -140216 -15753 -35909 -67604 211304 -48707 -108399 -121904 -48423 -162622 -121409
15314 -121409 -153008 49389 363813 117437 57388 -194579 135953 64419 123415 112283 -175449
15302 -107554 240908 -75284 26993 -49009 97441 -89072 50248 309369 58747 274033 -51805
15290 66388 201201 -50741 238288 -30226 42440 305377 -102507 583497 -334623 -347748
15280 -347748 187236 -27289 52689 -124702 -101881 68394 105890 251551 358524 113132
15269 -46243 198118 -77419 84208 47570 -80839 234022 -30360 14234 289018 -67117 118277
15257 21879 229651 399159 33328 64088 -103618 65497 223096 187970 403468 1305150
15247 1305150 1952409 1458933 1512756 1428811 322361 135412 145441 52161 137334 375706
15237 375706 1146 217196 68887 50016 -164297 -196294 44638 -146958 221890 89620 -285749
15225 -189061 -367705 165106 187675 374190 203744 259206 -43798 114591 29816 -28940
15214 105430 159534 218548 -16658 -98258 30244 112121 -155268 56919 28612 54477 -161962
15202 -17775 -117358 146508 -25838 113385 135669 63908 -37864 -71929 12434 -130289 27597
15190 157461 215068 288539 230060 -109441 6654 517942 135573 -123430 66310 -212533 386646
15178 145498 98088 -62103 337228 109988 223253 179322 202528 438956 -195947 -20183
15167 18632 120461 267269 482746 74883 72968 343498 -15010 211901 -58946 17120 -14338
15155 -219363 239908 261285 75232 506329 313912 -44597 120236 -256902 -142557 34014
15144 43457 254329 -134955 75268 -97300 142181 -65707 102903 193997 215817 115268 220133
15133 220133 226669 368672 9046 376709 237790 43738 -23465 -5984 -103611 92971 296088
15122 296088 -106070 48054 144893 240101 98021 -37897 93780 33042 147620 -201177 15437
15110 203284 -112002 22541 272640 324245 214375 262839 34516 316352 80012 101464 153486
15099 153486 86841 565338 270964 158224 104030 -71193 35919 42458 -13664 135364 176713
15088 176713 155438 -202818 190094 372766 360350 223588 112644 472315 195065 465504
15078 465504 248458 411631 -137833 89438 155553 150933 189117 -11591 240303 484382 17956
15066 94805 -44133 575874 230894 345511 464685 80485 203542 246847 -129446 -57243
15055 -164322 186458 -69015 11351 333170 112007 86013 166384 338231 231009 452094
15045 452094 117547 193215 366346 395387 545847 -17790 349036 42146 118924 262468
15035 262468 393697 -30470 10926 142329 9045 138693 201111 178525 287570 -61963 -7670
15023 336796 -92467 396863 -224 421542 -285990 589685 587876 -75712 225177 -213150 304361
15011 -7937 65576 -243461 429073 494668 416631 191473 64918 102532 -329356 201437 52906
14999 51141 294043 242502 350768 361163 11740 224655 -165449 196367 330877 237331
14989 237331 -219703 223791 600847 310793 72550 61934 350109 271069 382216 28959
14978 192442 -168949 152653 158844 97218 -50691 232260 654841 207227 461315 292600
14968 292600 12779 122286 468311 330283 98946 -9793 146154 337381 519855 237678
14957 313567 10809 187199 154621 127964 373484 350036 414978 352373 253848 158416 418776
14946 418776 362168 337018 535308 167570 198381 675153 42535 242617 160775 259900 381099
14935 381099 312656 530878 360873 104735 283680 263544 134055 507518 365816 286430
14925 286430 507943 242888 267318 88297 182501 425589 261419 319318 119442 553563
14915 553563 404744 395574 270261 349133 123630 339503 138353 61376 452409 447224 309128
14904 309128 210334 392918 512801 474606 164516 272900 356994 499773 250214 307833
14894 307833 103958 107110 60874 373374 605718 287864 301319 190398 298091 644698
14884 644698 437799 409273 279431 605312 262792 323867 693947 814008 163503 326232
14874 326232 271522 393167 233629 314142 751319 254898 164675 490199 465670 306585
14864 306585 196242 241888 310136 201081 466536 272429 218419 476255 334973 383624
14854 383624 446105 113561 623625 332760 420189 454852 487424 652050 525737 495365
14844 495365 338245 410527 338156 448395 81677 412051 327146 395626 845180 481507
14834 481507 670403 469292 214426 194376 585001 470402 640173 629074 535198 775958
14824 775958 218993 337472 371389 725989 474128 649407 310079 375925 248278 225869
14814 225869 710174 606563 435254 -89493 311499 720952 450650 722756 521349 497570
14804 497570 506120 346390 428070 583234 421971 923438 550138 523570 835682 848892
14794 848892 805061 587582 399540 513843 338658 700516 614407 734974 367298 603500
14784 603500 389686 606288 693395 899323 272864 577000 341637 784485 923433 456387
14773 657383 484363 516180 583234 612308 787649 339324 585891 826580 614759 755887
14763 755887 756970 155639 549817 665548 391125 661556 571916 561463 468089 711693
14753 711693 581207 531376 503249 816940 793304 1034034 661706 883471 768329 763165
14743 763165 918764 798027 715160 886670 764370 781967 846181 827334 495716 704728
14733 704728 346651 680134 902336 984322 814434 495359 669539 629204 645403 733290
14723 733290 691417 970141 1081140 470240 604057 966986 706251 771883 995306 739674
14713 739674 422001 1017176 812053 799404 821819 782821 787551 837615 843766 851234 1100160
14702 1100160 920644 632594 923171 1052941 879135 1064619 882671 800258 1031811 948377
14692 948377 1094403 792449 981696 844098 779265 899121 587019 944082 875051 1112377
14682 1112377 863716 1153669 862001 905839 1214165 901756 1116846 1002091 987096 758423
14672 758423 1147402 1018899 702675 1197333 718105 936039 1433212 727565 1120074 783560
14662 783560 980238 1093616 1013108 1236602 1101246 1216082 1268693 1407887 799090 1227239
14652 1227239 1198709 1181636 959083 1578214 1043523 1265912 973754 1099242 917134 1145362
14642 1145362 1412701 1113928 1567033 986601 1171242 1132560 1665137 1316189 1427855 1356979
14632 1356979 1436667 1517997 1193199 1322755 1425759 1241263 1200795 1525191 1684841 1498283
14622 1498283 1483747 1672491 1303081 1863773 1560966 1288687 1449005 1846100 1722922 1629229
14612 1629229 1498624 1065021 1805443 1337009 1777600 1390727 1812459 1485794 1537195 1701585
14602 1701585 1363828 1671659 1356693 1676042 1957261 1431111 1716851 1861415 1856016 1828338
14592 1828338 1749824 2125870 1967328 1750962 1913584 1955621 1742370 1710400 1739241 1995548
14582 1995548 2109205 2296482 2034263 2352330 2160669 2046417 2249850 2118379 1945902
14573 1945902 2232341 2142802 2170782 2454714 2444468 2195157 2558535 2446185 2334055 2722459
14563 2722459 2599032 2664412 2755100 2968504 2949569 3165644 3093894 3483864 3202596 3663966
14553 3663966 4179396 4446384 5227752 6543216 8664054 13971343 23537702 36951560
14545 36951560 41926655 23084939 12465819 6587586 3640313 3287134 2365131 2387703
14537 2387703 2338138 2042400 1988324 1921921 2212650 2160519 2152107 2485173 2517719 2472137 2347580
14526 2347580 2472774 2184877 2399028 2435271 2005424 2400327 2620442 2718202 2597827 2791888
14516 2791888 2765059 2957546 2627596 2668942 3001715 3155210 3009079 3077250 2974368 2846399
14506 2846399 3130523 3136044 3179961 3498899 3401134 3087164 2952012 3291550 3271964 3353943
14496 3353943 3153245 3594531 3553239 3640206 3422901 3181970 3656800 3716872 3803807 3746930
14486 3746930 4074109 3608996 3700838 4060604 3827747 3883747 4019789 4021729 3984217 4248474
14476 4248474 4142652 4146483 4189515 4280061 4291913 4417416 4610565 4358097 4447172 4599171
14466 4599171 4789641 4856839 4452714 4939546 4916933 4581134 4985547 5062305 4907008 5142407
14456 5142407 5194209 5252019 5299700 5157122 5265414 5225053 5440933 5468971 5846435 5816833
14446 5816833 6073364 6002471 5875275 6054979 6023526 6404896 6236172 6263245 6585570 6394257
14436 6394257 6691008 6846668 6858390 6963723 7017336 7035307 7053587 7222619 7556729 7602794
14426 7602794 7342603 7653199 7849784 7852387 7641860 7771949 7973137 8169552 8421067 8568434
14416 8568434 8679822 8945047 8959533 9366791 9442977 9373382 9340195 9310460 9736057 9793416
14406 9793416 9644497 9975140 10254074 10211505 10897453 10771906 11263783 11265532 11326803 11401847
14396 11401847 11545163 11551799 11789464 12424439 12425912 12607919 12681498 12890226 13388845 13823146
14386 13823146 13642468 14088880 14300012 14319709 14480132 14845414 15327423 15800094 15859821 15971780
14376 15971780 16518640 16661399 16861105 17265285 17534360 17846828 18408022 18773689 19282519
14367 19282519 19451002 20093597 20503381 20845517 21373581 21600270 22408413 22776117 23584082
14358 23584082 24198560 24197540 24792908 25553975 26153169 26593268 27145909 27801024 28585088 29224727
14348 29224727 30531401 30856063 31424388 32592367 33242624 34104053 35051554 35902871 36705888
14339 36705888 38024858 39000589 40179172 41195307 42289537 43704180 44876486 46518703
14331 46518703 48184536 49578821 51100280 52677940 54389996 56281718 58113876 60075506
14323 60075506 61971998 63979116 66685338 68843187 71432047 74024978 76910942 79658149
14315 79658149 82976295 86337766 89421951 93396000 96999686 101358779 105424604 110190843
14307 110190843 115213488 120099092 125395152 130916311 136886139 143704723 150892189 158156714
14299 158156714 165759626 173856557 182085501 191449609 201423807 211715221 222397957 233643594
14291 233643594 245643538 258179077 271673334 285260819 299460559 314251205 329605827
14284 329605827 345539136 361094340 377292704 393336156 408945567 424131105 438480924
14277 438480924 452392792 464985462 475599097 483704595 487086380 486300242 484886263 483149436
14269 483149436 483817458 477385461 472711336 465359319 455648963 444132480 430570943 415369849
14261 415369849 400021995 383603683 366977956 350512497 334061862 317630529 301809862
14254 301809862 287362102 273499906 259566717 246343112 234009294 221788172 210813258
14247 210813258 200376312 190768096 181594224 172848285 164742324 156910003 149582939 142566586
14239 142566586 136307042 130525684 125049394 119682411 114505693 109397906 104913217 100752660
14231 100752660 97056148 93257240 89334535 86022912 82658408 79718441 76539642 73692945
14223 73692945 71198589 68493173 66488860 64181893 62373549 59822449 57707165 56041004
14215 56041004 54204558 52630293 51290726 49852892 48088104 46817067 44883685 44315391
14207 44315391 43291459 42075481 40668665 39126771 38099120 37342153 36489833 35537578
14199 35537578 34472346 33539436 32544388 31673567 31006298 30262480 29682502 28925673 28142151
14190 28142151 27029911 26248273 26253317 25142747 24593607 24337888 23921007 23332221 22813602
14181 22813602 21946520 21945453 21776959 20919338 20563211 19976737 19569772 18908931 18764474 18587629
14171 18587629 18199419 18069017 17338371 16962341 17056186 16210399 16244639 15723722 15882162 15226483
14161 15226483 15177889 15154666 14734765 14159044 13813656 13594948 13783817 13261517 12924967 13056870
14151 13056870 12807596 12538449 11922519 12272143 11921457 11767798 11382421 11290359 11172791
14142 11172791 11342200 10782074 10525535 10641669 10397710 9969611 10161037 9971052 9778006
14133 9778006 9788211 9295169 9604868 9578688 9143351 8925357 8673856 8814200 8879535 8765074
14123 8765074 8511959 8234527 8086346 7763878 8011353 7943616 7699273 7688511 7321544 7515693
14113 7515693 7188083 7504020 7331892 7237655 7089806 6659355 6826150 6895968 6728039 6754443
14103 6754443 6444475 6461311 6578227 6656624 6240953 5695775 6222298 5770709 5983633 5916677
14093 5916677 5521207 5685414 5761258 5614210 5687270 5159652 5383711 5365516 5229568 5323796
14083 5323796 5464051 4946219 5082801 4746773 5004928 5186580 4733957 4466466 4536805 4574346
14073 4574346 4529845 4749103 4258555 4598214 4372498 4572338 4483264 4328730 4333937 4602390
14063 4602390 4534015 4044547 4107941 3878856 3978051 4422988 4214972 3957068 4258493 3972941
14053 3972941 3898331 3672131 3678182 3982257 3341303 3585100 3358820 3773261 3427755 3460414
14043 3460414 3651925 3575276 3510105 3094393 3318391 3581369 3402506 3248601 3100024 3361288
14033 3361288 2875291 3556210 3183136 3202127 3416318 3114792 2752435 3287831 2474651 3180261
14023 3180261 2769532 2786563 2631516 2716381 2715767 2603200 2683573 2659815 2253677 2449561 2455102
14012 2455102 2642826 2560531 2301209 2685671 2483249 2165453 2042180 2453335 2687727 2175875
14002 2175875 2226795 1924728 2417261 2033935 2172261 2270702 2237999 2055681 2344544 2336179
13992 2336179 2104080 2898332 2942471 4436076 8460571 17031288 31410546 42510253
13984 42510253 26820836 14521511 8897419 6268716 5015050 4556132 3975975 3559198
13976 3559198 3563205 3221277 3061461 3118838 2647131 2874223 2691310 2346029 2228294 2405086
13966 2405086 2165208 2488333 2243248 2363975 2284599 2188242 2457753 2516887 1993052 2208568
13956 2208568 2181710 1932151 2200576 1954150 1770746 2269054 1815289 2159467 1918570 2265140
13946 2265140 2091230 1647973 1677008 1804593 1837701 2104508 2080561 1912786 1844022 1849375
13936 1849375 1834599 1904286 1993925 2095590 1965809 1244385 2025443 1918368 1578699 1679623
13926 1679623 1642703 1394969 1434546 1351003 1723985 1332560 1548091 1601118 1436480 1576387
13916 1576387 1549864 1324516 1490795 1269075 1463889 1710253 1375576 1587152 1478638 1508892
13906 1508892 1487975 1562401 1318219 1374170 1526691 1210580 1733677 1467747 1376917 1177942
13896 1177942 1427071 1440279 1548665 1597317 1359484 1300203 1252004 1505181 1221358 913996
13886 913996 1387732 1369033 1470242 980528 1091363 1017334 1128237 1150206 1593548 1132410
13876 1132410 1402029 1376225 1404914 1033112 1219959 1408778 1204998 597082 1051288 1247015
13866 1247015 1250780 1276962 1122768 901007 1161119 980676 1397142 1103085 928776 999040
13856 999040 850143 1172303 1115754 1259725 804554 953027 782821 1075359 1132899 1082857
13846 1082857 864806 1074502 1138751 1026583 953965 890133 1135879 949932 778749 1197557
13836 1197557 1064841 897159 1195170 839098 811434 951792 1192290 1080882 843309 957194
13826 957194 1049126 867082 1219603 895401 1179985 605520 1300325 626990 769692 1111625
13816 1111625 948369 837754 784451 1029958 698062 674198 976113 995361 1186139 728257
13806 728257 967877 958432 583914 675192 631472 895072 820193 708731 1018449 851538
13796 851538 1004026 774501 1081331 947195 368776 538972 847652 906042 826389 723767
13786 723767 767835 836299 789938 518559 621459 1057339 698339 788561 935009 467989
13776 467989 819171 729607 612511 805174 736556 965543 837759 687778 885333 656017
13766 656017 650041 683616 363967 669847 718464 442757 1047857 690528 1121822 841122
13756 841122 833117 714680 716091 793657 352402 542530 379367 753110 970006 688730
13746 688730 800808 552676 667765 581725 701045 639857 770153 672127 293822 698130
13736 698130 758227 542844 723843 534006 734321 946506 892558 543988 876906 742529
13726 742529 388766 749858 688061 6280 476783 522887 464323 487920 589663 810391 439796
13715 439796 429853 480308 640436 240708 743138 215210 764790 791309 500394 593833
13705 593833 468066 209236 682989 733525 464006 682626 183015 286479 455989 289869
13695 289869 515085 706047 704341 502256 647876 660273 495291 454903 384528 257720
13685 257720 538717 702288 470327 579560 649553 396213 924758 460297 541344 321001
13675 321001 557245 340418 571576 432104 368931 415655 489317 304476 789034 451877
13665 451877 338432 551535 647646 234672 461343 604804 434646 640812 298594 324635
13655 324635 477349 576010 325379 537746 650232 232650 554485 607068 703675 408905
13645 408905 207316 413200 280777 554013 420234 381136 391500 307845 706514 531106
13635 531106 409157 161360 546718 549528 413270 443303 549994 366690 520480 503423
13625 503423 272705 284327 293799 715210 296889 374972 248160 315514 438376 101220
13614 318786 360391 498392 126203 540920 86479 379588 436113 561925 267401 124820
13603 352751 281738 214617 213824 143643 706647 777133 382122 237324 290152 307170 571763
13592 571763 495895 198847 285088 256444 490204 681762 342636 339504 418501 265646 71482
13580 495137 168522 157598 333008 420445 373192 494920 129033 312203 149485 227807
13570 227807 70017 605493 654993 353936 129586 629683 -102065 416760 93775 152721
13560 152721 195242 489378 495402 161356 332383 141823 -5586 390940 408620 346110 -138246
13548 302784 260735 139124 287133 558071 310200 547023 409499 401822 11230 196742
13538 196742 169669 370933 175987 430975 427462 145762 256658 395075 664930 151841
13527 132251 398890 336420 259060 311082 386352 159189 52775 407037 238060 419691
13517 419691 169110 295709 611027 634262 83526 407206 267921 249606 43687 302007
13507 302007 567439 -214998 86710 373485 24598 288497 439298 246114 228726 214533
13497 214533 513594 246128 -74981 -83446 321096 539850 192543 316879 -177978 -17977
13486 -53058 180084 199828 254136 7949 270662 247587 -64972 177377 392868 289851 150444
13475 150444 738633 401390 104952 117914 63474 414003 241108 380506 -50938 365077
13464 156082 142209 -20727 -20864 -91236 266395 360004 558571 299600 -15145 274736 459610
13453 459610 119687 140182 371253 348191 142727 327029 112650 313058 -112186 643811
13442 77582 106867 32156 32134 310681 134689 82903 -43306 209287 112481 -187429 97880
13430 360440 127545 218888 341201 126411 164340 182292 -11603 294709 277925 131748
13419 310447 281132 484682 505904 205626 431491 322074 168763 -145287 409082 426814
13409 426814 329444 482520 106479 243545 190857 144855 380733 311034 182428 -197184
13398 128520 730343 191550 156035 500623 98136 121830 154582 165649 99616 133909 -25541
13386 301395 294716 109762 282811 115722 -95196 -1380 -21655 105957 312946 241688 267043
13375 267043 174235 335111 344560 327640 94754 347586 244245 163942 281263 803045 162668
13363 265536 248866 274918 308829 -211140 81901 -68896 350244 100765 52684 352646 333422
13352 333422 393696 387189 429066 318949 -42287 202332 187980 217294 307947 288233 384775
13341 384775 256496 355086 18893 30984 513435 58079 473997 226752 -228660 232447
13330 128557 524612 335767 136154 310803 215377 301852 83837 -44265 126566 231342
13320 231342 225884 -63945 56609 310540 387774 52919 149237 307789 120974 298090 134569
13308 128433 -230278 365682 399848 55925 394029 149989 37877 253342 334689 505788
13298 505788 128870 168314 109319 556846 266789 275575 386566 344797 -88264 4223 126038
13287 126038 300338 -271310 560311 228542 -60112 187400 41120 -62353 716116 21664
13276 -264329 -113895 -136897 253399 124252 83661 -138077 148521 -178671 178050 -20349
13265 131138 -55815 143521 218411 233016 263816 -82998 425130 361960 280698 -115576 18065
13253 332382 90493 259762 -101997 210123 522221 102243 160384 153699 61985 -439653
13242 -37408 127130 185110 81202 314388 268457 340407 -77993 143120 213618 152286 -47540
13230 33243 80553 401396 99964 -261381 371073 380998 72051 7615 522773 1340 137970
13219 137970 -63045 94469 12967 161632 217619 93470 41199 -237155 -95583 -7149 -111152
13208 -111152 -170674 -27039 76597 119786 31791 40239 -228575 -86713 217453 159677 190238
13197 190238 -44205 87972 141911 -172970 176384 321683 103841 187780 41736 -23735 -111307
13186 -111307 -248743 -33747 270324 225187 189272 -29009 -54990 -19247 115312 127296 -37418
13174 153712 189712 75068 27984 100122 174857 36741 -204858 68457 -52159 151046 206430
13163 206430 474014 -58937 68332 63422 -113200 -110548 -68759 166659 382638 234610 263883
13152 263883 -5956 39232 330732 104760 65187 27606 -165294 512906 18061 69392 -146388
13140 559616 212973 162885 -117224 111450 -229637 3126 95377 180273 185665 266256 241607
13129 241607 -221307 -8362 295024 -127542 213118 -87934 -64943 -61336 48968 -155973 185508
13117 141563 320396 -373549 30726 -173964 -10718 69846 -294769 -65373 259389 17238
13106 -37203 200161 22859 466631 369877 -55621 175250 262161 -57950 275900 69824 -110644
13094 31675 115276 80117 -219564 -230223 44344 -380258 362649 -234507 -280299 -168572 137179
13082 132700 252489 34501 348157 -41993 381635 143149 51025 308769 163360 -136793
13071 -89091 255867 54454 224738 413830 152204 -117716 487093 16990 99537 412754
13061 412754 54102 77028 272082 144873 -2475 -33538 136766 -120394 250411 295729 117715
13049 104238 -145831 99480 92060 73775 -255499 -48660 284185 161558 133077 119905 217585
13038 217585 -48080 84701 140258 -173464 203232 190498 130478 -154096 -20582 -61964 59890
13026 335092 32401 -80343 276897 10823 -145934 140590 144120 -129498 43166 252073 120441
13014 380061 54635 113177 -99850 211856 -53619 -39608 91093 314160 -26807 306389 362282
13003 362282 169936 -59370 -153588 8081 168239 142092 403968 -75158 454158 -16356 25849
12991 -50375 -12897 -52605 105870 -414452 162257 197698 -24434 44717 -57300 294481 242271
12980 242271 -209061 -72829 91977 37165 -11786 -162263 224949 302791 -183786 211878
12969 140869 -250357 -182425 32986 -106316 -286566 190182 136231 151579 199975 -11678 64586
12957 112153 223668 -100851 -211632 387185 552820 299609 -235758 73681 297330 165361
12947 165361 55737 50541 118807 -71129 36743 88452 129358 134690 114808 46476 -7318 -251144
12935 -251144 615765 -173861 -46620 -13798 -59447 -21348 -251947 187234 -49143 311349
12924 322668 -197131 -253145 -77046 -124054 22167 246397 -23840 28055 76779 139043 327042
12913 327042 118107 28597 432997 237851 -84773 493329 321291 -152862 135623 51378
12902 -56044 67413 81063 163657 149272 80722 117980 -48730 -44413 480503 192752 75360
12890 217055 120262 1743 2301 287256 128452 325349 333690 720243 88087 248263 258774
12879 258774 238455 -29975 181084 356728 -62729 162550 73708 -284358 80016 -81261 95592
12867 56971 39633 -86061 -45839 119237 36514 -176977 -16498 -58001 -76978 -68389 210618
12855 151381 149604 -12221 -169661 157278 191863 321973 -130793 11669 143837 -109430
12844 -61574 74217 104862 -49400 283738 -143896 -71514 97719 -104025 200710 99829 369090
12833 369090 201961 140556 305593 133290 157680 -62163 -224784 34037 73717 47667 143439
12822 143439 -49615 63013 -11143 226000 -73220 -225948 114775 -1072 88017 -216160 233483
12810 -65625 25456 217826 454722 -75375 138320 -203056 -240554 -102444 -26651 -136483
12800 -136483 205618 83121 371337 133735 -207547 60985 -81046 -28571 -319953 -116857
12789 126200 -457475 -23512 -313125 -206022 119608 -244346 -356112 -167125 -230246 -135664
12779 -135664 -137804 -231680 102570 -195487 149087 -323016 -170550 114743 65821 16107
12768 141112 205644 185995 -52966 142036 -148692 -190859 -21615 31945 158415 449205 -171623
12756 64193 -228709 -80938 285047 99602 98143 -16828 148754 14698 192869 228202 306710
12745 306710 170962 -180798 77803 10528 356658 90916 -277871 -272213 41792 300247 -219966
12733 11185 -31374 267670 -265292 36904 263966 -96256 -25529 -263547 -174929 373090 144495
12721 121207 400524 27953 157712 120322 202106 -165968 -85920 166841 -203112 -52753
12710 -79262 197867 311959 316670 70886 302875 464130 136452 362496 97313 19635 118738
12699 118738 -53492 -77205 261159 167547 -70947 371818 -24451 -60340 44751 79203 5753
12687 52245 109148 -179486 -69429 43164 -90199 63712 -63512 154052 197250 -133790 36318
12675 244583 -23383 284271 220047 513464 82110 135415 12157 345600 100524 22976 254461
12664 254461 -238628 192492 636799 145677 -1406 260773 68450 167906 188611 120945 230819
12653 230819 158233 225825 -44028 109348 170044 -147355 386188 44764 60129 13339 -309459
12641 -43562 -74332 320353 -53976 66204 292555 -173592 -77272 251922 422000 16472 114156
12630 114156 417089 43882 367745 106661 66021 432902 356423 94261 205483 6376 291313
12619 291313 431421 51135 207884 -151715 -152063 123551 95589 119533 -76 -123357 -143483
12608 -143483 -176828 101882 96581 304208 369338 134464 -284663 196541 41740 113768 27407
12596 333735 -96638 134801 -167265 -262541 163509 289715 67507 -260456 393086 378392
12586 378392 25198 46183 222671 69867 -21180 -148195 193106 -433916 -96416 52846 -43929
12574 67681 -233487 105945 190703 252612 -63824 -102499 178362 -108166 70635 -127226 170005
12562 -182399 -119043 53872 -177634 172168 194826 -32468 -127132 100450 -270671 252242
12551 192347 -895 80571 -338583 -154457 187985 358713 368643 194996 -26241 144416 167804
12540 167804 -225110 -57941 -78426 -132712 -48652 -220447 171283 179307 -149269 -181942 142496
12528 197702 -63068 -98606 -58039 -16581 353276 -12199 -114155 76990 201397 -62504 266433
12516 69284 280763 435307 109031 135534 107963 233268 6689 7438 -252524 -47927 41485
12504 250813 -57090 -18798 -51581 374029 144763 -303329 -205107 -74438 -75440 -34677 -335065
12493 -335065 149293 -8499 254748 -167270 273850 -24721 85124 -16789 99529 174639 455876
12482 455876 110716 -81227 54045 -196902 -21780 -392054 -313527 -142914 -215957 -75255 -291646
12471 -291646 41113 78004 87925 210612 -79541 142898 290871 -242932 -56737 -210754 122085
12459 186315 33021 177026 120902 22934 -33997 164846 -69430 68644 215130 103037 -288705
12447 25468 3520 -66478 -106379 23028 111635 56347 315246 -20038 -78941 -139846 154208
12435 -32654 -5536 305081 -37580 184943 46774 -283474 109685 297873 -33056 -183655 -118134
12424 -118134 -81707 350858 77396 49519 93191 220627 -294050 31068 -256640 89514 -76077
12412 126738 12760 33466 -208043 253641 214279 85061 137039 -38214 76346 197612 133579
12401 133579 -212909 23371 -201522 -261245 73603 28316 29538 470078 81550 -126099 -266186
12390 -266186 193790 201199 210089 89654 -107704 205802 -60684 -264374 -78781 88631 -218832
12378 -115690 -65520 36188 -68901 15662 96989 -22368 -77910 -132524 -151854 -14925 120830
12366 127292 51156 110061 -73598 -49222 -252394 -82894 -123186 24325 -120869 -46595 -100673
12355 -100673 261836 39047 -98158 129974 122025 157297 154473 -97493 118227 208478 158317
12344 158317 62853 59830 -241664 -110706 -69056 -217908 -83014 -23847 187391 -111561 40611
12332 -5999 237121 98914 -197524 -36630 -217354 56902 211413 -302757 -6083 129422 250426
12321 250426 -25321 -218117 -4759 -157836 -9034 145969 -142300 72591 -162200 -60628 228304
12309 -43527 -321025 -60438 141351 201138 -188359 278217 67277 266401 88994 -74512 51361
12297 341714 -102668 -30861 -63792 190663 -189058 309847 58046 -129722 929 -62982 -95003
12286 -95003 -128738 -409364 28337 62645 206312 312440 137692 114530 186275 26648 -288319
12274 244089 221069 286017 -35599 235516 267398 -175140 100683 60066 205564 211279 348253
12263 348253 -33341 40326 182734 100393 -198180 -73478 78782 155947 292679 43508 -168795
12251 44963 67113 434836 12638 316593 -347 -75775 171984 178376 96898 -187748 56203
12239 137255 237955 400891 -148348 254118 108114 324545 150721 287934 75022 194290
12229 194290 399347 127992 91422 339503 267640 185913 208132 578392 307035 344136
12219 344136 139914 121110 556587 551869 136829 22614 277973 -29439 256228 4379 205051
12208 205051 -25025 -383057 158232 99297 57226 459844 212528 213928 151090 523776 61838
12196 147464 237284 392048 103308 262770 328039 121033 264875 110475 -56706 175822
12185 191079 -4216 -99583 -44335 97881 228732 16830 -187996 461688 402847 -51846 -69095
12174 -69095 368634 50970 90790 146904 99802 -90518 173725 162824 330952 120377 271978
12163 271978 138884 133098 -102993 -168218 -189385 118424 52775 -305768 15435 -329707 -76282
12151 26314 -107674 -34785 -283859 -120266 -87244 293703 336288 237270 -200324 93524 354024
12140 354024 -66543 128575 27475 51697 -102103 -200678 -380383 306047 82393 -97479 98331
12128 -284989 -263934 -43236 -23184 -187048 4074 -31914 -58787 389261 115138 -116482 -899
12116 264275 8775 74646 -138449 -180450 105289 87576 99218 142806 -118342 -103814 117698
12104 97317 53402 -171368 -62007 -246161 15805 -18476 151186 -55320 77605 -20716 -133763
12093 -133763 184413 591523 73880 -227238 184144 370659 68253 -67874 4278 -81999 -242523
12082 -242523 229373 119726 23721 105835 92825 53239 -81425 -87312 127954 -38815 -31939
12071 -31939 -156414 122764 -200832 10679 83396 -102066 -107063 -314716 13571 189753 90862
12059 58012 143839 541880 -16316 487055 1074124 1827127 1205820 331910 436034 232909
12049 232909 -53233 -108182 1857 -261922 182903 26306 72379 -20835 -355709 129711 305588
12038 305588 -99322 542259 -55850 -190653 -24999 -28873 272904 -147330 28196 46391 -40685
12026 -182877 130629 145542 -33693 -44222 -119016 -332475 59837 300878 -19977 114378 229176
12015 229176 20987 300592 -60796 -52536 -275810 -52768 152898 47759 259286 239657 154278
12004 154278 358921 -69403 229362 75822 -98348 70811 -146660 16302 -205145 253917
11993 -48425 -60629 -315549 19402 -207160 29881 104950 -4585 -200185 15851 365837 -194707
11981 119615 142898 -291647 -219119 17779 -187911 -62161 -202883 -98625 -383087 -146481
11970 -63949 580 103822 -259452 -131045 -135717 208114 179356 345018 -245165 -75712 171372
11958 22116 -172662 90498 68824 273213 -104986 75558 -13598 172027 115356 -26509 319585
11946 246816 84310 -301542 9083 -10006 -1442 -279112 187823 248239 -46386 -146929 63781
11934 19475 -311413 -166007 -80598 -438113 67317 103279 24838 320639 73188 62627 -289085
11922 -32169 -86985 -25273 122045 44815 -28084 -225229 285742 -533465 425172 -391408
11911 -456650 264039 -88443 174677 254786 191325 -210951 -144253 62206 -166072 -14071 201005
11899 -11397 -268458 -1969 -100498 116032 -159370 31394 171633 -67197 143305 -124517 54170
11887 13560 101728 312076 127115 112209 -192066 53768 49452 -37739 139719 -38720 3755
11875 23769 121967 203718 8051 -137240 -91477 -47145 -97101 233258 4772 -187285 229980
11863 75231 -129138 -279533 35430 -37096 -129527 -147142 -61092 -195465 62916 -44640 -269878
11852 -269878 -481544 -60114 -94381 254602 102516 -257786 -78460 -269585 12422 258325
11842 258325 60058 -6576 220295 19094 68732 -64813 300531 -94346 217892 105236 -91967
11830 32936 -4369 29051 174259 -314041 -9294 21648 -15957 -83752 21852 -275306 -139921
11819 -139921 432944 188205 -75106 166682 115882 3505 -212977 13279 130908 -79848 -103999
11808 -103999 37750 -526562 -29444 -21874 -676421 -96981 -170612 -58330 -42411 -77744 418028
11796 180164 -336728 -11790 222624 250314 -23032 192189 -171968 62767 9508 -65939 -344672
11785 -344672 -153912 229482 -105099 46453 -271704 -169949 -67315 -77471 71867 -115077
11774 -137489 109057 -165066 248103 73739 -176256 -33013 142437 -189739 5456 432547
11764 432547 27251 -32073 63066 -113318 -42216 69329 15830 110322 -160752 36917 -123319
11752 186212 198313 -220319 -204269 -87098 99414 9886 -260980 -190739 128754 101752 140497
11741 140497 -72358 -142310 -83778 -35887 260738 -81811 -50709 65081 -104221 -185454 -58267
11729 265548 125717 316990 266083 212566 114431 -103832 -181298 237046 185292 34374 -211393
11717 201891 45599 46491 219930 -188723 -13902 301983 4646 -238534 88553 86543 114042
11706 114042 119817 -158684 189016 125598 99598 -44489 21679 163850 228312 -287881 -80543
11694 -58794 306996 -66663 160444 -19131 120550 -237186 -80116 155017 315753 17277
11683 256844 -115155 -176456 -200557 -20812 -207081 21653 45441 30829 -127190 131685 223713
11672 223713 7546 -167218 86517 65692 330858 26014 -188872 134308 285495 106151
11661 181333 -9922 210401 41853 -75912 97865 -148242 257780 11105 -15202 190174 241632
11650 241632 323474 173935 -102153 -7521 118355 -219113 76661 -34573 -26971 137133 -535699
11638 47172 31042 -88683 123292 -140097 -31487 183376 -242275 4975 -83992 -138997 -63502
11626 107288 -117800 -75331 195745 330539 35531 373867 79078 38093 60408 -66401 170779
11614 21909 73125 -279340 220302 31022 -64577 240003 -195756 195011 -90023 75277 120852
11603 120852 -173008 382801 115162 102049 -12127 191272 172596 193340 -38103 221453
11592 89 -186715 48756 -57183 145554 236299 221736 219500 -89741 149045 182307 208210 422615
11580 422615 -65336 -80137 256079 -78534 39080 -26568 354215 98353 62488 -5694 103929
11568 -147819 -254137 -257701 57581 -10901 162110 190030 460996 298969 73024 102904 115516
11557 115516 219084 -68422 229734 42258 -77903 161227 228764 311392 -219304 -62452 -176259
11546 -176259 -97675 75534 83339 143543 -257270 268218 5666 68736 234366 -156049 37285
11534 197816 -63758 182198 128679 14217 287549 -78199 72789 -111197 55683 -136033 54414
11522 -235920 163680 147254 389315 4386 -139666 -281602 520924 122290 83465 111789
11512 111789 367271 365087 -139400 131753 188919 128691 62109 183725 284685 -90734 -128732
11501 -128732 67515 70160 -214361 166300 -284180 324625 478722 184018 124706 47388
11490 -259679 244856 186707 -5101 19411 -96491 152537 389357 -118172 88210 -107419 110389
11478 -57810 275844 189667 352112 183903 433484 -227085 107912 498654 29677 210918
11468 210918 -82567 4568 -50577 25725 420039 582743 374687 73587 -20486 212971 37707
11456 10460 -132764 114720 190107 339218 160631 23361 247143 185837 34421 234808
11446 234808 151397 136987 -77703 -131569 281637 81212 129839 287801 85186 177040 -38317
11434 115017 -121377 -171036 321054 40443 106946 -116433 165779 -261114 -1486 -227221
11424 -227221 254888 -46215 -39866 53011 126391 -234485 259631 16597 -192173 -244430 -89223
11412 -152658 223149 -72818 -3296 277583 443033 -154646 -74479 366082 -130890 212167
11401 122235 121164 40573 -155396 160911 47339 -223980 19203 62883 -284438 -253905 128880
11389 -148132 180623 37852 121885 -272028 -183876 146784 -291576 43345 -27648 94111 5769
11377 -286634 -79841 43981 -158650 -201237 -62446 80648 -344895 -55149 -125302 103162 325715
11366 325715 12881 -6015 158861 155747 6388 -169590 63563 159567 -380597 86887 293284
11355 293284 -289454 -489421 6080 41192 380619 -59816 13530 217666 69421 90440 -123171
11343 -50769 219695 380375 350330 -104070 68487 -69034 50975 -280793 -23029 -191437 296400
11331 -339652 -200374 -73354 -31670 207191 -153799 89697 -111629 -82314 -200903 -163324
11321 -163324 330305 -67472 196203 -338253 7729 -25383 304105 -175222 -9613 129694 251102
11310 251102 -41643 180548 -206503 72158 -198399 332788 221022 -48839 67836 120594
11300 120594 -391232 -368856 121072 2662 -320679 61320 -114811 254987 -54486 20819 -414643
11288 -13037 -47664 -117631 78496 335022 -111052 -57783 -184851 -231948 122850 -78653 143587
11276 -109262 -127186 -61813 -211186 -199733 188892 -471614 183957 -136912 -214692 15894
11265 354135 -41133 -148419 150428 -134160 -152109 19485 -220915 116619 202905 122055
11255 122055 -134803 190027 -83679 -53268 -230247 109811 -361935 19194 43571 168881
11245 168881 15152 -158529 -105328 6694 -307383 142459 -347013 133127 -206225 100457
11234 -300269 55020 -98919 -87615 -61665 201138 -265311 380883 92784 -18328 60677 70519
11223 70519 -91650 373014 -118841 -75461 -16910 -243742 -246427 -7397 -212959 -236473 102107
11211 -98667 -57671 189134 -406488 -309072 97236 285033 -155023 15707 -172452 19094 54012
11200 54012 -51347 212389 286260 187008 -68006 -164612 -66215 -131091 -206526 96772 -50066
11188 359722 -79482 -82 -147237 111505 -119843 -139332 -382095 143023 -258804 -184722 -205435
11177 -205435 -66801 18152 -237909 48676 65586 -59513 -160083 49025 -286148 -171864 197336
11165 73461 -55632 -16282 92733 245789 394211 -23659 -79707 292653 -24718 -16230 -370958
11154 -370958 10462 -107864 230671 370390 -22518 52847 -369396 -92978 -247903 -237763
11144 -237763 6043 143568 -95171 268888 54565 46654 790 97769 -86892 -80667 -242431 370872
11131 88008 19203 -228078 -253566 109721 39946 62226 165882 225136 315308 -303908 251857
11119 -151834 67400 246798 145089 80427 -41977 5277 -122427 14610 244486 156220 98486
11108 98486 -51983 450514 -81202 408564 309694 279988 133056 148858 195217 -60649 261398
11096 482981 -147204 127923 197926 292783 490686 211093 178362 166571 291377 2773 24901
11085 24901 231994 409270 470974 163921 15803 -146754 357953 336128 -70388 128910
11074 -25699 63999 464756 359966 292820 435953 518764 647711 428911 460927 794923
11064 794923 468663 471733 192929 339360 356797 596738 568868 910367 514934 472914
11054 472914 433037 1130867 777121 681348 679938 504461 843766 885333 719740 952017
11044 952017 432267 643560 757595 765424 770146 746230 872874 985493 440723 558150
11034 558150 732788 715931 851614 774516 765015 805064 1099373 674956 748904 629061 824565
11023 824565 710548 889488 728935 769345 746387 910830 752221 678566 819913 600897
11013 600897 506848 713245 756744 879142 962087 455591 571022 755714 725328 295985
11002 771299 771900 497693 537815 744156 543433 998256 769123 462705 836304 843905 839713
10991 839713 896009 889470 544724 783073 906026 1065154 1070525 1282407 1284024 1328331 1492449
10980 1492449 1351637 1330966 1780545 1805365 1985648 2179049 2825488 3148194 2782880 2946644
10970 2946644 3157618 2743844 2878271 2722904 2403713 2117124 1921393 1652898 1952494
10961 1952494 1797325 1601383 1858675 1654983 1832810 2045792 1556419 1596664 1442123 1553021
10951 1553021 1240037 849841 674712 565433 582491 162692 183752 194396 305935 188015
10941 188015 319687 95983 259877 238364 56729 374006 291379 91862 -171413 -71401 10676
10929 115738 285589 428335 29640 132791 190016 50826 21371 256424 213116 110011
10919 110011 39110 137633 -23555 -93613 15037 83545 -105357 -181430 325656 77339 -23629
10907 29637 11067 -494067 179825 -347421 10079 -393057 231200 65638 16602 115264 -247320
10895 -24353 -92120 23573 -3753 8758 -237365 -121561 -122420 153571 34565 -99896 -148871 -110472
10883 -110472 -30165 -327758 200967 -62457 -62518 -55224 19671 -444482 184001 -40867 127343
10871 -117311 -49732 40931 -262351 2167 196519 423929 -52549 81110 -124485 -315870 267220
10859 -97033 43935 -28995 -173533 -140965 -388013 273673 -203926 418495 -111317 -14863
10848 -41128 -63038 64870 -144625 -273211 -68842 -59483 -104111 -1414 -373290 280744 -10225
10836 73496 -145210 302851 281681 2540 -295983 -103132 27952 -181378 -121476 -105705 -90522
10825 -90522 -155720 93762 -181009 -28880 -244872 -86438 -24844 -128015 -19781 -89265 -111833
10814 -111833 59346 231879 -87264 47654 64900 -117204 151713 -59244 167046 58696 -109649
10802 267215 118481 305940 47054 -210403 121675 -41044 -237570 -134715 -279727 99549
10791 -135001 -147608 -172002 213780 90269 -339070 -28286 199365 -22807 -248416 -172355 -103205
10780 -103205 -284967 -81401 153675 -268978 -155810 -27026 -78703 -30090 -385036 -38599
10769 314572 -90372 -365814 -646306 34032 88520 97107 156952 -418958 329772 -112711 17089
10757 230981 -108576 72374 180561 -88365 50364 31099 12307 -26746 -104495 -257420 -245123
10746 -245123 177975 26376 52004 -103622 3167 -165075 44482 -63233 -163229 -180666 -139236
10735 -139236 -399937 -85662 305783 -242820 251797 -91648 109662 160244 -19865 -44789
10725 -44789 -110786 -161173 -457378 214623 -296116 -122736 -6392 -54811 -249777 -85152 377326
10713 170062 -63610 -169480 -215513 -109031 -41950 -294475 -156327 32903 -349396 8605 29695
10702 29695 2310 -184667 73058 -45221 40435 -34842 2787 382384 -171986 40609 -386 -22816
10690 -22816 144224 -210203 -560034 123512 -469803 -89583 -86927 -482669 -192632 59056
10679 100582 -231544 -129242 193536 133147 11641 -247964 -167028 -381717 127244 -99975
10668 199950 203048 -133752 47632 212086 -138913 74315 -94507 -159216 107755 117724 36707
10656 125573 74664 118 105548 82975 -112564 -47761 -148309 6507 -121132 248135 -132433
10644 -158055 51642 175027 111672 57267 -93749 108039 160201 -200999 -224670 71326 -475006
10632 -97028 149008 89482 19103 -404800 -31168 -426701 811 392553 -262197 -242756 -275227
10621 -275227 71508 -99534 -229142 -271151 59110 -86448 -310274 -8842 -21973 -46975 65 -421148
10608 -28377 -166253 -244330 48184 -75578 -400163 -343908 -176661 -12113 -17406 207766 -104260
10596 -138496 -288982 -208875 103190 97441 -310780 379735 332870 -235249 -83480 -16215 -145014
10585 -145014 -97122 -134914 -258147 -55531 1093 293006 61074 64620 -215029 6278 -296226
10573 -65873 19095 -363725 110536 48803 287315 191023 102322 102725 -61102 119923 -43157
10561 -7470 -245885 -136182 -297983 186357 -11005 76738 21280 103529 -33425 -60223 -208399
10550 -208399 -7657 -125103 137528 234214 -96316 -86284 4714 170231 55692 44968 257625
10539 257625 -255266 -1732 1179 -109906 2573 -281533 -23448 47377 238251 -3431 297599
10527 -42060 -106380 -279992 178558 -132024 -89313 180286 -83040 91147 372675 -66391 -108502
10516 -108502 -162995 105998 9238 485271 -189985 29273 14462 171956 59833 137293 -229507
10504 -325059 -250934 -134375 111487 225166 -272897 7610 147356 -127155 -43625 -12562
10493 317926 -68989 -228043 -157267 -175055 145987 -221698 -40154 237548 130205 143602
10483 143602 128673 422331 718899 506266 530149 476310 275067 -16872 48978 -165894
10472 16729 404457 307161 -161432 121714 -154573 223472 53556 -169513 -78348 -282012
10462 -282012 298691 -381901 287763 16458 48973 336708 -274277 -51575 -291956 -58622
10451 -350671 -34427 85232 49901 -53333 199020 -63306 5126 1426 -39458 -322161 198439
10439 -74541 222301 -228044 156480 -213072 142774 -309320 341151 -113308 176405 96554
10429 96554 -328297 22297 -40960 -12103 -198543 -271463 36854 -24312 -113211 255866 -72355
10417 250127 30839 -191551 198470 5204 157668 -261899 -26952 263841 116779 196143
10407 196143 65749 138544 -490463 273693 -157578 72085 -88315 62110 -286506 19973 -63839
10395 35702 200146 234211 -126782 557514 4945 93227 178432 394705 181719 419862 141746
10383 282510 345755 300227 -72889 53277 96591 -232603 285496 323971 94711 124739 302519
10372 302519 299173 345540 291326 365011 81074 532305 701990 451555 555922 294884 -96619
10360 260182 267776 36737 413062 272453 131094 176231 231839 418984 217434 669301
10350 669301 749023 462290 326949 396412 411795 256009 567229 436265 478964 288128
10340 288128 105951 352372 140976 312093 310674 9896 153749 138563 57179 441312 433825
10329 433825 498449 56079 151005 -28618 529524 -199010 -3073 109043 575296 322288 221934
10318 221934 331814 394565 189778 132031 -23128 -2367 25636 -268063 -84323 143813 66879
10306 226925 -188786 16015 -48055 5673 171589 -29144 -56808 -102276 8587 -54205 -356191
10295 -356191 -81856 -276925 381152 -436761 229906 244793 35796 43006 26544 128393 156878
10284 156878 89468 -403019 20582 -169730 -135929 -212961 -198771 -48080 326557 46374 -152310
10272 -314285 185120 10302 -275854 -109672 -124746 233442 -89247 161573 608095 174745
10261 160743 167687 489302 313353 289180 484525 -155797 175752 324924 136606 91924
10251 91924 185061 -91336 149143 -1847 -8766 -243077 -2817 -92581 204632 111786 123904 16644
10238 -57922 -115916 154965 -4404 -179206 -101127 76167 -110102 -124100 -139231 80292 -179032
10226 -29159 -102189 112323 -188556 -45232 -325546 -99985 13915 55283 -348452 48334 -190760
10214 209696 -321787 96627 269855 -50837 40192 -73316 86719 -288949 -57294 39032 32303
10203 32303 -113136 -103717 41004 91000 84627 -220972 -87614 431969 -367864 -14890 -271607
10192 -271607 -56485 -157514 -16225 91590 -319833 -67055 46252 -191711 415098 218890
10182 218890 -132878 175420 164643 -51283 -100208 -411145 -54951 -10196 92466 147118 -203909
10170 -241878 -199152 16851 229318 -147818 -232374 -45762 -70053 68959 -2712 -117168 -163732
10159 -163732 209154 90983 -6811 -125342 49426 -123098 169676 -97053 95733 119416 -152129
10147 -24827 -397413 104647 -316425 -15131 98560 400520 -76215 140601 -230714 -81487
10136 -147813 -192780 -290374 -315046 60815 7223 102670 -45480 -173252 97202 -147416 26242
10124 -120740 -376589 -49230 -155036 32564 -114064 -165765 6859 61998 416295 -116894 88846
10112 -51272 74596 -103105 -498191 295780 10888 -23247 6871 19688 22138 -107167 -266166
10101 -266166 49779 -133174 -144263 -102475 -418703 247122 -188008 5996 325931 -140541
10090 51726 88631 67959 -137993 -897 100721 47242 -389072 -68498 -267242 27170 -15190
10078 29475 25879 -224924 170958 -48066 -153240 67265 320298 180964 79044 -195987 22798
10066 -389134 137939 -173753 261359 56896 -239936 -72338 -181977 48643 29343 -304545
10055 -194219 47644 -239475 -318092 188885 178697 -143726 -43318 170001 -96969 -207334
10045 -207334 -124094 95322 111333 5162 -167204 -261263 -38020 -33235 -125421 236573 178987
10034 178987 -110529 47701 -74647 15947 -192402 -159287 -263889 147784 -181284 -155304
10024 -155304 135689 -236006 -1653 70280 136198 -44319 -168643 101022 -222204 -21587 24479
10012 126738 -102692 15555 125327 -175554 6045 -84679 -192478 -392618 -306039 -186972
10002 -186972 37880 -223095 -263199 -179615 -42759 -31881 215910 73211 81993 -21813 -12982
9991 -12982 -64641 -46163 -74803 -261264 241568 -25843 -1832 -120371 194910 107202 -228552
9979 127995 -312430 116395 69535 323031 -76516 185646 66090 -181896 -161029 127708
9968 207313 -201988 41257 261508 244188 -135530 2118 -144019 -130351 104772 -108825 298698
9956 37141 -206810 -123075 -217294 -398344 209603 -168519 -201330 -151777 -70557 28527 -48599
9944 99884 33292 -140451 -245446 -197058 -24420 -594346 -8256 -330325 46425 27021 23535
9933 23535 8256 -107881 98732 62189 -328281 -147655 59023 -217315 66392 -320872 -32282
9921 -80672 147472 106078 -21252 -287581 91365 -70200 -110515 -46170 247 5685 -73529 -130239
9909 -130239 -241039 324649 340 -425 -310696 -17526 211374 -63255 -338137 -201554 -175343
9898 -175343 193241 -133914 -14408 -246830 75964 233999 -404017 9160 282452 -50419 -70547
9887 -70547 -38557 -48232 -304379 -110471 -114307 -22977 -45678 282114 -87206 -75019 -194415
9876 -194415 127233 8238 -198087 -164439 -7943 235147 31902 -87897 -257287 209398 -211066
9864 -182319 -319020 -391019 -48563 -303421 56806 -138189 -206247 131980 -60748 -259632 -104384
9852 -271074 -136467 61926 -95058 201262 -252595 -51462 -459312 -464627 -145252 -12004 77853
9840 -156221 7772 -110951 87281 277009 -102625 -227936 -288205 -130363 -129509 -181960 -82187
9828 -72799 -257171 -41054 -136081 -40379 -38402 -233882 380033 -207544 -17286 -66009 -261543
9817 -261543 -214772 -60439 -14093 -40909 39381 -11284 128223 198653 -10364 -122158 -40021
9805 -140205 -59254 4451 -21138 -125657 -158794 -32950 -385574 170627 -358905 -77832 -115513
9794 -115513 31258 -142912 -438042 -374137 -90772 -435373 -217578 -22857 216380 64174 -137105
9782 170509 110410 -23643 195040 424789 -24842 -257333 219922 21991 -125963 168597
9771 -54544 166867 -14003 -113609 -108372 -174296 -208723 274255 206930 -82543 128365 261682
9760 261682 134017 -27955 143793 -104209 139505 -63155 -64004 -347338 -284653 -59302 -114606
9749 -114606 15175 -162308 -434105 -123540 -113601 10511 226498 -219282 -213979 92122 -286698
9737 -168858 -342298 -592030 -295317 -261261 -91672 196373 -79182 -271203 76954 -310672
9726 -225238 -159466 48465 -19884 -181034 68889 111794 226240 -106393 -30431 118138 17286
9714 93571 -219682 -306210 142239 263154 149928 -193206 -116393 126325 -187140 161229
9703 166142 128832 82485 -146746 -289601 278982 -41819 -256482 8590 -46609 -57625 170213
9691 103644 -23571 93009 -66373 323742 -170914 -163158 -52913 -287955 49721 81952 46111
9680 46111 -583308 -168122 28250 79445 13134 -85146 266629 61816 26655 -33382 -316583
9669 -316583 -188249 -62293 48467 229673 -93461 -369225 13904 -31973 121880 5157 -55763
9657 -351548 147813 33018 -296798 -189792 -17808 -204428 7339 -126455 69844 -317441 146124
9645 175575 -119517 272938 -11057 48599 -95506 -42762 149175 73546 -95815 -14447 -81538
9634 -81538 184228 -168628 -173273 -82947 -52758 23310 -10995 -328928 40276 -64306 -150957
9623 -150957 2072 -102990 207707 -123376 -69349 472965 146332 -240221 -277313 -274155 -41175
9611 114827 -312390 213051 -82789 -169276 157788 -36842 -300973 40466 -230051 -45859 -190532
9600 -190532 -128909 108168 -95968 106490 -165900 -72277 -34306 -163827 -94231 -255832 29502
9588 -137887 145378 290370 -253279 -315105 181798 -135067 196871 -60754 -47334 162873
9577 -106609 45251 -75845 -246148 -286905 -116169 -60801 172843 167518 -175623 -100930 -247826
9566 -247826 -297119 -241392 -167539 91344 -145070 -167400 4775 -72595 -42819 -152388 -4877 -135604
9554 -135604 -113608 -103069 36416 -8595 -219738 -106298 452502 -54720 -360543 84887 -379998
9542 -175101 -188056 -44197 24431 14608 34396 137874 -131865 170962 -252359 12286 -207338
9530 292916 14748 26525 -233198 79217 93890 -217544 -101579 111889 -249611 -353694
9520 -353694 -140756 54333 -403993 55082 895 -150195 -57137 163782 -117888 47109 -335411
9508 92992 -329573 -97461 -197791 -57541 -105923 -95223 11126 -54090 -217876 139136 24169
9496 -78464 -272117 -8775 -503183 71233 -246822 -318091 -19253 221995 4521 -147652 18391
9484 195660 -217475 330040 72351 -73934 -247986 -203562 -170498 -35227 120339 14142 -289998
9472 -49651 -187079 -116494 73539 151655 -172624 54555 9974 125748 -8527 2675 146705 4950
9459 -14538 -67182 -169313 -40456 11179 41106 -15368 -190878 -250087 -110126 -438262 -199764
9447 5196 -98792 -331632 -46533 -11213 -337390 -213539 -284515 -61665 -112547 -98821 -67792
9436 -67792 -119685 315872 15262 168281 83905 19466 -52647 -112644 274266 131139 -147445
9424 -152682 6603 -90580 -35737 -446248 -184142 113662 33953 216075 -368440 221661 355181
9413 355181 -186594 -287893 207447 -43621 43588 -179676 -225287 -159846 -206398 183003 -206952
9401 -156109 -230394 -42644 -57730 -335690 138816 280709 -4976 -185554 -246046 -209010 -177386
9390 -177386 -15372 -88752 -145536 206625 194890 -258858 132528 -101821 -132392 -122597 117893
9378 89741 -178652 214917 -222800 -79910 165182 66679 63761 -68237 -257801 -88958 -161625
9367 -161625 -361601 194361 -289319 -153489 10001 -2029 277460 -65374 -176244 -329667
9357 -329667 26307 201037 -145000 -88502 213139 136538 65511 -151437 8575 55645 43831
9346 43831 -252450 95880 -37963 41158 132815 -291599 -152195 -350814 -229270 -19732 16598
9334 5581 4300 -184565 -84663 127951 64977 -29909 -95879 118835 404343 106968 49140
9322 75881 -37662 -162454 129333 6692 -255268 -102153 175607 -236186 -325506 -291681 -261023
9311 -261023 80574 -280768 -164738 95439 25590 -34736 251818 313385 -293516 17803 -43262
9299 -119209 -290185 -162413 -281479 -165191 -234041 27467 -339809 -171227 12682 -62248
9288 -172364 -180381 -157555 183015 -417652 -177042 -345851 -91796 -228552 102859 -145935
9277 -328749 154214 10051 -227751 -117544 265113 104153 -137919 114726 -239048 153635
9266 140721 -71418 -278817 146144 -52773 -128091 -58820 -91413 -244684 -107078 -99250 -103246
9255 -103246 -110753 -37084 -68433 -111739 236656 -31186 198781 88600 -134694 -209858 77 -160521
9242 225903 198385 -43617 -362998 -241954 -310689 87268 303491 43697 -387229 328571 -143803
9230 101022 -108581 62358 -136585 -40289 177643 -8464 100060 -36894 -131782 -110973 -64100
9219 -64100 -174505 110078 -135572 -122186 169377 -187690 -93319 -202938 -39439 -378711
9209 -378711 68884 -192113 37894 -295230 -96826 -46541 -427043 139055 -96788 501641 -355453
9197 -232362 217465 102519 33806 -49719 28432 162879 144897 -47817 293690 -369501 11038
9185 -285339 -102898 -357646 -42874 -159090 -35742 -362225 -6232 -257122 -88904 -58749 -146477
9174 -146477 -19716 -335543 71404 -266890 -2439 79977 -242009 336304 104340 127067 9639
9162 -227428 60232 -194736 -28383 -16548 108901 -73212 95265 151515 139455 -43804 178580
9150 177193 -16649 -216524 171646 38625 -180137 56014 -79676 74162 -57422 -213470 -378941
9139 -378941 -106034 -120695 122830 -68505 -421746 61716 -120622 109827 -30579 -362700
9129 -362700 -54643 -75232 -119583 -189972 -110954 -64699 -153321 -14669 312521 16084 89907
9118 89907 411987 -138680 -65616 -47878 65654 307604 -363227 -82079 -168742 211790 -370165
9106 -202157 -57314 214982 -238275 171253 -31289 -436035 -82333 -180585 -104313 -363276 197370
9094 -99569 152997 120777 -118672 -15550 -94246 -251923 -45936 -23710 -165365 -37008 -271106
9083 -271106 -73497 -120493 186712 -90278 -67984 -322998 -63348 -121522 254325 210011 -370874
9071 -214205 227 -187619 323753 44485 7946 88784 86045 53304 -176259 -182182 -261075 -244221
9059 -244221 -418704 -148608 300326 57364 135743 -155837 -176073 72460 -508919 -136151
9048 119366 -194939 -33568 75166 -44664 22957 151782 -37934 -176034 -161687 -143270 166731
9036 112633 -78036 14110 93374 -93299 67130 -169614 205074 -140850 -201743 130989 -161092
9024 19883 -139315 -79824 -9982 -154606 -147913 -89446 24873 -334021 -188710 -92657 -385522
9013 -385522 -317497 58572 68236 2176 -100470 182441 118016 -145113 -373119 212946 -83302
9001 22514 164299 -166660 -119788 141323 23839 212480 -111754 -89106 -247235 -170289 -57738
8989 67595 -111439 -504136 77740 12148 -27476 142326 -34860 -4679 -24483 -144007 -119785
8978 -119785 398260 -93107 -35017 306232 -43479 8895 -32307 21217 -232226 -261068 68772
8966 -53984 -320324 -31583 -258365 -162756 913 94719 -5909 -147802 -362900 -439635 54439 -138452
8953 -68910 40537 -150587 -221166 -53848 -66159 -319898 44009 49453 -57404 -71008 212169
8941 -95171 -172404 -14309 -47323 167156 22611 -58939 327289 606916 84965 207549 161334
8930 161334 80719 597413 276183 156399 263410 1745227 2977792 7721651 17090367
8921 17090367 11373974 3745762 1376304 1091362 449105 394797 525054 -316191 135164
8911 -127065 -212026 9922 201527 -70710 126669 -102469 -178721 -170360 -79180 -196787 48856
8899 44353 2686 32777 -174860 125382 -115413 -270142 174693 -169346 -33513 66258 -200465
8887 -111380 -16683 -30640 -314685 62790 55146 -24182 176498 474396 126690 -170893 -36094
8875 -26560 -333495 -288748 -356340 -60341 -19035 122962 -93350 -342029 183850 55250 -101425
8863 198679 13624 -121887 -135529 -261607 -99633 -125478 115173 290351 -119109 306 -207350
8851 -204870 -197397 228005 -482554 162577 -46137 126851 -63170 180661 -464164 -437328 -166049
8839 -309217 46874 -328534 -205096 -138935 -12481 -199851 68733 -38514 16355 -43845 329954
8827 282582 122291 -391116 1522 295339 198387 242403 -243220 42886 -284198 213878 8247
8815 -173472 4833 -200443 48943 72847 -53268 35959 -169209 -210353 -157662 -207163 54301
8803 -95491 203270 96213 -411696 58276 112217 -166613 -151833 231428 -283782 -124643 332664
8791 -5451 -52794 -171821 46619 -300787 138925 183028 85017 -95627 208911 -170578 57236
8779 116145 -176977 -28243 -145327 -15575 -344565 19 -58404 -64037 238487 545348 -449559
8767 -291925 -224250 -74316 69198 17785 59623 -105234 -42534 36111 -323074 -95151 69631
8755 69996 -69653 -57290 -202110 -426337 -49609 79311 44304 -9475 -101620 -521600 -34906
8743 -147799 -477454 -55319 -167905 -147887 -137455 137200 55004 115702 360151 84178 -302555
8731 -85961 78653 -453373 131982 52525 -41651 -69252 -80228 -33082 -134922 -188000 62035
8719 368472 -82371 -204065 39717 -81505 -316309 -306078 -321687 52523 -132223 93717 -249572
8707 -34986 -53948 -294362 321612 -82759 85490 -1470 -421293 53495 219261 -239103 -22366
8695 74796 140033 150487 142025 -22500 -87973 -104548 133196 -233593 82450 -217598 -2242 -18940
8683 -18940 52814 -196430 185590 69446 -241530 -30053 -279278 61957 -53024 -176467 -259617
8672 -259617 -210352 -101129 -249019 38922 -243471 -77202 27247 2112 149699 -102814 34087
8660 -209073 139160 -18797 38962 -45811 -274375 -173041 -149020 35364 -139065 -165375 -138978
8649 -138978 319261 -217517 23498 -206832 -148058 109897 -78101 -217453 -84287 144567
8638 -58647 -437126 -18124 14213 255525 -121659 213681 -336805 172520 -379465 193336
8627 230371 -253905 -279635 -272252 -132775 -160233 -161839 -79742 54145 51145 -106651 39161 64259
8615 64259 -15282 205876 -75419 -23403 58888 43937 -332176 108600 -224890 -116451 -102628
8604 -102628 391128 74975 -31578 -11668 -100085 -299297 53025 8294 39690 287061 -221428
8592 -232792 39766 55887 -202028 -216353 491760 -161577 -342729 104969 -78561 188242
8581 -20113 -131909 -7617 -13763 27725 -128696 245422 96808 209518 -19645 -319417 -238451
8570 -238451 258950 9148 -288170 -269857 -96424 -113125 313543 309899 -248477 11033 409248
8559 409248 -143527 -108408 -4063 -73039 254167 -181400 -31436 50379 -270064 -104268 240822
8547 20701 -323434 93405 -270642 -102076 -126989 -193906 19140 -140886 73318 -4506 -73069
8536 -73069 -158372 -166884 -81006 -77092 -239157 109041 -155131 -317546 -29423 -29496 -178393 82526
8523 -67489 -113271 23859 -160144 185502 219065 -110750 50142 -72116 13290 -30091 -50927
8512 -50927 -116448 -7701 197727 -144555 -119895 -29766 -75534 -1647 172910 -280765 -294488
8501 -294488 -190593 -279136 -294459 -138507 -189577 -7754 -104938 35846 -17257 -246053 60904
8489 271950 205859 -78980 -123150 87267 138862 157033 58245 -254346 173200 62609 -80444
8477 -248372 -465483 -443924 -33939 -65181 142245 -146825 90452 -167911 -301671 -182318
8467 -182318 21867 36260 131677 37322 -291817 -105232 -186572 28263 -3935 22521 -6406 -69203
8455 -69203 1195 123056 248039 -207449 -379433 -101964 -56140 149609 -21031 -652813 -63568
8443 -211573 -25716 -136043 31788 40170 -118240 136591 -224693 -28473 -70976 -10979 -217880
8432 -217880 -307975 99275 -79217 74403 -120474 129860 -239094 -188967 -224775 127681 -348697
8420 -68170 -80616 -174469 -72253 -73188 79860 108910 -162968 -88782 243230 85803 -219011 43619
8407 79543 -328042 -198400 -88443 209777 213214 23848 -76816 -83964 -13237 102919 -49878
8395 -204295 -133602 -149057 -124798 30219 -263825 294313 -63181 -30577 18081 73815 300649
8384 300649 -106523 -63933 -94183 -59534 7795 100998 221979 70157 101828 -176916 128456
8372 -315554 -129933 -364436 -8384 -68158 -36216 -387129 18127 166087 -87303 90081 -159955
8360 194533 -244267 -100778 161030 255993 -336032 -10893 353701 99555 158986 171742 89121
8349 89121 -51875 -137532 -428377 -192048 -113627 -74039 -103269 107652 186045 90057 -212810
8337 -220524 123008 -185021 380862 -42026 74717 44108 -117501 -364897 151816 57026
8326 171073 -268810 165024 -1029 304954 -2592 -68730 -117779 111620 -155387 -346283 112669
8314 35334 32585 -100693 -57940 98524 32915 64841 101375 286094 -243375 -38115 -275182
8303 -275182 -132341 -58939 -209357 -246418 5575 -12124 334390 -203412 -231560 69496 -131311
8291 -40975 -21105 -338260 -50089 330610 -23274 -14223 -207920 -44147 -99423 237158 -150653
8279 145286 16844 -150847 -18210 -100568 -207855 -148116 -72045 109016 119067 310666 7439
8267 -143545 -91265 18397 -31066 -331473 -169672 -198317 59525 263629 -263989 -115713 147451
8255 70819 133937 -1454 -69863 -28809 -158831 72551 -282646 110024 -122352 -266666 -88704
8243 -125093 -123894 142182 47748 -222481 260732 -317537 -163237 -22740 -222949 114633
8232 117159 -173079 51822 -468982 -59331 -210297 95293 -204269 -172557 292742 10579 81159
8221 81159 -212442 -142020 386389 159618 229506 -4362 2028 -239102 21341 -152112 139293
8209 69618 176255 3896 -345561 -355132 -176630 -218709 8030 -21622 -275987 19012 -196617
8197 -180945 -193640 132454 -75922 -246924 -249336 -30863 -52717 53076 -74939 -383696 122880
8185 219341 95228 -112520 -134529 342662 26992 -157469 -74336 4521 222397 61988 55830
8174 55830 -58778 284276 -153451 -24360 -170573 58031 28805 -13743 -345679 117682 -39075
8162 120130 -6568 5863 -60243 -148546 -196346 -55568 5106 34763 -134537 -309183 -273735 40195
8149 -6223 -120699 -181761 129861 176239 -170211 -63074 38251 -175516 -89609 339627 -708
8137 -241098 -90815 -82902 -20972 -321990 -317825 -140926 -272347 -235575 309857 -18542 -108790
8126 -108790 -49586 -122704 -103420 -238567 192775 -191258 -164211 -701 -29011 105478 261372
8115 261372 129988 130922 -273061 259130 -23988 289746 -365986 -123679 -78733 119855 445957
8104 445957 104919 -4165 -263306 -221694 207079 -461675 -192589 -369551 511283 88094
8093 117633 -157684 143795 -11993 -110891 -43964 258218 121416 140398 -330062 -94442 99915
8081 -215096 228398 108767 -58180 106144 -62890 5309 27103 202616 96559 55003 104158
8070 104158 -134593 147703 266189 -8471 -117457 -264040 45546 185144 -243226 15503
8059 154045 -62079 -209773 -18696 43925 -62824 -155823 -30929 14613 -471279 -216531 216567
8047 130894 -131906 -242214 237073 44656 -68105 -179068 98464 152839 316637 166002
8037 166002 342052 214124 1372 323135 -223689 16299 -374775 94049 133857 -100753 -253186
8026 -253186 -168534 2564 -36686 -42758 -100671 -216954 146051 88565 -380099 136847 206554
8015 206554 -33930 -25204 -153231 -41255 -345428 -87627 -203979 24803 198471 165335 246241
8004 246241 24979 -82148 192373 399249 279241 -110472 -7651 153287 -124699 -337058
7994 -337058 157690 -237952 -205827 -578004 226381 -33685 -42416 -419627 -24609 -269197 -294233
7983 -294233 -178578 188828 -105973 428685 481696 -132466 -155133 -284819 -271975 9581 166550
7972 166550 417925 -46140 -129536 -92474 99584 78933 -34456 -158322 158613 72015 26089
7960 289276 16441 -57444 -273622 54437 -121027 -35104 70826 -73277 153250 20023 -302502
7948 -281375 -10213 -202202 -247024 71431 118163 -518992 -54243 -304128 -91720 122905 119326
7937 119326 -344507 39545 -255730 40115 214150 -251772 -19845 -434612 -59485 119864
7926 270384 -5486 -348196 157943 -67819 112008 -248049 -32700 -281303 -6892 -286164 -146267
7915 -146267 77475 -184606 35258 -345340 -61726 214033 135111 49185 -267330 -47416 -83738
7904 -83738 172036 124799 -193850 127369 -206038 87344 -72743 -163603 198206 -78977 -58273
7893 -58273 72529 382973 -326860 -119761 -215612 56533 104489 -109701 53809 -185438 128162
7881 -11398 69520 -75406 -228537 460199 -344467 -91499 -44539 -125622 -211908 204854 255307
7870 255307 120071 19717 -357877 -120796 -428717 -98083 -66362 -197862 69903 32827 -17442
7858 -161788 -286507 248583 102145 -146378 -191956 -64958 -11898 41668 -52831 -174475 122460
7846 -17505 -99464 262004 -242403 199006 95395 -293859 -408033 -163689 -98078 197551
7835 -45993 14544 -68081 -107064 -21573 205320 -276243 315994 -154319 -94671 43979 -413468
7823 30826 -166727 -173765 197315 9454 -322255 -60491 -90225 65712 127673 160972 48435 -108622
7810 -76331 18090 -293243 -59207 96512 21616 325201 -165923 -243520 -370297 -305841 -147327
7798 -153468 -211053 79827 -51890 -265030 -26407 -97779 -265311 239754 182040 92782 43733
7786 48003 29098 -214810 -136597 -33838 -49292 73663 285339 -64184 -230112 39830 -204868
7774 -8802 184822 -88268 -18517 137280 -99795 -87915 -149595 115505 201967 61960 27461
7762 136133 67123 160340 77774 -221119 5717 -88504 146478 -373306 177132 135599 5699
7750 155785 255630 -344206 136617 234409 -404446 -47941 46045 -38066 -256403 -109384 -160694
7739 -160694 -3683 -86862 -50657 -31216 -110880 -130833 -36556 235311 -192232 -64242 -19856
7727 32307 197058 500 -48318 -269687 -71480 -65830 -118883 -35296 31740 111087 -33550 63721
7714 -58880 386404 -234161 -179317 76483 113792 -170771 -136375 -70136 -11488 -68299 -126515
7703 -126515 -20931 -51200 -103688 304776 83647 360893 -20552 -196240 -60501 -226298 182656
7691 125184 -229832 181306 -147293 182528 -14193 -50974 65889 143630 93380 -334827 34027
7679 -15609 163753 -174869 80483 79441 -103002 197707 -316618 82098 -138511 -35690 508999
7667 66013 -252728 12803 -245748 -180417 -246852 -81787 -34524 234018 -26699 20243 -30642
7655 6741 -248994 -208945 -229587 -200647 26203 -216645 -82317 30436 -82497 39816 -242368
7643 89585 -296313 142836 -268547 -48608 219270 111079 24707 107259 -136948 233329
7632 -122341 347154 -447371 272316 -75539 -44771 -118278 387122 -242950 -335227 33857 2763
7620 -27825 230072 -125435 -294651 -177760 -38981 313259 81384 41193 6608 -145656 41750
7608 -307023 71094 12012 -354661 -550533 68416 18074 -172700 -119635 238955 -197890 -82247
7596 -127429 -415156 -356979 -108320 -279465 -139127 -64172 -122995 109646 -10679 309472
7585 -334112 303935 312012 -108927 -80485 -175347 217408 113288 -306918 -458700 266028
7574 -185435 -3790 -202662 -37622 -57021 265197 86862 -170915 -72799 -67599 4361 -162367
7562 45638 145296 -140052 323299 -19077 -226896 -532323 -83686 104654 303638 337978 36604
7550 -166378 260993 100932 -229560 88884 -190705 42845 12369 -54194 8365 -229192 -81068
7538 -218586 -182356 -199795 477057 -281173 -267468 -339460 -195224 145105 -290428 -69830 199180
7526 76053 -319560 -91549 -53132 -10378 -17078 377314 -129110 292220 26427 -388082 -315316
7515 -315316 86542 58892 -61857 18361 222227 79427 203807 -92001 -8159 -138711 -256128
7504 -256128 139595 -102213 109619 43834 -145987 -171614 140820 -47602 131732 -146750
7493 124958 144624 51912 133508 -103037 -161655 -96192 -428134 -246594 -269213 -3709 -22961
7482 -22961 225319 25982 -211153 224624 -40271 -228573 98113 73829 -63758 -47034 -75045
7471 -75045 179399 -159732 32397 212105 -160180 171132 -3761 35181 -21818 132915 -32139
7459 -390 95974 -5786 147673 258188 81945 -295043 181578 256805 283299 -246700 -31862
7447 -305706 -155778 -70643 -256396 178287 71938 -142536 83223 41712 -245110 34845 -81332
7435 44008 -601150 -129534 -95802 -61081 -11915 -38855 -136697 -12259 -37389 -207249 87005
7423 58896 89158 48478 -324244 -205372 197373 142761 -7300 -216104 -52249 -112888 25632
7411 167930 -2523 246515 76889 -33656 53929 21468 24097 -14499 -50850 -302369 13365 127519
7399 127519 -156936 -10935 -53246 -34476 194711 -131214 -91410 166122 -43269 -10012 -26539
7388 -26539 -186952 -51215 58580 2776 192158 364973 -112826 81477 103177 -94753 -363723
7377 -363723 101330 -161221 62774 128537 -328726 124183 -150075 -360086 -58665 -171879
7367 -171879 -75196 72947 -450957 -16248 -203768 41109 -95115 18415 181306 64437 108400
7356 108400 -68096 51511 -206846 32985 -81277 16791 -32965 -461968 21003 104051 -268002
7344 -152366 47426 -255175 -55517 -185845 -174989 -342221 -148850 170170 -366618 267653
7333 2574 78944 -234823 -67893 -40221 81524 -136327 -81358 -135650 -5745 -174493 -314025
7322 -314025 78275 -140023 -213578 -219763 223802 -182274 -109217 -259480 392514 177503 -25014
7310 -222765 -541735 -177869 -235306 -79341 -59990 129787 -41978 103835 85961 -199868 -256878
7299 -256878 183975 142452 -154514 68553 109111 34501 -151026 135423 -263333 -107206
7288 55803 -314348 -115501 -314589 144687 281062 -1555 201773 -241856 -330761 235671
7277 83820 21362 -239110 284828 68057 54561 -107109 10060 -56258 -343744 31554 -24977
7265 -283772 104221 38703 229310 101188 113912 -103381 -206769 -117686 -313137 211105
7254 98381 210047 158211 -158138 204274 64893 326462 -135834 -445257 -187553 319324
7243 314309 -400437 -944 -87141 -73184 -164689 1454 -10386 68757 -19318 -136908 135291 259948
7231 259948 -94415 -2567 56990 -42744 302143 -87880 -55872 -66112 -69110 -489431 114618
7219 -17734 237853 151250 -311640 -124141 94273 15464 39398 166763 -103408 -2654 67955
7207 80025 -142656 16858 -16860 -308409 259111 59325 94784 -16006 56501 -292519 -278509
7196 -278509 118542 44738 30608 149306 348678 73546 278527 -70968 -354853 44850 239260
7185 239260 -289926 -259114 156995 160949 -220877 -89617 -15350 -309877 -255283 79905 -93965
7173 -103802 445548 80420 -27054 -295901 -15339 -171881 -223437 161084 -42190 -486467 153123
7161 -285372 -121647 -420425 -59893 33254 -111511 83389 -171493 -172870 -51193 97133 -136671
7149 -66999 75424 -164811 -10140 -136609 88097 -258069 99231 227673 -37038 -205169 -169288
7138 -169288 220634 209966 -179006 168679 356720 23565 -133841 439730 -35228 -310972
7128 -310972 -245303 -102747 -111227 371592 -79609 -125327 141993 62809 -122218 -273449 -215759
7117 -215759 -75073 -29356 -149403 -26191 -66565 155294 -126394 243273 2590 41063 293000
7106 293000 -288981 137982 1852 945 -9962 -210645 -41488 -67541 50677 36975 2144 75305
7094 75305 35973 -61870 -110473 -177597 -155902 68486 -172785 104540 231297 19944 -256230
7082 223992 64117 -30826 -1543 -38538 -215101 -9030 145084 -137592 -25243 -185904 55150
7070 319514 178455 -47556 42082 81522 -51139 -175517 -131127 -108068 250825 -46545 233239
7058 -142712 -358594 52193 15912 133120 -164052 143604 239214 149162 96333 -209687 -278446
7047 -278446 -63137 -191699 209648 -158667 -190558 -302704 -58875 -248457 51389 -6379 307005
7035 280900 62202 -73946 -295193 38059 58533 -35295 -167737 -251874 232978 169657 -55833
7023 -10773 -156974 -90329 -221962 -249718 191408 273727 202462 -22999 -247270 -132463 244247
7011 -126682 -194873 -57502 -62771 99094 -329593 -292463 -31038 81743 -2529 -308648 -328353 -118012
6998 -116181 285873 -84638 -140142 -12289 -57078 -506216 -243246 -283960 20977 -142511 -124407
6987 -124407 176470 24634 73267 87009 196030 373160 27163 162806 34899 280635 226005
6976 226005 235137 -122442 -160567 -217941 -136702 -474716 158747 61899 134890 -143 -237527
6965 -237527 93376 205477 -131096 -124779 43169 -143412 102378 -33377 54341 138727 95420
6954 95420 286372 -86495 166168 45199 -144926 -175892 -31584 -175106 9634 247395 -274418
6942 189352 -198206 35004 -30781 210643 60800 930 268781 233 -182234 -307406 -134283
6930 65867 -217679 -41999 -91622 -350823 -157054 75561 255388 -277324 -387392 -252250
6920 -252250 12672 -35613 -4825 -228479 69116 -92991 -55462 -32178 136095 -73698 265069
6908 -358205 -37941 -40785 -160726 224411 177542 -76937 -195628 88374 -103172 -12442 -369548
6897 -369548 -169783 150294 -239036 -41133 85806 -20021 -53406 116472 -374832 -138757
6886 129456 -259488 -119185 262871 118497 31841 66064 -153031 -272655 -184090 221580
6875 -60946 131289 -22040 -83662 206792 127645 79162 -59560 -19309 148083 44241 -133896
6863 -288132 -134938 187561 26057 -196578 -296308 108538 -427474 162338 32045 222519
6853 222519 -61051 -161094 294218 114097 -31241 32039 432130 -333593 298334 -187616
6842 457948 19712 56245 -15353 -63590 -136851 -27108 47989 112354 -248750 409460 226518
6831 226518 49227 204698 -215920 95997 121271 -3253 -71599 101467 93849 -123408 -79190
6820 -79190 101028 -86353 -392635 -284611 358172 -239277 3632 69337 -167470 66635 326513
6809 326513 -75445 85556 -260439 -60178 23747 -155596 108448 -375531 141114 -137984
6798 133359 -192713 16364 55853 -426609 -23425 -234698 -30108 -165356 -29805 -237015 -143055
6787 -143055 19867 51145 -93134 107615 145250 -15751 -425257 102727 256902 -313358 -215315
6776 -215315 85375 87140 231349 -85725 -5008 -246381 221481 120160 -378860 -30345 272902
6764 8365 51247 -308714 -270440 28929 -191554 -161976 102778 100673 28186 40132 139897 3643
6751 -196580 -103133 483056 25997 -142257 109546 308175 -57230 92052 -370356 35171 -31809
6739 200926 242618 -134606 278672 -43209 94630 -5 -18190 -137935 -119994 156514 -34594 -252792
6727 -252792 -246377 -198622 27125 -32657 37124 -108776 -439668 396560 -311877 -200162 -70017
6715 226314 213641 -17871 -184290 325461 201378 19217 -166056 -44156 -107075 143648 80897
6704 80897 -145558 201815 624 -58003 -112763 199570 -603 -162030 -191013 -123346 -145750 -20684
6691 -191698 -152318 112796 55388 -293699 84019 -135363 -15957 -101617 -173839 -63248 -185207
6680 -185207 -155292 50233 37619 6550 140504 57629 111419 -13792 213669 7939 22965 -91042
6667 -147342 32690 -108777 258786 -139406 154111 188586 289980 -63821 -17562 62608 -7813
6655 44946 -51451 221910 89855 -401198 -64158 168340 131934 193142 -38720 -28347 19360
6643 -193766 -13419 56305 30214 282699 -284510 -34803 228860 58404 61736 -286239 189081
6631 188048 -248298 67850 -208318 -21692 -102600 -57307 -42737 119791 -122255 49842 -91972
6619 34864 -124971 -158712 129111 -206932 205099 -92894 101625 58647 236174 11259 105512
6608 105512 298178 -168982 -173193 285215 -414179 59931 137189 62012 212703 259036 -189995
6596 232347 95313 -204720 -222697 -120533 -164570 -75050 367685 -31797 -40917 -334124 -131541
6584 27602 43752 -200902 -90727 104778 46173 -308920 -165057 -110354 -144903 -290 72109
6572 -306057 -43503 -72921 247714 95561 -211045 181598 -337093 12862 -9034 -207070 -185292
6561 -185292 98998 -195742 -289632 156851 182001 309861 137221 -251065 -48265 199124
6550 259691 94263 226047 -112049 -191529 -261225 -159469 -151999 105622 -284269 37408 21703
6539 21703 120089 -225730 328301 99597 -199410 48114 107625 16141 -137823 -124033 29871
6527 -36130 118042 10750 20196 -245841 -390303 -151343 -403812 245850 -128963 -28857 4408
6515 -306866 104424 155677 130434 -83014 -176732 116108 225247 5931 -139841 -154914 151361
6503 -57686 -88211 66302 -181778 236864 -197672 -65748 53634 206230 -220479 141803 -5171
6491 259191 -181382 -20522 277536 233348 -268146 -26305 -130279 -265705 -58081 -61179 -185561
6480 -185561 -239833 123814 -35886 -199141 189206 34663 -200928 -126687 227523 245257 -94809
6468 -85033 135354 -223326 304937 135747 87170 -222564 -160480 107466 -59039 137858
6457 -50904 211998 -379758 169763 -219920 272068 -14698 -237032 86756 205140 290344
6447 290344 104816 -950 29395 -329332 -53252 -243479 32030 12481 -17730 -108596 24300
6435 -20199 -215479 2920 -503049 10798 201059 -163163 -129383 -44016 -284686 481045 125066
6423 -140457 168466 -200961 353683 69900 322825 216496 -350264 83664 116640 -199372
6412 -60575 225194 -124590 -241198 67949 -306905 84603 -220357 -120374 199079 375912
6402 375912 -36780 127493 -197740 -195971 93228 42875 -136628 118113 -85800 34709 -149270
6390 -55456 -65441 4110 335888 144590 -221143 304738 -82290 4092 -124783 179339 2838
6378 -3618 50851 -422909 -44648 213789 -32558 -78538 83893 -267443 -53931 -350243 -131498
6366 -16940 174153 -9153 56282 -90622 -56122 167289 -1012 -333226 197198 144982 -187970
6354 4007 -116069 117553 334924 147780 86416 -52980 -60556 51351 -509927 313447 -61041
6342 -214509 96702 -93946 -104479 -127859 215797 220909 -193224 -41334 15283 -66379 -111562
6331 -111562 -304966 -103483 272829 61600 83235 -11931 -74405 -219602 12673 -150847 -484788
6320 -484788 -219737 -254264 -134156 -57511 73354 232596 10345 138786 -305915 -339079 258292
6308 96395 84520 -109614 244389 -58066 -119332 363136 -102489 46066 23517 48333 43518
6297 43518 -19825 299170 -72896 -29671 196932 56958 60490 87483 94904 -130027 117628
6285 225365 -147037 -79707 -131140 -337083 -143717 200753 -56869 28146 -8255 303447 358216
6274 358216 -45416 -62004 -394825 -151750 -110909 -321027 -43157 25733 162869 197320 31961
6262 183570 -282534 -391172 138026 -79599 -30121 70739 14899 108357 124418 -106376 36303
6250 -224283 -80061 56683 92118 224411 -301204 -60187 -16795 302808 -252778 18358 -360018
6238 -78362 -266838 -189927 -80326 110072 155398 -113200 -185518 -93975 -341995 22431 -282637
6226 -19199 -103334 -212540 -298199 7319 -200647 -11348 -19042 -176630 76725 172685 178051 6697
6213 -283089 30891 279184 -192467 69845 90950 213796 -148146 -119494 108122 82200 35714
6201 83123 44690 114708 82788 -195615 -171097 -411085 109500 -300738 -73979 109069 -186657
6189 -77885 -183829 63211 227839 73071 168799 -125248 -86957 22022 -117965 308793 -266844
6177 56364 78075 -117341 -252691 -48671 50226 89419 -90899 -183601 119863 -43661 102349
6165 -349668 350871 72852 -155167 15255 58873 -73985 136424 207133 112040 -81047 -51757
6154 -51757 83194 -275585 -19586 -399052 -176908 83829 53428 203626 -49666 40465 -35086
6142 1610 -28046 -61906 190535 224583 -73195 52787 -183405 10555 -262577 -79783 21978
6130 -115708 181643 74809 304021 62964 195943 9362 76766 277262 366052 -104738 150381
6118 -113286 44566 -65515 -112766 -96810 142928 -5053 -119807 -111720 -273145 -39784 36943
6106 -181426 -41159 89436 -377849 25857 -275091 -127705 -204462 77070 92713 -296036 1244
6094 81953 -118175 251148 -29044 -55449 -125774 -63558 -122116 178133 -138530 140016 87256
6083 87256 -207135 -432748 164224 -67092 322414 -219755 -40120 -123096 271423 7180 116352
6072 116352 52780 -7323 172554 -59581 107623 -160874 101922 152108 -128563 -200169 -20074
6060 -141845 -366049 -75998 -210858 111812 -10225 -155579 25089 -44060 1909 -58148 -77372
6049 -77372 -264149 430386 40639 225496 34830 28822 116513 -136285 -287052 13753 -101849
6037 -178884 82549 -294405 355891 -133620 -63783 -18537 -42525 -56467 61416 165465 6979
6025 -28644 197686 325874 -45361 -109936 -462066 -440346 -136735 -92366 192362 -70355 267401
6013 -204728 43987 200347 -4055 -212557 -208306 29963 -51216 -336583 -325344 -81525 -8343 -31961
6001 -31961 34179 -116854 114270 105939 229843 -28609 -25831 195780 144816 130640 87483
5990 87483 45123 -201078 86778 -308225 315978 -145786 -265254 -19232 69748 -11939 108510
5978 118290 -450332 128710 161859 243990 2706 -158586 -84831 -5386 -101335 32006 249954
5967 249954 -248438 67660 -387049 132558 23971 206330 -135012 -403276 221037 141041
5957 141041 63021 136843 58636 29035 159843 57986 -29707 69173 -363714 -297044 -60682
5945 27411 -106799 -126081 153980 -120439 22312 -57270 7453 -72293 289474 192400 -171320
5933 6554 214415 -79366 12711 -371555 -212438 323857 274014 -150718 216826 59386 -90188
5921 -186444 -379039 -143272 139120 26855 -144186 109491 -64359 -6907 -106419 80925 106565
5910 106565 -194628 149480 -234463 10355 103230 -14188 230025 -47963 41114 -135510 7894
5898 -73657 -209179 -136855 427583 -224990 -77882 -38461 -116221 -13270 199843 -199260 -250185
5887 -250185 -5057 -15786 -10983 124072 4488 107500 -94721 -69098 -82826 39650 -116767 97594
5874 -14294 -170815 -33425 -69142 9254 -167366 19669 29174 138966 221447 237902 -214410
5862 36588 66853 154996 118506 17288 -118201 -125411 275585 -188161 -99170 -267787 -268303 111522
5849 -40493 -3589 165945 -32271 -159682 -207103 117409 265158 -36084 278100 271258 143133
5838 143133 78813 127621 -93239 -13148 338629 105612 159074 -132992 -167284 237157 -220647
5826 33382 140660 -142787 343928 -9894 389872 -478174 -287427 59344 165377 -89791 84580
5814 197165 -418457 245745 274132 56599 53542 159410 210792 1745 222650 -252064 -7538
5802 -198078 113573 -111692 -110548 -128206 -130776 -281441 240784 79601 51198 -358164 -37871
5790 -20281 175185 -216137 -239702 210282 -168544 -250665 -2786 -148406 51659 -370821 79856
5778 -77676 106931 113808 47757 -292270 -69675 -104582 -85613 -130733 27958 36698 101315 322133
5766 322133 -197296 -186193 -114744 -266535 100288 142128 -39952 -63985 -159321 195358 178783
5755 178783 -67160 -84214 -215353 70082 223164 149024 92523 205373 45448 232812 102120
5743 323317 225772 220964 159739 -6 -75585 -329900 173352 3798 167009 -230822 80505 -193403
5730 198435 -94987 -251485 -15860 -11784 -76455 293435 33352 -154343 81230 85773 166109
5719 166109 -464229 -289630 -76846 -199837 297870 -303996 139242 57034 454121 111760
5708 -221247 -49196 -153828 -155800 63720 77043 -170727 -25614 -10023 -101535 369895 15753
5696 -217351 -321254 -89993 119808 344682 -91931 -55530 -300479 98866 -15175 -189384 -126612
5685 -126612 -29149 -75465 204210 97305 -341939 126187 -71367 -84316 -70336 -112064 -173826
5674 -173826 269632 168937 -205298 208001 218070 -22216 -28401 78331 -15519 135462 111144
5663 111144 -30040 -23229 13952 128513 -37731 -88783 3212 332605 -485 263309 -305962 -93624
5650 134926 226918 -13128 -69796 149949 -160518 -295326 86565 -309343 -65962 -123705 -89250
5639 -89250 -69750 28680 -43494 170103 -64106 -63316 116030 -30435 -247518 -102660 -337453
5628 -337453 -130407 162843 43300 170631 -203001 69412 -175679 46226 251265 -74475
5617 488714 -8594 73378 81724 -209370 16100 -158846 237231 282300 246802 -208090 -164797
5606 -164797 -222021 278182 -340554 -15647 -253082 124101 117374 -214379 -122081 346558 46569
5594 168924 247354 -262954 167528 -36836 -63740 251961 -90486 -308796 -212256 -38189 141558
5582 41427 837 106439 -29817 109828 -35729 138874 87248 304824 -158711 -71869 -74520
5571 -74520 224403 -48530 436600 -281366 -95322 -30968 135402 135785 -21467 65497 143827
5560 143827 408019 112834 2184 27782 -11521 253257 210052 -66280 -144089 -65039 -97198
5549 -97198 20659 -49100 158388 14450 -8410 184997 -143834 191887 69225 57341 -186502
5537 70764 -184153 307881 356371 -275113 -36844 -5796 420906 -54890 29961 14123 21120
5526 21120 -85895 9052 -190513 -24721 152585 -176177 92455 -10340 -68992 91226 -383316
5514 -21490 29467 -41096 -13916 -128049 216764 146017 -44834 -26831 215973 49448 91120
5503 91120 169495 16237 -127201 58492 -154686 -135372 22280 438533 45297 146642 56280
5491 50733 -284437 62814 -331457 -93285 48303 -97898 -300643 123400 17835 -89991 373804
5479 -258073 83307 162655 60255 -194561 -38170 3131 -133871 -177691 151309 121072 163403
5468 163403 -330907 -31270 152020 78984 -153649 -26301 74288 -69747 -10394 63153 -419105
5456 -124376 -41666 -187661 4363 -254371 -390534 -102550 -133728 -56523 -183880 84693 22123
5444 468564 215889 175485 184231 227468 -441718 306672 3884 350826 -178268 159284 42097
5432 -37073 88849 -7004 -915 -329376 -121741 -9021 -144141 118475 -231006 125327 106145
5421 106145 102108 -81838 139644 204586 -122535 -291070 212923 65262 -89288 -214748 158322
5409 -309445 18466 -236491 477084 109468 -316226 -260512 -221744 -30887 112696 -235873
5398 -152769 37951 299927 94483 -182864 13942 -128596 -45285 38493 186698 -166599 324210
5386 -56285 -39161 -91810 -23684 126022 228274 114991 357682 409510 -345118 325644 208856
5375 208856 -53366 202581 36725 -104650 131307 132536 80111 -810 282751 -16199 -134908
5364 -134908 -200732 45947 -161469 60995 4987 -47842 135177 802 -97622 181464 106283 -43931
5351 -117359 197282 140109 -46193 56263 -10218 200824 103673 -43666 -222986 142168 -118249
5339 16368 -165103 537879 -190989 165180 -136276 78019 -57297 -83179 -68015 69346 -372738
5327 306708 -35830 122992 122842 -84893 -369855 -301485 76504 52638 -61512 423999 -110212
5315 164906 -251307 -222632 153041 -77875 -357576 -120182 25608 -1416 540735 -88622 -263658
5304 -263658 140816 -81438 122946 -104282 299404 52355 -139739 53494 147343 -151720
5293 53696 19725 37989 37678 11172 -32186 -330294 -13819 -83050 164395 131157 75433 176487
5281 176487 -63978 9970 -155909 -41792 134937 190439 -256407 -82536 122080 -1921 -124929
5270 -124929 -134092 260689 -293250 227033 9740 168711 249959 -37127 94804 -132602 -40225
5258 281586 35725 13906 -209804 -151150 27903 202636 -247955 94740 -115405 -261848 104957
5246 -407074 -52378 -200879 241664 298182 -26364 -134345 143958 270358 -37106 -55438 -26483
5234 -171210 -85296 -108826 -111671 -477506 -154625 7545 -54601 -17193 -137166 -138045 -64080 114011
5221 -364086 24260 -60859 118554 6955 144409 -95885 -127944 -199517 -152012 -125475 26144
5209 70321 106594 -163357 -45969 -159012 -134201 -65515 -201714 154378 -195863 145319 -215170
5197 -103457 80767 -187759 -122826 115686 27687 33223 150857 -299577 -108060 169198 82060
5185 -59543 -110533 48552 83892 35753 10207 100939 184 133048 179641 -86146 20464 -371838
5172 -186066 -55517 -249948 -27263 6505 152134 -102144 -294804 28308 88978 -393729 -10782
5160 100737 -111007 45098 219800 -222278 -258065 354155 -190331 -16870 30294 -21886 156503
5148 -117067 5240 34617 -50971 46986 -175783 197947 175225 -271927 -48138 19534 63453
5137 63453 -69784 -44485 -196925 -55408 324484 -204236 -70379 236877 101460 285344 -183427
5125 51672 76394 -318578 43702 33417 48065 183275 143907 167658 -78970 -147126 -57696
5113 147059 71180 221690 -391104 -274817 -197692 142847 -192650 -5377 120472 63980 21120
5101 381150 136325 203997 -14619 126773 -53426 -30797 -105274 329490 -21872 136334 -49403
5089 -313490 -162378 26408 -536154 -187682 298612 156623 15296 227058 45747 13402
5078 13771 314594 165420 217421 -229623 -280444 -197919 -315326 27835 -147738 263671 174607
5067 174607 -973 -285493 -195720 -220524 -367742 -10171 192407 -4863 -67828 -127345 130337
5055 311782 159364 379655 -31243 -10477 33211 249917 -214181 -33114 123812 -230853
5044 -27427 456715 -65731 -193140 324713 -10419 -187350 121346 -74324 237923 25008 -289129
5032 406256 405760 17777 187166 -183375 183153 -23836 169255 -75258 360870 18633 156052
5021 156052 -227197 -128779 -147999 -197264 137823 316531 214724 -106534 15656 84374 -191633
5009 95715 -41186 224957 -27548 -64621 205041 -331862 -245593 242694 -324060 276093 42454
4997 -280467 182040 -93226 38281 53669 -280589 -113842 8101 130302 -132634 133407 104834
4986 104834 -23009 -35712 -204876 -125502 54806 -86956 35649 180698 267935 144148 89680
4975 89680 -120489 -90205 -238100 -206326 -686 145227 -100869 277283 -1063 -96400 225170
4963 111392 -422420 -111586 91073 -215998 -168946 -149656 -27438 71355 -182680 -63967 41941
4951 -47704 342669 -132176 -151873 -10036 -22060 -219326 -116606 98555 -211976 -236878 -214683
4940 -214683 -31082 -19384 -84936 -17685 41527 -343573 77981 145574 -164020 -57747 16314
4928 40825 182175 256824 -82101 -269677 -270974 192488 100170 -82360 142092 143990 -114130
4916 160963 14999 -118545 192227 131807 -162539 -95106 -19636 -374080 -218895 -57132 69773
4904 -138104 189788 -45485 -121703 42243 -33468 -135469 -292044 -99925 76734 -80669 -38858
4892 -29283 -95990 186868 -52552 96612 -161780 83958 -62784 -273289 266225 128633 168679
4881 168679 54155 241347 -44943 10056 188668 1255 23559 168831 -221342 127454 -115271
4869 89227 -316977 -231496 -93229 -134383 129220 23411 11012 -111681 286804 23608 152213
4858 152213 115831 13027 -117298 -104039 72271 22594 -234163 -82263 -417276 389920 34332
4846 -279778 138569 52078 -98934 -110941 146449 -414810 164916 -163321 285316 -165932
4835 -68086 171156 71788 92949 -103307 -84325 196606 -278889 29900 -127770 -131126 138460
4823 101642 60086 119693 -91305 191579 -88169 103847 121464 -109120 292423 39536 179788
4812 179788 -317964 -299656 -130835 -229727 -303682 -134460 -93958 113252 -48611 263749 113315
4800 8969 -46607 222161 14456 -91191 -19321 154007 -68809 -62062 -69843 -19421 88062 193185
4788 193185 63260 215657 365166 49652 -151423 -376333 523250 -32986 -130335 135791
4777 141326 205158 -201155 212661 -286593 87221 138698 -60544 168222 153644 -30236 15367
4765 -24719 381751 -101643 -63565 -35276 337061 163305 251122 -245500 318880 212766
4755 212766 54309 19791 -55681 -22121 -87500 25640 97173 -56443 140818 -30496 13382
4743 -288917 205944 -321318 -64974 -286719 76850 80634 61928 -39260 278354 242581 166532
4732 166532 -46096 118578 -60105 -366827 -229802 -212336 13766 -26282 24319 -365080 -144010
4720 -19611 -189244 -283193 -291674 -287626 -4775 177073 130473 -2832 -258292 138169 115951 133473
4708 133473 -11939 -172632 187996 299601 -200802 -35369 60270 -344820 -129365 262198
4697 125587 152896 -55395 407580 65900 103811 5694 67900 203735 19331 185091 155287
4686 155287 -191390 7144 153321 -3683 -269562 66047 165448 428644 -74954 179378 -17935
4674 -125193 -79134 -58435 -150337 -138620 194924 141025 236763 -159952 -7827 100980 281923
4663 281923 32733 176328 137840 -80348 300735 130517 173757 202076 -159971 63831 -15896
4651 111645 -40996 -191059 163513 -98382 -91809 75032 204918 95865 -107772 26196 81635
4640 81635 189114 -207803 138653 209937 66184 -11116 -116139 35161 -64530 160433 152824
4629 152824 -58899 -477911 246082 4313 37399 -136180 96319 37669 -24151 -61018 -5000
4617 50735 -158614 -16650 10665 -179206 19660 13934 96912 271308 -109152 105189 143305
4606 143305 883 17942 -190248 56801 -87914 15252 472850 7499 -18520 -53498 194176 -188385
4593 95335 264437 334542 133839 148959 44337 -134084 -268584 137810 277744 -54477 99486
4581 287463 48427 108050 -168371 -5234 -188728 -85449 92682 -83184 -236527 123025 6494
4569 361889 54916 100183 -304010 305658 164660 15105 -141098 -115530 -212143 -51464 164008
4557 151683 366093 160154 121683 -142452 434737 -10276 -91269 -200906 51498 -157188
4546 69176 -121978 -289056 35166 -177145 -39007 193102 156935 -50726 -113210 -193952 -28300
4534 -16663 -62064 48315 74508 273898 172017 -65772 -152065 241213 82826 -137528 -22902
4522 213405 137626 -49294 -13064 -195061 -120459 -265956 108225 194224 52906 -91410 -199396
$$ [...]
##END NTUPLES=NMR SPECTRUM
##END=
