##TITLE=AC1524_ROEFFECT0006_8202296_HPoOqEx9dn
##JCAMPDX= 6.0         $$ Bruker NMR JCAMP-DX V2.0
##DATA TYPE= NMR SPECTRUM
##DATA CLASS= NTUPLES
##ORIGIN= BRUKER
##OWNER= Administrator
$$ 1.72 TOPSPIN		Version 2.1
$$ 2013-09-26 23:00:42.174 -0700  Administrator@X
$$ Compression mode = diff/dup
##.OBSERVE FREQUENCY= 400.02188249412
##.OBSERVE NUCLEUS= ^1H
##.ACQUISITION MODE= SIMULTANEOUS (DQD)
##.ACQUISITION SCHEME= undefined
##.AVERAGES= 64
##.DIGITISER RES= 22
##SPECTROMETER/DATA SYSTEM= spect
##.PULSE SEQUENCE= noesygpps1d.comp
##.SOLVENT NAME= COFFEE_meoh
##.SHIFT REFERENCE= INTERNAL, COFFEE_meoh, 1, 14.96081
##AUDIT TRAIL= $$ (NUMBER, WHEN, WHO, WHERE, PROCESS, VERSION, WHAT)
$$ ##TITLE= Audit trail, TOPSPIN		Version 2.1
$$ ##JCAMPDX= 5.01
$$ ##ORIGIN= Bruker BioSpin GmbH
$$ ##OWNER= Administrator
$$ $$ E:\/data/COFFEE/nmr/AC1524_ROEFFECT0006_8202296_HPoOqEx9dn/12/pdata/1/auditp.txt
$$ ##AUDIT TRAIL=  $$ (NUMBER, WHEN, WHO, WHERE, PROCESS, VERSION, WHAT)
(   1,<2013-09-26 23:00:36.893 -0700>,<Administrator>,<X>,<go>,<TOPSPIN 2.1>,
      <created by zg
	started at 2013-09-26 22:49:06.599 -0700,
	POWCHK enabled, PULCHK disabled,
       configuration hash MD5:
       C8 4E 4E 5D D3 5C D8 9E 9F 52 82 E0 59 8A DE 15
       data hash MD5: 64K
       30 CB 5F DF 2D F5 6D 23 93 C7 4A 7B 3F A3 5B 12>)
(   2,<2013-09-26 23:00:39.971 -0700>,<Administrator>,<X>,<proc1d>,<TOPSPIN 2.1>,
      <Start of raw data processing
       efp LB = 0.3 FT_mod = 6 PKNL = 1 PHC0 = 0 PHC1 = 0 SI = 128K 
       data hash MD5: 128K
       6C A9 D4 CA 08 D9 D0 1E 58 DB 02 EA F3 99 16 9F>)
(   3,<2013-09-26 23:00:41.002 -0700>,<Administrator>,<X>,<proc1d>,<TOPSPIN 2.1>,
      <pk PHC0 = -82.90283 PHC1 = 0 
       data hash MD5: 128K
       70 99 B4 82 C7 A0 DC AF 5D 61 D9 E1 C4 94 C0 17>)
(   4,<2013-09-26 23:00:41.440 -0700>,<Administrator>,<X>,<proc1d>,<TOPSPIN 2.1>,
      <abs ABSG = 1 
       data hash MD5: 128K
       90 33 D1 A8 DB 0E 90 B6 2E 35 99 50 BF 7B 3F DF>)
(   5,<2013-09-26 23:00:41.549 -0700>,<Administrator>,<X>,<proc1d>,<TOPSPIN 2.1>,
      <abs ABSG = 2 
       data hash MD5: 128K
       AD 9F 65 FB B0 19 5E C6 58 07 8E B2 4D 21 49 DE>)
(   6,<2013-09-26 23:00:41.674 -0700>,<Administrator>,<X>,<proc1d>,<TOPSPIN 2.1>,
      <abs ABSG = 3 
       data hash MD5: 128K
       EA DD 29 50 F0 52 CE D8 E0 E1 0A 2B 23 AA AD 34>)
(   7,<2013-09-26 23:00:41.784 -0700>,<Administrator>,<X>,<proc1d>,<TOPSPIN 2.1>,
      <abs ABSG = 4 
       data hash MD5: 128K
       05 38 3E B5 57 EA 76 A7 70 C1 5E E0 CE 9E D1 46>)
(   8,<2013-09-26 23:00:41.955 -0700>,<Administrator>,<X>,<proc1d>,<TOPSPIN 2.1>,
      <abs ABSG = 5 
       data hash MD5: 128K
       14 4F 13 8D 06 B8 E5 24 52 62 C8 65 EB 42 56 34>)
$$ ##END=
$$ 
$$ $$ hash MD5
$$ $$ 67 82 8E C3 3B 37 8E 49 17 10 51 4F B3 83 B3 64
##$RELAX= 
##$RELAX= 
##$RELAX= 
##$RELAX= 
##$RELAX= 
##$RELAX= 
##$RELAX= 
##$RELAX= 
$$ Bruker specific parameters
$$ --------------------------
##$DU= <E:\>
##$EXPNO= 12
$$ [...]
150 150 150 150 150 150 150 150
##$TP07= 0
##$TPNAME0= <>
##$TPNAME1= <>
##$TPNAME2= <>
##$TPNAME3= <>
##$TPNAME4= <>
##$TPNAME5= <>
##$TPNAME6= <>
##$TPNAME7= <>
##$TPOAL= (0..7)
0.5 0.5 0.5 0.5 0.5 0.5 0.5 0.5
##$TPOFFS= (0..7)
0 0 0 0 0 0 0 0
##$TUNHIN= 0
##$TUNHOUT= 0
##$TUNXOUT= 0
##$USERA1= <user>
##$USERA2= <user>
##$USERA3= <user>
##$USERA4= <user>
##$USERA5= <user>
##$V9= 5
##$VALIST= <valist>
##$VCLIST= <CCCCCCCCCCCCCCC>
##$VD= 0
##$VDLIST= <DDDDDDDDDDDDDDD>
##$VPLIST= <PPPPPPPPPPPPPPP>
##$VTLIST= <TTTTTTTTTTTTTTT>
##$WBST= 1024
##$WBSW= 4
##$XGAIN= (0..3)
0 0 0 0
##$XL= 0
##$YL= 0
##$YMAX_a= 7240046
##$YMIN_a= -13977382
##$ZGOPTNS= <>
##$ZL1= 120
##$ZL2= 120
##$ZL3= 120
##$ZL4= 120
##$ABSF1= 14.96081
##$ABSF2= -5.597372
##$ABSG= 5
##$ABSL= 3
##$ALPHA= 0
##$AQORDER= 0
##$ASSFAC= 0
##$ASSFACI= 0
##$ASSFACX= 0
##$ASSWID= 0
##$AUNMP= <proc_prof1d_extract.lims>
##$AXLEFT= 0
##$AXNAME= <>
##$AXNUC= <1H>
##$AXRIGHT= 0
##$AXTYPE= 0
##$AXUNIT= <>
##$AZFE= 0.1
##$AZFW= 0.1
##$BCFW= 0
##$BC_mod= 0
##$BYTORDP= 0
##$COROFFS= 0
##$CY= 15
##$DATMOD= 1
##$DC= 0
##$DFILT= <>
##$DTYPP= 0
##$F1P= 0
##$F2P= 0
##$FCOR= 0.5
##$FTSIZE= 131072
##$FT_mod= 6
##$GAMMA= 0
##$GB= 0
##$INTBC= 1
##$INTSCL= 1
##$ISEN= 128
##$LB= 0.3
##$LEV0= 0
##$LPBIN= 0
##$MAXI= 10000
##$MC2= 0
##$MEAN= 0
##$ME_mod= 0
##$MI= 0
##$NCOEF= 0
##$NC_proc= -2
##$NLEV= 6
##$NOISF1= 0
##$NOISF2= 0
##$NSP= 0
##$NTH_PI= 0
##$NZP= 0
##$OFFSET= 14.96081
##$PC= 1
##$PHC0= -82.90283
##$PHC1= 0
##$PH_mod= 1
##$PKNL= yes
##$PPARMOD= 0
##$PPDIAG= 0
##$PPIPTYP= 0
##$PPMPNUM= 2147483647
##$PPRESOL= 1
##$PSCAL= 4
##$PSIGN= 0
##$PYNMP= <proc.py>
##$REVERSE= no
##$SF= 400.02000971173
##$SI= 131072
##$SIGF1= 0
##$SIGF2= 0
##$SINO= 400
##$SIOLD= 131072
##$SPECTYP= <>
##$SREGLST= <1H.CDCl3>
##$SSB= 0
##$STSI= 131072
##$STSR= 0
##$SW_p= 8223.68421052631
##$SYMM= 0
##$S_DEV= 0
##$TDeff= 65536
##$TDoff= 0
##$TI= <>
##$TILT= no
##$TM1= 0
##$TM2= 0
##$TOPLEV= 0
##$USERP1= <user>
##$USERP2= <user>
##$USERP3= <user>
##$USERP4= <user>
##$USERP5= <user>
##$WDW= 1
##$XDIM= 131072
##$YMAX_p= 405812643
##$YMIN_p= -11836
##$CURPLOT= <Network HP LaserJet P1505>
##$CURPRIN= <$Network HP LaserJet P1505>
##$DFORMAT= <normdp>
##$LAYOUT= <+/1D_H.xwp>
##$LFORMAT= <normlp>
##$PFORMAT= <normpl>
##$SURQMSG= 1
$$ End of Bruker specific parameters
$$ ---------------------------------
##NTUPLES= NMR SPECTRUM
##VAR_NAME=  FREQUENCY,     SPECTRUM/REAL,   SPECTRUM/IMAG
##SYMBOL=    X,             R,               I
##VAR_TYPE=  INDEPENDENT,   DEPENDENT,       DEPENDENT
##VAR_FORM=  AFFN,          ASDF,            ASDF
##VAR_DIM=   131072,        131072,          131072
##UNITS=     HZ,            ARBITRARY UNITS, ARBITRARY UNITS
##FACTOR=    0.0627417313425164, 1,          1
##FIRST=     8223.62146879497, 3563,         -68108
##LAST=      0,             4357,            -68015
##MIN=       0,             -11836,          0
##MAX=       8223.62146879497, 405812643,    0
$$ Real data points
##PAGE= N=1
##DATA TABLE= (X++(R..R)), XYDATA
$$ [...]
$$ plain form
63796 387518 378131 369569 360933 352593 345714 340661 336700 333117 329742 326486 323212 320115 317426 314686
63782 314686 311093 306661 302320 298764 295946 293776 292409 291496 289987 287274 284023 281424 280016 279600 279797
63767 279797 280206 280343 279896 278906 277502 275756 273963 272616 271828 271176 270434 269999 270246 270877 271358 271616 271825
63750 271825 271907 271835 272114 273268 274987 276367 276976 277122 277158 277100 277036 277265 277839 278426 278924 279830 281681 284321 286995
63731 286995 289088 290672 292416 295016 298576 302527 306272 309852 313767 318232 322967 327743 332690 337885
63717 337885 343014 347726 352040 356052 359489 361963 363585 364897 366095 366605 365661 363164 359883 356788 354219
63702 354219 351688 348598 345147 342352 341084 341310 342509 344479 347246 350324 352791 354329 355654 357634
63688 357634 360399 363667 367409 371574 375484 378291 380006 381435 383062 384604 385754 386629 387196 386982 385872
$$ packed form
63796C87518r387q562q636q340o879n053l961l583l375l256l274l097k689k740
63782C14686l593m432m341l556k818k170j367r13j509k713l251k599j408m16J97
63767B79797M09J37m47r90j404j746j793j347p88o52p42m35K47O31M81K58K09
63750B71825Q2p2K79J154J719J380O09J46L6n8o4K29N74N87M98R06J851K640K674
63731B86995K093J584J744K600L560L951L745L580L915M465M735M776M947N195
63717C37885N129M712M314M012L437K474J622J312J198N10r44k497l281l095k569
63702C54219k531l090l451k795j268K26J199J970K767L078K467J538J325J980
63688C57634K765L268L742M165L910K807J715J429J627J542J150Q75N67k14j110
$$ plain form
63673 385872 384748 384677 385693 386936 387865 388807 390325 392501 394933 397085 398551 399164 398981 398122 396669 394712
63657 394712 392307 389303 385483 381000 376348 371769 367133 362645 359118 357022 355765 354546 353457 353018
63643 353018 353120 353456 354673 357839 362733 367915 372794 378376 385481 393343 400795 407825 415006 422208 428962
63628 428962 435605 442912 450843 458629 465880 472783 479425 485915 493015 501619 511543 521841 532498 544835
63614 544835 559930 577522 596873 617845 640568 664823 690446 717772 746972 777427 808474
63603 808474 840386 873760 908013 941250 971590 997953 1019514 1035262 1044580 1047817 1045895 1039700
63591 1039700 1030277 1019245 1008280 997917 987247 974934 960318 943353 923890 901585 876576
63580 876576 849782 822286 794662 767175 740426 715390 692730 672349 653785 636962 622464
$$ packed form
63673C85872j124p1J016J243R29R42J518K176K432K152J466O13j83q59j453j957
63657C94712k405l004l820m483m652m579m636m488l527k096j257j219j089m39
63643C53018J02L36J217L166M894N182M879N582P105P862P452P030P181P202O754
63628D28962O643P307P931P786P251O903O642O490P100Q604R924J0298J0657J2337
63614E44835J5095J7592J9351K0972K2723K4255K5623K7326K9200L0455L1047
63603H08474L1912L3374L4253L3237L0340K6363K1561J5748R318L237j922o195
63591A039700r423j1032j0965j0363j0670j2313j4616j6965j9463k2305k5009
63580H76576k6794k7496k7624k7487k6749k5036k2660k0381j8564j6823j4498
$$ plain form
63569 622464 611037 602772 596877 592441 589484 588867 590999 594976 599455 604131 609799 617044 625556 634906
63555 634906 645413 657793 672267 688451 706007 725209 747044 772884 803773 839753 879966
63544 879966 923546 970158 1019567 1071057 1123438 1174978 1222649 1261899 1288380 1300502 1300057 1290317
63532 1290317 1274088 1253670 1231697 1210783 1192209 1175513 1159522 1143324 1126064 1106434 1083102
63521 1083102 1055642 1024651 990910 954922 917366 879486 842506 806875 772503 739577 708662
63510 708662 680004 653324 628452 605751 585635 568053 552643 539065 526865 515442 504548
63499 504548 494578 485878 477994 470123 462187 454897 448695 443132 437501 431692 426240 421774 418584 416524
63485 416524 415168 414239 413947 414699 416469 418712 421007 423483 426488 430142 434434 439467 445240 451267 456687
$$ packed form
63569F22464j1427q265n895m436k957o17K132L977M479M676N668P245Q512R350
63555F34906J0507J2380J4474J6184J7556J9202K1835K5840L0889L5980M0213
63544H79966M3580M6612M9409N1490N2381N1540M7671L9250K6481J2122m45r740
63532A290317j6229k0418k1973k0914j8574j6696j5991j6198j7260j9630k3332
63521A083102k7460l0991l3741l5988l7556l7880l6980l5631l4372l2926l0915
63510G08662k8658k6680k4872k2701k0116j7582j5410j3578j2200j1423j0894
63499E04548r970q700p884p871p936p290o202n563n631n809n452m466l190k060
63485D16524j356r29k92P52J770K243K295K476L005L654M292N033N773O027N420
$$ plain form
63470 456687 460838 463667 465605 467112 468234 468586 467887 466467 465054 464082 463509 463263 463430 463824 463945 463721
63454 463721 463828 464767 465968 466482 466327 466488 467648 469651 472289 475867 480731 486862 494386 503914 515888
63439 515888 529921 545330 562110 580957 602589 627555 656505 689998 727910 769461 813785
63428 813785 859963 906177 949155 984871 1010174 1024199 1028726 1027137 1022663 1017526 1013693 1013827 1020513
63415 1020513 1034485 1054448 1078961 1107779 1140832 1176586 1212273 1245487 1274803 1299113 1317286
63404 1317286 1328718 1333572 1332281 1325405 1314180 1300502 1285778 1270092 1252850 1233799 1212827 1189035
63392 1189035 1160862 1127439 1089489 1048698 1006551 963999 921887 881163 842526 806202 772263
63381 772263 741074 713169 688774 667658 649551 634416 622212 612685 605717 601639 600774 602701 606476
$$ packed form
63470D56687M151K829J938J507J122L52o99j420j413r72n73k46J67L94J21k24
63454D63721J07R39J201N14j55J61J160K003K638L578M864O131P524R528J1974
63439E15888J4033J5409J6780J8847K1632K4966K8950L3493L7912M1551M4324
63428H13785M6178M6214M2978L5716K5303J4025M527j589m474n137l833J34O686
63415A020513J3972J9963K4513K8818L3053L5754L5687L3214K9316K4310J8173
63404A317286J1432M854j291o876j1225j3678j4724j5686j7242j9051k0972k3792
63392A189035k8173l3423l7950m0791m2147m2552m2112m0724l8637l6324l3939
63381G72263l1189k7905k4395k1116j8107j5135j2204r527o968m078q65J927L775
$$ plain form
63368 606476 611657 618643 627880 639245 652573 668304 687042 708694 732639 758723 787569 819821
63356 819821 855540 894431 936185 980343 1026158 1072861 1119787 1165886 1209360 1248168 1280913
63345 1280913 1306975 1325910 1337195 1340792 1337707 1329692 1318413 1305000 1290244 1274785 1258865 1242075
63333 1242075 1223616 1202798 1179060 1151625 1119707 1083424 1044312 1004535 965660 928505 893986
63322 893986 863475 838011 817508 801058 787888 777813 770911 766987 765071 762991 757436 745063
63310 745063 724218 695911 663176 629393 596970 567170 540687 518014 499198 483547 469956
63299 469956 457643 446415 436228 426840 418151 410590 404728 400495 397184 394282 391901 390148 388473
63286 388473 386142 383204 380452 378307 376208 373383 369844 366247 363012 360142 357823 356566 356514 357079 357624
$$ packed form
63368F06476N181O986R237J1365J3328J5731J8738K1652K3945K6084K8846L2252
63356H19821L5719L8891M1754M4158M5815M6703M6926M6099M3474L8808L2745
63345A280913K6062J8935J1285L597l085q015j1279j3413j4756j5459j5920j6790
63333A242075j8459k0818k3738k7435l1918l6283l9112l9777l8875l7155l4519
63322H93986l0511k5464k0503j6450j3170j0075o902l924j916k080n555j2373
63310G45063k0845k8307l2735l3783l2423k9800k6483k2673j8816j5651j3591
63299D69956j2313j1228j0187r388q689p561n862m233l311k902k381j753j675
63286C88473k331k938k752k145k099k825l539l597l235k870k319j257n2N65N45
$$ plain form
63271 357624 358192 359164 360465 361614 362432 363186 364013 364690 365121 365658 366757 368663 371547 375552 380449 385556
63255 385556 390351 394929 399611 404429 409346 414704 420949 428028 435544 443460 452126 461541 471139 480486
63241 480486 489883 500062 511581 524727 539609 555986 573185 590601 608311 627007 647322 669384
63229 669384 692908 717481 742708 768261 793950 819724 845521 871089 896001 919993 943328
63218 943328 966655 990264 1013597 1035759 1056497 1076328 1095595 1113779 1129887 1143100 1152688 1157621
63206 1157621 1156886 1150187 1137977 1120798 1098964 1072925 1043462 1011389 977530 943192 910163 879756
63194 879756 852088 826802 804321 785818 771926 762091 755447 751863 751677 754748 760334 767947 777908
63181 777908 790869 806985 825588 845499 865607 885389 905013 924858 944858 964438 983039
$$ packed form
63271C57624N68R72J301J149Q18P54Q27O77M31N37J099J906K884M005M897N107
63255C85556M795M578M682M818M917N358O245P079P516P916Q666R415R598R347
63241D80486R397J0179J1519J3146J4882J6377J7199J7416J7710J8696K0315K2062
63229F69384K3524K4573K5227K5553K5689K5774K5797K5568K4912K3992K3335
63218I43328K3327K3609K3333K2162K0738J9831J9267J8184J6108J3213R588M933
63206A157621p35o699j2210j7179k1834k6039k9463l2073l3859l4338l3029l0407
63194H79756k7668k5286k2481j8503j3892r835o644l584j86L071N586P613R961
63181G77908J2961J6116J8603J9911K0108J9782J9624J9845K0000J9580J8601
$$ plain form
63170 983039 1000444 1016484 1030739 1042766 1052434 1059819 1064881 1067453 1067338 1064107 1056928 1044944 1027874
63157 1027874 1006065 980159 951078 920191 888849 857537 825940 794108 763163 734561 708895
63146 708895 685755 664438 644479 625780 608813 594582 583818 576081 570015 564598 559783 555861
63134 555861 552653 549673 546770 544181 541982 539819 537265 534308 531373 528950 527208 525978 525110 524814 525532
63119 525532 527420 530083 532938 535802 538961 542686 546839 551015 554988 558832 562621 566192 569330 572133
63105 572133 575024 578319 581900 585368 588425 591041 593357 595587 598010 600911 604418 608404 612564 616705
63091 616705 621079 626311 632730 639619 645408 648931 650421 651055 651586 651734 650835 648705 645750 642616 640056
63076 640056 638912 639827 642870 647553 653244 659548 666434 674139 682949 692923 703849 715546 728203 742333
$$ packed form
63170I83039J7405J6040J4255J2027R668P385N062K572j15l231p179j1984j7070
63157A027874k1809k5906k9081l0887l1342l1312l1597l1832l0945k8602k5666
63146G08895k3140k1317j9959j8699j6967j4231j0764p737o066n417m815l922
63134E55861l208k980k903k589k199k163k554k957k935k423j742j230q68k96P18
63119E25532J888K663K855K864L159L725M153M176L973L844L789L571L138K803
63105E72133K891L295L581L468L057K616K316K230K423K901L507L986M160M141
63091F16705M374N232O419O889N789L523J490O34N31J48q99k130k955l134k560
63076F40056j144R15L043M683N691O304O886P705Q810R974J0926J1697J2657J4130
$$ plain form
63062 742333 758372 776372 796116 817447 840470 865530 893108 923756 957963 995909 1037359
63051 1037359 1082018 1130017 1181862 1237715 1296883 1358183 1420687 1483949 1547735 1611888 1676388
63040 1676388 1741160 1805787 1869802 1933357 1997216 2061860 2126823 2191077 2253770 2314329 2372002
63029 2372002 2425550 2473280 2513229 2543516 2562702 2569739 2563620 2543446 2509154 2461939 2403767 2336700
63017 2336700 2262831 2184377 2103360 2021482 1940695 1863447 1791675 1725825 1665736 1612407 1567922
63006 1567922 1533396 1507866 1489674 1478314 1474311 1477795 1487875 1503172 1522445 1544799 1569666 1596517
62994 1596517 1624384 1651992 1678689 1704886 1731107 1756964 1781682 1805364 1828900 1852496 1874948
62983 1874948 1894540 1910111 1921050 1926788 1926646 1919903 1905776 1883691 1853784 1816858 1773664 1724591
$$ packed form
63062G42333J6039J8000J9744K1331K3023K5060K7578L0648L4207L7946M1450
63051A037359M4659M7999N1845N5853N9168O1300O2504O3262O3786O4153O4500
63040A676388O4772O4627O4015O3555O3859O4644O4963O4254O2693O0559N7673
63029B372002N3548M7730L9949L0287J9186P037o119k0174l4292m7215n8172o7067
63017B336700p3869p8454q1017q1878q0787p7248p1772o5850o0089n3329m4485
63006A567922l4526k5530j8192j1360m003L484J0080J5297J9273K2354K4867K6851
62994A596517K7867K7608K6697K6197K6221K5857K4718K3682K3536K3596K2452
62983A874948J9592J5571J0939N738j42o743j4127k2085k9907l6926m3194m9073
$$ plain form
62971 1724591 1670325 1612363 1552501 1492090 1432174 1374032 1318958 1267550 1219633 1174894 1133245
62960 1133245 1094639 1058983 1026284 996499 969149 943455 919003 895986 874625 854672 835625
62949 835625 817194 799325 782013 765348 749571 734820 720856 707258 693842 680794 668457
62938 668457 657135 646984 637954 629903 622869 617075 612500 608612 604831 601223 598465 597077 596868 597146
62924 597146 597254 596839 595893 594721 593740 593064 592219 590441 587464 584054 581595 580837 581002 580425 578241 575238
62908 575238 572809 571355 570097 568256 565807 563051 560061 556863 553706 550713 547559 543960 540397 537909
62894 537909 537150 537942 539673 541779 543767 545126 545542 545166 544545 544249 544489 545003 545341 545335 545280 545588 546305 547084
62876 547084 547552 547599 547384 547251 547533 548190 548621 548062 546262 543681 541035 538828 537268 536289 535501 534330 532506
$$ packed form
62971A724591n4266n7962n9862o0411n9916n8142n5074n1408m7917m4739m1649
62960A133245l8606l5656l2699k9785k7350k5694k4452k3017k1361j9953j9047
62949H35625j8431j7869j7312j6665j5777j4751j3964j3598j3416j3048j2337
62938F68457j1322j0151r030q051p034n794m575l888l781l608k758j388k09K78
62924E97146J08m15r46j172r81o76q45j778k977l410k459p58J65n77k184l003
62908E75238k429j454j258j841k449k756k990l198l157k993l154l599l563k488
62894E37909p59P92J731K106J988J359M16l76o21k96K40N14L38on5L08P17P79
62876E47084M68M7k15j33K82O57M31n59j800k581k646k207j560r79p88j171j824
$$ plain form
62859 532506 530378 528654 527835 527920 528510 529060 529148 528777 528510 529135 530962 533343 535086 535543 535232 535125 535434 535567
62841 535567 535361 535716 537388 539581 540576 539749 538211 537273 537050 536976 537013 537573 538592 539493 540099 541009 542909 545916
62823 545916 549714 553965 558420 562882 567277 571668 576046 580170 583686 586396 588455 590387 592811 595989
62809 595989 599655 603379 607032 610788 614794 619125 624033 629922 636955 644789 652895 661057 669529 678727
62795 678727 688862 699941 712170 726188 742653 761587 782470 805124 830161 858357 889945
62784 889945 924992 964194 1008672 1058963 1114724 1175547 1241664 1313730 1392198 1477008 1567446
62773 1567446 1662085 1759136 1857057 1954621 2050264 2141608 2225828 2300361 2363256 2413133 2448926
62762 2448926 2469539 2473817 2461234 2432587 2389607 2333815 2266293 2188691 2103744 2014227 1921776
$$ packed form
62859E32506k128j724q19Q5N90N50Q8l71k67O25J827K381J743M57l11j07L09J33
62841E35567k06L55J672K193R95q27j538r38k23p4L7N60J019R01O06R10J900L007
62823E45916L798M251M455M462M395M391M378M124L516K710K059J932K424L178
62809E95989L666L724L653L756M006M331M908N889P033P834Q106Q162Q472R198
62795F78727J0135J1079J2229J4018J6465J8934K0883K2654K5037K8196L1588
62784H89945L5047L9202M4478N0291N5761O0823O6117P2066P8468Q4810R0438
62773A567446R4639R7051R7921R7564R5643R1344Q4220P4533O2895M9877L5793
62762B448926K0613M278j2583k8647m2980n5792o7522p7602q4947q9517r2451
$$ plain form
62751 1921776 1827224 1731783 1637285 1545407 1457188 1373301 1294374 1220964 1153420 1091786 1035701
62740 1035701 984596 938197 896620 859783 827055 797752 771690 748898 729119 712062 697793
62729 697793 686270 676754 668284 660588 653848 647765 641689 635740 631003 628361 627669 628299 629850 632159
62715 632159 635198 639351 645313 653410 663390 675064 688645 704271 721775 741285 763492 788892
62703 788892 817235 848190 882071 919486 960721 1005975 1055711 1110098 1168438 1229777 1293821
62692 1293821 1360610 1429444 1498800 1567138 1633149 1695339 1752098 1802247 1844913 1878738 1901810
62681 1901810 1912602 1910628 1896155 1869745 1832236 1784782 1728773 1665941 1598469 1528487 1457363
62670 1457363 1385833 1314836 1245743 1179717 1117349 1059063 1005342 956320 911601 870789 833833
$$ packed form
62751A921776r4552r5441r4498r1878q8219q3887p8927p3410o7544o1634n6085
62740A035701n1105m6399m1577l6837l2728k9303k6062k2792j9779j7057j4269
62729F97793j1523r516q470p696o740o083o076n949m737k642o92O30J551K309
62715F32159L039M153N962Q097R980J1674J3581J5626J7504J9510K2207K5400
62703G88892K8343L0955L3881L7415M1235M5254M9736N4387N8340O1339O4044
62692A293821O6789O8834O9356O8338O6011O2190N6759N0149M2666L3825K3072
62681A901810J0792j974j4473k6410l7509m7454n6009o2832o7472o9982p1124
62670A457363p1530p0997o9093o6026o2368n8286n3721m9022m4719m0812l6956
$$ plain form
62659 833833 800647 770786 743730 719134 696570 675538 656046 638753 624060 611350 599635
62648 599635 588667 578875 570343 562483 554772 547249 540031 532802 525236 517814 511727 507765 505533 504022
62634 504022 502799 502213 502437 502887 502929 502673 502544 502460 502171 502126 503027 504482 505130 504436 503464 503364 503977 504651 505700
62615 505700 508048 511786 516065 520299 524653 529411 534631 540546 547603 555901 565065 574799 585158 596280
62601 596280 608351 621891 637625 655982 677086 701167 728467 758735 791403 826373 864040
62590 864040 904408 946787 990550 1035556 1081434 1126922 1170288 1210038 1244914 1273674 1295364
62579 1295364 1309464 1315395 1312301 1299836 1278924 1251245 1218168 1180583 1139505 1096167 1051517 1006150
62567 1006150 960874 916923 875460 837090 801833 769281 738770 709834 682715 658280 637264
$$ packed form
62659H33833l3186k9861k7056k4596k2564k1032j9492j7293j4693j2710j1715
62648E99635j0968r792q532p860p711p523p218p229p566p422o087l962k232j511
62634E04022j223n86K24M50M2k56j29q4k89m5R01J455O48o94r72j00O13O74J049
62615E05700K348L738M279M234M354M758N220N915P057Q298R164R734J0359J1122
62601E96280J2071J3540J5734J8357K1104K4081K7300L0268L2668L4970L7667
62590H64040M0368M2379M3763M5006M5878M5488M3366L9750L4876K8760K1690
62579A295364J4100N931l094j2465k0912k7679l3077l7585m1078m3338m4650m5367
62567A006150m5276m3951m1463l8370l5257l2552l0511k8936k7119k4435k1016
$$ plain form
62556 637264 619590 604392 590593 577552 565418 554829 546141 538989 532765 527260 522516 518178 513569
62543 513569 508524 503722 499975 497498 496128 495856 496705 498247 499795 501145 502793 505174 507907 510066 511166
62528 511166 511712 512771 515104 518801 523614 529503 536826 546103 557648 571372 586932 604136 623271
62515 623271 644947 669492 696542 725378 755701 787940 822691 859939 898904 938551 978069
62504 978069 1016812 1053982 1088522 1119277 1145107 1164991 1178357 1185408 1186792 1182754 1172889 1157127
62492 1157127 1136783 1114189 1091310 1069099 1048153 1029342 1013433 1000516 990267 982587 977679 975713
62480 975713 976814 981212 989026 999907 1013207 1028252 1044031 1058792 1070649 1078716 1083211 1084347 1081728
62467 1081728 1075007 1064357 1049725 1030168 1004801 974334 940987 906756 872265 837327 802022
$$ packed form
62556F37264j7674j5198j3799j3041j2134j0589q688p152o224n505m744m338m609
62543E13569n045m802l747k477j370k72Q49J542J548J350J648K381K733K159J100
62528E11166N46J059K333L697M813N889P323R277J1545J3724J5560J7204J9135
62515F23271K1676K4545K7050K8836L0323L2239L4751L7248L8965L9647L9518
62504I78069L8743L7170L4540L0755K5830J9884J3366P051J384m038r865j5762
62492A157127k0344k2594k2879k2211k0946j8811j5909j2917j0249p680m908j966
62480I75713J101M398P814J0881J3300J5045J5779J4761J1857Q067M495J136k619
62467A081728o721j0650j4632j9557k5367l0467l3347l4231l4491l4938l5305
$$ plain form
62456 802022 766895 732575 699758 669338 642095 618224 597447 579585 564716 552758 543192 535401
62444 535401 529152 524584 521797 520625 520755 521975 524229 527469 531475 535815 540039 543939 547586 551066
62430 551066 554191 556506 557589 557334 555959 553738 550699 546609 541345 535239 528906 522640 516171 509181
62416 509181 501990 495530 490581 487173 484715 482575 480451 478291 475978 473273 470132 467011 464525 462658
62402 462658 460620 457823 454815 452770 452135 452326 452758 453556 454912 456429 457686 459108 461577 465254 469331
62387 469331 473011 476233 479350 482568 485931 489562 493607 498089 502926 508055 513484 519349 525925 533440
62373 533440 541879 551148 561300 572392 584241 596705 610146 625195 641996 660144 679550 700904
62361 700904 724983 751909 781428 813675 849305 889037 933363 982459 1035993 1093156 1153150
$$ packed form
62456H02022l5127l4320l2817l0420k7243k3871k0777j7862j4869j1958r566p791
62444E35401o249m568k787j172J30J220K254L240M006M340M224L900L647L480
62430E51066L125K315J083k55j375k221l039m090n264o106o333o266o469o990
62416E09181p191o460m949l408k458k140k124k160k313k705l141l121k486j867
62402D62658k038k797l008k045o35J91M32P98J356J517J257J422K469L677M077
62387D69331L680L222L117L218L363L631M045M482M837N129N429N865O576P515
62373E33440Q439R269J0152J1092J1849J2464J3441J5049J6801J8148J9406K1354
62361G00904K4079K6926K9519L2247L5630L9732M4326M9096N3534N7163N9994
$$ plain form
62350 1153150 1215453 1279184 1342422 1402634 1457738 1506355 1547147 1578608 1599786 1610815 1612490
62339 1612490 1605599 1590894 1569372 1542095 1509748 1472575 1430848 1385418 1337875 1290114 1243498
62328 1243498 1198308 1154221 1111438 1071149 1034708 1002561 974114 948391 924486 901453 878297
62317 878297 854374 829764 805099 781037 757884 735598 713982 692854 672171 652199 633588
62306 633588 617053 602808 590402 579351 569808 562309 556871 552729 549120 545981 543632 542058 540889
62293 540889 539965 539472 539491 539717 539798 539769 540078 541226 543352 546086 548887 551635 554769 558610 562739 566374 569347
62276 569347 572262 575673 579522 583577 587940 592748 597716 602480 607333 613170 620674 629894 640781 653848
62262 653848 670133 690577 715546 744859 778180 815463 857056 903359 954380 1009707 1068887
$$ packed form
62350A153150O2303O3731O3238O0212N5104M8617M0792L1461K1178J1029J675
62339A612490o891j4705k1522k7277l2347l7173m1727m5430m7543m7761m6616
62328A243498m5190m4087m2783m0289l6441l2147k8447k5723k3905k3033k3156
62317H78297k3923k4610k4665k4062k3153k2286k1616k1128k0683j9972j8611
62306F33588j6535j4245j2406j1051r543p499n438m142l609l139k349j574j169
62293E40889r24m93J9K26Q1k9L09J148K126K734K801K748L134L841M129L635K973
62276E69347K915L411L849M055M363M808M968M764M853N837P504R220J0887J3067
62262F53848J6285K0444K4969K9313L3321L7283M1593M6303N1021N5327N9180
$$ plain form
62251 1068887 1131675 1197755 1266194 1335165 1402210 1464755 1520548 1567785 1605109 1631632 1646935
62240 1646935 1650960 1643960 1626734 1600780 1567721 1528307 1482233 1429353 1370866 1308938 1245284 1180727
62228 1180727 1116294 1054090 996501 944687 898244 856230 818088 783612 752588 724850 700486
62217 700486 679585 661729 645964 631424 617882 605575 594585 584666 575700 568006 561818 556607
62205 556607 551377 545791 540622 536787 534179 531866 529354 527241 526547 527755 530617 534587 539180 544062
62191 544062 549125 554484 560368 567017 574682 583434 592842 602117 610893 619692 629233 639411 649431 658938
62177 658938 668406 678183 687698 696139 703566 710848 718742 727703 738544 752491 770291 791762 816533
62164 816533 844795 876977 913103 952972 996634 1044002 1093967 1144335 1192727 1237212 1276175
$$ packed form
62251A068887O2788O6080O8439O8971O7045O2545N5793M7237L7324K6523J5303
62240A646935M025p000j7226k5954l3059l9414m6074n2880n8487o1928o3654o4557
62228A180727o4433o2204n7589n1814m6443m2014l8142l4476l1024k7738k4364
62217G00486k0901j7856j5765j4540j3542j2307j0990r919q966p694o188n211
62205E56607n230n586n169l835k608k313k512k113o94J208K862L970M593M882
62191E44062N063N359N884O649P665Q752R408R275Q776Q799R541J0178J0020R507
62177F58938R468R777R515Q441P427P282P894Q961J0841J3947J7800K1471K4771
62164H16533K8262L2182L6126L9869M3662M7368M9965N0368M8392M4485L8963
$$ plain form
62153 1276175 1308202 1332430 1348735 1357371 1358625 1352948 1341168 1324236 1302796 1277105 1247295 1213661
62141 1213661 1176851 1137938 1098378 1059832 1023973 992148 964895 941895 922681 907433 896717
62130 896717 890532 888056 888516 891808 898084 907205 919000 933633 951211 971277 993230 1017079 1043212
62117 1043212 1071439 1100751 1130090 1158880 1186718 1212917 1236573 1256710 1272215 1282026 1285719 1283809
62105 1283809 1277302 1267112 1254064 1239158 1223415 1207404 1191117 1174346 1157141 1139966 1123525
62094 1123525 1108442 1095068 1083647 1074607 1068420 1065069 1063833 1063904 1065125 1067866 1072216 1077610 1083357 1089264
62080 1089264 1095540 1102330 1109732 1118183 1128448 1141050 1155976 1173053 1192271 1213449 1235811 1258338
62068 1258338 1280536 1302544 1324541 1346414 1368092 1389818 1411929 1434641 1458152 1482636 1507989
$$ packed form
62153A276175L2027K4228J6305Q636J254n677j1780j6932k1440k5691k9810l3634
62141A213661l6810l8913l9560l8546l5859l1825k7253k3000j9214j5248j0716
62130H96717o185k476M60L292O276R121J1795J4633J7578K0066K1953K3849K6133
62117A043212K8227K9312K9339K8790K7838K6199K3656K0137J5505R811L693j910
62105A283809o507j0190j3048j4906j5743j6011j6287j6771j7205j7175j6441
62094A123525j5083j3374j1421r040o187l351j236P1J221K741M350N394N747N907
62080A089264O276O790P402Q451J0265J2602J4926J7077J9218K1178K2362K2527
62068A258338K2198K2008K1997K1873K1678K1726K2111K2712K3511K4484K5353
$$ plain form
62057 1507989 1533878 1560089 1586350 1611504 1633374 1650023 1660978 1666842 1667958 1663927 1654206 1638580
62045 1638580 1617057 1589801 1557184 1519540 1476949 1429680 1378737 1325418 1270451 1214236 1157954
62034 1157954 1103609 1052586 1004810 959727 917514 878781 843591 811488 782332 756467 734034
62023 734034 714500 696879 680230 664134 649029 635863 625012 615631 606437 597049 588109 580172
62011 580172 573047 566363 560303 555366 551659 548795 546482 544933 544633 545848 548475 552282 557058 562463
61997 562463 567947 573043 577668 581822 585034 586542 586179 584687 582817 580405 576666 571219 564385 556616
61983 556616 548123 539156 530168 521446 512762 503659 494067 484578 476068 468990 463023 457489 452199 447685
61969 447685 444481 442414 440886 439618 438687 437935 436890 435398 433905 432911 432460 432371 432635 433342 434461 435998
$$ packed form
62057A507989K5889K6211K6261K5154K1870J6649J0955N864J116m031r721j5626
62045A638580k1523k7256l2617l7644m2591m7269n0943n3319n4967n6215n6282
62034A157954n4345n1023m7776m5083m2213l8733l5190l2103k9156k5865k2433
62023G34034j9534j7621j6649j6096j5105j3166j0851r381r194r388q940p937
62011E80172p125o684o060m937l707k864k313j549l00J215K627L807M776N405
61997E62463N484N096M625M154L212J508l63j492j870k412l739n447o834p769
61983E56616q493q967q988q722q684r103r592r489q510p078n967n534n290m514
61969D47685l204k067j528j268r31p52j045j492j493r94m51q9K64P07J119J537
$$ plain form
61953 435998 438175 441133 444629 448382 452671 458196 465277 473467 482106 491033 500676 511608 524194 538545
61939 538545 554644 572541 592421 614365 637899 661945 685447 708040 729951 751334 771897
61928 771897 791133 808586 823858 836715 847351 856241 863464 868456 870761 870773 869290 866496 861964
61915 861964 855698 848602 841698 835369 829696 825125 822356 821783 823518 827865 835345 846113 859523 874310
61901 874310 889079 902710 914505 923977 930461 933099 931376 925597 916603 905072 891262 875376 857889
61888 857889 839375 820134 800171 779604 759032 739339 721033 703959 687825 672829 659360
61877 659360 647187 635499 623908 612889 602970 594012 585714 578350 572383 567601 563300 559296 556251
61864 556251 554985 555829 558623 562956 568421 575031 583299 593631 605809 619524 635168 653496 674631
$$ packed form
61953D35998K177K958L496L753M289N525P081Q190Q639Q927R643J0932J2586J4351
61939E38545J6099J7897J9880K1944K3534K4046K3502K2593K1911K1383K0563
61928G71897J9236J7453J5272J2857J0636Q890P223M992K305J2j483k794m532
61915H61964o266p096o904o329n673m571k769n73J735M347P480J0768J3410J4787
61901H74310J4769J3631J1795R472O484K638j723n779q994j1531j3810j5886j7487
61888H57889j8514j9241j9963k0567k0572j9693j8306j7074j6134j4996j3469
61877F59360j2173j1688j1591j1019r919q958q298p364n967m782m301m004l045
61864E56251j266Q44K794M333N465O610Q268J0332J2178J3715J5644J8328K1135
$$ plain form
61851 674631 698095 723860 752538 784294 818202 853034 888161 923402 958533 993312 1027425
61840 1027425 1059898 1088951 1112993 1131541 1144868 1153179 1156602 1155630 1150964 1143129 1132832 1121566
61828 1121566 1111229 1103054 1097298 1093917 1093046 1094810 1099164 1106055 1115291 1125948 1136240 1144309 1149122
61815 1149122 1150510 1148432 1142328 1131094 1113713 1090111 1061535 1029983 997136 963783 930176 896706
61803 896706 864128 833300 804866 779208 756531 736843 719833 704924 691603 679702 669216
61792 669216 659934 651488 643823 637329 632321 628550 625399 622425 619552 616878 614488 612366 610384 608409
61778 608409 606447 604482 602116 598787 594585 590545 587685 585928 584347 582277 579778 577172 574721 572754
61764 572754 571527 570747 569717 568219 566877 566388 566667 567045 567089 566913 566880 567306 568364 569981 571779 573316 574369
$$ packed form
61851F74631K3464K5765K8678L1756L3908L4832L5127L5241L5131L4779L4113
61840A027425L2473K9053K4042J8548J3327Q311L423r72m666p835j0297j1266
61828A121566j0337q175n756l381q71J764M354O891R236J0657J0292Q069M813
61815A149122J388k078o104j1234j7381k3602k8576l1552l2847l3353l3607l3470
61803H96706l2578l0828k8434k5658k2677j9688j7010j4909j3321j1901j0486
61792F69216r282q446p665o494n008l771l151k974k873k674k390k122j982j975
61778F08409j962j965k366l329m202m040k860j757j581k070k499k606k451j967
61764E72754j227p80j030j498j342m89K79L78M4j76l3M26J058J617J798J537J053
$$ plain form
61747 574369 574943 575114 575029 574963 575148 575503 575653 575234 574169 572657 570949 569163 567348 565798 565162 565964 567976
61730 567976 570308 572286 574043 576114 578731 581746 585027 588549 592133 595448 598348 601034 603898 607340
61716 607340 611665 616822 622310 627603 632636 637525 641855 644793 646078 646401 646465 646124 644897 642978 641134
61701 641134 639821 639007 638730 639093 639633 639347 637670 634947 631768 628378 625035 622237 620076 617811 614747
61686 614747 611165 607745 604378 600381 595708 591050 586674 582111 577282 573057 570122 567951 565572 562875
61672 562875 560454 558462 556430 554160 552090 550540 549142 547247 544649 541717 539049 537132 536122 535745
61658 535745 535445 534690 533166 530860 528155 525730 524109 523294 523038 523338 524360 525981 527839 529935 532665
61643 532665 536085 539525 542350 544784 547519 550663 553533 555525 556702 557412 557716 557485 556734 555501 553564
$$ packed form
61747E74369N74J71q5o6J85L55J50m19j065j512j708j786j815j550o36Q02K012
61730E67976K332J978J757K071K617L015L281L522L584L315K900K686K864L442
61716F07340M325N157N488N293N033M889M330K938J285L23O4l41j227j919j844
61701F41134j313q14k77L63N40k86j677k723l179l390l343k798k161k265l064
61686F14747l582l420l367l997m673m658m376m563m829m225k935k171k379k697
61672E62875k421j992k032k270k070j550j398j895k598k932k668j917j010l77
61658E35745l00p55j524k306k705k425j621q15k56L00J022J621J858K096K730
61643E32665L420L440K825K434K735L144K870J992J177P10L04k31p51j233j937
$$ plain form
61628 553564 550712 547280 543967 541008 537882 534090 529972 526420 523966 522445 521442 520666 519899 518962 517904
61613 517904 516929 515988 514661 512560 509629 505904 501261 495653 489463 483343 477705 472421 466910 460559 453351
61598 453351 446234 440528 436673 433746 430481 426515 422317 418169 413843 409198 404500 399940 395313 390532
61584 390532 386139 382897 380893 379312 377151 374040 370374 366812 363740 361176 359001 357120 355416 353733
61570 353733 351989 350171 348180 345945 343793 342438 342261 342766 343053 342776 342323 342156 342279 342381 342188 341626 340913
61553 340913 340545 340969 342211 343943 345837 347608 348870 349416 349666 350392 351806 353277 354089 354253 354409 355267
61537 355267 357234 360205 363501 366325 368550 370752 373287 375695 377364 378359 379113 379550 379091 377454 374934
61522 374934 371829 368119 363876 359640 356061 353355 351276 349497 347844 346285 344883 343782 343099 342782 342612
$$ packed form
61628E53564k852l432l313k959l126l792m118l552k454j521j003p76p67r37j058
61613E17904r75r41j327k101k931l725m643n608o190o120n638n284n511o351p208
61598D53351p117n706l855k927l265l966m198m148m326m645m698m560m627m781
61584C90532m393l242k004j581k161l111l666l562l072k564k175j881j704j683
61570C53733j744j818j991k235k152j355j77N05K87k77m53j67J23J02j93n62p13
61553C40913l68M24J242J732J894J771J262N46K50P26J414J471Q12J64J56Q58
61537C55267J967K971L296K824K225K202K535K408J669R95P54M37m59j637k520
61522C74934l105l710m243m236l579k706k079j779j653j559j402j101o83l17j70
$$ plain form
61507 342612 342406 342238 342371 342895 343473 343582 342982 341779 340020 337536 334367 331121 328628 327279 326893 327105
61491 327105 327603 328020 327977 327454 326949 327071 327916 328913 329312 328817 327779 326836 326452 326812 327979 329902 332239 334429
61473 334429 336085 337216 338032 338678 339223 339728 340164 340419 340479 340485 340540 340591 340613 340664 340656 340357 339773 339253 338976 338660 338122
61452 338122 337799 338216 339131 339781 339955 340290 341398 343165 345061 346690 347834 348362 348413 348456 348963 350111 351883
61435 351883 354178 356714 359089 361160 363151 365278 367478 369657 371886 374133 376056 377363 378246 379203 380536
61420 380536 382200 384011 385853 387818 390252 393446 397076 400246 402340 403625 404738 405771 406252 405824 404551
61405 404551 402663 400466 398406 396731 394956 392162 388017 383204 378689 374908 371858 369578 368143 367339
61391 367339 366693 365805 364501 362796 360988 359737 359729 361080 363102 364776 365502 365472 365383 365749 366505 367254 367823 368467
$$ packed form
61507C42612k06j68J33N24N78J09o00j203j759k484l169l246k493j349l86K12
61491C27105M98M17m3n23n05J22Q45R97L99m95j038r43l84L60J167J923K337K190
61473C34429J656J131Q16O46N45N05M36K55O0ON5N1K2N1qk99n84n20k77l16n38
61452C38122l23M17R15O50J74L35J108J767J896J629J144N28N1M3N07J148J772
61435C51883K295K536K375K071J991K127K200K179K229K247J923J307Q83R57J333
61420C80536J664J811J842J965K434L194L630L170K094J285J113J033M81m28j273
61405D04551j888k197k060j675j775k794m145m813m515l781l050k280j435q04
61391C67339o46q88j304j705j808j251qJ351K022J674P26l0q9L66P56P49N69O44
$$ plain form
61373 368467 369511 370966 372533 373879 374810 375294 375463 375652 376357 378038 380751 383930 386742 388850 390738
61358 390738 393022 395621 397975 400084 402807 406929 412306 418230 424349 430811 437701 444815 452062 459809
61344 459809 468659 478910 490172 501427 511600 520225 527498 533692 538819 543028 546905 550903 554637
61331 554637 557259 558481 558764 558543 557816 556647 555487 554614 553637 551967 549590 547027 544715 542817 541510
61316 541510 541062 541526 542694 544462 547015 550533 554896 559883 565544 572173 579951 588841 598886 610344
61302 610344 623262 637002 650517 663199 675176 686596 696857 704837 709729 711387 710068 706304
61290 706304 700939 694756 687865 679808 670434 660295 650013 639723 629485 619838 611403 604113 597419
61277 597419 591241 586238 583003 581450 581223 582336 584937 588556 592045 594565 596531 599336 604014 610243
$$ packed form
61373C68467J044J455J567J346R31M84J69J89P05J681K713L179K812K108J888
61358C90738K284K599K354K109K723M122N377N924O119O462O890P114P247P747
61344D59809Q850J0251J1262J1255J0173Q625P273O194N127M209L877L998L734
61331E54637K622J222K83k21p27j169j160q73r77j670k377k563k312j898j307
61316E41510m48M64J168J768K553L518M363M987N661O629P778Q890J0045J1458
61302F10344J2918J3740J3515J2682J1977J1420J0261P980M892J658j319l764
61290G06304n365o183o891q057r374j0139j0282j0290j0238r647q435p290o694
61277E97419o178n003l235j553k27J113K601L619L489K520J966K805M678O229
$$ plain form
61263 610243 616755 622625 627951 633382 639316 645770 652777 660563 669345 679135 689753 700880 712060
61250 712060 722798 732691 741465 748887 754708 758660 760571 760587 759290 757382 755149 752344 748686 744269
61236 744269 739400 734280 729097 724235 720069 716641 713854 711942 711411 712424 714506 716981 719572 722491
61222 722491 726121 730786 736746 744159 752898 762506 772501 782692 792981 802794 811156 817755 823704 830568
61208 830568 838536 846171 852192 856907 861454 866195 870509 873878 876478 878920 882043 886917 894337 904175
61194 904175 915727 928794 943905 961389 980828 1001637 1023679 1046853 1070446 1093260 1114328
61183 1114328 1133265 1150106 1165007 1178031 1189103 1198234 1205706 1211830 1216550 1219600 1221038 1221307 1220699
61170 1220699 1219036 1215876 1210677 1202856 1192200 1179356 1165325 1150289 1133449 1114273 1093322 1071461
$$ packed form
61263F10243O512N870N326N431N934O454P007P786Q782R790J0618J1127J1180
61250G12060J0738R893Q774P422N821L952J911J6j297j908k233k805l658m417
61236G44269m869n120n183m862m166l428k787j912n31J013K082K475K591K919
61222G22491L630M665N960P413Q739R608R995J0191J0289R813Q362O599N949O864
61208H30568P968P635O021M715M547M741M314L369K600K442L123M874P420R838
61194I04175J1552J3067J5111J7484J9439K0809K2042K3174K3593K2814K1068
61183A114328J8937J6841J4901J3024J1072R131P472O124M720L050J438K69o08
61170A220699j663l160n199p821j0656j2844j4031j5036j6840j9176k0951k1861
$$ plain form
61158 1071461 1048897 1025537 1001805 978322 955128 932015 909564 889113 871629 857156 845421
61147 845421 836297 829428 823981 819201 814960 811464 808638 806039 803152 799483 794577 788293 781129 774020
61133 774020 767783 762824 759409 758003 759123 762812 768433 775214 783038 792544 804395 818759 835627
61120 835627 855387 878629 905439 935235 967368 1001524 1037429 1074573 1112577 1151695 1192516
61109 1192516 1235133 1278859 1322773 1366233 1408693 1449320 1487181 1521795 1553140 1581067 1604994
61098 1604994 1624343 1638982 1648927 1653772 1652824 1645783 1632981 1614851 1591548 1563337 1531078 1495960
61086 1495960 1458746 1419538 1378348 1335733 1292739 1250343 1209049 1169033 1130466 1093588 1058538
61075 1058538 1025317 994019 964954 938482 914762 893747 875324 859419 846046 835300 827161
$$ packed form
61158A071461k2564k3360k3732k3483k3194k3113k2451k0451j7484j4473j1735
61147H45421r124o869n447m780m241l496k826k599k887l669m906o284p164p109
61133G74020o237m959l415j406J120L689N621O781P824R506J1851J4364J6868
61120H35627J9760K3242K6810K9796L2133L4156L5905L7144L8004L9118M0821
61109A192516M2617M3726M3914M3460M2460M0627L7861L4614L1345K7927K3927
61098A604994J9349J4639R945M845r48p041j2802j8130k3303k8211l2259l5118
61086A495960l7214l9208m1190m2615m2994m2396m1294m0016l8567l6878l5050
61075A058538l3221l1298k9065k6472k3720k1015j8423j5905j3373j0746q139
$$ plain form
61064 827161 821247 816911 813662 811361 810037 809780 810868 813606 817796 822801 828439 835397 844356 855103
61050 855103 867066 880302 895279 911957 929952 949537 971572 996324 1023091 1051239 1080923
61039 1080923 1112550 1146200 1181861 1219695 1259744 1301859 1346114 1392691 1441158 1490588 1540742
61028 1540742 1592461 1646477 1702510 1759985 1818966 1879651 1941483 2003570 2065789 2129048 2194724
61017 2194724 2264324 2339438 2421709 2513096 2616337 2734545 2870135 3024962 3202207 3407850
61007 3407850 3650274 3939454 4286970 4705531 5207328 5803453 6505735 7328626 8289173
60998 8289173 9406200 10698452 12178380 13843865 15678270 17660218 19762746 21923166
60990 21923166 24004783 25804144 27127677 27889108 28148062 28063622 27813820 27544132 27351120
$$ packed form
61064H27161n914m336l249k301j324k57J088K738M190N005N638O958Q959J0747
61050H55103J1963J3236J4977J6678J7995J9585K2035K4752K6767K8148K9684
61039A080923L1627L3650L5661L7834M0049M2115M4255M6577M8467M9430N0154
61028A540742N1719N4016N6033N7475N8981O0685O1832O2087O2219O3259O5676
61017B194724O9600P5114Q2271R1387J03241J18208J35590J54827J77245K05643
61007C407850K42424K89180L47516M18561N01797N96125P02282Q22891R60547
60998H289173J117027J292252J479928J665485J834405J981948K102528K160420
60990B1923166K081617J799361J323533P61431K58954q4440k49802k69688j93012
$$ plain form
60981 27351120 27263750 27211080 27017691 26466557 25404863 23818444 21825585 19610490 17353563
60972 17353563 15193520 13217864 11466856 9945275 8639066 7528638 6593033 5809345
60964 5809345 5154268 4607241 4150847 3768941 3446428 3170869 2932926 2725134 2541379
60955 2541379 2377518 2231271 2101033 1985198 1882453 1791750 1711787 1641002 1578043 1521627
60945 1521627 1469998 1421163 1373758 1327259 1281483 1236457 1192707 1150961 1111368 1073423 1036722
60934 1036722 1001306 967256 934507 903252 874045 847250 822632 799641 777908 757368 738171
60923 738171 720546 704532 689796 675872 662631 650302 639078 628911 619736 611659 604816 599135
60911 599135 594281 589844 585670 582097 579690 578659 578615 578987 579513 580237 581254 582610 584277 586058 587658
$$ packed form
60981B7351120q7370n2670j93389n51134j061694j586419j992859k215095k256927
60972A7353563k160043j975656j751008j521581j306209j110428r35605p83688
60964E809345o55077n47027m56394l81906l22513k75559k37943k07792j83755
60955B541379j63861j46247j30238j15835j02745r0703p9963p0785o2959n6416
60945A521627n1629m8835m7405m6499m5776m5026m3750m1746l9593l7945l6701
60934A036722l5416l4050l2749l1255k9207k6795k4618k2991k1733k0540j9197
60923G38171j7625j6014j4736j3924j3241j2329j1224j0167r175q077o843n681
60911E99135m854m437m174l573k407j031m4L72N26P24J017J356J667J781J600
$$ plain form
60896 587658 588947 590014 590876 591318 591103 590087 588136 585265 581920 578719 575775 572756 569623 566693 563761
60881 563761 559923 554719 548771 542735 536358 529351 522547 517152 513153 509466 505467 501405 497442 493366
60867 493366 489370 486123 483793 481823 479994 478938 479249 480793 483308 486960 491790 497170 502400 507399
60853 507399 512324 516927 520858 524330 527889 531743 535812 540245 545305 550752 555829 559961 563131 565552
60839 565552 567290 568320 568655 568261 567047 565086 562698 560215 557716 555128 552476 549904 547464 545050 542617
60824 542617 540343 538410 536715 534976 533107 531288 529606 527882 525880 523439 520298 516253 511676 507496
60810 507496 504151 500871 496554 491220 485990 481680 478027 474467 471045 468211 466126 464571 463319 462204
60796 462204 460949 459290 457379 455891 455573 456489 457713 458052 457312 456649 457295 459141 461083 462637 464480 467238
$$ packed form
60896E87658J289J067Q62M42k15j016j951k871l345l201k944l019l133k930k932
60881E63761l838n204n948o036o377p007o804n395l999l687l999m062l963m076
60867D93366l996l247k330j970j829j056L11J544K515L652M830N380N230M999
60853E07399M925M603L931L472L559L854M069M433N060N447N077M132L170K421
60839E65552J738J030L35l94j214j961k388k483k499k588k652k572k440k414k433
60824E42617k274j933j695j739j869j819j682j724k002k441l141m045m577m180
60810E07496l345l280m317n334n230m310l653l560l422k834k085j555j252j115
60796D62204j255j659j911j488l18R16J224L39p40o63O46J846J942J554J843K758
$$ plain form
60780 467238 470476 473340 475628 477654 479475 481000 482698 485522 489991 495776 502185 508635 514686 520204
60766 520204 525711 532111 539660 547516 554621 560719 566120 570762 574242 576839 579816 584249 589847 595361
60752 595361 599929 603572 606567 608964 610887 612812 615200 618056 621084 624029 626658 628698 630077 631077
60738 631077 631873 632067 631001 628555 625357 622242 619710 617864 616652 616125 616565 618276 621119 624429 627613
60723 627613 630718 634172 638145 642561 647663 654089 662228 671804 682260 693391 705444 718670 732860
60710 732860 747347 761550 775559 790009 805293 821181 837343 853861 870813 887678 903721
60699 903721 918832 933427 947556 960654 972241 982357 991154 998533 1004292 1008251 1010035 1009159 1005572
60686 1005572 999814 992502 983956 974396 964090 953085 941173 928349 915006 901516 887977 874545
$$ packed form
60780D67238L238K864K288K026J821J525J698K824M469N785O409O450O051N518
60766E20204N507O400P549P856P105O098N401M642L480K597K977M433N598N514
60752E95361M568L643K995K397J923J925K388K856L028K945K629K040J379J000
60738F31077P96J94j066k446l198l115k532j846j212n27M40J711K843L310L184
60723F27613L105L454L973M416N102O426Q139R576J0456J1131J2053J3226J4190
60710G32860J4487J4203J4009J4450J5284J5888J6162J6518J6952J6865J6043
60699I03721J5111J4595J4129J3098J1587J0116Q797P379N759L959J784q76l587
60686A005572n758p312q546r560j0306j1005j1912j2824j3343j3490j3539j3432
$$ plain form
60674 874545 861557 849005 836280 822854 808903 794875 780701 765954 750657 735485 721179
60663 721179 708081 696202 685343 675092 664968 654784 644767 635301 626640 618865 611957 605829
60651 605829 600333 595365 591032 587635 585286 583469 581302 578514 575928 574515 574045 573249 571399 569169 567636
60636 567636 566856 565898 564056 561621 559454 558108 557454 557049 556751 556825 557361 557885 557918 557771 558216 559304 560103 559871
60618 559871 558931 558017 557190 555870 553671 550745 547483 544242 541199 538113 534415 529891 525109 520862 517353
60603 517353 514286 511503 509058 506680 503752 500026 496078 492859 490872 489836 489061 488110 487083 486197 485191
60588 485191 483431 480743 477872 475916 475405 475983 476727 476648 475284 473049 470833 469089 467636 466443 466034 466732
60572 466732 468015 469198 470510 472965 477372 483924 492446 502468 513157 523798 534376 545249 556383
$$ packed form
60674H74545j2988j2552j2725j3426j3951j4028j4174j4747j5297j5172j4306
60663G21179j3098j1879j0859j0251j0124j0184j0017r466q661p775o908o128
60651F05829n496m968m333l397k349j817k167k788k586j413m70p96j850k230j533
60636E67636p80r58j842k435k167j346o54m05k98P4N36N24L3j47M45J088P99k32
60618E59871r40r14q27j320k199k926l262l241l043l086l698m524m782m247l509
60603E17353l067k783k445k378k928l726l948l219j987j036p75r51j027q86j006
60588D85191j760k688k871j956n11N78P44p9j364k235k216j744j453j193m09O98
60572D66732J283J183J312K455M407O552Q522J0022J0689J0641J0578J0873J1134
$$ plain form
60559 556383 567254 577299 585883 592033 594961 594869 592635 588731 583146 576396 569823 564552 560770 558303
60545 558303 557262 557694 559127 560998 563266 566245 570147 575089 581256 588645 596851 605373 613942 622301
60531 622301 629972 636463 641423 644334 644526 642041 638180 634593 631834 629271 626358 623473 621423 620593 620809
60516 620809 621667 622707 623488 623883 624358 625721 628414 632086 635948 639566 643116 646798 650294 653220 656113
60501 656113 660461 667508 677402 689835 705130 724164 747334 774137 803832 835990 870236 905892
60489 905892 942206 978510 1013654 1045385 1070801 1087637 1094952 1092622 1080608 1059002 1028624 991321
60477 991321 949664 906353 863603 822666 783898 747468 713990 684216 658234 635359 614946
60466 614946 596959 581474 568042 555965 545028 535474 527263 519782 512418 505067 497962 491339 485437
$$ packed form
60559E56383J0871J0045Q584O150K928r2k234l904n585o750o573n271l782k467
60545E58303j041M32J433J871K268K979L902M942O167P389Q206Q522Q569Q359
60531F22301P671O491M960K911J92k485l861l587k759k563k913k885k050q30K16
60516F20809Q58J040P81L95M75J363K693L672L862L618L550L682L496K926K893
60501F56113M348P047R894J2433J5295J9034K3170K6803K9695L2158L4246L5656
60489I05892L6314L6304L5144L1731K5416J6836P315k330j2014k1606l0378l7303
60477I91321m1657m3311m2750m0937l8768l6430l3478k9774k5982k2875k0413
60466F14946j7987j5485j3432j2077j0937r554q211p481p364p351p105o623n902
$$ plain form
60453 485437 480534 476636 473253 469794 466171 462840 460221 458260 456543 454626 452227 449292 446140 443521
60439 443521 442315 442884 444651 446444 447369 447401 447050 446561 445612 443887 441727 439929 438840 437853 436054 433295
60423 433295 430407 428312 427192 426650 426399 426471 426877 427476 428188 429069 430156 431568 433710 436880 440495 443214
60407 443214 444245 444248 444613 446082 448453 451277 454224 456814 458431 458847 458528 458287 458813 460390 462732 465062
60391 465062 466694 467662 468624 470165 472397 475106 477980 480696 483108 485326 487380 488991 490061 491181 493041
60376 493041 495403 497370 498752 500406 502910 505709 508040 510023 512079 513867 514689 514736 514979 515817 516641 516915
60360 516915 517035 517792 519512 521980 524778 527383 529310 530554 531710 533379 535644 538398 541865 546411 551992
60345 551992 558224 564969 572427 580572 588922 597151 605612 614893 624865 634510 642715 648964 653094 654604
$$ packed form
60453D85437m903l898l383l459l623l331k619j961j717j917k399k935l152k619
60439D43521j206N69J767J793R25L2l51m89r49j725k160j798j089r87j799k759
60423D33295k888k095j120n42k51P2M06N99P12Q81J087J412K142L170L615K719
60407D43214J031LL65J469K371K824K947K590J617M16l19k41N26J577K342K330
60391D65062J632R68R62J541K232K709K874K716K412K218K054J611J070J120J860
60376D93041K362J967J382J654K504K799K331J983K056J788Q22M7K43Q38Q24K74
60360E16915J20P57J720K468K798K605J927J244J156J669K265K754L467M546N581
60345E51992O232O745P458Q145Q350Q229Q461R281R972R645Q205O249M130J510
$$ plain form
60331 654604 652620 646730 637680 627083 616420 606371 596995 588332 580704 574516 569883 566434 563412
60318 563412 560000 555811 551197 547073 544217 542645 541711 540911 540575 541616 544567 548947 553739 558499 563861
60303 563861 570895 580093 591165 603630 617198 631460 645550 658503 669855 679529 687104 691540
60291 691540 691855 688006 681086 672841 664986 658689 654412 652191 652022 653807 656940 660318 662969 664477 664605
60276 664605 662747 658139 650611 640847 629904 618591 607237 595825 584336 573125 562876 554064
60264 554064 546547 539894 533933 528698 523964 519266 514438 509761 505542 501939 499254 497895 497680 497539 496390
60249 496390 494209 491914 490309 489527 489417 489938 490944 492042 493015 494153 495813 497734 499194 499860 500136 500597
60233 500597 501445 502655 504281 506312 508568 511107 514475 519072 524372 529269 533099 535871 537671 538579 539277
$$ packed form
60331F54604j984n890r050j0597j0663j0049r376q663p628o188m633l449l022
60318E63412l412m189m614m124k856j572r34q00l36J041K951M380M792M760N362
60303E63861P034R198J1072J2465J3568J4262J4090J2953J1352R674P575M436
60291F91540L15l849o920q245p855o297m277k221j69J785L133L378K651J508J28
60276F64605j858m608p528r764j0943j1313j1354j1412j1489j1211j0249q812
60264E54064p517o653n961n235m734m698m828m677m219l603k685j359k15j41j149
60249D96390k181k295j605p82j10N21J006J098R73J138J660J921J460O66K76M61
60233E00597Q48J210J626K031K256K539L368M597N300M897L830K772J800R08O98
$$ plain form
60218 539277 540910 543951 547813 551925 556513 561780 567065 571691 576183 581667 588226 594813 600835 606925
60204 606925 613900 621720 629781 637642 645073 651889 658125 664042 669672 674629 678598 681667 683935 685196
60190 685196 685337 684821 684418 684522 684916 685013 684225 682327 679704 677037 674538 671615 667464 661944 655837 650373
60174 650373 646405 643746 641266 637922 633721 629449 625613 622163 619233 617369 616715 616572 616228 615755 615542
60159 615542 615509 615371 615314 615717 616419 617034 617923 620110 623936 628391 632100 634655 636667 638816 641271 643915
60143 643915 646715 649788 653363 657862 663812 671284 679469 687222 694343 702015 711540 722742 733989 743703
60129 743703 751402 757348 761880 765286 767732 768906 768180 765545 762042 758869 756376 754297 752556 751257
60115 751257 750170 748878 747400 746159 745360 744902 744902 745740 747405 749170 750098 749674 747896 745094 741705 737969
$$ packed form
60218E39277J633L041L862M112M588N267N285M626M492N484O559O587O022O090
60204F06925O975P820Q061P861P431O816O236N917N630M957L969L069K268J261
60190F85196J41n16m03J04L94R7p88j898k623k667k499k923m151n520o107n464
60174F50373l968k659k480l344m201m272l836l450k930j864o54j43l44m73k13
60159F15542l3j38n7M03P02O15Q89K187L826M455L709K555K012K149K455K644
60143F43915K800L073L575M499N950P472Q185P753P121P672R525J1202J1247R714
60129G43703P699N946M532L406K446J174p26k635l503l173k493k079j741j299
60115G51257j087j292j478j241p99m58%Q38J665J765R28m24j778k802l389l736
$$ plain form
60099 737969 733732 728782 723351 718004 713062 708492 704425 701347 699593 698946 699009 699716 701243 703623 706765
60084 706765 710746 715817 722060 729158 736523 743532 749724 754937 759321 763082 766104 767914 768131 766886
60070 766886 764620 761393 756630 749716 740726 730319 719020 706983 694546 682594 672113 663463 656263
60057 656263 649882 643921 638357 633366 628922 624521 619497 613746 607942 602955 599268 597101 596705 598171
60043 598171 601140 605111 609964 615821 622387 628829 634448 639284 643933 648912 654201 659257 663401 666249
60029 666249 667914 668783 669085 668596 666749 663108 657838 651563 644622 636673 627328 616995 606573 596363
60015 596363 585890 574988 564452 555267 547634 541143 535480 530586 526481 523390 521686 521294 521478 521662
60001 521662 522115 523306 524956 526400 527635 529317 531780 534695 537580 540066 541780 542707 543715 546041 550053
$$ packed form
60099G37969m237m950n431n347m942m570m067l078j754o47O3P07J527K380L142
60084G06765L981N071O243P098P365P009O192N213M384L761L022J810K17j245
60070G66886k266l227m763o914q990j0407j1299j2037j2437j1952j0481q650p200
60057F56263o381n961n564m991m444m401n024n751n804m987l687k167l96J466
60043E98171K969L971M853N857O566O442N619M836M649M979N289N056M144K848
60029F66249J665Q69L02m89j847l641n270o275o941p949r345j0333j0422j0210
60015E96363j0473j0902j0536r185p633o491n663m894m105l091j704l92J84J84
60001E21662M53J191J650J444J235J682K463K915K885K486J714R27J008K326M012
$$ plain form
59986 550053 554997 559989 564765 569398 573924 578390 582737 586457 588871 589849 589790 588843 586824 584043 581467
59971 581467 579646 578036 575843 573066 570316 568013 566273 565242 565068 565677 566891 568612 570694 572929 575343
59956 575343 578167 581242 583887 585654 586838 587831 588399 588108 587166 586270 585726 585257 584544 583501 582057 580177
59940 580177 578129 576310 574729 572965 570647 567644 563825 559060 553634 548275 543517 539257 535177 531434
59926 531434 528656 527253 526935 526970 526841 526624 526786 527749 529568 531927 534341 536487 538486 540844 544043 548196
59910 548196 553061 558201 563073 567250 570868 574675 579331 584722 590246 595540 600510 604814 607949 609887
59896 609887 611164 612209 613138 614205 615833 618014 620345 622940 626622 631796 637829 644015 650500 657556
59882 657556 664646 671116 677375 684298 691695 698456 704208 709721 715426 720540 724170 726460 728011 728772
$$ packed form
59986E50053M944M992M776M633M526M466M347L720K414R78n9r47k019k781k576
59971E81467j821j610k193k777k750k303j740j031j74O09J214J721K082K235K414
59956E75343K824L075K645J767J184R93N68k91r42q96n44m69p13j043j444j880
59940E80177k048j819j581j764k318l003l819m765n426n359m758m260m080l743
59926E31434k778j403l18L5j29k17J62R63J819K359K414K146J999K358L199M153
59910E48196M865N140M872M177L618L807M656N391N524N294M970M304L135J938
59896F09887J277J045R29J067J628K181K331K595L682N174O033O186O485P056
59882F57556P090O470O259O923P397O761N752N513N705N114L630K290J551P61
$$ plain form
59868 728772 728172 725956 722291 717241 710753 703039 694610 685999 677751 670440 664276 658793 653344 647890
59854 647890 642965 639011 636139 634509 634399 635748 638027 640865 644591 649926 657238 666200 675944 685348
59840 685348 693348 699303 703178 705302 706018 705691 704911 704415 704685 705715 707143 708429 708859 707584 703947 697947
59824 697947 690352 682248 674287 666333 657877 648823 639651 630724 621699 611982 601686 591787 583269 576405
59810 576405 570885 566295 562321 558782 555678 553036 550624 548141 545796 544226 543586 543086 541835 539781 537404
59795 537404 534841 531971 529076 526659 524592 522146 519032 515855 513349 511711 510825 510628 510936 511348 511614
59780 511614 511780 511844 511679 511477 511726 512417 512806 512422 511918 512370 514011 516117 517935 519252 520272 521366 522842
59763 522842 524557 526000 527214 529354 533649 539849 546281 551584 555864 560125 565140 571064 577606 584218
$$ packed form
59868G28772o00k216l665n050o488p714q429q611q248p311o164n483n449n454
59854F47890m925l954k872j630j10J349K279K838L726N335P312Q962R744R404
59840F85348Q000N955L875K124P16l27p80m96K70J030J428J286M30j275l637o000
59824F97947p595q104p961p954q456r054r172q927r025r717j0296r899q518o864
59810E76405n520m590l974l539l104k642k412k483k345j570o40n00j251k054k377
59795E37404k563k870k895k417k067k446l114l177k506j638q86j97L08M12K66
59780E11614J66O4j65k02K49O91L89l84n04M52J641K106J818J317J020J094J476
59763E22842J715J443J214K140M295O200O432N303M280M261N015N924O542O612
$$ plain form
59749 584218 590530 596888 604141 612531 621088 628535 634586 639963 645315 650662 655884 661104 666206 670351
59735 670351 672506 672437 670909 668907 666998 665435 664418 663932 663540 662750 661535 660230 659026 657882 656891 656345
59719 656345 656334 656596 656836 656897 656503 655206 652893 650108 647655 646021 645351 645699 646984 648828 650761 652548
59703 652548 654138 655424 656283 656797 657231 657833 658728 659898 661125 662089 662697 663160 663632 664032 664366 664906 665645
59686 665645 665811 664427 661390 657651 654311 651875 650367 649719 649813 650387 651130 651825 652261 652097 650925 648521
59670 648521 645078 641125 637103 632975 628412 623379 618268 613391 608694 604188 600281 597273 594839 592496
59656 592496 590390 589042 588397 587794 587005 586712 587656 589809 592710 596218 600429 604993 608962 611447 612261 611882
59640 611882 610849 609182 606431 602335 597373 592537 588619 585932 584613 584748 586036 587729 589214 590533
$$ packed form
59749E84218O312O358P253Q390Q557P447O051N377N352N347N222N220N102M145
59735F70351K155o9j528k002j909j563j017m86l92p90j215j305j204j144r91n46
59719F56345j1K62K40O1l94j297k313k785k453j634o70L48J285J844J933J787
59703F52548J590J286Q59N14M34O02Q95J170J227R64O08M63M72M00L34N40P39
59686F65645J66j384l037l739l340k436j508o48R4N74P43O95M36j64j172k404
59670F48521l443l953m022m128m563n033n111m877m697m506l907l008k434k343
59656E92496k106j348o45o03p89k93R44K153K901L508M211M564L969K485Q14l79
59640F11882j033j667k751m096m962m836l918k687j319J35J288J693J485J319
$$ plain form
59626 590533 592058 593780 595133 595503 594778 593476 592488 592538 593649 595110 596129 596552 596785 597086 597130 596382 594681
59609 594681 592339 589826 587632 586371 586647 588544 591424 594443 597126 599237 600331 599977 598451 596678 595265
59594 595265 594007 592624 591435 590776 590138 588636 586290 584146 582987 582464 581709 580323 578464 576376 574198
59579 574198 571997 569671 566975 563904 560833 558030 555227 552055 548755 546072 544413 543460 542733 542207 542153
59564 542153 542538 542923 542965 542867 543163 544136 545576 547111 548619 550164 551683 552975 554042 555247 556983 559355
59548 559355 562270 565686 569559 573632 577604 581550 585944 591167 597218 604106 612274 622254 634001 647011
59534 647011 661187 677043 694630 712541 728446 740546 748174 751340 750555 747384 744390 743780 746086
59521 746086 750424 755833 761995 768847 776009 782714 788143 791773 793515 793427 791207 786204 778189 767943
$$ packed form
59626E90533J525J722J353L70p25j302r88N0J111J461J019M23K33L01M4p48j701
59609E94681k342k513k194j261K76J897K880L019K683K111J094l54j526j773j413
59594E95265j258j383j189o59o38j502k346k144j159n23p55j386j859k088k178
59579E74198k201k326k696l071l071k803k803l172l300k683j659r53p27n26n4
59564E42153L85L85M2r8K96R73J440J535J508J545J519J292J067J205J736K372
59548E59355K915L416L873M073L972L946M394N223O051O888Q168R980J1747J3010
59534F47011J4176J5856J7587J7911J5905J2100P628L166p85l171k994o10K306
59521G46086M338N409O162O852P162O705N429L630J742q8k220n003q015j0246
$$ plain form
59507 767943 756745 745339 733709 721788 709934 698551 687626 676932 666593 657159 649086 642287
59495 642287 636332 631059 626815 623943 622224 621165 620776 621645 624025 627281 630596 633946 637959 642972 648690
59480 648690 654813 661628 669833 679928 691832 705051 719203 734306 750308 766359 781086 793732
59468 793732 804504 813412 819404 821488 820437 818538 817650 818143 819732 822537 827106 834061 844032 857488
59454 857488 874342 894052 916236 940796 967394 995409 1024606 1055232 1087048 1118777 1148918
59443 1148918 1176577 1200813 1219422 1229199 1227710 1214658 1191667 1161281 1126294 1089504 1053286 1018935
59431 1018935 986568 955982 927714 902830 881621 863016 845835 830301 817793 809336 805015 804750
59419 804750 808821 817464 830597 848051 869473 893865 919904 946927 974868 1003051 1029934 1054449
$$ packed form
59507G67943j1198j1406j1630j1921j1854j1383j0925j0694j0339r434q073o799
59495F42287n955n273m244k872j719j059l89Q69K380L256L315L350M013N013N718
59480F48690O123O815Q205J0095J1904J3219J4152J5103J6002J6051J4727J2646
59468G93732J0772Q908N992K084j051j899q88M93J589K805M569O955R971J3456
59454H57488J6854J9710K2184K4560K6598K8015K9197L0626L1816L1729L0141
59443A148918K7659K4236J8609R777j489j3052k2991l0386l4987l6790l6218l4351
59431A018935l2367l0586k8268k4884k1209j8605j7181j5534j2508q457m321k65
59419H04750M071Q643J3133J7454K1422K4392K6039K7023K7941K8183K6883K4515
$$ plain form
59407 1054449 1076528 1095440 1108368 1111797 1104233 1087093 1063499 1037073 1011379 989112 971391 958282
59395 958282 949833 945735 943881 940189 930495 912629 887006 856069 823309 791880 763357 737781
59383 737781 714965 695336 679335 666488 655562 645578 636461 628834 623301 619796 617530 615670 614104
59370 614104 613323 613600 614586 615763 616935 618185 619689 621800 624991 629384 634510 639815 645331 651615 659136
59355 659136 667962 678086 689745 703271 718785 736265 755905 778115 802908 829420 856393 883218
59343 883218 910249 937972 966165 994070 1021023 1046471 1069551 1089147 1104483 1115316 1121496 1122669
59331 1122669 1118545 1109290 1095501 1077902 1057139 1033718 1008124 981019 953234 925440 897997 871376
59319 871376 846561 824601 805769 789439 774821 761479 749222 737995 728079 719979 713840 709233
$$ packed form
59407A054449K2079J8912J2928L429p564j7140k3594k6426k5694k2267j7721j3109
59395I58282q449m098j854l692r694j7866k5623l0937l2760l1429k8523k5576
59383G37781k2816j9629j6001j2847j0926r984r117p627n533l505k266j860j566
59370F14104p81K77R86J177J172J250J504K111L191M393N126N305N516O284P521
59355F59136Q826J0124J1659J3526J5514J7480J9640K2210K4793K6512K6973K6825
59343H83218K7031K7723K8193K7905K6953K5448K3080J9596J5336J0833O180J173
59331A122669m124r255j3789j7599k0763k3421k5594k7105k7785k7794k7443k6621
59319H71376k4815k1960j8832j6330j4618j3342j2257j1227r916q100o139m607
$$ plain form
59307 709233 705751 703481 702649 703040 704198 706072 709157 714037 721017 730138 741226 753918 767798 782508
59293 782508 797592 812239 825305 835529 841663 842650 838143 828998 817020 804039 791251 779349
59281 779349 768984 760886 755638 753571 754848 759474 767121 777049 788423 800823 814499 830013 847564
59268 847564 866645 886379 906065 925289 943517 959847 973377 983787 991270 995687 995997 990906
59256 990906 980214 965317 948215 930165 911501 892428 873511 855302 838019 821857 807290
59245 807290 794697 783965 774914 767966 763809 762337 762450 763207 764829 768196 773646 780656 788538 796933
59231 796933 805604 814131 821958 828508 833154 835276 834485 830726 824212 815434 805165 794129 782530 770093
59217 770093 756538 741842 726139 709854 694007 679839 667822 657378 647899 639635 633149 628231
$$ packed form
59307G09233l482k270q32L91J158J874L085M880O980R121J1088J2692J3880J4710
59293G82508J5084J4647J3066J0224O134R87m507r145j1978j2981j2788j1902
59281G79349j0365q098n248k067J277M626P647R928J1374J2400J3676J5514J7551
59268H47564J9081J9734J9686J9224J8228J6330J3530J0410P483M417L10n091
59256I90906j0692j4897j7102j8050j8664j9073j8917j8209j7283j6162j4567
59245H07290j2593j0732r051o948m157j472J13P57J622L367N450P010P882Q395
59231G96933Q671Q527P827O550M646K122p91l759o514q778j0269j1036j1599j2437
59217G70093j3555j4696j5703j6285j5847j4168j2017j0444r479q264o486m918
$$ plain form
59205 628231 623952 619726 615843 612912 611146 610210 609461 608343 606848 605591 605196 605658 606541 607621 609066
59190 609066 611118 613981 617802 622308 626693 630489 634452 639837 646721 653797 660009 665650 671601 678291
59176 678291 685936 695029 705731 717144 728034 738186 748411 759345 770857 782585 794350 805911
59164 805911 816912 827427 838102 849369 860705 871022 879705 886939 892984 897434 899407 898380 894520
59151 894520 888170 879296 867731 853721 837969 821239 804229 787665 772015 757130 742668 729000
59139 729000 717168 707774 700354 694107 688743 684293 680565 677341 674833 673436 673116 673360 673670 673964 674693
59124 674693 676708 680637 686132 692057 697713 703539 710395 718653 728374 739663 752120 764398 775188
59111 775188 784451 793017 801237 808885 816155 823671 831308 837912 842561 845458 847266 848250 848418 847930 846891
$$ packed form
59205F28231m279m226l883k931j766r36p49j118j495j257l95M62Q83J080J445
59190F09066K052K863L821M506M385L796L963N385O884P076O212N641N951O690
59176F78291P645R093J0702J1413J0890J0152J0225J0934J1512J1728J1765J1561
59164H05911J1001J0515J0675J1267J1336J0317Q683P234O045M450J973j027l860
59151H94520o350q874j1565j4010j5752j6730j7010j6564j5650j4885j4462j3668
59139G29000j1832r394p420o247n364m450l728l224k508j397l20K44L10K94P29
59124F74693K015L929N495N925N656N826O856Q258R721J1289J2457J2278J0790
59111G75188R263Q566Q220P648P270P516P637O604M649K897J808R84J68m88j039
$$ plain form
59096 846891 845169 842832 840363 838065 835607 832532 828942 825292 821790 818412 815337 812904 811163 809649
59082 809649 807594 804246 799158 792377 784283 775151 764986 753889 742392 731275 721121 711984 703366
59069 703366 694592 685574 677155 670267 664774 659712 654732 650557 647603 644930 641360 637128 633508 631015
59055 631015 628985 626932 625284 624365 623545 622050 620052 618165 616255 613692 610709 608610 608244 608869 609013
59040 609013 608124 606926 606437 607162 609096 611897 614888 617359 619253 621371 624697 629591 635753 642764 650471
59025 650471 658992 668546 679228 690831 702950 715360 728173 741477 754956 768013 780123 790932
59013 790932 800131 807462 812798 816038 817045 815872 812973 809011 804555 800181 796709 794969 795285 797357
58999 797357 800695 805017 810301 816713 824513 833730 843856 854052 863748 872872 881478 889385 896345 902354
$$ packed form
59096H46891j722k337k469k298k458l075l590l650l502l378l075k433j741j514
59082H09649k055l348n088o781q094r132j0165j1097j1497j1117j0154r137q618
59069G03366q774r018q419o888n493n062m980m175k954k673l570m232l620k493
59055F31015k030k053j648r19q20j495j998j887j910k563k983k099l66O25J44
59040F09013q89j198m89P25J934K801K991K471J894K118L326M894O162P011P707
59025F50471Q521R554J0682J1603J2119J2410J2813J3304J3479J3057J2110J0809
59013G90932R199P331N336L240J007j173k899l962m456m374l472j740L16K072
58999G97357L338M322N284O412P800R217J0126J0196R696R124Q606P907O960O009
$$ plain form
58985 902354 907452 911210 912731 911419 907705 902736 897298 891348 884848 878767 874744 873772 875636 879638
58971 879638 885334 892388 900364 909172 919366 931522 945559 961043 977796 995607 1013578 1030529
58959 1030529 1046098 1060796 1074699 1086549 1094462 1097321 1095307 1089251 1079718 1066666 1049928 1029970
58947 1029970 1007987 985175 962092 938947 916252 894891 875657 859085 845505 834805 826194
58936 826194 818755 812355 807635 804924 803410 801561 798283 793722 789084 785532 783061 780617 777467 774071
58922 774071 771192 768603 765462 761790 758655 756756 755671 754853 754562 755202 756337 757122 757568 758737 761693
58907 761693 766648 773194 781043 790386 801628 814852 829619 845467 862539 881406 902061 923439
58895 923439 944342 964781 985966 1008810 1032720 1056219 1078674 1101023 1124633 1149906 1176452
$$ packed form
58985I02354N098L758J521j312l714m969n438n950o500o081m023r72J864M002
58971H79638N696P054P976Q808J0194J2156J4037J5484J6753J7811J7971J6951
58959A030529J5569J4698J3903J1850P913K859k014o056r533j3052j6738j9958
58947A029970k1983k2812k3083k3145k2695k1361j9234j6572j3580j0700q611
58936H26194p439o400m720k711j514j849l278m561m638l552k471k444l150l396
58922G74071k879k589l141l672l135j899j085q18k91O40J135P85M46J169K956
58907G61693M955O546P849R343J1242J3224J4767J5848J7072J8867K0655K1378
58895I23439K0903K0439K1185K2844K3910K3499K2455K2349K3610K5273K6546
$$ plain form
58884 1176452 1204244 1233677 1264261 1294105 1321231 1344850 1364777 1380169 1389744 1392979 1390262 1381950
58872 1381950 1368107 1349163 1325994 1299151 1268820 1235870 1202301 1170152 1140310 1112656 1086980
58861 1086980 1063416 1042225 1023466 1006780 991388 976426 961358 945987 930353 914926 900563
58850 900563 887692 875717 863852 852395 842356 833899 826041 818050 810184 802731 795214 787112 778610
58837 778610 770030 761124 751600 741891 732748 724382 716617 709558 703549 698628 694541 691095 688137 685410
58823 685410 682961 681547 682147 685064 689727 695260 700964 706415 711463 716231 720971 725887 731002 736002
58809 736002 740292 743542 746106 748461 750309 750843 750021 748846 748072 747232 745345 742095 737893 733250 728563
58794 728563 724118 719886 715618 711375 707552 704136 700571 696740 693449 691422 690441 690075 690680 692875 696471
$$ packed form
58884A176452K7792K9433L0584K9844K7126K3619J9927J5392R575L235k717q312
58872A381950j3843j8944k3169k6843l0331l2950l3569l2149k9842k7654k5676
58861A086980k3564k1191j8759j6686j5392j4962j5068j5371j5634j5427j4363
58850I00563j2871j1975j1865j1457j0039q457p858p991p866p453p517q102q502
58837G78610q580q906r524r709r143q366p765p059o009m921m087l446k958k727
58823F85410k449j414O00K917M663N533N704N451N048M768M740M916N115N000
58809G36002M290L250K564K355J848N34q22j175p74q40j887l250m202m643m687
58794G28563m445m232m268m243l823l416l565l831l291k027r81l66O05K195L596
$$ plain form
58779 696471 700723 705328 710364 715499 720030 723547 725888 726604 725308 722472 719105 715598 711550 706702
58765 706702 701351 695787 690134 684963 681322 679677 679238 678819 678154 678009 679126 681371 683986 686493 689139
58750 689139 692362 696063 699825 703741 708401 713844 719110 723348 726886 730713 735299 740581 746785 754422
58736 754422 763450 773038 782271 790719 798364 805455 812393 819415 826403 833312 840574 848674 857407 865997
58722 865997 873793 880561 886359 891656 897292 903656 910074 915670 920708 926347 933062 940169 947027 953846
58708 953846 960859 967385 972237 974776 975097 973365 969341 962498 952425 939221 923479 905732 885965
58695 885965 864016 840470 816777 794277 773406 753984 736017 719932 706085 694288 683920
58684 683920 674509 666114 658947 652668 646414 639710 633018 627104 622215 618226 615242 613448 612536 611875 611288
$$ packed form
58779F96471M252M605N036N135M531L517K341P16j296k836l367l507m048m848
58765G06702n351n564n653n171l641j645m39m19o65j45J117K245K615K507K646
58750F89139L223L701L762L916M660N443N266M238L538L827M586N282O204P637
58736G54422R028R588R233Q448P645P091O938P022O988O909P262Q100Q733Q590
58722H65997P796O768N798N297N636O364O418N596N038N639O715P107O858O819
58708I53846P013O526M852K539L21j732m024o843j0073j3204j5742j7747j9767
58695H85965k1949k3546k3693k2500k0871j9422j7967j6085j3847j1797j0368
58684F83920r411q395p167o279o254o704o692n914m889l989k984j794r12o61n87
$$ plain form
58669 611288 611210 612114 614255 617942 623550 631161 640515 651335 663285 675646 687537 698485 708324 716456
58655 716456 721849 724039 723668 721705 718442 713651 707542 701123 695500 690958 686815 682235 677141 672154
58641 672154 667657 663323 658885 655019 652902 652917 654313 656192 658414 661435 665648 671049 677197 683275 688410
58626 688410 692119 694446 695729 696468 697334 698910 701238 703841 706310 708743 711621 715546 721164 729006 739038
58611 739038 750456 762174 773654 785117 796830 808194 817704 823952 826617 826387 824142 820505 815972
58598 815972 810942 805506 799685 793987 789208 785434 781704 777117 771936 767297 764217 763281 764926 769356
58584 769356 776221 784859 794895 806364 819259 833147 847192 860519 872740 884211 895501 906576
58572 906576 916886 926227 934947 943290 951318 959736 969908 982493 996875 1012594 1030477 1051470
$$ packed form
58669F11288p8R04K141L687N608P611R354J0820J1950J2361J1891J0948R839Q132
58655G16456N393K190l71j963l263m791o109o419n623m542m143m580n094m987
58641F72154m497m334m438l866k117J5J396J879K222L021M213N401O148O078N135
58626F88410L709K327J283P39Q66J576K328K603K469K433K878L925N618P842J0032
58611G39038J1418J1718J1480J1463J1713J1364R510O248K665k30k245l637m533
58598H15972n030n436n821n698m779l774l730m587n181m639l080r36J645M430
58584G69356O865Q638J0036J1469J2895J3888J4045J3327J2221J1471J1290J1075
58572I06576J0310R341Q720Q343Q028Q418J0172J2585J4382J5719J7883K0993
$$ plain form
58560 1051470 1075006 1099613 1124626 1150072 1175109 1197876 1217068 1232696 1245071 1253877 1258509 1258651
58548 1258651 1254364 1246186 1235369 1223439 1211282 1198991 1186602 1174408 1162437 1150059 1136327 1120455
58536 1120455 1102016 1081131 1058581 1035517 1012989 991773 972322 954562 938097 923009 910145
58525 910145 900230 893018 887809 884464 883332 884401 887033 890353 893583 896371 899160 902704 906732 909786
58511 909786 911022 911477 912719 914876 917015 918794 920485 921802 922055 921359 920493 919662 918462 916937 915488
58496 915488 913840 911319 908161 905304 902819 899814 896014 892152 888585 884900 881421 879780 881180 884953
58482 884953 889573 894439 900075 907181 916063 926628 938538 951629 966123 981923 997764 1011760
58470 1011760 1022796 1030688 1035192 1035832 1032831 1027202 1019685 1010435 999934 989371 979848 971987 966349
$$ packed form
58560A051470K3536K4607K5013K5446K5037K2767J9192J5628J2375Q806M632J42
58548A258651m287q178j0817j1930j2157j2291j2389j2194j1971j2378j3732j5872
58536A120455j8439k0885k2550k3064k2528k1216j9451j7760j6465j5088j2864
58525I10145r915p212n209l345j132J069K632L320L230K788K789L544M028L054
58511I09786J236M55J242K157K139J779J691J317K53o96q66q31j200j525j449
58496I15488j648k521l158k857k485l005l800l862l567l685l479j641J400L773
58482H84953M620M866N636P106Q882J0565J1910J3091J4494J5800J5841J3996
58470A011760J1036P892M504O40l001n629p517r250j0501j0563r523p861n638
$$ plain form
58457 966349 963362 962574 962912 963966 966277 970199 975304 981065 987285 993617 999395 1004071 1007102 1007505 1004498
58442 1004498 998617 991199 982779 973101 962731 953359 946245 941550 939347 939980 942970 946882 950834 955161
58428 955161 960291 966202 973371 982837 994556 1006915 1018656 1030289 1042852 1056291 1069761 1082499
58416 1082499 1093505 1101255 1104739 1104316 1101013 1095589 1088686 1081030 1072829 1063650 1053347 1042432 1031233
58403 1031233 1019661 1008193 998134 990205 983716 977709 972157 967559 964118 961824 960604 959988 959362 958812
58389 958812 958926 959643 960334 961137 962918 965578 967736 968655 969277 970762 973211 976440 980764 986224 992062 997693
58373 997693 1003349 1009337 1015673 1022801 1031420 1041130 1050554 1059242 1068186 1078049 1088392 1099170 1111332
58360 1111332 1125200 1139842 1154827 1170932 1188192 1204940 1219867 1233389 1245935 1256521 1264302
$$ packed form
58457I66349k987p88L38J054K311L922N105N761O220O332N778M676L031M03l007
58442A004498n881p418q420r678j0370r372p114m695k203O33K990L912L952M327
58428I55161N130N911P169R466J1719J2359J1741J1633J2563J3439J3470J2738
58416A082499J1006P750L484m23l303n424o903p656q201r179j0303j0915j1199
58403A031233j1572j1468j0059p929o489o007n552m598l441k294j220o16o26n50
58389I58812J14P17O91Q03J781K660K158R19O22J485K449L229M324N460N838N631
58373I97693N656N988O336P128Q619R710R424Q688Q944R863J0343J0778J2162
58360A111332J3868J4642J4985J6105J7260J6748J4927J3522J2546J0586P781
$$ plain form
58349 1264302 1269923 1273959 1275650 1274741 1273125 1272946 1274226 1275928 1278209 1282028 1287540 1294509 1303437 1314784
58335 1314784 1327915 1342142 1357937 1375763 1394671 1413386 1431925 1450793 1469493 1487166 1503881
58324 1503881 1520015 1535172 1548775 1560783 1570780 1577613 1581243 1583828 1587563 1592461 1597563 1603125 1610048
58311 1610048 1618168 1626771 1636130 1647173 1660282 1675483 1692953 1712306 1732364 1752649 1773990 1796746
58299 1796746 1819767 1842179 1864760 1888341 1912289 1935793 1959204 1982878 2006305 2029645 2054445
58288 2054445 2081457 2109437 2137460 2166482 2197102 2227905 2257937 2288869 2322608 2358464 2394672
58277 2394672 2431024 2468038 2505374 2543151 2583124 2626419 2671758 2717834 2765583 2816176 2868895
58266 2868895 2923242 2980871 3042958 3107842 3173883 3242572 3316027 3393403 3472585 3553507 3637030
$$ packed form
58349A264302N621M036J691r09j616j79J280J702K281L819N512O969Q928J1347
58335A314784J3131J4227J5795J7826J8908J8715J8539J8868J8700J7673J6715
58324A503881J6134J5157J3603J2008R997O833L630K585L735M898N102N562O923
58311A610048Q120Q603R359J1043J3109J5201J7470J9353K0058K0285K1341K2756
58299A796746K3021K2412K2581K3581K3948K3504K3411K3674K3427K3340K4800
58288B054445K7012K7980K8023K9022L0620L0803L0032L0932L3739L5856L6208
58277B394672L6352L7014L7336L7777L9973M3295M5339M6076M7749N0593N2719
58266B868895N4347N7629O2087O4884O6041O8689P3455P7376P9182Q0922Q3523
$$ plain form
58255 3637030 3722494 3809197 3898247 3990207 4083105 4175638 4270053 4368900 4471467 4576607 4686468
58244 4686468 4803899 4928790 5060599 5201722 5354372 5516753 5686635 5866186 6058966
58235 6058966 6264689 6481477 6710782 6955385 7214960 7488477 7778689 8089519 8421477
58226 8421477 8774459 9152266 9559316 9995862 10461831 10962345 11503948 12088842 12718901
58217 12718901 13401894 14147447 14960855 15848184 16823925 17906271 19108952 20446095 21941770
58208 21941770 23627073 25533106 27697448 30175216 33036664 36361535 40249060 44830480
58200 44830480 50260904 56702829 64325984 73311725 83839872 96078837 110209319 126454199
58192 126454199 145060435 166230737 190039855 216351032 244761359 274636349 305184664
$$ packed form
58255C637030Q5464Q6703Q9050R1960R2898R2533R4415R8847J02567J05140J09861
58244D686468J17431J24891J31809J41123J52650J62381J69882J79551J92780
58235F058966K05723K16788K29305K44603K59575K73517K90212L10830L31958
58226H421477L52982L77807M07050M36546M65969N00514N41603N84894O30059
58217A2718901O82993P45553Q13408Q87329R75741J082346J202681J337143J495675
58208B1941770J685303J906033K164342K477768K861448L324871L887525M581420
58200D4830480N430424O441925P623155Q985741J0528147J2238965J4130482J6244880
58192A26454199J8606236K1170302K3809118K6311177K8410327K9874990L0548315
$$ plain form
58185 305184664 335343737 363374037 386552319 401585944 405812643 398403703 380683132
58178 380683132 355463471 326028707 295336641 265545233 237799564 212336062 188901246
58171 188901246 167223478 147235349 129020376 112680061 98257701 85710643 74905530
58164 74905530 65648917 57738898 50991806 45237483 40318322 36101304 32478906 29356282
58156 29356282 26648123 24287048 22222482 20409063 18804126 17375035 16098712 14953148
58148 14953148 13916767 12974892 12118445 11336539 10617355 9955120 9348671 8793714 8283178
58139 8283178 7814012 7386481 6997291 6639883 6310922 6010076 5733696 5474758 5229030
58130 5229030 4996058 4774591 4562431 4360453 4171553 3995652 3830124 3674367 3529358
$$ packed form
58185C05184664L0159073K8030300K3178282J5033625M226699p408940j7720571
58178C80683132k5219661k9434764l0692066k9791408k7745669k5463502k3434816
58171A88901246k1677768j9988129j8214973j6340315j4422360j2547058j0805113
58164G4905530r256613p910019o747092n754323m919161m217018l622398l122624
58156B9356282k708159k361075k064566j813419j604937j429091j276323j145564
58148A4953148j036381r41875q56447p81906p19184o62235o06449n54957n10536
58139H283178m69166m27531l89190l57408l28961l00846k76380k58938k45728
58130E229030k32972k21467k12160k01978j88900j75901j65528j55757j45009
$$ plain form
58121 3529358 3393535 3263972 3140980 3026962 2921350 2821195 2725947 2636999 2553232 2471828
58111 2471828 2393012 2319272 2250216 2182855 2116793 2054466 1996236 1939823 1884836 1833327 1785361
58100 1785361 1738313 1691332 1646552 1604957 1564677 1524371 1485101 1447986 1412909 1380221 1350851
58089 1350851 1324087 1297837 1271526 1246406 1222899 1200164 1178253 1158009 1138746 1118716 1097973
58078 1097973 1078209 1059706 1041002 1021574 1002280 983249 963950 945298 928937 914321 899137
58067 899137 882791 866940 852563 839100 826584 815913 806726 797442 787716 778555 769935 760695 750828
58054 750828 741417 732189 721655 709833 698357 687816 677472 667668 659788 653556 647139 640387 635291
58041 635291 632533 630162 626469 621864 617092 611814 605814 599667 593504 586900 580327 574766 569492 562440
$$ packed form
58121C529358j35823j29563j22992j14018j05612j00155r5248q8948q3767q1404
58111B471828p8816p3740o9056o7361o6062o2327n8230n6413n4987n1509m7966
58100A785361m7048m6981m4780m1595m0280m0306l9270l7115l5077l2688k9370
58089A350851k6764k6250k6311k5120k3507k2735k1911k0244j9263k0030k0743
58078A097973j9764j8503j8704j9428j9294j9031j9299j8652j6361j4616j5184
58067H99137j6346j5851j4377j3463j2516j0671r187r284r726r161q620r240r867
58054G50828r411r228j0534j1822j1476j0541j0344r804p880o232o417o752n096
58041F35291k758k371l693m605m772n278o000o147o163o604o573n561n274p052
$$ plain form
58027 562440 553150 543268 533748 523876 513573 504227 496437 489153 481923 475809 471183 466647 461239 455808
58013 455808 451252 447203 443434 440778 439593 438871 437806 436760 435947 434799 433438 433128 434346 435882 436718
57998 436718 437382 438695 440694 443509 447659 452617 456582 458675 459996 461674 463278 464027 464202 464378 464473 464440
57982 464440 464781 465601 466269 466565 466990 467398 466759 464939 463318 462843 462853 462602 462488 462822 462716 461356 459343 457797
57964 457797 456920 456225 455331 453913 451785 449531 448072 447291 446189 444661 443578 442761 440564 436240 431036
57949 431036 426089 420942 415294 410548 408057 407096 406063 404745 404038 404327 405617 408527 413706 420630 428133
57934 428133 435787 443872 452473 461514 471179 481345 490987 498945 504926 509120 511349 511351 509492 506479 502639
57919 502639 497923 492269 485537 477533 468430 458805 449066 439320 429821 420808 411863 402400 392951 384949
$$ packed form
58027E62440r290r882r520r872j0303r346p790p284p230o114m626m536n408n431
58013D55808m556m049l769k656j185p22j065j046q13j148j361l10J218J536Q36
57998D36718O64J313J999K815M150M958L965K093J321J678J604P49J75J76R5l3
57982D64440L41Q20O68K96M25M08o39j820j621m75J0k51j14L34j06j360k013j546
57964D57797q77o95q94j418k128k254j459p81j102j528j083q17k197m324n204
57949D31036m947n147n648m746k491r61j033j318p07K89J290K910N179O924P503
57934D28133P654Q085Q601R041R665J0166R642P958N981M194K229Kj859l013l840
57919E02639m716n654o732q004r103r625r739r746r499r013q945r463r449q002
$$ plain form
57905 384949 378961 374155 369761 365838 362184 357788 352057 345573 339037 332527 326341 321356 317803 314744
57891 314744 311568 308957 307627 307148 306865 306883 307240 307117 305947 304452 303583 303200 302766 302548 303051 303903 304303
57874 304303 304019 303134 301407 298804 296015 293632 291398 289067 287271 286626 286669 286747 287404 289729 293649 297931
57858 297931 301725 305341 309658 315391 322707 330923 338777 345441 351079 356228 361165 366177 371666 377441
57844 377441 382472 385886 387651 387967 386766 384310 381457 378665 375441 371302 366589 361821 357067 352492
57830 352492 348615 345367 341871 337907 334688 333399 333820 335142 337085 339337 341005 341804 342862 345097 347674
57815 347674 349352 350560 352677 355842 358924 361245 362898 363664 362991 360923 357826 353387 347046 339333 331648
57800 331648 324800 318704 313313 308721 304471 299894 295187 291203 288182 285617 283246 281196 279159 276534
$$ packed form
57905C84949n988m806m394l923l654m396n731o484o536o510o186m985l553l059
57891C14744l176k611j330m79k83J8L57j23j170j495q69l83m34k18N03Q52M00
57874C04303k84q85j727k603k789k383k234k331j796o45M3P8O57K325L920M282
57858B97931L794L616M317N733P316Q216P854O664N638N149M937N012N489N775
57844C77441N031L414J765L16j201k456k853k792l224m139m713m768m754m575
57830C52492l877l248l496l964l219j289M21J322J943K252J668P99J058K235K577
57815C47674J678J208K117L165L082K321J653P66o73k068l097m439o341p713p685
57800C31648o848o096n391m592m250m577m707l984l021k565k371k050k037k625
$$ plain form
57786 276534 273470 270841 268971 267247 265226 263378 262424 262505 263245 264247 265476 267435 270833 275702 281051
57771 281051 285761 289461 292085 293221 292732 291550 290835 290477 289313 286673 282853 278186 272655 266498 260287
57756 260287 254177 247804 241150 234937 229895 226107 223228 221040 219650 219356 220234 221718 222893 223465 224003
57741 224003 224855 225373 224828 223665 223076 223586 224736 225850 226453 226167 224982 223569 222719 222599 223042 224224 226389
57724 226389 229155 231757 233787 235175 235818 235855 235912 236303 236414 235704 234920 235264 236599 237542 237246 236113 234683
57707 234683 232830 230301 227245 224000 220981 218822 217975 218076 218294 218316 218440 218820 219319 220082 221546 223766
57691 223766 226286 228629 230413 231178 230771 229849 229366 229699 230850 233191 237200 242683 249258 257494 268609
57676 268609 283064 300475 321092 346303 377333 414250 456492 503559 554843 609569 667263
$$ packed form
57786B76534l064k629j870j724k021j848r54Q1P40J002J229J959L398M869N349
57771B81051M710L700K624J136m89j182p15l58j164k640l820m667n531o157o211
57756B60287o110o373o654o213n042l788k879k188j390k94Q78J484J175N72N38
57741B24003Q52N18n45j163n89N10J150J114O03k86j185j413q50j20M43J182K165
57724B26389K766K602K030J388O43L7N7L91J11p10p84L44J335R43k96j133j430
57707B34683j853k529l056l245l019k159q47J01K18K2J24L80M99P63J464K220
57691B23766K520K343J784P65m07r22m83L33J151K341M009N483O575Q236J1115
57676B68609J4455J7411K0617K5211L1030L6917M2242M7067N1284N4726N7694
$$ plain form
57665 667263 727324 787298 841691 882930 903758 899634 870529 821312 759865 693755 628030 565499
57653 565499 507996 456890 412847 375723 344786 319045 297621 279899 265269 252931 242239
57642 242239 233016 225193 218410 212439 207699 204638 202791 201121 199199 197366 195863 194599 193802 194000 195114
57627 195114 196247 196677 196463 195859 194726 192873 190533 188139 185914 183816 181618 178930 175470 171379 167082
57612 167082 162964 159498 157389 156977 157570 157980 157752 157397 157483 158162 159561 161901 164922 167690 169299 169563
57596 169563 168947 168049 167109 165800 163643 160780 157999 155692 153364 150715 148553 147711 147523 146486 144242
57581 144242 141755 139629 137490 135231 133545 132720 131877 130067 127435 124717 122179 119617 117026 114751 113106
57566 113106 112074 111215 109913 108022 106180 105081 104619 104264 104017 104226 104671 104794 104814 105657 107560 109676 111291
$$ packed form
57665F67263O0061N9974N4393M1239K0828m124k9105m9217o1447o6110o5725o2531
57653E65499n7503n1106m4043l7124l0937k5741k1424j7722j4630j2338j0692
57642B42239r223p823o783n971m740l061j847j670j922j833j503j264p97J98J114
57627A95114J133M30k14o04j133j853k340k394k225k098k198k688l460m091m297
57612A67082m118l466k109m12N93M10k28l55Q6O79J399K340L021K768J609K64
57596A69563o16q98r40j309k157k863k781k307k328k649k162q42j88j037k244
57581A44242k487k126k139k259j686q25q43j810k632k718k538k562k591k275j645
57566A13106j032q59j302j891j842j099m62l55k47K09M45J23K0Q43J903K116J615
$$ plain form
57549 111291 112581 113871 114996 115859 116870 118345 119979 121313 122219 122677 122665 122550 122998 124210 125821 127687
57533 127687 130067 132677 134331 134062 132104 129382 126521 123768 121383 119656 118746 118755 119616 120838 121778 122312
57517 122312 122821 123530 124424 125762 127866 130291 131984 132508 132392 132123 131611 130905 130523 130626 130670 130373 130230 130581
57499 130581 130880 130410 129085 127029 124124 120564 117173 114474 112018 109283 106709 105079 104310 103600 102460
57484 102460 100965 99274 97531 96043 94998 94190 93429 93030 93424 94482 95567 96143 96097 95705 95445 95521 95382
57467 95382 94152 91793 89398 88059 87823 88004 88005 87592 86881 86413 86788 87931 89181 90267 91544 93030 94024
57450 94024 94194 94259 94932 95804 95982 95412 94847 94866 95520 96605 97721 98364 98438 98415 98610 98748 98620 98564 98774 98768 98311
57429 98311 98308 99824 102449 104556 105184 104948 105013 105732 106447 106303 105156 103831 103354 103851 104467 104458 103948 103418 102996
$$ packed form
57549A11291J290J290J125Q63J011J475J634J334R06M58j2j15M48J212J611J866
57533A27687K380K610J654k69j958k722k861k753k385j727r10RQ61J222R40N34
57517A22312N09P09Q94J338K104K425J693N24j16k69n12p06l82J03M4k97j43L51
57499A30581K99m70j325k056k905l560l391k699k456k735k574j630p69p10j140
57484A02460j495j691j743j488j045q08p61l99L94J058J085N76m6l92k60P6j39
57467I5382j230k359k395j339k36J81Jm13p11m68L75J143J250J086J277J486R94
57450I4024J70O5O73Q72J78n70n65J9O54J085J116O43P4k3J95J38j28n6K10om57
57429I8311lJ516K625K107O28k36O5P19P15j44j147j325m77M97O16rn10n30m22
$$ plain form
57410 102996 102633 102430 102396 102286 102082 102211 102897 103811 104710 105842 107175 107908 107468 106538 106342 107262 108794 110523
57392 110523 112391 114288 116066 117859 119827 121723 123193 124251 125061 125619 126173 127522 130246 133924 137615
57377 137615 140781 143237 144668 144988 144823 144946 145468 146198 147365 149212 151144 152187 152153 151665 151222 150968 151181
57360 151181 152058 153133 153689 153824 154408 155998 158422 161360 164565 167500 169580 170918 172284 174208 176597
57345 176597 179244 182077 184871 187312 189536 192126 195441 199293 203243 206858 209788 212069 214329 217243
57331 217243 220866 224870 229161 233735 238153 241886 245185 248918 253577 258986 264910 271233 277475 282853
57317 282853 287084 290736 294677 299534 305551 312411 319177 325054 330331 336154 343301 351622 360610 369948
57303 369948 379435 388970 398756 409080 419755 430245 440403 450696 461595 473098 484823 496229
$$ packed form
57410A02996l63k03l4j10k04J29O86R14Q99J132J333P33m40r30j96R20J532J729
57392A10523J868J897J778J793J968J896J470J058Q10N58N54J349K724L678L691
57377A37615L166K456J431L20j65J23N22P30J167J847J932J043l4m88m43k54K13
57360A51181Q77J075N56J35N84J590K424K938L205K935K080J338J366J924K389
57345A76597K647K833K794K441K224K590L315L852L950L615K930K281K260K914
57331B17243L623M004M291M574M418L733L299L733M659N409N924O323O242N378
57317B82853M231L652L941M857O017O860O766N877N277N823P147Q321Q988R338
57303C69948R487R535R786J0324J0675J0490J0158J0293J0899J1503J1725J1406
$$ plain form
57291 496229 506850 516796 526996 538484 551471 565511 580329 595929 612137 628760 646100 664456
57279 664456 683174 701175 718565 736730 756445 776780 796391 815080 833366 851134 867607
57268 867607 882403 895853 908318 919828 930461 940585 950542 960381 970046 979641 989351 999266 1009492
57255 1009492 1020416 1032524 1045692 1058894 1071093 1082500 1094501 1108226 1123666 1140398 1158523
57244 1158523 1178284 1199222 1220408 1241393 1262444 1283993 1306347 1329692 1353875 1378358 1402837
57233 1402837 1427608 1452839 1477969 1502590 1527548 1554216 1582835 1612595 1643238 1675459 1709497
57222 1709497 1744495 1779738 1815707 1853307 1892706 1933423 1974987 2016990 2058958 2100700 2142439
57211 2142439 2184280 2225844 2266787 2307326 2347997 2389149 2430995 2473781 2517690 2562851 2609579
$$ packed form
57291D96229J0621R946J0200J1488J2987J4040J4818J5600J6208J6623J7340J8356
57279F64456J8718J8001J7390J8165J9715K0335J9611J8689J8286J7768J6473
57268H67607J4796J3450J2465J1510J0633J0124R957R839R665R595R710R915J0226
57255A009492J0924J2108J3168J3202J2199J1407J2001J3725J5440J6732J8125
57244A158523J9761K0938K1186K0985K1051K1549K2354K3345K4183K4483K4479
57233A402837K4771K5231K5130K4621K4958K6668K8619K9760L0643L2221L4038
57222A709497L4998L5243L5969L7600L9399M0717M1564M2003M1968M1742M1739
57211B142439M1841M1564M0943M0539M0671M1152M1846M2786M3909M5161M6728
$$ plain form
57200 2609579 2658281 2708971 2761256 2814916 2869997 2926227 2982992 3040184 3098394 3157778 3217324
57189 3217324 3275941 3333922 3392617 3452827 3514118 3575599 3636673 3696945 3755983 3813486 3869367
57178 3869367 3923447 3975289 4024555 4071386 4116219 4159252 4200220 4238704 4274536 4307884 4339138
57167 4339138 4368874 4397864 4426899 4456471 4486701 4517541 4548896 4580573 4612356 4644183 4676076
57156 4676076 4707882 4739313 4770192 4800349 4829342 4856890 4883607 4910524 4937478 4962656 4984316
57145 4984316 5002391 5017750 5030474 5039757 5045150 5046813 5044647 5038122 5027120 5012146 4993600 4971696
57133 4971696 4947398 4922661 4899255 4877753 4857957 4839851 4823728 4809775 4798050 4788761 4782186 4778190
57121 4778190 4775771 4773064 4767997 4759379 4747620 4734439 4722040 4712621 4708268 4710661 4720615 4738135 4763157
$$ packed form
57200B609579M8702N0690N2285N3660N5081N6230N6765N7192N8210N9384N9546
57189C217324N8617N7981N8695O0210O1291O1481O1074O0272N9038N7503N5881
57178C869367N4080N1842M9266M6831M4833M3033M0968L8484L5832L3348L1254
57167D339138K9736K8990K9035K9572L0230L0840L1355L1677L1783L1827L1893
57156D676076L1806L1431L0879L0157K8993K7548K6717K6917K6954K5178K1660
57145D984316J8075J5359J2724R283N393J663k166o525j1002j4974j8546k1904
57133D971696k4298k4737k3406k1502j9796j8106j6123j3953j1725r289o575l996
57121D778190k419k707n067q618j1759j3181j2399r419m353K393R954J7520K5022
$$ plain form
57108 4763157 4796484 4840404 4898811 4976821 5080219 5215334 5389314 5610327 5887644 6232060
57098 6232060 6656336 7174561 7800190 8543517 9409529 10396862 11498690 12704972 14003876
57089 14003876 15381930 16824426 18312784 19810474 21241682 22491500 23454209 24107556
57081 24107556 24545112 24922249 25352707 25841286 26298682 26607648 26680386 26478709 26006758
57072 26006758 25294121 24378788 23295573 22073836 20741886 19331275 17877647 16419054
57064 16419054 14992543 13629524 12352436 11174780 10102911 9137257 8273478 7504753
57056 7504753 6823613 6221874 5690423 5220678 4805995 4440830 4119187 3834777 3581938
57047 3581938 3355450 3150164 2962075 2789437 2631912 2488862 2359009 2240857 2132418
$$ packed form
57108D763157L3327M3920N8407P8010J03398J35115J73980K21013K77317L44416
57098F232060M24276N18225O25629P43327Q66012R87333J101828J206282J298904
57089A4003876J378054J442496J488358J497690J431208J249818R62709O53347
57081B4107556M37556L77137M30458M88579M57396L08966P2738k01677m71951
57072B6006758p12637r15333j083215j221737j331950j410611j453628j458593
57064A6419054j426511j363019j277088j177656j071869r65654q63779p68725
57056G504753o81140o01739n31451m69745m14683l65165l21643k84410k52839
57047C581938k26488k05286j88089j72638j57525j43050j29853j18152j08439
$$ plain form
57038 2132418 2031114 1935039 1843964 1758292 1677660 1601552 1530632 1466334 1409625 1361123 1321844
57027 1321844 1292504 1272527 1261069 1258838 1267622 1288042 1318722 1357291 1400441 1442377 1474228 1486202
57015 1486202 1471163 1427472 1359723 1276799 1188124 1100869 1019769 947867 886075 832809 785662
57004 785662 743684 707254 676198 649309 625633 604921 586615 569576 553184 537879 524273
56993 524273 512450 502330 493957 487201 481860 478306 477320 479000 482391 486421 490659 494956 498899 501845
56979 501845 503093 501808 497262 489354 478710 466268 453068 440310 428982 419295 410811 403193 396597
56966 396597 391497 388580 388658 392123 398471 406749 416453 427633 440226 453802 467790 481421 493335
56953 493335 501742 505111 502585 494081 480490 463686 445787 428272 412025 397867 386512 378038
$$ packed form
57038B132418j01304r6075r1075q5672q0632p6108p0920o4298n6709m8502l9279
57027A321844k9340j9977j1458k231Q784K0420L0680L8569M3150M1936L1851J1974
57015A486202j5039m3691o7749q2924q8675q7255q1100p1902o1792n3266m7147
57004G85662m1978l6430l1056k6889k3676k0712j8306j7039j6392j5305j3606
56993E24273j1823j0120q373o756n341l554r86J680L391M030M238M297L943K946
56979E01845J248j285m546p908j0644j2442j3200j2758j1328r687q484p618o596
56966C96597n100k917P8L465O348Q278R704J1180J2593J3576J3988J3631J1914
56953D93335Q407L369k526q504j3591j6804j7899j7515j6247j4158j1355q474
$$ plain form
56941 378038 371959 367889 365905 366392 369834 376567 386388 398594 412684 428683 446437 464985 483029
56928 483029 499497 513052 521560 522905 516279 502311 482416 458697 433871 410046 387596 365979
56916 365979 345581 327812 313425 301659 291233 281521 272688 265318 260058 257019 255418 254258 253334
56903 253334 253103 253730 254955 256814 259824 264402 270611 278367 287308 296630 305715 314868 324865 335987
56889 335987 348171 361789 377256 393957 410525 426253 441209 454690 464501 468291 465211 456182
56877 456182 443171 428361 413424 399266 386709 377101 371564 369883 371077 375108 383100 395755 412514
56864 412514 432617 456118 483407 514393 548571 585308 623521 661226 695451 722395 738112
56853 738112 740131 728847 707051 678255 645983 614054 585983 563557 546851 535922 531706 535061
$$ packed form
56941C78038o079m070j984M87L442O733R821J2206J4090J5999J7754J8548J8044
56928D83029J6468J3555Q508J345o626j3968j9895k3719k4826k3825k2450k1617
56916C65979k0398j7769j4387j1766j0426r712q833p370n260l039j601j160r24
56903B53334k31O27J225J859L010M578O209P756Q941R322R085R153R997J1122
56889C35987J2184J3618J5467J6701J6568J5728J4956J3481R811L790l080r029
56877D56182j3011j4810j4937j4158j2557r608n537j681J194M031P992J2655J6759
56864D12514K0103K3501K7289L0986L4178L6737L8213L7705L4225K6944J5717
56853G38112K019j1284k1796k8796l2272l1929k8071k2426j6706j0929m216L355
$$ plain form
56841 535061 546058 564656 591176 625507 666665 713739 766558 824788 886971 950856 1013708
56830 1013708 1071297 1117167 1144250 1147796 1127027 1084838 1026731 959595 890264 824198 764964
56819 764964 714400 673026 640659 617004 601782 594630 595456 604891 623675 651276 685601 724359
56807 724359 766274 810585 855554 897504 931006 950154 950722 931943 896431 848538 793049 734895
56795 734895 678586 627036 581202 541234 507637 481116 461913 449750 444109 444263 449411 459048
56783 459048 472968 490666 510996 532450 553414 572104 586590 594888 594838 584431 563246 533564
56771 533564 499179 462935 426124 390047 356710 327435 301887 279257 259607 243299 229778
56760 229778 217837 206762 196615 187671 180143 174172 169642 166183 163536 161567 159792 157503 154687
$$ packed form
56841E35061J0997J8598K6520L4331M1158M7074N2819N8230O2183O3885O2852
56830A013708N7589M5870K7083L546k0769m2189n8107o7136o9331o6066n9234
56819G64964n0564m1374l2367k3655j5222p152Q26R435J8784K7601L4325L8758
56807G24359M1915M4311M4969M1950L3502J9148N68j8779l5512m7893n5489n8154
56795G34895n6309n1550m5834l9968l3597k6521j9203j2163n641J54N148R637
56783D59048J3920J7698K0330K1454K0964J8690J4486Q298n0j0407k1185k9682
56771E33564l4385l6244l6811l6077l3337k9275k5548k2630j9650j6308j3521
56760B29778j1941j1075j0147q944p528n971m530l459k647j969j775k289k816
$$ plain form
56747 154687 152218 150709 149686 148306 146442 144634 143404 142967 143188 143501 143290 142655 142347 142759 143497 144122
56731 144122 144577 144620 143701 141905 140290 139635 139493 139097 138604 138699 139417 140095 140272 140068 139869 140053 140844 142078
56713 142078 143376 144661 146142 147746 149142 150415 151930 153380 153960 153877 154606 156927 159609 160911 160665
56698 160665 159991 159623 159531 159719 160358 161323 162316 163230 163876 163757 162757 161594 160931 160456 159524 158241 157167 156402
56680 156402 155747 155338 155270 154946 153700 151815 150152 149035 148297 148078 148626 149508 149950 149887 149830 149728 148905 147280
56662 147280 145804 145402 146023 146976 147791 148527 149512 150936 152611 154196 155694 157439 159476 161424 163144 164953
56646 164953 166813 167989 168083 167807 168082 168880 169725 170786 172575 174873 176882 178259 179215 179726 179525 178849 178446
56629 178446 178715 179378 180004 180429 180722 181146 181992 183123 183929 184081 183901 183581 182587 180508 178037 176320 175683
$$ packed form
56747A54687k469j509j023j380j864j808j230m37K21L13k11o35l08M12P38O25
56731A44122M55M3r19j796j615o55j42l96m93R5P18O78J77k04j99J84P91J234
56713A42078J298J285J481J604J396J273J515J450N80q3P29K321K682J302k46
56698A60665o74l68r2J88O39R65R93R14O46j19j000j163o63m75r32j283j074p65
56680A56402o55m09o8l24j246j885j663j117p38k19N48Q82M42o3n7j02q23j625
56662A47280j476m02O21R53Q15P36R85J424J675J585J498J745K037J948J720J809
56646A64953J860J176R4k76K75P98Q45J061J789K298K009J377R56N11k01o76m03
56629A78446K69O63O26M25K93M24Q46J131Q06J52j80l20r94k079k471j717o37
$$ plain form
56612 175683 175677 175994 176501 176668 175864 174200 172419 171033 170150 169853 170072 170301 170115 169814 169921 170326 170537 170472 170311
56593 170311 169916 169158 168580 168917 170078 171253 171805 171526 170440 169045 168285 168467 168706 168217 167615 167950 169043
56576 169043 169979 170754 172055 173688 174673 174851 175091 175901 177124 178952 181891 185600 189137 192564 196976 202656
56560 202656 208612 214398 221031 229385 238792 247943 256221 263427 269141 273178 276127 278718 281091 283131
56546 283131 284945 286530 287434 287147 285507 282594 278784 275004 272232 270474 268838 266705 264121 260993 256865
56531 256865 251796 246635 242017 237862 234142 231244 229164 227220 225119 223486 222688 221885 220034 217305 214766
56516 214766 212994 211614 209975 207784 205194 202626 200383 198316 196110 193917 192264 191304 190694 190305 190450
56501 190450 191206 192063 192492 192426 191993 191321 190680 190294 189882 189002 187901 187349 187518 187786 187812 188053 188851 189797 190386
$$ packed form
56612A75683oL17N07J67q04j664j781j386q83k97K19K29j86l01J07M05K11o5j61
56593A70311l95p58n78L37J161J175N52k79j086j395p60J82K39m89o02L35J093
56576A69043R36P75J301J633R85J78K40Q10J223J828K939L709L537L427M412N680
56560B02656N956N786O633Q354R407R151Q278P206N714M037K949K591K373K040
56546B83131J814J585R04k87j640k913l810l780k772j758j636k133k584l128m128
56531B56865n069n161m618m155l720k898k080j944k101j633p98q03j851k729k539
56516B14766j772j380j639k191k590k568k243k067k206k193j653r60o10l89J45
56501A90450P56Q57M29o6m33o72o41l86m12q80j101n52J69K68K6K41P98R46N89
$$ plain form
56482 190386 190725 191183 191828 192503 192999 193014 192418 191652 191301 191283 191146 191109 191910 193595 195478 197397 199863 202676
56464 202676 204598 204999 204754 204891 205255 205223 204768 204075 202930 201369 200192 200046 200547 201003 201350 201666 201511 200679
56446 200679 200044 200682 202474 204373 205725 206554 206913 206808 206651 207028 207980 208995 209679 210117 210681 211645 212771
56429 212771 213222 212373 210860 210169 210944 212416 213765 215101 216546 217323 216731 215439 214804 215271 216262 217294
56413 217294 218336 219204 219432 218794 217481 215862 214437 213792 214176 215276 216663 218111 219206 219298 218362 217412
56397 217412 217445 218349 219482 220847 222955 225762 228455 230233 230829 230405 229443 228632 228462 228974 230036 231578
56381 231578 233337 234816 235819 236668 237637 238640 239727 241296 243370 245226 246251 246680 247033 247388 247713 248336
56365 248336 249423 250445 250904 251165 251918 253082 253901 253924 253361 252734 252622 253458 255069 256688 257758 258352 258559
$$ packed form
56482A90386L39M58O45O75M96J5n96p66l51j8j37l7Q01J685J883J919K466K813
56464B02676J922M01k45J37L64l2m55o93j145j561j177j46N01M56L47L16j55q32
56446B00679o35O38J792J899J352Q29L59j05j57L77R52J015O84M38N64R64J126
56429B12771M51q49j513o91P75J472J349J336J445P77n92j292o35M67R91J032
56413B17294J042Q68K28o38j313j619j425o45L84J100J387J448J095R2r36r50
56397B17412L3R04J133J365K108K807K693J778N96m24r62q11j70N12J062J542
56381B31578J759J479J003Q49R69J003J087J569K074J856J025M29L53L55L25O23
56365B48336J087J022M59K61P53J164Q19K3n63o27j12Q36J611J619J070N94K07
$$ plain form
56348 258559 258120 257233 257034 258494 261214 264042 266441 268527 270178 271039 271301 271672 272528 273638 274710 275812
56332 275812 277243 279271 281876 284637 287166 289771 293134 297139 300714 303214 305248 307545 309734 310979
56318 310979 311283 311384 311757 312410 313304 314269 314903 315216 316016 318012 320848 323646 326154 328792 331947 335816
56302 335816 340518 345729 350646 354931 359286 364482 370331 376253 382235 388293 393553 396982 398871 400609
56288 400609 403071 406058 409260 412892 417242 422270 427877 434215 441589 450165 459635 469155 478098 486991
56274 486991 497113 508911 521539 534290 547631 562247 577982 594544 612490 632597 654806
56263 654806 678660 704299 732228 762684 796000 833108 874920 921760 974107 1033152 1099707
56252 1099707 1173258 1253055 1339514 1433654 1535849 1646192 1765261 1893177 2028323 2168226
$$ packed form
56348B58559m39q87j99J460K720K828K399K086J651Q61K62L71Q56J110J072J102
56332B75812J431K028K605K761K529K605L363M005L575K500K034K297K189J245
56318C10979L04J01L73O53Q94R65O34L13Q00J996K836K798K508K638L155L869
56302C35816M702N211M917M285M355N196N849N922N982O058N260L429J889J738
56288D00609K462K987L202L632M350N028N607O338P374Q576R470R520Q943Q893
56274D86991J0122J1798J2628J2751J3341J4616J5735J6562J7946K0107K2209
56263F54806K3854K5639K7929L0456L3316L7108M1812M6840N2347N9045O6555
56252A099707P3551P9797Q6459R4140J02195J10343J19069J27916J35146J39903
$$ plain form
56242 2168226 2311250 2456234 2600916 2742029 2876665 3002283 3115674 3213164 3291819 3349470
56232 3349470 3383995 3393797 3378865 3340428 3279956 3199536 3102591 2992781 2872498 2743755 2610093
56221 2610093 2475853 2343511 2213246 2085257 1961137 1842686 1730779 1625802 1528162 1437963
56211 1437963 1354897 1278634 1208738 1144419 1085158 1031276 982960 939165 898610 861469 828736
56200 828736 800141 774141 749915 727936 708473 690856 674452 659272 645422 632974 622415
56189 622415 614172 607646 601685 595924 590705 585947 581276 577054 573944 571558 568812 565598 562830 560947
56175 560947 559679 559244 560308 562638 565071 566937 568357 569306 569734 570565 573079 577230 581929 586954 593046
56160 593046 600143 607182 613932 621444 630333 640024 650097 660973 672910 685663 699519 715428 733777
$$ packed form
56242B168226J43024J44984J44682J41113J34636J25618J13391R7490P8655N7651
56232C349470L4525R802j4932l8437o0472q0420r6945j09810j20283j28743j33662
56221B610093j34240j32342j30265j27989j24120j18451j11907j04977r7640r0199
56211A437963q3066p6263o9896o4319n9261n3882m8316m3795m0555l7141l2733
56200H28736k8595k6000k4226k1979j9463j7617j6404j5180j3850j2448j0559
56189F22415q243o526n961n761n219m758m671m222l110k386k746l214k768j883
56175E60947j268m35J064K330K433J866J420R49M28Q31K514M151M699N025O092
56160E93046P097P039O750P512Q889R691J0073J0876J1937J2753J3856J5909J8349
$$ plain form
56147 733777 754231 777001 803080 833106 867223 906071 950534 1000498 1055384 1116023 1184438
56136 1184438 1261537 1346412 1437865 1534807 1634871 1734342 1829957 1919452 2000434 2070767 2130590
56125 2130590 2182328 2228172 2268898 2305001 2336737 2362463 2378953 2384257 2378885 2363946 2340041 2308411
56113 2308411 2270881 2227587 2176429 2115605 2045173 1965715 1877692 1783261 1686918 1593127 1504592
56102 1504592 1423373 1351584 1289841 1236716 1190947 1152739 1121957 1096764 1075314 1057384 1043216
56091 1043216 1032118 1023268 1016616 1012001 1008600 1006182 1005671 1007661 1011520 1016525 1022493 1028838 1034605 1040005
56077 1040005 1046316 1053722 1060983 1067751 1075319 1084459 1094473 1105073 1117086 1130441 1143611 1156061
56065 1156061 1169277 1184443 1201074 1218787 1238220 1259168 1280038 1300273 1321197 1343389 1365491
$$ packed form
56147G33777K0454K2770K6079L0026L4117L8848M4463M9964N4886O0639O8415
56136A184438P7099Q4875R1453R6942J00064R9471R5615Q9495Q0982P0333N9823
56125B130590N1738M5844M0726L6103L1736K5726J6490N304n372j4939k3905l1630
56113B308411l7530m3294n1158o0824p0432p9458q8023r4431r6343r3791q8535
56102A504592q1219p1789o1743n3125m5769l8208l0782k5193k1450j7930j4168
56091A043216j1098q850o652m615l401k418n11J990L859N005N968O345N767N400
56077A040005O311P406P261O768P568R140J0014J0600J2013J3355J3170J2450
56065A156061J3216J5166J6631J7713J9433K0948K0870K0235K0924K2192K2102
$$ plain form
56054 1365491 1386661 1407844 1429418 1450091 1469463 1489170 1509984 1530281 1549004 1567766 1588276
56043 1588276 1610014 1632153 1655455 1680511 1706409 1732829 1761191 1792099 1824041 1856236 1890194
56032 1890194 1926779 1964532 2002790 2043571 2088229 2135047 2182386 2231370 2283102 2336139 2389351
56021 2389351 2444478 2503054 2563438 2623693 2684859 2748650 2814521 2881916 2952817 3029058 3109539
56010 3109539 3192927 3280581 3373963 3471821 3572920 3678901 3791504 3909679 4032481 4161969
56000 4161969 4300197 4446346 4599873 4763212 4938067 5122424 5314807 5517991 5734794
55991 5734794 5963879 6203813 6457661 6729311 7018926 7326371 7655407 8009999 8390347
55982 8390347 8797222 9236167 9712581 10227092 10781045 11382020 12038570 12754631 13535376
$$ packed form
56054A365491K1170K1183K1574K0673J9372J9707K0814K0297J8723J8762K0510
56043A588276K1738K2139K3302K5056K5898K6420K8362L0908L1942L2195L3958
56032A890194L6585L7753L8258M0781M4658M6818M7339M8984N1732N3037N3212
56021B389351N5127N8576O0384O0255O1166O3791O5871O7395P0901P6241Q0481
56010C109539Q3388Q7654R3382R7858J01099J05981J12603J18175J22802J29488
56000D161969J38228J46149J53527J63339J74855J84357J92383K03184K16803
55991E734794K29085K39934K53848K71650K89615L07445L29036L54592L80348
55982H390347M06875M38945M76414N14511N53953O00975O56550P16061P80745
$$ plain form
55973 13535376 14393730 15344886 16399947 17572201 18884578 20364291 22037150 23936546
55965 23936546 26113489 28631337 31560220 34989124 39038420 43850784 49576687 56377708
55957 56377708 64431415 73915767 84996431 97846404 112670808 129690507 149088738
55950 149088738 170947590 195172737 221428204 249152923 277630026 305889647 332324701
55943 332324701 354366091 368816148 372953994 365724078 348149118 322784818 292756270
55936 292756270 260971404 229699320 200431183 173945549 150513151 130115445 112574700
55929 112574700 97613743 84910541 74149801 65040747 57314649 50734861 45110467
55922 45110467 40288611 36137639 32546132 29428597 26716813 24347019 22262789 20423301
$$ packed form
55973A3535376Q58354R51156J055061J172254J312377J479713J672859J899396
55965B3936546K176943K517848K928883L428904M049296M812364N725903O801021
55957E6377708Q053707R484352J1080664J2849973J4824404J7019699J9398231
55950A49088738K1858852K4225147K6255467K7724719K8477103K8259621K6435054
55943C32324701K2041390J4450057M137846p229916j7574960k5364300l0028548
55936B92756270l1784866l1272084k9268137k6485634k3432398k0397706j7540745
55929A12574700j4960957j2703202j0760740r109054p726098o579788n624394
55922D5110467m821856m150972l591507l117535k711784k369794k084230j839488
$$ plain form
55914 20423301 18797398 17352635 16058453 14895421 13851745 12913172 12063669 11292564
55906 11292564 10592996 9955540 9370044 8831328 8336690 7880172 7455170 7060132 6695678
55897 6695678 6358263 6042301 5746419 5472133 5218277 4981911 4762773 4561612 4375647
55888 4375647 4200585 4035770 3882941 3741468 3609177 3486285 3374028 3270685 3173193 3081512
55878 3081512 2997313 2919534 2845086 2772729 2702333 2631536 2557223 2479709 2401863 2324777 2247726
55867 2247726 2171581 2098727 2029993 1964745 1903462 1847312 1795733 1747169 1701598 1659772 1620813
55856 1620813 1583132 1546882 1512868 1480039 1446784 1413834 1383129 1354565 1326436 1298365 1271154
55845 1271154 1244481 1217347 1190270 1164606 1140302 1116511 1093602 1072333 1051909 1031211 1011001
$$ packed form
55914B0423301j625903j444763j294182j163032j043676r38573q49503p71105
55906A1292564o99568o37456n85496n38716m94638m56518m25002l95038l64454
55897F695678l37415l15962k95882k74286k53856k36366k19138k01161j85965
55888D375647j75062j64815j52829j41473j32291j22892j12257j03343r7492r1681
55878C081512q4199p7779p4448p2357p0396p0797p4313p7514p7846p7086p7051
55867B247726p6145p2854o8734o5248o1283n6150n1579m8564m5571m1826l8959
55856A620813l7681l6250l4014l2829l3255l2950l0705k8564k8129k8071k7211
55845A271154k6673k7134k7077k5664k4304k3791k2909k1269k0424k0698k0210
$$ plain form
55834 1011001 992553 975123 957317 940027 925316 913148 901805 890772 880565 870501 859514
55823 859514 848615 839657 831971 822969 811917 800459 789581 778701 767712 757283 746991 735629
55811 735629 723662 713183 705191 698882 693676 689834 686999 684299 682127 681915 683946 687125 690925 695729
55797 695729 701302 706852 712604 719350 726349 731511 733798 733755 731728 727440 721361 714598 707196 698266 687929
55782 687929 677427 667313 657094 646581 635786 623685 609173 593429 579322 568206 559118 551249
55770 551249 545149 541131 538621 537718 539413 543323 546893 547821 546043 542626 538060 532444 526173 519524 512261
55755 512261 504125 495119 485247 474838 465120 457348 451295 445509 439032 431847 423983 415531 407363 400455
55741 400455 394557 388887 383840 380387 378035 375254 371991 369823 369308 369116 368231 367163 366269 364644 361560
$$ packed form
55834A011001j8448j7430j7806j7290j4711j2168j1343j1033j0207j0064j0987
55823H59514j0899q958p686r002j1052j1458j0878j0880j0989j0429j0292j1362
55811G35629j1967j0479p992o309n206l842k835k700k172k12K031L179L800M804
55797F95729N573N550N752O746O999N162K287m3k027m288o079o763p402q930j0337
55782F87929j0502j0114j0219j0513j0795j2101j4512j5744j4107j1116r088p869
55770E51249o100m018k510r03J695L910L570R28j778l417m566n616o271o649p263
55755E12261q136r006r872j0409r718p772o053n786o477p185p864q452q168o908
55741D00455n898n670n047l453k352k781l263k168n15j92q85j068q94j625l084
$$ plain form
55726 361560 357566 353328 348664 343485 338399 333583 328202 321826 315504 310708 307987 307049 307262 307663 307535
55711 307535 307435 308704 311643 315137 318324 321383 324365 326533 327474 327663 327385 326149 323723 320631 317096
55696 317096 312558 306818 300654 294733 288911 283150 278065 273998 270507 267346 264998 263726 263076 262841 263539
55681 263539 265403 267883 270664 274104 278075 281441 283458 284730 285993 286877 286670 285577 284453 283864 283967
55666 283967 284699 285604 286080 286163 286352 286493 285790 284194 282693 281895 281528 281801 283807 287789 292224 295611 298129
55649 298129 300605 302964 304770 306330 308018 309227 309175 308149 306859 305090 302077 297753 292623 286772 280009
55634 280009 272679 265452 258534 251936 246162 241763 238407 235274 232272 230088 229023 228407 227238 225058
55620 225058 222254 219808 218548 218378 218426 218056 217377 216628 215655 214231 212390 210132 207451 204924 203556 203508
$$ packed form
55726C61560l994m238m664n179n086m816n381o376o322m796k721r38K13M01j28
55711C07535j00J269K939L494L187L059K982K168R41J89k78j236k426l092l535
55696C17096m538n740o164n921n822n761n085m067l491l161k348j272o50k35O98
55681B63539J864K480K781L440L971L366K017J272J263Q84k07j093j124n89J03
55666B83967P32R05M76Q3J89J41p03j596j501p98l67K73K006L982M435L387K518
55649B98129K476K359J806J560J688J209n2j026j290j769l013m324n130n851o763
55634B80009p330p227o918o598n774m399l356l133l002k184j065o16j169k180
55620B25058k804k446j260j70M8l70o79p49r73j424j841k258k681k527j368m8
$$ plain form
55604 203508 203614 202710 200896 198954 197113 194980 192273 189029 185522 182438 180669 180412 180822 180966 180709 180339
55588 180339 179944 179607 179649 180150 180674 180950 181319 182067 182863 183326 183636 184088 184638 185376 186880 189554 193097 197150
55570 197150 201907 207602 213931 220439 226880 232733 237073 239549 240844 241653 241867 241327 240441 239264 236793
55555 236793 232241 226400 220756 215765 210981 206287 201879 197387 192218 186724 182032 178779 176874 176319
55541 176319 177257 179147 180817 181556 181629 181610 181772 182170 182780 183505 184298 185201 186000 186161 185502 184589 184030 183726 183266
55522 183266 182629 181912 180816 179023 176797 174592 172389 169991 167584 165385 163193 160912 159045 157895 156801
55507 156801 155073 153270 152501 152727 152794 152049 150893 149786 148709 147680 146904 146230 145316 144481 144587 145841 147365
55490 147365 148207 148152 147383 146042 144471 143400 143385 144241 145176 145449 144983 144512 144874 145933 146554 146032 145105 144936
$$ packed form
55604B03508J06r04j814j942j841k133k707l244l507l084j769k57M10J44k57l70
55588A80339l95l37M2N01N24K76L69P48P96M63L10M52N50P38J504K674L543M053
55570A97150M757N695O329O508O441N853M340K476J295Q09K14n40q86j177k471
55555B36793m552n841n644m991m784m694m408m492n169n494m692l253j905n55
55541A76319R38J890J670P39P3j9J62L98O10P25P93R03P99J61o59r13n59l04m60
55522A83266o37p17j096j793k226k205k203k398k407k199k192k281j867j150j094
55507A56801j728j803p69K26O7p45j156j107j077j029p76o74r14q35J06J254J524
55490A47365Q42n5p69j341j571j071j5Q56R35K73m66m71L62J059O21n22r27j69
$$ plain form
55472 144936 145527 145918 145612 144891 143888 142413 140803 139927 140004 140210 139890 139503 139900 141206 142833 144260 145276
55455 145276 145668 145165 143805 142174 141086 140882 141062 140872 140326 140278 141264 142735 143763 144107 144113 144010 143898 144086
55437 144086 144727 145278 145022 143991 142833 141919 141204 140816 141007 141551 141876 141852 141883 142181 142550 142939 143653 144868
55419 144868 146361 147763 148733 149029 148795 148658 149109 150002 151118 152855 155555 158416 159936 159493 157775 155695
55403 155695 153668 151958 150852 150264 149800 149321 148879 148093 146434 144208 142442 141571 140986 140106 139166 138628 138541
55386 138541 138815 139473 140241 140527 140214 139940 140234 140840 141180 140926 139837 137769 135297 133657 133408 133612 133017
55369 133017 131724 130978 131536 132942 134409 135726 137033 138150 138525 137827 136390 134987 134208 134145 134598 135365
55353 135365 136245 136992 137509 137855 137892 137249 135955 134816 134695 135592 136842 137955 138801 139249 139294 139398 140027 140905
$$ packed form
55472A44936N91L91l06p21j003j475j610q76P7K06l20l87L97J306J627J427J016
55455A45276L92n03j360j631j088k04J80j90n46m8R86J471J028L44Oj03j12J88
55437A44086O41N51k56j031j158r14p15l88J91N44L25k4L1K98L69L89P14J215
55419A44868J493J402R70K96k34j37M51Q93J116J737K700K861J520m43j718k080
55403A55695k027j710j106n88m64m79m42p86j659k226j766q71n85q80r40n38q7
55386A38541K74O58P68K86l13k74K94O06L40k54j089k068k472j640k49K04n95
55369A33017j293p46N58J406J467J317J307J117L75o98j437j403p79o3M53P67
55353A35365Q80P47N17L46L7o43j294j139j21Q97J250J113Q46M48M5J04O29Q78
$$ plain form
55335 140905 141267 140781 139647 137961 135720 133399 131739 130961 130882 131716 133836 136691 138956 140009 140400 140588
55319 140588 140186 138888 137270 136061 135334 134944 135092 135850 136725 137237 137466 137538 137142 136098 134856 133865 132987
55302 132987 132113 131764 132371 133385 133864 133626 133103 132409 131385 130417 130361 131540 133355 134921 135723 135771 135612 136053
55284 136053 137344 138632 138716 137369 135495 134010 133052 132281 131448 130498 129530 128899 129095 130263 131920 133280
55268 133280 133760 133229 131956 130482 129395 129037 129332 129916 130453 130854 131182 131451 131593 131681 131962 132569 133381 134306
55250 134306 135425 136605 137267 136985 136136 135481 135229 135050 134892 135102 135664 135988 135719 135225 134972 134912 134787 134654
55232 134654 134801 135389 136440 137846 139238 140142 140353 139875 138544 136258 133619 131640 130563 129604 128191 126845
55216 126845 126446 127237 128963 131312 133601 134641 133810 132009 130859 131098 132322 134025 136124 138421 140237
$$ packed form
55335A40905L62m86j134j686k241k321j660p78p9Q34K120K855K265J053L91J88
55319A40588m02j298j618j209p27l90J48P58Q75N12K29P2l96j044j242r91q78
55302A32987q74l49O07J014M79k38n23o94j024r68n6J179J815J566Q02M8j59M41
55284A36053J291J288Q4j347j874j485r58p71q33r50r68o31J96J168J657J360
55268A33280M80n31j273j474j087l58K95N84N37M01L28K69J42Q8K81O07Q12R25
55250A34306J119J180O62k82q49o55k52j79j58K10N62L24k69m94k53o0j25j33
55232A34654J47N88J051J406J392R04K11m78j331k286k639j979j077r59j413j346
55216A26845l99P91J726K349K289J040q31j801j150K39J224J703K099K297J816
$$ plain form
55201 140237 140927 140475 139501 138792 138753 139161 139454 139333 138874 138065 136700 134959 133634 133374 133991 134825 135467 135783
55183 135783 135621 135002 134341 134002 133851 133634 133529 133857 134480 134967 135221 135441 135633 135652 135603 135749 136086 136453 136969
55164 136969 137859 138895 139474 139356 138932 138714 138872 139309 139886 140436 140729 140560 139920 139186 139079 140032 141519 142360
55146 142360 141947 140821 139843 139278 139021 139180 139836 140538 140732 140503 140356 140421 140452 140477 140852 141682 142689 143593 144155
55127 144155 143985 142916 141544 140826 141036 141598 141995 142309 142755 143205 143344 142917 141703 139714 137577 136273 136294
55110 136294 137331 138879 140732 142727 144450 145575 146225 146736 147248 147832 148785 150474 152875 155442 157464
55095 157464 158496 158644 158566 159105 160680 162908 164857 165743 165432 164350 163009 161683 160511 159675 159292 159188
55079 159188 159018 158595 157979 157332 156946 157246 158356 159608 159961 159082 157670 156579 156015 155755 155698 155903 156435 157379
$$ packed form
55201A40237O90m52r74p09l9M08K93j21m59q09j365j741j325k60O17Q34O42L16
55183A35783j62o19o61l39j51k17j05L28O23M87K54K20J92J9m9J46L37L67N16
55164A36969Q90J036N79j18m24k18J58M37N77N50K93j69o40p34j07R53J487Q41
55146A42360m13j126r78n65k57J59O56P02J94k29j47O5L1K5L75Q30J007R04N62
55127A44155j70j069j372p18K10N62L97L14M46M50J39m27j214j989k137j304K1
55110A36294J037J548J853J995J723J125O50N11N12N84R53J689K401K567K022
55095A57464J032J48p8N39J575K228J949Q86l11j082j341j326j172q36l83j04
55079A59188j70m23o16o47l86L00J110J252L53q79j412j091n64k60n7K05N32R44
$$ plain form
55061 157379 158639 159542 159190 157545 155660 154402 153486 152270 150946 150243 150307 150687 151213 152070 153054 153474 152977
55044 152977 151953 151057 150698 150964 151592 151978 151617 150567 149252 147983 147000 146684 147209 148112 148706 148831 148779 148681
55026 148681 148487 148365 148532 148802 148872 148887 149107 149193 148555 147401 146664 146796 147311 147621 147604 147204 146196 144705 143418
55007 143418 142984 143517 144771 146305 147441 147651 147212 146958 147251 147718 148068 148484 148943 148902 148091 147119 146845 147500
54989 147500 148703 149956 150827 151116 151210 151926 153664 156034 158482 160911 163409 165799 167745 168981 169226 168309
54973 168309 166611 164940 163666 162475 161227 160513 160914 162202 163761 165322 166789 167774 168038 168053 168474 169170
54957 169170 169412 168931 168215 167744 167434 166940 166098 164991 163889 163161 163014 163259 163531 163687 163806 164000 164444 165397
54939 165397 166847 168212 168752 168290 167298 166411 166151 166940 168844 171223 173094 174053 174616 175507 176853 178269
$$ packed form
55061A57379J260R03l52j645j885j258r16j216j324p03O4L80N26Q57R84M20m97
55044A52977j024q96l59K66O28L86l61j050j315j269r83l16N25R03N94J25n2r8
55026A48681j94j22J67K70P0J5K20Q6o38j154p37J32N15L10j7m00j008j491j287
55007A43418m34N33J254J534J136K10m39k54K93M67L50M16M59m1q11r72k74O55
54989A47500J203J253Q71K89R4P16J738K370K448K429K498K390J946J236K45r17
54973A68309j698j671j274j191j248p14M01J288J559J561J467R85K64J5M21O96
54957A69170K42m81p16m71l10m94q42j107j102p28j47K45K72J56J19J94M44R53
54939A65397J450J365N40m62r92q87k60P89J904K379J871R59N63Q91J346J416
$$ plain form
54923 178269 179533 180995 183333 187012 191939 197606 203626 210043 217000 224127 230552 235680 239707 243074
54909 243074 245567 246349 244992 242095 238553 234452 229184 222611 215602 209184 203563 198371 193560 189578
54895 189578 186704 184676 183045 181565 180135 178655 177156 175973 175585 176170 177327 178352 178967 179723 181398
54880 181398 184002 186828 189611 193041 197713 203145 208471 213705 219498 225840 231897 237155 241849 246012
54866 246012 248866 249530 247872 244389 239702 234380 228774 222747 216027 208981 202547 197182 192487 188092
54852 188092 184267 181196 178324 175080 171824 169387 167949 167003 166198 165559 164964 164100 162989 162099 161706 161515
54836 161515 160995 159850 158080 155895 153724 152081 151211 150954 151060 151595 152784 154420 155685 155938 155630 155924
54820 155924 157230 158620 159077 158867 159051 160025 161263 162331 163239 163869 163956 163782 163977 164408 164194 163172 162447
$$ packed form
54923A78269J264J462K338L679M927N667O020O417O957P127O425N128M027L367
54909B43074K493P82j357k897l542m101n268o573p009o418n621n192m811l982
54895A89578k874k028j631j480j430j480j499j183l88N85J157J025O15P56J675
54880A81398K604K826K783L430M672N432N326N234N793O342O057N258M694M163
54866B46012K854O64j658l483m687n322n606o027o720p046o434n365m695m395
54852A88092l825l071k872l244l256k437j438r46q05o39n95q64j111q90l93j91
54836A61515n20j145j770k185k171j643q70k57J06N35J189J636J265K53l08K94
54820A55924J306J390M57k10J84R74J238J068R08O30Q7j74J95M31k14j022p25
$$ plain form
54803 162447 162989 164465 165966 167060 167508 166867 165291 164040 164123 164900 164988 164176 163440 163365 163623 163883 164165 164231
54785 164231 163672 162810 162648 163628 165135 166495 167706 168878 169715 170148 170939 172968 176058 179041 181085 182693
54769 182693 185269 189747 195681 201771 207253 212481 218126 224278 230696 237481 244812 252191 258598 263373
54755 263373 266360 267276 265680 261777 256559 250784 244305 236761 228464 220226 212606 205768 199833 194961
54741 194961 191133 188138 185824 184145 182985 182040 180937 179498 178031 177265 177772 179359 181192 182618 183769
54726 183769 185321 187802 191185 195037 198982 203110 207926 213805 220502 227310 233677 239518 244894 249529
54712 249529 252733 253818 252592 249421 244804 239011 232317 225439 219270 214045 209105 203785 198304 193520
54698 193520 190017 187647 185765 183647 180928 177897 175226 173211 171539 169984 168911 168726 169175 169641 169879
$$ packed form
54803A62447N42J476J501J094M48o41j576j251Q3P77Q8q12p36p5K58K60K82O6
54785A64231n59q62j62R80J507J360J211J172Q37M33P91K029L090K983K044J608
54769A82693K576M478N934O090N482N228N645O152O418O785P331P379O407M775
54755B63373K987R16j596l903n218n775o479p544q297q238p620o838n935m872
54741A94961l828k995k314j679j160r45j103j439j467p66N07J587J833J426J151
54726A83769J552K481L383L852L945M128M816N879O697O808O367N841N376M635
54712B49529L204J085j226l171m617n793o694o878o169n225m940n320n481m784
54698A93520l503k370j882k118k719l031k671k015j672j555j073j85M49M66K38
$$ plain form
54683 169879 169963 169839 169486 169285 169592 170050 169936 169123 168108 167198 166288 165424 164862 164514 164013 163478 163604 164714
54665 164714 166266 167471 167924 167532 166433 165195 164526 164462 164389 164118 164356 165668 167485 168664 168698 167958 167049
54648 167049 166405 166281 166689 167369 168096 168813 169341 169263 168449 167450 166996 167237 167763 168130 168092 167511 166450 165253 164326
54629 164326 163941 164370 165859 168078 169926 170411 169618 168406 167272 166031 164598 163461 163110 163411 163862 164255
54613 164255 164737 165371 165970 166408 166780 167098 166993 166039 164420 162981 162503 163068 164245 165610 166799 167367 167119
54596 167119 166501 166127 165876 165110 163922 163458 164528 166399 167629 167765 167566 167735 168172 168540 168842 169134 169165 168711
54578 168711 168023 167629 167745 168075 168069 167333 165967 164636 164039 164106 163965 163012 161830 161628 162802 164481 165638 166221
54560 166221 166871 167830 168660 169021 169260 169966 171173 172287 172779 172739 172671 172834 172922 172466 171477 170509 169989 169782 169633
$$ packed form
54683A69879Q4j24l53k01L07M58j14q13j015r10r10q64n62l48n01n35J26J110
54665A64714J552J205M53l92j099j238o69o4p3k71K38J312J817J179L4p40r09
54648A67049o44j24M08O80P27P17N28p8q14r99m54K41N26L67l8n81j061j197r27
54629A64326l85M29J489K219J848M85p93j212j134j241j433j137l51L01M51L93
54613A64255M82O34N99M38L72L18j05r54j619j439m78N65J177J365J189N68k48
54596A67119o18l74k51p66j188m64J070J871J230J36j99J69M37L68L02K92L1m54
54578A68711o88l94J16L30op36j366j331n97O7j41r53j182k02J174J679J157N83
54560A66221O50R59Q30L61K39P06J207J114M92m0o8J63Q8m56r89r68n20k07j49
$$ plain form
54541 169633 169813 170815 172462 173864 174446 174548 174707 174841 174603 174229 174408 175422 176890 178386 179831 181206
54525 181206 182305 182959 183210 183140 182707 181888 180824 179767 178986 178663 178719 178783 178522 177956 177244 176390 175435 174761 174711
54506 174711 174951 174759 174042 173522 173725 174275 174507 174317 173987 173495 172650 171812 171894 173352 175506 177112 177523 177077
54488 177077 176458 175994 175666 175476 175441 175298 174689 173716 172959 172705 172556 172120 171724 171966 172777 173491 173740 173807 174138
54469 174138 175017 176654 178982 181256 182497 182576 182401 182784 183552 184080 184213 184245 184324 184392 184507 184801 185128 185098 184543
54450 184543 183705 182988 182575 182328 182026 181690 181590 181802 181888 181316 180144 178958 178136 177496 176786 176140 175852 175945 176130
54431 176130 176008 175304 174206 173491 173891 175208 176446 177008 177327 178092 179306 180526 181595 182623 183464 183766
54415 183766 183553 183311 183406 183661 183606 183000 182089 181431 181424 181944 182464 182540 182078 181237 180356 179996 180665 182283 184151 185657
$$ packed form
54541A69633J80J002J647J402N82J02J59J34k38l74J79J014J468J496J445J375
54525A81206J099O54K51p0m33q19j064j057p81l23N6O4k61n66p12q54r55o74n0
54506A74711K40j92p17n20K03N50K32j90l30m92q45q38Q2J458K154J606M11m46
54488A77077o19m64l28j90l5j43o09r73p57k54j49m36l96K42Q11P14K49O7L31
54469A74138Q79J637K328K274J241P9j75L83P68N28J33L2P9O8J15K94L27l0n55
54450A84543q38p17m13k47l02l36j00K12Q6n72j172j186q22o40p10o46k88R3J85
54431A76130j22p04j098p15M00J317J238N62L19P65J214J220J069J028Q41L02
54415A83766k13k42R5K55n5o06r11o58pN20N20P6m62q41q81l60O69J618J868J506
$$ plain form
54395 185657 186817 188011 189460 191134 192912 194545 195652 196033 195887 195590 195361 195258 195331 195639 196214 197071 198084
54378 198084 198831 198879 198286 197538 196963 196491 196054 195747 195499 195004 194222 193518 193107 192825 192648 192895 193543 193948 193782
54359 193782 193741 194602 195914 196440 195764 194788 194572 195338 196706 198270 199628 200293 200023 199174 198491 198461 198904 199137
54341 199137 198593 197290 195670 194146 192991 192498 192799 193435 193634 193178 192575 192237 192017 191826 192078 193012 194109
54324 194109 194773 195150 195636 195961 195568 194718 194430 195346 197236 199576 201982 204084 205563 206477 207163 207890 208934
54307 208934 210784 213636 216846 219489 221446 223374 225739 228597 232155 236611 241298 244894 246839 247791
54293 247791 248391 248364 247269 245300 242725 239215 234525 229384 224893 221261 217910 214697 212221 210831 209965
54278 209965 208821 207278 205851 204884 204108 203015 201559 200331 199927 200209 200449 200223 199882 200015 200782 201985
$$ packed form
54395A85657J160J194J449J674J778J633J107L81j46k97k29j03P3L08N75Q57J013
54378A98084P47M8n93p48n75m72m37l07k48m95p82p04m11k82j77K47O48M05j66
54359A93782m1Q61J312N26o76r76k16P66J368J564J358O65k70q49o83l0M43K33
54341A99137n44j303j620j524j155m93L01O36J99m56o03l38k20j91K52R34J097
54324A94109O64L77M86L25l93q50k88R16J890K340K406K102J479R14O86P27J044
54307B08934J850K852L210K643J957J928K365K858L558M456M687L596J945R52
54293B47791O00k7j095j969k575l510m690n141m491l632l351l213k476j390q66
54278B09965j144j543j427r67p76j093j456j228m04K82K40k26l41J33P67J203
$$ plain form
54262 201985 203436 204894 205876 206065 205778 205582 205484 205000 204108 203575 204020 205051 205773 205880 205755 205616 205170 204245
54244 204245 203236 202556 201960 200900 199405 198118 197435 197049 196579 196284 196758 198032 199306 199652 198863 197560
54228 197560 196551 196192 196280 196429 196396 196147 195884 196061 197012 198349 199081 198744 198092 198171 198880 199168 198595 197899 197867
54209 197867 198388 198944 199344 199479 198994 197779 196365 195290 194446 193520 192651 192116 191813 191693 192232 193706 195336
54192 195336 196018 195765 195570 195915 196302 196294 196130 196043 195707 194794 193614 192845 192931 193860 195162 196012 195765 194561 193142
54173 193142 192040 191278 190766 190511 190432 190475 190923 192060 193475 194316 194353 194219 194503 195196 196192 197597 199187 200235
54155 200235 200353 200077 200145 200601 201041 201418 202106 203357 205019 206659 207731 207840 207135 206253 205748 205757 206262 207213
54137 207213 208211 208556 208017 207224 206892 206927 206684 205943 205193 204984 205299 205644 205624 205417 205588 206327 207048 207074 206621 206608
$$ packed form
54262B01985J451J458R82J89k87j96r8m84q92n33M45J031P22J07j25j39m46r25
54244B04245j009o80n96j060j495j287o83l86m70k95M74J274J274L46p89j303
54228A97560j009l59Q8J49l3k49k63J77R51J337P32l37o52P9P09K88n73o96l2
54209A97867N21N56M00J35m85j215j414j075q44r26q69n35l03j20N39J474J630
54192A95336O82k53j95L45L87qj64q7l36r13j180p69Q6R29J302Q50k47j204j419
54173A93142j102p62n12k55p9M3M48J137J415Q41L7j34K84O93R96J405J590J048
54155B00235J18k76O8M56M40L77O88J251J662J640J072J09p05q82n05RN05R51
54137B07213R98L45n39p93l32L5k43p41p50k09L15L45k0k07J71P39P21K6m53j3
$$ plain form
54117 206608 207445 208526 209070 208950 208477 207916 207592 207987 209237 210750 211719 211830 211292 210435 209534 208737 207909 206799
54099 206799 205521 204497 203789 202990 202007 201372 201387 201522 201238 200918 201318 202461 203733 204826 205852 206722 207181
54082 207181 207446 208089 209131 209879 209869 209514 209569 210296 211408 212539 213512 214297 214888 215237 215317 215251 215248 215305 215111 214457
54062 214457 213599 213029 212956 213212 213604 214162 215072 216424 217919 218869 218827 218306 218467 219923 222222 224745 227530
54045 227530 230736 233860 236243 238084 240231 243084 246348 249728 253136 256240 258659 260799 263751 267993
54031 267993 272758 277061 280833 284638 288692 292704 296431 299920 303277 306531 309670 312575 315038 317027
54017 317027 318786 320446 321745 322385 322494 322306 321503 319416 316022 312265 309001 305930 302055 297056 291762
54002 291762 287193 283646 280909 278891 277558 276515 275140 273060 270163 266371 261954 257957 255546 254768
$$ packed form
54117B06608Q37J081N44j20m73n61l24L95J250J513R69J11n38q57r01p97q28j110
54099B06799j278j024p08p99r83o35J5J35k84l20M00J143J272J093J026Q70M59
54082B07181K65O43J042P48j0l55N5P27J112J131R73P85N91L49Q0o6lN7j94o54
54062B14457q58n70p3K56L92N58R10J352J495R50m2n21J61J456K299K523K785
54045B27530L206L124K383J841K147K853L264L380L408L104K419K140K952M242
54031B67993M765M303L772L805M054M012L727L489L357L254L139K905K463J989
54017C17027J759J660J299O40J09j88q03k087l394l757l264l071l875m999n294
54002B91762m569l547k737k018j333j043j375k080k897l792m417l997k411p78
$$ plain form
53988 254768 254508 253891 253112 252634 252375 252231 252704 254129 255701 256217 255653 255110 255179 255296 254947 254583 254783 255146
53970 255146 254818 253886 253599 255118 258423 262530 266485 270124 274094 279302 286314 295171 305667 317634
53956 317634 330903 345141 359947 375090 390438 405560 419429 430594 437584 439258 435114 425686
53944 425686 412706 398453 384647 371978 360706 351345 344432 339904 337157 335666 335082 334863 334425 333819
53930 333819 333732 334568 335902 337078 337950 338811 339927 341456 343451 345684 347789 349860 352491 355887 359321
53915 359321 361968 363974 366228 369356 373486 378703 385036 392010 398789 404875 410231 414710 417825 419227
53901 419227 419046 417635 415310 412426 409436 406708 404388 402417 400487 398033 394586 390175 385202 379862
53887 379862 373915 367066 359491 351925 345210 339597 334461 328974 323139 317899 314055 311378 309030 306480
$$ packed form
53988B54768k60o17p79m78k59j44M73J425J572N16n64n43O9J17l49l64K00L63
53970B55146l28r32k87J519L305M107L955L639L970N208P012Q857J0496J1967
53956C17634J3269J4238J4806J5143J5348J5122J3869J1165O990J674m144r428
53944D25686j2980j4253j3806j2669j1272r361o913m528k747j491n84k19m38o06
53930C33819q7Q36J334J176Q72Q61J116J529J995K233K105K071K631L396L434
53915C59321K647K006K254L128M130N217O333O974O779O086N356M479L115J402
53901D19227j81j411k325k884k990k728k320j971j930k454l447m411m973n340
53887C79862n947o849p575p566o715n613n136n487n835n240l844k677k348k550
$$ plain form
53873 306480 303687 300759 297861 295278 293065 290812 288091 284980 281866 278956 276360 274322 272931 271880
53859 271880 270931 270325 270245 270272 270006 269747 269728 269042 266486 262470 259003 257478 257301 256991 255735 253560 250842
53842 250842 248342 247108 247602 249124 250421 250637 249585 247659 245834 245153 245714 246516 246694 246529 246799 247555
53826 247555 248110 248090 247913 248213 249168 250423 251500 252242 252907 253827 254970 256069 257069 258112 259102 259775 260329
53809 260329 261513 263854 267122 270755 274443 278167 282000 286076 290388 294561 298325 302265 307387 313648
53795 313648 319657 324348 328295 332735 337906 343137 348171 353409 359028 364742 370546 376974 384407 392676
53781 392676 401513 410999 421439 433163 446481 461454 477630 494328 511098 527301 541130 549632
53769 549632 550186 541942 525933 504360 479940 455225 431754 409789 389165 370284 353985 340620
$$ packed form
53873C06480k793k928k898k583k213k253k721l111l114k910k596k038j391j051
53859B71880r49o06q0K7k66k59j9o86k556m016l467j525j77l10j256k175k718
53842B50842k500j234M94J522J297K16j052j926j825o81N61Q02J78j65K70P56
53826B47555N55k0j77L00R55J255J077P42O65R20J143J099J000J043R90O73N54
53809B60329J184K341L268L633L688L724L833M076M312M173L764L940N122O261
53795C13648O009M691L947M440N171N231N034N238N619N714N804O428P433Q269
53781C92676Q837R486J0440J1724J3318J4973J6176J6698J6770J6203J3829Q502
53769E49632N54q244j6009k1573k4420k4715k3471k1965k0624j8881j6299j3365
$$ plain form
53757 340620 329715 320551 312723 306023 300218 295173 290961 287630 285033 283104 281992 281630 281402 280725 279794
53742 279794 279233 279101 278887 278517 278523 278856 278354 276120 272890 270290 269119 269193 270457 273141 276805 280217 282565
53725 282565 284096 285380 286650 288042 289732 291486 292752 293618 295019 297576 300795 303870 306703 309668
53711 309668 312983 316917 322081 328749 336175 343311 350008 356994 364887 373720 383173 392666 401480 409368
53697 409368 416874 424461 431510 436801 439843 441065 440868 439191 436039 431738 426530 420547 414287 408496
53683 408496 403358 398367 393224 388317 383999 379950 375690 371363 367527 364406 361727 359190 356728 354433
53669 354433 352516 351303 350924 350990 350833 350143 349182 348284 347384 346185 344649 343032 341463 339824 338219 337208
53653 337208 337268 338144 339136 339894 340533 341064 341264 341231 341488 342284 343264 344114 345088 346552 348390 350299 352284 354426
$$ packed form
53757C40620j0905r164p828o700n805n045m212l331k597j929j112l62k28o77r31
53742B79794n61j32k14l70OL33n02k234l230k600j171P4J264K684L664L412K348
53725B82565J531J284J270J392J690J754J266Q66J401K557L219L075K833K965
53711C09668L315L934N164O668P426P136O697O986P893Q833R453R493Q814P888
53697D09368P506P587P049N291L042J222j97j677l152m301n208n983o260n791
53683D08496n138m991n143m907m318m049m260m327l836l121k679k537k462k295
53669C54433j917j213l79O6j57o90r61q98r00j199j536j617j569j639j605j011
53653C37208O0Q76R92P58O39N31K00l3K57P96R80Q50R74J464J838J909J985K142
$$ plain form
53635 354426 356507 358369 360298 362562 364853 366732 368310 369887 371239 372060 372861 374550 377206 380110 382993
53620 382993 386332 390287 394369 398495 403375 409231 414994 419536 423091 426666 430537 434170 437335 440382
53606 440382 443518 446636 449925 453856 458359 462607 465902 468290 470092 471330 471993 472491 473316 474380 475097
53591 475097 475119 474710 474331 474098 473736 472964 471790 470422 468906 466942 464179 460769 457416 454771 452815 450964
53575 450964 448691 445906 442841 439842 437236 435111 433193 431215 429444 428461 428253 427952 426863 425419 424662
53560 424662 424970 425830 426745 427756 429006 430379 431807 433450 435301 437005 438378 439733 441380 443144 444768
53545 444768 446496 448794 451620 454469 457137 460137 464202 469518 475523 481453 487176 493442 501123 510208
53531 510208 519879 529630 539880 551275 563818 577031 590576 604364 618364 632789 648230 665153
$$ packed form
53635C54426K081J862J929K264K291J879J578J577J352Q21Q01J689K656K904K883
53620C82993L339L955M082M126M880N856N763M542L555L575L871L633L165L047
53606D40382L136L118L289L931M503M248L295K388J802J238O63M98Q25J064P17
53591D75097K2m09l79k33l62p72j174j368j516j964k763l410l353k645j956j851
53575D50964k273k785l065k999k606k125j918j978j771r83k08l01j089j444p57
53560D24662L08Q60R15J011J250J373J428J643J851J704J373J355J647J764J624
53545D44768J728K298K826K849K668L000M065N316O005N930N723O266P681R085
53531E10208R671R751J0250J1395J2543J3213J3545J3788J4000J4425J5441J6923
$$ plain form
53519 665153 683456 702870 723572 745965 770094 795747 822891 851502 881204 911701 943373
53508 943373 976676 1011075 1045362 1079062 1112620 1145962 1177722 1206418 1231819 1254650 1275465
53497 1275465 1294440 1311974 1328807 1345540 1362428 1379613 1397247 1415367 1433906 1452835 1472161
53486 1472161 1491768 1511307 1530296 1548381 1565648 1582658 1599968 1617586 1635020 1651734 1667258
53475 1667258 1680921 1691921 1699913 1705272 1708609 1710214 1709958 1707481 1702320 1694149 1683136 1669959 1655360
53462 1655360 1639770 1623326 1606006 1587723 1568565 1548940 1529150 1508854 1487408 1464835 1441942
53451 1441942 1419207 1396129 1372112 1347563 1323601 1300913 1279503 1259380 1240827 1223870 1208041
53440 1208041 1193030 1179256 1167501 1158085 1150615 1144556 1139812 1136708 1135466 1135896 1137608 1140458 1144597
$$ packed form
53519F65153J8303J9414K0702K2393K4129K5653K7144K8611K9702L0497L1672
53508I43373L3303L4399L4287L3700L3558L3342L1760K8696K5401K2831K0815
53497A275465J8975J7534J6833J6733J6888J7185J7634J8120J8539J8929J9326
53486A472161J9607J9539J8989J8085J7267J7010J7310J7618J7434J6714J5524
53475A667258J3663J1000P992N359L337J605k56k477n161q171j1013j3177j4599
53462A655360j5590j6444j7320j8283j9158j9625j9790k0296k1446k2573k2893
53451A441942k2735k3078k4017k4549k3962k2688k1410k0123j8553j6957j5829
53440A208041j5011j3774j1755r416p470o059m744l104j242M30J712K850M139
$$ plain form
53427 1144597 1150166 1157120 1165412 1175147 1186446 1199324 1213822 1230122 1248372 1268440 1289987 1312747
53415 1312747 1336675 1361880 1388542 1416864 1447014 1479063 1512977 1548675 1586106 1625354 1666669
53404 1666669 1710332 1756456 1804889 1855313 1907414 1961049 2016367 2073706 2133332 2195209 2258979
53393 2258979 2324010 2389508 2454804 2519639 2583967 2647433 2709404 2769651 2828600 2886498 2942655
53382 2942655 2995958 3045894 3092505 3135496 3173987 3207213 3234976 3257361 3274538 3286866 3294617
53371 3294617 3297353 3294039 3284082 3267931 3246416 3219787 3187569 3149051 3103843 3052400 2996296 2937584
53359 2937584 2877543 2816202 2753177 2688648 2623390 2558396 2494777 2433540 2374975 2318501 2263536
53348 2263536 2210236 2158977 2109414 2060660 2012327 1964832 1918635 1873692 1829924 1787869 1748475
$$ packed form
53427A144597N569O954Q292R735J1299J2878J4498J6300J8250K0068K1547K2760
53415A312747K3928K5205K6662K8322L0150L2049L3914L5698L7431L9248M1315
53404A666669M3663M6124M8433N0424N2101N3635N5318N7339N9626O1877O3770
53393B258979O5031O5498O5296O4835O4328O3466O1971O0247N8949N7898N6157
53382B942655N3303M9936M6611M2991L8491L3226K7763K2385J7177J2328P751
53371C294617K736l314r957j6151k1515k6629l2218l8518m5208n1443n6104n8712
53359B937584o0041o1341o3025o4529o5258o4994o3619o1237n8565n6474n4965
53348B263536n3300n1259m9563m8754m8333m7495m6197m4943m3768m2055l9394
$$ plain form
53337 1748475 1712234 1678751 1647252 1617428 1589627 1564267 1541395 1520927 1502935 1487207 1472779
53326 1472779 1458453 1443815 1429244 1414932 1400559 1386035 1371921 1358769 1346560 1335108 1324492
53315 1324492 1314750 1305677 1297437 1290862 1286664 1284705 1284584 1286442 1290548 1296434 1303282 1311091 1320715 1332699
53301 1332699 1346722 1362289 1379416 1398415 1419394 1442149 1466319 1491561 1517800 1545295 1574189
53290 1574189 1604069 1634234 1664304 1694187 1723478 1751296 1776849 1799898 1820621 1839216 1855609
53279 1855609 1869341 1879767 1886541 1889785 1889691 1886213 1879433 1869906 1858186 1844286 1828053 1809834 1790086
53266 1790086 1768497 1744252 1717314 1688724 1659433 1629422 1598256 1565939 1532808 1499004 1464507
53255 1464507 1429532 1394581 1360212 1326881 1294752 1263487 1232526 1201822 1171981 1143454 1115795
$$ packed form
53337A748475l6241l3483l1499k9824k7801k5360k2872k0468j7992j5728j4428
53326A472779j4326j4638j4571j4312j4373j4524j4114j3152j2209j1452j0616
53315A324492r742r073q240o575m198j959j21J858M106N886O848P809R624J1984
53301A332699J4023J5567J7127J8999K0979K2755K4170K5242K6239K7495K8894
53290A574189K9880L0165L0070K9883K9291K7818K5553K3049K0723J8595J6393
53279A855609J3732J0426O774L244r4l478o780r527j1720j3900j6233j8219j9748
53266A790086k1589k4245k6938k8590k9291l0011l1166l2317l3131l3804l4497
53255A464507l4975l4951l4369l3331l2129l1265l0961l0704k9841k8527k7659
$$ plain form
53244 1115795 1088113 1060090 1032294 1005552 980275 956338 933385 911189 889805 869434 850167
53233 850167 831983 814994 799487 785637 773287 762108 751782 741934 732020 721465 709949 697534
53221 697534 684546 671284 657758 643777 629418 615272 602009 589711 577885 566116 554422
53210 554422 543001 531948 521329 511267 501798 492904 484703 477313 470354 462939 454448 445179 436034
53197 436034 427700 420272 413462 406906 400367 393906 387832 382363 377386 372627 367972 363556 359700 356843
53183 356843 355293 354789 354453 353427 351603 349564 347854 346460 344963 342993 340547 338053 336153 335232 335051
53168 335051 334915 334333 333466 332874 332818 332962 332854 332602 332812 333784 335033 335793 335907 335936 336436 337369 338252 338627 338315
53149 338315 337472 336505 335801 335476 335451 335696 336127 336332 335865 334992 334776 336058 338522 341041 342766 343618 343942 344063
$$ packed form
53244A115795k7682k8023k7796k6742k5277k3937k2953k2196k1384k0371j9267
53233H50167j8184j6989j5507j3850j2350j1179j0326r848r914j0555j1516j2415
53221F97534j2988j3262j3526j3981j4359j4146j3263j2298j1826j1769j1694
53210E54422j1421j1053j0619j0062r469q894q201p390o959p415q491r269r145
53197D36034q334p428o810o556o539o461o074n469m977m759m655m416l856k857
53183C56843j550n04l36j026j824k039j710j394j497j970k446k494j900r21j81
53168C35051j36n82q67n92n6J44j08k52K10R72J249P60J14K9N00R33Q83L75l12
53149C38315q43r67p04l25k5K45M31K05m67q73k16J282K464K519J725Q52L24J21
$$ plain form
53131 344063 344164 344246 344125 343657 342914 341936 340453 338227 335639 333522 332267 331429 330370 328980 327530 326157
53115 326157 324823 323577 322466 321310 319916 318460 317329 316577 315887 315074 314237 313324 311993 310120 308120
53100 308120 306460 305165 304089 303410 303385 303777 303991 303719 303074 302099 300675 299015 297781 297456 297824 298286 298455
53083 298455 298332 298089 297850 297526 296866 295870 295118 295275 296231 297158 297500 297427 297165 296501 295356 294292 293875 293878 293673
53064 293673 293135 292563 291990 291193 290273 289591 289219 289058 289422 290816 293018 295083 296428 297378 298440 299654 300990
53047 300990 302786 305332 308326 311151 313455 315142 316108 316446 316721 317617 319239 321006 322268 322817 322813 322374
53031 322374 321406 319844 318057 316814 316671 317460 318470 319014 318683 317353 315376 313662 312989 313200 313531 313714
53015 313714 314184 315095 315854 316044 316145 316803 317776 318267 318084 317787 317770 317786 317469 316902 316453 316321 316408 316463 316207 315408
$$ packed form
53131C44063J01Q2j21m68p43r78j483k226k588k117j255q38j059j390j450j373
53115C26157j334j246j111j156j394j456j131p52o90q13q37r13j331j873k000
53100C08120j660j295j076o79k5L92K14k72o45r75j424j660j234l25L68M62J69
53083B98455j23k43k39l24o60r96p52J57R56R27L42p3k62o64j145j064m17Lk05
53064B93673n38n72n73p97r20o82l72j61L64J394K202K065J345R50J062J214J336
53047C00990J796K546K994K825K304J687R66L38K75Q96J622J767J262N49mm39
53031C22374r68j562j787j243j43P89J010N44l31j330j977j714o73K11L31J83
53015C13714M70R11P59J90J01O58R73M91j83k97j7J6l17n67m49j32Q7N5k56p99
$$ plain form
52995 315408 313947 311922 309786 308314 308148 309247 310914 312377 313144 312828 311206 308769 306772 306199 306847
52980 306847 307786 308548 309364 310358 311098 311141 310666 310342 310784 312160 314107 315984 317423 318690 320314 322336 324155
52963 324155 325161 325343 325205 325298 325895 326884 327832 328292 328205 327937 327858 327925 327770 327145 326215 325373 324861 324628 324545 324611
52943 324611 324793 324769 324098 322714 321008 319355 317837 316585 315991 316262 316968 317488 317762 318169 318701 318764 317909 316319
52925 316319 314399 312245 309880 307727 306428 306184 306540 306881 306963 306833 306394 305291 303358 301130 299689 299817
52909 299817 301292 303084 304224 304428 304008 303434 302993 302656 302113 301104 299823 298920 298931 299748 300753 301387 301470
52892 301470 301077 300340 299519 298949 298739 298613 298324 298200 298927 300671 302714 304172 304866 305182 305340 305240 304974 304956
52874 304956 305430 306245 307274 308653 310352 311854 312570 312396 311599 310427 309138 308179 307874 307986 307952 307595 307339
$$ packed form
52995C15408j461k025k136j472j66J099J667J463P67l16j622k437j997n73O48
52980C06847R39P62Q16R94P40M3m75l24M42J376J947J877J439J267J624K022J819
52963C24155J006J82j38R3N97R89R48M60q7k68p9O7j55o25r30q42n12k33q3O6
52943C24611J82k4o71j384j706j653j518j252n94K71P06N20K74M07N32O3q55j590
52925C16319j920k154k365k153j299k44L56L41Q2j30m39j103j933k228j441J28
52909B99817J475J792J140K04m20n74m41l37n43j009j281r03J1Q17J005O34Q3
52892C01470l93p37q21n70k10j26k89j24P27J744K043J458O94L16J58j00k66j8
52874C04956M74Q15J029J379J699J502P16j74p97j172j289r59l05J12l4l57k56
$$ plain form
52857 307339 307714 308836 310348 311673 312320 312143 311335 310152 308848 307899 307830 308415 308328 306291 302588 298927 296653
52840 296653 295523 294376 292489 289966 287146 284220 281418 279193 277973 277755 277989 278015 277684 277514 278114 279520
52824 279520 281107 282065 281834 280360 278255 276525 275774 275706 275712 275738 276093 276587 276633 276332 276695 278468 281328 284597
52806 284597 288104 291806 295170 297706 299709 301717 303408 303847 302766 300774 298257 294937 290854 287012
52792 287012 284474 283185 282232 280984 279562 278311 277304 276321 275122 273706 272481 272028 272496 273343 273870 273927
52776 273927 273892 274102 274579 275240 276061 276975 277834 278555 279108 279343 279023 278176 277312 277165 278199 280281 282707 284577
52758 284577 285368 285368 285471 286403 288037 289461 289751 288777 287326 286455 286626 287424 288053 288059 287557 286873 286131 285266 284360
52739 284360 283850 284322 285964 288269 290367 291782 292781 293934 295381 296639 297058 296415 295121 293934 293362 293242
$$ packed form
52857C07339L75J122J512J325O47j77q08j183j304r49o9N85q7k037l703l661k274
52840B96653j130j147j887k523k820k926k802k225j220k18K34K6l31j70O00J406
52824B79520J587R58k31j474k105j730p51o8OK6L55M94M6l01L63J773K860L269
52806B84597L507L702L364K536K003K008J691M39j081j992k517l320m083l842
52792B87012k538j289r53j248j422j251j007r83j199j416j225m53M68Q47N27N7
52776B73927l5K10M77O61Q21R14Q59P21N53K35l20q47q64j47J034K082K426J870
52758B84577P91%J03R32J634J424K90r74j451q71J71P98O29On02o84p42q65r06
52739B84360n10M72J642K305K098J415R99J153J447J258M19o43j294j187n72j20
$$ plain form
52723 293242 293016 292526 292317 292930 294100 294960 294952 294173 292929 291459 290186 289677 290062 290817 291370 291597 291405 290266
52705 290266 287747 284441 281799 280920 281769 283613 285856 288240 290464 292008 292438 291863 290948 290438 290648 291439
52689 291439 292523 293586 294262 294369 294241 294505 295375 296442 297303 297999 298640 299019 299038 299194 300196 302234 304971
52672 304971 307972 310740 312601 313127 312577 311480 310011 308360 307432 308256 310566 312740 313501 313148 312845 313277
52656 313277 314314 315488 316338 316625 316626 316954 317841 318875 319641 320263 320959 321409 320962 319354 316951 314499 312770
52639 312770 312093 311932 311248 309619 307758 306687 306730 307677 309525 312429 316051 319591 322527 324990 327336 329716
52623 329716 332155 334750 337589 340444 342589 343060 341386 338139 334578 331630 329448 327890 326872 326041 324709
52608 324709 322646 320553 319278 318831 318659 318505 318360 317805 316271 314044 312348 312106 313025 314121 314853 315516
$$ packed form
52723B93242k26m90k09O13J170Q60qp79j244j470j273n09L85P55N53K27j92j139
52705B90266k519l306k642q79Q49J844K243K384K224J544M30n75r15n10K10P91
52689B91439J084J063O76J07j28K64Q70J067Q61O96O41L79J9J56J002K038K737
52672C04971L001K768J861N26n50j097j469j651r28Q24K310K174P61l53l03M32
52656C13277J037J174Q50K87JL28Q87J034P66O22O96M50m47j608k403k452j729
52639C12770o77j61o84j629j861j071M3R47J848K904L622L540K936K463K346K380
52623C29716K439K595K839K855K145M71j674l247l561k948k182j558j018q31j332
52608C24709k063k093j275m47j72j54j45n55j534k227j696k42R19J096P32O63
$$ plain form
52592 315516 316707 318563 320503 321781 322334 322872 323931 325157 325877 326097 326445 327287 328425 329632 330904 332186
52576 332186 333326 334417 335730 337213 338474 339362 340096 340703 340784 340096 339001 338004 337100 335916 334361 332856
52560 332856 331853 331219 330246 328421 326178 324585 324109 324007 323299 322009 321003 320848 321381 322293 323502 324916
52544 324916 326354 327749 329012 329784 329858 329727 330016 330434 330092 328954 328076 328157 328752 329308 330006 330894 331069 329763
52526 329763 327743 326611 326864 327525 327624 327259 327076 327392 328093 328970 329914 331046 332687 334993 337678 340353 343019
52509 343019 345906 348958 351923 354844 357980 361159 363670 364905 364760 363314 360546 356609 352069 347591
52495 347591 343553 340168 337759 336575 336389 336556 336568 336393 336240 336163 336116 336327 337319 339349 342018 344684 347163
52478 347163 349718 352360 354562 355879 356495 356860 357023 356776 356373 356631 358089 360331 362441 364029 365550 367550
$$ packed form
52592C15516J191J856J940J278N53N38J059J226P20K20L48Q42J138J207J272J282
52576C32186J140J091J313J483J261Q88P34O07Q1o88j095r97r04j184j555j505
52560C32856j003o34r73j825k243j593m76j02p08j290j006j55N33R12J209J414
52544C24916J438J395J263P72P4j31K89M18l42j138q78Q1N95N56O98Q88J75j306
52526C29763k020j132K53O61R9l65j83L16P01Q77R44J132J641K306K685K675K666
52509C43019K887L052K965K921L136L179K511J235j45j446k768l937m540m478
52495C47591m038l385k409j184j86J67J2j75j53p7m7K11R92K030K669K666K479
52478C47163K555K642K202J317O16L65J63k47m03K58J458K242K110J588J521K000
$$ plain form
52462 367550 369852 371786 373096 374223 375537 376728 377307 377335 377079 376155 373808 370109 366146 362704 359408
52447 359408 355623 351604 348092 345174 342265 339118 336171 333842 332067 330659 329638 328993 328455 327769 327016
52432 327016 326483 326274 326125 325601 324532 323312 322594 322586 322821 322802 322647 322832 323487 324358 325363 326775 328782 331206
52414 331206 333713 336073 338232 340363 342896 346217 350320 355000 360368 366914 375001 384543 395174 406463
52400 406463 417933 429104 439535 448563 455032 457653 455832 450034 441365 431075 420348 410059 400540
52387 400540 391868 384515 379256 376272 374769 373813 373219 373260 373928 374976 376492 378805 381861 385189 388516
52372 388516 391973 395635 399411 403584 408846 415262 421581 426148 428514 429605 430352 430684 430065 428472 426395
52357 426395 424156 421768 419390 417456 416235 415569 415179 414940 414823 414847 415252 416448 418590 421380 424478 427884
$$ packed form
52462C67550K302J934J310J127J314J191N79K8k56r24k347l699l963l442l296
52447C59408l785m019l512k918k909l147k947k329j775j408j021o45n38o86p53
52432C27016n33k09j49n24j069j220p18qK35j9j55J85O55Q71J005J412K007K424
52414C31206K507K360K159K131K533L321M103M680N368O546Q087R542J0631J1289
52400D06463J1470J1171J0431R028O469K621j821n798q669j0290j0727j0289r519
52387D00540q672p353n259k984j503r56n94M1O68J048J516K313L056L328L327
52372C88516L457L662L776M173N262O416O319M567K366J091P47L32o19j593k077
52357D26395k239k388k378j934j221o66l90k39j17K4M05J196K142K790L098L406
$$ plain form
52341 427884 431737 435953 440360 444971 449853 454861 459873 465184 471276 478216 485657 493488 502128 512064
52327 512064 523459 536322 550725 566590 583549 601268 619729 638901 658345 677467 696124
52316 696124 714712 733595 752698 771656 790229 808458 826561 844755 863142 881782 900895
52305 900895 920839 941658 962685 982872 1001646 1019260 1036177 1052320 1067236 1080842 1093572
52294 1093572 1105615 1116308 1124582 1129850 1132224 1132019 1129442 1124853 1118957 1112471 1105703 1098630 1091260 1083717
52280 1083717 1076093 1068494 1061276 1055014 1050096 1046450 1043779 1042005 1041430 1042485 1045428 1050246 1056697 1064376
52266 1064376 1072876 1082062 1092231 1103872 1117232 1132135 1148190 1165026 1182286 1199527 1216245 1232021
52254 1232021 1246713 1260660 1274591 1288990 1303386 1316656 1328169 1338223 1347002 1353626 1356982 1357259
$$ packed form
52341D27884L853M216M407M611M882N008N012N311O092O940P441P831Q640R936
52327E12064J1395J2863J4403J5865J6959J7719J8461J9172J9444J9122J8657
52316F96124J8588J8883J9103J8958J8573J8229J8103J8194J8387J8640J9113
52305I00895J9944K0819K1027K0187J8774J7614J6917J6143J4916J3606J2730
52294A093572J2043J0693Q274N268K374k05k577m589n896o486o768p073p370p543
52280A083717p624p599p218o262m918l646k671j774n75J055K943M818O451P679
52266A064376Q500R186J0169J1641J3360J4903J6055J6836J7260J7241J6718J5776
52254A232021J4692J3947J3931J4399J4396J3270J1513J0054Q779O624L356K77
$$ plain form
52242 1357259 1355797 1353348 1349298 1342927 1334657 1325513 1315938 1305833 1295385 1285088 1275004 1264622 1253548
52229 1253548 1241884 1229923 1217864 1205992 1194744 1184388 1174803 1165731 1157167 1149449 1142969 1137809
52217 1137809 1133608 1129906 1126631 1124108 1122534 1121746 1121652 1122558 1124760 1128030 1131880 1136119 1140791 1145750 1150794
52202 1150794 1156106 1162021 1168264 1174037 1179065 1184088 1189870 1196021 1201337 1205297 1208823 1213379 1219477 1226279
52188 1226279 1232571 1237821 1242120 1245459 1247543 1248321 1248203 1247464 1245763 1242525 1237537 1230921 1222863 1213722 1204142
52173 1204142 1194623 1185187 1175846 1167127 1159572 1152909 1146421 1140145 1135045 1131927 1130741 1131124 1132978 1136169
52159 1136169 1140172 1144489 1149157 1154478 1160330 1166008 1170596 1173424 1174403 1174135 1173513 1173069 1172828 1172792 1173279 1174647
52143 1174647 1176976 1180099 1183691 1187198 1189986 1191793 1192829 1193390 1193627 1193793 1194365 1195770 1198262 1202106 1207488
$$ packed form
52242A357259j462k449m050o371q270r144r575j0105j0448j0297j0084j0382j1074
52229A253548j1664j1961j2059j1872j1248j0356r585r072q564p718o480n160
52217A137809m201l702l275k523j574p88r4R06K202L270L850M239M672M959N044
52202A150794N312N915O243N773N028N023N782O151N316L960L526M556O098O802
52188A226279O292N250M299L339K084P78j18p39j701l238m988o616q058r141r580
52173A204142r519r436r341q719p555o663o488o276n100l118j186L83J854L191
52159A136169M003M317M668N321N852N678M588K828R79k68o22m44k41l6M87J368
52143A174647K329L123L592L507K788J807J036N61K37J66N72J405K492L844N382
$$ plain form
52128 1207488 1214210 1221967 1231112 1242568 1256721 1272982 1290909 1311098 1334303 1360153 1387535 1415963
52116 1415963 1445708 1476651 1507922 1538811 1569255 1599089 1627438 1653310 1676429 1697152 1715920
52105 1715920 1733142 1749312 1764775 1779386 1792678 1804364 1814506 1823295 1830834 1837199 1842565 1847210
52093 1847210 1851276 1854407 1855760 1854592 1850809 1844677 1836060 1824337 1809216 1791232 1771284 1750063 1728307
$$ packed form
52128A207488O722P757R145J1456J4153J6261J7927K0189K3205K5850K7382K8428
52116A415963K9745L0943L1271L0889L0444K9834K8349K5872K3119K0723J8768
52105A715920J7222J6170J5463J4611J3292J1686J0142Q789P539O365N366M645
52093A847210M066L131J353j168l783o132q617j1723j5121j7984j9948k1221k1756
$$ [...]
##END NTUPLES=NMR SPECTRUM
##END=
