##TITLE=AC1524_ROEFFECT0006_8202296_HPoOqEx9dn
##JCAMPDX= 6.0         $$ Bruker NMR JCAMP-DX V2.0
##DATA TYPE= NMR SPECTRUM
##DATA CLASS= NTUPLES
##ORIGIN= BRUKER
##OWNER= Administrator
$$ 1.72 TOPSPIN		Version 2.1
$$ 2014-07-31 17:46:31.012 -0700  Administrator@X
$$ Compression mode = diff/dup
##.OBSERVE FREQUENCY= 400.02188249412
##.OBSERVE NUCLEUS= ^1H
##.ACQUISITION MODE= SIMULTANEOUS (DQD)
##.ACQUISITION SCHEME= undefined
##.AVERAGES= 8
##.DIGITISER RES= 22
##SPECTROMETER/DATA SYSTEM= spect
##.PULSE SEQUENCE= zg30
##.SOLVENT NAME= COFFEE_meoh
##.SHIFT REFERENCE= INTERNAL, COFFEE_meoh, 1, 14.98509
##AUDIT TRAIL= $$ (NUMBER, WHEN, WHO, WHERE, PROCESS, VERSION, WHAT)
$$ ##TITLE= Audit trail, TOPSPIN		Version 2.1
$$ ##JCAMPDX= 5.01
$$ ##ORIGIN= Bruker BioSpin GmbH
$$ ##OWNER= Administrator
$$ $$ E:\/data/COFFEE/nmr/AC1524_ROEFFECT0006_8202296_HPoOqEx9dn/20/pdata/1/auditp.txt
$$ ##AUDIT TRAIL=  $$ (NUMBER, WHEN, WHO, WHERE, PROCESS, VERSION, WHAT)
(   1,<2014-07-31 17:46:22.429 -0700>,<Administrator>,<X>,<go>,<TOPSPIN 2.1>,
      <created by zg
	started at 2014-07-31 17:45:21.647 -0700,
	POWCHK enabled, PULCHK disabled,
       configuration hash MD5:
       16 EA D6 F4 BB 67 03 14 9B FF E7 A0 43 5B 48 2E
       data hash MD5: 64K
       EE 1E 3C 43 98 68 46 BE A8 89 A2 C2 D8 01 C3 00>)
(   2,<2014-07-31 17:46:26.003 -0700>,<Administrator>,<X>,<proc1d>,<TOPSPIN 2.1>,
      <Start of raw data processing
       efp LB = 0 FT_mod = 6 PKNL = 1 PHC0 = 0 PHC1 = 0 SI = 32K 
       data hash MD5: 32K
       D2 96 74 91 C3 CC 21 88 F6 13 50 BB 64 C6 B2 6F>)
(   3,<2014-07-31 17:46:26.431 -0700>,<Administrator>,<X>,<proc1d>,<TOPSPIN 2.1>,
      <pk PHC0 = 93.89465 PHC1 = 0 
       data hash MD5: 32K
       E0 F4 E0 56 82 F5 4F C8 81 7E 9B 6F 8B 69 A4 87>)
(   4,<2014-07-31 17:46:26.573 -0700>,<Administrator>,<X>,<proc1d>,<TOPSPIN 2.1>,
      <abs ABSG = 1 
       data hash MD5: 32K
       90 50 41 12 51 3D 32 4E 3F 4F 55 B5 00 61 6C 83>)
(   5,<2014-07-31 17:46:26.675 -0700>,<Administrator>,<X>,<proc1d>,<TOPSPIN 2.1>,
      <abs ABSG = 2 
       data hash MD5: 32K
       31 6C 79 16 B1 72 00 6F 81 9C EB DC AC 32 20 EB>)
(   6,<2014-07-31 17:46:26.757 -0700>,<Administrator>,<X>,<proc1d>,<TOPSPIN 2.1>,
      <abs ABSG = 3 
       data hash MD5: 32K
       23 70 99 9C 16 A7 AB 5B 9F 33 FF 88 40 B2 39 72>)
(   7,<2014-07-31 17:46:26.858 -0700>,<Administrator>,<X>,<proc1d>,<TOPSPIN 2.1>,
      <abs ABSG = 4 
       data hash MD5: 32K
       50 F2 37 1E CB 8F 42 48 9E 90 7E 19 5C F7 6B 04>)
(   8,<2014-07-31 17:46:26.920 -0700>,<Administrator>,<X>,<proc1d>,<TOPSPIN 2.1>,
      <abs ABSG = 5 
       data hash MD5: 32K
       87 A8 32 78 01 4B 92 56 AF A2 30 34 C4 D5 69 73>)
$$ ##END=
$$ 
$$ $$ hash MD5
$$ $$ 36 7B 17 14 BC 06 CA 94 50 FB 7A 71 15 8B 12 62
##$RELAX= 
##$RELAX= 
##$RELAX= 
##$RELAX= 
##$RELAX= 
##$RELAX= 
##$RELAX= 
$$ Bruker specific parameters
$$ --------------------------
##$DU= <E:\>
##$EXPNO= 20
$$ [...]
150 150 150 150 150 150 150 150
##$TP07= 0
##$TPNAME0= <>
##$TPNAME1= <>
##$TPNAME2= <>
##$TPNAME3= <>
##$TPNAME4= <>
##$TPNAME5= <>
##$TPNAME6= <>
##$TPNAME7= <>
##$TPOAL= (0..7)
0.5 0.5 0.5 0.5 0.5 0.5 0.5 0.5
##$TPOFFS= (0..7)
0 0 0 0 0 0 0 0
##$TUNHIN= 0
##$TUNHOUT= 0
##$TUNXOUT= 0
##$USERA1= <user>
##$USERA2= <user>
##$USERA3= <user>
##$USERA4= <user>
##$USERA5= <user>
##$V9= 5
##$VALIST= <valist>
##$VCLIST= <CCCCCCCCCCCCCCC>
##$VD= 0
##$VDLIST= <DDDDDDDDDDDDDDD>
##$VPLIST= <PPPPPPPPPPPPPPP>
##$VTLIST= <TTTTTTTTTTTTTTT>
##$WBST= 1024
##$WBSW= 4
##$XGAIN= (0..3)
0 0 0 0
##$XL= 0
##$YL= 0
##$YMAX_a= 623819
##$YMIN_a= -529529
##$ZGOPTNS= <>
##$ZL1= 120
##$ZL2= 120
##$ZL3= 120
##$ZL4= 120
##$ABSF1= 14.98509
##$ABSF2= -5.573092
##$ABSG= 5
##$ABSL= 3
##$ALPHA= 0
##$AQORDER= 0
##$ASSFAC= 0
##$ASSFACI= 0
##$ASSFACX= 0
##$ASSWID= 0
##$AUNMP= <proc_prof1d_extract_pilot.lims>
##$AXLEFT= 0
##$AXNAME= <>
##$AXNUC= <1H>
##$AXRIGHT= 0
##$AXTYPE= 0
##$AXUNIT= <>
##$AZFE= 0.1
##$AZFW= 0.1
##$BCFW= 0
##$BC_mod= 0
##$BYTORDP= 0
##$COROFFS= 0
##$CY= 15
##$DATMOD= 1
##$DC= 0
##$DFILT= <>
##$DTYPP= 0
##$F1P= 0
##$F2P= 0
##$FCOR= 0.5
##$FTSIZE= 32768
##$FT_mod= 6
##$GAMMA= 0
##$GB= 0
##$INTBC= 1
##$INTSCL= 1
##$ISEN= 128
##$LB= 0
##$LEV0= 0
##$LPBIN= 0
##$MAXI= 10000
##$MC2= 0
##$MEAN= 0
##$ME_mod= 0
##$MI= 0
##$NCOEF= 0
##$NC_proc= -8
##$NLEV= 6
##$NOISF1= 0
##$NOISF2= 0
##$NSP= 0
##$NTH_PI= 0
##$NZP= 0
##$OFFSET= 14.98509
##$PC= 1
##$PHC0= 93.89465
##$PHC1= 0
##$PH_mod= 1
##$PKNL= yes
##$PPARMOD= 0
##$PPDIAG= 0
##$PPIPTYP= 0
##$PPMPNUM= 2147483647
##$PPRESOL= 1
##$PSCAL= 4
##$PSIGN= 0
##$PYNMP= <proc.py>
##$REVERSE= no
##$SF= 400.02
##$SI= 32768
##$SIGF1= 0
##$SIGF2= 0
##$SINO= 400
##$SIOLD= 32768
##$SPECTYP= <>
##$SREGLST= <1H.CDCl3>
##$SSB= 0
##$STSI= 32768
##$STSR= 0
##$SW_p= 8223.68421052631
##$SYMM= 0
##$S_DEV= 0
##$TDeff= 65536
##$TDoff= 0
##$TI= <>
##$TILT= no
##$TM1= 0
##$TM2= 0
##$TOPLEV= 0
##$USERP1= <user>
##$USERP2= <user>
##$USERP3= <user>
##$USERP4= <user>
##$USERP5= <user>
##$WDW= 1
##$XDIM= 32768
##$YMAX_p= 448782802
##$YMIN_p= -782205
##$CURPLOT= <Network HP LaserJet P1505>
##$CURPRIN= <$Network HP LaserJet P1505>
##$DFORMAT= <normdp>
##$LAYOUT= <+/1D_H.xwp>
##$LFORMAT= <normlp>
##$PFORMAT= <normpl>
##$SURQMSG= 1
$$ End of Bruker specific parameters
$$ ---------------------------------
##NTUPLES= NMR SPECTRUM
##VAR_NAME=  FREQUENCY,     SPECTRUM/REAL,   SPECTRUM/IMAG
##SYMBOL=    X,             R,               I
##VAR_TYPE=  INDEPENDENT,   DEPENDENT,       DEPENDENT
##VAR_FORM=  AFFN,          ASDF,            ASDF
##VAR_DIM=   32768,         32768,           32768
##UNITS=     HZ,            ARBITRARY UNITS, ARBITRARY UNITS
##FACTOR=    0.250966925370066, 1,           1
##FIRST=     8223.43324360094, -114660,      -124238
##LAST=      0,             -358888,         -130928
##MIN=       0,             -782205,         0
##MAX=       8223.43324360094, 448782802,    0
$$ Real data points
##PAGE= N=1
##DATA TABLE= (X++(R..R)), XYDATA
$$ [...]
19516F2343G650b1749A00358k9376i4336K0891D714J98878e9597B04982E4853
19504f5315j51814f1886k51643a56427k97984e3730A78828p5655a56953p046k03675
19493c67674M1995D2452f4928J0940G1696b1212I3938a2658q6572I6115Q1551
19482A77666b71754A91800i0175j67818A11548a68443r5549f9900i320A72317
19471c28106A05711a7789j84070a634k86164d8160J9815N54B05320p1307f0121
19459A91473J22056f296j57799L225h0363p3986k4481L4627A92572r6207k2410
19448G3955L0737C6581c12713l4902a10881b2408B20858b53133B66451b16098
19437a55393K3290f0396b9217m56822e5431l4810j71807A72385b54012m4154D733
$$ plain form
19516 62343 7650 -21749 100358 70982 -94336 -73445 4714 203592 -59597 204982 54853
19504 -65315 -217129 -61886 -313529 -156427 -454411 -53730 178828 103173 -156953 -163999 -367674
19493 -367674 -325679 42452 -64928 -53988 71696 -21212 93938 -12658 -99230 96115 177666
19482 177666 -271754 191800 -90175 -257993 111548 -168443 -263992 -69900 -9320 172317
19471 -328106 105711 -17789 -201859 -1634 -287798 -48160 -28345 -27791 205320 134013 -60121
19459 191473 313529 -6296 -164095 -160870 -80363 -154349 -178830 -144203 192572 96365 73955
19448 73955 104692 36581 -312713 -347615 -110881 -22408 220858 -253133 266451 -216098
19437 -155393 -132103 -60396 -29217 -486039 -55431 -90241 -262048 172385 -254012 -298166 4733
19425c81911c5397m6769C06378b59146b3781q0311j92007C9066c26563A07927
19414A54047o0854m2396b15384H6764h6296A08909A8221J48653A7881K8098a90547
19402C6524a41873B8072a09678L5248A65282b85497i5827q191A22456b19425j23
19391b19548R4872M5889r2039o5292J08836J3798j06027A67162c7799k36245B70879
19379b01805n2852j42112f4985n3212e8436k12757g6692k04239a15262J062j7354
19368a31554C0583J06360e2580l2225A07370E2096B3353M30465f0389F4136Q9277
19357A53413K3006a58343j63572C97291C6177d98905A39281a58213b3516l5033
19347e8549k03854B2810J39391c63908a9851B99746a68205a5380A39365O692A6139
$$ plain form
19425 -381911 -35397 -82166 306378 -259146 -23781 -104092 -296099 39066 -326563 107927
19414 154047 93193 50797 -215384 86764 -86296 108909 18221 166874 17881 45979 -190547
19402 36524 -141873 28072 -109678 -74430 165282 -285497 -95827 -104018 122456 -219425 -219548
19391 -219548 -124676 -78787 -170826 -236118 -127282 -113484 -219511 167162 -37799 -274044 270879
19379 -201805 -254657 -396769 -64985 -118197 -58436 -271193 -76692 -280931 -115262 -114200 -131554
19368 -131554 30583 136943 -52580 -84805 107370 52096 23353 453818 -60389 64136 153413
19357 153413 176419 -158343 -321915 397291 36177 -498905 139281 -158213 -23516 -58549
19347 -58549 -262403 22810 162201 -363908 -19851 299746 -168205 -15380 139365 146057 16139
19335b09334M7764O5851j52495b7662m4280H1586g8247C1663a07288K952k73597
19324c77933a45986e5920b071D5567i9281d6067j07390A99380d428B88016I5185
19312a86742I5832b90853a04826d7594C1426b73623d0849r6785j8081g1347A04448
19300b96717E4252a30236d9796l079H2446b592B10568a44343H6272d1518C86587
19288g3776o6065M4961M373H6957a06423b2802k94590P4781K8993R0437k28517
19277c51698A1093a34804C9453a04104k039M5980A93d14158a7487A59293F415
19265a33656F0053J93694G0217a12289d4120k47496N8856p536m5459m1595c374
19253E1004d4189k07117A35574a78436d3776A20074J12364h9269D7053j3561r465
$$ plain form
19335 -209334 -161570 -95719 -248214 -27662 -71942 81586 -78247 31663 -107288 -104336 -377933
19324 -377933 -145986 -55920 -2071 45567 -99281 -46067 -153457 199380 -4428 288016 95185
19312 -186742 95832 -290853 -104826 -47594 31426 -273623 -40849 -137634 -155715 -71347 104448
19300 -296717 54252 -130236 -49796 -52875 82446 -2592 210568 -144343 86272 -41518 386587
19288 -73776 -139841 -94880 -90507 86957 -106423 -22802 -317392 -242611 -213618 -123181 -351698
19277 -351698 11093 -134804 39453 -104104 -106143 -60163 193 -414158 -17487 159293 6415
19265 -133656 60053 253747 70217 -112289 -44120 -291616 -232760 -240296 -285755 -327350 -3374
19253 51004 -44189 -251306 135574 -178436 -43776 120074 232438 -89269 47053 33492 24027
19242B4027O0670a58038g8825I400a30283k29777A3987M7259f5597l2148d5945
19230a90779A95820G9239c23982A40278b02505B22669A01547a49659k87014K05798
19220b30875i8687l1390C65964A28979b25991F1398f3872I2699f5205n02640K67342
19209c00503D1989b20470A86641b12144G5666K87754c90994A38979b53573a17474
19198F0761J81684d18596G2432J1293A0647P9568b8066j43865q3430r2281J12945
19187b34697b9896k09634i2629l09304L9945b1401B2377M72575d61626B1054b0846
19175F242g5718A36089f1091E3019J75761b33237g3872A69051c0332l15246H6606
19163b30327j52960a68248e1371k4875A49809M4512f1344B10344a33126N215r3928
$$ plain form
19242 24027 84697 -158038 -78825 9400 -130283 -360060 13987 61246 -65597 -97745 -45945
19230 -190779 195820 79239 -323982 140278 -202505 222669 101547 -149659 -436673 -230875
19220 -230875 -98687 -130077 365964 128979 -225991 61398 -63872 92699 -65205 -567845 -300503
19209 -300503 41989 -220470 186641 -212144 75666 363420 -390994 138979 -253573 -117474
19198 60761 242445 -418596 72432 83725 10647 90215 -28066 -171931 -255361 -347642 -234697
19187 -234697 -29896 -239530 -92629 -401933 -361988 -21401 22377 494952 -461626 21054 -20846
19175 6242 -75718 136089 -61091 53019 228780 -233237 -73872 169051 -30332 -345578 86606
19163 -230327 -383287 -168248 -51371 -76246 149809 194321 -61344 210344 -133126 -127911 -221839
19152b21839B00420a79952j41030a27572j02939A82985b49315c3199k53537J32637
19142a54099A48548a39532B44572b832o9200j46524R8055A41845b69954a07580
19131B061a39085B97838H0367J36210Q2942c20366A58672a59210D8705b12820
19120a22803j9625l29865K26709L2610A4573a47861D3224J23266a86439d9800
19109c6575B3352J00913B2073F989a60623B17886D6846a96427A3646b12692j44600
19098c57292k2957h2756C84153A75205b64676B00817i6457q3141A58544l8509
19088A20035c5034B25231a1942A10839k1888c4085F621a0828j36774A63179a12933
19076a96136L2333A23951A5989b15949j10745N8142R3147g519A78073g1429C84300
$$ plain form
19152 -221839 200420 -179952 -320982 -127572 -230511 182985 -249315 -33199 -286736 -154099
19142 -154099 148548 -139532 244572 -2832 -72032 -218556 -120501 141845 -269954 -107580
19131 2061 -139085 297838 80367 216577 299519 -320366 158672 -159210 48705 -212820
19120 -122803 -142428 -472293 -245584 -212974 14573 -147861 43224 166490 -186439 -49800
19109 -36575 23352 124265 22073 6989 -160623 217886 46846 -196427 13646 -212692 -357292
19098 -357292 -380249 -82756 384153 175205 -264676 200817 -96457 -179598 158544 120035
19088 120035 -35034 225231 -11942 110839 88951 -34085 6621 -10828 -147602 163179 -112933
19076 -196136 -163803 123951 15989 -215949 -326694 -268552 -175405 -7519 178073 -71429 384300
19064a49379c1757B0933J18904E2493O8671c02591H0616a60598I9896b82352n0388
19053c32740A45888F6775c982j51715o4766O6485P6388j87654F6661m800b21782
19041G5662a34678j1401k4014A96690i6767n61018L17057h7882p2510d0963G4038
19029E6253e7902j39703A60378b84161A88982J76242b36479c9635q4189c4695
19018b0040j07111A95759d9565a1787B81422H6418g4636k7790a5880l2166A75867
19006b33388A93955m9426F9576b28486L7658C22578A25311A5176J80300h6288
18995A56831g254m1453A45131a58765E3492j2607L5313C5087a75423H5459b42485
18983B52435e475j31831C3848i693j18471k5539C0325K77745A0931b06934d507
$$ plain form
19064 -149379 -31757 20933 139837 52493 121164 -302591 80616 -160598 99896 -282352 -332740
19053 -332740 145888 66775 -3982 -155697 -220463 -153978 -77590 -265244 66661 61861 -221782
19041 75662 -134678 -146079 -170093 196690 -96767 -657785 -340728 -87882 -160392 -40963 74038
19029 56253 -57902 -197605 160378 -284161 188982 365224 -236479 -39635 -123824 -34695
19018 -20040 -127151 195759 -49565 -11787 281422 86418 -74636 -102426 -15880 -48046 175867
19006 -233388 193955 144529 69576 -228486 -190828 322578 125311 15176 195476 -86288
18995 156831 -7254 -48707 145131 -158765 53492 40885 76198 35087 -175423 85459 -242485
18983 252435 -5475 -137306 33848 -9693 -128164 -153703 30325 308070 10931 -206934 -4507
18971C82372h6961D34511a04277K7337A87744b11531r2758J27044A93014C667
18960b82358f5230a4098m88923g1780I9594d4473r1822j07858A5224c18364p670
18949c26034B1011L1662a97082A44616d62687j2502F1651a41572I3253K03496
18939B96749d1184j47444r9219a41108F3578a20348j09042c0936j91052i5763
18928c638j18327D5807c22344b7189k8669j1366B4289f8387j08049G0572b85624
18916E9417c40340g9435j34052d0816k80727a03782B4920F789M8442K78066c02542
18904i7759H2424J68639D0311J71353G0882b18165Q0848F5941a23246G213K00989
18893B08202a16572A82642F3074a5946B80922H5179c39818B30706n7394B2143
$$ plain form
18971 382372 -86961 434511 -104277 -76940 187744 -211531 -304289 -177245 193014 3667
18960 -282358 -65230 -14098 -503021 -71780 99594 -44473 -136295 -244153 15224 -318364 -326034
18949 -326034 21011 52673 -197082 144616 -462687 -475189 61651 -141572 93253 296749
18939 296749 -41184 -188628 -287847 -141108 63578 -120348 -229390 -30936 -221988 -95763
18928 -3638 -121965 45807 -322344 -27189 -55858 -67224 24289 -68387 -176436 70572 -285624
18916 59417 -340340 -79435 -213487 -40816 -321543 -103782 24920 6789 55231 333297 -302542
18904 -97759 82424 251063 40311 211664 70882 -218165 -137317 65941 -123246 7213 208202
18893 208202 -116572 182642 63074 -15946 280922 85179 -339818 230706 173312 22143
18882d34060f6082A754d2987A12627b16542j36202d8250A50409b17198i5865l1700
18871a27565A51308b7429j23003b4499F0423a4012B28921q5168l8438b15364P7610
18860a37754P679B17470b3742G4834a57898G8939c9155a3141r0061b6682j50524
18849a77206C5536h1440C5350A0066a53043b5227j70117N8165B10397G6661c1517
18837b61924h6767f639C4843J65819a41948j00762A9614J7149a06082D12514b86071
18825f6973n6248B20366c8467A50793b90517f8127B31307a36497D6823P9743D9756
18813I9889A0774c8410o19j98662H1320a85151e8845k3517c9743J0177j09844
18802a39410B23720l4444l7272a6364j37793p3451F9215J3131a72676Q4036j3859
$$ plain form
18882 -434060 -66082 1754 -42987 112627 -216542 -352744 -48250 150409 -217198 -95865 -127565
18871 -127565 151308 -27429 -150432 -24499 60423 -14012 228921 143753 105315 -215364 -137754
18860 -137754 -130075 217470 -23742 74834 -157898 78939 -39155 -13141 -103202 -26682 -177206
18849 -177206 35536 -81440 35350 10066 -153043 -25227 -195344 -137179 210397 76661 -31517
18837 -261924 -86767 -6639 34843 200662 -141948 -242710 19614 36763 -106082 412514 -286071
18825 -66973 -123221 220366 -38467 150793 -290517 -68127 231307 -136497 46823 126566 49756
18813 99889 10774 -38410 -39029 -237691 81320 -185151 -58845 -82362 -39743 -29566 -139410
18802 -139410 223720 189276 152004 -16364 -154157 -227608 69215 82346 -172676 -88640 -102499
18791a02499A58096i3038E9123d4254C6769K4710h743m107j9793k01131B62354
18779B05654d9989B3410b40440L3129B9399J1369b54834A3145c01024d9212j655
18768e0867E424i1739p4367g40j60981B43858N738I305a33140o4395B39052C319
18755A99802i8746k0482l8316A44740L3355b97945Q1391A6769d6037I9526a55321
18743a35870B47137H9278b5089j06820B24650a33693M4402l19868A6312a0113
18732a50575h480j50222A44750c5165C15289f1188j01035A26488L0833a78801
18721C76936c67256J17372B12439b092B22702f4173k21401Q6145B76059h9344
18710a86699c4929N535k56457a04430B2827O6685M0495b67256E241J39787n3518
$$ plain form
18791 -102499 158096 -93038 59123 -44254 36769 61479 -8743 -12850 -32643 -233774 262354
18779 205654 -49989 23410 -240440 -207311 29399 40768 -254834 13145 -301024 -49212 -50867
18768 -50867 5424 -91739 -166106 -740 -161721 243858 249596 9305 -133140 -197535 239052 3319
18755 199802 -98746 -119228 -157544 144740 178095 -297945 -216554 16769 -46037 99526 -155321
18743 -135870 247137 89278 -25089 -131909 224650 -133693 -89291 -409159 16312 -10113
18732 -150575 -8480 -158702 144750 -35165 315289 -61188 -162223 126488 157321 -178801
18721 376936 -367256 -249884 212439 -2092 222702 -64173 -285574 -199429 276059 -89344
18710 -186699 -34929 -29394 -285851 -104430 22827 89512 130007 -267256 5241 145028 91510
18699I1510b08983a238l89853e5806a7741C6825b93163R1482B3009N3866l271
18688G3604B2400J0899a09765p5220P7339b6833j54711C5460b04312A9694a21497
18676c40900Q2169A97690f2496J6735m30445H9675c91997B37203f9543B82985
18665b7938H6504a48383j40765D9095b17143A99219J1523D0573N1366A3049g2124
18653h8896p2064B32014H9168d34654J86623I754e58793b28390a5053j36899k5767
18642a77719p132j32420j37933E9022J24665a25611c8701E9579a19743k69656
18632c89399J91033N2718L389d5512D9337A2755g3830k304n9501j2703C8267A8100
18619a11159d3486r3716A58436a0530o9041r8636r412B22200p4212b38823j43155
$$ plain form
18699 91510 -208983 -1238 -391091 -55806 -17741 36825 -293163 -201681 23009 76875 73604
18688 73604 22400 33299 -109765 -184985 -107646 -26833 -181544 35460 -204312 19694 -121497
18676 -340900 -258731 197690 -62496 -45761 -476206 89675 -391997 237203 -69543 282985
18665 -27938 86504 -148383 -289148 49095 -217143 199219 210742 40573 91939 13049 -72124
18653 -88896 -160960 232014 89168 -434654 -248031 9754 -558793 -228390 -15053 -151952 -177719
18642 -177719 -184851 -317271 -455204 59022 183687 -125611 -38701 59579 -119743 -389399
18632 -389399 -198366 -145648 -142259 -45512 49337 12755 -73830 -76134 -135635 -148338 38267 18100
18619 -111159 -43486 -137202 158436 -10530 -79571 -178207 -187619 222200 147988 -238823 -381978
18608c81978L0643J02635B96755a48393L3099N7484C6389a28517A12968a51594
18597E3085R2554c79642d4700H6632f6490D9448k1468a84243B6369P2633m9009
18586D9993f3894B55194b62232A8579i7780j7418j21957A21033f0882j46699B83622
18574b53213j07919F6152K01923b65625A3884J65464b67953A79481a42286C6253
18563b42049e0783E3770N3021a84072B10427e3944j19445l2984A12632n5518B2467
18551b82976A19691b14195R0596j45273c3215j56099Q3192C9768J51560d20701
18540a29144O3959B53136O5690F5223c02820H9331K11938p0352c9747E534b72707
18528B15596e3393l79767K05334h9073M3940l5712A40829I17c07371m7685F0890
$$ plain form
18608 -381978 -351335 -248700 296755 -148393 -115294 -57810 36389 -128517 112968 -151594
18597 53085 145639 -379642 -44700 86632 -66490 49448 27980 -184243 26369 99002 49993
18586 49993 -63894 255194 -262232 18579 -97780 -115198 -237155 121033 -60882 -207581 283622
18574 -253213 -361132 66152 268075 -265625 13884 179348 -267953 179481 -142286 36253
18563 -242049 -50783 53770 106791 -184072 210427 -53944 -173389 -206373 112632 57114 22467
18551 -282976 119691 -214195 -123599 -268872 -33215 -189314 -106122 39768 191328 -420701
18540 -129144 -65185 253136 318826 65223 -302820 89331 301269 230917 -39747 5534 -272707
18528 215596 -53393 -433160 -227826 -89073 -45133 -80845 140829 917 -307371 -355056 60890
18516F50998h3126D839K99017j19847o9839o329i4318c9587E6099b26473P5012
18505a51461j7077g5266A17541H564b24057B7306g9691r9419j24103r4099A6825
18493C13172a27800E9287a7100D9322a29347j26608A29310a56221k4129j4569
18483a94919i3369A30657b33142A67817D502f5678q9877N1439J41A61772G877
18471c58820c1844k46104A12354a07962M2264L2776k7247o2533A29491a56426
18460A72852H1726a11906d3274m261E7405j4088b09489A85942a83468G0897L2450
18449A03347b08546j54540C5623a41348B63442o5732b67476J25656B40015a10
18438f7973e009r5716C5061K81381j48647K23386k2928B5939K04177D2429J84389
$$ plain form
18516 650998 -83126 4839 303856 184009 114170 107841 -94318 -39587 56099 -226473 -151461
18505 -151461 -168538 -75266 117541 8564 -224057 27306 -79691 -179110 -303213 -397312 16825
18493 313172 -127800 59287 -17100 49322 -129347 -255955 129310 -156221 -180350 -194919
18483 -194919 -93369 130657 -233142 167817 4502 -65678 -155555 -104116 -103975 161772 7877
18471 -358820 -31844 -277948 112354 -107962 -65698 -32922 -60169 -122702 129491 -156426
18460 172852 81726 -111906 -43274 -47535 57405 43317 -209489 185942 -183468 70897 103347
18449 103347 -208546 -363086 35623 -141348 263442 197710 -267476 -141820 240015 -110
18438 -67973 -5009 -100725 35061 316442 167795 391181 368253 25939 230116 42429 226818
18427B26818c3550j06244r2843H6467e2504J6616A51899b6239l0505C8084b3204
18415a86154A7586H525K11794a15041e5983A78223E0609e30031F760h8399k3137
18404a11536L0156l4394J1315L2913A2383a68425k94000i7386l4100c0326m0912
18393g1238k98225B16406b514k49189O4574k86376b06373A00443a16038I3796
18382a09210m9708q585C5383K50895b2573A99652a35768d1924m6580B55766d10899
18370b76908g4387A85893a08931G3192M2224d9400l0010A5207J06737b31I427
18358B54863a89037f210j62407k35102A32773A4400K60866h6495K5736A96260
18347H8816G958K26583G0352l4680P9546a56325A63844M016a10789M0546I3167
$$ plain form
18427 226818 -33550 -139794 -232637 86467 -52504 -35888 151899 -26239 -56744 38084 -23204
18415 -186154 17586 8525 220319 -115041 -55983 178223 50609 -530031 6760 -88399 -111536
18404 -111536 -81380 -115774 -104459 -71546 12383 -168425 -462425 -97386 -131486 -30326 -71238
18393 -71238 -369463 216406 -2514 -251703 -187129 -473505 -206373 100443 -116038 93796
18382 -109210 -158918 -167503 35383 286278 -22573 199652 -135768 -41924 -88504 255766 -410899
18370 -276908 -74387 185893 -108931 73192 115416 -49400 -79410 15207 121944 -231 9427
18358 254863 -189037 -6210 -168617 -403719 132773 14400 275266 -86495 -60759 196260
18347 88816 7958 234541 70352 35672 115218 -156325 163844 167860 -110789 -70243 93167
18335a09996H6781b18077H1930a31306j07639L6951A73344d1502k52727K0864
18325b73365B38712A09136i2591q3857j9308A66680a12451G5125c42634n0744
18315c93378e0567j69738f8250j28034i6282k14195A6126a62760m8793G065a04123
18303A97597f779E5546L0016d2850B3768c60824J40853q5897a9584D21747a39224
18291b50704m5759h6598N439C051J77419b52495D9467L2260i9516N673j00407
18280a94250j25963Q5616e8381m3735A24054b89616A14726a99876D8963c75193
18269b90266c5316j37986A30136b02864A2077a04341n0958D8851N728g2238H3999
18257A98382E1993R5772e7603B69696h9181j10264I2858a39743c8425B00578a36865
$$ plain form
18335 -109996 86781 -218077 81930 -131306 -238945 -201994 173344 -41502 -294229 -273365
18325 -273365 238712 109136 -92591 -176448 -195756 166680 -112451 75125 -342634 -393378
18315 -393378 -50567 -220305 -68250 -196284 -96282 -310477 16126 -162760 -211553 7065 -104123
18303 197597 -6779 55546 85562 -42850 23768 -360824 -219971 -305868 -19584 421747 -139224
18291 -250704 -296463 -86598 -81159 3051 180470 -252495 49467 81727 -99516 -93843 -194250
18280 -194250 -320213 -234597 -58381 -102116 124054 -289616 114726 -199876 48963 -375193
18269 -290266 -35316 -173302 130136 -202864 12077 -104341 -155299 48851 54579 -72238 83999
18257 198382 51993 147765 -57603 269696 -89181 -199445 92858 -139743 -38425 200578 -136865
18245e1550n5490e0592k31675a36769m905I7609P9444b19223B15558R2068G6864
18233B9827J55483c7203A56470F118a74152F8230a69239N9733B7332c57014G0144
18221a49372n7566J6988B09920c45305h3203B08085a73144D9822a88464D3102
18210b04168b5843k89228R9125e3381I3294a4402B22124p3729i6472D351a50315
18198A21212b63663A81441q1903J49622m4286a61766N2840J1667q9963P0618j73822
18187b90426B0657a08989k8028B2671d78074A03381K27770h239F6173j5902b52031
18175A18139b20737A34744B6284L8043N3568K46833j37896b12917C2084a8010
18164A99448h6770A77843E2450e0445R684k6381j06053B15915d88556J93776A82187
$$ plain form
18245 -51550 -107040 -50592 -282267 -136769 -141674 97609 177053 -219223 215558 307626 76864
18233 29827 185310 -37203 156470 6118 -174152 68230 -169239 -109506 27332 -357014 70144
18221 -149372 -206938 -189950 209920 -345305 -83203 208085 -173144 49822 -188464 43102
18210 -204168 -25843 -315071 -215946 -53381 93294 -14402 222124 148395 -96472 4351 -150315
18198 121212 -263663 181441 99538 249160 204874 -161766 -108926 -97259 -187222 -116604 -290426
18187 -290426 20657 -108989 -137017 22671 -478074 103381 331151 -8239 66173 50271 -252031
18175 118139 -220737 134744 26284 64327 117895 364728 226832 -212917 32084 -18010
18164 199448 -86770 177843 52450 -50445 -40761 -67142 -173195 215915 -488556 -294780 182187
18152C6340d9198j87396C57109a441A35891g480j09538o7706H2399a76255D3397
18140B26131h5593B7564c86974A66084d6469l55475I215b59908A27793B2032K5286
18129D7318a74070G8118b94244D7151b10578h6331l37566a33715r6794Q8723c592
18117B71171L7733C568a44948n2505O1833A26693J99996a3707A31418b20392A42678
18105b69040a27928p7413C70188a50107G5345L1458g7242A15269K03143D8729
18094B82974K99446b96107B20858D9546b38115N6736h9721j75169I794c8613R306
18083b9307R233A26098a97002j56540J54184A93252J44762j01712j6145b0731
18072F5565a03883L5020J3709n5264A77894c8061j9497m8609j80073a16545j2288
$$ plain form
18152 36340 -49198 -236594 357109 -1441 135891 -7480 -117018 -184724 82399 -176255 43397
18140 226131 -85593 27564 -386974 166084 -46469 -401944 9215 -259908 127793 22032 47318
18129 47318 -174070 78118 -294244 47151 -210578 -86331 -423897 -133715 -230509 -141786 -3592
18117 271171 308904 3568 -144948 -197453 -135620 126693 326689 -13707 131418 -220392 142678
18105 -269040 -127928 -205341 370188 -150107 75345 106803 -77242 115269 318412 48729
18094 282974 582420 -296107 220858 49546 -238115 -181379 -89721 -264890 9794 -38613 -29307
18083 -29307 -20074 126098 -197002 -353542 -199358 193252 338014 236302 220157 -20731
18072 65565 -103883 -68863 -55154 -110418 177894 -38061 -57558 -106167 -286240 -116545 -128833
18061a28833B74983a66623A04447b01653k9542j9522Q861A37070E0949d02950
18050a48391A50353b33722k5078J15941j81873J23568A31770k8352O190c98895
18039F1261A9215c23174A67727a30191A9474b72507B61439d673A35531Kd2791
18027a49362r2886B73011A7842N8610e9427i136k03474j21753b7915k12696d8484
18015A78268E0243b16949a5903l46176J49923i3596A54531j0185h7068A09778
18004c65186D4786J8577j7377c23425J31552A0012a61822b5267B18737J6314f0241
17992C86331A62316f3480k08822i1111j04196A13698c2929l48698a14020B3798
17981A6903e5764C0914J10880O1036J62506c9388B07934b5055F1877d6221F0072
$$ plain form
18061 -128833 274983 -166623 104447 -201653 -231195 -250717 -241856 137070 50949 -402950
18050 -148391 150353 -233722 -258800 -142859 -324732 -201164 131770 103418 109608 -398895
18039 61261 19215 -323174 167727 -130191 19474 -272507 261439 -4673 135531 135533 -42791
18027 -149362 -242248 273011 17842 76452 -59427 -9136 -212610 -334363 -27915 -240611 -48484
18015 178268 50243 -216949 -15903 -362079 -212156 -93596 154531 144346 -87068 109778
18004 -365186 44786 63363 45986 -323425 -191873 10012 -161822 -25267 218737 235051 -60241
17992 386331 162316 -63480 -272302 -91111 -195307 113698 -32929 -381627 -114020 23798
17981 16903 -55764 30914 141794 202830 365336 -39388 207934 -25055 61877 -46221 60072
17969g9232m1743J9381H261c07294h272n9724J5254p8224j2278K4478L123g020
17956e5222o2886C9652e2971a8500A07742i6254B6494a45648H3837J43138b46591
17944A02378J76837h7455L8589A14360A9697a6991p0907J3166C566c44505A17616
17932D6001a80314A8K4166R6324i5997D01289b15631A93343g1099J180B76078
17920a41037j70024D2120J51182e1975A33397O9539J91422i9883c6810p8913H7197
17908a6379I46a55835A64059d05313A19310a47007D0114h3410k24899C37826a13650
17896B56029a09758C62653q5127b69037b8629A48764a61962B61988E1716J11010
17886A62726a43088D427c08396J27893H9209a09909B1826M5225a917j23174L5557
$$ plain form
17969 -79232 -120975 -101594 8261 -307294 -8272 -67996 -52742 -130966 -143244 -118766 -115643 -7020
17956 -55222 -118108 39652 -52971 -18500 107742 -96254 26494 -145648 83837 226975 -246591
17944 102378 279215 -87455 -48866 114360 19697 -16991 -87898 -74732 3566 -344505 117616
17932 46001 -180314 18 24184 120508 -95997 401289 -215631 193343 -71099 -69919 276078
17920 -141037 -311061 42120 193302 -51975 133397 202936 394358 -99883 -36810 -115723 87197
17908 -16379 946 -155835 164059 -405313 119310 -147007 40114 -83410 -308309 337826 -113650
17896 256029 -109758 362653 277526 -269037 -28629 148764 -161962 261988 51716 162726
17886 162726 -143088 4427 -308396 -180503 89209 -109909 21826 67051 -1917 -125091 -89534
17875h9534F5581d05236J74329l9244J10922A48318n749a41355b521k15844h6373
17863I1520a47320M8305C6575L07395j60212b4993I5037j4692K59729e2043B4872
17851g8025n0485E0881O5366e3075D5866r57J61678h3687A63621f1996j63799
17840b25795c620A53235g3456A23652a11182A66917m85l3392i0434j24090m526
17829b19050B8021M1930b27553H8167a77282m3628O7879E9950a43540f8608j71750
17818b40358L6679f0114C25598G7423J43563J43572a25405A78096e7756K641c750
17806A46322a57233l4525N3181G9593c7861A82114q1213f598B69322G8463b94671
17794a83081C4233j2097j991J33999a78938h8340A56500J8828a06306o8a3148
$$ plain form
17875 -89534 65581 -405236 -230907 -270151 -159229 148318 142569 -141355 -2521 -218365 -86373
17863 91520 -147320 -99015 36575 343970 183758 -24993 95037 80345 340074 -52043 24872
17851 -78025 -128510 50881 116247 -53075 45866 44909 206587 -83687 163621 -61996 -225795
17840 -225795 -3620 153235 -73456 123652 -111182 166917 166432 133040 -90434 -214524 -219050
17829 -219050 28021 69951 -227553 88167 -177282 -220910 -153031 59950 -143540 -68608 -240358
17818 -240358 -203679 -60114 325598 77423 220986 364558 -125405 178096 -57756 -55115 -3750
17806 146322 -157233 -191758 -138577 79593 -37861 182114 100901 -6598 269322 78463 -294671
17794 -183081 34233 22136 20145 154144 -178938 -88340 156500 175328 -106306 -106374 -13148
17782e9879j09681A10251b70738B53718b85766A19778P8026b91877A50370K19292
17772C69662A49388b89817A99158i7011b5675j72695G4755j6055g4157r60K1354
17761e3763A32644a26247A27556J4387d9334q7086H6072a80386l233A54068g9764
17749A22821d32602d9859j05505A7365o659a791A41349l58h8290o222C54863A7364
17736B21234A6526c85929C06781H6263l056c4922o3948K2700K3986m3805I8994
17724D2622J13478c8558O014j04324j2146L8899A81582B2124a32837G0931a78230
17712F2866M0161f1197b4757B76015c10281E5769N6700D8033J81269a17848M2615
17701g5233C82662d6844n3083j92152C56024H5566R0116d0860A68986a2642B93905
$$ plain form
17782 -59879 -169560 110251 -270738 253718 -285766 119778 197804 -291877 150370 369662
17772 369662 149388 -289817 199158 -97011 -25675 -198370 74755 58700 -74157 -75117 -53763
17761 -53763 132644 -126247 127556 141943 -49334 -136420 86072 -180386 -183619 154068 -79764
17749 122821 -432602 -49859 -155364 17365 10706 -1791 141349 140991 -88290 -94512 354863 17364
17736 221234 16526 -385929 306781 86263 83207 -34922 -98870 -76170 -52184 -95989 98994
17724 42622 156100 -38558 -32544 -136868 -149014 -110115 181582 22124 -132837 70931 -178230
17712 62866 103027 -61197 -24757 276015 -310281 55769 112469 48033 229302 -117848 -75233
17701 -75233 382662 -46844 -99927 -292079 356024 85566 175682 -40860 168986 -12642 293905
17689A13611B9601b05322c5852B6605p117K41642H6931d2801A5929i7108A19907
17677h8205J2254A60624a21110j31040a02284I6812e2249A1571i4736F190K3863
17666C0053L42621b7978D16014C583J05002m8730b43205D177f2852n4765J0727
17655a06890A2090e38076E6094b1465C97414o4380b4313B96127A01643J39860
17645B41503a66368B61834D8139A6873h5075D6999a09154A08207M4476P4374q1594
17634A45463D08K4734K35394j26168B9495K06996G6588j592j4830J19311a3660
17622b01726B7290a20636j35334B0565L7446J9316c8810A27064a2264l0874I8994
17610e0561k14612F6353a15456D25589A64970E5303c02627D2029b91530A84974
$$ plain form
17689 113611 29601 -205322 -35852 26605 19488 261130 86931 -42801 15929 -97108 119907
17677 -88205 -75951 160624 -121110 -252150 -102284 96812 -52249 11571 -94736 6190 30053
17666 30053 372674 -27978 416014 3583 108585 59855 -243205 4177 -62852 -117617 -106890
17655 -106890 12090 -538076 56094 -21465 397414 333034 -24313 296127 101643 241503
17645 241503 -166368 261834 48139 16873 -85075 46999 -109154 108207 152683 227057 145463
17634 145463 408 25142 260536 134368 29495 236491 76588 74996 60166 179477 -13660
17622 -201726 27290 -120636 -255970 20565 58011 77327 -38810 127064 -12264 -43138 98994
17610 -50561 -265173 66353 -115456 425589 164970 55303 -302627 42029 -291530 184974
17599d7856A74639G4571b7341c615o6125E5094g7458A19506N6643a8147A437e3847
17586B1811c87089G5105a27147B75020a1126j7034j4061q4047A70520h5201B54612
17574d5051l8869B98995b58267D0857O4053b42135f7496C09451b62974A88820
17563A39083d9319k79355C83115f1127j88265C59908f6539K3574B45519b28312
17552D02163f340k71300A3754L16371c58088A30590M97572A84453k4339B2352
17541c7233A56129h613E9140a53534p3622h5119j25819n2941j35201a8747F9558
17529c50773C84441h443B89740b43577D35974g5250B2951J9271J21310j5211p0998
17518G7323B3097K33183c7360j18384D1246a23660A18722n7427J06953a32552
$$ plain form
17599 -47856 174639 74571 -27341 -3615 -69740 55094 -77458 119506 176149 -18147 1437 -53847
17586 21811 -387089 75105 -127147 275020 -11126 -28160 -42221 -126268 170520 -85201 254612
17574 -45051 -83920 298995 -258267 40857 104910 -242135 -67496 309451 -262974 188820
17563 139083 -49319 -328674 383115 -61127 -249392 359908 -66539 -42965 245519 -228312
17552 402163 -6340 -277640 13754 330125 -358088 130590 628162 184453 160114 22352
17541 -37233 156129 -8613 59140 -153534 -227156 -85119 -210938 -263879 -399080 -18747 69558
17529 -350773 384441 -8443 289740 -243577 435974 -75250 22951 42222 163532 148321 77323
17518 77323 23097 256280 -37360 -155744 41246 -123660 118722 61295 168248 -132552
17507a73432I2478C3977n506J62982h716n0532K7564A27018k458L2910B623a31959
17494A41193R6972a8846B09469C7402J91457J01549c6429A48572n3897q385d0518
17482a7823A71220n5153J15848H000P3102L75361e1932C26297f2329B64464c3117
17470I8937R8174n1279B639L16325j36901l1610m4855a79474C72327a16114C16961
17458A3590L02786k2610G8638J72851F5931J59633q3779H221a14018B59951r5978
17447A63973k4477B8897K15077D7849J23867N448a55540P404C74432j59496q3995
17436A30941Q1947J0460c1304B12285J84982n6643j6412m0104K22559A99712N6090
17425B55802J2142j19789N0442e3864B92855L77198B70664B7553K02959I5899
$$ plain form
17507 -173432 92478 33977 28471 191453 -8716 -59248 -31684 127018 124560 157470 2623 -131959
17494 141193 238165 -18846 209469 37402 228859 330408 -36429 148572 94675 86290 -40518
17482 -17823 171220 116067 231915 8000 81102 456463 -51932 326297 -62329 264464 -33117
17470 98937 197111 145832 2639 318964 182063 150453 105598 -179474 372327 -116114 316961
17458 13590 316376 293766 78638 251489 65931 225564 141785 8221 -114018 259951 163973
17447 163973 139496 28897 243974 47849 171716 177164 -155540 -148136 374432 214936 130941
17436 130941 212888 223348 -31304 212285 397267 340624 324212 284108 506667 199712 255802
17425 255802 267944 148155 198597 -53864 292855 670053 270664 27553 230512 95899
17414A30251L6035F8657L23938A81059B2414K56617A22875B4084a5089A49184
17403g0977A03131J84463K14449j95066A8227J72537H7131K87647N2926l0749
17393C96955J09658q5277j25253L41741k92475k5281Q8988N3415G6457J46315
17383B22772a3959D82711m9039j73198k2626J34762D65Q7363M6150L25862B06185
17371f2647n3421I0221J14927F50L09892D602e0675E32475A89786l5639o3970
17360I0177K55191J13851I4496d8911A11980K47771b7440I8037J87400R5987q7842
17349B93582J96930M9674A43174J836K99920a7186n982l4832j50430f0374B35986
17337h4272F3255k4454a00728F5713R4883J30252Q8504A8575J59595L5795B7868
$$ plain form
17414 130251 166286 68657 392595 181059 22414 279031 122875 24084 -15089 149184
17403 -70977 103131 287594 502043 306977 18227 190764 87131 374778 427704 396955
17393 396955 506613 421336 296083 637824 345349 320068 409056 462471 76457 222772
17383 222772 -13959 482711 433672 260474 237848 372610 465 87828 133978 459840 206185
17371 -62647 -116068 90221 205148 650 310542 4602 -50675 532475 189786 154147 90177
17360 90177 345368 459219 94496 -48911 111980 359751 -27440 98037 285437 381424 293582
17349 293582 490512 540186 143174 145010 444930 -17186 -23168 -58000 -208430 -60374 235986
17337 -84272 63255 38801 -100728 65713 160596 290848 379352 18575 178170 213965 27868
17325D26046j67272J81218D7163M0316R7132J94871q0560A09424K85997A35715
17314B54608B94K42177p3561J9777K8218Q8722H4856a53911M7174A48669f682
17302a11755A59573p0736j0526M5750L0927h6766F12341A02860K31105k6702A7131
17290I0872k3152k3675R6678K86511j36677a7829A72797Q9535J13385f6228A14975
17278C2491L83989J3680A06637J51608P5585A47850J8785J40017I2476l642N2482
17267A41316J67586j01749A2602K84831j04097b3428A73190O4160A04725K60002
17257C64727r0668H343d8274C48061m3605J85539B26821p7316l1600e497E02562
17245A65755n862R0962q6799J72837G928J35041a2047A32502R0079J60026A69450
$$ plain form
17325 426046 258774 439992 47163 87479 184611 379482 298922 109424 395421 135715
17314 254608 294 242471 168910 188687 216905 305627 84856 -153911 -106737 148669 -6682
17302 -111755 159573 88837 78311 124061 154988 -86766 612341 102860 333965 307263 17131
17290 90872 67720 44045 140723 427234 290557 -17829 172797 262332 375717 -66228 114975
17278 32491 416480 430160 106637 258245 333830 147850 166635 306652 92476 88834 141316
17267 141316 308902 207153 12602 297433 193336 -23428 173190 237350 104725 364727
17257 364727 274059 8343 -48274 348061 304456 489995 226821 149505 117905 -5497 502562
17245 165755 159893 250855 164056 336893 7928 142969 -12047 132502 222581 382607 169450
17233A34468l8708J78795A31059P5703J48210j67929B6226K02031J06500I9615
17222b2593C37156j33784J67392j80377B4924L01702j58095A4127b669D45992
17211F4730L67932l0015K6201j2410A75483L07048A93859K8066l8275J96035j28370
17200B51315F6706L02124m6453k3058J99840k5338O4664K6923j74870I9182J54957
17189B54139M6284G6237Q8687K43286J33531A00755K71142j30621o9151l8695
17179A33430J03558a20591B61848n7883O6512j59b9793B15926G2663J62208N0273
17168B85144L4146b9499B08586K22809r3731N1945m1030J8428j45446L7845l4803
17157B24603N951J26881A66795J71557O8983p5457O4844j41502L3566q6370J18564
$$ plain form
17233 134468 95760 274555 131059 206762 354972 187043 26226 228257 334757 99615
17222 -22593 337156 203372 370764 190387 24924 326626 168531 14127 -2669 445992
17211 64730 432662 402647 428848 416438 175483 482531 193859 221925 183650 379685 251315
17200 251315 66706 368830 322377 299319 499159 473821 538485 565408 390538 99182 254139
17189 254139 300423 76237 164924 408210 541741 100755 371897 241276 172125 133430
17179 133430 236988 -120591 261848 203965 270477 270318 -29793 215926 72663 234871 285144
17168 285144 319290 -29499 208586 431395 337664 389609 348579 367007 221561 259406 224603
17157 224603 230554 357435 166795 338352 407335 331878 396722 255220 288786 202416 320980
17146C20980P4001r8062Q6058l5644r2465K15475K2634j52057A69585L52740n3947
17135D68378k33278K83415j0906k30602j04859M09744K97753C38409j21745L33847
17125E50511B59509J04572j36646K02936K57297j92199j42757r4733M0606j21302
17115A77283K19549P6948A94602K00185K91834k84445J10072q0232R0458J05667
17105F28141J31444B86981J76043n2804H2828J4717L14359K12780B81861J47939
17095D29800l2355p7231m0063N1458J47897J72773J35429l71394P2826k6881K41975
17084G04234k55477L7038k6214q9530R146k3736A72206N50226k80718j50578Q3347
17073C74483A64217M37322Q7519n7589k21955M2824J14832k52517K87017k61780
$$ plain form
17146 320980 394981 296919 382977 347333 254868 470343 492977 340920 169585 522325 468378
17135 468378 235100 518515 507609 277007 172148 581892 879645 338409 216664 550511
17125 550511 259509 364081 227435 430371 687668 495469 352712 257979 298585 177283
17115 177283 396832 473780 194602 394787 686621 402176 512248 432016 522474 628141
17105 628141 759585 286981 463024 410220 82828 97545 411904 624684 281861 429800
17095 429800 397445 320214 280151 331609 479506 652279 787708 416314 489140 462259 704234
17084 704234 448757 485795 459581 370051 379197 355461 172206 722432 441714 291136 374483
17073 374483 164217 601539 689058 631469 409514 452338 567170 314653 601670 339890
17063C39890M89620C48462j58048K96034M10440B89704M26181j00182k415j08886
17053E04402j81558L76495k3661j20922k15319J28819j4849J40510m9340k0014
17043E24563m3484K9139j42448q2980M59746j38344J03471l6819l08352K41598
17033F06090j93967L713J66347j93616L74702q1649k57268L57718L1335C86428
17022E66262P2206J09568J02662j68431P3839j16518j25161J91260K54555D07461
17011I34108Q15j18315j98696j09673K44042l33157K89820j06126N1271K71161
17001I25250l57740K82293j79263R9418k9458M5313L19993j42905k8107J01169
16991A035963j70748R4507L0102m77099K25638L39360Q2148k68394j24582P2243
$$ plain form
17063 339890 829510 348462 190414 486448 896888 289704 715885 615703 613288 504402
17053 504402 322844 699339 675678 554756 339437 468256 453407 593917 544577 524563
17043 524563 481079 510218 367770 284790 744536 606192 709663 672844 364492 606090
17033 606090 412123 415836 582183 388567 763269 681620 424352 782070 813405 386428
17022 566262 638468 748036 850698 682267 756106 639588 514427 705687 960242 407461
17011 934108 934923 816608 617912 508239 752281 419124 708944 602818 654089 925250
17001 925250 567510 849803 670540 769958 740500 785813 1105806 962901 934794 1035963
16991 1035963 865215 959722 989824 512725 738363 1077723 1159871 891477 766895 839138
16981H39138J84274j18446K9744P0949Q9088j98206L37579k88593m5184P0417
16971I70760q8838J16184o1744l0131N1578j75151L74235j25435J98224p8210
16961A151472j85551J63410M5038k66433p7769L42707m49337M09117R6404j22413
16951A106645m7569k9056M07902l64307l4727K86811k17569l2638J69551k45074
16941I99969M61346J30100l53952m3361n3490L91167m93200K32592l69867M32888
16931A334192k44814j1619J78804O0120k93392K25391J18586J3448J02436k38399
16921A244753k1083j17287O32211l35939J33867K13505j61879J0636j52830K39697
16911A685651p9931q9504J84217l24723L94051l8491O9146o217r9849M3837l1211
$$ plain form
16981 839138 1023412 904966 934710 1005659 1094747 896541 1234120 945527 900343 970760
16971 970760 881922 998106 936362 906231 957809 782658 1156893 1031458 1229682 1151472
16961 1151472 965921 1129331 1174369 907936 830167 1172874 723537 1132654 1229058 1106645
16951 1106645 1059076 1030020 1437922 1073615 1038888 1325699 1108130 1075492 1245043 999969
16941 999969 1461315 1591415 1237463 1194102 1140612 1531779 1038579 1271171 901304 1334192
16931 1334192 1089378 1077759 1256563 1316683 1023291 1248682 1367268 1380716 1483152 1244753
16921 1244753 1223670 1106383 1738594 1402655 1536522 1750027 1588148 1598784 1445954 1685651
16911 1685651 1605720 1516216 1700433 1375710 1769761 1731270 1800416 1794199 1694350 1738187 1706976
16900A706976J21454k08160J41636k2736K9834J34934Q7106k4385j62638L96355
16890B200376K8185l95673O5718Q3314J74849k76893o0908J95897k7418p7724
16880A909723M11853N6197m77024P2191L77826k17414M26934n47039R0468K29850
16870B333565M73478o89391m2205L13213Q0402L19104n76504P6901M6749K90075
16860B625387k371Q4903K8028J53610K27712m31730o1923N53626j63296K99103
16850C313049m63858M21219m92262M55149r9824k12108L11072N3282R4887K57540
16840C638146k6283l29128J73868J3958J38972k00411J47158K98631j1131M3395
16830C887175q0369l69781R48891l56102K45450m9643K81083l43248K98814K49505
$$ plain form
16900 1706976 1828430 1620270 1761906 1739170 1769004 1903938 1991044 1966659 1804021 2200376
16890 2200376 2228561 1832888 1898606 1981920 2156769 1879876 1818968 2014865 1987447 1909723
16880 1909723 2321576 2377773 1900749 1972940 2350766 2133352 2560286 2013247 2103715 2333565
16870 2333565 2807043 2117652 2075447 2388660 2469062 2788166 2211662 2288563 2335312 2625387
16860 2625387 2623016 2707919 2735947 2889557 3117269 2685539 2623616 3177242 3013946 3313049
16850 3313049 2849191 3270410 2778148 3233297 3133473 2921365 3232437 3285719 3380606 3638146
16840 3638146 3611863 3282735 3456603 3470561 3609533 3409122 3556280 3854911 3843780 3887175
16830 3887175 3806806 3437025 4385916 4029814 4275264 4225621 4506704 4163456 4462270 4711775
16820D711775k0503J42774n13730L31344J22114o44K43551K7839Q6484M0095J7186
16809E188285L63621l602j23816L11016N3475K93206k74474K03617J35324K57494
16799F404146M9671K3938L55825q9034L11961j12795L88782k45772M82008k1252
16789G547478N71997k29259J4774O98128j14117k24483J73994L75257j0445K88288
16779I091612M13948l68107Q15412J54800Q9754J65580L71199K8319N76298K86748
16769A1625563J90696M66952j22471O02454Q8108M46370M67120Q4837N15549L5916
16759A4401094P88691M74138K42492N87431O06574J64425N38378M92946M11430
16750A8707599O92603M02564R10527O79816O99671O41069O27794P87805Q30607
$$ plain form
16820 4711775 4691272 4834046 4320316 4651660 4773774 4773130 5016681 5044520 5131004 5171099 5188285
16809 5188285 5551906 5548304 5424488 5735504 5788979 6082185 5807711 6011328 6146652 6404146
16799 6404146 6453817 6477755 6833580 6744546 7056507 6943712 7332494 7086722 7568730 7547478
16789 7547478 8119475 7890216 7904990 8603118 8489001 8264518 8438512 8813769 8803324 9091612
16779 9091612 9505560 9137453 9952865 10107665 10197419 10362999 10734198 10762517 11338815 11625563
16769 11625563 11816259 12283211 12160740 12763194 12851302 13297672 13764792 13849629 14365178 14401094
16759 14401094 15189785 15663923 15906415 16493846 17100420 17264845 17803223 18296169 18707599
16750 18707599 19400202 19802766 20713293 21393109 22092780 22733849 23361643 24149448 24980055
16741B4980055J005501N35654R70347Q65853Q07988J057171J568765R03683J048941
16732C3743958J652385Q47129J469784J456729J601384J715633K037514J361501
16724D5886017J957085J784616K169345J684227K434526K709750K367903K452324
16716F3445793K828137K652591K991968K904050L783752K850482L526243L628291
16708H8611307L418000L832518L443289L932810L705516L851139L831420L526272
16700A18152271L198642L092585L041032K726883K872550J732905J866135J141491
16692A37824494N79250O23189k39076r40884j186207j649214j848874k535262
16684A30627416k330161l188580l143115l759489l709078l384004l965099m066541
$$ plain form
16741 24980055 25985556 26521210 27491557 28357410 29165398 30222569 31791334 32695017 33743958
16732 33743958 35396343 36243472 37713256 39169985 40771369 42487002 44524516 45886017
16724 45886017 47843102 49627718 51797063 53481290 55915816 58625566 60993469 63445793
16716 63445793 66273930 68926521 71918489 74822539 78606291 81456773 84983016 88611307
16708 88611307 92029307 95861825 99305114 103237924 106943440 110794579 114625999 118152271
16700 118152271 121350913 124443498 127484530 130211413 133083963 134816868 136683003 137824494
16692 137824494 138403744 139026933 138787857 137846973 136660766 135011552 133162678 130627416
16684 130627416 128297255 125108675 121965560 118206071 114496993 111112989 107147890 103081349
16676A03081349l814823l677974l821936l698708l323914l806320l241717l103214
16668G4592743l322692k853208l053501k736082k485436k679286k265835j956361
16660E3240342k373140k394571j614965k014201j856207j616177j533702j686369
16652C8151010j194948j300821j493244r32538j046654j289318j359349r73496
16644B8560642q58736q16486j320975k83922j354321l23303r71413j208857j72184
16635B1250445n14592m80514q08399q61615l24087m85867q71952j33500o31477
16626A6138442o72653m1625l60172n55361n78898K0941l54289l41317l52444l42543
16616A2560081l92699M4118n50110n62475K46520n45265j47272m63889J10531
$$ plain form
16676 103081349 99266526 95588552 91766616 88067908 84743994 80937674 77695957 74592743
16668 74592743 71270051 68416843 65363342 62627260 60141824 57462538 55196703 53240342
16660 53240342 50867202 48472631 46857666 44843465 42987258 41371081 39837379 38151010
16652 38151010 36956062 35655241 34161997 33229459 32182805 30893487 29534138 28560642
16644 28560642 27701906 26885420 25564445 25280523 23926202 23602899 22631486 21422629 21250445
16635 21250445 20735853 20255339 19446940 18585325 18261238 17775371 16903419 16769919 16138442
16626 16138442 15465789 15424164 15063992 14508631 13929733 13950674 13596385 13255068 12902624 12560081
16616 12560081 12167382 12211500 11661390 11098915 11345435 10800170 10652898 10189009 10299540
16607A0299540l50223k04725k26265k52452n08342L09567k4269n02931P5648l92392
16597H223156l42309l5834l28906K5774l56970o7778k57207J09773k95339J6263
16587F690623l79359J19400k78574j57222K4179O5419k33476m58457L89339j05744
16577E676128j38124l13272p7817L1145k63648J84537j88119K50466l96260J39669
16567D904705l61775J51051l45673N6111j12832M7571J13555m01590J79399q5711
16557D144811l35620J18314k91173K11024O2983j79480j35722l00933K15284J0561
16547C520049k36632J40976n6931j71051k8240k8619K22159k49312L71451n12800
16537B971050j96117K21867j40989k97840M41485j01852m27629K07661o1012l5576
$$ plain form
16607 10299540 9949317 9744592 9518327 9265875 8757533 9067100 9042831 8539900 8615548 8223156
16597 8223156 7880847 7845013 7516107 7541881 7184911 7117133 6859926 6969699 6674360 6690623
16587 6690623 6311264 6430664 6152090 5994868 6019047 6084466 5850990 5392533 5781872 5676128
16577 5676128 5538004 5224732 5146915 5178060 4914412 5098949 4910830 5161296 4765036 4904705
16567 4904705 4542930 4693981 4348308 4404419 4291587 4339158 4452713 4051123 4230522 4144811
16557 4144811 3809191 3927505 3636332 3847356 3910339 3730859 3595137 3294204 3509488 3520049
16547 3520049 3283417 3424393 3367462 3196411 3168171 3139552 3361711 3112399 3483850 2971050
16537 2971050 2774933 2996800 2855811 2557971 2999456 2897604 2469975 2677636 2616624 2581048
16527B581048J82005m1380k8768K04429m26580O7297J13239l1078k60568m25473
16517A934171M42656k83116K20186J21332j97737K98421l40116n6148O2922j97693
16507B004878J19755o7113j76843J81437J69757k33230k95141R7001O5916J5995
16497A882412K06121o42983O06705J5815p55373L92378J66908j32355r866M271
16487A734033p5397j93554L19428l21875M43304k71685j21711j9773K5911j17941
16477A400740L37402l09685J24141j86547J52769j8655j26399M7447J04454k57261
16467A268406N9107J88375m21061K21530J53328r2031m3259M4092q2122k90066
16457A006299K82492j59555Q958N17519k57582M9703l87490L2624k1156q5727
$$ plain form
16527 2581048 2763053 2721673 2692905 2897334 2470754 2538051 2651290 2620212 2359644 1934171
16517 1934171 2376827 2093711 2313897 2435229 2237492 2535913 2195797 2139649 2202571 2004878
16507 2004878 2124633 2057520 1880677 2062114 2231871 1998641 1703500 1800501 1866417 1882412
16497 1882412 2088533 1445550 2052255 2068070 1312697 1705075 1871983 1739628 1729762 1734033
16487 1734033 1658636 1465082 1784510 1462635 1905939 1634254 1512543 1492770 1518681 1400740
16477 1400740 1738142 1428457 1552598 1366051 1518820 1500165 1373766 1421213 1525667 1268406
16467 1268406 1327513 1515888 1094827 1316357 1469685 1377654 1334395 1378487 1296365 1006299
16457 1006299 1288791 1129236 1138194 1655713 1398131 1447834 1060344 1092968 1071812 986085
16447I86085J20907K28819k86713K3644l71122M56439k45469K97416O1478m54635
16437H16849M10826l40670k19719L58483m6428k23023o0204L42203k19104L1514
16427H50727P46J44461j67326l4752p1760L12000l77107K04967J91530k11112
16417H42374q6142M8016L98354m08396j27001P2445L60592n38858M22775m68257
16407E15902L06853J66253k80919k10426N27218l16221k3750q3633L31179j44425
16397G88031j68200J35085J72408k87492N4337l8255Q134k39276L18372R2998
16387H36142m8853J92929k58406r3366L3529k96595J70856K23510k30222J53119
16377F82643R0099n1422O2038j32063P2938l275o315J13173P374C08702P03126
$$ plain form
16447 986085 1106992 1335811 1049098 1072742 701620 1158059 912590 1210006 1271484 816849
16437 816849 1227675 887005 667286 1025769 979341 756318 696114 1038317 819213 850727
16427 850727 851473 995934 828608 793856 722096 1034096 656989 861956 1053486 842374
16417 842374 756232 804248 1202602 794206 667205 739650 1100242 561384 984159 515902
16407 515902 822755 989008 708089 497663 1024881 708660 684910 601277 932456 788031
16397 788031 619831 754916 927324 639832 694169 655914 664048 424772 743144 836142
16387 836142 787289 980218 721812 628446 661975 365380 536236 759746 529524 682643
16377 682643 772742 721320 783358 651295 724233 720958 714643 827816 835190 308702 1011828
16366A011828l48677K06221p2119j06014K78235C40101J58013O4616L8767B63275
16355F70981j42900K33749k79578j72596L08776k659K4507p3676j51399J2218
16345D27423J50695r1343N1313J49099l21101L16223j67312K93374k33125K8585
16335F03831j06571j5218L35399k36248k70530K38780j88187k6439m7986J22840
16325D09671J47082j70441K96123l01896K88272k59845R1348r7063m2316J79105
16315E40040p5144k05003J85212K01213k43742H5736N08922k80374j5985J08595
16305D06894j31069R5414K9487a9649A22313N33223k72206j86857m1156m3077
16295A12240L52730j84470K04485j43405j15215B2659M77601j57162Q7835j37558
$$ plain form
16366 1011828 663151 869372 797253 691239 969474 340101 498114 562730 601497 263275
16355 670981 528081 761830 482252 309656 618432 615773 640280 566604 415205 427423
16345 427423 578118 486775 538088 687187 366086 682309 514997 808371 575246 603831
16335 603831 497260 482042 817441 581193 310663 549443 361256 334817 286831 409671
16325 409671 556753 386312 682435 380539 668811 408966 500314 403251 360935 540040
16315 540040 464896 259893 445105 646318 402576 85736 594658 314284 298299 406894
16305 406894 275825 371239 400726 -19649 122313 655536 383330 196473 155317 112240
16295 112240 464970 280500 484985 341580 226365 22659 500260 343098 430933 293375
16285B93375O0732r8891p8180K99890A86040Q1708J9427A22713K38293J35163
16275D96169j11792j60074J37690j56950p7124e2620F62837A71165J18181j37543
16265A51803J7789J33374q3868N6995J52038r1474p978Q6569m4045R9885j20319
16254C50769J27340j81584N20527B39720k496J36105j35831J36113a45280A98620
16243B00360J26127A59861K41037j00658m2416h7795D42239M14397C53897e1887
16232D09536B01818l743K60027B18276p4427E6330L537J06609l0761O1620b19345
16220C01989j09160M4076B9506K47719a62470A31909B8350O2651J26225L4343
16210B51569j22334d426B19260J04318j60125J42829D272J31263K43441K58945
$$ plain form
16285 293375 354107 255216 177036 476926 186040 267748 287175 122713 361006 496169
16275 496169 384377 224303 361993 205043 127919 -52620 662837 171165 289346 151803
16265 151803 169592 302966 219098 276093 428131 336657 328679 415248 371203 471088 350769
16254 350769 478109 296525 817052 239720 237224 373329 237498 373611 -145280 198620
16243 200360 326487 159861 400898 300240 257824 -87795 442239 856636 353897 -51887
16232 409536 201818 198075 458102 218276 143849 56330 59867 166476 135715 197335 -219345
16220 301989 192829 236905 29506 277225 -162470 131909 28350 91001 217226 251569
16210 251569 129235 -4426 219260 323578 163453 306282 4272 135535 378976 637921
16200F37921C13107n9905P8326m3279f5511B17943a09296B32970J6922b05818
16189A96021N3950J82322a68874q8444C4348K17421C6218L11503l1951j11187
16179B04583J0597F0124M76712I4628C7181K06617M05211H8769L31556j62480
16169B57845j16949B1156J50028D9573i7389C68307j07345q5818h2509I1071B2639
16157i2871A6028L52796G8202K37444n8349j13755J20024A6448e9040D3641K46705
16146B90346K2176R4517j61949g098j49870B3988Q5755J69214n7534r1019o1415
16135F8989g7666A87714K21567j98501l2643E9724K40868E0891J30011a00248
16124A93293n6533g0073C95888A47367b6640J0776I3373J59966F7173g0223B37340
$$ plain form
16200 637921 313107 253202 331528 288249 -65511 217943 -109296 232970 249892 -205818
16189 196021 249971 432293 -168874 -257318 34348 251769 36218 347721 315770 204583
16179 204583 215180 60124 536836 94628 37181 243798 649009 88769 420325 257845
16169 257845 140896 21156 171184 49573 -97389 368307 260962 175144 -82509 91071 22639
16157 -92871 16028 368824 78202 315646 257297 143542 263566 16448 -59040 43641 290346
16146 290346 312522 407039 245090 -7098 -156968 23988 109743 278957 221423 130404 68989
16135 68989 -77666 187714 409281 210780 178137 59724 300592 50891 180902 -100248
16124 193293 136760 -70073 395888 147367 -26640 -15864 93373 253339 67173 -70223 237340
16112c43257I3740K4935O8502N5065m9204l3911f0244B08392f3528K8400A1696
16100C64919b88318Q4928A90024J25985j34269J56797k4008A30692a41651A1281
16089a52569A83791a71519A80539D0608L05133d4608B1986a3790A15014a70738
16078A88748c18102h0180a3442D67011a03270B89957a4388H6231R9763F1112K78460
16067C39572B8687J51210A0631J88152b72228C93361J6906h5915A10592L6191
16057A46783M2607J31327a21772L5593A59070c41235B33255Q7023a15176N5821
16047e9355A37094J66830E32L13865a99354C30369D566f5521j4391m7033j94212
16036c21157f275B21757a8989B8470K05210K90023j54182e3557H1653a982r0161
$$ plain form
16112 -343257 93740 118675 187177 242242 193038 159127 -60244 208392 -63528 -35128 11696
16100 364919 -288318 -203390 190024 316009 181740 338537 314529 130692 -141651 11281
16089 -152569 183791 -171519 180539 40608 345741 -44608 21986 -13790 115014 -170738
16078 188748 -318102 -80180 -13442 467011 -103270 289957 -14388 86231 185994 61112 339572
16067 339572 28687 179897 10631 198783 -272228 393361 410267 -85915 110592 146783
16057 146783 189390 320717 -121772 -86179 159070 -341235 233255 320278 -115176 -59355
16047 -59355 137094 303924 532 314397 -199354 330369 4566 -65521 -79912 -126945 -321157
16036 -321157 -6275 221757 -18989 28470 233680 523703 369521 -53557 81653 -1982 -92143
16025i2143A80061p0852g3470E7808J00869f0076n1135e3951j35724r7812a31192
16013e2899A5684J34935D2729Q3030b0214I8188J84214a94688A75400K95129a05794
16001i0164I6575J49444a83148C46362h3409J1402B37056A18127b910p2657A26165
15989i1285L8309E7296a56374C88380A16018a89572H1665Q0851p3909a18953A32603
15977E4486f7561I3421J1673B0202b46747h1038m8454r6856e512E40613A0636
15965a08835N1196J7307A70876D2068K45055m4149n0622K74593o1610j35921A10076
15953G4411a12190D2039d8255j52957A36282j7708a67491d7243B35540D6662M2475
15942H9137J18533J33165j3966j11451K0723J25246p0034O0954A57958F0285G810
$$ plain form
16025 -92143 180061 109209 -73470 57808 158677 -60076 -111211 -53951 -189675 -287487 -131192
16013 -52899 15684 150619 42729 125759 -20214 98188 282402 -194688 175400 470529 -105794
16001 -90164 96575 246019 -183148 346362 -83409 -72007 237056 118127 -2910 -75567 126165
15989 -91285 -52976 57296 -156374 388380 116018 -189572 81665 162516 88607 -118953 132603
15977 54486 -67561 93421 105094 20202 -246747 -81038 -129492 -226348 -5512 540613 10636
15965 -108835 -57639 -40332 170876 42068 287123 242974 192352 466945 405335 269414 110076
15953 74411 -112190 42039 -48255 -201212 136282 118574 -167491 -47243 235540 46662 89137
15942 89137 207670 340835 326869 215418 236141 361387 291353 352307 157958 60285 7810
15930b18447a273k1803j29417q223A87999c28874J08474N5769H6671b11610I8800
15918A75614G047g9155b1953I2711D3085b7508k38234d0963J432j3882A11625
15906A82958a11579C43435b14260j53608A39175E4472a82174k60359a986A37523
15895h208B5097a06067j61263c3280a6442j8950C16148f3179C9938e2445A7306
15883A00922d1568j10935M7343j34306H9623M0956P9278a1703j79948F8072b17912
15871A57887K469b92203J20918h4572F9816J04330A7587L379a18936G2912K23864
15860B96776N7645h162A18740N0903i4049k7903j26283A41325J16678J80957H5186
15848a87846m2882A18969a5694k04785q089I9100P8062l9996b1205B48744n5728
$$ plain form
15930 -218447 -1273 -23076 -152493 -160716 187999 -328874 -220400 -164631 86671 -211610 98800
15918 175614 7047 -79155 -21953 92711 43085 -27508 -265742 -40963 -39531 -53413 111625
15906 182958 -111579 343435 -214260 -367868 139175 54472 -182174 -442533 -1986 137523
15895 -8208 25097 -106067 -267330 -33280 -16442 -35392 316148 -63179 39938 -52445 17306
15883 100922 -41568 -152503 -105160 -239466 89623 130579 209857 -11703 -191651 68072 -217912
15871 157887 160356 -292203 -171285 -84572 69816 174146 17587 20966 -118936 72912 296776
15860 296776 354421 -8162 118740 169643 -94049 -121952 -248235 141325 258003 438960 85186
15848 -187846 -230728 118969 -15694 -220479 -228568 99100 177162 137166 -21205 248744 193016
15837A93016d37505B3250J2561a88271n8395I5431l0257a01787M3057D8341a48995
15825A36822E3472a34082K022A4150R010c3562l04728A33064E1814h5255B39471
15813A09979l9565P5756a20260E8408a70386p2818J10748n8027A94269P8367M6929
15802C19565j48036h5752j19795b2854j71114P3965k47333J01591A5043c0385
15791f4281B44075c40538J30339h5328q9442n9034e6317n2290j3027r4011B18697
15779C26141A61432e4711B3777i0261C7732M2292g3781C5506P9799E2115K10804
15768B62919a35080b7403B43352F7183R4783E4332k3573J55929a60623l6728J0398
15757a86953A7698a4434j73991H5735b58770B09869I9631a43758c6752J3072o2596
$$ plain form
15837 193016 -437505 23250 35811 -188271 -246666 95431 65174 -101787 -58730 48341 -148995
15825 136822 53472 -134082 -132060 14150 23160 -33562 -338290 133064 51814 -85255 239471
15813 109979 70414 146170 -120260 58408 -170386 -243204 -132456 -190483 194269 272636 319565
15802 319565 171529 -85752 -205547 -22854 -193968 -120003 -367336 -265745 15043 -30385
15791 -64281 244075 -340538 -210199 -85328 -174770 -233804 -56317 -108607 -121634 -215645 218697
15779 326141 161432 -54711 23777 -90261 37732 80024 -73781 35506 115305 52115 262919
15768 262919 -135080 -27403 243352 67183 161966 54332 30759 186688 -160623 -197351 -186953
15757 -186953 17698 -14434 -188425 85735 -258770 209869 99631 -143758 -36752 -23680 -86276
15746h6276A01517f7279g119o8106p1463I4073L39106G7704C8470J00995M6456
15735A85921p188I689K93393a30666A7059c7809D38097C0144J34740a06230B32840
15723B35489c30059B44467r1228c04455a42220j99742A8418M6783J14480m8010
15713A31671E788K67192h9347A23228E7544d5824j56206A54563a79199h5796D09096
15701a03278A51794l9431O9525g6951L7751A14395a35014C04151j35305b23670
15690G2761b76287o4763a14602j01242E6050a31833c0894A44778E2508d42203
15679b88j15578B06249a0479m83800a34543A88174a05557O812j54929B72410k4982
15668B47428p8625A1940g7518B30204I1096D0740a01334B64872q4913c0369o6607
$$ plain form
15746 -86276 101517 -67279 -7119 -75225 -146688 94073 433179 77704 38470 139465 185921
15735 185921 178733 9689 303082 -130666 17059 -37809 438097 30144 164884 -106230 232840
15723 235489 -330059 244467 153239 -304455 -142220 -341962 18418 65201 179681 131671
15713 131671 5788 272980 -89347 123228 57544 -45824 -202030 154563 -179199 -85796 409096
15701 -103278 151794 112363 181888 -76951 -39200 114395 -135014 304151 168846 -223670
15690 72761 -276287 -341050 -114602 -215844 56050 -131833 -30894 144778 52508 -442203
15679 -288 -115866 206249 -10479 -494279 -134543 188174 -105557 -98745 -253674 272410 247428
15668 247428 168803 11940 -77518 230204 91096 40740 -101334 264872 179959 -30369 -96976
15657i6976A1455b8461A5777m866g504j99009M5826c3297A20623l1298d1026A49155
15644D98409A1390i4995j63335A5060O6824d2144B0120h4050q561I282a31937
15632i1490C51584c1141j15197A10154b47478j36388J89614e3587I426J74595
15622A84021d2286I0754j3013C7745K3972a44522C6957K1141e6104o6610J5505
15611a07209L339c1490j2195j59148d5663l346B17781b17049R0498A03600b55429
15599a27009A32482N2151q6137a42848h471B86414i725j49296D5820f9378I4635
15587b38875n6471a41752O8296B28410o9129l3327g9784j226B1323J2748E956
15575B35565l6452l4242h9693p9181D5349c41624B89125b03076D9917a60580O4668
$$ plain form
15657 -96976 11455 -28461 15777 10911 -7504 -206513 -160687 -33297 120623 89325 -41026 149155
15644 498409 11390 -94995 -258330 15060 81884 -42144 20120 -84050 -92611 9282 -131937
15632 -91490 351584 -31141 -146338 110154 -247478 -383866 -194252 -53587 9426 184021
15622 184021 -42286 90754 77741 37745 61717 -144522 36957 58098 -56104 -122714 -107209
15611 -107209 -103870 -31490 -43685 -202833 -45663 -49009 217781 -217049 -126551 103600 -255429
15599 -127009 132482 184633 98496 -142848 -8471 286414 -9725 -159021 45820 -69378 94635
15587 -238875 -295346 -141752 -73456 228410 159281 125954 -79784 -81010 21323 34071 5956
15575 235565 199113 164871 -89693 -168874 45349 -341624 289125 -203076 49917 -160580 -95912
15564i5912D1082n425d1978A0829J27604a82644P0843B80706M2190j51486g9256
15552b42543e6348m003n4735B0988Q545P7786m5421i9252M0001l1083k48253J67596
15540a70991A28467h1561E4745k6077d6666A21721J23904A5971J47981c43850
15529A4169K54094m0908b47777f5638p4907e4834A53916d0597D57653G0343h1762
15517d6057A65231k4750R001F4345J76274D5507b2671G0513a82684j68973G7280
15505a25524j01587j50846a60885B82774a20088A61162a34528A63735K4707a94694
15494A09103a01129b4631k7769A60550D1953J83722M7344B9674P9772l9457a35951
15482b08715A24676a32631f1102p0621J5989K0180h32l1248j4794j63430A21294
$$ plain form
15564 -95912 41082 35657 -41978 10829 138433 -182644 -111801 280706 322896 171410 -79256
15552 -242543 -56348 -60351 -115086 20988 29533 107319 61898 -99252 -59251 -90334 -338587 -170991
15540 -170991 128467 -81561 54745 28668 -46666 121721 245625 15971 163952 -343850
15529 14169 268263 227355 -247777 -65638 -140545 -54834 153916 -40597 457653 70343 -81762
15517 -46057 165231 140481 149482 64345 240619 45507 -22671 70513 -182684 -351657 77280
15505 -125524 -227111 -377957 -160885 282774 -120088 161162 -134528 163735 188442 -194694
15494 109103 -101129 -24631 -52400 160550 41953 225675 273019 29674 109446 69989 -135951
15482 -208715 124676 -132631 -61102 -131723 -115734 -95554 -832 -32080 -46874 -210304 121294
15470a02130a7712e905p3550B6266a80590k21245i1016j301b4287k32029C774
15458a86131F3193k4629a60048f3875j63809G13g8420A6292a50383j15119M6436
15447b19066r8664J08431A11828b37317C37876A31878b50733a09274c9127C0064
15436c2278A65023K5584a22565P815c3439m7958F9627h1530l7594A82234l0253
15425A51981J36892d3768A68597F3242L1885K022j1687J65226A15974a13269D01577
15413A93250a77448k47053A60822a6547k17576B59687b253A32225d054B73296
15402H1132b09769i136E1648N560a0444A1408a04046A94091q1906b784A02296
15390B48726i4300h987B6091i9983k8221r2255Q2180M4327d183k78345B28605
$$ plain form
15470 -102130 -17712 -5905 -79455 26266 -180590 -401835 -91016 -92317 -24287 -256316 3774
15458 -186131 63193 38564 -160048 -63875 -227684 713 -78420 16292 -150383 -265502 -219066
15447 -219066 -317730 -209299 111828 -237317 337876 131878 -250733 -109274 -39127 30064
15436 -32278 165023 190607 -122565 -114750 -33439 -81397 69627 -81530 -119124 182234 151981
15425 151981 288873 -43768 168597 63242 95127 97149 85462 250688 115974 -113269 401577
15413 193250 -177448 -424501 160822 -16547 -234123 259687 -2253 132225 -4054 273296
15402 81132 -209769 -9136 51648 57208 -10444 11408 -104046 194091 112185 -2784 102296
15390 248726 -94300 -8987 26091 -99983 -128204 -220459 -138279 -93952 -4183 -282528 228605
15378b73460J13191D3796A8418j843K4776c715j17056H0797Q1493P4283a38729
15366A33587n2763d4389B11332h5584k7744B02552a37482o4084L5720b7980G3790
15354d15359J81082I9151c6542B30821d9976A651J35016l2104D1340O2629i4297
15342e6864A11563J71365d8521e737j13569k63735J75799k19588d0074F2569c08059
15330E2032g03k6797k49576j61288B29479j06664d9328A6817J15054a06544c4819
15318B6466f6100r5324A83484a45204B27383d3781A02459K41397g7970k29452
15308c07422b8951A49980l8969p333J69999a30599B35605C4599N6940a91078A77181
15296a76308C5433g1897B80845A38753a86238B91005J09379a88826r9452J10045
$$ plain form
15378 -273460 -160269 43796 18418 16575 41351 -3715 -120771 80797 162290 236573 -138729
15366 133587 80824 -44389 211332 -85584 -113328 202552 -137482 -201566 -165846 -27980 73790
15354 -415359 -234277 99151 -36542 230821 -49976 1651 136667 104563 41340 103969 -94297
15342 -56864 111563 282928 -48521 -5737 -119306 -383041 -207242 -426830 -40074 62569 -308059
15330 52032 -703 -27500 -277076 -438364 229479 122815 -49328 16817 131871 -106544 -34819
15318 26466 -66100 -161424 183484 -145204 227383 -43781 102459 343856 -77970 -307422
15308 -307422 -28951 149980 111011 103678 273677 -130599 235605 34599 91539 -191078 177181
15296 -176308 35433 -71897 280845 138753 -186238 291005 400384 -188826 -288278 -178233
15286a78233I5661q53j0672Q0345H0231N5099J2898g253B27792A9731P9124J96343
15274B95198a2413D9959J10802O335G9730J87351A00334e2302A62912D3072P8786
15263A21858M5977b66387C8153A3187K4454K95701b13617A91444K9465B7960N3968
15252H1928M6377P6015i1551A77470a57079O6839D55622p1724C438L53534e068
15240b0054A26281J93192K1290e9660A18467c0737m2693A7880J788k806R6909
15229A13771J43510r2446h7854d124B49751J08199Q77978J34044n15972Q74152
15219A728152F62505k36468c594A34740J15486p9491E3651c7830B809L0605M3220
15208G6634a31616A35825E0452J77535K7500m128q8109h9661A42711f9309B59553
$$ plain form
15286 -178233 95661 94808 84136 164481 80231 135330 148228 -7253 227792 19731 98855 295198
15274 295198 -12413 49959 160761 167096 79730 267081 100334 -52302 162912 43072 121858
15263 121858 167835 -266387 38153 13187 37641 333342 -213617 191444 220909 27960 81928
15252 81928 128305 204320 -91551 177470 -157079 -90240 455622 383898 3438 356972 -5068
15240 -20054 126281 319473 340763 -59660 118467 -30737 -73430 17880 19668 16862 113771
15229 113771 257281 164835 -87854 -4124 249751 357950 1235928 1369972 854000 1728152
15219 1728152 662505 426037 -3594 134740 250226 170735 53651 -37830 2809 33414 76634
15208 76634 -131616 135825 50452 227987 255487 251359 163250 -89661 142711 -69309 259553
15196B97406A24850d6514g69A22218R8293b5743E4553k550k4455O48597a00759
15184H3326J88579n2401a25981J3673j21221a2180A60383F3467K4822J28383a29854
15172A72206O684N8414j11862c22800h3090H253J15709a03506H7531K01683A37330
15160B76154j0826E4150K89453j38649d7633J4148A87789B1522L4625N2298B8335
15148B2662L2735K16389a25010b3232k06364B063J5965c0729h127A86823q2723
15137A04100H686P1278K42130C7638P0289J49886N9758g0307H6054K62559G3884
15125B16278i773l8368H6023J26058M608a09694F9326k3616O4411b16347B05366
15113F694J01281a36443B99891j16770j4980H058K18798E792K18291A6730M16083
$$ plain form
15196 297406 124850 -46514 -769 122218 220511 -25743 54553 52003 27548 676145 -100759
15184 83326 271905 219504 -125981 -112308 -233529 -12180 160383 63467 88289 216672 -129854
15172 172206 178890 237304 125442 -322800 -83090 8253 123962 -103506 87531 289214 137330
15160 276154 265328 54150 343603 204954 -47633 -33485 187789 21522 56147 108445 28335
15148 22662 55397 271786 -125010 -23232 -229596 2063 18028 -30729 -8127 186823 104100
15137 104100 8686 79964 322094 37638 107927 257813 317571 -70307 86054 348613 73884
15125 216278 -9773 -48141 86023 212081 216689 -109694 69326 45710 110121 -216347 205366
15113 6694 107975 -136443 299891 183121 168141 8058 226856 5792 224083 16730 432813
15102D32813A22634D1104h0471j40689A63748J44733d21202i0698A95820o3012
15092A32808J15318G4929a33329A62973d2470I0604J47495L70819C7295J51629
15082A88924J3660r2070b02951B30197h2605C50392A5379J37237D7202K24574
15072B71776a37769A39685j186B3503h9059B48281E5325a37272B06418J49611
15062C56029A74073a5602B32306Q160Q1280J4937a12516A90603l3826a59526H6258
15050B64919A29019J18242F8032J34437M2512a18489A68493G1003a66523C27010
15039F7656K48875j09831k4062J6013h6752C08941j04306H6501J56141p7455M3594
15028B08781H325L30820e4766C77553p6342J88940A86408k8781J09258J07919
$$ plain form
15102 432813 122634 41104 -80471 -221160 163748 308481 -421202 -90698 195820 132808
15092 132808 248126 74929 -133329 162973 -42470 90604 238099 608918 37295 188924
15082 188924 202584 110514 -202951 230197 -82605 350392 15379 152616 47202 271776
15072 271776 -137769 139685 138499 23503 -89059 248281 55325 -137272 206418 356029
15062 356029 174073 -15602 232306 240466 321746 336683 -112516 190603 156777 -159526 86258
15050 264919 129019 247261 68032 202469 244981 -118489 168493 71003 -166523 327010
15039 67656 316531 206700 182638 198651 -86752 308941 204635 86501 242642 165187 208781
15028 208781 8325 339145 -54766 377553 301211 490151 186408 157627 266885 374804
15018C74804c1229D6157M21262B05650m7556d5848B9851h3087C24061j17474a9494
15006B21540J5232b3063B70065o5164Q1403p682B2162L09824i6519E4250L36856
14995C91106j19490J80465A62003a58854B61487J15195r306c18328C19711G4374
14984B90446j21370F886L85991j19046G6899a24348B4250K89476H0246A342K00205
14973B01547J34633D6531M0031J92119C9870c6507A69618l1988J04751B1967a2277
14961D45689j32475m438j35123I568J84122K522J5692D0835J08267O9723o124
14950B12701F405K96183K93328j94445j24271P2093J52311A2427K01531p2109
14940A41849F8489C950J59004N13093A79243H503M87199A71894J71213b9634B55002
$$ plain form
15018 374804 -31229 46157 467419 205650 158094 -45848 29851 -83087 324061 206587 -19494
15006 221540 236772 -23063 270065 204901 286304 278622 22162 331986 -96519 54250 391106
14995 391106 271616 452081 162003 -158854 261487 376682 367376 -318328 319711 74374
14984 290446 169076 6886 392877 273831 76899 -124348 24250 313726 80246 1342 201547
14973 201547 336180 46531 86562 278681 39870 -36507 169618 137630 242381 21967 -12277
14961 445689 313214 308776 173653 9568 193690 196212 211904 40835 149102 218825 212701
14950 212701 6405 302588 595916 401471 277200 349293 501604 12427 213958 141849
14940 141849 68489 3950 162954 676047 179243 8503 495702 171894 343107 -29634 255002
14928A96369J03690H7837J3256L28795B05302f3134C69667J54119j57295c2535
14917F00880k85889J37245D1951J94585N8330j23185M36572k13859b862k7145
14907c0007E5296J76792J50920J75431j64104j07845J86905j50318J11455j90142
14897B44390J74575k03874J15665D0909N34736B45111K3176K69079C8470L38035
14887C76505H1681K03845m4749P6106B9673L00045r0882r9286a27379B25639k7822
14876A97817r8226J02752J14876A10940M24943B42295J04364M7524J48047r8377
14866D43853j25346L58127j62398j44314B5974K64357A18664J99160O7781k2918
14856C62687r066n2522K06259j87152m9762J43312M0420M7187k33309r172n4076
$$ plain form
14928 196369 300059 87837 101093 429888 205302 -63134 369667 523786 366491 -32535
14917 600880 314991 452236 41951 236536 294866 171681 608253 394394 -2862 -30007
14907 -30007 55296 232088 383008 558439 394335 286490 473395 323077 434532 244390
14897 244390 418965 215091 330756 40909 575645 245111 268287 537366 38470 376505
14887 376505 81681 285526 240777 316883 29673 329718 238836 139550 -127379 225639 197817
14876 197817 99591 202343 317219 110940 535883 242295 346659 394183 542230 443853
14866 443853 318507 676634 514236 369922 25974 290331 118664 317824 385605 362687
14856 362687 353621 301099 507358 320206 270444 413756 454176 501363 268054 258882 204806
14845B04806L87156k42481q9436K94858k38204A57521Q5114Q9642J52552k16668
14835B68161J06320q8984K04469n6233k12038R4296J33410k2337m10A77559O0222
14824B37781K40845L08847C86779l9285B9107L29277l7140J01091J38312k18216
14814C42431J11252L27457l9923k82364l7931o8488R1571A86003J64129L8525
14804C88657Q4997j24667o9599J80572j41905l1539j22022N36874l30775j76085
14794A94508N26259j4335j63693O8622K5124j39474r6241l2320j67381M29993
14784F31062j50036J62272j17078j055L7080K0313n0408J03219p1497M8464k23593
14773C88743L34892k6628j66857J40512j15562k22685K94908M444k77114K44704
$$ plain form
14845 204806 591962 349481 260045 554903 316699 157521 242635 332277 484829 268161
14835 268161 374481 285497 489966 433733 221695 315991 449401 427064 426654 177559 237781
14824 237781 478626 787473 386779 347494 29107 358384 321244 422335 560647 342431
14814 342431 453683 781140 741217 458853 420922 352434 444005 186003 350132 388657
14804 388657 473654 348987 279388 459960 318055 286516 164494 701368 370593 194508
14794 194508 720767 706432 542739 611361 636485 497011 400770 368450 201069 631062
14784 631062 481026 643298 526220 525165 562245 582558 532150 635369 563872 612336 388743
14773 388743 723635 697007 530150 670662 555100 332415 627323 631767 354653 599357
14763E99357j42051K95379l18835K23287J69759J08409j21014o4724j01361k07263
14753D40943L59645B15700M2127L31197j51509K49610Q122k64137L80508j41283
14743F70335j21745J87739n6461j52717K53166k22846k40061J80787M15947l59826
14733E54318p9489K50899J59239m23611N31958B81469L25134j33404L07561l37668
14723D43092J61919L6728j82882K46590M4357p978k14015M75799k20925M8308
14713H30993B91196M06921K94520j59266j29300k9226k42711L04579L25999l07010
14703G55702O101l59906L11052j65141J62641J65990l3943J7912l87914J55932
14693F28426j28205L07933K7365k07758o0012K86641j2577L0431O9526j73470
$$ plain form
14763 599357 457306 752685 433850 657137 826896 935305 814291 749567 648206 440943
14753 440943 800588 215700 257827 589024 437515 687125 695247 431110 811618 670335
14743 670335 548590 736329 679868 527151 780317 557471 317410 498197 914144 554318
14733 554318 474829 725728 884967 461356 993314 281469 606603 473199 780760 443092
14723 443092 605011 641739 458857 705447 749804 741826 527811 1003610 782685 830993
14713 830993 291196 698117 992637 833371 704071 674845 432134 736713 1062712 755702
14703 755702 761803 401897 712949 547808 710449 876439 842496 860408 472494 628426
14693 628426 500221 808154 835519 627761 567749 854390 841813 872244 941770 768300
14683G68300O2260K22171q7703r9715P6484l11029J48597j76959K49821j81589
14673F70638R877L7336r2557L12433K8679k15538L5742l3383o6995M12259l52702
14662G45789K85058k24559p7021L90943k06796Q328j8710K747o3244N35647k71794
14651A106388n8451j73025J45961K60293m44878K1257L30808k2299n73980M63561
14641A055635k9096K19418l76995L49451k89197M9319o0702M28994j34333o9332
14631A143162p9901J14296N9421j09749J48158j22003J2938Q5645m64317m6353
14621G41297N80545m29634o3589N67781l49238J41932K05615L1976K3082j19752
14611A330015J07248j86803p6824M7937N4776r0213Q5692k1570j88086N27674
$$ plain form
14683 768300 830560 1052731 965028 865313 941797 630768 779365 602406 852227 670638
14673 670638 680515 717851 625294 937727 966406 750868 786610 753227 686232 1098491 745789
14662 745789 1030847 806288 729267 1120210 913414 921742 903032 905779 842535 1378182 1106388
14651 1106388 1047937 874912 1020873 1281166 836288 857545 1188353 1166054 592074 1055635
14641 1055635 1026539 1245957 868962 1218413 929216 978535 917833 1346827 1212494 1143162
14631 1143162 1063261 1177557 1236978 1127229 1275387 1153384 1166322 1251967 787650 741297
14621 741297 1321842 892208 828619 1396400 1047162 1189094 1394709 1426685 1449767 1330015
14611 1330015 1437263 1250460 1173636 1221573 1276349 1186136 1271828 1250258 1062172 1589846
14601A589846k81154J12500k69233J90838p7840R6877R0551k52919J01298K54477
14591A555241k9836M9945Q1826k08451K06090m79855N42159M804n64405O24551
14581A782069l63116P9029j15152N5321J31065k3688K1087J33566L04511l28646
14571A676046j39526J24208m0170J27129k39220j6315K25948j55053M81291m12843
14561A631495R9887M7466k65384L95573q1855j09991J46219j46926J83912j24735
14551A775661L55716p7406N2964j21907J62611l4007j60473R3095J9147J27958
14541B193359J86028O1796j13498R2127L2013p8057L93357N5820L4342j09556
14531B747731K69709K63367M4569P2330M20700P7570O49250J509347J649909L961223
$$ plain form
14601 1589846 1308692 1421192 1151959 1342797 1264957 1361834 1452385 1199466 1300764 1555241
14591 1555241 1525405 1575350 1657176 1448725 1654815 1174960 1717119 1721923 1157518 1782069
14581 1782069 1418953 1497982 1382830 1438151 1569216 1545528 1566615 1700181 2004692 1676046
14571 1676046 1536520 1660728 1620558 1747687 1508467 1492152 1718100 1563047 2044338 1631495
14561 1631495 1731382 1778848 1513464 1909037 1827182 1717191 1863410 1716484 1900396 1775661
14551 1775661 2131377 2053971 2106935 1985028 2147639 2113632 1953159 2046254 2065401 2193359
14541 2193359 2379387 2441183 2327685 2419812 2451825 2373768 2767125 2822945 2857287 2747731
14531 2747731 3017440 3280807 3325376 3397706 3818406 3895976 4545226 6054573 7704482 11665705
14521A1665705J0386941K2565885j637189A6545120F743215k940837j555034j47503
14513B099841Q9761l53269q4295j4661J43968o2979K79384k29969K9775J22655
14503B020211K53614L39171l02457j46765J96670M9237n6061K5007p0426K51337
14493B559538N1857l69361J94950K32961j8480o0187j4272J99562L57826n39687
14483B594707j5080J13548L4995L48371m58668K95755P5525J36795j60485L74347
14473C339810k26004r3010L01630l43456K02518m5192p621J39953N00051m05102
14463C363577J74376j3323k56741M53503k16826K51977k42745J38766J33113k09151
14453C576526K61743Q4873j2921K30971k42310L46744k21548K43181L9520N2071
$$ plain form
14521 11665705 22052646 44618531 42981342 16545120 6743215 3802378 2247344 2099841
14513 2099841 2189602 1836333 1752038 1737377 1881345 1818366 2097750 1867781 1897556 2020211
14503 2020211 2273825 2612996 2310539 2163774 2360444 2409681 2353620 2378627 2308201 2559538
14493 2559538 2611395 2242034 2436984 2669945 2651465 2591278 2577006 2776568 3134394 2594707
14483 2594707 2579627 2693175 2728170 3076541 2617873 2913628 2989153 3125948 2965463 3339810
14473 3339810 3113806 3020796 3322426 2978970 3181488 3136296 3128675 3268628 3768679 3363577
14463 3363577 3537953 3524630 3267889 3721392 3504566 3756543 3513798 3652564 3785677 3576526
14453 3576526 3838269 3923142 3910221 4141192 3898882 4245626 4024078 4267259 4306779 4358850
14443D358850k78992J64674q4171l59879O97588j78705P7415K96821K32447j48283
14433D777765q5734K43617m03415M09000l4235M44078k10583J03389j95261P0226
14423E118847L49888l00447R2416M56488l26922K68859Q1048k73609P54556o3900
14413F157224k37716J07366J12423Q0590K42424o7671p2046N8534J30170M09044
14403F920342J3821j27978L01797p2280Q884Q8645N94139j09243N4108R8416m1062
14392G729589J17086L77708k72430J0091N74362l30998L09087J28577L08896k0147
14382H931821M57181j41667J38447M9993L41001J714K41339R9875L5295L07251
14372A0462250j01574M58103J98964J63298n4703L33924L45735j43951O53725
$$ plain form
14443 4358850 4079858 4244532 4160361 3800482 4498070 4319365 4396780 4693601 4926048 4777765
14433 4777765 4692031 4935648 4532233 4941233 4906998 5351076 5140493 5243882 5048621 5118847
14423 5118847 5468735 5168288 5260704 5717192 5390270 5659129 5740177 5466568 6221124 6157224
14413 6157224 5919508 6026874 6139297 6219887 6462311 6394640 6322594 6381128 6511298 6920342
14403 6920342 6934163 6806185 7107982 7035702 7044586 7133231 7727370 7618127 7672235 7770651 7729589
14392 7729589 7846675 8224383 7951953 7962044 8536406 8205408 8514495 8643072 8951968 8931821
14382 8931821 9389002 9247335 9385782 9435775 9776776 9778490 10019829 10119704 10154999 10462250
14372 10462250 10360676 10818779 11017743 11181041 11126338 11460262 11805997 11662046 12315771
14363A2315771J16961j13680J57751L84125K92309M58654j06573M68914L4287
14354A4008519K03148N59248R9953J80203M26350J97530M73764P9381M49189J64689
14344A6841974L12703N53340K60422L10866M78706J21730N00146M97263M31593
14335B0308743N11254O48076K66376K40585N01148O18160N37070M39328M54008
14326B4524748J048981M69110O92466M19242J004453K88879R69996L18404J234872
14317C0971151P62712Q92895J024000O82645Q40925J080544J085542J393802J194862
14308C9929078O59868J042622J591067J080696J574807J621701J289341J347411
14300E0136591K039725J634250J579618K136471J769086K077833J910508K669638
$$ plain form
14363 12315771 12432732 12319052 12476803 12860928 13153237 13611891 13505318 13974232 14008519
14354 14008519 14211667 14770915 14870868 15051071 15477421 15674951 16148715 16228096 16677285 16841974
14344 16841974 17154677 17708017 17968439 18279305 18758011 18879741 19379887 19877150 20308743
14335 20308743 20819997 21468073 21734449 21975034 22476182 23094342 23631412 24070740 24524748
14326 24524748 25573729 26042839 26735305 27154547 28159000 28447879 29417875 29736279 30971151
14317 30971151 31733863 32626758 33650758 34333403 35174328 36254872 37340414 38734216 39929078
14308 39929078 40588946 41631568 43222635 44303331 45878138 47499839 48789180 50136591
14300 50136591 52176316 53810566 55390184 57526655 59295741 61373574 63284082 65953720
14292F5953720K210898K801627K690112L132655K782955K978902K990796L896782
14284H9438447L696437L941585L725566M805367M635777M775139N038835N365385
14276A25422538O129538O393043O268551O986763P417599Q106744P844680R033971
14268A83603427Q978482R904151J0160982J1056898J1206500J1693280J2273388
14261B58877108J2575439J2993385J3719341J3770345J4355488J4286299J4368024
14254C54945429J4040823J3624300J3743544J2245100J1137546J0397489Q322681
14247D38456912O272541J984101J097455R71793n46223n121096m512426n206666
14239D33396391q676930j0931770j2546773j3468758j4440175j5187126j5089282
$$ plain form
14292 65953720 68164618 70966245 73656357 76789012 79571967 82550869 85541665 89438447
14284 89438447 93134884 97076469 100802035 105607402 110243179 115018318 120057153 125422538
14276 125422538 131552076 137945119 144213670 151200433 158618032 166724776 174569456 183603427
14268 183603427 192581909 202486060 212647042 223703940 234910440 246603720 258877108
14261 258877108 271452547 284445932 298165273 311935618 326291106 340577405 354945429
14254 354945429 368986252 382610552 396354096 408599196 419736742 430134231 438456912
14247 438456912 444729453 446713554 447811009 448782802 448236579 443115483 438603057 433396391
14239 433396391 424719461 413787691 401240918 387772160 373331985 358144859 343055577
14232C43055577j5578645j5334352j4956613j3301006j3911311j3236679j3044823
14225B43692148j2099066j1768067j0786684j0443371r901169r008899q931417
14218A70753475p891588p705447p265504o985873o525285o410014n330299m751826
14210A17887639n831228m792560m592171m027740l898024l379326l631003l658178
14202H4077409l384468l266768k955485k542062k838516k499965k155689k367024
14194F2067432j581876k238796k156491j986606j304256k037455j331206j229191
14186D8201555j643601j845736r66467j494970q62410q42371j465127j151016
14178C7929857j011527j308473n15810q00828r65469j170236r19674n30697q90513
$$ plain form
14232 343055577 327476932 312142580 297185967 283884961 269973650 256736971 243692148
14225 243692148 231593082 219825015 209038331 198594960 188693791 179684892 170753475
14218 170753475 162861887 155156440 147890936 140905063 134379778 127969764 122639465 117887639
14210 117887639 112056411 107263851 102671680 98643940 94745916 91366590 87735587 84077409
14202 84077409 80692941 77426173 74470688 71928626 69090110 66590145 64434456 62067432
14194 62067432 60485556 58246760 56090269 54103663 52799407 50761952 49430746 48201555
14186 48201555 46557954 44712218 43745751 42250781 41388371 40546000 39080873 37929857
14178 37929857 36918330 35609857 35094047 34293219 33327750 32157514 31237840 30707143 29816630
14169B9816630j049750j94565j134576l54884p37924q86201k83784o94325n69088
14160B3911533l96761p06710o60603j61218o51310l28630l36689m33156k14686
14151B0021770m87733r00053j81901k79796m04552l50513n23057k57478l39113
14142A6297574j88879m93770l28594m90368p3523q6385m73153j69143r6955l58691
14132A3538113j43024l07057l93869N9962q9650m45380j93631j97404r1891l75887
14122A1360282q0026l56145J24485p8847n27414J55760l73667K50290k46175m50798
14112I777745j72173m3992l66014o6920l45057N54361q15704L34006l0397k96382
14102H529473l13055j03343p6321k0718p5686J87470l08452r8294j48090j79842
$$ plain form
14169 29816630 28766880 28572315 27437739 27082855 26344931 25458730 25174946 24480621 23911533
14160 23911533 23514772 22808062 22147459 21986241 21334931 21006301 20669612 20236456 20021770
14151 20021770 19534037 18633984 18452083 18172287 17767735 17417222 16894165 16636687 16297574
14142 16297574 16108695 15614925 15286331 14795963 14722440 14636055 14162902 13993759 13896804 13538113
14132 13538113 13395089 13088032 12694163 12754125 12664475 12219095 12025464 11828060 11736169 11360282
14122 11360282 11280256 10924111 11048596 10969749 10442335 10598095 10224428 10474718 10228543 9777745
14112 9777745 9605572 9561580 9195566 9128646 8783589 9337950 8522246 8856252 8825855 8529473
14102 8529473 8216418 8113075 8036754 8016036 7940350 8127820 7819368 7721074 7572984 7393142
14092G393142j68123k24393o038k7957K8967m22736j92913M03108k74126J80511
14082F689442j59056k35256l3110L3158j43752k46005j1423K05490r7779N5077
14072F056786m91938K26881O4173k09828n17016k7399K36423j36419o8441R6082
14062E229304j07636k49282l0296J56030j85733j58018K01278l65172M3892j89971
14052D344396N5671J84010p2390m7190k68778p41J7795J60863r3872j62145K52623
14041D370242k30826j61091J56464l10168k33595N24485k67830R853j71017J52380
14031C838897K02531k14011P1235l54139P0670k01868K26489o5453k45817J87910
14021C516444J26541n35824K21146m7382M5264p6104k46876j45606J25512j68150
$$ plain form
14092 7393142 7225019 7000626 6994588 6966631 6995598 6572862 6379949 6783057 6508931 6689442
14082 6689442 6530386 6295130 6262020 6295178 6151426 5905421 5893998 6099488 6001709 6056786
14072 6056786 5564848 5791729 5855902 5646074 5129058 5101659 5338082 5201663 5133222 5229304
14062 5229304 5121668 4872386 4842090 4998120 4812387 4654369 4855647 4490475 4534367 4344396
14052 4344396 4400067 4584077 4511687 4464497 4195719 4194978 4212773 4373636 4279764 4117619 4370242
14041 4370242 4139416 3978325 4134789 3824621 3591026 4115511 3847681 3857534 3686517 3838897
14031 3838897 4041428 3827417 3898652 3544513 3615183 3413315 3639804 3574351 3328534 3516444
14021 3516444 3642985 3107161 3328307 3280925 3326189 3250085 3003209 2857603 2983115 2814965
14011B814965j7544M3914L62087k40469K81616m82925K38903K47934m09193L16093
14001C155381m74730L41037m31510l0002J40173j81258J89903m8302k28282J08406
13991B540816k72822Q1309m4001j05714R2551J23884N9699l39826R528J08548
13981B253972M2561J08099k59706J63532j12071P253j34681J94790j20424l8959
13971B104366L2630J10311j80920j05092L01177j29103Q5194L92832J123129K631808
13961F366332O556743K0520661J4492451B2416911j0771069m378338j850523j091582
13953D325399m57405n96854L0377n49537J79875o15999L16329m66347K76903Q5217
13943B527958k54485k24434M44112o5720l8892k11738P2579j71452M17777l00643
$$ plain form
14011 2814965 2797421 2841335 3203422 2962953 3244569 2761644 3000547 3248481 2839288 3155381
14001 3155381 2680651 3021688 2590178 2560176 2700349 2519091 2708994 2660692 2432410 2540816
13991 2540816 2267994 2349303 2305302 2199588 2292139 2416023 2475722 2135896 2145424 2253972
13981 2253972 2296533 2404632 2144926 2308458 2196387 2203640 2068959 2263749 2143325 2104366
13971 2104366 2136996 2247307 2066387 1961295 2262472 2133369 2218563 2611395 3734524 6366332
13961 6366332 12923075 33443736 47936187 22416911 11645842 7267504 5416981 4325399
13953 4325399 3867994 3271140 3301517 2751980 2931855 2315856 2632185 2165838 2442741 2527958
13943 2527958 2273473 2049039 2493151 2427431 2388539 2176801 2249380 2077928 2495705 2195062
13933B195062k22784K6178K20415l17157K26052l07936J42790O1180L23250q65758
13923A481292L41118l2495m3085K86679n40718L05352O2645r2311O2311J55552
13913A986340r4623o71706O30714J53349m22539j31720O0734L75306o03368J75047
13903A457534L21442l42964L55095j50226l0844K6747p5725q0341m5910l1309
13893A403499P840P2089k33758K66925k3796K0809j61702j19234J2927L82258
13883A627857k84423M0864j72320J91880P715K32535k93127r0879K27196l7401
13873A449897l02326K83077k22772J18307q2424k17208K17175j24001N1825p5969
13863A095581j11784j3437O57392l73553o4433j24007J25305j41195l7934k3747
$$ plain form
13933 2195062 1972278 1998456 2218871 1901714 2127766 1819830 1962620 2023800 2347050 1481292
13923 1481292 1822410 1789915 1746830 2033509 1492791 1798143 1860788 1768477 1830788 1986340
13913 1986340 1891717 1220011 1850725 2004074 1581535 1449815 1510549 1885855 1282487 1457534
13903 1457534 1778976 1436012 1791107 1640881 1610037 1636784 1561059 1480718 1434808 1403499
13893 1403499 1411339 1483428 1249670 1516595 1492799 1513608 1351906 1232672 1245599 1627857
13883 1627857 1343434 1384298 1211978 1403858 1411573 1644108 1350981 1260102 1487298 1449897
13873 1449897 1147571 1430648 1207876 1326183 1243759 1026551 1243726 1119725 1171550 1095581
13863 1095581 983797 970360 1627752 1254199 1189766 1065759 1191064 1049869 1011935 988188
13853I88188l99270Q55032l72715k12622K74036j26801m289K91124k71296j2102
13843A009285j36142O4363k53091N21014l17379K72593l83925q8536M40018j25857
13833A002343M2944j163r1535k20217K35332K17566L6049n08672L65942j58442
13823I20147L54063l27525L30622j50163j52382P1773D56988L00801L03250j60511
13813I00528J38697k38826Q4671K2616J12466m17511L84708J02410j01414q0290
13803I08055j29743q4427J16791j22760r05m685R1577L45234l84906k1549o0812
13792F51870L10455j9417J7252o8453j31838J90105k15270M20418n14063Q1444
13782G22503M9200j6602p2519L0403q4031K34180j12826j83513L12310r135k72412
$$ plain form
13853 988188 588918 1443950 1071235 858613 1132649 1005848 1001559 1292683 1021387 1009285
13843 1009285 873143 937506 684415 1205429 888050 1160643 776718 688182 1128200 1002343
13833 1002343 1045287 1044124 952589 732372 967704 1185270 1221319 712647 1078589 920147
13823 920147 1274210 946685 1277307 1127144 974762 1046535 456988 757789 1061039 900528
13813 900528 1039225 800399 885070 907686 1020152 602641 987349 1089759 988345 908055
13803 908055 778312 693885 810676 687916 687011 682326 773903 1119137 734231 712682 651870
13792 651870 962325 942908 960160 891707 759869 949974 734704 1155122 641059 722503
13782 722503 771703 755101 682582 712985 628954 863134 750308 566795 879105 869970 597558
13771E97558L23416k46667j29434K55167j59332L57675j49096k43302N57502l61540
13761H01947n5092m239J18185k15894K62868P9413l76718J12548K14918j02528
13751H35408p2143C66274K29086j47342K19474J76794m17589N8928K49885k22107
13741E13403K28017Q0350j40936K12172p4986j29099o7543J07366j69165j13798
13731D45781J00097L09461q981k38114k65039J79318K0065j16699p0534N82971
13721I38326B28809N06356j91468N095J36524P334J85473l2456C41489M69187
13711H10676k30544J40704l52749L66110q0057j91373o9143J73465A88267O16059
13701H04326k55237j95003K31735R7642j92654B33572N11342r7158B28574O7339
$$ plain form
13771 597558 920974 674307 544873 800040 640708 998383 849287 605985 1163487 801947
13761 801947 746855 742616 860801 644907 907775 987188 610470 723018 937936 835408
13751 835408 763265 366274 595360 448018 667492 844286 426697 485625 735510 513403
13741 513403 741420 821770 680834 893006 818020 688921 621378 728744 559579 445781
13731 445781 545878 855339 846358 608244 343205 522523 542588 425889 355355 938326
13721 938326 228809 735165 543697 548792 685316 692650 878123 845667 341489 810676
13711 810676 580132 720836 368087 734197 654140 462767 393624 567089 188267 804326
13701 804326 549089 354086 585821 683463 490809 233572 744914 647756 228574 295913
13691B95913L97907k73583K6723K76062C42861Q7750n0945A56738M09686j31797
13681D34627J6662A65470J33070O9648J50617j78220j68402M7512J48704M01170
13671G69569C05002m7503K78582L9742J81846n310l48571Q5529A88342M21280
13661F09622P2081j2558k31401o9562q1881N22199C83749L9233M6607j55151O2163
13650C76601M44312C21506J49166p0366P3404j23359P290p5291K30486L7984I5610
13638E98537k41477N9187o1935K96250B37924N43638C72024J67908k12788A49833
13627C64990K84156j8699j02922a04569B44730K16244r1215j02710L17714j99005
13617C85758J01378j93506K42529A56114L04545J2576A96840N5131J69427A03761
$$ plain form
13691 295913 693820 420237 446960 723022 342861 430611 379666 156738 566424 434627
13681 434627 451289 165470 298540 368188 518805 340585 172183 219695 368399 769569
13671 769569 305002 257499 536081 575823 757669 752359 403788 489317 188342 609622
13661 609622 681703 669145 437744 368182 286301 808500 383749 422982 469589 314438 376601
13650 376601 820913 321506 470672 400306 473710 350351 357641 282350 512836 550820 95610
13638 598537 357060 416247 354312 650562 237924 781562 372024 539932 327144 149833
13627 364990 649146 630447 527525 -104569 244730 460974 369759 267049 584763 385758
13617 385758 487136 293630 536159 156114 460659 473235 196840 251971 421398 103761
13606C41567j36392I9319L66154A56062K58058j4267J90470k65207A58134L1055
13596A89189J9190A3584K86556J85659j20554K30589j31069A75697P1539b13389
13585E4779K22061J03379M0394R6194k54613L2228J37116A29601R4822L08774
13575E33197j09318H6694M63835j57406A86091J71050J08984k18828J72798j42769
13565B77326J72462k21738D8932B3083R9689N6213J92919j22359P2981j50415
13555A72111J69072j00965K18233j49624K60852k00876K17482B45930K58174A83114
13544D24525j28589J92975j10475F1565M00860B10531F1422K92440m0616q2705
13534B30541I8572J4733J91129r8331K33927k5958L5509k1365j6120j72878L28466
$$ plain form
13606 341567 205175 99319 465473 156062 414120 399853 590323 325116 158134 189189
13596 189189 208379 13584 300140 485799 365245 595834 464765 175697 247236 -213389
13585 54779 276840 380219 420613 516807 262194 294422 431538 129601 224423 533197
13575 533197 423879 86694 550529 393123 186091 357141 466125 247297 420095 277326
13565 277326 449788 228050 48932 23083 122772 178985 371904 249545 322526 172111
13555 172111 341183 240218 458451 308827 569679 368803 586285 245930 504104 183114
13544 424525 295936 488911 378436 61565 462425 210531 61422 353862 313246 230541
13534 230541 98572 113305 304434 206103 440030 414072 449581 428216 412096 239218 567684
13523E67684k11345j30607D4359K26128j441j6654J9011J88392M063a7596C18335
13511c0007B21645m48J86343A41931J28738J30459A71161K68666D9188M75276
13501E24464k46619B3589J34022J90811N2722A37421J74244K0787A00877c9435
13490D73017A70095H0325L69301a6849D47600J09400G563K06697P2936L48826
13480F36022a18544C72395M6424k504j64361q1234M323D9236K85866F5888f364
13468C89180j0773A44835f0938A90060k5170J37271F2910J63325l1888d428B57234
13456B40250E0273M60997B34035o5671Q1825J131C9876L88913j66719k6418l7258
13445A98394N5467I7085O0379a57743A92508L1247j1605O4983E1773M83454j59135
$$ plain form
13523 567684 356339 225732 44359 270487 269046 252392 271403 459795 463858 -17596 318335
13511 -30007 221645 221197 407540 141931 270669 401128 171161 439827 49188 524464
13501 524464 277845 23589 157611 348422 401144 137421 311665 332452 100877 -39435
13490 473017 170095 80325 449626 -16849 447600 557000 7563 214260 287196 636022
13480 636022 -118544 372395 418819 416315 251954 170720 175043 49236 335102 65888 -6364
13468 389180 378407 144835 -60938 190060 164890 302161 62910 226235 194347 -4428 257234
13456 240250 50273 511270 234035 168364 250189 251320 39876 428789 262070 235652 198394
13445 198394 253861 97085 157464 -157743 192508 223755 212150 277133 51773 535227 376092
13434C76092j60115b7121B70582o1993k8553J93551J3873A69307K90438k05997
13424B53748D3550e3687B10242I5882K83774j53472Q5721j05435Q825o2772Q0422
13413B32945A1504N53103B58843J8751q2283K28601k09189N090G1243Q2251o0637
13402I2857K27517n9153M3664p4622A04957L5470A0483a12328B44164o0272K01021
13391C84913A52967b697A90806L0859D6054A6842L40085j42935E1474J74038O6491
13380B92003j2682a09944G7142J27594K9049R6844j08782H9283N9102B3281P9529
13369A02810Q7915l1568Q7419a28599A37646E2549J0682J20784a04410D23598
13358a16097A39671J09518e122B87269k4616a85719G5202N53M22916A29169a14376
$$ plain form
13434 376092 215977 -27121 270582 208589 180036 373587 387460 169307 459745 253748
13424 253748 43550 -53687 210242 95882 379656 226184 311905 206470 215295 152523 232945
13413 232945 11504 564607 258843 277594 195311 423912 214723 219813 71243 153494 92857
13402 92857 320374 261221 304885 230263 104957 140427 10483 -112328 244164 183892 384913
13391 384913 152967 -2697 190806 221665 46054 16842 356927 213992 51474 225512 292003
13380 292003 279321 -109944 77142 204736 233785 330629 221847 89283 148385 23281 102810
13369 102810 190725 159157 246576 -128599 137646 52549 63231 184015 -104410 423598
13358 -116097 139671 249189 -5122 287269 262653 -185719 75202 75755 498671 129169 -114376
13346D59701A27852J3270F6474J78106B2065g1662A61833J14509a79384D71648
13335B92878M4399K5828A50557J59996J53299g976D42489I7645J99204j00904
13325A95945j2596a54376A19207h8397B069K92515m7241A04259J52176L0804q6762
13314B00477o3432L9558A6525M23372k10912j6830D590K49876o5538H3455K69597
13303C53052j71976J40146c1837C07899j44403A3346K09175A10620P5868b09851
13292A85438K12072L03143g6860A53597o2980J9720m4549K76871j42424C0729
13281F5703i5236I9645K2993a14066M0196C50359q2345i7231G4167K420K46977
13270C23564b03940D3177a09597E21426F7053j9246L99621d6810C04119B0656
$$ plain form
13346 459701 127852 141122 66474 244580 22065 -71662 161833 276342 -179384 471648
13335 292878 337277 363105 150557 310553 463852 -7976 442489 97645 296849 195945
13325 195945 183349 -154376 119207 -88397 2069 294584 247343 104259 256435 287239 200477
13314 200477 137045 176603 16525 439897 228985 212155 4590 254466 188928 83455 353052
13303 353052 181076 321222 -31837 307899 163496 13346 222521 110620 186488 -209851
13292 185438 397510 700653 -76860 153597 90617 110337 65788 342659 200235 30729
13281 65703 -95236 99645 122638 -114066 -73870 350359 268014 -97231 74167 76587 323564
13270 323564 -203940 43177 -109597 521426 67053 47807 447428 -46810 304119 20656
13259A77710C4321J5084a8155B5220J155J72768J25267J32968G1110d105B5607
13247A01456h7681B40021D9691J39867f0259A53168j5637B9847E738d7162A56493
13235B09907l4743M0106j01883e8601A59338E4919m399A1103P7427R7344L47090
13224E32964B13748K2534p5849m4811Q6760a27066d1065j90362D6318a77963A62632
13212e6961n1667G6072g6282m740C0624a58903C06628A41281h2198A40568C1408
13200a04132D97899b28871B58581n5961a14821C49624H2833K65207j19058b77355
13189d0207A47895h9375B05265r9798P9521J67235C3710M9543C1166L69489j53428
13178B47227g1454k5152B82319H3196a33368B23404a83300B51400G0627b11021
$$ plain form
13259 177710 34321 49405 -18155 25220 26375 199143 324410 457378 71110 -4105 25607
13247 101456 -87681 240021 49691 189558 -60259 153168 137531 29847 5738 -47162 156493
13235 209907 175164 215270 113387 -58601 159338 54919 50520 11103 88530 185874 532964
13224 532964 213748 236282 160433 115622 202382 -127066 -41065 -231427 46318 -177963 162632
13212 -56961 -108628 76072 -76282 -81022 30624 -158903 306628 141281 -82198 140568 31408
13200 -104132 497899 -228871 258581 202620 -114821 349624 82833 348040 228982 -277355
13189 -40207 147895 -89375 205265 105467 184988 352223 33710 83253 31166 400655 247227
13178 247227 -71454 -96606 282319 83196 -133368 223404 -183300 251400 70627 -211021
13167b81895C61967a08000A25088a39039C3521R8494b6485C48868j36810r2896
13157A19162K78736g4626j99355A10311M2019c71470i025B13035J38445M3078
13147C94558j79971j04555a4342A3341K0180a4444n0509A01770j0642a12999I3057
13135C65600b44815c2526l110A01843k6121L04682E547a00048A48177a4030C85775
13123B55003f4512G4724r114b66270A66102a69792A00776E479L77637D8839i4518
13111D83403c89652F6679N4649a2807E5939L32626F5279P3578a56705A95777Q744
13100B04521L2799a77722P8051A51871b8160j02039k40778B78556a44741A58258
13089a62324A26638b25577B98766j11207L2345J95489A12771i5878A70053e7311
$$ plain form
13167 -281895 361967 -108000 125088 -139039 33521 132015 -26485 348868 212058 119162
13157 119162 397898 -74626 -273981 110311 152330 -371470 -9025 213035 351480 394558
13147 394558 214587 110032 -14342 13341 33521 -14444 -64953 101770 91128 -112999 93057
13135 365600 -244815 -32526 -35636 101843 75722 380404 5547 -100048 148177 -14030 385775
13123 255003 -64512 74724 65610 -266270 166102 -169792 100776 5479 383116 48839 -94518
13111 483403 -389652 66679 121328 -12807 55939 388565 65279 138857 -156705 195777 204521
13100 204521 237320 -177722 -99671 151871 -28160 -130199 -370977 278556 -144741 158258
13089 -162324 126638 -225577 298766 187559 219904 415393 112771 -95878 170053 -57311
13078f3399A77277J62309B0477b89421A02573b796B12668A3578J97373b25854
13067g0400j20846A16219J4199a9079o4458A22117h2797B31156b9549B76674B5106
13055A92833e6820A72969G5798h8285B9707b16350A6149c0191b400o3219j93350
13044b58969a3220B16237m3020a31111g822A72727i9201A39291m3203b97529D6663
13032C2746K42959h8325k0436j80542G1808L82700j95273d82C4894J12151G2302
13020A49842G0908a00053B04951R1409A10520N889A7260J15665j381D8616J37894
13009A86510o8103a54585A08793e6487A0949c7692c67A29720a68610A15590c8099
12997A4570e981B96773A44706i1570J1360B06138C1807R6382m093k7015d3179
$$ plain form
13078 -63399 177277 339586 20477 -289421 102573 -2796 212668 13578 210951 -225854
13067 -70400 -191246 116219 130418 -19079 -83537 122117 -82797 231156 -29549 276674 25106
13055 192833 -56820 172969 75798 -88285 29707 -216350 16149 -30191 -2400 -65619 -258969
13044 -258969 -13220 216237 173217 -131111 -7822 172727 -99201 139291 96088 -297529 46663
13032 32746 275705 -88325 -108761 -289303 71808 454508 259235 -482 34894 147045 72302
13020 149842 70908 -100053 204951 296360 110520 116409 17260 132925 131544 48616 186510
13009 186510 118407 -154585 108793 -56487 10949 -37692 -367 129720 -168610 115590 -38099
12997 14570 -5981 296773 144706 -91570 -80210 206138 31807 128189 124096 97081 -43179
12985A91453k4715J4029M08117D2409K645J84901c1601q3824A92574B5267K55594
12974B80861H2730D0450r324c4594A40162a25304A87888n7021l3639P9169a98384
12962A01447M5741K80580D645a11512A29379e4967j35223a7040B97176j16362
12952A80814a76840m3557A92473Q7501m0094G2652l3760b83528B14366a62715
12941a02793L8217A97299d53661A69021J79166G3269J03614D9594d38987K05804
12931b33183F3884a78128A63275K6325e48113e9799J4658A30838b59571e9633
12920c4265R574A79284b21484A1731B822K4777L02125D5659p533K52636a9646
12908b85703A61494k9645N580g2955J9023D19325A01575B8212J66920d5999j0238
$$ plain form
12985 191453 166738 180767 588884 42409 45054 229955 -31601 -115425 192574 25267 280861
12974 280861 82730 40450 31126 -34594 140162 -125304 187888 130867 97228 176397 -198384
12962 101447 147188 427768 4645 -111512 129379 -54967 -190190 -17040 297176 180814
12952 180814 -176840 -220397 192473 279974 239880 72652 38892 -283528 214366 -162715
12941 -102793 -64576 197299 -453661 169021 348187 73269 176883 49594 -438987 -233183
12931 -233183 63884 -178128 163275 189600 -548113 -59799 -45141 130838 -259571 -59633
12920 -34265 -24691 179284 -221484 11731 2822 27599 329724 45659 38126 290762 -19646
12908 -285703 161494 131849 137429 -72955 -53932 419325 101575 28212 195132 -45999 -56237
12897e6237A3327J5975i1661j93711A40466a67060A14602c49801A33567K6586
12887A60153E4950M05688B08785a04405a9329q3481j36570A03056b17934A5428
12876I9870B8384K21030p8639l6023a28372K0695A57117b11472g1799A53551a28663
12864a7998A33188h8949A7320a25756A40452b15134B33548a19808e25B66287H8122
12852C321d13330J87490J03q782k9879J22064b6492c73o9729C718M3253J03488
12840A50459A3558c53397J61551A26673J53816A39920J7943K25451j60547a53845
12829b485A3614b5017m4107D13886g1397A62014a10473p424I2132K64402j06306
12818B50228b64771B80001h6022K9241l1397l2023I3556a89948E8099d8934I7288
$$ plain form
12897 -56237 13327 29302 -91661 -285372 140466 -167060 114602 -349801 133567 160153
12887 160153 54950 460638 208785 -104405 -19329 -102810 -239380 103056 -217934 15428
12876 99870 28384 249414 170775 134752 -128372 -107677 157117 -211472 -71799 153551 -128663
12864 -17998 133188 -88949 17320 -125756 140452 -215134 233548 -119808 -525 266287 88122
12852 3321 -413330 -225840 -225737 -234519 -264398 -142334 -26492 -373 -70102 3718 46971 150459
12840 150459 13558 -353397 -191846 126673 280489 139920 157863 383314 222767 -153845
12829 -2485 13614 -25017 -69124 413886 -71397 162014 -110473 -117897 92132 356534 250228
12818 250228 -264771 280001 -86022 -56781 -88178 -120201 93556 -189948 58099 -48934 97288
12806B8711e7425A05760k6213O3390A7903P3656J8396a43258C41194D158L0247
12795C4405c17977B06226a4598m1238a3861j28781B37862F4887j7537J76161P7475
12784C00986j7690b09873Q1590L8861M2402j14398b9843B5518K60605b80581h8517
12772A65348R0606a27605E6612J68032G7277a7707k9681B7416K5370q759K07329
12761B51356E6223g622A22443C555J26928b06914e6640q922C39406d31348f5994
12749B9100K55399a32140A8961q231a94749C0774A2765d57534B41988c07635a06983
12737i7658j17357i7720j87643a4280j02542o4016l2960a01622d1479k0660f225
12725A67908a27330A91603r3923k4325B7481M6802O3594c1019G5847b39267J8162
$$ plain form
12806 28711 -57425 105760 79547 142937 17903 91559 109955 -143258 341194 4158 34405
12795 34405 -317977 206226 -14598 -55836 -13861 -142642 237862 64887 47350 223511 300986
12784 300986 283296 -209873 -128283 -89422 -47020 -161418 -29843 25518 286123 -280581 -88517
12772 165348 255954 -127605 56612 224644 77277 -17707 -47388 27416 52786 44027 251356
12761 251356 56223 -7622 122443 3555 130483 -206914 -56640 -65562 339406 -431348 -65994
12749 29100 284499 -132140 18961 10730 -194749 30774 12765 -457534 241988 -307635 -106983
12737 -97658 -215015 -97720 -285363 -14280 -116822 -180838 -213798 -101622 -41479 -62139 -6225
12725 167908 -127330 191603 97680 73355 27481 74283 137877 -31019 75847 -239267 -221105
12714b21105E9459a30009b7439A99234H5636B3591N1414J22035b6015n7072p5980
12703a59067C64568e0737J4561j27385k49437A09126l0611J6321K9659k1565a77459
12691A20129a37712A85047I0779e0023C5525L3558J29151H9130Q4893J6426O354
12680A96803E9410J91962a12440L1032B79034C0943K37440h1224k4777A62654
12669b28719h4627A66632f2046A7077c6162k8254B8861J79159a02394a1883A32650
12657g0897D482b094l4083A4737K04376J82093a46742j44544A22317N313c27120
12645C8616b00345h4346A33482g4672B03691a89969A83181Q3785j18915A6605
12634B90047j37424a66522B78922j15826b6966G0105g6753A42528O6042j02150
$$ plain form
12714 -221105 59459 -130009 -27439 199234 85636 23591 75005 197040 -26015 -83087 -159067
12703 -159067 364568 -50737 -36176 -163561 -412998 109126 78515 94836 124495 102930 -177459
12691 120129 -137712 185047 90779 -50023 35525 69083 198234 89130 174023 190449 196803
12680 196803 59410 251372 -112440 -81408 279034 30943 268383 -81224 -106001 162654
12669 -228719 -84627 166632 -62046 17077 -36162 -64416 28861 208020 -102394 -11883 132650
12657 -70897 4482 -2094 -36177 14737 219113 401206 -146742 -291286 122317 127630 -327120
12645 38616 -200345 -84346 133482 -74672 203691 -189969 183181 266966 148051 16605
12634 290047 152623 -166522 278922 163096 -26966 70105 -76753 142528 208570 106420
12624A06420K7643M0303B49M1237J02731C6963l827A5082J48573p9076R0886k7320
12612A48145c53790A49089o04f6267A92939b7093k6665C27973A37115j3709b934
12600I4188p086b17920B02338h8048D21151j98343o5828b6132A45330i1455j14846
12589b06301b4893p6138A4004K218Q3123e402A77757c08604I5901g3629G908K00692
12577B08600a01821A49499F0314a18723A60510J89583e214B23827o8935J63869
12567C18761j16477A198J87715a23550M1885l13018A8462b22073o0590A43130
12556I0185l7667k5667K01303c769D1297i2403H6285P2291a53012G610K6457c9697
12543B47662e8737B29655a96354C3860a9623k2735d168B93013b9578a3442A16421
$$ plain form
12624 106420 134063 174366 249 41486 144217 36963 33136 15082 163655 84579 175465 148145
12612 148145 -353790 149089 148485 -66267 192939 -27093 -53758 327973 137115 123406 -2934
12600 94188 87102 -217920 202338 -88048 421151 222808 156980 -26132 145330 -91455 -206301
12589 -206301 -24893 -101031 14004 16222 99345 -5402 177757 -308604 95901 -73629 7908 208600
12577 208600 -101821 149499 60314 -118723 160510 350093 -5214 223827 154892 318761
12567 318761 202284 1198 188913 -123550 -81665 -394683 18462 -222073 -282663 143130
12556 90185 52518 26851 228154 -3769 41297 -92403 86285 158576 -153012 7610 34067 -39697
12543 247662 -58737 229655 -196354 33860 -19623 -42358 -4168 293013 -29578 -13442 116421
12531D62979a10211A00319C4311e6157B8090J31746B7596K6745j4533c62091g1979
12519a34241A15754j6814Q2173b74657g6172r2895j2268k79815f4315A77926q5415
12508I2511c16972A89171b01847m8499d5366n3521F4772a33009b480k71530e3082
12496g9522l8946j60677G8149a14204I8574k9381K3003N1875i5315m145j55574
12485b55034C0561j4547a4704B97658l7453H844L62304c7417A9711a01686B31207
12473C02576I0358b44508C71019H6715a26756M1161a0987j69841B19571b3809
12462B2749J95273q8321a35687b5755p4930C25610e2053n8352M3325B48464e1334
12450I904f8239B43785h515G7960A0684i0014A21249a38571J1790j03137Q4678
$$ plain form
12531 462979 -110211 100319 34311 -56157 28090 159836 27596 54341 39808 -362091 -71979
12519 -134241 115754 98940 181113 -274657 -76172 -169067 -181335 -461150 -64315 177926 92511
12508 92511 -316972 189171 -201847 -250346 -45366 -98887 64772 -133009 -2480 -274010 -53082
12496 -79522 -118468 -279145 78149 -114204 98574 69193 92196 144071 -95315 -99460 -255034
12485 -255034 30561 16014 -14704 297658 260205 8844 371148 -37417 19711 -101686 231207
12473 302576 90358 -244508 371019 86715 -126756 -85595 -10987 -180828 219571 -23809
12462 22749 218022 129701 -135687 -25755 -100685 325610 -52053 -110405 -67080 248464 -51334
12450 9904 -68239 243785 -8515 77960 10684 -90014 121249 -138571 -126781 -229918 -145240
12439a45240A07694O1248A5942a94169e4727C4589b93795a10899H3453a09768
12428b87264J30554j45705A03628a12253C09058j29519a55833F4415h46A57552
12417c51547e7188J1292A48374m0033L6260M7941B0329J65119k2141a03872A51355
12405b8359j47497B82943b18449c329C7946b49529g3589r0437A27062i2233H8991
12393c9200k1742B06961g559C18689A32487c4436A21165J07081F8355A0384K7087
12382C7471B479Q5631i1910A30799c5532A7180i192j77366A3248P051r882a77380
12369C27944A53935a17941A28590d7290C6750a14953A48649J14049a15113o1181
12359a76294d7422B26444A05112J55406H3236c4982I0530A0733j904a20754j31608
$$ plain form
12439 -145240 107694 168942 15942 -194169 -54727 34589 -293795 -110899 83453 -109768
12428 -287264 -156710 -302415 103628 -112253 309058 179539 -155833 64415 -846 157552
12417 -351547 -57188 -45896 148374 108341 144601 192542 20329 185448 163307 -103872 151355
12405 -28359 -175856 282943 -218449 -3329 37946 -249529 -73589 -164026 127062 -92233 88991
12393 -39200 -60942 206961 -7559 318689 132487 -34436 121165 228246 68355 10384 37471
12382 37471 2479 88110 -91910 130799 -35532 17180 -9192 -186558 13248 20299 10417 -177380
12369 327944 153935 -117941 128590 -47290 36750 -114953 148649 262698 -115113 -176294
12359 -176294 -47422 226444 105112 260518 83236 -34982 90530 10733 8829 -120754 -252362
12348b52362d8667l8396A3098M2975K21615B2398a03429j1724D813R4736k2496
12337G7053a17642j33458d9398B75872d77291J79568F1574a51383A33590b5819
12326B83136j16733L2790a70367D0651a01072G2819J18276g7593B28813b48908
12315B66194a42419A63543B5368d28787E6086b22016H0635J33717A9126a29859
12304a90553H9333M5236J69241g196E2433c5246n3454F5712a38064A05939K22688
12293C28627D9059c71681P1573J27966b1567B8382a25673k33438F2614J45415
12283B08029R8b426C0271a16907A86211p4809J20210N0948A33319b5563r335j44347
12271a79245d8385D0505F648b87006I531a57665C86341b51333A59465a6751G5351
$$ plain form
12348 -252362 -48667 -87063 13098 56073 277688 22398 -103429 -115153 4813 99549 77053
12337 77053 -117642 -251100 -49398 275872 -477291 -297723 61574 -151383 133590 -25819
12326 283136 166403 199193 -170367 40651 -101072 72819 191095 -77593 228813 -248908
12315 266194 -142419 163543 25368 -428787 56086 -222016 80635 214352 19126 -129859
12304 -190553 89333 134569 303810 -7196 52433 -35246 -88700 65712 -138064 105939 328627
12293 328627 49059 -371681 -300108 -172142 -21567 28382 -125673 -359111 62614 208029
12283 208029 208127 -2426 30271 -116907 186211 111402 231612 282560 133319 -25563 -34898 -179245
12271 -179245 -48385 40505 6648 -287006 9531 -157665 386341 -251333 159465 -16751 75351
12259a84356C6306g3725j37131g9928b714B42314J41181b61531B00624F8495L6635
12248A05130g7576A40318K8825K24305c615R83A79073e467H1769R5884G5546k0448
12236E5098a14120n6249F2699a25320A87420H3632b00675A15011J50033r1558
12226A73486l92p9304J68373c6254A37570q870J4482P0206l7126j5661Q9842C8743
12213E5207f9600a1065E7753A2328i9116I8673c6814j91920a01973A1290O1032
12202G2322e4086B20301O8289C8514a3356C29031p0254O1809o4617q7974a41629
12190C6139Q8541N1377a10113N362A94363F7835K96271e5461E2618k6193J29474
12179A55899J45944A600L87669A16085k8360J18617a23549B1799a74605P0151
$$ plain form
12259 -184356 36306 -73725 -210856 -79928 -2714 242314 383495 -261531 200624 68495 105130
12248 105130 -77576 140318 169143 393448 -3615 -2632 179073 -5467 81769 177653 75546 55098
12236 55098 -114120 -170369 62699 -125320 187420 83632 -200675 115011 265044 173486
12226 173486 173094 93790 262163 -36254 137570 128700 143182 213388 176262 160601 250443 38743
12213 55207 -69600 -11065 57753 12328 -99116 98673 -36814 -228734 -101973 11290 72322
12202 72322 -54086 220301 288590 38514 -13356 329031 258777 320586 255969 167995 -141629
12190 36139 124680 176057 -110113 -104751 194363 67835 364106 -55461 52618 26425 155899
12179 155899 301843 1600 389269 116085 87725 206342 -123549 21799 -174605 -104454
12169a04454K6635B7723N1312J96430j17841a58067D35580f7950B93120A00557
12158i2498E16325A0501L3560j2066O8184O9337J49707H7326J40081a3396l206
12147a6602B39407L6796G8994J43152a55551C2102M7490K34171h9083E9667e6213
12135A40759L4608J03201g6827B1651J82165g9605B7548L58634G812f0490r4610
12124a55100C55728A51639F4789l2141a18870A16881j0366J70392a17020B0479
12113A39512a87144h1539G648R2844l481j4227a23512k48910b8126k71439B36902
12101A01952D1390a7155j86095C1794b00596M5069B5946P0225g5555L2299A5277
12089B89524b9182l2707k78847I3229a25803G0890H065a42937O0534A52842C6388
$$ plain form
12169 -104454 -77819 27723 79035 275465 157624 -158067 435580 -67950 293120 100557
12158 -92498 516325 10501 44061 31995 100179 169516 319223 87326 227407 -13396 -16602
12147 -16602 239407 276203 78994 222146 -155551 32102 79592 313763 -89083 59667 -56213
12135 140759 175367 278568 -76827 21651 203816 -79605 27548 386182 7812 -60490 -155100
12124 -155100 355728 151639 64789 32648 -118870 116881 106515 276907 -117020 20479
12113 139512 -187144 -81539 7648 100492 97011 82784 -123512 -372422 -28126 -299565 236902
12101 101952 41390 -17155 -203250 31794 -200596 -155527 25946 96171 -75555 -43256 15277
12089 289524 -29182 -61889 -340736 93229 -125803 70890 8065 -142937 -82403 152842 36388
12077B44920I1229a36700f2530A71583H3026a15157m2352b6329A21527p993h4827
12065A86233H5631a16707H9188Q2669F967L70540a66845I6818L7501K84767A02216
12053c01955a13399A4354e0159n127q4498C44582j21451N16970R88871G64527
12042A41386d4633B06416a22371C46176C8512J51032c2858A49622E63J51597r543
12031A42617k7387c46436C113a7865C9482J11992p3837g8836j06699c8885B01552
12019d6744A16111a64492a6927k27684g0598G7920b16781B7809a00470A85794
12008a53422j05584J19790j00364G585a86300b9641j61817A56464i0085q5426
11998a75511I6650K9068b56636B4179J97979G3196J01763C0894J6779a18696N7939
$$ plain form
12077 244920 91229 -136700 -62530 171583 83026 -115157 -157509 -26329 121527 113534 -84827
12065 186233 85631 -116707 89188 171857 6967 377507 -166845 96818 134319 419086 102216
12053 -301955 -113399 14354 -50159 -55286 -139784 344582 223131 740101 1728972 764527
12042 141386 -44633 206416 -122371 346176 38512 189544 -32858 149622 563 152160 142617
12031 142617 115230 -346436 3113 -17865 39482 151474 77637 -78836 -185535 -38885 201552
12019 -46744 116111 -164492 -16927 -244611 -70598 77920 -216781 27809 -100470 185794
12008 -153422 -259006 -139216 -239580 7585 -186300 -29641 -191458 156464 -90085 -175511
11998 -175511 96650 125718 -256636 24179 222158 73196 174959 30894 47673 -118696 -60757
11987f0757D5972O3871J26406E4798J96815G2120L39954j21781b92259D1761a13393
11975c1013F1450N2454b64616h6162N596r1445B92894a5869B17934a84100A78399
11963a26872f0651I3510e56196B19553j00187c84866G6911i0614E1117b25983
11952b75762a6344C2109L3342k6994a23033j85603R8687J5557I3125d53029B56104
11940b1679j6577a0700A73918m0689c1561d514j13343b8662k83582A61706A5147
11928C12402a42543H8579e4263C9536Q6900K78818a5805k22104I9177E722a11818
11916A079a14070G9864c26517a9861A16067a85291j27434a36065R425B25050c5727
11904F9843J27230r3102O0785h4152c7811C6588b36451A66862c03663A21250P7878
$$ plain form
11987 -60757 45972 109843 236249 54798 251613 72120 412074 290293 -292259 41761 -113393
11975 -31013 61450 113904 -264616 -86162 -80566 -172011 292894 -15869 217934 -184100 178399
11963 -126872 -60651 93510 -556196 219553 119366 -384866 76911 -90614 51117 -225983
11952 -275762 -16344 32109 65451 38457 -123033 -308636 -209949 -194392 93125 -453029 256104
11940 -21679 -38256 -10700 173918 133229 -31561 -4514 -117857 -28662 -312244 161706 15147
11928 312402 -142543 88579 -54263 39536 126436 405254 -15805 -237909 99177 5722 -111818
11916 1079 -114070 79864 -326517 -19861 116067 -185291 -312725 -136065 -126640 225050 -35727
11904 69843 197073 103971 164756 -84152 -37811 36588 -236451 166862 -303663 121250 199128
11893A99128a32366F2001b805A01707g1268k05115D07390a6146o3529B64615j10364
11882A54251h2670k3819A03554N2857a71758l30053E2934B57J12802N9500H4208
11870a48755j0918j43612a7400F0184A6848g6861k88786J77643A01691m7598O2798
11859A16891b22674A98662b78869a23237B69104g8595m3468N5779D1076a86078
11848b60677G665M7064b46117d1886r1446A8713R0851c33878d3562A81110b4947
11836D10824h8940n1860j44647b6246j04183B14886a70485K1532E2043b70881
11825a2965B575c1686B34922B9902c4999m9960L268H5156g6346K0429j26444N4457
11813a27904J1741o9461B27488J00795G5919k693a52400j74179a9477j48787f8321
$$ plain form
11893 199128 -132366 62001 -2805 101707 -71268 -276383 407390 -16146 -79675 264615 154251
11882 154251 -82670 -106489 103554 156411 -171758 -501811 52934 257 113059 172559 84208
11870 -148755 -159673 -303285 -17400 60184 16848 -76861 -365647 -188004 101691 54093 116891
11859 116891 -222674 198662 -278869 -123237 269104 -78595 -122063 -66284 41076 -186078
11848 -260677 7665 54729 -246117 -41886 -133332 18713 109564 -333878 -43562 181110 -24947
11836 410824 -88940 -140800 -285447 -26246 -130429 214886 -170485 -148953 52043 -270881
11825 -12965 2575 -31686 234922 29902 -34999 -84959 -81691 85156 -76346 -55917 -182361 -127904
11813 -127904 -116163 -185624 227488 328283 75919 73226 -152400 -326579 -19477 -168264 -68321
11801C60943c5718E5072j3887a4185l22482A7999a799B572h4741A01993n504c34557
11788c6900K223I6713J29176c77898P6476G4533I505a54646A18595c3138A44664
11776h0598j27699a00966B9445J63956D234f4258E32360g5655k50619C04414C9917
11764B5677i5342A59000a01143a4242j41751b1679A09742J10528a25234M092j54205
11753b75347A93302c16782a10531p6604I4946j2313c02129B45827D7150F791a88209
11741d4164A64639a85834A99307J2014f7612n5388B04829H1041b06712A85751
11730A31549C9624M6896a63627m33k1677E1717a38721B76021f9461j21117L2184
11719a58394p9142E8467e1334A74744b80559J39637k7407A56372N2100Q151I2953
$$ plain form
11801 360943 -35718 55072 41185 -14185 -336667 17999 -1799 2572 -84741 101993 96489 -334557
11788 -36900 -34677 96713 225889 -377898 -301422 74533 9505 -154646 118595 -33138 144664
11776 -80598 -208297 -100966 29445 193401 4234 -64258 532360 -75655 -326274 304414 39917
11764 25677 -95342 159000 -101143 -14242 -155993 -21679 109742 220270 -125234 -121142 -275347
11753 -275347 193302 -316782 -110531 -187135 94946 82633 -302129 245827 47150 6791 -188209
11741 -44164 164639 -185834 199307 211321 -67612 -123000 204829 81041 -206712 185751
11730 131549 39624 86520 -163627 -164060 -185737 51717 -138721 276021 -69461 -190578 -158394
11719 -158394 -237536 58467 -51334 174744 -280559 -140922 -168329 156372 208472 216623 92953
11707F4649d2999B24180b72053c1291A29514a40045N6917c4219j14873A98512
11696b67957B65166i6458d6849E0887b17574A33995J3388a5443P171B77887c2028
11684b3993C4585a19722A73388f3191j49909M920B99087f958A25473a4685o5464
11673h0149H2430M2430J8067H689a1300k3253B19067h3391h775k33011I1120d7692
11660C06672D8491K08621G0589h0883B6000a62592c3901B168K94b99934J44273
11649a55661A63635K20773F6881g6471j2237A9486M5636g0381B07019M6888e494
11637F3587d1870E2185a26892P605b8048i060A50133a53005A38943J11447I3448
11625D29982B4650q497K06524a58704G6343J95712H1710c31892H7487a54078A24897
$$ plain form
11707 64649 -42999 224180 -272053 -31291 129514 -140045 -83128 -34219 -149092 198512
11696 -267957 265166 -96458 -46849 50887 -217574 133995 147383 -15443 -8272 277887 -32028
11684 -23993 34585 -119722 173388 -63191 -213100 -208180 299087 -6958 125473 -14685 -80149
11673 -80149 82430 124860 142927 8689 -11300 -34553 219067 -83391 -8775 -241786 91120 -47692
11660 306672 48491 257112 70589 -80883 26000 -162592 -33901 2168 2462 -299934 -155661
11649 -155661 163635 384408 66881 -76471 -88708 19486 65122 -70381 207019 253907 -5494
11637 63587 -41870 52185 -126892 -119287 -28048 -9060 150133 -153005 138943 250390 93448
11625 429982 24650 16153 222677 -158704 76343 272055 81710 -331892 87487 -154078 124897
11613B4521f8350D5161M3576b68217C48487B9223J74240a13636N073l0097B02035
11601A39248b18536e3886B48414M4425n6412J30674j33128H7116C0302J82391
11591B12693c2514j44160f7089J4426k0249m6038B36241b36882J15706C5897c90480
11579a32787E9690J17082B4928K2619Q259M8616B9426J52040j687g191j17982
11568a25173I4889a86671f2827A08704M4248a55893J5809D25000b15495O3317
11558a52178A18017L23322D1389K49065j09756l0630m6768J60751G4221a63041
11547A99865k7712G8332J26570G328f2477B75952b58049j4495A76689j0000J15073
11536B81762a26592k3975F9484k1406K4491d3572A41698K0863h0176B1104a9215
$$ plain form
11613 24521 -68350 45161 88737 -268217 348487 29223 203463 -113636 -108563 -138660 202035
11601 139248 -218536 -53886 248414 292839 236427 367101 233973 87116 30302 212693
11591 212693 -32514 -176674 -67089 -52663 -72912 -118950 236241 -236882 -121176 35897 -390480
11579 -132787 59690 176772 24928 47547 55806 104422 29426 181466 179779 -7191 -125173
11568 -125173 94889 -186671 -62827 108704 152952 -155893 -140084 425000 -215495 -152178
11558 -152178 118017 441339 41389 290454 180698 150068 103300 264051 74221 -163041
11547 199865 172153 78332 204902 7328 -62477 275952 -258049 -272544 176689 166689 281762
11536 281762 -126592 -150567 69484 48078 72569 -43572 141698 162561 -80176 21104 -19215
11524i9367m7716C829h4122C0292J91391D1541h772j97984A65999d8827G7692
11512A08970j2161l8108Q6478K74623j61612C4970J88221B4807R987d8448l93476
11501d41924C43850A20105k2182a61032I493J9335K92063m1087b84519F2348M7302
11490A09650J64044E9245K92899a31289j55120C35160A57242b3857j03239D86065
11479B4125J10574P1043f1452H8182K252P3687e5969j7044C7067J63667a00405
11467a18704B69004E4322N3082c8641A37386h646n796D2696j0661J63728H3868
11455C9608L67930j94898c49422C30629b2163C89742q6914f3161G141K82407j21691
11444A67857J07504j02782A1062J17886C4713R3341K47448A37739j0481k5029
$$ plain form
11524 -99367 -147083 3829 -84122 30292 221683 41541 -8772 -206756 165999 -48827 77692
11512 108970 96809 58701 145179 419802 258190 34970 223191 24807 34794 -48448 -441924
11501 -441924 343850 120105 97923 -161032 9493 28828 320891 279804 -284519 62348 109650
11490 109650 273694 59245 352144 -131289 -286409 335160 157242 -23857 -127096 486065
11479 24125 134699 205742 -61452 88182 90434 164121 -55969 -73013 37067 200734 -100405
11467 -118704 269004 54322 107404 -38641 137386 -8646 -14442 42696 32035 195763 83868
11455 39608 407538 212640 -349422 330629 -22163 389742 302828 -63161 7141 289548 167857
11444 167857 275361 172579 11062 128948 34713 128054 375502 137739 127258 102229
11434A02229a37117A14588L1820l8749b89455I213a59711j29044I6146b7221C72511
11422i7498A48944L17745b39627B28611a07717A6291J49338N187E9646K40427
11412C00073A42290o7457a3024j30618A68548h9986E6542J98104a19832B7440
11401C6324K53125B2614c7233N072l2819C5480a76576F8024j1565K11641L56274
11390F24374b89921H7488i1851a8234H4842N6015L2132e3589j12683J1435B53168
11378b28290O8024A48531o9235l0153d545k08853j26657A84288a39189A78874
11367a82326p6038h5722J9779j54356K3953B77963j19651b1656A2584b62986j34435
11356c97421r5c6390m09931a27800M0351G3727A9940c65800D552J19317j2467
$$ plain form
11434 102229 -137117 114588 146408 107659 -289455 9213 -159711 -288755 96146 -27221 372511
11422 -97498 148944 466689 -239627 228611 -107717 16291 165629 170816 59646 300073
11412 300073 142290 74833 -13024 -143642 168548 -89986 56542 254646 -119832 27440
11401 36324 289449 22614 -37233 -32161 -64980 35480 -176576 68024 56459 268100 624374
11390 624374 -289921 87488 -91851 -18234 84842 140857 172989 -53589 -166272 -154837 253168
11378 -228290 -160266 148531 79296 49143 -4545 -213398 -340055 184288 -139189 178874
11367 -182326 -258364 -85722 -65943 -220299 -196346 277963 158312 -21656 12584 -262986 -397421
11356 -397421 -397516 -36390 -446321 -127800 -87449 73727 19940 -365800 4552 123869 111402
11345A11402d4260E5619J07245j3106b27097a00648B39986C2870b30115a814D3050
11333A84274g0566l2005j78532A73128k6461N2244C7103c9823A2480b21205a06870
11321c4535A03071e682j93397A42334b14150E7958p600A1073J98993a72390N9563
11310a12827A00832O2297D6985b40086e3883E8510Q1371c8288l4998L2841j22411
11299a62856j6317c1816C4953b9571j10296a6730k33242d0027D8931d0819j37733
11288a78552e2261B0740d4644l6053A42990a80474A03351J67024c31453J0747
11278c20706A86675c36271g0243o2067C800L0811L25945c49780a19577L0413A52631
11266D6628J74443H8029C2090K4202k2406a12426l8460I2947L1141a30875k01148
$$ plain form
11345 111402 -44260 55619 162864 149758 -227097 -100648 239986 32870 -230115 -1814 43050
11333 184274 -70566 -102571 -281103 173128 146667 198911 37103 -39823 12480 -221205 -106870
11321 -34535 103071 -5682 -199079 142334 -214150 57958 50358 11073 210066 -172390 -112827
11310 -112827 100832 163129 46985 -240086 -53883 58510 139881 -38288 -73286 -40445 -162856
11299 -162856 -179173 -31816 34953 -29571 -139867 -16730 -249972 -40027 48931 -40819 -178552
11288 -178552 -52261 20740 -44644 -80697 142990 -180474 103351 270375 -331453 -320706
11278 -320706 186675 -336271 -70243 -132310 3800 34611 360556 -349780 -119577 -89164 152631
11266 46628 221071 88029 32090 56292 33886 -112426 -150886 92947 124088 -130875 -332023
11255c32023H5887R9862d22322b04817D9783R9007b36186F22J63279D1184b65364
11243A05339K67968d2346B49599H9536J392a12708j32202l4105a31462e4667A5633
11231A1326M126K05673I9203A1452b53848o5013A98890a26119F8952M4486J7427
11220A30865a41466M5138M5624C9791d91584a94201n9548B05095b9344j5397j48258
11209a92999c4702H2760J41137b58002E0551J0569A3349a48051j09270N0617A60715
11197g9858c5430k42707b56A85879b6270p7545A26885E1746b66357g2709o8600
11186a41309l602A7816g6526B14320g6972A08192A8587d7243I4500c7056j09812
11175a46868B68124B5984j0791R4699n272a90374G043c21656E9120i9760j99127
$$ plain form
11255 -332023 85887 185749 -422322 -204817 49783 148790 -236186 622 163901 41184 -265364
11243 105339 373307 -42346 249599 89536 90928 -112708 -244910 -279015 -131462 -54667 15633
11231 11326 15452 221125 99203 11452 -253848 -318861 198890 -126119 68952 113438 130865
11220 130865 -141466 -96328 -50704 39791 -491584 -194201 -253749 205095 -29344 -44741 -192999
11209 -192999 -34702 82760 223897 -258002 50551 61120 13349 -148051 -257321 -206704 160715
11197 -79858 -35430 -278137 -256 185879 -26270 -103815 126885 51746 -266357 -72709 -141309
11186 -141309 -144911 17816 -76526 214320 -76972 108192 18587 -47243 94500 -37056 -146868
11175 -146868 268124 25984 15193 109892 104620 -190374 7043 -321656 59120 -99760 -298887
11164b98887B7570I852R52b74910J37354H0201B7396R3307h1692B55341b31422
11152A93609h305A19515R9373a90359R2076A41814J89420c39728h7243G9297c4339
11140f6103j36114d6848k52368Q9185I2008J80735d1498A6429f2024j55715H5601
11128d8017K3444H9577d02463I4088a44283l1591n6936D8191c38476J49913E4176
11116a0572B9189P4437j5673b123A5599b79883i3723n7158c0141k09039B71353
11104a82141b7925j52124H3713E699f1713k17815C28050f3429B00623p8636N3777
11093A75764d3055j70586A39595a09440j6083j00571A86722c899p4554r5765F4906
11081C54822j55492b62409b9336j13856D03358j54929J40824A53063J57872p063
$$ plain form
11164 -298887 27570 9852 10804 -274910 -137556 80201 27396 120703 -81692 255341 -231422
11152 193609 -8305 119515 218888 -190359 -98283 141814 331234 -339728 -87243 79297 -34339
11140 -66103 -202217 -46848 -299216 -210031 92008 272743 -41498 16429 -62024 -217739 85601
11128 -48017 -24573 89577 -402463 94088 -144283 -175874 -232810 48191 -338476 -188563 54176
11116 -10572 29189 103626 87953 -2123 15599 -279883 -93723 -150881 -30141 -239180 271353
11104 -182141 -27925 -180049 83713 5699 -61713 -279528 328050 -63429 200623 121987 175764
11093 175764 -43055 -213641 139595 -109440 -125523 -226094 186722 -3899 -78453 -174218 64906
11081 354822 199330 -262409 -29336 -143192 403358 248429 389253 153063 310935 303872
11071C03872N4510j61719L63365A54270O9162J59490d8940D5754r471K83083r2666
11060B26700J28000p1374o4906C5523N37956a22550A97636l8750N4152J79287
11050C92325j60160J66752j57874J26453E2402L0849E807K60649J77307A91181
11039D56089k18449J98759e6065A33879M49014B44748K74590j90154J93838j83479
11029C39543q446K12125A34608J99903J06726M5923j08094K78903m479N9667j33232
11018E79925J54987k57150J379q111L50848k41666J37551j78028M14209j80155
11008G73789l11096K24479k156j22682L02637l51881l7073L79523j74204j05096
10998E76240k41179P1913j52652K97458m4778J19173J8823M44722D37989j0599
$$ plain form
11071 303872 358382 196663 560028 154270 223432 382922 -48940 45754 36283 319366 226700
11060 226700 354700 283326 218420 35523 573479 -122550 197636 158886 213038 392325
11050 392325 232165 398917 241043 367496 52402 83251 5807 266456 443763 191181
11039 456089 237640 436399 -56065 133879 582893 244748 519338 329184 523022 339543
11029 339543 331097 543222 134608 334511 441237 487160 379066 657969 653490 713157 579925
11018 579925 734912 477762 479141 471030 821878 580212 717763 539735 953944 773789
11008 773789 462693 687172 685016 562334 864971 513090 476017 855540 681336 576240
10998 576240 335061 406974 254322 551780 507002 626175 644998 1089720 437989 427390
10988D27390n6096J36607k17125K10041N6444q1073j35334J54291Q8348J48542
10978G32035r6303j41142B29433m7852K89061J60987n8071j59089P9694r2719
10968D01444K055J16933j31110L2712r9415K57450P4936j36356M32578k05971
10958G45256l5537j80525M0748N98864j31374k69341M56486K42810k60050J66180
10948A373517L21315P3112k79019L45260O63112n766p6465l69245M12437m55030
10938B003228j36729m04778k68421M07327n95883P51828k39613p9173j61398K11082
10928A487470m7095j41115q0952k80751J51192k30174k86767O0825B32792A07395
10917B35953J11484J66084l6057a92230B39982J07739J0941j12052J72878r6891
$$ plain form
10988 427390 371294 507901 290776 500817 557261 476188 340854 495145 583493 732035
10978 732035 635732 494590 229433 181581 470642 631629 573558 414469 494163 401444
10968 401444 403499 520432 389322 422034 322619 580069 655005 518649 951227 745256
10958 745256 709719 529194 569942 1168806 1037432 768091 1224577 1467387 1207337 1373517
10948 1373517 1694832 1767944 1488925 1834185 2497297 2491531 2415066 2045821 2458258 2003228
10938 2003228 1866499 1461721 1193300 1600627 1004744 1756572 1516959 1437786 1276388 1487470
10928 1487470 1440375 1299260 1218308 937557 1088749 858575 571808 632633 232792 107395
10917 235953 347437 513521 477464 -192230 239982 347721 358662 246610 419488 322597
10907C22597c3687E4600J21007L506d558G2703P2788o7030J40263D6167a38534
10895d69740K30065B04868F8003b87535M665G5370a59565B31039j11442D9931
10884f1821b9321A55569d4904p3318j28165a9598p3791A92582a7085q6922j95915
10873b99922B85347j1509d8146A86036a68729L2762e8204j4496a9238D6872b5036
10861A84500b21165L0487H8784a1789m06262J99368I9235a09125k88847c5343
10850I1193M002k8023a2556E7845B0093e7621j03236B3247c5471j24554B87452
10838A12868d3648B5790J0954N8958L6571P1284b3294l40189e6901k4364c9942
10826G1410c04189A84332b06098B1882a90066a3274r6985n7933f3516C80399b3319
$$ plain form
10907 322597 -33687 54600 175607 179113 -4558 72703 145491 78461 218724 46167 -138534
10895 -469740 -239675 204868 68003 -287535 -282870 75370 -159565 231039 119597 49931
10884 -61821 -29321 155569 -44904 -118222 -246387 -19598 -93389 192582 -17085 -104007 -299922
10873 -299922 285347 273838 -48146 186036 -168729 -135967 -58204 -72700 -19238 46872 -25036
10861 184500 -221165 -190678 88784 -11789 -418051 -218683 99235 -109125 -397972 -35343
10850 91193 95195 67172 -12556 57845 20093 -57621 -160857 23247 -35471 -160025 287452
10838 112868 -43648 25790 36744 95702 132273 203557 -23294 -363483 -56901 -81265 -39942
10826 71410 -304189 184332 -206098 21882 -190066 -13274 -110259 -168192 -63516 380399 -23319
10814a01925K7871C65704a92514E47b0426p0257A52197Q3480E1389a26520A30969
10802A36422o1861b23151A53961c79231a20731p1545n7561Q7801k31424c0375
10791D9024R0892c07070A39377b959l16157A20499b54821j39997A2900d508A13967
10779A33468a70773G0660a83131B4405J27997B6486a39214I464P9041e1927j55624
10768b07551C4800c9616A46178G650b97669K3967a2080E803J8271d2988k89168
10757c32156a33354C37159I6626d33714a46266J0031a9820k9662A0028N8675N4455
10746A23158M0520F8546R9707J10565f720k09596B43195b47321I5468a8558j60373
10735a78931P3582E4984d00980i4788L3962o5186j90843I6440m1371L04508h6763
$$ plain form
10814 -101925 -74054 365704 -192514 547 -20426 -90683 152197 235677 51389 -126520 130969
10802 136422 74561 -223151 153961 -379231 -120731 -192276 -249837 -162036 -393460 -30375
10791 49024 139916 -307070 139377 -2959 -319116 120499 -254821 -394818 12900 -4508 113967
10779 133468 -170773 70660 -183131 24405 152402 26486 -139214 9464 88505 -51927 -207551
10768 -207551 34800 -39616 146178 7650 -297669 -273702 -12080 5803 24074 -42988 -332156
10757 -332156 -133354 337159 96626 -433714 -146266 -136235 -19820 -49482 10028 68703 123158
10746 123158 163678 68546 168253 278818 -6720 -216316 243195 -247321 95468 -18558 -178931
10735 -178931 -105349 54984 -400980 -94788 -60826 -126012 -316855 96440 55069 359577 -86763
10723b16286C30854c62355J7717B15634a83825C60678E8884k6768J13599E7340
10712g1071j98823C1046K03649h0502k8080C29569a61376k56899J62245D4775
10701E2074i2871n1685j07883G0409i9855J1024E1270J80426a07324A08447a18649
10689A73786a06302j474r7780h4553j16603P3394k94052b00125A44240b10074
10678a67664p6556f5110r7198A80489p6112A0794L07531i9025q0212j05809h6401
10666c56037e241A03759d01696J29112M9345A24883a09717A68894k5135h3409
10655A22983c38643A12938b01107h2998j06859g6743J8947E2516d5831r4959b9877
10643h8228L977j60701a04631A06189m4229c0043A00858f5804k75313d7900q5546
$$ plain form
10723 -216286 330854 -362355 -344638 215634 -183825 360678 58884 32116 145715 57340
10712 -71071 -269894 31046 234695 -80502 -108582 329569 -161376 -418275 -256030 44775
10701 52074 -92871 -144556 -252439 70409 -99855 -88831 51270 231696 -107324 108447 -118649
10689 173786 -106302 -107776 -205556 -84553 -201156 -127762 -421814 -200125 144240 -210074
10678 -167664 -244220 -65110 -162308 180489 104377 10794 318325 -99025 -179237 -285046 -86401
10666 -356037 -5241 103759 -401696 -272584 -223239 124883 -109717 168894 143759 -83409
10655 122983 -338643 112938 -201107 -82998 -189857 -76743 -57796 52516 -45831 -140790 -29877
10643 -88228 -84251 -244952 -104631 106189 61960 -30043 100858 -65804 -341117 -47900 -133446
10632a33446j5208H7686a3892j56635p0872A20422m1038m434a34691k28519f7733
10620a31702k5323O2240A15827d0798k90843g9847G1206A1889J21196d21467c9734
10608A18289a84852M4692e9515R91p6085k2570c3985C1554a56649D8622a2573
10596g6841j19404l7278k60923a49888j78946G7405b33036J01984B39001o1551
10586A77450f72370h2892D7271r658J16854M8043D1271c08629J30179Q6090A17856
10574A93729b9370n5865I620J55157D2916k0724c1364A51262i1069C32791a5393
10562I5665a06266H3110GJ3321d4116j49218A39716b121l78804L0961J35320B50426
10549b0592B70517A07992p246k6407b98000A73330a16211o6691j5870K3839C3939
$$ plain form
10632 -133446 -148654 87686 -13892 -170527 -241399 120422 79384 74950 -134691 -363210 -67733
10620 -131702 -157025 -94785 115827 -40798 -331641 -79847 71206 11889 133085 -421467 -39734
10608 118289 -184852 -140160 -59515 -58524 -134609 -157179 -33985 31554 -156649 48622 -12573
10596 -76841 -196245 -233523 -494446 -149888 -328834 77405 -233036 -131052 239001 177450
10586 177450 -672370 -82892 47271 37613 154467 202510 41271 -308629 -178450 -92360 117856
10574 193729 -29370 -85235 9620 164777 42916 22192 -31364 151262 -91069 332791 -15393
10562 95665 -106266 83110 7 13328 -44116 -193334 139716 -2121 -380925 -349964 -214644 250426
10549 -20592 270517 107992 100746 74339 -298000 173330 -116211 -182902 -198772 -174933 33939
10537B33957H5870K21267i126p2707c1127j3391j01081l29322A61313b77598h1844
10525B3964r195c4757B75725j13290a23322O0245B52194A05403Q1765b86873A05265
10513A88047C7669a01874d1536j86587A08901J0570a27232k1155k52994g4729
10502a4356F7774a08514A42591a11145j16007q2158E535Q2375P4506E9946C662
10490c730G0498g6045F2965g3673j48054E1540c14754B957a84873g4805B7070
10478a40533l07621B40575d10178B80078g3598A08765b61528B2912J38586c26752
10467A02041B5599h777l3032C01145j17814N2082m5540f5650g018A71968l7655
10456A34313P5752K19868L4939A88806K99273O2177o2453H4003B5106K02268c45176
$$ plain form
10537 233957 85870 307137 -9126 -81833 -31127 -44518 -145599 -474921 161313 -277598 -81844
10525 23964 14769 -34757 275725 162435 -123322 -63077 252194 105403 187168 -286873 105265
10513 188047 37669 -101874 -41536 -228123 108901 119471 -127232 -148387 -401381 -74729
10502 -14356 67774 -108514 142591 -111145 -227152 -309310 5535 87910 162416 59946 3662
10490 -3730 70498 -76045 62965 -73673 -221727 51540 -314754 2957 -184873 -74805 27070
10478 -140533 -448154 240575 -410178 280078 -73598 108765 -261528 22912 161498 -326752
10467 102041 25599 -8777 -41809 301145 183331 235413 189873 -65650 -7018 171968 134313
10456 134313 210065 429933 464872 188806 488079 550256 487803 84003 25106 227374 -345176
10444c7039A79399K6205a50447D8246a01457B04839a28426Q769A44344O5871c04208
10432a72263L5032B93475b45810A00003k4543L2919a62130L6533N9061j88309
10422b54845j66906a3498n9070F0993a07980A91526j2961a18753D15e0349g057
10410B91349a55052e8270D1332h2707B3923a1659o4024j89534B07980P7756B6965
10398a21338N5757gI0347a96707A42737a98911A10167a03552I9554a4915E437
10386a37112E7460p904P4596c7723m32697a3069H7205K11005b1139j3327A28476
10374b09757j67346G065i2055C7238g3106a029k27404F0158a85840C88444G6883
10362H3416J74592A00227D5037K22254b94315a3618l255A2213b35104B08968a4736
$$ plain form
10444 -37039 179399 205604 -150447 48246 -101457 204839 -128426 -119657 144344 210215 -304208
10432 -172263 -137231 293475 -245810 100003 75460 108379 -162130 -125597 -66536 -254845
10422 -254845 -421751 -13498 -72568 60993 -107980 191526 178565 -118753 415 -50349 -7057
10410 291349 -155052 -58270 41332 -82707 23923 -11659 -75683 -265217 207980 285736 26965
10398 -121338 -65581 -7 90347 -196707 142737 -198911 110167 -103552 99554 -14915 5437
10386 -137112 57460 49556 124152 -37723 -470420 -13069 87205 298210 -21139 -34466 128476
10374 -209757 -377103 7065 -92055 37238 -73106 -1029 -228433 60158 -185840 388444 76883
10362 83416 258008 100227 45037 267291 -294315 -13618 -16873 12213 -235104 208968 -14736
10350B82952l7116b58848C50541o2896J782j7702A31325K1599M6148K60552k02517
10339B57107a4985L037B85864M8391R8919j56208P6232K7930H8531b08729H5031
10327C73534h3152C26252p8398J48717O7268r8488J9005M5343q2253j35809k7959
10316A83678K98696A17206Q8609H8318K61154a52189C2213L9009L2053i1506L9270
10305e2236A03680J37301K0014J895l4192m2620i1631A52658e4558q2638A59467
10293H7953i3325A14543N5470K2304a10759I4008K33247A20464l3740J78701a06018
10281e5730a1198n1725Q828m9270l0248A2436a33620K3851G727i0501A59755m7712
10269A12043a18179B45682j12597J6165D4554J07031a11791E5666Q4575j656E1641
$$ plain form
10350 282952 245836 -258848 350541 287645 289427 271725 131325 152924 199072 459624 257107
10339 257107 -14985 -11948 285864 334255 433174 276966 353198 381128 88531 -208729 85031
10327 373534 -83152 326252 247854 396571 463839 365351 384356 429699 347446 211637 183678
10316 183678 482374 117206 205815 88318 349472 -152189 32213 71222 103275 -91506 -52236
10305 -52236 103680 240981 260995 262890 228698 186078 -91631 152658 -54558 -137196 159467
10293 87953 -93325 114543 170013 192317 -110759 94008 327255 120464 86724 265425 -106018
10281 -55730 -11198 -62923 -54095 -103365 -133613 12436 -133620 -109769 7727 -90501 159755 112043
10269 112043 -118179 245682 133085 149250 44554 151585 -111791 55666 140241 138585 51641
10257B28407a09602m6866k46581a26511H6066g1986a7124B97418C8715a73114
10246H6545l0670i4359m9124L1883D40149g0513B47672m2381a53145A06788a49979
10234A03042a44571A65357a72167E62147B78393f0361a7846C41916A36057J11688
10224B47745b02413A27507b03646r04Q4809A01426b59108B1183I395a21905r6770
10213b18675H0561i8961K0202C56997b31827P1364j70957c3735n1805o0027d552
10201a99920A734N9937c57733a29104I9600h5112p3647F0590a19418E1394j9238
10190C2156L34107e1140F4990a39571O1704j0392j02777B2284c24517F9638f1374
10178a17716M6154j340E9088R1489d12107a65538f3917B93164H8969A443a52877
$$ plain form
10257 228407 -109602 -156468 -403049 -126511 86066 -71986 -17124 297418 38715 -173114
10246 86545 55875 -94359 -143483 -111600 440149 -70513 247672 205291 -153145 106788 -149979
10234 103042 -144571 165357 -172167 562147 278393 -60361 -17846 341916 136057 247745
10224 247745 -202413 127507 -203646 -204550 -119741 101426 -259108 21183 9395 -121905 -218675
10213 -218675 80561 -98961 -78759 356997 -231827 -160463 -331420 -33735 -85540 -145567 -4552
10201 -199920 1734 61671 -357733 -129104 99600 -85112 -158759 60590 -119418 51394 32156
10190 32156 366263 -51140 64990 -139571 -77867 -88259 -191036 22284 -324517 69638 -61374
10178 -117716 -71562 -72902 59088 150577 -412107 -165538 -63917 293164 88969 1443 -152877
10166C9974b10303a03177j38426J03027j725B23608f3814A21090a46535j54842
10156c01377f4670a5868m2694q8876j12734N1355J6180Q9952M6478j56392e7580
10144a05262A792K90532f0993B617g0871m9983j87866a5606B58174D181J3345
10133A7526a99550c5276Q33B68449g1961I251i4781J7573a2612j08096A34107
10121B45429i7984H2665b48209D6054K3694K3315a26131D7047i9285C3473J7543
10110E1016c23562Q1318A93758A9795i2140j11086F9235b95275Q6596j19046J28921
10099a98804g4430j84393J01996I8981d1934r056B68540d0124G7619b53041o8896
10088c21937I4150g1324j38307d3053Q24C7650a44750g1862l2781C6506h2028
$$ plain form
10166 39974 -210303 -103177 -241603 -138576 -140301 223608 -63814 121090 -146535 -301377
10156 -301377 -64670 -15868 -58562 -147438 -260172 -208817 -192637 -102685 -56207 -212599 -57580
10144 -105262 1792 292324 -60993 2617 -70871 -120854 -308720 -15606 258174 4181 17526
10133 17526 -199550 -35276 -34443 268449 -71961 9251 -94781 -77208 -12612 -120708 134107
10121 245429 -97984 82665 -248209 46054 69748 93063 -126131 47047 -99285 33473 51016
10110 51016 -323562 -242244 193758 19795 -92140 -203226 69235 -295275 -208679 -327725 -198804
10099 -198804 -74430 -258823 -156827 98981 -41934 -50990 268540 -40124 77619 -253041 -321937
10088 -321937 94150 -71324 -209631 -43053 -42229 37650 -144750 -71862 -104643 36506 -82028
10076a83250B25956H0994a47437O4812j30284e310A18321a62976B00861a29030
10065B4162j1216b19648B76028b63427G5564b19255b6211E3589a51192k9506H3952
10053g8364j78200C00245b97343E6625a86302j18986h4937I6974b12318M0348
10043a71970e8193G0329b53921A56697d0983l45993g8068D7293b05850k5880A76339
10031a56806N3591B94145b74655R1199A33460a84654L6650j04814m2452D0750
10020B46730B1535L2501A9208a85596O0581M0168j0268Q93k06845a8891j946G2772
10007F7773a9821j03559j82440A29997g7488p3542G2304b35357c0834j99139N1786
9996a78187g501G0489Q4042D9308J34928c6883B8169a1264o2902G4153R2512f7545
$$ plain form
10076 -183250 225956 80994 -147437 -82625 -212909 -5310 118321 -162976 200861 -129030
10065 24162 12946 -219648 276028 -263427 75564 -219255 -26211 53589 -151192 -180698 83952
10053 -78364 -256564 300245 -297343 56625 -186302 -305288 -84937 96974 -212318 -171970
10043 -171970 -58193 70329 -253921 156697 -40983 -386976 -78068 47293 -205850 -231730 176339
10031 -156806 -103215 294145 -274655 -183456 133460 -184654 -148004 -252818 -295270 40750
10020 246730 21535 54036 19208 -185596 -125015 -84847 -95115 -94222 -301067 -18891 -20837 72772
10007 67773 -19821 -123380 -305820 129997 -77488 -151030 72304 -235357 -30834 -229973 -178187
9996 -178187 -7501 70489 154531 49308 184236 -36883 28169 -11264 -74166 74153 166665 -67545
9983f1001j33711F6884a05659k33949F4219m285b23926h0508j40616A40647B0119
9971b18563B4371b37671i9257o0239P6851G1337K8978m8879J55709a49194M708
9960a44486h256A3795d182j51459j41057j51180a81613b1741H294a3478j00694
9949a14172a9216k20838c4376j34919C5551d10721J22546C5822a10805A52426
9938b98925J00727I5777C6281c30548A9139p307M9268J28886E5275b20458e5556
9926c38121i2729j88459A36353c8961D5070K7268M0907f1708C9986K08929e9997
9914a9180A04266M276d22256K01567e3244n3081k70093J08282j7279A4411J48151
9903A62562a31677r1528R9247G6496a20065A6261h796k65966D8889a7339n928
$$ plain form
9983 -61001 -194712 66884 -105659 -339608 64219 59934 -223926 -80508 -221124 140647 20119
9971 -218563 24371 -237671 -99257 -159496 -82645 71337 100315 51436 207145 -149194 -144486
9960 -144486 -8256 13795 -4182 -155641 -296698 -447878 -181613 -21741 8294 -13478 -114172
9949 -114172 -19216 -240054 -34376 -169295 35551 -410721 -288175 35822 -110805 152426
9938 -298925 -198198 95777 36281 -330548 19139 11832 61100 189986 55275 -220458 -55556
9926 -338121 -92729 -281188 136353 -38961 45070 72338 113245 -61708 39986 248915 -59997
9914 -19180 104266 108542 -422256 -220689 -53244 -106325 -376418 -268136 -285415 14411 162562
9903 162562 -131677 -223205 -123958 76496 -120065 16261 -8796 -274762 48889 -17339 -23267
9892b3267I4209e4095k9738j62540C68681G8311a47494n1241k15806A07308L9807
9881A47115k9125g0993A67302c67699G629i7246E2813L1814b63328Q2462l2566
9870b13432N2801d213j3170A77641i3242B00981p8859d07288a28778B08310a65862
9858b46696A76422B59b06256B75097c6508n9227l40080a06562c7635C0115b9119
9846a48060b0045p8676M8846j51321M4561j79953J31718r992o6238R2934C4374
9834F0908i2402k86430J60587j15213a19828B582N890i1399D88065b03246I6929
9822a37810l32618i5627j1724E4097q052d5836K1733q835l01148g7842n18308
9811e96150b51987F1549a39424r0377k98975F2241J5092a780q4657l6704C6001
$$ plain form
9892 -23267 94209 -54095 -83833 -246373 368681 78311 -147494 -198735 -414541 107308 147115
9881 147115 117990 -70993 167302 -367699 7629 -97246 52813 84627 -263328 -180866 -213432
9870 -213432 -160631 -4213 -17383 177641 -93242 200981 122122 -407288 -128778 208310 -165862
9858 -246696 176422 259 -206256 275097 -36508 -95735 -435815 -106562 -37635 30115 -29119
9846 -148060 -20045 -98721 -49875 -201196 -156635 -336588 -204870 -214862 -281100 -188166 34374
9834 60908 -92402 -378832 -218245 -333458 -119828 2582 8472 -91399 488065 -203246 96929
9822 -137810 -470428 -95627 -107351 54097 46045 -45836 -24103 -32938 -334086 -77842 -596150
9811 -596150 -251987 61549 -139424 -229801 -528776 62241 77333 -1780 -86437 -123141 36001
9799G6828b46869r4799J06482D0244a90656B0171d6341A24855c7298o5935k8979
9788a32212p4127c8297j29341E0384d2158m8166D627L7451e70974a4399B92919
9776c9247j35683H3044b78031D1783d33920E0926b32177R218A6474a93521I6978
9764A64311B6433M283b28745K8266A18510a12672a5772p3742k6143A56917b02477
9752d4760I2575a52522j48248P7470C9490f8784K0910H66a58456A79863a66462
9740a47764k69161d322j74540j84967J43457A38018J4508c9238k63395C10771
9729A85900b01589A3914a05782A18272b4459B39701G4549c62601g0799A0500c59014
9717B71586h5040A82226a19049A03567a57039D6536a4549o8040p3760c9150n4646
$$ plain form
9799 76828 -246869 -341668 -235186 40244 -190656 20171 -46341 124855 -37298 -103233 -132212
9788 -132212 -206339 -38297 -167638 50384 -42158 -90324 4627 42078 -570974 -14399 292919
9776 -39247 -174930 83044 -278031 41783 -433920 50926 -232177 -222959 16474 -193521 96978
9764 164311 26433 30716 -228745 -200479 118510 -112672 -15772 -89514 -115657 156917 -202477
9752 -44760 92575 -152522 -300770 -223300 39490 -68784 -47874 866 -158456 179863 -166462
9740 -147764 -416925 -4322 -178862 -363829 -220372 138018 152526 -39238 -302633 310771
9729 185900 -201589 13914 -105782 118272 -24459 239701 74549 -362601 -70799 10500 -359014
9717 271586 -85040 182226 -119049 103567 -157039 46536 -14549 -82589 -156349 -39150 -93796
9706i3796H5328d4555A6971J42108b14966O287a0870B26742b33572a14809L9122
9695g5687j06870O12D8126a52708d1694A7806K57057e6088j28685M1356m7386
9684a90803D7207L0555M4282E7685J65373d3132f505k06006B0215a79733K3735
9673a55998h281B3569c1605D48a5040H0622c00833c8722j14737A43085c36309
9661c32198b7128k5503A85143a9563r3052d0298j31498G6619b17693h9678j70572
9650b60250q4805a18341o406A95067a58270k4744b1808A59092d35328e313k53923
9639b59236B41736F5050h9282O874j20190b5370j49795I5207a34232k74838a86795
9627d39110A11266m1860a88453q9054A10894k7593K5618g5360I5380J38516a30513
$$ plain form
9706 -93796 85328 -44555 16971 159079 -214966 -208679 -10870 226742 -233572 -114809 -75687
9695 -75687 -182557 -181945 48126 -152708 -41694 17806 274863 -56088 -184773 -143417 -190803
9684 -190803 47207 77762 122044 57685 223058 -43132 -6505 -212511 20215 -179733 -155998
9673 -155998 -8281 23569 -31605 448 -15040 80622 -300833 -38722 -153459 143085 -336309
9661 -332198 -27128 -52631 185143 -19563 -112615 -40298 -171796 76619 -217693 -89678 -260250
9650 -260250 -345055 -118341 -124747 195067 -158270 -183014 -21808 159092 -435328 -5313 -259236
9639 -259236 241736 65050 -89282 -82408 -202598 -25370 -175165 95207 -134232 -409070 -186795
9627 -439110 111266 69406 -188453 -277507 110894 83301 108919 -75360 95380 233896 -130513
9615d18132a81017D6076g3894j37800j68899A40439C1485a22523m8042d6195q3683
9604a29878d1559j35921B5508N1352C2951K9980c8196E3101a18450d7256A74234
9592B9116G57e5000l05622a27129k22911k4787a2409o8705C6283b5390J0031j23193
9580a38552A02667K5252m8085b39894L2220C70448b66384l7461f7694B4032a84648
9568a49102e9978m5473D4782a09007n0518e7338l25243B8356b64420b5290n20800
9557e46090E2011a37568b9018r1677a8792j92107D8035d20989A91056B5787Q7482
9546A13269a82502r6021H4267F488b27672n2534a11676j38125i7176l9303j75700
9535c12179B41910a75214E8467K85700A71889a52549c0166G0838R0720L8579a18270
$$ plain form
9615 -418132 -181017 46076 -73894 -211694 -380593 140439 31485 -122523 -170565 -46195 -129878
9604 -129878 -41559 -177480 25508 76860 32951 62931 -38196 53101 -118450 -47256 174234
9592 29116 757 -55000 -360622 -127129 -350040 -374827 -12409 -81114 36283 -25390 -15359 -138552
9580 -138552 102667 127919 79834 -239894 -207674 370448 -266384 -303845 -67694 24032 -184648
9568 -149102 -59978 -105451 44782 -109007 -159525 -57338 -382581 28356 -264420 -25290 -546090
9557 -546090 52011 -137568 -29018 -120695 -18792 -210899 48035 -420989 191056 25787 113269
9546 113269 -182502 -278523 84267 6488 -227672 -280206 -111676 -249801 -97176 -136479 -312179
9535 -312179 241910 -175214 58467 344167 171889 -152549 -30166 70838 161558 200137 -118270
9523C4941a85396r8883B18229o3486G0529k7141e65I7408b77842h9965j81233
9512b71198A99142a8667I4965a99117A04382a79933A27560c17049Q9963k6840
9502b53926A28364a86053j75834F1355a53278k58843R5990f6924K8158j31463
9492a70229I8301d00935C77143e603j91620A91677a99174A13946b81126O9473
9482b11653N7214D66097e7003B51487A17156a13737j98272L5188c3571a5195B75903
9470a16569j53259F7106B0026O8817a88078B29351j02693a0674k11495A08422
9459a09444b3363k6536F4725K1545b63898F3902a79405B63145E2016h3259q8203
9448a71462r2728a17326L6282A32502J3732b32917A30600b86643C6581L2923a55326
$$ plain form
9523 34941 -185396 -284279 218229 154743 70529 43388 -565 97408 -277842 -89965 -271198
9512 -271198 199142 -18667 94965 -199117 104382 -179933 127560 -317049 -227086 -253926
9502 -253926 128364 -186053 -361887 61355 -153278 -412121 -316131 -66924 -38766 -170229
9492 -170229 98301 -400935 377143 -5603 -197223 191677 -199174 113946 -281126 -211653
9482 -211653 -154439 466097 -57003 251487 117156 -113737 -312009 -276821 -33571 -15195 275903
9470 -116569 -269828 67106 20026 88843 -188078 229351 126658 -10674 -222169 108422
9459 -109444 -23363 -49899 64725 86270 -263898 63902 -179405 263145 52016 -83259 -171462
9448 -171462 -264190 -117326 -81044 132502 146234 -232917 130600 -286643 36581 69504 -155326
9436a13416j99102P6220h4792n6098d8974j06254j54356h2789A7499p307a20474
9424d13510A4859K5495L3850b25046m7850E8925J73203g5070F0431a20471J6145
9413a04326a1345k5152n5695R079j22316J4046B5858J35064d48763a81459I017
9401D3763a78505A27239g3650C2905g113E0147M9530a62403c8806k50832K1969
9390b67669D0795a51737O8802j46338c5078j71569L9200g9714a5198k8542E4277
9378b39617c9965A89210a53004A25589K4281c38660a04892A35650g9111l24730
9368d03841L598F5082J77072E8385c29260C7593M8589J11350G1422B1115C354
9356f9158l2617F9945c7037j82827B49461b26110C49393e0152E5756a49436e2162
$$ plain form
9436 -113416 -312518 -236298 -84792 -140890 -48974 -155228 -309584 -82789 17499 10192 -120474
9424 -413510 14859 40354 74204 -225046 -272896 58925 232128 -75070 60431 -120471 -104326
9413 -104326 -11345 -36497 -92192 -83113 -205429 -191383 25858 160922 -448763 -181459 9017
9401 43763 -178505 127239 -73650 32905 -7113 50147 99677 -162403 -38806 -289638 -267669
9390 -267669 40795 -151737 -82935 -229273 -35078 -206647 -167447 -79714 -15198 -43740 54277
9378 -239617 -39965 189210 -153004 125589 149870 -338660 -104892 135650 -79111 -403841
9368 -403841 -400243 65082 242154 58385 -329260 37593 86182 197532 71422 21115 3354
9356 -69158 -101775 69945 -37037 -219864 249461 -226110 349393 -50152 55756 -149436 -52162
9344D9425b45508A43760g8586E1297f1843k2967j18304g0552o013j57837E7818
9332E1657K683a61506C9236b537j84064B13728a78621J4651J5138E1365N1922
9321A03287C9097b65493L0412J1271g4503m3153j19870A9049J49823aB19197a23735
9308A43214a42367r940I3295k4244N6053b43238C4990b3612O536l01099P9111
9297b39064J00635L2674C1976a63243P8051j40887I0657a81792A59845D8981i4057
9285b71132D1671A7401a04923k6754a5405j15855l2660H504Q7823d02115J20581
9274b81534Q8906e0317j79305E2360J99524f8315k4763I5171r111a46844k1272
9263a68116N4292j4195A06433b54976k4003B34637A15739E1665c6986J0858j15737
$$ plain form
9344 49425 -245508 143760 -78586 51297 -61843 -84810 -203114 -70552 -76565 -234402 57818
9332 51657 54340 -161506 39236 -2537 -186601 213728 -178621 -163970 -148832 51365 103287
9321 103287 39097 -265493 -235081 -223810 -74503 -117656 -237526 19049 168872 -1 219197 -123735
9308 143214 -142367 -152307 93295 69051 125104 -243238 34990 -23612 -17076 -318175 -239064
9297 -239064 -138429 -105755 31976 -163243 -85192 -226079 90657 -181792 159845 48981 -94057
9285 -271132 41671 17401 -104923 -131677 -15405 -131260 -163920 8504 96327 -402115 -281534
9274 -281534 -192628 -50317 -229622 52360 251884 -68315 -93078 95171 86060 -146844 -168116
9263 -168116 -113824 -128019 106433 -254976 -278979 234637 115739 51665 -36986 -26128 -141865
9252a41865j4959m9262A0883K2408j2679L5932b5440A03852a1541j85248j54425
9241c51214A88327e5884n90820g8010k2395p2750g9930a0245p1273b8138A08234
9229C3837J01797m2635b9463k34370b5088A72044b9662o0753A17529a97777B40164
9217a73443Q3582j03819a1927j32307F042c27218J37671j08704d1023n6507a9962
9205b61383O2495I684a06583j26488L8426N5255O5084j35588h3278A20837d80896
9193f3819j36104g8924r8221B41559b77018A36399g7285j15631a5297k15211A03938
9181b92384J10646j03389A05985b9304C41447j24771a48472I2365R8680a89099
9170b33206H7267i0300I7975j0503b69705E8582J39634a02568b0178r0969c9308
$$ plain form
9252 -141865 -156824 -206086 10883 33291 20612 56544 -25440 103852 -11541 -196789 -351214
9241 -351214 188327 -55884 -646704 -78010 -100405 -173155 -79930 -10245 -81518 -28138 108234
9229 33837 135634 92999 -29463 -263833 -25088 172044 -29662 -90415 117529 -197777 240164
9217 -173443 -89861 -193680 -11927 -144234 6042 -327218 -189547 -298251 -41023 -97530 -19962
9205 -261383 -198888 9684 -106583 -233071 -194645 -139390 -74306 -209894 -83278 120837 -480896
9193 -63819 -199923 -78924 -177145 241559 -277018 136399 -77285 -192916 -15297 -230508 103938
9181 -292384 -181738 -285127 105985 -29304 341447 216676 -148472 92365 191045 -189099
9170 -233206 87267 -90300 97975 87472 -269705 58582 198216 -102568 -20178 -111147 -39308
9158A73427a76045K4717q8648a12592C3113b47665A08357J56874j13666b25365
9147d959B04869a39201f5280B73670I1007h585A3b4986k654j05145A37706b06423
9134A99696b07949l093B07476A00602a26242j3746d3715C1599g3066j19213J1712
9123a80567k1517L6082b2102j33809K6202l6067B85375b00522M5724F6840B1776
9111c65573A12663O4487A788b37813A92520F8627i6362l77671B06512b44717R3135
9100a51582j08048A32074a09852B0653a81062G4593R7694b5709j02877I0745a57868
9088A35788n8620E769a0644l93262J82537B26538a91529f3318A91412b32302d6633
9076F4400a00810m67877i463A41489c88246A1723Q1545d01882e152k61048n8311
$$ plain form
9158 173427 -176045 -151328 -239976 -112592 33113 -247665 108357 265231 151565 -225365
9147 -4959 204869 -139201 -65280 273670 91007 -8585 13 -24986 -27640 -132785 137706 -206423
9134 199696 -207949 -211042 207476 100602 -126242 -139988 -43715 31599 -73066 -192279 -180567
9123 -180567 -202084 -166002 -22102 -155911 -129709 -165776 285375 -200522 -154798 66840 21776
9111 -365573 112663 177150 1788 -237813 192520 68627 -96362 -474033 206512 -244717 -151582
9100 -151582 -259630 132074 -109852 20653 -181062 74593 172287 -25709 -128586 90745 -157868
9088 135788 77168 5769 -10644 -403906 -221369 226538 -191529 -63318 191412 -232302 -46633
9076 64400 -100810 -568687 -9463 141489 -388246 11723 93268 -401882 -5152 -266200 -324511
9065c24511J60515r9384g4439m736H4764A8503b40905l4270h5876p7929L0365
9054a33440A31150b14307l683D34501E6503a85105j93531a63072C28720i6246
9043B2559a6318A06168a35769D4969i922B14125b31380A67955d45941b7020A4251
9031B80492b07180n5685J16652a1488j43658B86893A22374j1612c4689D1564a35185
9019b3660C604c81471A18005e5929A35110d6652j09866q6638a17320J8372q4065
9008a83013c9469k03111A56251m0301a28748B7767O3506c81802A41524b01113
8997a25192B42331a2916p8184C53097r1586a20500B22861a67216i705p2250G9344
8985C8762a92195D348a70816G2455d05118D9804b32054k04152i7695f859j52311
$$ plain form
9065 -324511 -163996 -263380 -74439 -79175 84764 18503 -240905 -275175 -85876 -163805 -133440
9054 -133440 131150 -214307 -217990 434501 56503 -185105 -378636 -163072 328720 -96246
9043 22559 -16318 106168 -135769 44969 -9922 214125 -231380 167955 -445941 -27020 14251
9031 280492 -207180 -262865 -146213 -11488 -155146 286893 122374 110762 -34689 41564 -135185
9019 -23660 3604 -381471 118005 -55929 135110 -46652 -156518 -243156 -117320 -98948 -183013
9008 -183013 -39469 -242580 156251 115950 -128748 27767 91273 -381802 141524 -201113
8997 -125192 242331 -12916 -91100 353097 261511 -120500 222861 -167216 -9705 -81955 79344
8985 38762 -192195 4348 -170816 72455 -405118 49804 -232054 -436206 -97695 -6859 -159170
8974a59170B60326E9711f9325k55322b977I5560D2362Q8734b83422B49087C3315
8962b59371a14215G1315c40560J32828B673a74019A33378d9701j45591g4168C5619
8950I4622c8915j96655l6518J10900n6080A24997M0228C4643b15818j98275b05566
8938f9545a4675j98079A83899d0383k95638a31341K7732A0254a74748B10973e3598
8926c4338B7058h9719A88402a05223a7937E3586h9108F8872K98676a46039G8842
8914a73686f7491m8102B19200c9246J6355A28130a32579l6397l208q9916h4376
8902g2856I6325i9387A66499E9102d29341A56016A2597K38021J66143C3860d22827
8890B41654A19715a61666B88507a04573A3832J32803b5701I637a81915B02508
$$ plain form
8974 -159170 260326 59711 -69325 -324647 -2977 95560 42362 131096 -283422 249087 33315
8962 -259371 -114215 71315 -340560 -207732 2673 -174019 133378 -49701 -195292 -74168 35619
8950 94622 -38915 -235570 -272088 -161188 -217268 124997 165225 34643 -215818 -414093 -205566
8938 -69545 -14675 -212754 183899 -40383 -336021 -131341 -103609 10254 -174748 210973 -53598
8926 -34338 27058 -89719 188402 -105223 -17937 53586 -89108 68872 367548 -146039 78842
8914 -173686 -67491 -115593 219200 -39246 -22891 128130 -132579 -168976 -172184 -262100 -84376
8902 -72856 96325 -99387 166499 59102 -429341 156016 12597 250618 416761 33860 -422827
8890 241654 119715 -161666 288507 -104573 13832 146635 -25701 9637 -181915 202508
8879F8291a24438E3339E971M8868i3719d0453q7726j23401i6648C094N2726d28166
8866h0717l7927j51662A70954q4149a64885B10010g0933l8039k73014a34554E5319
8854e5700A21767a58141j411K5605j47450d4683j26508H8769J65450H2344d1321
8842c16982a9017m27515R3266J7851A00798F293R696J15170b24954P8110B5491
8830H0710b93171A16111J09658b53187A69790k8763F2922c60474a71395k53611
$$ plain form
8879 68291 -124438 53339 5971 54839 -93719 -40453 -128179 -251580 -96648 3094 55820 -428166
8866 -80717 -118644 -270306 170954 86805 -164885 210010 -70933 -108972 -381986 -134554 55319
8854 -55700 121767 -158141 -159552 -133947 -281397 -44683 -171191 88769 254219 82344 -41321
8842 -316982 -19017 -446532 -353266 -335415 100798 6293 15989 131159 -224954 -146844 25491
8830 80710 -293171 116111 225769 -253187 169790 141027 62922 -360474 -171395 -425006
$$ [...]
##END NTUPLES=NMR SPECTRUM
##END=
