##TITLE=AC1524_ROEFFECT0006_8202296_HPoOqEx9dn
##JCAMPDX= 6.0         $$ Bruker NMR JCAMP-DX V2.0
##DATA TYPE= NMR SPECTRUM
##DATA CLASS= NTUPLES
##ORIGIN= BRUKER
##OWNER= Administrator
$$ 1.72 TOPSPIN		Version 2.1
$$ 2014-07-31 17:59:35.524 -0700  Administrator@X
$$ Compression mode = diff/dup
##.OBSERVE FREQUENCY= 400.02188249412
##.OBSERVE NUCLEUS= ^1H
##.ACQUISITION MODE= SIMULTANEOUS (DQD)
##.ACQUISITION SCHEME= undefined
##.AVERAGES= 64
##.DIGITISER RES= 22
##SPECTROMETER/DATA SYSTEM= spect
##.PULSE SEQUENCE= noesygpps1d.comp
##.SOLVENT NAME= COFFEE_meoh
##.SHIFT REFERENCE= INTERNAL, COFFEE_meoh, 1, 14.97786
##AUDIT TRAIL= $$ (NUMBER, WHEN, WHO, WHERE, PROCESS, VERSION, WHAT)
$$ ##TITLE= Audit trail, TOPSPIN		Version 2.1
$$ ##JCAMPDX= 5.01
$$ ##ORIGIN= Bruker BioSpin GmbH
$$ ##OWNER= Administrator
$$ $$ E:\/data/COFFEE/nmr/AC1524_ROEFFECT0006_8202296_HPoOqEx9dn/22/pdata/1/auditp.txt
$$ ##AUDIT TRAIL=  $$ (NUMBER, WHEN, WHO, WHERE, PROCESS, VERSION, WHAT)
(   1,<2014-07-31 17:59:31.833 -0700>,<Administrator>,<X>,<go>,<TOPSPIN 2.1>,
      <created by zg
	started at 2014-07-31 17:47:57.506 -0700,
	POWCHK enabled, PULCHK disabled,
       configuration hash MD5:
       16 EA D6 F4 BB 67 03 14 9B FF E7 A0 43 5B 48 2E
       data hash MD5: 64K
       EC 59 E8 03 B1 54 DA 9D EF 78 D7 4E 08 82 0A 67>)
(   2,<2014-07-31 17:59:34.031 -0700>,<Administrator>,<X>,<proc1d>,<TOPSPIN 2.1>,
      <Start of raw data processing
       efp LB = 0.3 FT_mod = 6 PKNL = 1 PHC0 = 0 PHC1 = 0 SI = 128K 
       data hash MD5: 128K
       E1 F4 1A 4E A6 E1 BF F1 52 3A 0F D7 6A 9F 3A 69>)
(   3,<2014-07-31 17:59:34.729 -0700>,<Administrator>,<X>,<proc1d>,<TOPSPIN 2.1>,
      <pk PHC0 = -82.98523 PHC1 = 0 
       data hash MD5: 128K
       30 9A 2E A7 3B 17 FB E5 AF FC 0C A7 6F EB 79 A0>)
(   4,<2014-07-31 17:59:35.061 -0700>,<Administrator>,<X>,<proc1d>,<TOPSPIN 2.1>,
      <abs ABSG = 1 
       data hash MD5: 128K
       CC C0 A8 09 3C E6 9D D0 6D F2 04 E9 26 84 BD A8>)
(   5,<2014-07-31 17:59:35.141 -0700>,<Administrator>,<X>,<proc1d>,<TOPSPIN 2.1>,
      <abs ABSG = 2 
       data hash MD5: 128K
       29 51 68 C6 30 CF 26 4B B2 44 99 87 A2 71 70 B4>)
(   6,<2014-07-31 17:59:35.221 -0700>,<Administrator>,<X>,<proc1d>,<TOPSPIN 2.1>,
      <abs ABSG = 3 
       data hash MD5: 128K
       E7 AA 77 2B DD 5D A7 4E A9 32 A6 D7 01 D1 99 62>)
(   7,<2014-07-31 17:59:35.302 -0700>,<Administrator>,<X>,<proc1d>,<TOPSPIN 2.1>,
      <abs ABSG = 4 
       data hash MD5: 128K
       90 D6 9B 9C 9E A3 DF 87 58 BB 86 D9 29 5D B0 CE>)
(   8,<2014-07-31 17:59:35.379 -0700>,<Administrator>,<X>,<proc1d>,<TOPSPIN 2.1>,
      <abs ABSG = 5 
       data hash MD5: 128K
       EB 0F 64 DC 2A 8D 18 7E 3B 4D 2B A9 19 50 6F 21>)
$$ ##END=
$$ 
$$ $$ hash MD5
$$ $$ 8D 3C F9 F2 9B A3 C5 58 D9 AC BB 0E 32 C7 1D 42
##$RELAX= 
##$RELAX= 
##$RELAX= 
##$RELAX= 
##$RELAX= 
##$RELAX= 
##$RELAX= 
##$RELAX= 
$$ Bruker specific parameters
$$ --------------------------
##$DU= <E:\>
##$EXPNO= 22
$$ [...]
##$TP07= 0
##$TPNAME0= <>
##$TPNAME1= <>
##$TPNAME2= <>
##$TPNAME3= <>
##$TPNAME4= <>
##$TPNAME5= <>
##$TPNAME6= <>
##$TPNAME7= <>
##$TPOAL= (0..7)
0.5 0.5 0.5 0.5 0.5 0.5 0.5 0.5
##$TPOFFS= (0..7)
0 0 0 0 0 0 0 0
##$TUNHIN= 0
##$TUNHOUT= 0
##$TUNXOUT= 0
##$USERA1= <user>
##$USERA2= <user>
##$USERA3= <user>
##$USERA4= <user>
##$USERA5= <user>
##$V9= 5
##$VALIST= <valist>
##$VCLIST= <CCCCCCCCCCCCCCC>
##$VD= 0
##$VDLIST= <DDDDDDDDDDDDDDD>
##$VPLIST= <PPPPPPPPPPPPPPP>
##$VTLIST= <TTTTTTTTTTTTTTT>
##$WBST= 1024
##$WBSW= 4
##$XGAIN= (0..3)
0 0 0 0
##$XL= 0
##$YL= 0
##$YMAX_a= 9773850
##$YMIN_a= -10799568
##$ZGOPTNS= <>
##$ZL1= 120
##$ZL2= 120
##$ZL3= 120
##$ZL4= 120
##$ABSF1= 14.97786
##$ABSF2= -5.580321
##$ABSG= 5
##$ABSL= 3
##$ALPHA= 0
##$AQORDER= 0
##$ASSFAC= 0
##$ASSFACI= 0
##$ASSFACX= 0
##$ASSWID= 0
##$AUNMP= <proc_prof1d_extract.lims>
##$AXLEFT= 0
##$AXNAME= <>
##$AXNUC= <1H>
##$AXRIGHT= 0
##$AXTYPE= 0
##$AXUNIT= <>
##$AZFE= 0.1
##$AZFW= 0.1
##$BCFW= 0
##$BC_mod= 0
##$BYTORDP= 0
##$COROFFS= 0
##$CY= 15
##$DATMOD= 1
##$DC= 0
##$DFILT= <>
##$DTYPP= 0
##$F1P= 0
##$F2P= 0
##$FCOR= 0.5
##$FTSIZE= 131072
##$FT_mod= 6
##$GAMMA= 0
##$GB= 0
##$INTBC= 1
##$INTSCL= 1
##$ISEN= 128
##$LB= 0.3
##$LEV0= 0
##$LPBIN= 0
##$MAXI= 10000
##$MC2= 0
##$MEAN= 0
##$ME_mod= 0
##$MI= 0
##$NCOEF= 0
##$NC_proc= -1
##$NLEV= 6
##$NOISF1= 0
##$NOISF2= 0
##$NSP= 0
##$NTH_PI= 0
##$NZP= 0
##$OFFSET= 14.97786
##$PC= 1
##$PHC0= -82.98523
##$PHC1= 0
##$PH_mod= 1
##$PKNL= yes
##$PPARMOD= 0
##$PPDIAG= 0
##$PPIPTYP= 0
##$PPMPNUM= 2147483647
##$PPRESOL= 1
##$PSCAL= 4
##$PSIGN= 0
##$PYNMP= <proc.py>
##$REVERSE= no
##$SF= 400.020002892488
##$SI= 131072
##$SIGF1= 0
##$SIGF2= 0
##$SINO= 400
##$SIOLD= 131072
##$SPECTYP= <>
##$SREGLST= <1H.CDCl3>
##$SSB= 0
##$STSI= 131072
##$STSR= 0
##$SW_p= 8223.68421052631
##$SYMM= 0
##$S_DEV= 0
##$TDeff= 65536
##$TDoff= 0
##$TI= <>
##$TILT= no
##$TM1= 0
##$TM2= 0
##$TOPLEV= 0
##$USERP1= <user>
##$USERP2= <user>
##$USERP3= <user>
##$USERP4= <user>
##$USERP5= <user>
##$WDW= 1
##$XDIM= 131072
##$YMAX_p= 164697236
##$YMIN_p= -404300561
##$CURPLOT= <Network HP LaserJet P1505>
##$CURPRIN= <$Network HP LaserJet P1505>
##$DFORMAT= <normdp>
##$LAYOUT= <+/1D_H.xwp>
##$LFORMAT= <normlp>
##$PFORMAT= <normpl>
##$SURQMSG= 1
$$ End of Bruker specific parameters
$$ ---------------------------------
##NTUPLES= NMR SPECTRUM
##VAR_NAME=  FREQUENCY,     SPECTRUM/REAL,   SPECTRUM/IMAG
##SYMBOL=    X,             R,               I
##VAR_TYPE=  INDEPENDENT,   DEPENDENT,       DEPENDENT
##VAR_FORM=  AFFN,          ASDF,            ASDF
##VAR_DIM=   131072,        131072,          131072
##UNITS=     HZ,            ARBITRARY UNITS, ARBITRARY UNITS
##FACTOR=    0.0627417313425164, 1,          1
##FIRST=     8223.62146879497, 953,          -17698
##LAST=      0,             1186,            -17411
##MIN=       0,             -404300561,      0
##MAX=       8223.62146879497, 164697236,    0
$$ Real data points
##PAGE= N=1
##DATA TABLE= (X++(R..R)), XYDATA
$$ [...]
$$ plain form
62945 499295 522625 547385 573210 599480 625769 652090 678613 705241 731604 757386 782560
62934 782560 807383 832303 857819 884225 911359 938594 965082 990028 1012813 1032950 1049902
62923 1049902 1062896 1070982 1073364 1069671 1059922 1044308 1023150 997006 966689 933145 897364 860368
62911 860368 823138 786489 751127 717853 687635 661307 639152 620829 605744 593513 584105 577620
62899 577620 574019 573089 574597 578394 584333 592155 601553 612372 624627 638259 652854 667724 682327
62886 682327 696610 710879 725429 740309 755366 770292 784558 797456 808371 816962 823035 826299
62874 826299 826357 822863 815563 804233 788793 769519 747046 722151 695626 668353 641226 614790
62862 614790 589082 563989 539711 516746 495443 475726 457266 439829 423447 408348 394710
$$ packed form
62945D99295K3330K4760K5825K6270K6289K6321K6523K6628K6363K5782K5174
62934G82560K4823K4920K5516K6406K7134K7235K6488K4946K2785K0137J6952
62923A049902J2994Q086K382l693r749j5614k1158k6144l0317l3544l5781l6996
62911H60368l7230l6649l5362l3274l0218k6328k2155j8323j5085j2231r408o485
62899E77620l601r30J508L797N939P822R398J0819J2255J3632J4595J4870J4603
62886F82327J4283J4269J4550J4880J5057J4926J4266J2898J0915Q591O073L264
62874H26299N8l494p300j1330j5440j9274k2473k4895k6525k7273k7127k6436
62862F14790k5708k5093k4278k2965k1303j9717j8460j7437j6382j5099j3638
$$ plain form
62851 394710 382377 370859 359741 349097 339357 330725 322931 315605 308726 302532 297147 292495 288460
62838 288460 284903 281546 278095 274520 271084 268075 265658 263943 262971 262584 262563 262948 263969 265547 267151
62823 267151 268368 269342 270336 271076 270941 269717 267778 265530 263060 260412 257760 255124 252223 248886 245410
62808 245410 242266 239661 237580 236101 235319 235060 234948 234747 234434 233968 233226 232191 230988 229677 228209 226652
62792 226652 225281 224329 223737 223292 222932 222791 222970 223357 223713 223887 223926 224001 224250 224706 225282 225789 226018 225910 225663
62773 225663 225588 225789 226068 226167 226031 225770 225464 225121 224788 224594 224668 225057 225710 226480 227191 227782 228385 229176 230140 231048
62753 231048 231654 231914 231985 232063 232232 232484 232837 233354 234000 234562 234837 234869 234855 234843 234710 234422 234090 233697 233004 231930
62733 231930 230817 230137 230009 230188 230392 230501 230498 230479 230622 230994 231462 231966 232739 234002 235519 236789 237687 238624
$$ packed form
62851C94710j2333j1518j1118j0644r740q632p794p326o879o194n385m652m035
62838B88460l557l357l451l575l436l009k417j715r72l87k1L85J021J578J604
62823B67151J217R74R94P40j35j224j939k248k470k648k652k636k901l337l476
62808B45410l144k605k081j479p82k59j12k01l13m66p42j035j203j311j468j557
62792B26652j371r52n92m45l60j41J79L87L56J74L9P5K49M56N76N07K29j08k47
62773B25663p5K01K79R9j36k61l06l43l33j94P4L89O53P70P11N91O03P91R64R08
62753B31048O06K60P1P8J69K52L53N17O46N62K75L2j4j2j33k88l32l93o93j074
62733B31930j113o80j28J79K04J09lj9J43L72M68N04P73J263J517J270Q98R37
$$ plain form
62715 238624 240014 241831 243797 245716 247475 248952 250176 251484 253284 255652 258264 260742 262953 265011
62701 265011 267060 269138 271258 273593 276440 279939 283926 288215 292943 298462 304924 312210 320278 329365
62687 329365 339739 351446 364423 378731 394571 412162 431684 453235 476798 502323 529949
62676 529949 560019 592816 628351 666432 706720 748588 791092 833259 874353 913654 950047
62665 950047 982044 1008258 1027762 1040005 1044549 1041029 1029416 1010331 985047 955047 921428 884755
62653 884755 845510 804601 763245 722434 682687 644369 608023 574201 543064 514350 487751
62642 487751 463189 440707 420285 401880 385545 371281 358760 347395 336787 326974 318195 310509
62630 310509 303761 297805 292643 288368 285083 282792 281274 280139 279133 278313 277794 277450 277087 276862 277242 278503
$$ packed form
62715B38624J390J817J966J919J759J477J224J308J800K368K612K478K211K058
62701B65011K049K078K120K335K847L499L987M289M728N519O462P286Q068R087
62687C29365J0374J1707J2977J4308J5840J7591J9522K1551K3563K5525K7626
62676E29949L0070L2797L5535L8081M0288M1868M2504M2167M1094L9301L6393
62665I50047L1997K6214J9504J2243M544l520j1613j9085k5284l0000l3619l6673
62653H84755l9245m0909m1356m0811l9747l8318l6346l3822l1137k8714k6599
62642D87751k4562k2482k0422j8405j6335j4264j2521j1365j0608r813q779p686
62630C10509o748n956n162m275l285k291j518j135j006q20n19l44l63k25L80J261
$$ plain form
62614 278503 280493 282980 286028 289851 294434 299492 304839 310676 317460 325477 334597 344521 355264 367292
62600 367292 381117 396903 414605 434317 456222 480300 506336 534210 563868 594975 626830
62589 626830 658710 690047 720220 748401 773687 795183 811921 822997 827990 827031 820405 808344
62577 808344 791351 770289 745888 718419 688262 656537 624750 593867 564079 535405 508089
62566 508089 482378 458315 435978 415640 397461 381183 366366 352855 340819 330311 320964 312253
62554 312253 303966 296280 289336 282925 276740 270825 265533 261097 257475 254643 252673 251400 250333 249120
62540 249120 247869 246760 245627 244233 242739 241508 240559 239607 238569 237619 236767 235832 234884 234285 234147 234134 233981
62523 233981 233885 234128 234622 235092 235477 235868 236202 236364 236480 236860 237639 238710 239917 241134 242225 243211 244479
$$ packed form
62614B78503J990K487L048L823M583N058N347N837O784Q017R120R924J0743J2028
62600C67292J3825J5786J7702J9712K1905K4078K6036K7874K9658L1107L1855
62589F26830L1880L1337L0173K8181K5286K1496J6738J1076M993r59o626j2061
62577H08344j6993k1062k4401k7469l0157l1725l1787l0883k9788k8674k7316
62566E08089k5711k4063k2337k0338j8179j6278j4817j3511j2036j0508r347q711
62554C12253q287p686o944o411o185n915n292m436l622k832j970j273j067j213
62540B49120j251j109j133j394j494j231r49r52j038r50q52r35r48n99j38j3j53
62523B33981r6K43M94M70L85L91L34J62J16L80P79J071J207J217J091R86J268
$$ plain form
62506 244479 246566 249641 253382 257418 261713 266458 271817 277916 284929 292941 301827 311483 322154 334350
62492 334350 348374 364083 381155 399431 418875 439325 460438 481802 502883 522825 540528
62481 540528 555095 566161 573710 577634 577622 573484 565464 554195 540358 524454 506881 488141 468887
62468 468887 449704 430903 412594 394935 378218 362688 348369 335141 322891 311532 300913
62457 300913 290880 281469 272993 265842 260125 255499 251395 247461 243776 240609 238065 236042 234415 233101
62443 233101 231927 230676 229280 227832 226376 224860 223357 222105 221207 220469 219753 219286 219404 220099 221072 222160
62427 222160 223501 225264 227441 229924 232641 235623 239078 243388 248820 255218 262142 269356 277105 285890
62413 285890 296110 307854 320881 334781 349316 364661 381161 398795 416982 434850 451584
$$ packed form
62506B44479K087L075L741M036M295M745N359O099P013Q012Q886R656J0671J2196
62492C34350J4024J5709J7072J8276J9444K0450K1113K1364K1081J9942J7703
62481E40528J4567J1066P549L924j2m138q020j1269j3837j5904j7573j8740j9254
62468D68887j9183j8801j8309j7659j6717j5530j4319j3228j2250j1359j0619
62457C00913j0033r411q476p151n717m626m104l934l685l167k544k023j627j314
62443B33101j174j251j396j448j456j516j503j252q98p38p16m67J18O95R73J088
62427B22160J341J763K177K483K717K982L455M310N432O398O924P214P749Q785
62413B85890J0220J1744J3027J3900J4535J5345J6500J7634J8187J7868J6734
$$ plain form
62402 451584 466519 479159 489215 496513 500829 501959 499935 495014 487425 477350 465195 451652 437347
62389 437347 422613 407723 393151 379339 366364 354026 342239 331159 320966 311723 303407 295885
62377 295885 288859 281996 275180 268525 262151 256071 250317 245005 240206 235817 231717 227959 224737 222124
62363 222124 219914 217764 215472 213130 211011 209337 208153 207430 207203 207526 208230 208898 209220 209396 210023 211410
62347 211410 213164 214635 215728 217063 219265 222318 225706 228989 232013 234753 237235 239549 241670 243227
62333 243227 243704 242950 241270 238958 235976 232268 228177 224270 220786 217485 214071 210602 207399 204693 202458
62318 202458 200527 198729 196917 195005 193083 191454 190401 189888 189544 189003 188204 187377 186856 186915 187627 188736
62302 188736 189771 190440 190876 191422 192302 193568 195199 197024 198689 199984 201125 202500 204181 205991 207948
$$ packed form
62402D51584J4935J2640J0056P298M316J130k024m921p589j0075j2155j3543j4305
62389D37347j4734j4890j4572j3812j2975j2338j1787j1080j0193r243q316p522
62377B95885p026o863o816o655o374o080n754n312m799m389m100l758l222k613
62363B22124k210k150k292k342k119j674j184p23k27L23P04O68L22J76O27J387
62347B11410J754J471J093J335K202L053L388L283L024K740K482K314K121J557
62333B43227M77p54j680k312k982l708m091l907l484l301l414l469l203k706k235
62318B02458j931j798j812j912j922j629j053n13l44n41p99q27n21N9P12J109
62302A88736J035O69M36N46Q80J266J631J825J665J295J141J375J681J810J957
$$ plain form
62287 207948 210260 212839 215252 217331 219448 221963 224706 227279 229604 231866 234153 236471 238997 241913
62273 241913 245063 248038 250639 253046 255628 258825 263116 268732 275393 282646 290555 299782 310884 323811
62259 323811 338235 354093 371594 390804 411392 432658 453670 473508 491566 507578 521265
62248 521265 532160 539963 544961 547823 548987 548400 545886 541477 535316 527408 517683 506233 493378 479519
62234 479519 465052 450396 436016 422329 409573 397780 386840 376627 367068 358090 349473 340876
62222 340876 332087 323198 314469 306018 297776 289707 281905 274442 267298 260517 254306 248867 244200 240230
62208 240230 236968 234398 232290 230338 228527 227132 226354 226111 226260 226837 227928 229386 230825 231934 232770
62193 232770 233745 235277 237370 239565 241335 242487 243098 243262 243100 242915 242965 243043 242665 241814 241131 241172 241745 242328
$$ packed form
62287B07948K312K579K413K079K117K515K743K573K325K262K287K318K526K916
62273B41913L150K975K601K407K582L197M291N616O661P253P909R227J1102J2927
62259C23811J4424J5858J7501J9210K0588K1266K1012J9838J8058J6012J3687
62248E21265J0895P803M998K862J164n87k514m409o161p908r725j1450j2855j3859
62234D79519j4467j4656j4380j3687j2756j1793j0940j0213r559q978q617q597
62222C40876q789q889q729q451q242q069p802p463p144o781o211n439m667l970
62208B40230l262k570k108j952j811j395p78k43J49N77J091J458J439J109Q36
62193B32770R75J532K093K195J770J152O11J64j62j85N0P8l78q51o83M1N73N83
$$ plain form
62175 242328 242863 243752 245207 247068 249255 251988 255426 259400 263696 268393 273754 280033 287511 296573 307534
62160 307534 320454 335250 351912 370442 390673 412252 434758 457675 480252 501542 520665
62149 520665 537030 550337 560458 567333 570974 571566 569491 565121 558505 549303 537183 522277 505193
62136 505193 486635 467142 447246 427686 409255 392430 377291 363905 352662 344093 338355 335014
62124 335014 333392 333040 333812 335582 338113 341178 344683 348525 352424 356013 359113 361822 364271 366288 367366
62109 367366 367007 365130 362128 358451 354131 348839 342467 335567 329028 323285 317996 312585 307001 301800
62095 301800 297545 294321 291895 290169 289293 289391 290343 291885 293786 295913 298196 300657 303419 306565 309912
62080 309912 313021 315473 317180 318411 319517 320675 321863 323033 324317 326149 329216 334174 341273 350302
$$ packed form
62175B42328N35Q89J455J861K187K733L438L974M296M697N361O279P478R062J0961
62160C07534J2920J4796J6662J8530K0231K1579K2506K2917K2577K1290J9123
62149E20665J6365J3307J0121O875L641N92k075m370o616r202j2120j4906j7084
62136E05193j8558j9493j9896j9560j8431j6825j5139j3386j1243q569n738l341
62124C35014j622l52P72J770K531L065L505L842L899L589L100K709K449K017J078
62109C67366l59j877l002l677m320n292o372o900o539n743n289n411n584n201
62095C01800m255l224k426j726q76R8R52J542J901K127K283K461K762L146L347
62080C09912L109K452J707J231J106J158J188J170J284J832L067M958P099R029
$$ plain form
62066 350302 360985 373337 387407 402711 418216 432959 446460 458399 468194 475261 479604 481811
62054 481811 482461 481777 479802 476587 472087 466105 458509 449396 438982 427491 415236 402663 390187
62041 390187 378136 366909 357033 348903 342535 337672 333976 331023 328348 325705 323252 321276 319790 318562
62027 318562 317525 316979 317316 318663 320875 323845 327790 333164 340263 348949 358835 369655 381257 393204
62013 393204 404626 414585 422456 427962 431130 432410 432625 432452 431954 430719 428314 424477 419074 412244 404528
61998 404528 396601 388936 381968 376445 373182 372366 373458 375915 379729 385085 391758 399116 406593 413901
61984 413901 420859 427273 433062 438386 443577 448896 454374 459933 465680 471996 479214 487291 495994 505356
61970 505356 515705 527147 539267 551482 563532 575448 587165 598291 608246 616486 622665 626680
$$ packed form
62066C50302J0683J2352J4070J5304J5505J4743J3501J1939R795P067M343K207
62054D81811O50o84j975l215m500n982p596r113j0414j1491j2255j2573j2476
62041C90187j2051j1227r876q130o368m863l696k953k675k643k453j976j486j228
62027C18562j037n46L37J347K212K970L945N374P099Q686R886J0820J1602J1947
62013C93204J1422R959P871N506L168J280K15j73m98j235k405l837n403o830p716
61998D04528p927p665o968n523l263q16J092K457L814N356O673P358P477P308
61984D13901O958O414N789N324N191N319N478N559N747O316P218Q077Q703R362
61970E05356J0349J1442J2120J2215J2050J1916J1717J1126R955Q240O179M015
$$ plain form
61958 626680 628571 628364 626119 622109 616793 610487 603242 595170 586727 578404 570222 561754 552686 543125
61944 543125 533371 523553 513560 503201 492348 481022 469390 457616 445694 433499 421002 408314
61932 408314 395524 382670 369938 357726 346389 336005 326489 317811 309907 302508 295295 288249 281649
61919 281649 275678 270180 264884 259691 254632 249719 244992 240634 236870 233784 231389 229780 229036 229004 229436
61904 229436 230370 232111 234729 237786 240739 243451 246090 248628 250712 252082 252852 253267 253308 252653 251036 248550
61888 248550 245621 242748 240224 238019 235823 233222 229973 226268 222734 220035 218403 217586 217244 217281 217780
61873 217780 218785 220243 222033 223923 225631 227101 228600 230362 232201 233697 234766 235785 237139 238861
61859 238861 240803 242939 245292 247695 249875 251720 253324 254761 256002 257122 258437 260267 262619 265251
$$ packed form
61958F26680J891k07k245m010n316o306p245q072q443q323q182q468r068r561
61944E43125r754r818r993j0359j0853j1326j1632j1774j1922j2195j2497j2688
61932D08314j2790j2854j2732j2212j1337j0384r516q678p904p399p213p046o600
61919B81649n971n498n296n193n059m913m727m358l764l086k395j609p44l2M32
61904B29436R34J741K618L057K953K712K639K538K084J370P70M15M1o55j617k486
61888B48550k929k873k524k205k196k601l249l705l534k699j632q17l42L7M99
61873B17780J005J458J790J890J708J470J499J762J839J496J069J019J354J722
61859B38861J942K136K353K403K180J845J604J437J241J120J315J830K352K632
$$ plain form
61845 265251 268116 271581 276117 281859 288626 296325 305077 314864 325283 335843 346390 357025 367693
61832 367693 378061 387837 397004 405661 413736 420957 427088 432169 436457 440056 442607 443522 442667 440646
61818 440646 438226 435622 432659 429514 426905 425506 425497 426844 429685 434159 440031 446753 453825 460884 467525
61803 467525 473258 477638 480315 480992 479507 475949 470580 463617 455180 445405 434514 422797 410625 398467
61789 398467 386734 375610 365097 355233 346158 337942 330515 323778 317685 312106 306741 301277 295690
61776 295690 290308 285574 281716 278677 276312 274629 273777 273763 274284 274974 275852 277354 279810 283008 286460 290084
61760 290084 294350 299718 306169 313495 321823 331552 342849 355542 369551 385055 402090 420299 439293
61747 439293 458983 479275 499628 519297 537867 555177 570740 583674 593333 599743 603292 604313
$$ packed form
61845B65251K865L465M536N742O767P699Q752R787J0419J0560J0547J0635J0668
61832C67693J0368R776R167Q657Q075P221O131N081M288L599K551R15q55k021
61818D40646k420k604k963l145k609j399rJ347K841M474N872O722P072P059O641
61803D67525N733M380K677O77j485l558n369o963q437r775j0891j1717j2172j2158
61789C98467j1733j1124j0513r864r075q216p427o737o093n579n365n464n587
61776B95690n382m734l858l039k365j683q52j4N21O90Q78J502K456L198L452L624
61760B90084M266N368O451P326Q328R729J1297J2693J4009J5504J7035J8209J8994
61747D39293J9690K0292K0353J9669J8570J7310J5563J2934R659O410L549J021
$$ plain form
61735 604313 603128 600206 596088 591334 586731 583321 581944 582820 585734 590430 596590 603577 610568 616989
61721 616989 622580 626965 629381 628951 625106 617726 607044 593495 577579 559760 540494 520342 499940
61708 499940 479827 460395 442011 425041 409683 395863 383395 372194 362271 353618 346190 339939
61696 339939 334712 330153 325867 321739 317972 314742 311932 309269 306672 304287 302240 300471 298813 297112
61682 297112 295254 293209 291122 289279 287873 286903 286272 285904 285699 285512 285296 285147 285122 285101 284918 284620 284459 284665
61664 284665 285277 286074 286637 286649 286247 285942 286041 286330 286482 286553 286747 286903 286671 286135 285806 285922 286139 286064 285684 285121
61644 285121 284325 283279 282201 281264 280365 279497 279091 279601 280865 282215 283201 283876 284429 284864 285136 285335 285581
61627 285581 285873 286143 286379 286614 286925 287438 288280 289434 290733 291996 293144 294217 295309 296504 297820 299202
$$ packed form
61735F04313j185k922m118m754m603l410j377Q76K914M696O160O987O991O421
61721F16989N591M385K416m30l845p380j0682j3549j5916j7819j9266k0152k0402
61708D99940k0113j9432j8384j6970j5358j3820j2468j1201r923q653p428o251
61696C39939n227m559m286m128l767l230k810k663k597k385k047j769j658j701
61682B97112j858k045k087j843j406r70o31l68k05j87k16j49k5k1j83k98j61K06
61664B84665O12P97N63J2m02l05R9K89J52P1J94J56k32n36l29J16K17p5l80n63
61644B85121p96j046j078r37q99q68m06N10J264J350R86O75N53M35K72J99K46
61627B85581K92K70K36K35L11N13Q42J154J299J263J148J073J092J195J316J382
$$ plain form
61611 299202 300564 301785 302679 303094 303032 302553 301482 299471 296517 293238 290368 288048 285867 283565 281390
61596 281390 279681 278334 276906 275123 273121 271217 269567 268104 266687 265206 263558 261623 259393 257099
61582 257099 255050 253306 251621 249756 247745 245765 243837 241824 239667 237506 235538 233861 232456 231222
61568 231222 230002 228613 226959 225139 223418 222030 220969 220029 219101 218323 217847 217579 217301 216962 216615 216183
61552 216183 215586 215107 215229 215993 216896 217584 218325 219540 221166 222852 224510 226278 228063 229520 230456 230874
61536 230874 230676 229651 227841 225638 223377 221051 218455 215485 212231 208945 205970 203558 201717 200257
61522 200257 198966 197678 196343 195157 194460 194304 194263 193931 193437 193152 193047 192701 191858 190582 188872 186559 183708
61505 183708 180711 177853 175058 172196 169357 166643 163962 161203 158396 155610 152951 150721 149272 148520
$$ packed form
61611B99202J362J221Q94M15o2m79j071k011k954l279k870k320k181k302k175
61596B81390j709j347j428j783k002j904j650j463j417j481j648j935k230k294
61582B57099k049j744j685j865k011j980j928k013k157k161j968j677j405j234
61568B31222j220j389j654j820j721j388j061r40r28p78m76k68k78l39l47m32
61552B16183n97m79J22P64R03O88P41J215J626J686J658J768J785J457R36M18
61536B30874j98j025j810k203k261k326k596k970l254l286k975k412j841j460
61522B00257j291j288j335j186o97j56m1l32m94k85j05l46q43j276j710k313k851
61505A83708k997k858k795k862k839k714k681k759k807k786k659k230j449p52
$$ plain form
61491 148520 147872 146846 145532 144260 143101 141914 140694 139584 138671 137975 137529 137282 137075 136835 136631 136409
61475 136409 135973 135349 134922 134896 134901 134472 133720 133135 132900 132784 132635 132542 132484 132239 131765 131325 131154 131246 131549 132084 132755
61454 132755 133281 133496 133538 133599 133640 133503 133200 132943 132990 133467 134239 134892 135004 134580 134098 134033 134458 135179 136129 137419
61434 137419 139079 140914 142661 144205 145642 147149 148763 150252 151260 151595 151326 150590 149439 147953 146351
61419 146351 144885 143688 142833 142419 142440 142636 142663 142437 142143 141910 141655 141272 140808 140325 139752 139025 138271 137713 137368
61400 137368 137010 136464 135895 135686 136051 136768 137366 137581 137565 137637 137917 138349 139000 140041 141356 142450 142969 143201
61382 143201 143793 145054 146708 148280 149453 150077 150140 149827 149412 149033 148728 148687 149179 150118 150993 151394 151384 151226
61364 151226 151003 150780 150819 151231 151602 151380 150635 150027 149999 150393 150922 151612 152562 153575 154359 154887 155318 155662 155823
$$ packed form
61491A48520o48j026j314j272j159j187j220j110r13o96m46k47k07k40k04k22
61475A36409m36o24m27k6Nm29p52n85k35j16j49r3n8k45m74m40j71R2L03N35O71
61454A32755N26K15M2O1M1j37l03k57M7M77P72O53J12m24m82o5M25P21R50J290
61434A37419J660J835J747J544J437J507J614J489J008L35k69p36j151j486j602
61419A46351j466j197q55m14K1J96K7k26k94k33k55l83m64m83n73p27p54n58l45
61400A37368l58n46n69k09L65P17N98K15j6P2K80M32O51J041J315J094N19K32
61382A43201N92J261J654J572J173O24O3l13m15l79l05m1M92R39Q75M01j0j58
61364A51226k23k23L9M12L71k22p45o08k8L94N29O90R50J013P84N28M31L44J61
$$ plain form
61345 155823 155917 156275 157043 157997 158852 159659 160745 162305 164200 166196 168280 170627 173329 176301 179435 182617
61329 182617 185589 187988 189661 190780 191547 192014 192356 192988 194097 195249 195886 196074 196344 196831 197092 196806 196159
61312 196159 195340 194170 192597 191146 190415 190308 190195 189689 188916 188084 187183 186187 185221 184422 183789 183261 182799 182387
61294 182387 182060 181941 182102 182366 182376 181946 181228 180564 180229 180298 180639 180989 181136 181053 180816 180418 179805 179108 178687 178829
61274 178829 179454 180213 180891 181622 182654 183980 185306 186426 187506 188886 190652 192529 194237 195823 197614
61259 197614 199858 202510 205322 208185 211313 215043 219448 224279 229385 234947 241099 247457 253294 258137
61245 258137 261969 264923 267133 268867 270422 271777 272662 273082 273366 273569 273191 271818 269713 267457 265258
61230 265258 262996 260729 258727 257091 255709 254540 253587 252665 251562 250489 249948 250076 250396 250408 250202 250314
$$ packed form
61345A55823R4L58P68R54Q55Q07J086J560J895J996K084K347K702K972L134L182
61329A82617K972K399J673J119P67M67L42O32J109J152O37J88K70M87K61k86o47
61312A96159q19j170j573j451p31j07j13n06p73q32r01r96r66p99o33n28m62m12
61294A82387l27j19J61K64J0m30p18o64l35O9L41L50J47q3k37l98o13o97m21J42
61274A78829O25P59O78P31J032J326J326J120J080J380J766J877J708J586J791
61259A97614K244K652K812K863L128L730M405M831N106N562O152O358N837M843
61245B58137L832K954K210J734J555J355Q85M20K84K03l78j373k105k256k199
61230B65258k262k267k002j636j382j169r53r22j103j073n41J28L20J2k06J12
$$ plain form
61214 250314 251112 252470 254000 255514 257291 259927 263901 269289 275812 283009 290302 297115 303154 308465
61200 308465 313037 316530 318624 319521 319813 319859 319628 319080 318371 317584 316575 315208 313550 311681 309542 307057
61184 307057 304287 301376 298484 295824 293571 291673 289927 288311 287084 286455 286289 286259 286182 286136 286348 286997 288001
61167 288001 289009 289787 290671 292434 295607 300086 305488 311622 318423 325598 332572 338752 343702 347093 348674
61152 348674 348377 346425 343284 339428 335057 330130 324754 319436 314715 310626 306849 303370 300627 298860
61138 298860 297720 296767 296039 295759 295772 295685 295459 295456 295909 296713 297821 299459 301792 304601 307481 310207 312765
61121 312765 315145 317294 319274 321348 323891 327179 331189 335564 339866 343918 347830 351684 355312 358539
61107 358539 361589 365069 369442 374630 380253 386195 392744 400135 408154 416448 425090 434526 444917 455772
$$ packed form
61214B50314P98J358J530J514J777K636L974N388O523P197P293O813O039N311
61200C08465M572L493K094Q97K92M6k31n48p09p87j009j367j658j869k139k485
61184C07057k770k911k892k660k253j898j746j616j227o29j66l0p7m6K12O49J004
61167B88001J008P78Q84J763L173M479N402O134O801P175O974O180M950L391J581
61152C48674k97j952l141l856m371m927n376n318m721m089l777l479k743j767
61138B98860j140r53p28k80J3q7k26lM53Q04J108J638K333K809K880K726K558
61121C12765K380K149J980K074K543L288M010M375M302M052L912L854L628L227
61107C58539L050L480M373N188N623N942O549P391Q019Q294Q642R436J0391J0855
$$ plain form
61093 455772 466359 476269 485369 493419 499990 504781 507824 509382 509811 509476 508570 506930 504138 499907 494299
61078 494299 487578 479933 471372 461830 451379 440350 429219 418277 407465 396635 385859 375307
61066 375307 364905 354432 344063 334491 326303 319385 313186 307504 302724 299296 297160 295822 294839 294179
61052 294179 294137 295006 296810 299304 302130 304918 307240 308645 308874 308006 306329 304135 301747 299684 298547
61037 298547 298657 299930 302158 305340 309566 314759 320673 327223 334631 343170 352821 363230 374028 385095
61023 385095 396557 408546 421005 433659 446129 458084 469366 480008 490087 499540 508154 515787
61011 515787 522513 528468 533638 537865 541030 543088 543945 543500 541786 538886 534600 528408 519973 509577
60997 509577 497918 485578 472858 460010 447297 434786 422340 409997 398140 387136 376934
$$ packed form
61093D55772J0587R910R100Q050O571M791L043J558M29l35r06j640k792m231n608
61078D94299o721p645q561r542j0451j1029j1131j0942j0812j0830j0776j0552
61066C75307j0402j0473j0369r572q188o918o199n682m780l428k136j338r83o60
61052B94179m2Q69J804K494K826K788K322J405K29q68j677k194k388k063j137
61037B98547J10J273K228L182M226N193N914O550P408Q539R651J0409J0798J1067
61023C85095J1462J1989J2459J2654J2470J1955J1282J0642J0079R453Q614P633
61011E15787O726N955N170M227L165K058Q57m45j714k900m286o192q435j0396
60997E09577j1659j2340j2720j2848j2713j2511j2446j2343j1857j1004j0202
$$ plain form
60986 376934 367209 357848 349095 341190 334107 327713 322070 317339 313454 310062 306899 304124 302177 301322
60972 301322 301420 302097 303010 303926 304725 305452 306332 307621 309439 311782 314634 318023 322019 326729 332271 338633
60956 338633 345636 353095 361015 369586 379012 389357 400500 412140 423944 435743 447585 459590
60944 459590 471812 484246 496838 509409 521737 533777 545675 557549 569427 581447 593792
60933 593792 606311 618597 630677 643292 657130 672156 688166 705617 725190 746633 768788
60922 768788 790917 813436 837297 863332 892482 925969 964751 1009106 1059062 1114878 1176923
60911 1176923 1245546 1321564 1406767 1504027 1617461 1752685 1916298 2114863 2355054 2645238
60901 2645238 2996582 3423183 3943402 4581810 5365092 6306765 7387091 8542700 9674395
$$ packed form
60986C76934r725r361q753p905p083o394n643m731l885l392l163k775j947q55
60972C01322R8O77R13R16P99P27Q80J289J818K343K852L389L996M710N542O362
60956C38633P003P459P920Q571R426J0345J1143J1640J1804J1799J1842J2005
60944D59590J2222J2434J2592J2571J2328J2040J1898J1874J1878J2020J2345
60933E93792J2519J2286J2080J2615J3838J5026J6010J7451J9573K1443K2155
60922G68788K2129K2519K3861K6035K9150L3487L8782M4355M9956N5816O2045
60911A176923O8623P6018Q5203R7260J13434J35224J63613J98565K40191K90184
60901B645238L51344M26601N20219O38408P83282R41673J080326J155609J131695
$$ plain form
60892 9674395 10668901 11426063 11886836 12056802 12012643 11879291 11782252 11798973 11934030 12124586
60882 12124586 12265237 12240092 11956802 11376854 10529608 9499649 8393265 7304323 6296556
60873 6296556 5403157 4634107 3984156 3440179 2987399 2612506 2303612 2049614 1840595
60864 1840595 1668272 1525592 1406355 1305506 1219331 1144940 1079840 1022115 970583 924472
60854 924472 883228 846716 815052 787888 764160 742761 723081 704615 686537 668124 649381
60843 649381 630815 612742 595149 578096 561929 547051 533675 521715 510859 500842 491700 483595
60831 483595 476402 469768 463648 458404 454216 450759 447706 445208 443588 442851 442812 443451 444776 446560 448624
60816 448624 451266 455037 460090 466044 472426 479039 485910 493132 500799 508907 517337 525966 534739 543538
$$ packed form
60892I674395R94506P57162M60773J69966m4159j33352r7039J6721J35057J90556
60882A2124586J40651k5145k83290n79948q47246j029959j106384j088942j007767
60873F296556q93399p69050o49951n43977m52780l74893l08894k53998k09019
60864A840595j72323j42680j19237j00849q6175p4391o5100n7725n1532m6111
60854I24472m1244l6512l1664k7164k3728k1399j9680j8466j8078j8413j8743
60843F49381j8566j8073j7593j7053j6167j4878j3376j1960j0856j0017r142q105
60831D83595p193o634o120n244m188l457l053k498j620p37l9O39J325J784K064
60816D48624K642L771N053N954O382O613O871P222P667Q108Q430Q629Q773Q799
$$ plain form
60802 543538 552122 560315 568122 575553 582484 588807 594589 599924 604799 609218 613247 616784 619450 620920
60788 620920 621196 620419 618635 615943 612656 609057 605123 600696 595772 590363 584281 577349 569774 562018 554318
60773 554318 546498 538217 529300 519947 510696 502039 493970 486052 477995 469961 462217 454856 447979 441740
60759 441740 435932 429917 423352 416660 410360 404249 397723 390655 383403 376172 368962 362078 356037 350889
60745 350889 346091 341195 336262 331526 327027 322667 318239 313338 307585 301110 294524 288356 282799 277955
60731 277955 273941 270619 267588 264628 261891 259561 257604 255956 254667 253722 252982 252420 252179 252289 252576 252941
60715 252941 253511 254373 255411 256476 257527 258500 259292 259954 260658 261356 261731 261608 261216 260899 260796 260885 261114 261327
60697 261327 261265 260792 259993 259011 257957 256995 256223 255389 254032 252055 249878 247866 245891 243665 241201 238661
$$ packed form
60802E43538Q584Q193P807P431O931O323N782N335M875M419M029L537K666J470
60788F20920K76p77j784k692l287l599l934m427m924n409o082o932p575p756p700
60773E54318p820q281q917r353r251q657q069p918q057q034p744p361o877o239
60759D41740n808o015o565o692o300o111o526p068p252p231p210o884o041n148
60745C50889m798m896m933m736m499m360m428m901n753o475o586o168n557m844
60731B77955m014l322l031k960k737k330j957j648j289r45p40n62k41J10K87L65
60715B52941N70Q62J038J065J051R73P92O62P04O98L75j23l92l17j03Q9K29K13
60697B61327o2m73p99r82j054r62p72q34j357j977k177k012j975k226k464k540
$$ plain form
60681 238661 235980 233008 229863 226841 224006 221124 218010 214793 211860 209632 208235 207253 205971 204061
60667 204061 201930 200230 199137 198318 197479 196694 196222 196265 196900 198049 199402 200541 201246 201675 202238 203298 204937
60650 204937 206925 208927 210821 212812 215211 218128 221382 224635 227556 229911 231567 232463 232598 232060 230996
60635 230996 229488 227529 225218 222837 220594 218341 215781 212921 210070 207399 204794 202221 199906 197996
60621 197996 196269 194394 192329 190290 188467 186891 185468 184011 182355 180587 179003 177742 176586 175288
60607 175288 173920 172731 171779 170893 169935 168915 167939 167148 166627 166305 166035 165867 166063 166697 167474 168106 168682 169406
60589 169406 170178 170779 171344 172300 173815 175656 177594 179645 181858 184148 186521 189183 192249 195501 198594
60574 198594 201435 204189 207022 209937 212834 215572 217955 219773 220909 221424 221480 221208 220653 219891 219159 218701
$$ packed form
60681B38661k681k972l145l022k835k882l114l217k933k228j397r82j282j910
60667B04061k131j700j093q19q39p85m72M3O35J149J353J139P05M29N63J060J639
60650B04937J988K002J894J991K399K917L254L253K921K355J656Q96J35n38j064
60635B30996j508j959k311k381k243k253k560k860k851k671k605k573k315j910
60621A97996j727j875k065k039j823j576j423j457j656j768j584j261j156j298
60607A75288j368j189r52q86r58j020r76p91n21l22k70j68J96O34P77O32N76P24
60589A69406P72O01N65R56J515J841J938K051K213K290K373K662L066L252L093
60574A98594K841K754K833K915K897K738K383J818J136N15N6k72n55p62p32m58
$$ plain form
60558 218701 218442 217976 217021 215804 214805 214186 213672 213007 212275 211669 211132 210411 209431 208426 207670 207170 206666 205908
60540 205908 204835 203504 201870 199762 197150 194326 191728 189559 187684 185918 184351 183273 182855 182942 183170
60525 183170 183202 182865 182178 181348 180681 180363 180279 180102 179604 178823 177953 177172 176651 176540 176803 177124 177178 176975 176751 176582
60505 176582 176269 175676 174936 174269 173744 173331 173005 172733 172472 172323 172498 173006 173508 173698 173699 173892 174419 175122 175919
60486 175919 176987 178462 180139 181557 182331 182371 181916 181407 181209 181326 181412 181156 180647 180319 180546 181314 182324 183372
60468 183372 184585 186244 188437 191036 193968 197316 201095 205082 209079 213162 217413 221490 224783 227071
60454 227071 228721 230064 230861 230643 229423 227703 225875 224003 222240 221044 220692 220887 221200 221748 223044 225253
60438 225253 228030 231162 234982 239890 245745 252076 258677 265636 272795 279508 285003 288803 290751 290880
$$ packed form
60558B18701k59m66r55j217r99o19n14o65p32o06n37p21r80j005p56n00n04p58
60540B05908j073j331j634k108k612k824k598k169j875j766j567j078m18Q7K28
60525A83170L2l37o87q30o67l18q4j77m98p81q70p81n21j11K63L21N4k03k24j69
60505A76582l13n93p40o67n25m13l26k72k61j49J75N08N02J90JJ93N27P03P97
60486A75919J068J475J677J418P74M0m55n09j98J17Q6k56n09l28K27P68J010J048
60468A83372J213J659K193K599K932L348L779L987L997M083M251M077L293K288
60454B27071J650J343P97k18j220j720j828j872j763j196l52J95L13N48J296K209
60438B25253K777L132L820M908N855O331O601O959P159O713N495L800J948J29
$$ plain form
60424 290880 289409 286770 283486 280024 276712 273695 270940 268353 265942 263821 262063 260659 259621 259030
60410 259030 258931 259247 259836 260652 261857 263748 266480 269804 273207 276370 279446 282879 287151 292833 300582
60395 300582 310747 323030 336797 351751 368074 385975 405344 425705 446156 465303 481631
60384 481631 494064 502008 504910 502211 493837 480425 462951 442480 420375 398229 377196 357585
60372 357585 339376 322836 308275 295482 283897 273264 263734 255340 247764 240710 234228 228534 223671
60359 223671 219444 215622 212167 209276 207071 205253 203232 200796 198426 196713 195581 194426 192890 191158
60345 191158 189512 188002 186652 185639 185001 184402 183456 182240 181238 180820 180898 181119 181264 181382 181600 181904 182154
60328 182154 182271 182317 182361 182392 182433 182668 183309 184297 185249 185749 185667 185220 184741 184433 184306 184328 184541 184984 185514 185869 185922
$$ packed form
60424B90880j471k639l284l462l312l017k755k587k411k121j758j404j038n91
60410B59030r9L16N89Q16J205J891K732L324L403L163L076L433M272N682P749
60395C00582J0165J2283J3767J4954J6323J7901J9369K0361K0451J9147J6328
60384D81631J2433P944K902k699q374j3412j7474k0471k2105k2146k1033j9611
60372C57585j8209j6540j4561j2793j1585j0633r530q394p576p054o482n694m863
60359B23671m227l822l455k891k205j818k021k436k370j713j132j155j536j732
60345A91158j646j510j350j013o38n99r46j216j002m18P8K21J45J18K18L04K50
60328A82154J17M6M4L1M1K35O41R88R52N00q2m47m79l08j27K2K13M43N30L55N3
$$ plain form
60307 185922 185830 185829 185957 185981 185625 184823 183829 183032 182629 182518 182565 182846 183484 184350 185216 186131 187349 188793 189987
60288 189987 190677 191218 192106 193369 194719 196098 197697 199503 201217 202658 203948 205206 206349 207322 208334
60273 208334 209637 211136 212421 213249 213825 214548 215541 216576 217434 218156 218851 219490 220034 220628 221412 222237 222873
60256 222873 223445 224363 225836 227775 230175 233199 236798 240659 244731 249421 255022 261214 267355 272952 277600
60241 277600 280812 282328 282342 281078 278365 274044 268630 263117 258154 253771 249844 246410 243530 241158 239245
60226 239245 237710 236321 234857 233377 232131 231197 230453 229838 229364 228886 228118 226981 225743 224782 224345 224468
60210 224468 224977 225619 226362 227533 229487 232291 235874 240284 245485 251078 256623 262129 267803 273335 277863
60195 277863 280725 281889 281577 279860 276774 272527 267396 261616 255504 249471 243785 238479 233582 229253
$$ packed form
60307A85922r2jJ28K4l56q02r94p97m03j11M7K81O38Q66Q66R15J218J444J194
60288A89987O90N41Q88J263J350J379J599J806J714J441J290J258J143R73J012
60273B08334J303J499J285Q28N76P23R93J035Q58P22O95O39N44N94P84Q25O36
60256B22873N72R18J473J939K400L024L599L861M072M690N601O192O141N597M648
60241B77600L212J516J4j264k713m321n414n513m963m383l927l434k880k372j913
60226B39245j535j389j464j480j246r34p44o15m74m78p68j137j238r61m37J23
60210B24468N09O42P43J171J954K804L583M410N201N593N545N506N674N532M528
60195B77863K862J164l12j717l086m247n131n780o112o033n686n306m897m329
$$ plain form
60181 229253 225615 222606 220068 217837 215740 213687 211811 210329 209244 208379 207705 207386 207466 207737 207969 208063
60165 208063 207939 207497 206785 206029 205412 204969 204745 204888 205496 206469 207545 208429 208932 209107 209179 209227 209080 208662 208249
60146 208249 208128 208181 208129 207958 207756 207364 206669 206121 206330 207155 207781 207835 207852 208449 209582 210891 212281 213783 215238
60127 215238 216504 217724 219041 220301 221325 222266 223456 225055 227058 229419 231965 234385 236528 238488
60113 238488 240315 241929 243503 245529 248210 251054 253394 255067 256276 257063 257337 257219 257002 256815 256638 256491
60097 256491 256303 255751 254594 253077 251672 250456 249055 247227 245225 243516 242375 241795 241609 241645 241807 242061
60081 242061 242338 242572 242828 243268 243876 244415 244757 245026 245308 245440 245282 245018 244937 245139 245671 246750 248482 250483
60063 250483 252067 252824 252829 252396 251847 251424 251176 250979 250819 250918 251421 252144 252883 253782 255039 256415 257470 258257
$$ packed form
60181B29253l638l009k538k231k097k053j876j482j085q65o74l19Q0K71K32R4
60165B08063j24m42p12p56o17m43k24J43O08R73J076Q84N03J75P2M8j47m18m13
60146B08249j21N3n2j71k02l92o95n48K09Q25O26N4J7N97J133J309J390J502J455
60127B15238J266J220J317J260J024R41J190J599K003K361K546K420K143J960
60113B38488J827J614J574K026K681K844K340J673J209P87K74j18k17j87j77j47
60097B56491j88n52j157j517j405j216j401j828k002j709j141n80j86L6J62K54
60081B42061K77K34K56M40O08N39L42K69K82J32j58k64q1K02N32J079J732K001
60063B50483J584P57Nm33n49m23k48j97j60R9N03P23P39Q99J257J376J055P87
$$ plain form
60045 258257 259386 261283 263748 266297 268626 270611 272146 273262 274277 275624 277517 279849 282349 284805
60031 284805 287139 289315 291159 292382 292864 292820 292536 291967 290763 288712 286042 283253 280733 278565 276644
60016 276644 274915 273481 272413 271510 270387 268840 267001 265088 263207 261484 260173 259423 259039 258658 258093
60001 258093 257388 256641 255977 255607 255676 256074 256565 257108 257923 259245 261117 263426 266059 268987 272227 275722 279288
59984 279288 282755 286104 289344 292282 294680 296612 298368 299903 300668 300181 298507 296009 292879 289154 284973
59969 284973 280517 275846 271045 266352 261914 257609 253398 249646 246740 244517 242476 240499 238993 238237
59955 238237 237965 237691 237220 236739 236517 236634 236919 237199 237591 238424 239749 241118 242013 242300 242062 241247 239849 238220
59937 238220 236734 235223 233166 230500 227791 225527 223586 221601 219526 217579 215814 213987 211825 209334
$$ packed form
60045B58257J129J897K465K549K329J985J535J116J015J347J893K332K500K456
60031B84805K334K176J844J223M82m4k84n69j204k051k670k789k520k168j921
60016B76644j729j434j068r03j123j547j839j913j881j723j311p50l84l81n65
60001B58093p05p47o64l70O9L98M91N43Q15J322J872K309K633K928L240L495L566
59984B79288L467L349L240K938K398J932J756J535P65m87j674k498l130l725m181
59969B84973m456m671m801m693m438m305m211l752k906k223k041j977j506p56
59955B38237k72k74m71m81k22J17K85K80L92Q33J325J369Q95K87k38q15j398j629
59937B38220j486j511k057k666k709k264j941j985k075j947j765j827k162k491
$$ plain form
59923 209334 206834 204721 203122 201739 200106 197960 195380 192716 190462 189037 188485 188470 188713 189298 190331
59908 190331 191461 192060 191868 191215 190640 190502 190917 191793 192870 193894 194836 195801 196813 197801 198717 199493 199983
59891 199983 200170 200346 200855 201730 202732 203627 204217 204292 203868 203335 203035 202782 202150 201164 200258 199620 198993 198189 197413
59872 197413 196967 196895 197007 197027 196758 196353 196383 197307 198910 200645 202464 204842 207951 211311 214397 217124 219519
59855 219519 221391 222568 223149 223269 222864 221885 220484 218822 216949 215020 213283 211690 209854 207611 205328
59840 205328 203464 202145 201369 201261 201772 202470 202963 203349 203914 204642 205346 206058 206942 207961 208991 210120 211485
59823 211485 212889 213997 214859 215896 217337 218979 220554 222077 223754 225710 227935 230343 232872 235573
59809 235573 238600 242018 245641 249114 252133 254528 256257 257364 257855 257546 256220 254091 251910 250392 249633
$$ packed form
59923B09334k500k113j599j383j633k146k580k664k254j425n52j5K43N85J033
59908A90331J130N99j92o53n75j38M15Q76J077J024R42R65J012R88R16P76M90
59891A99983J87J76N09Q75J002Q95N90P5m24n33l00k53o32r86r06o38o27q04p76
59872A97413m46p2J12K0k69m05L0R24J603J735J819K378L109L360L086K727K395
59855B19519J872J177N81J20m05r79j401j662j873j929j737j593j836k243k283
59840B05328j864j319p76j08N11O98M93L86N65P28P04P12Q84J019J030J129J365
59823B11485J404J108Q62J037J441J642J575J523J677J956K225K408K529K701
59809B35573L027L418L623L473L019K395J729J107M91l09j326k129k181j518p59
$$ plain form
59794 249633 249253 248987 248849 248830 248775 248645 248657 249051 249867 251023 252505 254368 256660 259432 262723 266442 270217
59777 270217 273489 275801 277028 277316 276859 275805 274340 272719 271115 269536 268002 266669 265592 264462 262831
59762 262831 260642 258311 256233 254441 252809 251352 250149 249153 248270 247553 247191 247374 248226 249830 252252 255585
59746 255585 259932 265219 270983 276503 281166 284644 286811 287774 288028 288317 289160 290661 292774 295487 298564
59731 298564 301345 303039 303142 301506 298203 293510 287894 281794 275485 269196 263187 257569 252254 247245
59717 247245 242869 239465 237001 235131 233581 232258 231073 229891 228663 227497 226560 225962 225669 225460 225069
59702 225069 224441 223770 223234 222780 222254 221580 220755 219767 218634 217469 216437 215722 215517 215853 216395 216639 216436 216117
59684 216117 216021 216102 216156 216200 216433 216954 217715 218582 219306 219590 219397 219065 218920 218933 218877 218694 218503 218445 218706 219481 220676
$$ packed form
59794B49633l80k66j38j9n5j30J2L94Q16J156J482J863K292K772L291L719L775
59777B70217L272K312J227K88m57j054j465j621j604j579j534j333j077j130j631
59762B62831k189k331k078j792j632j457j203r96q83p17l62J83Q52J604K422L333
59746B55585M347N287N764N520M663L478K167R63K54K89Q43J501K113K713L077
59731B98564K781J694J03j636l303m693n616o100o309o289o009n618n315n009
59717B47245m376l404k464j870j550j323j185j182j228j166r37n98k93k09l91
59702B25069o28o71n36m54n26o74q25r88j133j165j032p15k05L36N42K44k03l19
59684B16117r6Q1N4M4K33N21P61Q67P24K84j93l32j45J3n6j83j91n8K61P75J195
$$ plain form
59663 220676 221832 222653 223446 224743 226595 228565 230325 231880 233260 234390 235385 236676 238640 241280 244297
59648 244297 247372 250329 253198 256187 259484 263041 266617 270003 273089 275800 278093 279956 281254 281684
59634 281684 281119 279904 278543 277127 275393 273361 271589 270613 270320 270071 269279 267782 265829 263907 262486
59619 262486 261688 261207 260608 259748 258791 257915 257138 256437 255879 255527 255271 254898 254368 253942 253962 254527 255419 256273 256798
59600 256798 256888 256664 256384 256262 256307 256391 256387 256195 255752 255132 254593 254393 254579 255087 255917 257032 258156 258961 259422 259720
59580 259720 259822 259449 258472 257036 255197 252800 249820 246542 243222 239887 236603 233621 231041 228639 226294
59565 226294 224319 223062 222420 222032 221720 221443 221078 220619 220431 220874 221770 222602 223171 223685 224259 224754 225108 225436
59547 225436 225697 225628 225165 224653 224477 224662 224949 225164 225359 225699 226293 227078 227852 228462 228964 229545 230306 231125 231647
$$ packed form
59663B20676J156Q21P93J297J852J970J760J555J380J130R95J291J964K640L017
59648B44297L075K957K869K989L297L557L576L386L086K711K293J863J298M30
59634B81684n65j215j361j416j734k032j772r76k93k49p92j497j953j922j421
59619B62486p98m81n99q60r57q76p77p01n58l52k56l73n30m26K0N65Q92Q54N25
59600B56798R0k24k80j22M5Q4mj92m43o20n39k00J86N08Q30J115J124Q05M61K98
59580B59720J02l73r77j436j839k397k980l278l320l335l284k982k580k402k345
59565B26294j975j257o42l88l12k77l65m59j88M43Q96Q32N69N14N74M95L54L28
59547B25436K61o9m63n12j76J85K87K15J95L40N94P85P74O10N02N81P61Q19N22
$$ plain form
59528 231647 231414 230175 228181 226054 224243 222702 221182 219658 218344 217422 216931 216728 216459 215708 214423 213022
59512 213022 211911 211092 210456 210199 210597 211528 212574 213520 214477 215549 216695 217860 218973 219883 220530 221092 221688
59495 221688 222025 221653 220485 218805 216874 214874 213152 212080 211591 211223 210720 210320 210351 210793 211308 211542 211375
59478 211375 211051 211017 211404 211754 211477 210510 209294 208207 207387 206983 207120 207578 207889 207851 207656 207475 207276 207087 207062
59459 207062 207223 207489 207987 208928 210098 210916 211187 211370 211909 212680 213388 214112 215126 216487 218183 220470 223685
59442 223685 227857 232856 238900 246555 256190 267521 279575 290873 299756 304964 306215 304283 300513
59429 300513 296164 292065 288618 286005 284317 283541 283532 284053 284791 285296 285064 283830 281663 278653 274694 269771
59413 269771 264284 258745 253286 247770 242333 237403 233190 229547 226358 223725 221687 220097 218863 217975
$$ packed form
59528B31647k33j239j994k127j811j541j520j524j314r22m91k03k69p51j285j401
59512B13022j111q19o36k57L98R31J046R46R57J072J146J165J113R10O47N62N96
59495B21688L37l72j168j680j931k000j722j072m89l68n03m00L1M42N15K34j67
59478B11375l24l4L87L50k77r67j216j087q20m04J37M58L11l8j95j81j99j89k5
59459B07062J61K66M98R41J170Q18K71J83N39P71P08P24J014J361J696K287L215
59442B23685M172M999O044P655R635J1331J2054J1298Q883N208J251j932l770
59429C00513m349m099l447k613j688p76rN21P38N05k32j234k167l010l959m923
59413B69771n487n539n459n516n437m930m213l643l189k633k038j590j234q88
$$ plain form
59399 217975 217270 216547 216011 216130 216848 217378 217030 215927 214641 213481 212472 211692 211194 210756 210094 209269 208649
59382 208649 208518 208937 209878 211233 212817 214532 216435 218484 220367 221830 223056 224492 226371 228594 230984
59367 230984 233456 235988 238610 241377 244245 247081 249885 252872 256235 259939 263908 268198 272763 277239
59353 277239 281212 284639 287765 290683 293183 294983 295918 295944 295141 293643 291389 288011 283240 277423 271479
59338 271479 266279 262169 259029 256599 254702 253289 252366 251906 251900 252530 254177 257119 261252 266246 271934 278430
59322 278430 285896 294313 303474 312995 322339 331002 338870 346375 354141 362341 370321 376838 380660 381029
59308 381029 377784 371316 362527 352664 343064 334938 329291 326701 326996 329243 332229 334827 335897 334273
59294 334273 329345 321647 312532 303259 294545 286753 280003 274079 268694 263955 260252 257662 255845 254613
$$ packed form
59399B17975p05p23n36J19P18N30l48j103j286j160j009p80m98m38o62q25o20
59382B08649j31M19R41J355J584J715J903K049J883J463J226J436J879K223K390
59367B30984K472K532K622K767K868K836K804K987L363L704L969M290M565M476
59353B77239L973L427L126K918K500J800R35K6q03j498k254l378m771n817n944
59338B71479n200m110l140k430j897j413r23m60oO30J647K942M133M994N688O496
59322B78430P466Q417R161R521R344Q663P868P505P766Q200P980O517L822L69
59308C81029l245o468q789r863r600q126n647k590K95K247K986K598J070j624
59294C34273m928p698r115r273q714p792o750n924n385m739l703k590j817j232
$$ plain form
59280 254613 254108 254257 254526 254524 254483 254841 255642 256684 257992 259725 261802 263958 266096 268299 270579 272897 275359
59263 275359 278170 281394 284951 288796 293000 297663 302852 308539 314584 320898 327643 335031 342925 350861
59249 350861 358611 366410 374493 382716 390761 398388 405204 410553 413995 415671 415874 414428 410863 405062
59235 405062 397397 388371 378481 368331 358474 349102 340121 331548 323587 316380 309898 304092 298928 294326
59221 294326 290240 286762 283948 281629 279567 277752 276328 275283 274395 273490 272558 271704 271073 270790 270839 271116
59205 271116 271688 272841 274704 277065 279765 283155 287836 294022 301315 308932 315891 321138 323854 323704 320734
59190 320734 315235 307912 299900 292191 285078 278438 272432 267560 264106 261909 260735 260578 261560 263780 267262
59175 267262 271856 277188 282903 288850 294834 300368 304989 308735 311910 314450 315949 316339 316101 315689 315099
$$ packed form
59280B54613n05J49K69km1L58Q01J042J308J733K077K156K138K203K280K318K462
59263B75359K811L224L557L845M204M663N189N687O045O314O745P388P894P936
59249C50861P750P799Q083Q223Q045P627O816N349L442J676K03j446l565n801
59235D05062p665r026r890j0150r857r372q981q573p961p207o482n806n164m602
59221B94326m086l478k814k319k062j815j424j045q88r05r32q54o31k83M9K77
59205B71116N72J153J863K361K700L390M681O186P293P617O959N247K716j50k970
59190C20734n499p323q012p709p113o640o006m872l454k197j174j57R82K220L482
59175B67262M594N332N715N947N984N534M621L746L175K540J499L90k38m12n90
$$ plain form
59160 315099 314128 312732 310973 308902 306654 304379 301976 299129 295777 292342 289313 286867 285002 283773
59146 283773 283191 283083 283317 284043 285505 287695 290358 293244 296179 298959 301360 303264 304639 305423 305507 304812
59130 304812 303306 300966 297840 294118 290030 285676 281036 276202 271515 267361 263873 260924 258385 256239
59116 256239 254365 252463 250387 248449 247125 246444 245932 245211 244364 243601 242835 241800 240425 238838 237157 235473
59100 235473 234002 233053 232795 233127 233726 234220 234461 234660 235143 235939 236830 237766 238887 240073 240901 241286 241793 242962
59082 242962 244663 246498 248538 251143 254259 257415 260388 263361 266440 269491 272551 275993 280105 284788
59068 284788 289757 294790 299657 304047 307725 310614 312690 313903 314200 313449 311405 307976 303520 298686 293936
59053 293936 289392 285050 280892 276813 272705 268621 264658 260702 256587 252465 248713 245417 242271 239050
$$ packed form
59160C15099r71j396j759k071k248k275k403k847l352l435l029k446j865j229
59146B83773n82j08K34P26J462K190K663K886K935K780K401J904J375P84Q4o95
59130C04812j506k340l126l722m088m354m640m834m687m154l488k949k539k146
59116B56239j874j902k076j938j324o81n12p21q47p63p66j035j375j587j681j684
59100B35473j471r49k58L32N99M94K41J99M83P96Q91R36J121J186Q28L85N07J169
59082B42962J701J835K040K605L116L156K973K973L079L051L060L442M112M683
59068B84788M969N033M867M390L678K889K076J213K97p51k044l429m456m834m750
59053B93936m544m342m158m079m108m084l963l956m115m122l752l296l146l221
$$ plain form
59039 239050 235914 233124 230684 228440 226352 224508 222944 221528 220064 218534 217278 216775 217135 217933 218725
59024 218725 219535 220647 222135 223920 226141 229030 232473 236102 239875 244207 249465 255611 262424 269733
59010 269733 277371 285146 292991 300950 308932 316662 323889 330434 336072 340616 344093 346578 347865 347604
58996 347604 345776 342776 339039 334916 330882 327462 324797 322547 320368 318229 316224 314309 312355 310221
58982 310221 307749 304867 301705 298358 294627 290325 285805 281707 278187 274844 271550 268838 267163 266184
58968 266184 265110 263503 261500 259418 257448 255587 253706 251752 249893 248299 246812 245136 243413 242176
58954 242176 241633 241351 240891 240368 240145 240308 240747 241485 242565 243754 244672 245127 245155 244867 244447 244071 243653 242850
58936 242850 241583 240347 239802 240208 241484 243641 246795 250853 255449 260267 265309 270854 277238 284522 292241
$$ packed form
59039B39050l136k790k440k244k088j844j564j416j464j530j256n03L60P98P92
59024B18725Q10J112J488J785K221K889L443L629L773M332N258O146O813P309
59010B69733P638P775P845P959P982P730P227O545N638M544L477K485J287k61
58996C47604j828l000l737m123m034l420k665k250k179k139k005j915j954k134
58982C10221k472k882l162l347l731m302m520m098l520l343l294k712j675r79
58968B66184j074j607k003k082j970j861j881j954j859j594j487j676j723j237
58954B42176n43k82m60n23k23J63M39P38J080J189R18M55K8k88m20l76m18q03
58936B42850j267j236n45M06J276K157L154M058M596M818N042N545O384P284P719
$$ plain form
58921 292241 299548 305731 310530 313934 315905 316426 315685 313988 311588 308689 305538 302391 299481 297044 295252
58906 295252 294080 293415 293343 294104 295725 297964 300725 304209 308491 313181 317711 321756 325168 327776 329541
58891 329541 330747 331699 332291 332097 330885 328870 326485 324078 321794 319654 317742 316380 315991 316733 318398
58876 318398 320735 323709 327381 331709 336620 342103 348064 354200 360194 365938 371480 376839 382038 387194
58862 387194 392436 397747 402907 407545 411212 413598 414684 414577 413149 410052 405183 398897 391642 383572
58848 383572 374685 365190 355574 346362 337915 330336 323519 317404 312206 308210 305276 302827 300434 298228
58834 298228 296554 295415 294481 293523 292629 291987 291623 291341 290829 289833 288249 286104 283532 280842 278444 276555
58818 276555 275024 273653 272593 272174 272442 273093 273816 274443 274890 275296 276144 277886 280505 283785 287905 293244
$$ packed form
58921B92241P307O183M799L404J971N21p41j697k400k899l151l147k910k437j792
58906B95252j172o65p2P61J621K239K761L484M282M690M530M045L412K608J765
58891C29541J206R52N92j94j212k015k385k407k284k140j912j362l89P42J665
58876C18398K337K974L672M328M911N483N961O136N994N744N542N359N199N156
58862C87194N242N311N160M638L667K386J086j07j428l097m869o286p255q070
58848C83572q887r495r616r212q447p579o817o115n198l996k934k449k393k206
58834B98228j674j139r34r58q94o42l64k82n12r96j584k145k572k690k398j889
58818B76555j531j371j060m19K68O51P23O27M47M06Q48J742K619L280M120N339
$$ plain form
58802 293244 299617 306349 313257 320967 329919 339576 348947 357578 365737 373979 382869 392786 403650 414952
58788 414952 426287 437615 448905 459818 469947 478995 486501 491781 494434 494624 492586 488209 481403
58775 481403 472532 462145 450584 438198 425670 413712 402674 392746 384321 377728 372780 368914 365644
58762 365644 362610 359448 355929 352146 348309 344526 340965 337923 335454 333150 330566 327626 324365 320617
58748 320617 316287 311637 306900 301876 296277 290229 284075 277914 271775 266014 261057 256892 253210 249954
58734 249954 247339 245443 244165 243433 243153 243086 243134 243582 244728 246419 248322 250411 252798 255279 257519 259514
58718 259514 261421 263063 264123 264755 265490 266495 267413 267940 268137 268112 267805 267200 266458 265705 264917 264014 262894
58701 262894 261425 259626 257744 255919 253912 251475 248829 246374 244045 241432 238532 235920 234085 232957
$$ packed form
58802B93244O373O732O908P710Q952R657R371Q631Q159Q242Q890R917J0864J1302
58788D14952J1335J1328J1290J0913J0129R048P506N280K653J90k038m377o806
58775D81403q871j0387j1561j2386j2528j1958j1038r928q425o593m948l866l270
58762C65644l034l162l519l783l837l783l561l042k469k304k584k940l261l748
58748C20617m330m650m737n024n599o048o154o161o139n761m957m165l682l256
58734B49954k615j896j278p32k80o7M8M48J146J691J903K089K387K481K240J995
58718B59514J907J642J060O32P35J005R18N27J97k5l07o05p42p53p88r03j120
58701B62894j469j799j882j825k007k437k646k455k329k613k900k612j835j128
$$ plain form
58687 232957 232219 231748 231549 231525 231512 231458 231443 231558 231784 232001 232174 232500 233219 234276 235429 236701 238378 240371
58669 240371 241991 242642 242439 241847 241038 239982 238845 237859 237009 236275 235950 236291 237002 237543 237787 237956 238040 237764
58651 237764 237060 236139 235142 234133 233363 233166 233584 234396 235468 236773 238251 239985 242359 245634 249511 253527
58635 253527 257726 262552 268163 274301 280707 287232 293612 299534 304868 309490 313053 315370 316858 318102
58621 318102 319110 319507 319347 319189 319404 319941 320763 321954 323390 324765 326054 327477 328959 329986 330092 329113
58605 329113 327003 323736 319391 313984 307288 299179 290068 280614 271135 261705 252650 244431 237112 230459
58591 230459 224469 219325 214935 211069 207854 205540 203818 202003 199923 198066 196825 196129 195813 195779 195800 195766
58575 195766 196146 197607 200128 203152 206587 210924 216244 221907 227556 233694 240897 248958 257184 264974
$$ packed form
58687B32957p38m71j99k4j3n4j5J15K26K17J73L26P19J057J153J272J677J993
58669B40371J620O51k03n92q09j056j137r86q50p34l25L41P11N41K44J69Q4k76
58651B37764p04r21r97j009p70j97M18Q12J072J305J478J734K374L275L877M016
58635B53527M199M826N611O138O406O525O380N922N334M622L563K317J488J244
58621C18102J008L97j60j58K15N37Q22J191J436J375J289J423J482J027J06r79
58605C29113k110l267m345n407o696q109r111r454r479r430r055q219p319o653
58591B30459n990n144m390l866l215k314j722j815k080j857j241o96l16l4K1l4
58575A95766L80J461K521L024L435M337N320N663N649O138P203Q061Q226P790
$$ plain form
58561 264974 271747 276798 279680 280495 279501 276743 272308 266648 260407 254136 248279 243113 238596 234556 231081
58546 231081 228420 226516 225058 223979 223427 223239 222981 222618 222549 222859 223081 222887 222473 221989 221134 219663 217899
58529 217899 216416 215569 215539 216456 218214 220470 223099 226385 230612 235698 241315 247074 252551 257484 262026
58514 262026 266460 270643 274110 276689 278574 279749 279907 278988 277318 275109 272357 269302 266397 263688 260770
58499 260770 257539 254430 251718 249178 246672 244535 243055 242121 241692 242141 243774 246385 249627 253469 257981
58484 257981 262977 268146 273312 278382 283238 287741 291637 294510 296195 297169 298098 299094 299942 300938 302806
58469 302806 305822 309750 314723 321388 329950 339817 350493 362131 374768 387566 399238 408874 416166
58456 416166 421274 424674 426709 427167 425793 423170 420443 418104 415766 413204 410782 408558 405816 401873
$$ packed form
58561B64974O773N051K882Q15r94k758m435n660o241o271n857n166m517m040l475
58546B31081k661j904j458j079n52j88k58l63o9L10K22j94m14m84q55j471j764
58529B17899j483q47l0R17J758K256K629L286M227N086N617N759N477M933M542
58514B62026M434M183L467K579J885J175J58r19j670k209k752l055k905k709k918
58499B60770l231l109k712k540k506k137j480r34m29M49J633K611L242L842M512
58484B57981M996N169N166N070M856M503L896K873J685R74R29R96Q48R96J868
58469C02806L016L928M973O665Q562R867J0676J1638J2637J2798J1672R636P292
58456D16166N108L400K035M58j374k623k727k339k338k562k422k224k742l943
$$ plain form
58442 401873 396739 390700 383954 376945 370323 364199 358143 352183 347037 343027 339552 336088 332869 330142
58428 330142 327590 325089 323324 322960 323862 325678 328592 332821 337958 343414 349025 354689 359868 364022 367105
58413 367105 369210 370196 370038 368986 367027 363798 359396 354577 349727 344388 338255 331834 325564 319095 312154
58398 312154 305353 299423 294294 289682 285876 283181 281178 279381 278054 277616 277794 278173 279055 280941 283640
58383 283640 286742 290508 295442 301296 307309 313098 318554 323194 326369 327843 327585 325355 321193 315935
58369 315935 310547 305269 299969 294912 290487 286622 283209 280730 279792 280325 281856 284165 287111 290294 293561
58354 293561 297341 301799 306139 309406 311493 312686 312825 311736 309972 308235 306513 304582 302865 301910 301462
58339 301462 300974 300662 301104 302161 303222 304253 305680 307491 309340 311331 313862 316867 319984 323290 327141
$$ packed form
58442D01873n134o039o746p009o622o124o056n960n146m010l475l464l219k727
58428C30142k552k501j765l64R02J816K914M229N137N456N611N664N179M154L083
58413C67105K105R86j58j052j959l229m402m819m850n339o133o421o270o469o941
58398C12154o801n930n129m612l806k695k003j797j327m38J78L79Q82J886K699
58383B83640L102L766M934N854O013N789N456M640L175J474k58k230m162n258
58369C15935n388n278n300n057m425l865l413k479r38N33J531K309K946L183L267
58354B93561L780M458M340L267K087J193J39j089j764j737j722j931j717r55m48
58339C01462m88l12M42J057J061J031J427J811J849J991K531L005L117L306L851
$$ plain form
58324 327141 331456 335767 339729 343022 345191 346173 346551 346601 345647 343062 339318 335229 330813 325844 320885
58309 320885 316662 312879 308775 304483 300752 297672 294808 292356 290981 290657 290704 290908 291640 292988 294670
58294 294670 296699 299223 301810 303666 304493 304484 303758 302538 301481 301041 300861 300561 300640 301755 303640 305715 308260
58277 308260 311858 316142 320213 323962 327814 331539 334517 336977 339796 343185 346638 349981 353444 356811
58263 356811 359552 361681 363611 365389 366896 368429 370124 371178 370681 368921 366927 365168 363670 362877 363231
58248 363231 364320 365567 367381 370499 374675 379214 384308 390568 397702 404964 412470 420752 429359 437249
58234 437249 444154 450285 455173 458178 459730 460668 460830 459706 457967 456769 455987 454718 453126 452178 451929
58219 451929 451758 451938 453308 455638 457981 460333 463364 466889 470257 473865 478560 483968 489183 494638 501406
$$ packed form
58324C27141M315M311L962L293K169R82L78N0r54k585l744m089m416m969m959
58309C20885m223l783m104m292l731l080k864k452j375l24M7K04P32J348J682
58294B94670K029K524K587J856Q27rp26j220j057m40j80l00P9J115J885K075K545
58277C08260L598M284M071L749L852L725K978K460K819L389L453L343L463L367
58263C56811K741K129J930J778J507J533J695J054m97j760j994j759j498p93L54
58248C63231J089J247J814L118M176M539N094O260P134P262P506Q282Q607P890
58234D37249O905O131M888L005J552R38J62j124j739j198p82j269j592r48k49
58219D51929j71J80J370K330K343K352L031L525L368L608M695N408N215N455O768
$$ plain form
58204 501406 509089 516411 523464 531266 539448 546550 552410 558109 563789 568724 573299 578652 584516 589718
58190 589718 594656 600908 608434 615673 622413 630093 639080 648191 657150 667063 678139 689319 700471
58177 700471 712639 725840 738929 751859 765769 780691 795566 810586 827022 844647 861994
58166 861994 879228 898035 918499 938928 958929 979740 1001312 1022118 1042154 1063009 1084611
58155 1084611 1105101 1124410 1144690 1166716 1189208 1212314 1238270 1267764 1298946 1330885 1364718
58144 1364718 1400688 1437458 1475118 1515402 1558205 1601486 1645250 1691897 1742012 1793876 1847848
58133 1847848 1906911 1971850 2040291 2111548 2187967 2270308 2356508 2446345 2542692 2646808 2757189
58122 2757189 2874328 3001488 3139399 3285506 3439858 3606214 3785955 3977095 4180943
$$ packed form
58204E01406P683P322P053P802Q182P102N860N699N680M935M575N353N864N202
58190E89718M938O252P526P239O740P680Q987R111Q959R913J1076J1180J1152
58177G00471J2168J3201J3089J2930J3910J4922J4875J5020J6436J7625J7347
58166H61994J7234J8807K0464K0429K0001K0811K1572K0806K0036K0855K1602
58155A084611K0490J9309K0280K2026K2492K3106K5956K9494L1182L1939L3833
58144A364718L5970L6770L7660M0284M2803M3281M3764M6647N0115N1864N3972
58133A847848N9063O4939O8441P1257P6419Q2341Q6200Q9837R6347J04116J10381
58122B757189J17139J27160J37911J46107J54352J66356J79741J91140K03848
$$ plain form
58113 4180943 4403284 4647226 4911695 5198948 5516131 5867274 6251802 6673584 7142996
58104 7142996 7667264 8248230 8893235 9618586 10439021 11365550 12419286 13636926 15059405
58095 15059405 16730931 18717733 21114559 24026618 27564033 31866345 37118598 43543741
58087 43543741 51419580 61120646 73063164 87457556 103976287 121561836 138484102
58080 138484102 152608727 161839338 164697236 160836557 151166933 137459892 121701687
58073 121701687 105585723 90305662 76554503 64609331 54462710 45965621 38920987
58066 38920987 33114957 28333293 24387768 21127834 18427364 16175212 14283129 12688235
58058 12688235 11339327 10188335 9197251 8341410 7599663 6948887 6371387 5858755 5403757
$$ packed form
58113D180943K22341K43942K64469K87253L17183L51143L84528M21782M69412
58104G142996N24268N80966O45005P25351Q20435R26529J053736J217640J422479
58095A5059405J671526J986802K396826K912059L537415M302312N252253O425143
58087D3543741P875839R701066J1942518J4394392J6518731J7585549J6922266
58080A38484102J4124625R230611K857898l860679r669624j3707041j5758205
58073A21701687j6115964j5280061j3751159j1945172j0146621q497089p044634
58066C8920987n806030m781664l945525l259934k700470k252152j892083j594894
58058A2688235j348908j150992r91084q55841p41747o50776n77500n12632m54998
$$ plain form
58049 5403757 4995427 4625469 4292027 3993033 3722168 3474725 3251147 3051202 2870313
58040 2870313 2704879 2555693 2422783 2301923 2189296 2084861 1988143 1895492 1804662 1717907
58030 1717907 1637540 1562266 1490550 1423660 1362566 1305351 1250315 1198382 1150075 1103456 1057443
58019 1057443 1013999 974691 938086 902737 869765 840206 812628 785628 760073 736769 714411
58008 714411 691896 670269 650457 631363 612034 593402 576182 559286 542068 525865 511630
57997 511630 498161 484346 471027 459043 447514 435645 424225 413838 403659 393438 384597 377831
57985 377831 371711 365145 359112 354376 349599 343486 336848 330785 324621 317403 309791 302730 295815 288536
57971 288536 281593 275476 269254 262277 255551 249981 244833 239425 234703 231552 229007 225817 222426 219822
$$ packed form
58049E403757m08330l69958l33442k98994k70865k47443k23578j99945j80889
58040B870313j65434j49186j32910j20860j12627j04435r6718r2651r0830q6755
58030A717907q0367p5274p1716o6890o1094n7215n5036n1933m8307m6619m6013
58019A057443m3444l9308l6605l5349l2972k9559k7578k7000k5555k3304k2358
58008G14411k2515k1627j9812j9094j9329j8632j7220j6896j7218j6203j4235
57997E11630j3469j3815j3319j1984j1529j1869j1420j0387j0179j0221q841o766
57985C77831o120o566o033m736m777o113o638o063o164p218p612p061o915p279
57971B88536o943o117o222o977o726n570n148n408m722l151k545l190l391k604
$$ plain form
57957 219822 217741 215614 214023 213596 213482 212417 210352 207783 204580 200755 197226 194504 191670 187895 183850
57942 183850 180407 177129 173326 169465 166196 163072 159519 156049 153220 150500 147381 144546 142627 140888
57928 140888 138494 136041 134421 133146 131225 128843 126803 125103 123386 122024 121415 120939 119851 118552 117769
57913 117769 117228 116351 115524 115465 115961 116402 116910 117847 118838 119407 119957 121057 122389 123361 124078 124766 125061 124864
57895 124864 125049 126178 127372 127620 127378 127620 128022 127491 125914 124062 122267 120403 118754 117655 116654 115103
57879 115103 113219 111594 110131 108480 106974 106033 105150 103586 101591 99886 98370 96513 94591 93371 92852
57864 92852 92403 91873 91526 91175 90424 89552 89179 89304 89558 90101 91300 92795 93845 94399 95004 95858 96740 97633
57846 97633 98633 99554 100362 101609 103693 106107 108259 110553 113751 117661 121466 125049 129003 133567 138432
$$ packed form
57957B19822k081k127j591m27j14j065k065k569l203l825l529k722k834l775m045
57942A83850l443l278l803l861l269l124l553l470k829k720l119k835j919j739
57928A40888k394k453j620j275j921k382k040j700j717j362o09m76j088j299p83
57913A17769n41q77q27n9M96M41N08R37R91N69N50J100J332R72P17O88K95j97
57895A24864J85J129J194K48k42K42M02n31j577j852j795j864j649j099j001j551
57879A15103j884j625j463j651j506r41q83j564j995j705j516j857j922j220n19
57864I2852m49n30l47l51p51q72l73J25K54N43J199J495J050N54O05Q54Q82Q93
57846I7633J000R21Q08J247K084K414K152K294L198L910L805L583L954M564M865
$$ plain form
57831 138432 143443 148564 153332 157157 160063 162455 164324 165294 165218 164108 161843 158606 155190 152157 149084
57816 149084 145301 140948 136549 132055 127193 122344 118170 114652 111357 108333 105940 104080 102401 100965
57802 100965 99980 99226 98455 97972 98023 98087 97586 96882 96701 97039 97513 98360 100074 102410 104654 106579 108256 109362
57784 109362 109649 109690 110123 110553 110202 109254 108446 107733 106555 105118 104116 103371 102015 99938 97837 95891 93588
57767 93588 90909 88431 86182 83593 80762 78597 77437 76564 75415 74281 73519 72973 72525 72352 72306 71815
57751 71815 70725 69540 68545 67386 65771 63954 62213 60479 58685 56998 55510 54109 52754 51442 49996
57736 49996 48369 47016 46404 46275 46066 45841 46062 46606 46925 47136 48048 49934 52104 53864 55177 56241 57108
57719 57108 57913 58825 59666 60147 60501 61274 62483 63638 64550 65416 66093 66107 65448 64613 63782 62633 61111 59610
$$ packed form
57831A38432N011N121M768L825K906K392J869R70p6j110k265l237l416l033l073
57816A49084l783m353m399m494m862m849m174l518l295l024k393j860j679j436
57802A00965r85p54p71m83N1O4n01p04j81L38M74Q47J714K336K244J925J677J106
57784A09362K87M1M33M30l51r48q08p13j178j437j002p45j356k077k101j946k303
57767I3588k679k478k249k589k831k165j160q73j149j134p62n46m48j73m6m91
57751G1815j090j185r95j159j615j817j741j734j794j687j488j401j355j312j446
57736D9996j627j353o12j29k09k25K21N44L19K11R12J886K170J760J313J064Q67
57719E7108Q05R12Q41M81L54P73J209J155R12Q66O77J4o59q35q31j149j522j501
$$ plain form
57701 59610 58326 57101 56027 55482 55449 55446 55245 55003 54634 53801 52603 51574 50846 50009 48896 47808 46882 45977
57683 45977 45239 45048 45209 45016 44292 43674 43624 43897 44172 44515 44966 45298 45436 45508 45368 44700 43705 43015 42745 42383
57663 42383 41758 41347 41359 41267 40596 39537 38495 37613 37019 36917 37151 37213 36922 36559 36272 35933 35694 35886 36234
57644 36234 35949 34854 33657 32810 31884 30439 28733 27092 25295 23091 20778 18738 16850 14781 12488
57629 12488 10116 7811 5850 4460 3347 1913 147 -1288 -2035 -2444 -2827 -3016 -2943 -2975 -3322 -3732 -4090
57612 -4090 -4685 -5556 -6307 -6896 -7866 -9343 -10589 -11087 -11404 -12341 -13827 -15269 -16485 -17625 -18596 -19247 -19818
57595 -19818 -20696 -21934 -23415 -25143 -27008 -28634 -29828 -30836 -31808 -32424 -32438 -32173 -32074 -32162 -32250 -32280 -32066 -31189
57577 -31189 -29529 -27464 -25143 -22032 -17619 -12062 -5686 1777 10959 22256 36047 53105 74214
$$ packed form
57701E9610j284j225j074n45l3lk01k42l69q33j198j029p28q37j113j088r26r05
57683D5977p38j91J61j93p24o18n0K73K75L43M51L32J38P2j40o68r95o90k70l62
57663D2383o25m11J2r2o71j059j042q82n94j02K34O2k91l63k87l39k39J92L48
57644C6234k85j095j197q47r26j445j706j641j797k204k313k040j888k069k293
57629A2488k372k305j961j390j113j434A47a288p47m09l83j89P3l2l47m10l58
57612d090n95q71p51n89r70j477j246m98l17r37j486j442j216j140r71o51n71
57595a9818q78j238j481j728j865j626j194j008r72o16j4K65R9q8q8l0K14Q77
57577c1189J660K065K321L111M413N557e686A777R182J1297J3791J7058K1109
$$ plain form
57564 74214 99430 127820 157385 184862 206208 218112 219207 209878 191620 166960 139284 111720
57552 111720 86122 63300 43730 27524 14142 2836 -6725 -14688 -21412 -27258 -32205 -36207 -39629
57539 -39629 -42849 -45727 -47981 -49780 -51479 -53006 -54049 -54628 -55008 -55306 -55655 -56448 -57858 -59342 -60221 -60593
57523 -60593 -61101 -61933 -62636 -62887 -62872 -62879 -63012 -63402 -64268 -65631 -67222 -68743 -70006 -70872 -71312 -71503 -71719 -72140 -72828
57504 -72828 -73700 -74408 -74528 -74075 -73616 -73657 -74160 -74837 -75600 -76433 -77144 -77595 -77987 -78608 -79475 -80465 -81538 -82633 -83579
57485 -83579 -84366 -85251 -86352 -87457 -88436 -89519 -90871 -92252 -93445 -94662 -96187 -97893 -99492 -100982 -102494
57470 -102494 -103962 -105282 -106539 -107768 -108812 -109723 -110901 -112465 -113847 -114465 -114479 -114455 -114601 -114841 -115291 -116112 -117108
57453 -117108 -117957 -118689 -119458 -120081 -120296 -120285 -120461 -120904 -121451 -122153 -123130 -124123 -124704 -124857 -124889 -124895 -124730 -124426 -124155 -123878
$$ packed form
57564G4214K5216K8390K9565K7477K1346J1904J095r329j8258k4660k7676k7564
57552A11720k5598k2822j9570j6206j3382B836f725p963o724n846m947m002l422
57539c9629l220k878k254j799j699j527j043n79l80k98l49p93j410j484q79l72
57523f0593n08q32p03k51J5pj33l90q66j363j591j521j263q66m40j91k16m21o88
57504g2828q72p08j20M53M59m1n03o77p63q33p11m51l92o21q67r90j073j095r46
57485h3579p87q85j101j105r79j083j352j381j193j217j525j706j599j490j512
57470a02494j468j320j257j229j044r11j178j564j382o18j4K4j46k40m50q21r96
57453a17108q49p32p69o23k15J1j76m43n47p02r77r93n81j53l2oJ65L04K71K77
$$ plain form
57433 -123878 -123458 -123088 -123166 -123758 -124512 -125037 -125124 -124768 -124371 -124696 -126191 -128385 -130353 -131677 -132604 -133444 -134239 -134943
57415 -134943 -135496 -135763 -135758 -135850 -136381 -137143 -137635 -137763 -137906 -138337 -138969 -139627 -140220 -140590 -140575 -140291 -140145 -140488 -141393 -142684
57395 -142684 -144021 -145073 -145789 -146423 -147229 -148277 -149626 -151328 -153130 -154572 -155615 -156769 -158315 -159820 -160863
57380 -160863 -161761 -163045 -164585 -165862 -166864 -168062 -169583 -171038 -172163 -173121 -174107 -175059 -175825 -176325 -176596 -176910
57364 -176910 -177694 -179028 -180411 -181321 -181797 -182172 -182516 -182770 -183136 -183792 -184446 -184729 -184906 -185621 -187025 -188650 -190120
57347 -190120 -191486 -192862 -194195 -195455 -196674 -197781 -198665 -199361 -199921 -200266 -200477 -201001 -202128 -203515 -204687 -205793
57331 -205793 -207319 -209185 -210761 -211746 -212503 -213441 -214567 -215728 -216848 -217828 -218548 -219054 -219514 -220031 -220671 -221512 -222441
57314 -222441 -223161 -223710 -224656 -226321 -228160 -229435 -230234 -231189 -232461 -233679 -234752 -235961 -237258 -238207 -238680 -239019
$$ packed form
57433a23878M20L70p8n92p54n25q7L56L97l25j495k194j968j324r27q40p95p04
57415a34943n53k67Nr2n31p62m92j28j43m31o32o58n93l70J5K84J46l43r05j291
57395a42684j337j052p16o34q06j048j349j702j802j442j043j154j546j505j043
57380a60863q98j284j540j277j002j198j521j455j125r58r86r52p66n00k71l14
57364a76910p84j334j383r10m76l75l44k54l66o56o54k83j77p15j404j625j470
57347a90120j366j376j333j260j219j107q84o96n60l45k11n24j127j387j172j106
57331b05793j526j866j576r85p57r38j126j161j120r80p20n06m60n17o40q41r29
57314b22441p20n49r46j665j839j275p99r55j272j218j073j209j297r49m73l39
$$ plain form
57298 -239019 -239423 -239805 -240292 -241206 -242428 -243415 -244035 -244808 -246068 -247464 -248589 -249605 -250903 -252490 -254032 -255253
57282 -255253 -256109 -256764 -257576 -258855 -260517 -262183 -263636 -264925 -266097 -267161 -268335 -269899 -271724 -273321 -274485
57267 -274485 -275548 -276871 -278372 -279695 -280589 -281049 -281252 -281476 -281913 -282573 -283442 -284624 -286134 -287684 -288973 -290014
57251 -290014 -290945 -291690 -292166 -292674 -293696 -295377 -297514 -299925 -302504 -305084 -307613 -310326 -313365 -316417 -319131
57236 -319131 -321683 -324464 -327388 -329995 -332080 -333762 -335131 -336324 -337781 -339798 -341942 -343518 -344537 -345644
57222 -345644 -347138 -348726 -350217 -351814 -353611 -355373 -356934 -358350 -359636 -360804 -362167 -364052 -366200 -367978
57208 -367978 -369220 -370369 -371804 -373555 -375612 -377951 -380237 -382116 -383827 -385961 -388551 -391066 -393309 -395663
57194 -395663 -398314 -400938 -403370 -405930 -408802 -411666 -414244 -416788 -419754 -423358 -427632 -432509 -437691 -442833
$$ packed form
57298b39019m04l82m87r14j222r87o20p73j260j396j125j016j298j587j542j221
57282b55253q56o55q12j279j662j666j453j289j172j064j174j564j825j597j164
57267b74485j063j323j501j323q94m60k03k24m37o60q69j182j510j550j289j041
57251b90014r31p45m76n08j022j681k137k411k579k580k529k713l039l052k714
57236c19131k552k781k924k607k085j682j369j193j457k017k144j576j019j107
57222c45644j494j588j491j597j797j762j561j416j286j168j363j885k148j778
57208c67978j242j149j435j751k057k339k286j879j711k134k590k515k243k354
57194c95663k651k624k432k560k872k864k578k544k966l604m274m877n182n142
$$ plain form
57180 -442833 -447990 -453522 -459441 -465282 -470665 -475546 -479859 -483395 -486133 -488234 -489585 -489843 -489043 -487739 -486435
57165 -486435 -485290 -484426 -483998 -483863 -483656 -483331 -483237 -483532 -484001 -484541 -485412 -486827 -488660 -490648 -492618 -494501 -496416
57148 -496416 -498633 -501136 -503476 -505473 -507786 -511177 -515461 -519875 -524255 -529048 -534323 -539677 -545154 -551349
57134 -551349 -558445 -565930 -573436 -581078 -588799 -596155 -603013 -609773 -616618 -623230 -629453 -635576 -641694 -647429
57120 -647429 -652604 -657607 -662877 -668501 -674519 -681067 -688047 -695175 -702495 -710324 -718617 -726985 -735427 -744397
57106 -744397 -754055 -764071 -774242 -784637 -795066 -805099 -814691 -824143 -833412 -842234 -850965 -860444 -870852
57093 -870852 -881540 -892151 -903090 -914687 -926782 -939431 -953214 -968461 -984816 -1001831 -1019356
57082 -1019356 -1037183 -1055041 -1073142 -1092058 -1111814 -1131806 -1151714 -1171860 -1192547 -1213817 -1235900
$$ packed form
57180d42833n157n532n919n841n383m881m313l536k738k101j351k58Q00J304J304
57165d86435J145Q64M28J35K07L25R4k95m69n40q71j415j833j988j970j883j915
57148d96416k217k503k340j997k313l391m284m414m380m793n275n354n477o195
57134e51349p096p485p506p642p721p356o858o760o845o612o223o123o118n735
57120f47429n175n003n270n624o018o548o980p128p320p829q293q368q442q970
57106g44397r658j0016j0171j0395j0429j0033r592r452r269q822q731r479j0408
57093h70852j0688j0611j0939j1597j2095j2649j3783j5247j6355j7015j7525
57082a019356j7827j7858j8101j8916j9756j9992j9908k0146k0687k1270k2083
$$ plain form
57071 -1235900 -1259030 -1282686 -1305862 -1328237 -1350309 -1372326 -1394015 -1415480 -1437308 -1459601 -1481803
57060 -1481803 -1503850 -1526751 -1551959 -1580957 -1615331 -1656101 -1702694 -1753452 -1807192 -1863444 -1921483
57049 -1921483 -1980534 -2041044 -2104445 -2171529 -2242221 -2316969 -2396856 -2482099 -2571868 -2665881 -2764884
57038 -2764884 -2869290 -2978829 -3093840 -3215592 -3344977 -3482220 -3628067 -3783795 -3949802
57029 -3949802 -4125632 -4311613 -4508924 -4717924 -4938110 -5169979 -5415208 -5674847 -5949210
57020 -5949210 -6239845 -6549666 -6880831 -7234494 -7612950 -8019982 -8458805 -8931912 -9443354
57011 -9443354 -9998881 -10603547 -11261698 -11979914 -12767648 -13634930 -14592605 -15655678 -16844028
57002 -16844028 -18180063 -19689745 -21407512 -23378294 -25656260 -28308082 -31421369 -35109490
$$ packed form
57071a235900k3130k3656k3176k2375k2072k2017k1689k1465k1828k2293k2202
57060a481803k2047k2901k5208k8998l4374m0770m6593n0758n3740n6252n8039
57049a921483n9051o0510o3401o7084p0692p4748p9887q5243q9769r4013r9003
57038b764884j04406j09539j15011j21752j29385j37243j45847j55728j66007
57029c949802j75830j85981j97311k09000k20186k31869k45229k59639k74363
57020e949210k90635l09821l31165l53663l78456m07032m38823m73107n11442
57011i443354n55527o04666o58151p18216p87734q67282r57675j063073j188350
57002a6844028j336035j509682j717767j970782k277966k651822l113287l688121
$$ plain form
56994 -35109490 -39511353 -44794440 -51160966 -58845432 -68099958 -79175708 -92300831 -107647692
56986 -107647692 -125299617 -145240477 -167363497 -191466355 -217222893 -244162146 -271667536
56979 -271667536 -298964059 -325089280 -348925577 -369361541 -385514679 -396853685 -403143566
56972 -403143566 -404300561 -400295630 -391163227 -377083485 -358478945 -336066234 -310814223
56965 -310814223 -283812840 -256122874 -228678757 -202251108 -177432090 -154627105 -134064749
56958 -134064749 -115826059 -99875809 -86088905 -74279930 -64235069 -55734291 -48561800
56951 -48561800 -42514996 -37414189 -33105149 -29454375 -26346687 -23687068 -21399260 -19419962
56943 -19419962 -17695957 -16185331 -14855999 -13680754 -12635565 -11701949 -10866692 -10117774
$$ packed form
56994c5109490m401863n283087o366526p684466r254526j1075750j3125123j5346861
56986a07647692j7651925j9940860k2123020k4102858k5756538k6939253k7505390
56979b71667536k7296523k6125221k3836297k0435964j6153138j1339006o289881
56972d03143566j156995M004931R132403J4079742J8604540K2412711K5252011
56965c10814223K7001383K7689966K7444117K6427649K4819018K2804985K0562356
56958a34064749J8238690J5950250J3786904J1808975J0044861Q500778P172491
56951d8561800O046804N100807M309040L650774L107688K659619K287808J979298
56943a9419962J724005J510626J329332J175245J045189R33616Q35257P48918
$$ plain form
56935 -10117774 -9442905 -8832120 -8278500 -7775492 -7316142 -6895506 -6511084 -6160100 -5838767
56926 -5838767 -5544845 -5278461 -5039272 -4824373 -4629025 -4447296 -4271865 -4096008 -3917136
56917 -3917136 -3737144 -3559122 -3385408 -3218583 -3061575 -2915619 -2779746 -2652891 -2534937
56908 -2534937 -2425343 -2322663 -2226049 -2135673 -2051139 -1971041 -1894574 -1822082 -1753598 -1688340 -1626016
56897 -1626016 -1567089 -1511351 -1457743 -1405979 -1356846 -1310468 -1265791 -1222264 -1180476 -1140626 -1101853
56886 -1101853 -1063729 -1026963 -991958 -957981 -924430 -891751 -860367 -829883 -800033 -771436 -744710
56875 -744710 -719677 -695974 -673614 -652561 -632553 -613661 -596188 -579770 -563502 -547207 -531590
56864 -531590 -516948 -502697 -488416 -474334 -460459 -446290 -431681 -417043 -402378 -387064 -370895
$$ packed form
56935a0117774O74869O10785N53620N03008M59350M20636L84422L50984L21333
56926e838767K93922K66384K39189K14899J95348J81729J75431J75857J78872
56917c917136J79992J78022J73714J66825J57008J45956J35873J26855J17954
56908b534937J09594J02680R6614R0376Q4534Q0098P6467P2492O8484O5258O2324
56897a626016N8927N5738N3608N1764M9133M6378M4677M3527M1788L9850L8773
56886a101853L8124L6766L5005L3977L3551L2679L1384L0484K9850K8597K6726
56875g44710K5033K3703K2360K1053K0008J8892J7473J6418J6268J6295J5617
56864e31590J4642J4251J4281J4082J3875J4169J4609J4638J4665J5314J6169
$$ plain form
56853 -370895 -354447 -338201 -322299 -307375 -294586 -284440 -276416 -269921 -264715 -260266 -255742 -250880 -245911
56840 -245911 -240529 -234012 -226481 -218818 -211139 -202588 -192979 -183268 -173868 -163723 -151739 -138059 -123308
56827 -123308 -107649 -91352 -75493 -61376 -49898 -41844 -37894 -37735 -39867 -42799 -45814 -48405 -49961
56814 -49961 -50544 -51026 -51851 -52387 -51947 -50692 -49050 -47109 -45058 -43424 -42263 -40834 -38573 -35707 -32510 -28730
56798 -28730 -24275 -19691 -15392 -11116 -6605 -2137 2139 6617 11410 15852 19366 22268 25194 28329
56784 28329 31615 35054 38287 40552 41622 42204 42943 43625 43757 43243 42028 39819 36755 33742 31582 30284
56768 30284 29676 29967 31198 32863 34739 37472 41724 47299 53792 61527 71163 82747 95804 109852
56754 109852 124128 137126 147100 153003 154632 152318 146925 139766 131977 124103 116572 110175 105683 103337
$$ packed form
56853c70895J6448J6246J5902J4924J2789J0146Q024O495N206M449M524M862M969
56840b45911N382O517P531P663P679Q551R609R711R400J0145J1984J3680J4751
56827a23308J5659J6297J5859J4117J1478Q054L950J59k132k932l015k591j556
56814d9961n83m82q25n36M40J255J642J941K051J634J161J429K261K866L197L780
56798b8730M455M584M299M276M511b137B139M478M793M442L514K902K926L135
56784B8329L286L439L233K265J070N82P39O82J32n14j215k209l064l013k160j298
56768C0284o08K91J231J665J876K733M252N575O493P735R636J1584J3057J4048
56754A09852J4276J2998R974N903J629k314n393p159p789p874p531o397m492k346
$$ plain form
56740 103337 103020 104586 107761 112171 117807 125121 134484 145997 159995 177101 197352 219681 242354
56727 242354 263313 279940 289474 290454 283474 270347 253098 233945 215207 198419 183867 171388
56715 171388 161088 152982 146681 142047 139577 139632 141830 145740 151655 160155 171389 185181 201170 218194
56701 218194 234036 246362 253646 255040 250242 240127 226842 212510 198212 184571 172484 162524
56689 162524 154308 147274 141637 137829 135563 134290 134136 135560 138468 142496 147811 154788 163042 171497
56675 171497 179246 185660 189910 191144 189136 184268 177024 168049 158431 149341 141393 134715 129340 125099
56661 125099 121461 118027 115020 112869 111562 110786 110326 109917 109109 107804 106576 105967 105778 105513 105086 104630
56645 104630 104016 103163 102399 101986 101648 101104 100610 100413 100151 99456 98713 98475 98556 98453 98309 98618 99292 99826 100197
$$ packed form
56740A03337l17J566L175M410N636P314R363J1513J3998J7106K0251K2329K2673
56727B42354K0959J6627R534R80o980j3127j7249j9153j8738j6788j4552j2479
56715A71388j0300q106o301m634k470N5K198L910N915Q500J1234J3792J5989J7024
56701B18194J5842J2326P284J394m798j0115j3285j4332j4298j3641j2087r960
56689A62524q216p034n637l808k266j273j54J424K908M028N315O977Q254Q455
56675A71497P749O414M250J234k008m868p244q975r618r090p948o678n375m241
56661A25099l638l434l007k151j307p76m60m09q08j305j228o09j89k65m27m56
56645A04630o14q53p64m13l38n44m94j97k62o95p43k38Q1j03j44L09O74N34L71
$$ plain form
56626 100197 100814 101716 102522 103069 103484 103762 103920 104347 105353 106593 107549 108351 109425 110550 111082 110998 110949 111259
56608 111259 111587 111591 111341 111020 110763 110797 111215 111662 111693 111384 111162 111190 111350 111663 112190 112686 112856 112804 112776 112701 112449
56587 112449 112264 112349 112324 111697 110653 109744 109040 108271 107576 107381 107663 108043 108470 109134 109810 110028 109845 109787 110049
56568 110049 110376 110675 111108 111638 112131 112865 114252 116076 117619 118560 119139 119509 119593 119600 120019 120959 122045 123061
56550 123061 124190 125573 127116 128696 130193 131363 132123 132829 133783 134683 135114 135331 135937 136959 137938 138713
56534 138713 139345 139463 138565 136962 135578 134746 133978 132933 131766 130438 128595 126403 124687 123873 123447 122797
56518 122797 121967 121260 120687 120200 119990 120139 120343 120268 119922 119470 118981 118500 118056 117544 116879 116296 116140 116361 116569
56499 116569 116559 116444 116343 116328 116600 117251 117957 118352 118625 119200 119967 120433 120527 120631 120844 120874 120698 120662 120858 120977
$$ packed form
56626A00197O17R02Q06N47M15K78J58M27J006J240R56Q02J074J125N32q4m9L10
56608A11259L28Mk50l21k57L4M18M47L1l09k22K8J60L13N27M96J70n2k8p5k52
56587A12449j85Q5k5o27j044r09p04p69o95j95K82L80M27O64O76K18j83n8K62
56568A10049L27K99M33N30M93P34J387J824J543R41N79L70Q4PM19R40J086J016
56550A23061J129J383J543J580J497J170P60P06R54R00M31K17O06J022R79P75
56534A38713O32J18q98j603j384q32p68j045j167j328j843k192j716q14m26o50
56518A22797q30p07n73m87k10J49K04p5l46m52m89m81m44n12o65n83j56K21K08
56499A16569j0j15j01j5K72O51P06L95K73N75P67M66R4J04K13L0j76l6J96J19
$$ plain form
56479 120977 120913 120936 121183 121507 121908 122535 123201 123440 123138 122618 122068 121432 120893 120891 121567 122688 124130 125909 127755
56460 127755 129296 130624 132104 133616 134692 135423 136472 138096 139876 141525 143181 144750 145761 146150 146508
56445 146508 147174 147718 147671 147243 146980 147120 147525 147836 147586 146609 145475 145016 145366 145961 146427 146819 146961 146382 145124
56426 145124 143868 143029 142354 141672 141304 141404 141526 141226 140623 140031 139564 139328 139485 139869 140036 139875 139693 139557
56408 139557 139148 138412 137726 137227 136643 135989 135728 135974 136221 136171 136139 136295 136218 135662 135137 135245 135908 136684 137383 138021
56388 138021 138568 139084 139706 140308 140573 140523 140462 140317 139701 138715 137945 137459 136653 135373 134345 134066 134076 133831 133530
56369 133530 133527 133614 133521 133480 133721 133966 134029 134318 135129 135962 136165 135803 135291 134665 133829 133106 132881 133011 133184 133479 134051
56348 134051 134591 134722 134649 134875 135490 136182 136732 137099 137260 137364 137808 138776 139962 141025 141975 142824 143264 143092
$$ packed form
56479A20977o4K3K47L24M01O27O66K39l02n20n50o36n39kO76J121J442J779J846
56460A27755J541J328J480J512J076P31J049J624J780J649J656J569J011L89L58
56445A46508O66N44m7m28k63J40M05L11k50r77j134m59L50N95M66L92J42n79j258
56426A45124j256q39o75o82l68J00J22l00o03n92m67k36J57L84J67j61j82j36
56408A39557m09p36o86m99n84o54k61K46K47n0l2J56p7n56n25J08O63P76O99O38
56388A38021N47N16O22O02K65n0o1j45o16r86p70m86q06j280j028k79J0k45l01
56369A33530lQ7r3m1K41K45O3K89Q11Q33K03l62n12o26q36p23k25J30J73K95N72
56348A34051N40J31p3K26O15O92N50L67J61J04M44R68J186J063R50Q49M40j72
$$ plain form
56330 143092 142646 142404 142430 142488 142445 142238 141820 141397 141392 141911 142561 142966 143102 142968 142468 141809 141469 141509 141454 141086 140768
56309 140768 140699 140499 139884 139180 138788 138720 138988 139772 140848 141467 141310 140949 140971 141259 141608 142311 143544 144778 145428
56290 145428 145625 145806 146077 146460 147218 148383 149501 150354 151362 152763 154005 154540 154636 154836 155180 155537 156107
56273 156107 156925 157477 157423 157201 157238 157158 156488 155587 155145 155228 155509 155951 156579 157058 157235 157610 158575 159654 160182 160280
56253 160280 160432 160626 160665 160822 161403 162080 162411 162583 162876 162922 162316 161536 161373 161801 162242 162546 162935 163353 163724
56234 163724 164454 165791 167073 167515 167425 167685 168369 168819 168860 168974 169366 169783 170186 170847 171821 172999 174425 175970
56216 175970 176998 177135 177027 177549 178586 179451 180119 181118 182462 183711 184932 186597 188596 190273 191453 192587
56200 192587 193874 195049 196052 197198 198655 200370 202405 204773 207098 209070 211025 213445 216141 218646
$$ packed form
56330A43092m46k42K6N8m3k07m18m23nN19O50M05J36j34n00o59l40M0n5l68l18
56309A40768o9k00o15p04l92o8K68P84J076O19j57l61K2K88L49P03J233J234O50
56290A45428J97J81K71L83P58J165J118Q53J008J401J242N35R6K00L44L57N70
56273A56107Q18N52n4k22L7q0o70r01m42Q3K81M42O28M79J77L75R65J079N28R8
56253A60280J52J94L9J57N81O77L31J72K93M6o06p80j63M28M41L04L89M18L71
56234A63724P30J337J282M42r0K60O84M50M1J14L92M17M03O61R74J178J426J545
56216A75970J028J37j08N22J037Q65O68R99J344J249J221J665J999J677J180J134
56200A92587J287J175J003J146J457J715K035K368K325J972J955K420K696K505
$$ plain form
56186 218646 221101 223960 227126 230186 233289 236916 240977 244929 248663 252482 256403 260251 264263 268828
56172 268828 273817 278936 284460 290828 297757 304671 311754 319725 328774 338626 349396 361461 374698
56159 374698 388859 404587 423031 444529 468603 495216 525090 558799 596418 638092 684050
56148 684050 734054 787584 844587 905284 969230 1035210 1101917 1168092 1232207 1292680 1348154
56137 1348154 1396981 1436955 1466387 1485000 1492938 1489569 1474393 1448583 1414294 1372793 1324554 1270851
56125 1270851 1213753 1154636 1094092 1033278 973990 917222 862883 811063 762389 717066 674720
56114 674720 635370 599489 566978 537113 509587 484657 462275 442075 424143 408699 395086
56103 395086 382194 369869 358757 348929 339853 331615 324801 319185 313856 308687 304336 300765 297161
$$ packed form
56186B18646K455K859L166L060L103L627M061L952L734L819L921L848M012M565
56172B68828M989N119N524O368O929O914P083P971R049R852J0770J2065J3237
56159C74698J4161J5728J8444K1498K4074K6613K9874L3709L7619M1674M5958
56148F84050N0004N3530N7003O0697O3946O5980O6707O6175O4115O0473N5474
56137A348154M8827L9974K9432J8613P938l369j5176k5810l4289m1501m8239n3703
56125A270851n7098n9117o0544o0814n9288n6768n4339n1820m8674m5323m2346
56114F74720l9350l5881l2511k9865k7526k4930k2382k0200j7932j5444j3613
56103C95086j2892j2325j1112r828r076q238o814n616n329n169m351l571l604
$$ plain form
56090 297161 293448 290442 288306 286220 283855 281822 280419 279214 278109 277503 277164 276283 274922 274073 274011 273945
56074 273945 273573 273573 274162 274616 274677 275095 276249 277530 278617 280107 282369 284945 287545 290479 293699 296610
56058 296610 299249 302408 306201 309781 312914 316504 321035 325791 330207 334832 340350 346776 354151 362931
56044 362931 373197 384551 397265 412463 430824 452215 476891 505845 539577 577615 619384
56033 619384 664122 709651 752696 791026 824200 852249 875240 894440 912075 929143 944768
56022 944768 958013 968737 976280 979174 977008 971151 962945 952615 940332 926533 910422 889824
56010 889824 863472 832077 796644 757553 716131 675318 637602 603566 573207 547119 525503
55999 525503 507536 492659 481089 472405 465207 458940 454444 451977 450395 448957 448156 447961 447204 445607
$$ packed form
56090B97161l713l006k136k086k365k033j403j205j105o06l39q81j361q49o2o6
56074B73945l72%N89M54O1M18J154J281J087J490K262K576K600K934L220K911
56058B96610K639L159L793L580L133L590M531M756M416M625N518O426P375Q780
56044C62931J0266J1354J2714J5198J8361K1391K4676K8954L3732L8038M1769
56033F19384M4738M5529M3045L8330L3174K8049K2991J9200J7635J7068J5625
56022I44768J3245J0724P543K894k166n857q206j0330j2283j3799j6111k0598
56010H89824k6352l1395l5433l9091m1422m0813l7716l4036l0359k6088k1616
55999E25503j7967j4877j1570q684p198o267m496k467j582j438q01j95p57j597
$$ plain form
55985 445607 444520 444626 444877 444722 445329 447427 449955 452176 455118 459513 464231 468262 472440 477683 483278
55970 483278 488432 493766 499763 505434 510032 514419 519284 523693 526905 529862 533403 536761 539375 542356
55956 542356 546592 551146 555103 559215 564187 569229 573899 579441 586609 594128 600996 608305 617000 625918
55942 625918 633972 642213 651761 661732 671222 681300 692893 704763 715749 727025 739899 753416
55930 753416 766436 780039 795498 811786 827479 843203 859934 876843 893135 909998 928398
55919 928398 947087 965123 984133 1005642 1028485 1051342 1075382 1101738 1128929 1155620 1183394
55908 1183394 1213870 1245666 1277214 1309985 1345720 1383142 1420692 1459787 1501979 1545649 1589134
55897 1589134 1634343 1683646 1735988 1789812 1846793 1908770 1974042 2040798 2111065 2187053 2267021
$$ packed form
55985D45607j087J06K51j55O07K098K528K221K942M395M718M031M178N243N595
55970D83278N154N334N997N671M598M387M865M409L212K957L541L358K614K981
55956E42356M236M554L957M112M972N042M670N542P168P519O868P309Q695Q918
55942F25918Q054Q241R548R971R490J0078J1593J1870J0986J1276J2874J3517
55930G53416J3020J3603J5459J6288J5693J5724J6731J6909J6292J6863J8400
55919I28398J8689J8036J9010K1509K2843K2857K4040K6356K7191K6691K7774
55908A183394L0476L1796L1548L2771L5735L7422L7550L9095M2192M3670M3485
55897A589134M5209M9303N2342N3824N6981O1977O5272O6756P0267P5988P9968
$$ plain form
55886 2267021 2349260 2436625 2532327 2634884 2742307 2857450 2983720 3119297 3261446 3412704
55876 3412704 3576790 3752543 3938419 4138852 4359238 4598989 4856858 5138552 5451221
55867 5451221 5795328 6170580 6584916 7048519 7564562 8136378 8778475 9509701 10341978
55858 10341978 11288906 12380161 13655077 15151084 16916824 19031683 21595657 24708882
55850 24708882 28484403 33077187 38684250 45539486 53948904 64296093 76879361 91596019
55842 91596019 107687723 123724233 137809807 147937864 152483695 150743040 143220090
55835 143220090 131408844 117189124 102250451 87823051 74664067 63130234 53277253
55828 53277253 44988951 38089482 32388848 27689805 23807418 20592554 17927281 15706962
$$ packed form
55886B267021Q2239Q7365R5702J02557J07423J15143J26270J35577J42149J51258
55876C412704J64086J75753J85876K00433K20386K39751K57869K81694L12669
55867E451221L44107L75252M14336M63603N16043N71816O42097P31226Q32277
55858A0341978R46928J091255J274916J496007J765740K114859K563974L113225
55850B4708882L775521M592784N607063O855236Q409418J0347189J2583268J4716658
55842I1596019J6091704J6036510J4085574J0128057M545831j740655p522950
55835A43220090j1811246j4219720j4938673j4427400j3158984j1533833r852981
55828E3277253q288302o899469n700634m699043l882387l214864k665273k220319
$$ plain form
55820 15706962 13841505 12265743 10932112 9795663 8815953 7966741 7230963 6589197 6022241
55811 6022241 5520128 5078194 4687270 4336224 4020433 3738983 3486408 3255228 3043800
55802 3043800 2853882 2682818 2525271 2380309 2249729 2131365 2020675 1917116 1822685 1735875
55792 1735875 1653155 1574872 1503862 1439581 1379050 1322236 1271113 1224611 1179735 1136728 1098159
55781 1098159 1063710 1030556 998086 967758 939044 909815 880091 851379 823044 793269 762866
55770 762866 734260 707463 680799 654801 631606 611070 591174 571757 554319 538644 523047
55759 523047 507516 493359 480259 466890 453872 442875 433304 423105 412396 403067 395161 386918
55747 386918 378148 370413 363925 357275 350188 343684 337519 330261 321983 314268 307501 300649 293667 287683
$$ packed form
55820A5706962j865457j575762j333631j136449r79710q49212p35778o41766n66956
55811F022241n02113m41934l90924l51046l15791k81450k52575k31180k11428
55802C043800j89918j71064j57547j44962j30580j18364j10690j03559r4431q6810
55792A735875q2720p8283p1010o4281o0531n6814n1123m6502m4876m3007l8569
55781A098159l4449l3154l2470l0328k8714k9229k9724k8712k8335k9775l0403
55770G62866k8606k6797k6664k5998k3195k0536j9896j9417j7438j5675j5597
55759E23047j5531j4157j3100j3369j3018j0997r571j0199j0709r329p906q243
55747C86918q770p735o488o650p087o504o165p258q278p715o767o852o982n984
$$ plain form
55733 287683 282813 278114 273617 270073 266910 262774 257981 254100 251300 248448 245641 244158 243959 243579 242578
55718 242578 241861 241541 240700 239312 238305 237691 236701 235727 236059 237703 239504 241311 243904 246898 248893 249746
55702 249746 250492 251016 249990 247256 244072 240808 236557 231294 226289 221968 217411 212377 207878 204308 200851
55687 200851 197266 194503 193042 192196 191427 190750 189570 186837 182737 178696 175401 172330 169376 167283 166128
55672 166128 165063 163900 163317 163189 162316 160212 157620 154869 151311 146837 142441 138784 135527 132449 129885
55657 129885 127759 125571 123597 122713 122767 122595 121851 121291 120998 119946 117771 115406 113477 111552 109458 107842
55641 107842 106908 106006 104964 104434 104471 104207 103450 103113 103509 103675 103071 102493 102625 103027 103282 103804 104732 105268 104963
55622 104963 104481 104312 103864 102613 101094 99981 99153 98360 97795 97358 96382 94809 93609 93343 93295 92723 91990
$$ packed form
55733B87683m870m699m497l544l163m136m793l881k800k852k807j483j99l80j001
55718B42578p17l20q41j388j007o14r90r74L32J644J801J807K593K994J995Q53
55702B49746P46N24j026k734l184l264m251n263n005m321m557n034m499l570l457
55687B00851l585k763j461q46p69o77j180k733m100m041l295l071k954k093j155
55672A66128j065j163n83j28q73k104k592k751l558m474m396l657l257l078k564
55657A29885k126k188j974q84N4j72p44n60k93j052k175k365j929j925k094j616
55641A07842r34r02j042n30L7k64p57l37L96J66o04n78J32M02K55N22R28N36l05
55622A04963m82j69m48j251j519j113q28p93n65m37r76j573j200k66m8n72p33
$$ plain form
55605 91990 91689 91625 91429 91330 91580 91921 92304 93248 94768 95779 95334 93766 91974 90353 89049 88416 88466 88515
55587 88515 88059 87403 86961 86668 86594 87311 88995 90943 92577 94188 96068 97751 98832 99802 101248 102867
55571 102867 104035 104787 105476 105951 105883 105527 105513 106087 107061 108225 109438 110627 111973 113715 115588 116955 117625
55554 117625 117914 117767 116603 114327 111670 109159 106524 103520 100543 97974 95598 93162 90831 88704 86562
55539 86562 84500 83014 82090 80988 79413 78086 77660 77857 78188 78695 79410 79869 79826 79701 79733 79446 78540 77544
55521 77544 76931 76352 75468 74769 74790 75197 75407 75431 75349 74666 73112 71437 70526 70195 69793 69433 69646 70178 70163 69330
55501 69330 68204 67280 66701 66584 66924 67271 67150 66719 66511 66659 66859 66891 66724 66330 65819 65516 65548 65657 65731 66104
55481 66104 66946 67835 68409 68973 69915 71012 71877 72675 73762 75010 76077 77070 78379 80127 82250 84708
$$ packed form
55605I1990l01o4j96r9K50L41L83R44J520J011m45j568j792j621j304o33N0M9
55587H8515m56o56m42k93p4P17J684J948J634J611J880J683J081R70J446J619
55571A02867J168P52O89M75o8l56j4N74R74J164J213J189J346J742J873J367O70
55554A17625K89j47j164k276k657k511k635l004k977k569k376k436k331k127k142
55539H6562k062j486r24j102j575j327m26J97L31N07P15M59m3j25L2k87r06r96
55521G7544o13n79q84o99K1M07K10K4q2o83j554j675r11l31m02l60K13N32j5q33
55501F9330j126r24n79j17L40L47j21m31k08J48K00L2j67l94n11l03L2J09P4L73
55481F6104Q42Q89N74N64R42J097Q65P98J087J248J067R93J309J748K123K458
$$ plain form
55465 84708 87147 88813 89389 89519 89915 90387 90340 89752 88959 87851 86129 84087 82364 81062 79773 78356
55449 78356 77062 76018 75150 74517 74192 73958 73596 73316 73419 73760 74022 74268 74721 75183 75242 74843 74198 73327 72228
55430 72228 71252 70777 70642 70396 69920 69352 68609 67483 66084 64704 63461 62424 61862 61899 62196 62389 62557 62758
55412 62758 62496 61292 59541 58160 57528 57352 57416 57794 58404 58900 59074 58939 58484 57721 56927 56454 56423 56794 57534
55393 57534 58407 58970 59143 59426 60136 60840 61070 61120 61495 61940 61798 61094 60485 60244 60015 59553 59018 58512 57946
55374 57946 57412 57221 57461 57921 58395 58730 58684 58160 57444 56839 56268 55583 54983 54645 54301 53748 53468 54065 55304
55355 55304 56393 57050 57551 57891 57695 57016 56456 56372 56576 56897 57405 58008 58401 58591 58897 59366 59650 59584 59400
55336 59400 59275 59158 59140 59483 60155 60740 60958 60899 60679 60279 59801 59505 59465 59570 59864 60511 61381 62069 62379 62445
$$ packed form
55465H4708K439J666N76J30L96M72m7n88p93j108j722k042j723j302j289j417
55449G8356j294j044q68o33l25k34l62k80J03L41K62K46M53M62N9l99o45q71j099
55430G2228r76m75j35k46m76n68p43j126j399j380j243j037n62L7K97J93J68K01
55412F2758k62j204j751j381o32j76O4L78O10M96J74j35m55p63p94m73l1L71P40
55393E7534Q73N63J73K83P10P04K30N0L75M45j42p04o09k41k29m62n35n06n66
55374E7946n34j91K40M60M74L35m6n24p16o05n71o85o00l38l44n53k80N97J239
55355E5304J089O57N01L40j96o79n60q4K04L21N08O03L93J90L06M69K84o6j84
55336E9400j25j17j8L43O72N85K18n9k20m00m78k96m0J05K94O47Q70O88L10O6
$$ plain form
55316 62445 62364 62109 61860 62010 62698 63646 64500 65090 65334 65240 65013 64891 64826 64560 63945 62969 61633 60110 58861
55297 58861 58188 57834 57380 56893 56730 56882 57003 56996 57039 57090 56916 56605 56565 56962 57596 58346 59269 60244 60948 61245 61262
55276 61262 61069 60656 60215 60032 60126 60289 60426 60508 60392 60068 59914 60203 60582 60568 60366 60552 61032 61076 60387 59482
55256 59482 58916 58734 58754 58816 58679 58206 57747 57746 57980 57810 57205 56831 56995 57255 57272 57355 57809 58369 58665 58740 58786 58806
55234 58806 58854 59169 59734 60122 60063 59815 59700 59660 59501 59230 58898 58465 58022 57823 57899 57985 57989 58118 58378 58356 57774 56916
55212 56916 56283 56110 56355 56812 57097 56909 56436 56179 56329 56678 57142 57786 58262 57923 56790 55765 55533 55795
55194 55795 55975 56122 56618 57435 58194 58678 58842 58615 58138 57897 58230 58863 59286 59330 59087 58585 57924 57455 57424 57598
55174 57598 57630 57580 57703 57938 57969 57733 57477 57397 57491 57689 57880 57882 57610 57215 56942 56955 57373 58223 59212 59851 60003 60063
$$ packed form
55316F2445q1k55k49J50O88R48Q54N90K44r4k27j22o5k66o15r76j336j523j249
55297E8861o73l54m54m87j63J52J21pM3N1j74l11m0L97O34P50R23R75P04K97J7
55276F1262j93m13m41j83R4J63J37Q2j16l24j54K89L79j4k02J86M80M4o89r05
55256E9482n66j82K0O2j37m73m59jK34j70o05l74J64K60J7Q3M54N60K96P5M6K0
55234E8806M8L15N65L88n9k48j15m0j59k71l32m33m43j99P6Q6MJ29K60k2n82q58
55212E6916o33j73K45M57K85j88m73k57J50L49M64O44M76l39j133j025k32K62
55194E5795J80J47M96Q17P59M84J64k27m77k41L33O33M23M4k43n02o61m69l1J74
55174E7598L2n0J23K35L1k36k56q0R4J98J91Kk72l95k73J3M18Q50R89O39J52O0
$$ plain form
55152 60063 60354 60640 60527 60068 59618 59271 58830 58276 57882 57861 58151 58573 59015 59450 59882 60295 60600 60692 60568 60321
55132 60321 60032 59771 59681 59839 60086 60207 60277 60547 61008 61386 61580 61721 61750 61375 60628 60037 59999 60266 60325 59995 59459
55111 59459 58977 58794 59104 59814 60543 60966 61020 60753 60262 59855 59860 60165 60311 60223 60387 61076 61867 62253 62345 62551 62899
55090 62899 63092 62968 62550 61858 61079 60664 60866 61330 61502 61307 61120 61237 61683 62345 62967 63176 62837 62310 62042
55071 62042 62067 62168 62324 62664 63088 63333 63341 63269 63210 63181 63290 63639 64080 64333 64320 64164 63942 63657 63347 63062 62767
55050 62767 62489 62447 62828 63518 64211 64738 65132 65450 65688 65809 65752 65493 65138 64827 64540 64205 64016 64263 64794 65016
55030 65016 64649 64109 63893 63966 64056 64142 64252 64118 63543 62898 62754 63131 63570 63845 64125 64472 64658 64535 64265 64092
55010 64092 64107 64309 64660 65049 65363 65573 65609 65334 64803 64421 64507 64830 64893 64610 64382 64489 64730 64764 64568 64483 64864
$$ packed form
55152F0063K91K86j13m59m50l47m41n54l94k1K90M22M42M35M32M13L05R2j24k47
55132F0321k89k61r0J58K47J21P0K70M61L78J94J41K9l75p47n91l8K67N9l30n36
55111E9459m82j83L10P10P29M23N4k67m91m07NL05J46q8J64O89P91L86R2K06L48
55090F2899J93j24m18o92p79m15K02M64J72j95j87J17M46O62O22K09l39n27k68
55071F2042K5J01J56L40M24K45Qp2n9k9J09L49M41K53j3j56k22k85l10k85k95
55050F2767k78m2L81O90O93N27L94L18K38J21n7k59l55l11k87l35j89K47N31K22
55030F5016l67n40k16P3R0Q6J10j34n75o45j44L77M39K75K80L47J86j23k70j73
55010F4092J5K02L51L89L14K10L6k75n31l82Q6L23O3k83k28J07K41L4j96q5L81
$$ plain form
54989 64864 65744 66772 67541 67997 68432 68968 69326 69255 69016 69103 69573 69942 69761 69106 68463 68256 68502 68861 69018
54970 69018 68997 69006 69034 68848 68431 68121 68232 68750 69508 70358 71038 71187 70747 70094 69582 69191 68801 68462 68187 67792
54950 67792 67252 66883 66904 67074 67096 67035 67012 66821 66294 65737 65552 65612 65527 65314 65331 65653 65987 66118 66051 65801 65458 65349
54928 65349 65682 66105 66058 65526 65033 64968 65267 65698 66035 65986 65434 64728 64367 64415 64588 64853 65398 66031 66160 65550
54908 65550 64684 64203 64287 64741 65374 66114 66967 67955 68953 69623 69750 69617 69756 70287 70807 70893 70463 69669 68768 68111
54888 68111 67904 67957 67948 67950 68335 69113 69781 69944 69820 69942 70582 71525 72300 72576 72502 72607 73137 73630 73436 72577 71744
54867 71744 71461 71635 71927 72137 72143 71866 71484 71414 71926 72955 74297 75733 76973 77776 78171 78319 78171 77588 76777
54848 76777 76242 76233 76577 77066 77642 78113 78155 77766 77410 77542 78226 79326 80751 82362 83963 85584 87543 90090
$$ packed form
54989F4864Q80J028P69M56M35N36L58p1k39Q7M70L69j81o55o43k07K46L59J57
54970F9018k1RK8j86m17l10J11N18P58Q50O80J49m40o53n12l91l90l39k75l95
54950F7792n40l69K1J70K2o1k3j91n27n57j85O0q5k13J7L22L34J31o7k50l43j09
54928F5349L33M23m7n32m93o5K99M31L37m9n52p06l61M8J73K65N45O33J29o10
54908F5550q66m81Q4M54O33P40Q53R88R98O70J27j33J39N31N20Q6m30p94r01o57
54888F8111k07N3rKL85P78O68J63j24J22O40R43P75K76p4J05N30M93j94q59q33
54867G1744k83J74K92K10Ok77l82p0N12J029J342J436J240Q03L95J48j48n83q11
54848G6777n35rL44M89N76M71M2l89l56J32O84J100J425J611J601J621J959K547
$$ plain form
54830 90090 93196 96773 100766 104918 108750 111955 114540 116424 117246 116789 115359 113440 111190 108492 105357
54815 105357 102018 98726 95637 92837 90318 87966 85710 83650 81989 80894 80381 80242 80119 79797 79400
54800 79400 79160 79072 78962 78817 78771 78851 79046 79595 80821 82647 84639 86628 88942 91914 95434 99176 102946
54783 102946 106604 109868 112434 114195 115214 115526 115056 113666 111345 108422 105434 102565 99432 95711 91805
54768 91805 88450 85791 83395 81107 79293 78133 77282 76428 75661 75064 74455 73824 73531 73711 73945 73869 73724
54751 73724 73895 74248 74363 74127 73694 73145 72631 72568 73205 74116 74593 74439 73978 73438 72736 71838 70916 70116 69515
54732 69515 69239 69349 69599 69662 69623 69887 70597 71409 71960 72288 72627 72998 73159 72929 72447 72092 72120 72377 72473 72301
54712 72301 72220 72585 73212 73558 73375 72950 72671 72584 72510 72441 72578 72995 73430 73579 73532 73721 74363 75162 75687 75872 75932
$$ packed form
54830I0090L106L577L993M152L832L205K585J884Q22m57j430j919k250k698l135
54815A05357l339l292l089k800k519k352k256k060j661j095n13j39j23l22l97
54800G9400k40q8j10j45m6Q0J95N49J226J826J992J989K314K972L520L742L770
54783A02946L658L264K566J761J019L12m70j390k321k923k988k869l133l721l906
54768I1805l355k659k396k288j814j160q51q54p67n97o09o31k93J80K34p6j45
54751G3724J71L53J15k36m33n49n14o3O37R11M77j54m61n40p02q98r22q00o01
54732F9515k76J10K50O3l9K64P10Q12N51L28L39L71J61k30m82l55K8K57R6j72
54712G2301q1L65O27L46j83m25k79q7p4o9J37M17M35J49m7J89O42P99N25J85O0
$$ plain form
54691 75932 75949 75856 75764 75989 76695 77782 79169 80864 82700 84297 85482 86510 87804 89635 92153 95415
54675 95415 99270 103450 107943 113031 118808 124858 130544 135419 139267 142001 143666 144325 143839 142068 139411
54660 139411 136772 134752 133131 131354 129188 126603 123405 119434 114977 110552 106381 102425 98799 95764
54646 95764 93337 91287 89563 88443 88130 88420 88844 89049 89048 89204 89957 91460 93491 95768 98238 100990 104014
54629 104014 107186 110369 113396 116004 117912 118867 118627 117046 114284 110760 106818 102630 98487 94813 91722
54614 91722 88847 85904 83176 81162 79921 79096 78437 77939 77556 77111 76499 75772 75044 74473 74255 74410 74685
54597 74685 74855 75027 75410 75888 76093 75858 75408 75095 75111 75367 75549 75398 75067 75032 75515 76194 76677 76991 77292 77406
54577 77406 77103 76651 76564 76814 76777 76102 75201 74718 74827 75212 75495 75486 75228 74982 75033 75417 75888 76231 76450 76638 76780
$$ packed form
54691G5932J7r3r2K25P06J087J387J695J836J597J185J028J294J831K518L262
54675I5415L855M180M493N088N777O050N686M875L848K734J665O59m86j771k657
54660A39411k639k020j621j777k166k585l198l971m457m425m171l956l626l035
54646I5764k427k050j724j120l13K90M24K05jJ56P53J503K031K277K470K752L024
54629A04014L172L183L027K608J908R55k40j581k762l524l942m188m143l674l091
54614I1722k875k943k728k014j241q25o59m98l83m45o12p27p28n71k18J55K75
54597G4685J70J72L83M78K05k35m50l13J6K56J82j51l31l5M83O79M83L14L01J14
54577G7406l03m52q7K50l7o75r01m83J09L85K83rk58k46N1L84M71L43K19J88J42
$$ plain form
54556 76780 76759 76490 76023 75583 75448 75659 75873 75701 75182 74757 74756 75084 75450 75712 75874 75909 75736 75365 74937 74611
54536 74611 74435 74358 74339 74379 74442 74444 74433 74639 75166 75674 75660 75097 74548 74505 74861 75217 75442 75697 76059 76375 76457 76223
54514 76223 75707 75064 74504 74102 73743 73341 72948 72600 72240 71941 71937 72266 72615 72731 72773 72974 73207 73184 72931 72720
54494 72720 72669 72757 73102 73848 74803 75559 75969 76211 76397 76457 76406 76374 76316 75991 75367 74778 74558 74699 74946 75103 75146
54473 75146 75172 75310 75626 76062 76539 77023 77438 77625 77536 77369 77309 77229 76882 76304 75835 75747 76004 76369 76561 76396 75977
54452 75977 75718 75960 76622 77342 77888 78248 78454 78585 78846 79366 79945 80204 80035 79689 79485 79558 79821 80000 79809
54433 79809 79319 79036 79389 80202 80906 81146 80947 80440 79742 79078 78656 78415 78124 77728 77385 77276 77541 78299 79420
54414 79420 80396 80757 80550 80129 79611 78887 78080 77570 77552 77876 78316 78701 78834 78586 78055 77390 76622 75970 75987 76887
$$ packed form
54556G6780k1k69m67m40j35K11K14j72n19m25jL28L66K62J62L5j73l71m28l26
54536G4611j76p7j9M0O3Kj1K06N27N08j4n63n49m3L56L56K25K55L62L16Q2k34
54514G6223n16o43n60m02l59m02l93l48l60k99mL29L49J16M2K01K33k3k53k11
54494G2720n1Q8L45P46R55P56M10K42J86O0n1l2n8l25o24n89k20J41K47J57M3
54473G5146K6J38L16M36M77M84M15J87q9j67o0q0l47n78m69q8K57L65J92j65m19
54452G5977k59K42O62P20N46L60K06J31K61N20N79K59j69l46k04P3K63J79j91
54433G9809m90k83L53Q13P04K40j99n07o98o64m22k41k91l96l43j09K65P58J121
54414G9420R76L61k07m21n18p24q07n10j8L24M40L85J33k48n31o65p68o52J7R00
$$ plain form
54394 76887 77891 77940 77009 76107 75913 76090 76104 76033 76232 76716 77255 77715 78003 78021 77922 78077 78564 79052 79391 79903
54374 79903 80809 81807 82547 83153 83847 84411 84485 84167 83875 83720 83436 82842 82014 81073 80143 79509 79467 79965 80600 81024
54354 81024 81206 81280 81303 81242 81118 81061 81173 81354 81418 81388 81514 81849 82027 81745 81276 81113 81229 81166 80758 80283 79847
54333 79847 79243 78570 78399 78941 79554 79466 78679 77789 77238 77128 77447 78071 78685 79102 79534 80260 81187 82012 82608
54314 82608 82990 83104 82975 82901 83144 83542 83735 83646 83459 83265 83034 82837 82761 82714 82610 82683 83272 84333 85442 86264
54294 86264 86769 86982 86832 86281 85452 84574 83929 83765 84095 84591 84879 84887 84809 84784 84811 84899 85131 85566 86159 86732 87020
54273 87020 86915 86742 87044 87953 88983 89613 89821 89817 89564 88972 88380 88372 89111 90160 91002 91480 91738 92017 92548 93407
54253 93407 94380 95139 95596 95985 96607 97583 98859 100327 101994 104024 106528 109303 111941 114225 116162 117548
$$ packed form
54394G6887J004M9r31r02j94J77J4p1J99M84N39M60K88J8r9J55M87M88L39N12
54374G9903R06R98P40O06O94N64P4l18k92j55k84n94q28r41r30o34m2M98O35M24
54354H1024J82P4K3o1j24n7J12J81O4l0J26L35J78k82m69j63J16o3m08m75m36
54333G9847o04o73j71N42O13q8p87q90n51j10L19O24O14M17M32P26R27Q25N96
54314H2608L82J14j29p4K43L98J93q9j87j94k31j97p6m7j04P3N89J061J109Q22
54294H6264N05K13j50n51q29q78o45j64L30M96K88Qp8k5K7Q8K32M35N93N73K88
54273H7020j05j73L02R09J030O30K08mk53n92n92qP39J049Q42M78K58K79N31Q59
54253I3407R73P59M57L89O22R76J276J468J667K030K504K775K638K284J937J386
$$ plain form
54237 117548 117951 117312 116200 115096 113776 111816 109415 107164 105217 103279 101364 99891 98947 98032 96766
54222 96766 95412 94438 93935 93697 93579 93503 93367 93167 93055 93076 93050 92890 92829 93080 93396 93286 92602 91710 91031 90592
54202 90592 90113 89457 88860 88658 88874 89205 89393 89436 89372 89086 88552 88079 88026 88348 88687 88873 89066 89385 89693 89816
54182 89816 89749 89569 89338 89173 89188 89325 89400 89383 89407 89477 89408 89179 89055 89216 89463 89578 89752 90387 91508 92660 93432
54161 93432 93832 94056 94107 93838 93317 92895 92826 92950 92919 92648 92372 92241 92098 91779 91430 91359 91649 92106 92514 92800
54141 92800 92991 93174 93464 93863 94169 94178 93944 93657 93348 92927 92473 92225 92228 92195 91874 91408 91194 91446 91979 92394 92453
54120 92453 92279 92151 92150 92100 91894 91706 91705 91754 91604 91299 91092 90998 90751 90255 89780 89616 89740 89945 90114 90271 90544
54099 90544 91136 92168 93432 94471 95008 95175 95226 95203 94996 94555 93903 93079 92200 91465 90952 90537 90129 89819 89642
$$ packed form
54237A17548M03o39j112j104j320j960k401k251j947j938j915j473r44r15j266
54222I6766j354r74n03k38j18p6j36k00j12K1k6j60o1K51L16j10o84q92o79m39
54202I0592m79o56n97k02K16L31J88M3o4k86n34m73n3L22L39J86J93L19L08J23
54182H9816o7j80k31j65J5J37P5j7K4P0o9k29j24J61K47J15J74O35J121J152P72
54161I3432M00K24N1k69n21m22o9J24l1k71k76j31j43l19l49p1K90M57M08K86
54141I2800J91J83K90L99L06Rk34k87l09m21m54k48Ll3l21m66k14K52N33M15N9
54120I2453j74j28jn0k06j88jM9j50l05k07r4k47m96m75j64J24K05J69J57K73
54099I0544N92J032J264J039N37J67N1k3k07m41o52q24q79p35n13m15m08l10j77
$$ plain form
54080 89642 89403 88975 88652 88898 89725 90564 90831 90434 89693 88941 88336 87922 87695 87598 87543 87475 87423 87492 87734 88045 88208
54059 88208 88131 87951 87824 87688 87425 87188 87311 87805 88215 88149 87774 87549 87609 87731 87838 88182 88936 89914 90855 91750
54039 91750 92664 93449 93908 94110 94313 94630 94998 95370 95671 95649 95075 94156 93404 93048 92844 92568 92409 92653 93197
54020 93197 93685 94010 94461 95354 96659 98008 98979 99373 99305 99018 98658 98230 97745 97298 97004 96930 97086 97350 97467
54001 97467 97275 96920 96678 96616 96589 96525 96447 96280 95966 95725 95863 96283 96538 96536 96753 97556 98678 99638 100346 101018 101746
53980 101746 102534 103547 104954 106676 108570 110764 113500 116770 120353 124133 128203 132800 138329 145219
53966 145219 153380 161892 169448 174985 177787 177385 173810 167844 160592 152883 145268 138346 132596 128033
53952 128033 124385 121552 119497 117877 116284 114805 113874 113560 113444 113223 113023 113081 113517 114445 115876 117446
$$ packed form
54080H9642k39m28l23K46Q27Q39K67l97p41p52o05m14k27r7n5o8n2O9K42L11J63
54059H8208p7j80j27j36k63k37J23M94M10o6l75k25O0J22J07L44P54R78R41Q95
54039I1750R14P85M59K02K03L17L68L72L01k2n74r19p52l56k04k76j59K44N44
54020I3197M88L25M51Q93J305J349R71L94o8k87l60m28m85m47k94p4J56K64J17
54001I7467j92l55k42o2k7o4p8j67l14k41J38M20K55kK17Q03J122R60P08O72P28
53980A01746P88J013J407J722J894K194K736L270L583L780M070M597N529O890
53966A45219Q161Q512P556N537K802m02l575n966p252p709p615o922n750m563
53952A28033l648k833k055j620j593j479r31l14j16k21k00N8M36R28J431J570
$$ plain form
53936 117446 118657 119496 120486 122014 123977 126135 128419 130759 133009 135169 137349 139398 140944 141977 142985
53921 142985 144326 145793 146994 147842 148441 148825 149024 149189 149370 149403 149209 148971 148860 148820 148800 148937 149295 149681 149969
53902 149969 150349 151024 151823 152455 152974 153706 154758 155818 156362 155905 154146 151104 147179 142964 138961 135405
53886 135405 132232 129178 126110 123273 121034 119381 117931 116505 115380 114805 114568 114250 113711 113089 112487 111932
53870 111932 111510 111323 111333 111398 111425 111342 111044 110493 109838 109319 109105 109245 109682 110268 110854 111416 111963 112402 112660 112942
53850 112942 113576 114531 115323 115562 115362 115174 115403 116301 117894 119844 121611 123010 124478 126588 129454 132735
53834 132735 136084 139414 142805 146339 149992 153656 157328 161244 165649 170499 175607 181020 186896 192997
53820 192997 198719 203782 208543 213517 219026 225527 233795 244343 256785 269968 282362 292145 297468
$$ packed form
53936A17446J211Q39R90J528J963K158K284K340K250K160K180K049J546J033J008
53921A42985J341J467J201Q48N99L84J99J65J81L3j94k38j11m0k0J37L58L86K88
53902A49969L80O75P99O32N19P32J052J060N44m57j759l042l925m215m003l556
53886A35405l173l054l068k837k239j653j450j426j125n75k37l18n39o22o02n55
53870A11932m22j87J0O5K7q3k98n51o55n19k14J40M37N86N86N62N47M39K58K82
53850A12942O34R55P92K39k00j88K29Q98J593J950J767J399J468K110K866L281
53834A32735L349L330L391L534L653L664L672L916M405M850N108N413N876O101
53820A92997N722N063M761M974N509O501Q268J0548J2442J3183J2394R783N323
$$ plain form
53807 297468 297343 292258 283605 272687 260549 248385 237423 228300 220909 214861 209806 205357 201137
53794 201137 196999 193034 189310 185813 182549 179482 176411 173140 169714 166335 163100 160045 157302 154961
53780 154961 152849 150723 148600 146643 144785 142792 140655 138617 136790 135036 133302 131804 130742 129985
53766 129985 129142 127876 126139 124182 122360 120846 119585 118503 117626 116880 116017 114906 113779 112981 112567 112338
53750 112338 112139 111922 111660 111421 111435 111838 112424 112881 113150 113336 113376 113092 112518 111938 111595 111588 111949 112538 112930 112721
53730 112721 112011 111338 111108 111270 111542 111727 111765 111696 111630 111620 111561 111317 110924 110563 110382 110463 110828 111348 111750 111905 111985
53709 111985 112165 112379 112577 113011 113930 115162 116377 117670 119470 121873 124469 126905 129267 131789 134478
53694 134478 137160 139668 141872 143733 145401 147100 148803 150185 150977 151225 151166 150967 150646 150158 149510 148814
$$ packed form
53807B97468j25n085q653j0918j2138j2164j0962r123p391o048n055m449m220
53794B01137m138l965l724l497l264l067l071l271l426l379l235l055k743k341
53780A54961k112k126k123j957j858j993k137k038j827j754j734j498j062p57
53766A29985q43j266j737j957j822j514j261j082q77p46q63j111j127p98m14k29
53750A12338j99k17k62k39J4M03N86M57K69J86M0k84n74n80l43pL61N89L92k09
53730A12721p10o73k30J62K72J85L8o9o6j0n9k44l93l61j81Q1L65N20M02J55Q0
53709A11985J80K14J98M34R19J232J215J293J800K403K596K436K362K522K689
53694A34478K682K508K204J861J668J699J703J382P92K48n9j99l21m88o48o96
$$ plain form
53678 148814 148168 147444 146370 144916 143392 141954 140287 138059 135491 133136 131240 129665 128323 127237 126245
53663 126245 125082 123771 122561 121492 120413 119421 118821 118527 117977 116859 115535 114566 114070 113791 113515 113205
53647 113205 112876 112571 112323 112031 111516 110770 110033 109555 109396 109501 109768 110069 110375 110818 111451 112034 112356 112652 113325
53628 113325 114258 114880 114917 114695 114588 114624 114769 115148 115733 116200 116369 116459 116718 117105 117595 118415 119649 120898 121697
53609 121697 122077 122426 122953 123633 124468 125490 126548 127413 128023 128446 128685 128711 128647 128737 129168 129990 131076 132130
53591 132130 132947 133760 135096 137121 139356 141183 142364 142909 142820 142328 142081 142613 143696 144609 145001 145173 145536
53574 145536 146162 146875 147479 147787 147691 147319 146963 146765 146533 145964 144972 143821 142936 142549 142512 142505 142415 142367 142416 142434 142395
53553 142395 142526 143008 143695 144307 144727 144981 145091 145137 145243 145352 145201 144762 144467 144715 145326 145772 145800 145544 145165
$$ packed form
53678A48814o46p24j074j454j524j438j667k228k568k355j896j575j342j086r92
53663A26245j163j311j210j069j079r92o00k94n50j118j324r69m96k79k76l10
53647A13205l29l05k48k92n15p46p37m78j59J05K67L01L06M43O33N83L22K96O73
53628A13325R33O22L7k22j07L6J45L79N85M67J69R0K59L87M90Q20J234J249P99
53609A21697L80L49N27O80Q35J022J058Q65O10M23K39K6o4R0M31Q22J086J054
53591A32130Q17Q13J336K025K235J827J181N45q9m92k47N32J083R13L92J72L63
53574A45536O26P13O04L08r6l72l56j98k32n69r92j151q85l87l7pr0m8M9J8l9
53553A42395J31M82O87O12M20K54J10M6J06J09j51m39k95K48O11M46K8k56l79
$$ plain form
53534 145165 144767 144574 144820 145453 146178 146812 147332 147658 147739 147818 148290 149200 150180 150938 151550 152235 153096 154146 155318
53515 155318 156380 157127 157751 158761 160410 162425 164427 166321 168073 169428 170193 170669 171452 172777 174356
53500 174356 175883 177482 179532 182200 185273 188391 191342 194117 196809 199528 202394 205561 209165 213283
53486 213283 217930 223024 228253 233027 236733 239111 240316 240510 239543 237166 233542 229326 225160 221202 217293
53471 217293 213456 210000 207094 204484 201813 199098 196728 195016 193918 193167 192502 191751 190845 189865 188972 188248
53455 188248 187651 187134 186737 186514 186479 186624 186941 187387 187900 188431 188890 189128 189104 189041 189236 189691 190107 190285 190362 190574
53435 190574 190983 191533 192228 193144 194350 195888 197731 199718 201650 203535 205588 207920 210424 213063 216051
53420 216051 219563 223408 227207 230899 234846 239475 244886 250762 256607 262093 267270 272419 277712 283116
$$ packed form
53534A45165l98j93K46O33P25O34N20L26Q1P9M72R10R80P58O12O85Q61J050J172
53515A55318J062P47O24J010J649K015K002J894J752J355P65M76P83J325J579
53500A74356J527J599K050K668L073L118K951K775K692K719K866L167L604M118
53486B13283M647N094N229M774L706K378J205J94r67k377l624m216m166l958l909
53471B17293l837l456k906k610k671k715k370j712j098p51o65p51r06r80q93p24
53455A88248n97n17l97k23l5J45L17M46N13N31M59K38k4o3J95M55M16J78P7K12
53435A90574M09N50O95R16J206J538J843J987J932J885K053K332K504K639K988
53420B16051L512L845L799L692L947M629N411N876N845N486N177N149N293N404
$$ plain form
53406 283116 288624 294381 300500 306914 313539 320449 327790 335638 344045 353068 362634 372491 382423 392396
53392 392396 402427 412470 422556 432841 443306 453591 463360 472698 481939 491155 500095 508587 516789
53379 516789 524994 533314 541608 549625 557196 564349 571239 578048 585016 592414 600262 608085 615337 622077
53365 622077 628813 635556 641530 646129 649695 652876 655558 657018 656940 655624 653241 649554 644523 638671 632572
53350 632572 626366 620050 613873 608130 602702 597093 590834 583740 575886 567528 558986 550490 542098 533740
53336 533740 525294 516674 507966 499480 491535 484187 477288 470752 464656 459181 454660 451580 450197 450083
53322 450083 450337 450355 450243 450420 451064 452082 453437 455256 457654 460587 463864 467322 471001 475182 480162 486030
53306 486030 492695 500092 508215 516987 526275 536007 546147 556586 567235 578233 589890 602446 615975
$$ packed form
53406B83116N508N757O119O414O625O910P341P848Q407R023R566R857R932R973
53392C92396J0031J0043J0086J0285J0465J0285R769R338R241R216Q940Q492Q202
53379E16789Q205Q320Q294Q017P571P153O890O809O968P398P848P823P252O740
53365F22077O736O743N974M599L566L181K682J460p8j316k383l687n031n852o099
53350F32572o206o316o177n743n428n609o259p094p854q358q542q496q392q358
53336E33740q446q620q708q486p945p348o899o536o096n475m521l080j383j14
53322D50083K54J8j12J77O44J018J355J819K398K933L277L458L679M181M980N868
53306D86030O665P397Q123Q772R288R732J0140J0439J0649J0998J1657J2556J3529
$$ plain form
53293 615975 630476 645864 661945 678619 696104 714743 734565 755271 776624 798576 821019
53282 821019 843737 866722 890187 914104 937984 961374 984335 1007163 1029788 1051745 1072684
53271 1072684 1092619 1111677 1129819 1146882 1162745 1177339 1190606 1202513 1213057 1222167 1229598 1235005
53259 1235005 1238162 1239061 1237698 1233811 1226967 1216941 1203878 1188031 1169600 1148983 1126988 1104478
53247 1104478 1081818 1058868 1035491 1011870 988398 965454 943341 922193 901913 882344 863498
53236 863498 845469 828151 811227 794380 777348 759896 742044 724315 707444 691802 677342
53225 677342 664050 652080 641386 631670 622837 615146 608743 603379 598745 594712 590969 586824 581786
53212 581786 576101 570345 564704 559036 553471 548402 543905 539624 535340 531325 527973 525343 523246 521595
$$ packed form
53293F15975J4501J5388J6081J6674J7485J8639J9822K0706K1353K1952K2443
53282H21019K2718K2985K3465K3917K3880K3390K2961K2828K2625K1957K0939
53271A072684J9935J9058J8142J7063J5863J4594J3267J1907J0544R110P431N407
53259A235005L157Q99j363l887o844j0026j3063j5847j8431k0617k1995k2510
53247A104478k2660k2950k3377k3621k3472k2944k2113k1148k0280j9569j8846
53236H63498j8029j7318j6924j6847j7032j7452j7852j7729j6871j5642j4460
53225F77342j3292j1970j0694r716q833p691o403n364m634m033l743m145n038
53212E81786n685n756n641n668n565n069m497m281m284m015l352k630k097j651
$$ plain form
53198 521595 520498 520099 520424 521330 522592 524109 526034 528633 532019 536106 540805 546131 552147 558912 566508
53183 566508 574952 584070 593594 603446 613783 624671 635814 646717 657073 666865 676150 684893 693043
53170 693043 700665 707862 714586 720574 725534 729309 731904 733381 733793 733127 731279 728102 723559 717761 710824
53155 710824 702739 693491 683243 672267 660696 648489 635699 622618 609574 596660 583787 570964
53143 570964 558425 546419 534937 523754 512774 502229 492388 483103 473840 464231 454370 444449 434350
53130 434350 423879 413266 403098 393754 385173 377187 369842 363265 357431 352156 347229 342516 338050
53117 338050 333987 330338 326792 323007 318990 314943 310757 306050 300796 295529 290703 286101 281129 275490
53103 275490 269343 262973 256594 250434 244786 239880 235749 232193 228863 225505 222146 218929 215782 212458
$$ packed form
53198E21595j097l99L25R06J262J517J925K599L386M087M699N326O016O765P596
53183E66508Q444R118R524R852J0337J0888J1143J0903J0356R792R285Q743Q150
53170F93043P622P197O724N988M960L775K595J477M12o66j848l177m543n798o937
53155G10824q085r248j0248j0976j1571j2207j2790j3081j3044j2914j2873j2823
53143E70964j2539j2006j1482j1183j0980j0545r841r285r263r609r861r921j0099
53130D34350j0471j0613j0168r344q581p986p345o577n834n275m927m713m466
53117C38050m063l649l546l785m017m047m186m707n254n267m826m602m972n639
53103B75490o147o370o379o160n648m906m131l556l330l358l359l217l147l324
$$ plain form
53089 212458 208946 205571 202603 199985 197566 195293 192984 190232 186861 183327 180352 178224 176685 175336
53075 175336 173863 172011 169735 167439 165744 164869 164374 163595 162204 160363 158458 156745 155177 153553 151860
53060 151860 150392 149442 148935 148500 147878 147124 146459 146035 145829 145656 145324 144863 144529 144485 144539 144329 143722 142922 142216
53041 142216 141750 141480 141215 140776 140180 139641 139301 139063 138787 138528 138371 138196 137815 137293 136909 136822 136975 137319 137868
53022 137868 138521 139081 139548 140208 141274 142562 143667 144414 145016 145780 146660 147180 146847 145668 144184 142931 141935
53005 141935 140852 139448 137804 136113 134517 133182 132313 131966 131924 131891 131802 131863 132292 133027 133744 134151 134243 134219 134227
52986 134227 134294 134466 134829 135353 135885 136355 136858 137425 137893 138086 138047 137962 137980 138153 138410 138532 138349 138048 138008 138221
52966 138221 138172 137560 136794 136423 136348 136065 135467 134862 134263 133282 131894 130733 130369 130603 130767 130460 129791 129161 129011
$$ packed form
53089B12458l512l375k968k618k419k273k309k752l371l534k975k128j539j349
53075A75336j473j852k276k296j695q75m95p79j391j841j905j713j568j624j693
53060A51860j468r50n07m35o22p54o65m24k06j73l32m61l34m4N4k10o07q00p06
53041A42216m66k70k65m39n96n39l40k38k76k59j57j75l81n22l84q7J53L44N49
53022A37868O53N60M67O60J066J288J105P47O02P64Q80N20l33j179j484j253r96
53005A41935j083j404j644j691j596j335q69l47m2l3q9O1M29P35P17M07R2k4Q
52986A34227O7J72L63N24N32M70N03N67M68J93l9q5J8J73K57J22j83l01m0K13
52966A38221m9o12p66l71p5k83n98o05n99r81j388j161l64K34J64l07o69o30j50
$$ plain form
52947 129011 129578 130637 131614 132083 132032 131563 130684 129578 128798 128792 129336 129778 129774 129519 129304 129200 129178 129270 129468 129638
52927 129638 129687 129662 129616 129490 129239 128966 128827 128879 129098 129486 130005 130446 130537 130260 129940 129909 130147 130376 130488 130699 131265
52906 131265 132106 132863 133229 133171 132839 132375 131840 131244 130628 130084 129716 129590 129759 130321 131322 132599 133811 134717
52888 134717 135332 135750 135916 135717 135278 134986 135164 135763 136432 136843 136949 136957 137052 137228 137420 137736 138410 139494 140769
52869 140769 142020 143247 144475 145561 146356 146959 147577 148182 148475 148212 147421 146353 145319 144536 143977 143380 142526
52852 142526 141445 140300 139165 138128 137445 137334 137604 137746 137448 136855 136287 135907 135707 135627 135584 135515 135450 135452 135445 135226
52832 135226 134698 134009 133406 133050 132957 133023 133082 133037 132916 132746 132467 132121 132041 132561 133522 134336 134615 134547 134561 134817 135191
52811 135191 135574 135990 136464 136944 137347 137598 137653 137514 137205 136735 136126 135469 134885 134409 134027 133819 133946 134436 135088
$$ packed form
52947A29011N67J059R77M69n1m69q79j106p80oN44M42mk55k15j04k2R2J98J70
52927A29638M9k5m6j26k51k73j39N2K19L88N19M41R1k77l20l1K38K29J12K11N66
52906A31265Q41P57L66n8l32m64n35n96o16n44l68j26J69N62J001J277J212R06
52888A34717O15M18J66j99m39k92J78N99O69M11J06QR5J76J92L16O74J084J275
52869A40769J251J227J228J086P95O03O18O05K93k63p91j068j034p83n59n97q54
52852A42526j081j145j135j037o83j11K70J42k98n93n68l80k00q0m3o9o5Kpk19
52832A35226n28o89o03l56r3O6N9m5j21j70k79l46q0N20R61Q14K79o8J4K56L74
52811A35191L83M16M74M80M03K51N5j39l09m70o09o57n84m76l82k08J27M90O52
$$ plain form
52792 135088 135647 136056 136513 137282 138429 139650 140421 140406 139717 138724 137696 136763 136092 135859 135996 136129 135874 135151
52774 135151 134249 133630 133582 133962 134368 134651 135065 135745 136296 136273 135886 135769 136084 136356 136263 136113 136332 136890 137505 138076
52754 138076 138623 139016 139119 139033 138973 138983 138916 138565 137712 136265 134537 133178 132603 132592 132587 132236 131508 130526 129495 128651
52734 128651 128052 127542 127064 126789 126773 126758 126573 126486 126835 127489 128037 128393 128827 129527 130493 131854 133861 136471 139238
52715 139238 141690 143541 144525 144369 143136 141348 139571 137978 136409 134716 132879 130912 128846 126837 125183
52700 125183 124098 123461 122864 122035 121203 120813 120865 120852 120495 120234 120628 121507 122197 122450 122667 123150 123626 123720 123504
52681 123504 123318 123333 123538 123960 124559 125064 125193 125009 124848 124915 125154 125414 125581 125529 125180 124655 124228 124073 124162 124404
52661 124404 124734 125005 124945 124425 123709 123263 123304 123664 124116 124655 125352 126106 126740 127273 127834 128305 128331 127802 127117 126793
$$ packed form
52792A35088N59M09M57P69J147J221P71j5o89r93j028r33o71k33J37J33k55p23
52774A35151r02o19m8L80M06K83M14O80N51k3l87j17L15K72r3j50K19N58O15N71
52754A38076N47L93J03q6o0J0o7l51q53j447j728j359n75j1nl51p28r82j031q44
52734A28651n99n10m78k75j6j5j85q7L49O54N48L56M34P00R66J361K007K610K767
52715A39238K452J851R84j56j233j788j777j593j569j693j837j967k066k009j654
52700A25183j085o37n97q29q32l90N2j3l57k61L94Q79O90K53K17M83M76R4k16
52681A23504j86J5K05M22N99N05J29j84j61O7K39K60J67n2l49n25m27j55Q9K42
52661A24404L30K71o0n20p16m46M1L60M52N39O97P54O34N33N61M71K6n29o85l24
$$ plain form
52641 126793 126958 127389 127889 128404 128870 129200 129443 129759 130222 130783 131419 132144 132877 133495 134006 134513 134983 135225 135161
52622 135161 134920 134606 134156 133551 132990 132671 132492 132176 131638 131121 130901 131011 131243 131365 131290 131095 130926 130834 130690
52603 130690 130294 129614 128919 128608 128855 129446 130046 130595 131348 132485 133809 134922 135612 135967 136168 136325 136490 136663
52585 136663 136769 136762 136787 137103 137740 138341 138464 138020 137313 136671 136149 135629 135123 134836 134947 135435 136152 136978 137777 138313
52565 138313 138393 138101 137715 137366 136947 136454 136183 136399 136928 137325 137407 137430 137715 138272 138861 139288 139568 139792 139903 139711
52545 139711 139170 138642 138670 139417 140495 141438 142146 142740 143160 143284 143289 143578 144308 145300 146441 147795 149203 150094
52527 150094 150006 149149 148209 147619 147210 146525 145333 143825 142410 141345 140585 139935 139327 138812 138376 137933 137530 137334
52509 137334 137349 137324 137121 136980 137261 137988 138839 139507 139893 140042 140094 140299 140848 141583 142010 141760 141023 140404 140342 140732
$$ packed form
52641A26793J65M31N00N15M66L30K43L16M63N61O36P25P33O18N11N07M70K42o4
52622A35161k41l14m50o05n61l19j79l16n38n17k20J10K32J22p5j95j69r2j44
52603A30690l96o80o95l11K47N91O00N49P53J137J324J113O90L55K01J57J65J73
52585A36663J06pK5L16O37O01J23m44p07o42n22n20n06k87J11M88P17Q26P99N36
52565A38313Q0k92l86l49m19m93k71K16N29L97Q2K3K85N57N89M27K80K24J11j92
52545A39711n41n28K8P47J078R43P08N94M20J24NK89P30R92J141J354J408Q91
52527A50094q8q57r40n90m09o85j192j508j415j065p60o50o08n15m36m43m03j96
52509A37334J5k5k03j41K81P27Q51O68L86J49N2K05N49P35M27k50p37o19o2L90
$$ plain form
52489 140732 141128 141273 141362 141766 142612 143674 144656 145444 146109 146758 147403 147891 147973 147562 146926 146490 146407 146445 146327 146007
52469 146007 145533 144895 144179 143700 143700 143978 144072 143800 143395 143124 143012 143006 143097 143212 143202 143094 143174 143632 144273 144784 145080
52448 145080 145189 144958 144215 143181 142354 141882 141387 140541 139588 139061 139151 139562 139936 140174 140383 140660 140994 141272 141410
52429 141410 141504 141803 142447 143302 144111 144715 145035 145020 144769 144608 144841 145436 146120 146700 147098 147248 147216 147379 148129 149383
52409 149383 150669 151715 152618 153387 153764 153697 153580 153691 153697 153082 151898 150681 149740 148894 147897 146799 145814 145079
52391 145079 144626 144416 144388 144566 145100 146031 147087 147903 148409 148831 149321 149774 149981 149807 149271 148654 148448 149005 150172
52372 150172 151466 152546 153348 153861 154062 154076 154125 154249 154357 154571 155207 156271 157254 157613 157283 156577 155785 155057
52354 155057 154518 154242 154169 154145 154036 153688 152929 151735 150356 149134 148252 147668 147224 146736 146112 145471 145084 145126 145504
$$ packed form
52489A40732L96J45Q9M04Q46J062R82P88O65O49O45M88Q2m11o36m36q3L8j18l20
52469A46007m74o38p16m79%K78R4k72m05k71j12oR1J15j0j08Q0M58O41N11K96
52448A45080J09k31p43j034q27m72m95q46r53n27R0M11L74K38K09K77L34K78J38
52429A41410R4K99O44Q55Q09O04L20j5k51j61K33N95O84N80L98J50l2J63P50J254
52409A49383J286J046R03P69L77o7j17J11Oo15j184j217r41q46r97j098r85p35
52391A45079m53k10k8J78N34R31J056Q16N06M22M90M53K07j74n36o17k06N57J167
52372A50172J294J080Q02N13K01J4M9J24J08K14O36J064R83L59l30p06p92p28
52354A55057n39k76p3k4j09l48p59j194j379j222q82n84m44m88o24o41l87M2L78
$$ plain form
52335 145504 145957 146260 146344 146322 146424 146757 147076 146932 146139 144963 143824 142936 142306 141866 141456 140867 140102 139512 139489
52316 139489 140059 140967 142059 143383 144951 146632 148369 150350 152841 155907 159406 163172 167158 171345 175579
52301 175579 179478 182462 183914 183433 181132 177692 173972 170431 166987 163520 160301 157795 156145 155137
52287 155137 154637 154735 155389 156188 156650 156653 156419 156214 156170 156323 156646 157048 157395 157567 157551 157567 158012 159155 160840 162609
52267 162609 164115 165267 166065 166528 166793 167041 167266 167308 167198 167216 167518 167939 168286 168610 169027 169498 169956 170459 171041
52248 171041 171591 172079 172751 173865 175354 176931 178387 179604 180485 181074 181692 182680 184067 185652 187314 189015
52232 189015 190606 191891 192908 194001 195586 197927 201047 204726 208643 212607 216581 220456 224019 227296
52218 227296 230662 234363 238134 241643 245094 249029 253618 258540 263548 268788 274470 280590 287070 293886
$$ packed form
52335A45504M53L03Q4k2J02L33L19j44p93j176j139q88o30m40m10n89p65n90k3
52316A39489N70R08J092J324J568J681J737J981K491L066L499L766L986M187M234
52301A75579L899K984J452m81k301l440l720l541l444l467l219k506j650j008
52287A55137n00R8O54P99M62Lk34k05m4J53L23M02L47J72j6J6M45J143J685J769
52267A62609J506J152P98M63K65K48K25M2j10J8L02M21L47L24M17M71M58N03N82
52248A71041N50M88O72J114J489J577J456J217Q81N89O18R88J387J585J662J701
52232A89015J591J285J017J093J585K341L120L679L917L964L974L875L563L277
52218B27296L366L701L771L509L451L935M589M922N008N240N682O120O480O816
$$ plain form
52204 293886 300966 308207 315700 323700 332238 341004 349747 358582 367744 377147 386349 394900 402635 409735
52190 409735 416553 423304 429849 435851 441166 445986 450584 455012 459081 462546 465283 467406 469202 470859
52176 470859 472280 473225 473621 473593 473269 472718 472064 471467 470960 470413 469628 468384 466458 463840 460902 458178 456014
52159 456014 454602 454181 454892 456508 458687 461520 465400 470295 475554 480650 485763 491336 497368 503426 509148
52144 509148 514463 519476 524396 529462 534685 539771 544445 548736 552738 556288 559127 561306 563138 564816
52130 564816 566309 567550 568459 568845 568536 567619 566331 564705 562570 559857 556697 553179 549284 545113 540942
52115 540942 536959 533126 529410 525927 522727 519644 516564 513715 511392 509507 507716 506028 504994 505084 506075
52100 506075 507311 508463 509777 511516 513483 515244 516579 517522 518133 518469 518695 518890 518856 518353 517537 516831 516338
$$ packed form
52204B93886P080P241P493Q000Q538Q766Q743Q835R162R403R202Q551P735P100
52190D09735O818O751O545O002N315M820M598M428M069L465K737K123J796J657
52176D70859J421R45L96k8l24n51o54n97n07n47p85j244j926k618k938k724k164
52159D56014j412m21P11J616K179K833L880M895N259N096N113N573O032O058N722
52144E09148N315N013M920N066N223N086M674M291M002L550K839K179J832J678
52130E64816J493J241R09L86l09r17j288j626k135k713l160l518l895m171m171
52115E40942l983l833l716l483l200l083l080k849k323j885j791j688j034R0R91
52100E06075J236J152J314J739J967J761J335R43O11L36K26J95l4n03q16p06m93
$$ plain form
52083 516338 515791 515108 514631 514570 514616 514382 513911 513350 512430 510745 508453 506161 504127 502042 499694 497411 495594
52066 495594 494181 492861 491569 490465 489582 488793 488079 487580 487367 487376 487580 488029 488666 489242 489594 489930 490696 492100
52048 492100 493828 495290 496140 496471 496548 496510 496357 496112 495795 495328 494653 493924 493414 493204 493145 493178 493535 494498 496068
52029 496068 497990 500041 502146 504274 506348 508283 510041 511651 513248 515038 517171 519628 522360 525546
52015 525546 529589 534769 540954 547742 554877 562402 570408 578730 587032 595142 603176 611276 619332 627046
52001 627046 634254 641098 647867 654705 661528 668192 674733 681394 688387 695674 702972 709982 716535 722597
51987 722597 728222 733501 738381 742516 745453 747053 747586 747290 745997 743397 739598 735169 730615 725997 721066
51972 721066 715637 709816 704009 698761 694406 690834 687671 684715 682060 679863 678243 677420 677676 678983 680899
$$ packed form
52083E16338n47o83m77o1M6k34m71n61r20j685k292k292k034k085k348k283j817
52066D95594j413j320j292j104q83p89p14m99k13RK04M49O37N76L52L36P66J404
52048D92100J728J462Q50L31P7l8j53k45l17m67o75p29n10k10n9L3L57R63J570
52029D96068J922K051K105K128K074J935J758J610J597J790K133K457K732L186
52015E25546M043N180O185O788P135P525Q006Q322Q302Q110Q034Q100Q056P714
52001F27046P208O844O769O838O823O664O541O661O993P287P298P010O553O062
51987G22597N625N279M880M135K937J600N33k96j293k600l799m429m554m618m931
51972G21066n429n821n807n248m355l572l163k956k655k197j620q23K56J307J916
$$ plain form
51957 680899 682979 685113 687289 689301 691010 692787 695281 698713 702707 706896 711384 716456 722027 727636
51943 727636 732931 737984 743106 748449 753798 758708 762784 765817 767653 768113 767138 764967 761988 758407 754164
51928 754164 749147 743330 736727 729448 721891 714687 708248 702478 696998 691515 685869 679941 673723 667414
51914 667414 661143 654698 647725 640195 632415 624601 616709 608768 601097 594032 587647 581885 576767 572252
51900 572252 568034 563736 559262 554724 550025 544761 538626 531731 524406 516750 508490 499257 488884 477459
51886 477459 465206 452418 439504 426946 415063 403814 392974 382571 373085 365122 358974 354524
51874 354524 351460 349417 348000 346885 345903 344905 343565 341511 338682 335329 331605 327378 322580 317526 312660
51859 312660 308152 303954 300198 297175 294938 293198 291724 290613 290038 289973 290377 291474 293575 296627 300167
$$ packed form
51957F80899K080K134K176K012J709J777K494L432L994M189M488N072N571N609
51943G27636N295N053N122N343N349M910M076L033J836M60r75k171k979l581m243
51928G54164n017n817o603p279p557p204o439n770n480n483n646n928o218o309
51914F67414o271o445o973p530p780p814p892p941p671p065o385n762n118m515
51900E72252m218m298m474m538m699n264o135o895p325p656q260r233j0373j1425
51886D77459j2253j2788j2914j2558j1883j1249j0840j0403r486p963o148m450
51874C54524l064k043j417j115r82r98j340k054k829l353l724m227m798n054m866
51859C12660m508m198l756l023k237j740j474j111n75o5M04J097K101L052L540
$$ plain form
51844 300167 303774 307356 310951 314423 317486 319987 322013 323787 325475 327035 328179 328551 328027 326815 325194
51829 325194 323218 320772 317862 314696 311482 308310 305237 302352 299668 297115 294766 292971 292118 292288 293277
51814 293277 294893 297093 299811 302864 306105 309564 313306 317180 320864 324181 327349 330956 335728 342230
51800 342230 350590 360319 370370 379424 386216 389723 389246 384561 376092 364881 352250 339430 327473
51787 327473 317302 309561 304252 300756 298433 297188 297286 298602 300282 301246 300884 299200 296467 292961 288975
51772 288975 284839 280796 276948 273358 270120 267322 264995 263150 261787 260852 260271 260086 260416 261147 261776 261738
51756 261738 260873 259375 257300 254370 250398 245707 240941 236529 232523 228888 225719 223113 221051 219498
51742 219498 218505 218092 218138 218475 219053 219877 220861 221899 223038 224469 226266 228217 229983 231354 232292 232811 232942
$$ packed form
51844C00167L607L582L595L472L063K501K026J774J688J560J144L72n24j212j621
51829C25194j976k446k910l166l214l172l073k885k684k553k349j795q53J70R89
51814B93277J616K200K718L053L241L459L742L874L684L317L168L607M772O502
51800C42230Q360R729J0051R054O792L507m77m685q469j1211j2631j2820j1957
51787C27473j0171p741n309l496k323j245R8J316J680R64l62j684k733l506l986
51772B88975m136m043l848l590l238k798k327j845j363r35n81j85L30P31O29l8
51756B61738q65j498k075k930l972m691m766m412m006l635l169k606k062j553
51742B19498r93m13M6L37N78Q24R84J038J139J431J797J951J766J371R38N19J31
$$ plain form
51725 232942 232828 232722 232817 233114 233510 233920 234186 233939 232752 230537 227648 224510 221261 217884 214581 211776
51709 211776 209791 208665 208273 208461 209034 209811 210708 211682 212607 213378 214117 215059 216228 217441 218663 220052 221520
51692 221520 222550 222698 222065 221062 219907 218601 217256 216103 215262 214799 214931 215888 217563 219616 221891 224501
51676 224501 227438 230435 233221 235614 237275 237771 237106 235902 234722 233412 231397 228527 225289 222184 219286
51661 219286 216526 214146 212553 211782 211331 210629 209552 208406 207529 207106 207318 208381 210312 212794 215420 217957
51645 217957 220300 222292 223820 224964 225844 226407 226622 226766 227215 227906 228322 228110 227432 226595 225586 224153 222165
51628 222165 219736 217162 214853 213181 212207 211657 211257 210981 210869 210809 210656 210436 210269 210232 210473 211336 213120 215771
51610 215771 218950 222309 225554 228318 230231 231099 230943 229929 228374 226741 225438 224653 224467 224981 226137
$$ packed form
51725B32942j14j06R5K97L96M10K66k47j187k215k889l138l249l377l303k805
51709B11776j985j126l92J88N73P77Q97R74R25P71P39R42J169J213J222J389J468
51692B21520J030J48o33j003j155j306j345j153q41m63J32R57J675K053K275K610
51676B24501K937K997K786K393J661M96o65j204j180j310k015k870l238l105k898
51661B19286k760k380j593p71m51p02j077j146q77m23K12J063J931K482K626K537
51645B17957K343J992J528J144Q80N63K15J44M49O91M16k12o78q37j009j433j988
51628B22165k429k574k309j672r74n50m00k76j12o0j53k20j67l7K41Q63J784K651
51610B15771L179L359L245K764J913Q68j56j014j555j633j303p85j86N14J156
$$ plain form
51595 226137 227540 228739 229626 230362 230970 231264 231162 230793 230230 229376 228148 226575 224613 222119 219090 215769
51579 215769 212365 208873 205249 201667 198475 196008 194496 193996 194279 194914 195621 196446 197518 198808 200264
51564 200264 202014 204169 206534 208772 210862 213107 215612 218029 219986 221640 223595 226335 229892 234016
51550 234016 238480 243160 247905 252400 256078 258189 258098 255686 251457 246215 240700 235537 231349 228626 227406
51535 227406 227262 227705 228545 229797 231334 232809 233874 234348 234124 233079 231190 228686 225956 223254 220568
51520 220568 217823 215112 212632 210490 208744 207588 207236 207501 207758 207529 207013 206778 207062 207665 208433 209479
51504 209479 210838 212332 213928 215996 218944 222796 227344 232575 238641 245456 252460 258766 263395 265569
51490 265569 265099 262549 258847 254672 250311 246011 242302 239854 239112 240048 242228 245178 248720 252931 257763
$$ packed form
51595B26137J403J199Q87P36O08K94j02l69n63q54j228j573j962k494l029l321
51579B15769l404l492l624l582l192k467j512n00K83O35P07Q25J072J290J456
51564B00264J750K155K365K238K090K245K505K417J957J654J955K740L557M124
51550B34016M464M680M745M495L678K111r1k412m229n242n515n163m188k723j220
51535B27406j44M43Q40J252J537J475J065M74k24j045j889k504k730k702k686
51520B20568k745k711k480k142j746j156l52K65K57k29n16k35K84O03P68J046
51504B09479J359J494J596K068K948L852M548N231O066O815P004O306M629K174
51490B65569m70k550l702m175m361m300l709k448p42R36K180K950L542M211M832
$$ plain form
51475 257763 262866 267886 272699 277141 280681 282699 283182 282946 283138 284664 288069 293754 302125 313500 327890
51460 327890 344870 363758 383935 404920 426128 446827 466465 484808 501498 515660 526251
51449 526251 532701 534878 532588 525492 513610 497578 478371 457050 434764 412647 391517 371868
51437 371868 354163 338815 325775 314478 304365 295268 287134 279750 272925 266699 261102 255938 251080
51424 251080 246779 243359 240700 238332 235993 233838 232099 230806 229827 229009 228232 227474 226841 226440 226194 225910
51408 225910 225523 225143 224891 224782 224789 224875 224963 224987 225003 225149 225446 225678 225566 225078 224529 224320 224561 225015 225400 225640 225723
51387 225723 225482 224690 223321 221478 219101 216018 212354 208650 205462 203034 201412 200568 200223 199863 199221 198556
51371 198556 198185 197892 197156 195892 194569 193583 192859 192143 191423 190872 190613 190737 191438 192891 194987 197314 199462
$$ packed form
51475B57763N103N020M813M442L540K018M83k36J92J526L405N685Q371J1375J4390
51460C27890J6980J8888K0177K0985K1208K0699J9638J8343J6690J4162J0591
51449E26251O450K177k290p096j1882j6032j9207k1321k2286k2117k1130j9649
51437C71868j7705j5348j3040j1297j0113r097q134p384o825o226n597n164m858
51424B51080m301l420k659k368k339k155j739j293r79q18p77p58o33m01k46k84
51408B25910l87l80k52j09PQ6Q8K4J6J46K97K32j12m88n49k09K41M54L85K40Q3
51387B25723k41p92j369j843k377l083l664l704l188k428j622q44l45l60o42o65
51371A98556l71k93p36j264j323r86p24p16p20n51k59J24P01J453K096K327K148
$$ plain form
51354 199462 201330 203143 205219 207720 210656 214046 217980 222475 227329 232157 236531 240098 242723 244622
51340 244622 246282 248113 250183 252286 254105 255206 255045 253216 249737 245031 239716 234463 229842 226040
51326 226040 222758 219558 216318 213214 210392 207903 205903 204591 203890 203403 202816 202142 201558 201171 201089 201508
51310 201508 202550 204070 205761 207402 208954 210495 212154 214008 215988 217927 219780 221693 223811 226107
51296 226107 228479 230974 233779 237044 240770 244836 249093 253441 257920 262735 268194 274620 282288 291400
51282 291400 302118 314651 329303 346384 366076 388466 413576 441148 470321 499644 527549
51271 527549 552815 574639 592434 605610 613491 615404 611006 600597 585018 565153 541666 515285
51259 515285 487178 458794 431333 405480 381558 359768 340234 322997 308024 295192 284248
$$ packed form
51354A99462J868J813K076K501K936L390L934M495M854M828M374L567K625J899
51340B44622J660J831K070K103J819J101j61j829l479m706n315n253m621l802
51326B26040l282l200l240l104k822k489k000j312p01m87n87o74n84l87q2M19
51310B01508J042J520J691J641J552J541J659J854J980J939J853J913K118K296
51296B26107K372K495K805L265L726M066M257M348M479M815N459O426P668R112
51282B91400J0718J2533J4652J7081J9692K2390K5110K7572K9173K9323K7905
51271E27549K5266K1824J7795J3176P881J913m398j0409j5579j9865k3487k6381
51259E15285k8107k8384k7461k5853k3922k1790j9534j7237j4973j2832j0944
$$ plain form
51248 284248 274868 266776 259760 253635 248244 243510 239442 236111 233644 232115 231320 230707 229744 228368 226949
51233 226949 225786 224791 223699 222388 220864 219094 217022 214725 212395 210194 208220 206597 205434 204666 204067
51218 204067 203498 203073 203035 203502 204406 205619 207027 208495 209831 210881 211642 212265 212923 213736 214815 216297 218220
51201 218220 220337 222194 223489 224306 224913 225366 225414 224823 223663 222223 220672 218911 216763 214298 211891 209942
51185 209942 208566 207653 207231 207526 208538 209750 210560 210932 211268 211635 211528 210626 209425 208770 208929 209466 209904
51168 209904 210129 210189 210078 209873 209788 209989 210509 211417 212770 214294 215389 215686 215380 214877 214278 213459 212502 211718
51150 211718 211296 211123 210980 210756 210466 210231 210258 210692 211476 212431 213483 214680 216015 217333 218461 219332 219968
51133 219968 220454 220901 221331 221588 221449 220905 220209 219597 218980 218020 216480 214519 212604 211154 210247 209680 209281
$$ packed form
51248B84248r380q092p016o125n391m734m068l331k467j529p95o13r63j376j419
51233B26949j163r95j092j311j524j770k072k297k330k201j974j623j163p68n99
51218B04067n69m25l8M67R04J213J408J468J336J050P61O23O58Q13J079J482J923
51201B18220K117J857J295Q17O07M53M8n91j160j440j551j761k148k465k407j949
51185B09942j376r13m22K95J012J212Q10L72L36L67j07r02j201o55J59N37M38
51168B09904K25O0j11k05q5K01N20R08J353J524J095K97l06n03n99q19r57p84
51150B11718m22j73j43k24k90k35K7M34P84R55J052J197J335J318J128Q71O36
51133B19968M86M47M30K57j39n44o96o12o17r60j540j961j915j450r07n67l99
$$ plain form
51116 209281 209097 209249 209711 210309 210926 211613 212491 213602 214902 216338 217922 219682 221603 223617 225680 227773
51100 227773 229774 231440 232645 233595 234604 235607 236101 235643 234276 232365 230248 228180 226447 225240 224496
51085 224496 224040 223887 224200 224999 226059 227104 227967 228576 228927 229065 228966 228491 227578 226477 225578 224990 224450 223668
51067 223668 222645 221635 220922 220667 220795 220999 220979 220727 220497 220469 220573 220617 220462 220006 219227 218273 217392 216672 216011
51048 216011 215384 215009 215138 215784 216750 217809 218827 219838 221083 222798 224828 226594 227571 227710 227306 226551
51032 226551 225426 223943 222272 220627 219173 218045 217325 216980 216916 217124 217644 218389 219097 219537 219726 219863 220104
51015 220104 220428 220722 220944 221179 221514 221905 222250 222605 223235 224349 225815 227275 228574 229964 231769 233921
50999 233921 235945 237432 238356 238891 239039 238658 237763 236605 235378 234063 232656 231404 230587 230179 229920 229651
$$ packed form
51116B09281j84J52M62N98O17O87Q78J111J300J436J584J760J921K014K063K093
51100B27773K001J666J205R50J009J003M94m58j367j911k117k068j733j207p44
51085B24496m56j53L13P99J060J045Q63O09L51J38r9m75r13j101q99n88n40p82
51067B23668j023j010p13k55J28K04k0k52k30k8J04M4j55m56p79r54q81p20o61
51048B16011o27l75J29O46R66J059J018J011J245J715K030J766R77J39m04p55
51032B26551j125j483j671j645j454j128p20l45o4K08N20P45P08M40J89J37K41
51015B20104L24K94K22K35L35L91L45L55O30J114J466J460J299J390J805K152
50999B33921K024J487R24N35J48l81q95j158j227j315j407j252q17m08k59k69
$$ plain form
50983 229651 229408 229209 228958 228591 228151 227666 227106 226475 225881 225475 225415 225902 227044 228693 230525 232283 233838
50966 233838 235073 235947 236688 237602 238628 239348 239577 239687 240184 241197 242626 244525 247004 249959 253253 257125
50950 257125 262040 268122 275044 282485 290386 298661 306964 314899 322185 328446 333107 335795 336731 336444 335157
50935 335157 332656 328748 323609 317660 311346 305070 299118 293492 288001 282705 278155 274972 273221 272392
50921 272392 272003 271991 272511 273620 275344 277808 281062 284873 288934 293215 297871 302854 307950 313232 319185
50906 319185 326209 334153 342519 350951 359362 367720 375913 383820 391394 398737 406170 414108 422694 431581
50892 431581 440220 448302 455809 462716 468833 473999 478330 482199 486025 489998 493946 497456 500193 502051
50878 502051 503035 503216 502955 503009 504171 506864 511309 517960 527485 540294 556343 575429 597334 621591
$$ packed form
50983B29651k43j99k51l67m40m85n60o31n94m06o0M87J142J649J832J758J555
50966B33838J235Q74P41R14J026P20K29J10M97J013J429J899K479K955L294L872
50950B57125M915O082O922P441P901Q275Q303P935P286O261M661K688R36k87j287
50935C35157k501l908n139n949o314o276n952n626n491n296m550l183j751q29
50921B72392l89j2N20J109J724K464L254L811M061M281M656M983N096N282N953
50906C19185P024P944Q366Q432Q411Q358Q193P907P574P343P433P938Q586Q887
50892D31581Q639Q082P507O907O117N166M331L869L826L973L948L510K737J858
50878E02051R84J81k61N4J162K693M445O651R525J2809J6049J9086K1905K4257
$$ plain form
50864 621591 647497 674613 703037 732889 763669 794435 824484 853521 881141 906558 929000
50853 929000 948154 964016 976535 985677 991736 995258 996619 995977 993781 991100 989120 988248 987824 986691
50839 986691 983950 979211 972434 963797 953674 942531 930711 918350 905419 891740 876951 860637
50827 860637 842628 823149 802545 780931 758178 734273 709564 684641 660012 636021 612966
50816 612966 591192 571021 552666 536200 521535 508415 496562 485894 476539 468554 461710 455650
50804 455650 450200 445408 441313 437772 434567 431578 428837 426479 424622 423199 421952 420660 419402 418452
50790 418452 417992 418039 418658 419984 421999 424436 427048 429790 432692 435663 438608 441583 444725 448090 451711
50775 451711 455677 460060 464863 470178 476239 483122 490519 498087 505955 514641 524482 535470 547650 561355
$$ packed form
50864F21591K5906K7116K8424K9852L0780L0766L0049K9037K7620K5417K2442
50853I29000J9154J5862J2519R142O059L522J361o42k196k681j980q72m24j133
50839I86691k741m739o777q637j0123j1143j1820j2361j2931j3679j4789j6314
50827H60637j8009j9479k0604k1614k2753k3905k4709k4923k4629k3991k3055
50816F12966k1774k0171j8355j6466j4665j3120j1853j0668r355p985o844o060
50804D55650n450m792m095l541l205k989k741k358j857j423j247j292j258r50
50790D18452m60M7O19J326K015K437K612K742K902K971K945K975L142L365L621
50775D51711L966M383M803N315O061O883P397P568P868Q686R841J0988J2180J3705
$$ plain form
50761 561355 576879 594177 613120 633955 657341 683991 714366 748623 786729 828695 874780
50750 874780 925374 980565 1039918 1102796 1168812 1237802 1309372 1382622 1456246 1528709 1598320
50739 1598320 1663284 1721840 1772386 1813567 1844530 1865160 1875971 1877611 1870609 1855766 1834653 1809452
50727 1809452 1782199 1754385 1727308 1702574 1681850 1666032 1654793 1646987 1641389 1636907 1632214 1625525
50715 1625525 1614991 1599376 1578236 1551479 1518926 1480437 1436317 1387386 1334661 1279158 1221997
50704 1221997 1164405 1107510 1052263 999674 950854 906586 866998 831931 801531 776190 755971
50693 755971 740375 728688 720303 714733 711632 710886 712352 715396 719002 722513 725950 729386 732313 733954
50679 733954 734009 732740 730473 727356 723572 719394 714918 709950 704243 697690 690238 681794 672271 661669
$$ packed form
50761E61355J5524J7298J8943K0835K3386K6650L0375L4257L8106M1966M6085
50750H74780N0594N5191N9353O2878O6016O8990P1570P3250P3624P2463O9611
50739A598320O4964N8556N0546M1181L0963K0630J0811J640p002j4843k1113k5201
50727A809452k7253k7814k7077k4734k0724j5818j1239p806n598m482m693o689
50715A625525j0534j5615k1140k6757l2553l8489m4120m8931n2725n5503n7161
50704A221997n7592n6895n5247n2589m8820m4268l9588l5067l0400k5341k0219
50693G55971j5596j1687q385n570l101p46J466L044L606L511L437L436K927J641
50679G33954N5j269k267l117l784m178m476m968n707o553p452q444r523j0602
$$ plain form
50665 661669 650083 637739 625025 612382 600176 588724 578312 569044 560786 553476 547458 543294
50653 543294 541185 540735 541342 542707 544951 548385 553201 559330 566524 574674 584007 594963 607927 623157
50639 623157 640870 661237 684336 710270 739291 771652 807336 845994 887060 929791 973316
50628 973316 1016871 1059933 1101972 1142190 1179755 1214171 1245056 1271574 1292395 1306354 1312929 1312121
50616 1312121 1304234 1289922 1270185 1246197 1219356 1191559 1165005 1141403 1121458 1105243 1092810
50605 1092810 1084183 1078980 1076385 1075497 1075517 1075598 1074706 1071625 1065108 1054147 1038278 1017667 992912 964807
50591 964807 934250 902152 869361 836808 805682 777142 751729 729306 709752 693467 680978
50580 680978 672299 667012 664846 665875 670187 677679 688199 701666 717964 736790 757609 779662 802105
$$ packed form
50665F61669j1586j2344j2714j2643j2206j1452j0412r268q258p310o018m164
50653E43294k109m50O07J365K244L434M816O129P194Q150R333J0956J2964J5230
50639F23157J7713K0367K3099K5934K9021L2361L5684L8658M1066M2731M3525
50628I73316M3555M3062M2039M0218L7565L4416L0885K6518K0821J3959O575q08
50616A312121p887j4312j9737k3988k6841k7797k6554k3602j9945j6215j2433
50605A092810q627n203k595q88K0Q1q92l081o517j0961j5869k0611k4755k8105
50591I64807l0557l2098l2791l2553l1126k8540k5413k2423j9554j6285j2489
50580F80978q679n287k166J029M312P492J0520J3467J6298J8826K0819K2053K2443
$$ plain form
50567 802105 824221 845462 865237 882894 898070 910918 921734 930537 937265 942289 946289 949569
50555 949569 951740 952220 950846 947975 944148 939790 935070 929947 924469 919119 914826 912554 912871 915858 921330
50540 921330 929077 939007 951124 965415 981728 999748 1019005 1038902 1058877 1078641 1098261 1118065
50528 1118065 1138613 1160724 1185070 1211269 1237176 1259171 1273217 1276018 1265984 1243904 1212848
50517 1212848 1177046 1140434 1105878 1075149 1049031 1027472 1010063 996536 986676 979906 975398 972682
50505 972682 971726 972245 973257 973481 971938 967975 961000 950507 936262 918312 896970 872926 847200
50492 847200 820770 794304 768382 743758 721214 701203 683784 668762 655811 644616 635064 627160
$$ packed form
50567H02105K2116K1241J9775J7657J5176J2848J0816Q803O728N024M000L280
50555I49569K171M80j374k871l827m358m720n123n478n350m293k272L17K987N472
50540I21330P747R930J2117J4291J6313J8020J9257J9897J9975J9764J9620J9804
50528A118065K0548K2111K4346K6199K5907K1995J4046K801j0034k2080l1056
50517A212848l5802l6612l4556l0729k6118k1559j7409j3527r860o770m508k716
50505I72682r56N19J012K24j543l963o975j0493j4245j7950k1342k4044k5726
50492H47200k6430k6466k5922k4624k2544k0011j7419j5022j2951j1195r552p904
$$ [...]
##END NTUPLES=NMR SPECTRUM
##END=
