##TITLE=AC1525_ROEFFECT0006_8202208_8TdhNIkwTJ
##JCAMPDX= 6.0         $$ Bruker NMR JCAMP-DX V2.0
##DATA TYPE= NMR SPECTRUM
##DATA CLASS= NTUPLES
##ORIGIN= BRUKER
##OWNER= Administrator
$$ 1.72 TOPSPIN		Version 2.1
$$ 2013-09-26 23:22:19.124 -0700  Administrator@X
$$ Compression mode = diff/dup
##.OBSERVE FREQUENCY= 400.02188249412
##.OBSERVE NUCLEUS= ^1H
##.ACQUISITION MODE= SIMULTANEOUS (DQD)
##.ACQUISITION SCHEME= undefined
##.AVERAGES= 8
##.DIGITISER RES= 22
##SPECTROMETER/DATA SYSTEM= spect
##.PULSE SEQUENCE= zg30
##.SOLVENT NAME= COFFEE_meoh
##.SHIFT REFERENCE= INTERNAL, COFFEE_meoh, 1, 14.98509
##AUDIT TRAIL= $$ (NUMBER, WHEN, WHO, WHERE, PROCESS, VERSION, WHAT)
$$ ##TITLE= Audit trail, TOPSPIN		Version 2.1
$$ ##JCAMPDX= 5.01
$$ ##ORIGIN= Bruker BioSpin GmbH
$$ ##OWNER= Administrator
$$ $$ E:\/data/COFFEE/nmr/AC1525_ROEFFECT0006_8202208_8TdhNIkwTJ/10/pdata/1/auditp.txt
$$ ##AUDIT TRAIL=  $$ (NUMBER, WHEN, WHO, WHERE, PROCESS, VERSION, WHAT)
(   1,<2013-09-26 23:22:11.921 -0700>,<Administrator>,<X>,<go>,<TOPSPIN 2.1>,
      <created by zg
	started at 2013-09-26 23:21:05.497 -0700,
	POWCHK enabled, PULCHK disabled,
       configuration hash MD5:
       C8 4E 4E 5D D3 5C D8 9E 9F 52 82 E0 59 8A DE 15
       data hash MD5: 64K
       B3 E9 60 D2 03 17 5F 32 50 CC 99 A2 1A CA 9F E5>)
(   2,<2013-09-26 23:22:14.858 -0700>,<Administrator>,<X>,<proc1d>,<TOPSPIN 2.1>,
      <Start of raw data processing
       efp LB = 0 FT_mod = 6 PKNL = 1 PHC0 = 0 PHC1 = 0 SI = 32K 
       data hash MD5: 32K
       21 9E B4 5F C7 44 BD DC 01 A6 FE C9 41 EF 04 97>)
(   3,<2013-09-26 23:22:15.249 -0700>,<Administrator>,<X>,<proc1d>,<TOPSPIN 2.1>,
      <pk PHC0 = 96.79504 PHC1 = 0 
       data hash MD5: 32K
       CD 81 4F EE 52 66 AB 9A 2D E4 1C 5D 5C 7A 9E 79>)
(   4,<2013-09-26 23:22:15.468 -0700>,<Administrator>,<X>,<proc1d>,<TOPSPIN 2.1>,
      <abs ABSG = 1 
       data hash MD5: 32K
       F7 79 C5 82 6B 04 B4 BE 08 71 44 8F 2B 0D 1D 9F>)
(   5,<2013-09-26 23:22:15.546 -0700>,<Administrator>,<X>,<proc1d>,<TOPSPIN 2.1>,
      <abs ABSG = 2 
       data hash MD5: 32K
       C2 FE B4 26 FC 8D 24 E0 5C DA 14 98 64 88 EC B4>)
(   6,<2013-09-26 23:22:15.639 -0700>,<Administrator>,<X>,<proc1d>,<TOPSPIN 2.1>,
      <abs ABSG = 3 
       data hash MD5: 32K
       B2 63 5C A4 3B 5F 8C 53 29 3C 4F 57 7F DC 3B 16>)
(   7,<2013-09-26 23:22:15.702 -0700>,<Administrator>,<X>,<proc1d>,<TOPSPIN 2.1>,
      <abs ABSG = 4 
       data hash MD5: 32K
       02 23 53 27 CB D5 FD 6E B0 3C 61 66 91 21 04 23>)
(   8,<2013-09-26 23:22:15.749 -0700>,<Administrator>,<X>,<proc1d>,<TOPSPIN 2.1>,
      <abs ABSG = 5 
       data hash MD5: 32K
       D0 9E 1F 86 6C 57 5B 53 E6 CC C5 D6 76 CC 8E C0>)
$$ ##END=
$$ 
$$ $$ hash MD5
$$ $$ AE D9 EA 0D 19 A0 21 76 17 B4 72 29 BA 36 E8 C2
##$RELAX= 
##$RELAX= 
##$RELAX= 
##$RELAX= 
##$RELAX= 
##$RELAX= 
##$RELAX= 
$$ Bruker specific parameters
$$ --------------------------
##$DU= <E:\>
##$EXPNO= 10
$$ [...]
##$TP= (0..7)
150 150 150 150 150 150 150 150
##$TP07= 0
##$TPNAME0= <>
##$TPNAME1= <>
##$TPNAME2= <>
##$TPNAME3= <>
##$TPNAME4= <>
##$TPNAME5= <>
##$TPNAME6= <>
##$TPNAME7= <>
##$TPOAL= (0..7)
0.5 0.5 0.5 0.5 0.5 0.5 0.5 0.5
##$TPOFFS= (0..7)
0 0 0 0 0 0 0 0
##$TUNHIN= 0
##$TUNHOUT= 0
##$TUNXOUT= 0
##$USERA1= <user>
##$USERA2= <user>
##$USERA3= <user>
##$USERA4= <user>
##$USERA5= <user>
##$V9= 5
##$VALIST= <valist>
##$VCLIST= <CCCCCCCCCCCCCCC>
##$VD= 0
##$VDLIST= <DDDDDDDDDDDDDDD>
##$VPLIST= <PPPPPPPPPPPPPPP>
##$VTLIST= <TTTTTTTTTTTTTTT>
##$WBST= 1024
##$WBSW= 4
##$XGAIN= (0..3)
0 0 0 0
##$XL= 0
##$YL= 0
##$YMAX_a= 669307
##$YMIN_a= -569338
##$ZGOPTNS= <>
##$ZL1= 120
##$ZL2= 120
##$ZL3= 120
##$ZL4= 120
##$ABSF1= 14.98509
##$ABSF2= -5.573092
##$ABSG= 5
##$ABSL= 3
##$ALPHA= 0
##$AQORDER= 0
##$ASSFAC= 0
##$ASSFACI= 0
##$ASSFACX= 0
##$ASSWID= 0
##$AUNMP= <proc_prof1d_extract_pilot.lims>
##$AXLEFT= 0
##$AXNAME= <>
##$AXNUC= <1H>
##$AXRIGHT= 0
##$AXTYPE= 0
##$AXUNIT= <>
##$AZFE= 0.1
##$AZFW= 0.1
##$BCFW= 0
##$BC_mod= 0
##$BYTORDP= 0
##$COROFFS= 0
##$CY= 15
##$DATMOD= 1
##$DC= 0
##$DFILT= <>
##$DTYPP= 0
##$F1P= 0
##$F2P= 0
##$FCOR= 0.5
##$FTSIZE= 32768
##$FT_mod= 6
##$GAMMA= 0
##$GB= 0
##$INTBC= 1
##$INTSCL= 1
##$ISEN= 128
##$LB= 0
##$LEV0= 0
##$LPBIN= 0
##$MAXI= 10000
##$MC2= 0
##$MEAN= 0
##$ME_mod= 0
##$MI= 0
##$NCOEF= 0
##$NC_proc= -8
##$NLEV= 6
##$NOISF1= 0
##$NOISF2= 0
##$NSP= 0
##$NTH_PI= 0
##$NZP= 0
##$OFFSET= 14.98509
##$PC= 1
##$PHC0= 96.79504
##$PHC1= 0
##$PH_mod= 1
##$PKNL= yes
##$PPARMOD= 0
##$PPDIAG= 0
##$PPIPTYP= 0
##$PPMPNUM= 2147483647
##$PPRESOL= 1
##$PSCAL= 4
##$PSIGN= 0
##$PYNMP= <proc.py>
##$REVERSE= no
##$SF= 400.02
##$SI= 32768
##$SIGF1= 0
##$SIGF2= 0
##$SINO= 400
##$SIOLD= 32768
##$SPECTYP= <>
##$SREGLST= <1H.CDCl3>
##$SSB= 0
##$STSI= 32768
##$STSR= 0
##$SW_p= 8223.68421052631
##$SYMM= 0
##$S_DEV= 0
##$TDeff= 65536
##$TDoff= 0
##$TI= <>
##$TILT= no
##$TM1= 0
##$TM2= 0
##$TOPLEV= 0
##$USERP1= <user>
##$USERP2= <user>
##$USERP3= <user>
##$USERP4= <user>
##$USERP5= <user>
##$WDW= 1
##$XDIM= 32768
##$YMAX_p= 485435168
##$YMIN_p= -882924
##$CURPLOT= <Network HP LaserJet P1505>
##$CURPRIN= <$Network HP LaserJet P1505>
##$DFORMAT= <normdp>
##$LAYOUT= <+/1D_H.xwp>
##$LFORMAT= <normlp>
##$PFORMAT= <normpl>
##$SURQMSG= 1
$$ End of Bruker specific parameters
$$ ---------------------------------
##NTUPLES= NMR SPECTRUM
##VAR_NAME=  FREQUENCY,     SPECTRUM/REAL,   SPECTRUM/IMAG
##SYMBOL=    X,             R,               I
##VAR_TYPE=  INDEPENDENT,   DEPENDENT,       DEPENDENT
##VAR_FORM=  AFFN,          ASDF,            ASDF
##VAR_DIM=   32768,         32768,           32768
##UNITS=     HZ,            ARBITRARY UNITS, ARBITRARY UNITS
##FACTOR=    0.250966925370066, 1,           1
##FIRST=     8223.43324360094, -249311,      -12913
##LAST=      0,             30123,           178211
##MIN=       0,             -882924,         0
##MAX=       8223.43324360094, 485435168,    0
$$ Real data points
##PAGE= N=1
##DATA TABLE= (X++(R..R)), XYDATA
$$ [...]
19530b30071i8110b5517O094j61569B3897a10316l5973k5109j04364A6308Q9142
$$ -230071 -98110 -25517 -19423 -180992 23897 -110316 -146289 -171398 -275762 16308 105450
19519A05450J40070F0170L30054A83946e745j55283L2959A38539b40126B20997
$$ 105450 245520 60170 390224 183946 -5745 -161028 -128069 138539 -240126 220997
19508b20626h2997j61707h3214e215j29679j27599A87773a02730a4371j89858
$$ -220626 -82997 -244704 -83214 -5215 -134894 -262493 187773 -102730 -14371 -204229
19498b04229j3515A77024j3922A2348L28751c08587D1863J87227b02597C63484
$$ -204229 -217744 177024 163102 12348 341099 -308587 41863 229090 -202597 363484
19487D7296J18537J31008D4742A6826R7261O8348a96820O6763f2260r4235G098
$$ 47296 165833 296841 44742 16826 114087 182435 -196820 -130057 -62260 -156495 7098
19475a62916f1326A5888J63822a97910Q9326n0289J0975J1969A65896b7474j20179
$$ -162916 -61326 15888 179710 -197910 -108584 -158873 -147898 -135929 165896 -27474 -147653
19464a47653I363f7427C0631a29262k08839a58707D2970a16538C1188a42704j6041
$$ -147653 9363 -67427 30631 -129262 -338101 -158707 42970 -116538 31188 -142704 -158745
19453a58745n7459F5453f6502r2495J920C42948b92531L5940A30023J89883c12967
$$ -158745 -216204 65453 -66502 -158997 -157077 342948 -292531 -256591 130023 319906 -312967
19441a43420j64765a36058R497A24463E9752a55562B9124a61749j87085D0283
$$ -143420 -308185 -136058 -126561 124463 59752 -155562 29124 -161749 -348834 40283
19430a29289B35857a13500q1182e2188B19797C1762L6531a64308H9399a66275
$$ -129289 235857 -113500 -194682 -52188 219797 31762 68293 -164308 89399 -166275
19419f5850k43334A45885l6538O4998b87591a29704j0646k9706d7143m13782B73370
$$ -65850 -309184 145885 109347 174345 -287591 -129704 -140350 -170056 -47143 -460925 273370
19407F0635c43693A38720c3460B6987L9690O7965a11240j17490p2622a21547B9466
$$ 60635 -343693 138720 -33460 26987 66677 134642 -111240 -228730 -301352 -121547 29466
19395b7979j40447k66055c4429G3019a76040c3602A17888b22822e3579q190r5626
$$ -27979 -168426 -434481 -34429 73019 -176040 -33602 117888 -222822 -53579 -61769 -157395
19384a57395J8645a5233F8453c5351A40788A340c00848i5144A93660b43469F7782
$$ -157395 -138750 -15233 68453 -35351 140788 1340 -300848 -95144 193660 -243469 67782
19372E8205a55935L931A9608Q44h6310A0838b63108b6474A30890l2035J11973
$$ 58205 -155935 -152004 19608 20452 -86310 10838 -263108 -26474 130890 98855 210828
19361B10828h9452A92582a8106m0543q1802e6397j706k81579J48581g5560p4382
$$ 210828 -89452 192582 -18106 -58649 -140451 -56397 -58103 -339682 -191101 -75560 -149942
19350a49942n9924A20432a64807H5292K72424j52690a60704e4850j70061M5152
$$ -149942 -209866 120432 -164807 85292 357716 205026 -160704 -54850 -224911 -179759
19340a79759k19253a08419L5323j74884a22122A10668m9036c1907A66551b23733
$$ -179759 -399012 -108419 -73096 -247980 -122122 110668 61632 -31907 166551 -223733
19329H4877a10733C7236J68599a33092H7501b9519A83278b35038a06297J8953
$$ 84877 -110733 37236 205835 -133092 87501 -29519 183278 -235038 -106297 -87344
19319h7344l00753A00108c67346N7964N0735A80354b44385F5433a18812A225a60647
$$ -87344 -388097 100108 -367346 -309382 -258647 180354 -244385 65433 -118812 1225 -160647
19307a5052I327b80733a10245j01520r8656I0210b83525L8390j05728H5713h1397
$$ -15052 9327 -280733 -110245 -211765 -310421 90210 -283525 -245135 -350863 85713 -81397
19295f8049A12239a28211m8840j06160a1524j90178B05627a03366l4286m9246
$$ -68049 112239 -128211 -177051 -283211 -11524 -201702 205627 -103366 -137652 -186898
19285a86898B0086a82149C09352h6966B8307J58211C3339a01864r5581i1298G8460
$$ -186898 20086 -182149 309352 -86966 28307 186518 33339 -101864 -197445 -91298 78460
19273C0251d59789M5494a52439O4669L8684j6923p090l63028a55386B98518L9094
$$ 30251 -459789 -414295 -152439 -87770 -49086 -66009 -73099 -436127 -155386 298518 337612
19262C37612a46733A72969D8333h0746A42983a21477Q790M7288F8269K1195O6966
$$ 337612 -146733 172969 48333 -80746 142983 -121477 -112687 -65399 68269 89464 156430
19251A56430F5778c34724J63413k08699J69303g5996B37529h0315p0082C7864
$$ 156430 65778 -334724 -171311 -380010 -210707 -75996 237529 -80315 -150397 37864
19240e8378B1457Q8678L01909E5594a00246b5122l2807j2846F0417J70737C6354
$$ -58378 21457 110135 412044 55594 -100246 -25122 -57929 -70775 60417 231154 36354
19228A10941a1531H4008a98299a7163D4823a30467j12895f8347p9982A50994b16512
$$ 110941 -11531 84008 -198299 -17163 44823 -130467 -243362 -68347 -148329 150994 -216512
19216c09999f0480B49216f7905a920A487d21128d9065m422D440R4593b94001B38198
$$ -309999 -60480 249216 -67905 -1920 1487 -421128 -49065 -53487 4440 99033 -294001 238198
19203H3760b06884N9938e7344p3980R717b6846B6733b5662A82210a40914A10576
$$ 83760 -206884 -146946 -57344 -131324 -121607 -26846 26733 -25662 182210 -140914 110576
19191a77961b7188n7776j03456d5459j72767g4698G1654J57917d46404L1250b1118
$$ -177961 -27188 -84964 -188420 -45459 -218226 -74698 71654 229571 -446404 -415154 -21118
19179b75416H4610h9526E0404R0362c26272L3746J05519d0073j50818e2580B87239
$$ -275416 84610 -89526 50404 140766 -326272 -292526 -187007 -40073 -190891 -52580 287239
19167b45232j44356h1499H416Q1289A1507f7430j15795H3123i8584J195c1188
$$ -245232 -389588 -81499 8416 89705 11507 -67430 -183225 83123 -98584 -97389 -31188
19155H0006h9158r9617Q0966a4682j12425k13913M9080N2251B2253J10972a39164
$$ 80006 -89158 -188775 -107809 -14682 -127107 -341020 -291940 -239689 22253 133225 -139164
19143D8100a24048C2084c51580a58939f0580D1618b65045j35742J24413j228p3995
$$ 48100 -124048 32084 -351580 -158939 -60580 41618 -265045 -400787 -276374 -277602 -351597
19132c51597A34151a52088k1809j58668B05189a49632E4663P2196K5745a46973
$$ -351597 134151 -152088 -173897 -332565 205189 -149632 54663 126859 152604 -146973
19121A00038b6896l7451k47659d0656C2252a66319I6727c15580O6403j689e4632
$$ 100038 -26896 -64347 -312006 -40656 32252 -166319 96727 -315580 -249177 -250866 -54632
19109B0677a05675A1677a43931k0178I6188a01390j88538B4584c16303E5685b32349
$$ 20677 -105675 11677 -143931 -164109 96188 -101390 -289928 24584 -316303 55685 -232349
19097c33418A84118H6695a4976C7486L6825J09564a01807l02841A67978b44943
$$ -333418 184118 86695 -14976 37486 74311 183875 -101807 -404648 167978 -244943
19086a75136K3349f9249r8554G1023K5627b56561A53493L6794b12687A56066D5622
$$ -175136 -151787 -69249 -167803 71023 96650 -256561 153493 190287 -212687 156066 45622
19074a56597A56680b14631K9027a5671f178B05111b49742k2764c5922m8786p4788
$$ -156597 156680 -214631 -185604 -15671 -6178 205111 -249742 -272506 -35922 -84708 -159496
19063a59496e0306n9826C064a23116r7072A28579d02718A66771G4895a18032E4268
$$ -159496 -50306 -110132 3064 -123116 -220188 128579 -402718 166771 74895 -118032 54268
19051d8382r8473A62085L0913a04978B4983a68421A56350F3188f2861A4486b64062
$$ -48382 -146855 162085 192998 -104978 24983 -168421 156350 63188 -62861 14486 -264062
19039c17311f1366k12955A10115i3702k77290k00690A61469a59763A52551k2067
$$ -317311 -61366 -274321 110115 -93702 -370992 -571682 161469 -159763 152551 130484
19029A30484k501g3287H8412J85445b6705p8801B31401b93697B4790K44088p1584
$$ 130484 127983 -73287 88412 273857 -26705 -105506 231401 -293697 24790 268878 197294
19018A97294J64545A25036D8283K8615a56905P3963j70890e8247k34656R8061
$$ 197294 361839 125036 48283 76898 -156905 -82942 -253832 -58247 -292903 -194842
19008a94842E8677a38459E7031b09240i4863M6330k43892E3792c0444J3452k13303
$$ -194842 58677 -138459 57031 -209240 -94863 -48533 -292425 53792 -30444 -16992 -230295
18997b30295G9096b20247P6232B97150h7411J9881b8017n4122j90550D5R56J12478
$$ -230295 79096 -220247 -144015 297150 -87411 -67530 -28017 -82139 -272689 45 1001 113479
18985A13479B5984b89719e9519q1812j3990C05707c1494j1192a8369A31036b28311
$$ 113479 25984 -289719 -59519 -141331 -155321 305707 -31494 -42686 -18369 131036 -228311
18973B60148B8137Q7875a65872e9488A09100B7375i2940A11056D6103L92843a89209
$$ 260148 28137 116012 -165872 -59488 109100 27375 -92940 111056 46103 438946 -189209
18961G4190b4545D7912d64522A07814d7315r8329b9330A13712Q6878H9831L64226
$$ 74190 -24545 47912 -464522 107814 -47315 -145644 -29330 113712 200590 89831 454057
18950D54057a41588d556C5310g1944k21503a36786k632G7131A2724a58263d6065
$$ 454057 -141588 -4556 35310 -71944 -293447 -136786 -139418 77131 12724 -158263 -46065
18938F4734L43827A14464N7335a77144B99395B7145d9149o1423C13230J51446
$$ 64734 408561 114464 171799 -177144 299395 27145 -49149 -110572 313230 464676
18928D64676a0347C15443b39999F7076c13995B11271c96010A49878c7094n311
$$ 464676 -10347 315443 -239999 67076 -313995 211271 -396010 149878 -37094 -42405
18918d2405A25877k4100K5537b474q5786B93295c10333e9173p3902A77729b85107
$$ -42405 125877 101777 127314 -2474 -88260 293295 -310333 -59173 -133075 177729 -285107
18906d8705j37056n3920B9014e4141A72975f6301j14702L9419C5387a69148J5476
$$ -48705 -185761 -239681 29014 -54141 172975 -66301 -181003 -141584 35387 -169148 -153672
18895a53672j24922H0378j6261b32258A44300R5999a28973r6585B91770I7647
$$ -153672 -278594 80378 64117 -232258 144300 240299 -128973 -225558 291770 97647
18884b21286J00179q3114e070j28524E2414g0935B57537b65189B02061h2700j22437
$$ -221286 -121107 -204221 -5070 -133594 52414 -70935 257537 -265189 202061 -82700 -205137
18873b05137m7930e3086r9037e5587A19526M142i2150C6106J23095o5701k4560
$$ -205137 -253067 -53086 -152123 -55587 119526 123668 -92150 36106 159201 93500 68940
18862F8940N8330e72649a62477d1017j39837e4242n3879d5341k98245A68807b1040
$$ 68940 127270 -572649 -162477 -41017 -180854 -54242 -108121 -45341 -343586 168807 -21040
18850c86048A183P4820K79844d8935A73060d33738a19712H3714f9480n07057B82811
$$ -386048 1183 76003 355847 -48935 173060 -433738 -119712 83714 -69480 -576537 282811
18838i4313d5970l41125I6762b38064R6421j98139n977e8119r4241o1642P3067
$$ -94313 -45970 -387095 96762 -238064 -141643 -339782 -345759 -58119 -152360 -214002 -140935
18827a40935D621J61251D0968J52177B7499K53240a07366A12614k858L94743A19626
$$ -140935 4621 165872 40968 193145 27499 280739 -107366 112614 109756 504499 119626
18815I6452C2228P3436b6429D4989O31650H8442J16280j9012h5970A12839c31518
$$ 96452 32228 105664 -26429 44989 676639 88442 204722 185710 -85970 112839 -331518
18803F0786a3506p5316C01443B4347a53347J8986o1374E3592b16319L0078B49825
$$ 60786 -13506 -88822 301443 24347 -153347 -134361 -195735 53592 -216319 -186241 249825
18791b13841O1707A04376j1034c0499l8989r475j81831r7835a72006k97453a56150
$$ -213841 -152134 104376 93342 -30499 -69488 -78963 -260794 -358629 -172006 -469459 -156150
18779b24313i7503B24442a38205j3177A16408c62687o6874g5164D3017b48640
$$ -224313 -97503 224442 -138205 -151382 116408 -362687 -429561 -75164 43017 -248640
18768a84593N4658C74J16260K70238A74641k7558c13749D856i8622C0052f3393
$$ -184593 -129935 374 116634 386872 174641 147083 -313749 4856 -98622 30052 -63393
18756a19217B27424b66838g3508B91676D2356g0407C41122A6827O9151a52488
$$ -119217 227424 -266838 -73508 291676 42356 -70407 341122 16827 85978 -152488
18745a32040B34889a23285j90702j29345A2887b70196A80544h4763a4605A02279
$$ -132040 234889 -123285 -313987 -443332 12887 -270196 180544 -84763 -14605 102279
18734F4857b99689c8230D6053K4098b01604O366i7306A85205B4045a3115B9375
$$ 64857 -299689 -38230 46053 70151 -201604 -195238 -97306 185205 24045 -13115 29375
18722d59925K27393R7375L0749j6947D5046a93018j6502B35725o6125l2881J08359
$$ -459925 -232532 -135157 -104408 -121355 45046 -193018 -209520 235725 169600 136719 245078
18711B45078a45144B21973c874E6047a23637k2656a8405A8524D170f4279D4748
$$ 245078 -145144 221973 -3874 56047 -123637 -146293 -18405 18524 4170 -64279 44748
18699e2909I7803h1530A74715M4132B946J26424m7544b5184k10371L5900i9096
$$ -52909 97803 -81530 174715 218847 2946 129370 81826 -25184 -235555 -199655 -99096
18687d7090C07554g8954k13198R4812j50225B5955c563A89263D4182A4029a85824
$$ -47090 307554 -78954 -292152 -197340 -347565 25955 -3563 189263 44182 14029 -185824
18675C6718e6641j92381A24417b21364n0640r1904A54365J05828H8161g3090l670
$$ 36718 -56641 -249022 124417 -221364 -272004 -363908 154365 260193 88161 -73090 -76760
18664g6760k78103a01356A85997e27554e9701k1361H2993b26674B9151h0278j39797
$$ -76760 -354863 -101356 185997 -527554 -59701 -81062 82993 -226674 29151 -80278 -220075
18653b20075A22789b25490r7184M6527R7905A32448A547c93059R9460a1803l22235
$$ -220075 122789 -225490 -322674 -276147 -178242 132448 1547 -393059 -293599 -11803 -334038
18642c34038a63606k5162C834P1386g3633j91853A20567d0852k46493h44B34152
$$ -334038 -163606 -188768 3834 75220 -73633 -265486 120567 -40852 -287345 -844 234152
18630A3458J67277N9690g1695a0738j13561e4699B04639b87543A56574a48110
$$ 13458 180735 240425 -71695 -10738 -124299 -54699 204639 -287543 156574 -148110
18619b55310d6671c310j00382B59967q0389f2311E3992a88869B99194a43694d7264
$$ -255310 -46671 -3310 -103692 259967 179578 -62311 53992 -188869 299194 -143694 -47264
18607b44572i7425j28132k94399K40390D66076a03241d6168F7006h1628d0558
$$ -244572 -97425 -225557 -519956 -279566 466076 -103241 -46168 67006 -81628 -40558
18596H8406b5608C9364a75911j51266a14329n024k32151D2794d74590a17123j62551
$$ 88406 -25608 39364 -175911 -327177 -114329 -119353 -351504 42794 -474590 -117123 -279674
18585b79674g5328r9233M0207E3101K45216a22495b6769J3134P15k50072F3335
$$ -279674 -75328 -174561 -134354 53101 298317 -122495 -26769 -13635 -12920 -262992 63335
18573B98984c97322C3569J09316O2239r7498i0421L1862a4400A92264n9984c21175
$$ 298984 -397322 33569 142885 205124 107626 -90421 -58559 -14400 192264 132280 -321175
18561a36298A2178K04008g6730A72882a88594c8231j17498f1936G8419e1138l42794
$$ -136298 12178 216186 -76730 172882 -188594 -38231 -155729 -61936 78419 -51138 -393932
18550c93932D8865b44659B29762q6149a16399n9697A97230I3285e8131G0499a4353
$$ -393932 48865 -244659 229762 143613 -116399 -176096 197230 93285 -58131 70499 -14353
18538b07844g7210d194A8545c21348a29167q0956i0970F1165b65503e3214b3744
$$ -207844 -77210 -4194 18545 -321348 -129167 -210123 -90970 61165 -265503 -53214 -23744
18526a08181A42281b34961R8775A05581N521a00556A39511J29058h7978E1748
$$ -108181 142281 -234961 -136186 105581 111102 -100556 139511 268569 -87978 51748
18515g4913j16028k17077G4249J61063B7123d0600j88703i4326n0306B96884o2051
$$ -74913 -190941 -408018 74249 235312 27123 -40600 -229303 -94326 -144632 296884 234833
18504B34833h0467B68932C889a060p5962H1838a2488j94001C18876B1357J41536
$$ 234833 -80467 268932 3889 -1060 -77022 81838 -12488 -206489 318876 21357 162893
18493A62893a21677B24084o7309h9231H0412L2576a82255q34h6561n5855H5446
$$ 162893 -121677 224084 156775 -89231 80412 112988 -182255 -183089 -86561 -142416 85446
18481b00443A56527b9319A20247a31160B43965c8087J6837j0248d036o1106I4580
$$ -200443 156527 -29319 120247 -131160 243965 -38087 -21250 -31498 -4036 -65142 94580
18469a43084k41085h1942C6303b55598A83531a35445K5141L3809D1056a77947
$$ -143084 -384169 -81942 36303 -255598 183531 -135445 -110304 -76495 41056 -177947
18458a8725H1276j98a79758Q3412d0791A38905h4837B13780b96332e6442H0323
$$ -18725 81276 81078 -179758 -96346 -40791 138905 -84837 213780 -296332 -56442 80323
18446B08187e066l6238l20196F5266b4871j45597h3925I6342e5996C74993d4286
$$ 208187 -5066 -41304 -361500 65266 -24871 -170468 -83925 96342 -55996 374993 -44286
18434b11734J00786j93153A03835a12625l35418a39447A7689F92a13710B99275
$$ -211734 -110948 -304101 103835 -112625 -448043 -139447 17689 692 -113710 299275
18423B42969b97221i5925C992c295A88624p5887b1177k13452A3888a44123N9695
$$ 242969 -297221 -95925 3992 -3295 188624 112737 -21177 -234629 13888 -144123 -84428
18412h4428B3872e5790F2751d0360J1181j61813B34199E3199e8805o1312A24634
$$ -84428 23872 -55790 62751 -40360 -29179 -190992 234199 53199 -58805 -120117 124634
18400e6413j11233B81390c9032l14860D9875J73543f9604j54732g3970l2586j8677
$$ -56413 -167646 281390 -39032 -353892 49875 223418 -69604 -224336 -73970 -106556 -125233
18389a25233M9852k6008D6681J45888F9918b96479D08780j05815e408A42289J58849
$$ -125233 -75381 -101389 46681 192569 69918 -296479 408780 302965 -5408 142289 301138
18378C01138C7413b17819Q3314B61016A9253L44472D4360M2554b32768J02904
$$ 301138 37413 -217819 -134505 261016 19253 363725 44360 86914 -232768 -129864
18368a29864o4224P7544e2979B9659A4306d10435A36975B1401D010e7965j09490
$$ -129864 -194088 -116544 -52979 29659 14306 -410435 136975 21401 4010 -57965 -167455
18357a67455B6167a56111c1769k12075O832A98876f4443r3109g4543l99059B19707
$$ -167455 26167 -156111 -31769 -243844 -237012 198876 -64443 -157552 -74543 -473602 219707
18345A31086b6494q56430b47830i5016K0711j8912K9516q9500O4044B0904c8965
$$ 131086 -26494 -882924 -247830 -95016 -74305 -93217 -63701 -153201 -89157 20904 -38965
18333a73429C7603F525a58199e2389q0536A89646a64508n0388B8930J178a80534
$$ -173429 37603 6525 -158199 -52389 -132925 189646 -164508 -214896 28930 30108 -180534
18321B72525g5576m04058A39332a07851j28958a963G136J08785D8214g134C7393
$$ 272525 -75576 -479634 139332 -107851 -236809 -1963 7136 115921 48214 -7134 37393
18309D9393b15593c5050r0531A48679J29752a14963k96318a92075B10109E964
$$ 49393 -215593 -35050 -125581 148679 278431 -114963 -411281 -192075 210109 5964
18298a18205f307j50174k4427B95236a59534p1626B49235a08580n1305A80192
$$ -118205 -6307 -156481 -180908 295236 -159534 -231160 249235 -108580 -159885 180192
18287a22013C445c3472A82852G920a03042j32116R7923o7570B89362C0712i812
$$ -122013 3445 -33472 182852 7920 -103042 -235158 -137235 -204805 289362 30712 -9812
18275e2461A22224g1499q8926k00341c8302A48319b23113M8621m9107A81794A5525
$$ -52461 122224 -71499 -160425 -360766 -38302 148319 -223113 -174492 -223599 181794 15525
18263c11032Q6487g1314G9337M9523R1118a12338J5550G981c79221i141E9434
$$ -311032 -224545 -71314 79337 128860 219978 -112338 -96788 7981 -379221 -9141 59434
18251G6404a79594h5046D8169f325j41339A46119e9870B99415h6606E0247b78246
$$ 76404 -179594 -85046 48169 -6325 -147664 146119 -59870 299415 -86606 50247 -278246
18239B70506d06088B10062b56809j75045a35109N3558a028C07449j24036c3866
$$ 270506 -406088 210062 -256809 -431854 -135109 -81551 -1028 307449 183413 -33866
18228a22720M8760C45429I9J04979i3369j01703E2061f5931A01841a26598A60018
$$ -122720 -73960 345429 99 105078 -93369 -195072 52061 -65931 101841 -126598 160018
18216a49815A02065F703a73948L014b28H8091b85913a06876C51764b40740C2605
$$ -149815 102065 6703 -173948 -170934 -228 88091 -285913 -106876 351764 -240740 32605
18204b093A7614J90874f3837C2328M3729b96589J34054j71219g5933B35086R3570
$$ -2093 17614 208488 -63837 32328 76057 -296589 -162535 -333754 -75933 235086 328656
18193C28656i7340j99786q5905a15119G4036C163P8049b4781j41548g518A59968
$$ 328656 -97340 -297126 -383031 -115119 74036 3163 81212 -24781 -166329 -7518 159968
18181I6445J06289f3463j25932h424k71273E0929d1518B03829F0662a5837j74107
$$ 96445 202734 -63463 -189395 -8424 -279697 50929 -41518 203829 60662 -15837 -189944
18170a89944D49328b40436A63663c13542R7225m3897J25267o2049H7053O416J41604
$$ -189944 449328 -240436 163663 -313542 -216317 -260214 -134947 -196996 87053 93469 235073
18159B35073g8724j03521Q3664A861K08872e0206k69217A285K77403A14638m6520
$$ 235073 -78724 -182245 -98581 1861 210733 -50206 -319423 1285 278688 114638 68118
18148F8118K96600G6143a19658j54832R4456B25891R364b6723C9408b55383n7879
$$ 68118 364718 76143 -119658 -274490 -180034 225891 235255 -26723 39408 -255383 -313262
18137c13262a28393j8249c1168j39904O031p4453a11187J3283B37583f1417r0983
$$ -313262 -128393 -146642 -31168 -171072 -165041 -239494 -111187 -97904 237583 -61417 -152400
18126a52400A56359B9348J56740a4993j39208G9925c10242i3912A90952a19835
$$ -152400 156359 29348 186088 -14993 -154201 79925 -310242 -93912 190952 -119835
18115I7750K5267a14770K9454A9212L2843N6938a42521F9156c1540A17566l4821
$$ 97750 123017 -114770 -85316 19212 52055 108993 -142521 69156 -31540 117566 82745
18104H2745O1008c49I507K56416e4513k99036f3190H71g9317r9572D7261i9422
$$ 82745 143753 -349 9507 265923 -54513 -353549 -63190 871 -79317 -178889 47261 -99422
18091g7555k58969A37633E393b65055i918n17853F2064c19361e7636j73056h5761
$$ -77555 -336524 137633 5393 -265055 -9918 -527771 62064 -319361 -57636 -230692 -85761
18079b40825e3089o6783l41095A75069a83559d2976A07794l5070J09789a47664
$$ -240825 -53089 -119872 -460967 175069 -183559 -42976 107794 72724 182513 -147664
18068A65605b40614B1134b82142g3762j94999m431h8095J7591H3718b99303A14279
$$ 165605 -240614 21134 -282142 -73762 -268761 -273192 -88095 -70504 83718 -299303 114279
18056E4433J94621b98652E3757e5431a3190l32580c8151l58943J23397j38933
$$ 54433 249054 -298652 53757 -55431 -13190 -345770 -38151 -397094 -273697 -412630
18046d12630a19094B5875i1168A73643c42019a30520r2747M7052a5922j83986
$$ -412630 -119094 25875 -91168 173643 -342019 -130520 -223267 -176215 -15922 -199908
18036a99908c5153A6909N5192b75388i4861M013A60476O8887g8853K8390E0407
$$ -199908 -35153 16909 72101 -275388 -94861 -90848 160476 229363 -78853 -50463 50407
18024C26073A02929d2915j76253b0131k20694B9152O4049e06201a20899j71412
$$ 326073 102929 -42915 -219168 -20131 -240825 29152 93201 -506201 -120899 -292311
18014b92311A6338b84880c2907A04760J43373A3680J04851K57831A35051J88214
$$ -292311 16338 -284880 -32907 104760 248133 13680 118531 376362 135051 323265
18004C23265h5389B53213a48099J8947n5872n0022D3403m099i2379A97870b81131
$$ 323265 -85389 253213 -148099 -129152 -185024 -235046 43403 39304 -92379 197870 -281131
17992a283H7731k6166a17655j19464B45322a69492G2490c07189B26158b96703
$$ -1283 87731 61565 -117655 -237119 245322 -169492 72490 -307189 226158 -296703
17981h0898F8672J53898d0492k15673a10883A61677f2321j26510d9510l5660B48102
$$ -80898 68672 222570 -40492 -256165 -110883 161677 -62321 -188831 -49510 -85170 248102
17969c9390l55973A26387n2705a59142A64237b21193p2937A39685Q0543J35945
$$ -39390 -395363 126387 73682 -159142 164237 -221193 -294130 139685 220228 356173
17959C56173e8208B09899c02829i5139J2743E5222L67820a83312A47134n1292
$$ 356173 -58208 209899 -302829 -95139 -82396 55222 423042 -183312 147134 95842
17949I5842a35613C11809b54516b3023I0037a07312A96933a5475j27840A95017
$$ 95842 -135613 311809 -254516 -23023 90037 -107312 196933 -15475 -143315 195017
17938A9391O4588c25645k025k022J15228Q0957d403j21647B57420c18711P3258
$$ 19391 83979 -325645 -327670 -329692 -214464 -133507 -4403 -126050 257420 -318711 -245453
17927b45453a15996A66085A6714a32928M9168F5660K71318e3001G6307P4427n0819
$$ -245453 -115996 166085 16714 -132928 -83760 65660 336978 -53001 76307 150734 99915
17916I9915J9429n2145e6600r7076m5366B08833b83990J10763Q3545j27777F5915
$$ 99915 119344 67199 -56600 -153676 -199042 208833 -283990 -173227 -89682 -217459 65915
17904B55670B630a14087A6318a28260n7576j72360g3517c5285k30008B30569a05898
$$ 255670 2630 -114087 16318 -128260 -185836 -358196 -73517 -35285 -265293 230569 -105898
17892B39367c7975j29272P6902r649D4087b9663A4002b04968a3191j41779j78704
$$ 239367 -37975 -167247 -90345 -99994 44087 -29663 14002 -204968 -13191 -154970 -333674
17881c33674E8340b04735F1393K86553G9140R9563N8625H8732a25469k15066i470
$$ -333674 58340 -204735 61393 347946 79140 178703 237328 88732 -125469 -340535 -9470
17869a81595B03666C2537a45701F5282c0188j17188d7464k83224D7124O9356e4900
$$ -181595 203666 32537 -145701 65282 -30188 -147376 -47464 -330688 47124 116480 -54900
17857d3510F7454J08761g8434k94B05952b10652b9409C01547B9231K10314d34333
$$ -43510 67454 176215 -78434 -78728 205952 -210652 -29409 301547 29231 239545 -434333
17845A34412a86168j41982A21482K4061D5687a86923j6733B7410a70059c9995
$$ 134412 -186168 -328150 121482 145543 45687 -186923 -203656 27410 -170059 -39995
17834b11570q7250q8061a63625N1121A01286d30403A65635F5449O7212J92945
$$ -211570 -298820 -386881 -163625 -112504 101286 -430403 165635 65449 132661 325606
17824C25606A17258B0741d4429A51659a28248E9045P3934a87936a758H6717L5930
$$ 325606 117258 20741 -44429 151659 -128248 59045 132979 -187936 -1758 86717 122647
17813A22647M6548J91331i1295b6025j09207O6905D6588b6735A93911h9849b9286
$$ 122647 169195 360526 -91295 -26025 -135232 -68327 46588 -26735 193911 -89849 -29286
17801a23475n0938D0349b00119B1462R8901a1241l98891A57429D8455N6638L1629
$$ -123475 -174413 40349 -200119 21462 120363 -11241 -410132 157429 48455 105093 136722
17790A36722N327c1706l7683H3874A217d0325C90733a11478B47720D391K04619
$$ 136722 142049 -31706 -69389 83874 1217 -40325 390733 -111478 247720 4391 209010
17779B09010b9969A19079J00138b0641G1322a70977C13114C1169j2560b11889
$$ 209010 -29969 119079 219217 -20641 71322 -170977 313114 31169 18609 -211889
17768a92208n6059l6669E4994b09734M4558P5451g766A29126a34876D5715g7788
$$ -192208 -248267 -284936 54994 -209734 -165176 -89725 -7766 129126 -134876 45715 -77788
17756A36307F1366b99183A05987b00928A27880k2639a70153A61262J01317c47545
$$ 136307 61366 -299183 105987 -200928 127880 105241 -170153 161262 262579 -347545
17745F672b709j04835j13709D6146M2068b76827a21910M2228G8649c5616A35369
$$ 6672 -2709 -107544 -221253 46146 88214 -276827 -121910 -79682 78649 -35616 135369
17733e4670A72124d21941d4127j96245I4489J19628O6599G3031K11059j35339
$$ -54670 172124 -421941 -44127 -240372 94489 214117 280716 73031 284090 148751
17723A48751D4978L99656e8866B42306g239p7709r6245H2102k7821i4442A37740
$$ 148751 44978 444634 -58866 242306 -7239 -84948 -181193 82102 54281 -94442 137740
17711f8434K5854D8447b15951g0922b2868C83799a49375j16635a25642A10306
$$ -68434 -42580 48447 -215951 -70922 -22868 383799 -149375 -266010 -125642 110306
17700h8510M0387A30773f1258j19563J2221J8888D9730J54135g0906A74384b94228
$$ -88510 -48123 130773 -61258 -180821 -168600 -149712 49730 203865 -70906 174384 -294228
17688D5900f9724B5661a36933A51931e0204A34817o7352b29534B912K2467a63991
$$ 45900 -69724 25661 -136933 151931 -50204 134817 67465 -229534 2912 25379 -163991
17676B31147b0445E5081a70601k80759A46745f9855A9396a52393B62102h0108
$$ 231147 -20445 55081 -170601 -451360 146745 -69855 19396 -152393 262102 -80108
17665C36558D3430a01971K8166m5104A31205Q7008C4235K5453a28355B6054R1746
$$ 336558 43430 -101971 -73805 -118909 131205 218213 34235 59688 -128355 26054 117800
17654A17800b71598J05023a8948A78201q3225b65708B12228a05047B61285A5361
$$ 117800 -271598 -166575 -18948 178201 94976 -265708 212228 -105047 261285 15361
17643A82899n6300D4149a45093A68717c36B40038a13329D88067g8133q1135e4740
$$ 182899 126599 44149 -145093 168717 -336 240038 -113329 488067 -78133 -159268 -54740
17631c5806a0258A0525b33412a7960j28496C33397h6862M1952C2257a63007H2859
$$ -35806 -10258 10525 -233412 -17960 -146456 333397 -86862 -44910 32257 -163007 82859
17619A47527K7463C1960O588f5851j7750b9779k81784A49284K40737f9424A35238
$$ 147527 174990 31960 38548 -65851 -83601 -29779 -311563 149284 390021 -69424 135238
17607G1803n289e3102E275P7724d6910J1652B75642d9765A0967L00931c3057k17212
$$ 71803 66514 -53102 5275 82999 -46910 -35258 275642 -49765 10967 311898 -33057 -250269
17595b50269J19609A87124K6260G7190n755c76441I0659a19052M9653A69314F5243
$$ -250269 -130660 187124 213384 77190 71435 -376441 90659 -119052 -69399 169314 65243
17583b93745B76804e3135a9304m8099A48902d0288A61836c74121B03180p219C5269
$$ -293745 276804 -53135 -19304 -67403 148902 -40288 161836 -374121 203180 195961 35269
17571G4101h7230C16176a99952c3924q5379p9491d9603o4843A83828a51645D8295
$$ 74101 -87230 316176 -199952 -33924 -119303 -198794 -49603 -114446 183828 -151645 48295
17559F8874a1340j33177A61398J74653H054J87009I1188m447j4505J754J47400
$$ 68874 -11340 -144517 161398 336051 8054 195063 91188 86741 72236 73990 221390
17548B21390J7350c5639o2532L8929A95922J17491A30476c4115A4028K93119I4131
$$ 221390 238740 -35639 -98171 -59242 195922 313413 130476 -34115 14028 307147 94131
17536C4149c73388B3356i2849A4954J74635J07453H7139f4683C11576p8755g040
$$ 34149 -373388 23356 -92849 14954 189589 297042 87139 -64683 311576 232821 -7040
17524A99860G57J74713a15486k71522c9360B47292j9465o5459a83249f9639j52973
$$ 199860 757 175470 -115486 -387008 -39360 247292 227827 162368 -183249 -69639 -222612
17513b22612f2999B35631j03798f337F1135J4194a50084M1239H6079i0625p6035
$$ -222612 -62999 235631 131833 -6337 61135 75329 -150084 -108845 86079 -90625 -166660
17502a66660B1848i4370I1426D0433J00673Q7828n3998L1232P3954p7672G934
$$ -166660 21848 -94370 91426 40433 141106 228934 174936 206168 280122 202450 7934
17490d9767o8411C51751j01599a53568B42509E2272f5451E6992K56079A11383
$$ -49767 -118178 351751 250152 -153568 242509 52272 -65451 56992 313071 111383
17479F3474J75004A01393a7513B199M56068h6510E9433a66272A58274o6117P7142
$$ 63474 238478 101393 -17513 2199 458267 -86510 59433 -166272 158274 92157 169299
17468A69299a9637j78314d6823A92461r1673J31860P7057I2696O5240a07278J6396
$$ 169299 -19637 -197951 -46823 192461 100788 232648 309705 92696 157936 -107278 -90882
17457i0882b4740B78115J80727E6844L62306e8346C8312J75649K41254e2211C38611
$$ -90882 -24740 278115 458842 56844 419150 -58346 38312 213961 455215 -52211 338611
17445C00221j04140O0047l9665m9140q3297B1821j0732K76620J51839H2054l65
$$ 300221 196081 256128 216463 167323 84026 21821 11089 287709 439548 82054 81689
17434H1689K01991A18365K37123n6668O4940L8628J9412e5172D39441D2294f5072
$$ 81689 283680 118365 355488 298820 363760 402388 421800 -55172 439441 42294 -65072
17422C34417O4378q5564N2831J6856K5166n6598a97C65140L2046j22562J67491
$$ 334417 398795 313231 366062 382918 408084 351486 -197 365140 397186 274624 442115
17411D42115a11313E7614K89736m4197A32838L9705b76619E7155M23915q1006
$$ 442115 -111313 57614 347350 303153 132838 172543 -276619 57155 481070 400064
17401D00064o5317a07989A86839L70296A30378l1054l8404k0238a99965B59448
$$ 400064 334747 -107989 186839 557135 130378 99324 60920 40682 -199965 259448
17390a70351b4577B71418p3518d0156D2800h5822D68881A49727b60989A11219
$$ -170351 -24577 271418 197900 -40156 42800 -85822 468881 149727 -260989 111219
17379f7979A24222j2271K4113F0242c4339N946D2994c3023B63990b72633B82786
$$ -67979 124222 111951 136064 60242 -34339 -28393 42994 -33023 263990 -272633 282786
17367A38193J09784K6800M572b05506e8147B26221J60836b24684B49775n7349
$$ 138193 247977 274777 279349 -205506 -58147 226221 387057 -224684 249775 192426
17357A92426m6989j8839c2086o9826A42699l8910J19982E0313K92765j63252J83514
$$ 192426 145437 126598 -32086 -101912 142699 103789 223771 50313 343078 179826 363340
17346C63340f6960H3923K57506j38690N0146I045M58256j04787A75901J6816I160
$$ 363340 -66960 83923 341429 202739 252885 9045 467301 362514 175901 192717 9160
17334C04663I5587a02487A33936K95871F442i6269I2062M9987m9296g358B9693
$$ 304663 95587 -102487 133936 429807 6442 -96269 92062 142049 92753 -7358 29693
17322B33468f2806D62116B12838l2359M77262B13299E1958K14453A28359E9586
$$ 233468 -62806 462116 212838 180479 657741 213299 51958 266411 128359 59586
17311A62140J84037a14823D53992c2716B23248q0967l6099K33484j67403o504
$$ 162140 346177 -114823 453992 -32716 223248 142281 106182 339666 172263 165759
17301A65759a11591A1803b01208B72121d4983k69744A66395J34302q299g3637
$$ 165759 -111591 11803 -201208 272121 -44983 -314727 166395 300697 292398 -73637
17290B96475m3720g7620G0703a20737B05223A2153J89882G0886a56918B97864
$$ 296475 252755 -77620 70703 -120737 205223 12153 202035 70886 -156918 297864
17279B2715K49466A06463M85423A27679K24866F4997J75426N1822p5211M8511
$$ 22715 272181 106463 591886 127679 352545 64997 240423 292245 217034 265545
17269B65545e7020j0321A52654d6386A21042L4436b87523A95905N981K3022G0545
$$ 265545 -57020 -67341 152654 -46386 121042 155478 -287523 195905 201886 224908 70545
17257B20467E4098a49729A5961J55445N22018H0154H936M23279j01456G1853K78718
$$ 220467 54098 -149729 15961 171406 693424 80154 8936 432215 330759 71853 350571
17246C50571A26143M6814B6812N80000k34934k0832H6887L32258e8373E98037
$$ 350571 126143 172957 26812 606812 371878 351046 86887 419145 -58373 598037
17235A55494J37813H3010j285K13485a02873j8418D82506a04199B93190J3495
$$ 155494 293307 83010 81725 295210 -102873 -121291 482506 -104199 293190 306685
17225C06685J23273k01719g091B35336J18585j65696l1750K28857j12873a53166
$$ 306685 429958 228239 -7091 235336 353921 188225 156475 385332 272459 -153166
17214b76122A57337M22522a9644C70528j80712n5940K81260A47487F1076K44432
$$ -276122 157337 579859 -19644 370528 189816 133876 415136 147487 61076 305508
17204C05508N92L26784d694A76037C8025O05889f4989k927C29585M7560j09285
$$ 305508 306100 632884 -4694 176037 38025 643914 -64989 -67916 329585 377145 267860
17193B67860G6688K34593n21R77B7747K06965q5196Q2872M4305J5665A18659K01396
$$ 267860 76688 311281 310760 311737 27747 234712 149516 232388 276693 292358 118659 320055
17181C20055a9371B29087A2491Q3730J91350L1191a5453A14918M88449j81167
$$ 320055 -19371 229087 12491 96221 287571 318762 -15453 114918 603367 422200
17171D22200O4835B14423F8188N8385J34620h0648k0045E05491A09826L18495
$$ 422200 487035 214423 68188 126573 261193 -80648 -100693 505491 109826 428321
17161D28321j12444j57339D8369m093J07041p0125K26405k2773J36051r1679h3953
$$ 428321 315877 158538 48369 44276 151317 81192 307597 284824 420875 329196 -83953
17149D85627p6074A53377J54009a0882G0093B5280L82989q5402J36687B25746
$$ 485627 409553 153377 307386 -10882 70093 25280 408269 322867 459554 225746
17138B61662L50070A55328K22005j40338A07275M83158A81376j1729J07535j18805
$$ 261662 611732 155328 377333 236995 107275 590433 181376 169647 277182 158377
17128A58377R9409k1429J38528o390n6602B9696M72346A73879L0567L91328A70387
$$ 158377 257786 236357 374885 368495 311893 29696 502042 173879 204446 595774 170387
17116E07936l5176A23614K25431J07557A18462L15596K48582A79613O37403l48658
$$ 507936 472760 123614 349045 456602 118462 434058 682640 179613 817016 468358
17106D68358r027j06905J79051R1343a26666D52337j42799P0191A71809N00561
$$ 468358 459331 352426 531477 622820 -126666 452337 309538 379729 171809 672370
17096F72370B79598h323E09866j03456k5163J93217R0570k10322k01106O3968
$$ 672370 279598 -8323 509866 406410 381247 574464 665034 454712 253606 317574
17086C17574k0282J7366K63571O887A95345L13803p4109A64480K06319J59756
$$ 317574 297292 314658 578229 585116 195345 509148 435039 164480 370799 530555
17076E30555j42063J70653j24304J62200k17764M6279q4255p3193M09227l16053
$$ 530555 388492 559145 434841 597041 379277 425556 341301 268108 677335 361282
17066C61282J39272j60575J27471k3990n8161j620j14575N31770k42798l2002
$$ 361282 500554 339979 467450 443460 385299 383679 269104 800874 558076 526074
17056E26074Q2802B97365o4753j06217K89630j24823J26260h0497E42445j6036
$$ 526074 608876 297365 232612 126395 416025 291202 417462 -80497 542445 526409
17046E26409j95781L06054j52819l3147J41427J55457k81272p4954J21294J71206
$$ 526409 330628 636682 483863 450716 592143 747600 466328 391374 512668 683874
17036F83874p0483k94048L39955j18610k25737N69981r883k32868n5916J38318
$$ 683874 613391 319343 659298 540688 314951 884932 875049 642181 586265 724583
17026G24583j92086k3942J57153k1864n3197J73229o5243q9652r2516J19034l5148
$$ 724583 532497 508555 665708 643844 590647 763876 698633 608981 516465 635499 600351
17015F00351k918K75258n1964p7097A77275L65411M9877O10838n00753m5864n5398
$$ 600351 597433 872691 820727 743630 177275 542686 592563 1203401 702648 656784 601386
17004F01386q5042J96312j61813O3833k43122L14911O0540L517K84663l24694
$$ 601386 516344 712656 550843 614676 371554 686465 747005 750522 1035185 710491
16994G10491K73872D88809J01373K91463L6769k23936k00212J17573K21818P6338
$$ 710491 984363 488809 590182 881645 918414 694478 494266 611839 833657 909995
16984I09995J00027o4168j3109K4334k15526J52230k58802j5601Q4922L54518
$$ 909995 1010022 945854 932745 957079 741553 893783 634981 619380 704302 1058820
16974A058820j40937Q1069J65841l13499r1952L38579k51322l30478M85409k37651
$$ 1058820 917883 998952 1164793 851294 759342 1097921 846599 516121 1001530 763879
16964G63879K19500O2635l72721M26550J4326j29805j00116j31155L33152L5958
$$ 763879 983379 1046014 673293 1099843 1114169 984364 884248 753093 1086245 1122203
16954A122203p8662L16444j93071j09540R5317l64727N5242N11112k70998J0345
$$ 1122203 1043541 1359985 1166914 1057374 1152691 787964 843206 1354318 1083320 1093665
16944A093665K97102k64006j6593p3345N488Q220m5206L47337j68574K99885k75784
$$ 1093665 1390767 1126761 1110168 1036823 1042311 1050531 1005325 1352662 1184088 1483973 1208189
16933A208189k31056m6305J01286J88849J01322K15301l88972j61187L87798k36169
$$ 1208189 977133 930828 1032114 1220963 1322285 1537586 1148614 987427 1375225 1139056
16923A139056K91553j63028l8397M27496j06330k38470M03956m06864m7113L12971
$$ 1139056 1430609 1267581 1229184 1656680 1550350 1311880 1715836 1308972 1261859 1574830
16913A574830l66394N7144Q7698J80069j54710L10899Q5903k34950m8863K43622
$$ 1574830 1208436 1265580 1353278 1533347 1378637 1689536 1775439 1540489 1491626 1735248
16903A735248J28563j92052j93081L48950l11830L78703m411N9289j17000j56796
$$ 1735248 1863811 1671759 1478678 1827628 1515798 1894501 1890090 1949379 1832379 1675583
16893A675583R7119j50983J91899J05342k98334K57616J87097n10528L48562M36333
$$ 1675583 1772702 1621719 1813618 1918960 1620626 1878242 2065339 1554811 1903373 2339706
16883B339706j39659j17129j19269J83621J66503k52164K58402r1146k11535j3139
$$ 2339706 2200047 2082918 1963649 2147270 2313773 2061609 2320011 2228865 2017330 2004191
16873B004191P4149L86152k55798J1312m9399P6852P991M71646k924k3890L3348
$$ 2004191 2078340 2464492 2208694 2220006 2170607 2247459 2255450 2727096 2724172 2700282 2733630
16862B733630j65155L7218L48506L7684k92762R2921J97827k74364M40427J64221
$$ 2733630 2568475 2605693 2954199 2991883 2699121 2792042 2989869 2715505 3155932 3320153
16852C320153q1068j351k1017k37101K8585L4877K58991R9504l9272J40348j07670
$$ 3320153 3239085 3237734 3216717 2979616 3008201 3043078 3302069 3401573 3362301 3502649 3394979
16841C394979M32762R0571K16044j44633n59078M08341J41412n8904j31348K93280
$$ 3394979 3827741 3918312 4134356 3989723 3430645 3838986 3980398 3921494 3790146 4083426
16831D083426J09271k10131J00150L82529R4241K85295k24327n7303P4722K52146
$$ 4083426 4192697 3982566 4082716 4465245 4559486 4844781 4620454 4563151 4637873 4890019
16821D890019J03473J06508J75538J62862J6840L61622k53001P0418J5197M38226
$$ 4890019 4993492 5100000 5275538 5438400 5455240 5816862 5563861 5634279 5649476 6087702
16811F087702o1962L278K15279L78490L29161l15016l4206N17606L4132k10177
$$ 6087702 6025740 6029018 6244297 6622787 6951948 6636932 6602726 7120332 7154464 6944287
16801F944287P67037K6486k9638K81347M45785O2824K23223k8313M44340L70432
$$ 6944287 7711324 7737810 7708172 7989519 8435304 8498128 8721351 8693038 9137378 9507810
16791I507810r8194N95701M3458L04614N9174N90743O4601L59140M10093L29527
$$ 9507810 9409616 10005317 10048775 10353389 10412563 11003306 11067907 11427047 11837140 12166667
16781A2166667j33896O50015M68252N93089j13143L75588P84979L14301O26788
$$ 12166667 12032771 12682786 13151038 13744127 13630984 14006572 14791551 15105852 15732640
16772A5732640P65758J36334P37730R62413K93631O20105R32625N38777J161850
$$ 15732640 16498398 16634732 17372462 18334875 18628506 19248611 20181236 20720013 21881863
16763B1881863M63433O76184J444261P57580J025227J149377J059683J418812
$$ 21881863 22345296 23021480 24465741 25223321 26248548 27397925 28457608 29876420
16755B9876420Q49261J953060J159253K047201J374921J826417K103431J978712
$$ 29876420 30725681 32678741 33837994 35885195 37260116 39086533 41189964 43168676
16747D3168676K114104K479400K503645K775497K723073L477909L071148L876277
$$ 43168676 45282780 47762180 50265825 53041322 55764395 59242304 62313452 66189729
16739F6189729L820849M157341M384316M726204N199320N576482O158437O062118
$$ 66189729 70010578 74167919 78552235 83278439 88477759 94054241 100212678 106274796
16731A06274796O974104O930221P183976P932089Q059293Q019637Q355100Q123296
$$ 106274796 113248900 120179121 127363097 135295186 143354479 151374116 159729216 167852512
16723A67852512P704674P323073O514153N498934M734792L519918K410135O18475
$$ 167852512 175557186 182880259 189394412 194893346 199628138 203148056 205558191 206176666
16715B06176666l23533k430266l486932m283985n886525o617425p032393p584534
$$ 206176666 205853133 203422867 199935935 195651950 189765425 183148000 176115607 168531073
16707A68531073q216320q208066q290199q015992p957667p621656p168194o857880
$$ 168531073 160314753 152106687 143816488 135800496 127842829 120221173 113052979 106195099
16699A06195099o654804n866900n565709n521218m667926m852457m561381l322973
$$ 106195099 99540295 93673395 88107686 82586468 77918542 73066085 68504704 65181731
16691F5181731l893286l600123k958467l005312k884783k454591k590882k280199
$$ 65181731 61288445 57688322 54729855 51724543 48839760 46385169 43794287 41514088
16683D1514088j660123k274140j548512j898878j539365j094214j692717j391285
$$ 41514088 39853965 37579825 36031313 34132435 32593070 31498856 29806139 28414854
16675B8414854j222447j240253j002066q30590j381131n07850q15396r16394r06961
$$ 28414854 27192407 25952154 24950088 24119498 22738367 22230517 21415121 20498727 19591766
16666A9591766l49030q68291p19618q21412m27959p33980k49855p36261q00804
$$ 19591766 19242736 18374445 17654827 16833415 16405456 15671476 15421621 14685360 13884556
16657A3884556J10634o09388k68559n81096j04573p68346k59827j30350n12463
$$ 13884556 13995190 13385802 13117243 12536147 12431574 11663228 11403401 11273051 10760588
16648A0760588j54947m04247l09242m78040K48422k17414q91924J17082k97492
$$ 10760588 10605641 10201394 9892152 9414112 9662534 9445120 8553196 8670278 8372786
16639H372786M1617m55000j27528n25351J37904l32128k07919L083j80364q3458
$$ 8372786 8414403 7959403 7831875 7306524 7444428 7112300 6904381 6907464 6727100 6643642
16629F643642k98322J68825n64326m4323l18995J46952o5623l22975N8540j81932
$$ 6643642 6345320 6514145 5949819 5905496 5586501 5733453 5667830 5344855 5403395 5221463
16619E221463k8992J01592k58640j27540k176j31710k53011j73142r0804m2066
$$ 5221463 5192471 5294063 5035423 4907883 4905707 4773997 4520986 4347844 4257040 4214974
16609D214974k83826J15695j28260j66967Q8829r6615j25621k35415L92900J45931
$$ 4214974 3931148 4046843 3918583 3751616 3840445 3743830 3618209 3382794 3775694 3921625
16599C921625m32704k26079J51910L3949J620l46965J07312j60145j06958L02088
$$ 3921625 3488921 3262842 3414752 3448701 3450321 3103356 3210668 3050523 2943565 3245653
16589C245653n50168J86730p6677k91285L7488m1847J97670M7275P0588l15568
$$ 3245653 2695485 2882215 2805538 2514253 2551741 2509894 2707564 2754839 2825427 2509859
16579B509859j45741K9130L70909m20858K03775o32743N69268l86980K03292m2572
$$ 2509859 2364118 2393248 2764157 2343299 2547074 1914331 2483599 2096619 2299911 2257339
16569B257339k06773L56458j43343m36476J82248M8704q943K1558k40815O1930
$$ 2257339 2050566 2407024 2263681 1827205 2009453 2058157 2049214 2070772 1829957 1891887
16559A891887R8315l86117r7733J15996Q3366m2725J82123k51133l1210j80327
$$ 1891887 1990202 1604085 1506352 1622348 1705714 1662989 1845112 1593979 1562769 1382442
16549A382442J67079L90636k29741r2813k91346r3427M48998m09435K41435j50539
$$ 1382442 1549521 1940157 1710416 1617603 1326257 1232830 1681828 1272393 1513828 1363289
16539A363289K23310j12041k62264P5953J62223j57515q5512J65659o9777J92071
$$ 1363289 1586599 1474558 1212294 1288247 1450470 1292955 1207443 1373102 1303325 1495396
16529A495396l10319L16067l07331n6198J62627J72778k34906j43442j72761M96676
$$ 1495396 1185077 1501144 1193813 1137615 1300242 1473020 1238114 1094672 921911 1418587
16519A418587Q4452F48377J01017M46960N4032j66106J80549J682j70875N6436
$$ 1418587 1503039 648377 749394 1196354 1250386 1084280 1264829 1266511 1095636 1152072
16509A152072m03419K39679D81884M39838M9944o8425k26420K64956L53880k62182
$$ 1152072 748653 988332 481884 921722 971666 903241 676821 941777 1295657 1033475
16499A033475L31030m96761j05222J6030J31348N3833M2350k91709M51030m72830
$$ 1033475 1364505 867744 762522 778552 909900 963733 1006083 714374 1165404 692574
16489F92574l853K42820l01016J52070k5749J34966R7038j3211k35565j03321
$$ 692574 688721 931541 630525 782595 756846 891812 988850 975639 740074 636753
16479F36753n5074J55030K80449J9149k16015L15377k85502P8098l26229J18467
$$ 636753 581679 736709 1017158 1036307 820292 1135669 850167 928265 602036 720503
16469G20503m3527J59349D03860Q8710Q15741B34342M61494l2200K63151m43534
$$ 720503 676976 836325 403860 492570 1308311 234342 695836 663636 926787 483253
16459D83253J21724L07074j17082k59395K57657j59385k40839K28268j41232P1668
$$ 483253 604977 912051 794969 535574 793231 633846 393007 621275 480043 551711
16449E51711M2171P1537J07704q0876k39772J95820B95273M53460l19155j5333
$$ 551711 593882 665419 773123 692247 452475 648295 295273 748733 429578 414245
16439D14245J44972k32026K17728M5963k5945R5531k33913l8148N3211J11016
$$ 414245 559217 327191 544919 590882 564937 660468 426555 388407 441618 552634
16429E52634l3633K59334j35462l05602O5770K17026k12383J87980K17657D05495
$$ 552634 519001 778335 642873 337271 403041 620067 407684 595664 813321 405495
16418E03410m1893A69980J81308K67165J84263l99085L7014J39213o4368k00728
$$ 503410 461517 169980 351288 618453 802716 403631 440645 579858 515490 314762
16408C14762P36477l67147C22065j675k4728J23868L1810m3890J89293j29712
$$ 314762 1051239 684092 322065 320390 295662 419530 451340 407450 596743 467031
16398D67031j7725B23457N4016K55446A62277J25689J19324K25459l0013k67934
$$ 467031 449306 223457 277473 532919 162277 287966 407290 632749 602736 334802
16388C34802N5828N6213J83806B36202K86464k2019c5805D04517j98977J2862
$$ 334802 390630 446843 630649 236202 522666 500647 -35805 404517 205540 218402
16378B18402k8363R6717D9286J67025Q6621r2733K95565k04862k4925M02850r6376
$$ 218402 190039 286756 49286 216311 302932 210199 505764 300902 275977 678827 582451
16367E82451q6981A69220M13843E3475K10400J29043c4726A81039o3864J24972
$$ 582451 495470 169220 583063 53475 263875 392918 -34726 181039 117175 242147
16357B42147C3962N69463B77613r205L11548k33175Q9577r5817j20837P5808J886
$$ 242147 33962 603425 277613 268408 579956 346781 436358 340541 219704 295512 297398
16346B97398j2842j7931j13393J2567d6526A77071J10753j13032J71313D5105
$$ 297398 284556 266625 153232 165799 -46526 177071 287824 174792 346105 45105
16335D1892O0415L85097A62618J20449K9602a42788M9171C51008j08150J43920
$$ 41892 102307 487404 162618 283067 312669 -142788 -93617 351008 242858 386778
16325C86778o4069a4533D24383n4059j76456F0762J16582l0590a51808A84262
$$ 386778 322709 -14533 424383 370324 193868 60762 177344 146754 -151808 184262
16314C61374o192J31944j46748k598B7208J32571F5973L96647j26505a4279E16177
$$ 361374 355182 487126 340378 337780 27208 159779 65973 462620 336115 -14279 516177
16302C98852A81484a49232B60408J26021A33179n374a19580A93952I1050K38666
$$ 398852 181484 -149232 260408 386429 133179 127805 -119580 193952 91050 329716
16292C29716A62843K51461A76984q6620J8410a07390B58420j23186L2238k349
$$ 329716 162843 414304 176984 90364 108774 -107390 258420 135234 167472 165123
16282A65123b7351B24016L58518k60681k0268R5819F3712J56616N7129G439N7952
$$ 165123 -27351 224016 582534 321853 301585 397404 63712 220328 277457 7439 65391
16271F5391K54138m0669c4887A5621M3796k8155O9620d2028k6131c2238A53446
$$ 65391 319529 278860 -34887 15621 59417 31262 100882 -42028 -68159 -32238 153446
16259A16966K01222M4622L6114B0021L36496n4425n4503P4289j51752q198J57423
$$ 116966 318188 362810 398924 20021 356517 302092 247589 321878 170126 161928 319351
16248C19351A23703B057N7973b62304Q4754j6589d1246A1751M5121K19652l3171
$$ 319351 123703 2057 60030 -262304 -177550 -194139 -41246 11751 56872 276524 243353
16237B43353R0480e8157B58141o6484IM1406h538B31354L2610j19755g7090F2157
$$ 243353 333833 -58157 258141 191657 9 41415 -8538 231354 263964 144209 -77090 62157
16224B1077L7133b1640K086B52659I5137J65721n7231d8012B50833c0246A96824
$$ 21077 58210 -21640 -19554 252659 95137 260858 203627 -48012 250833 -30246 196824
16212b02350A09961f9244l01390A2440L75302f4865B83106j13243B4117c5789
$$ -202350 109961 -69244 -370634 12440 387742 -64865 283106 169863 24117 -35789
16201c1575A45666g6306o8517F9680a3061A64630O5674F3206K87501G927L40305
$$ -31575 145666 -76306 -144823 69680 -13061 164630 230304 63206 350707 7927 348232
16190C48232A9380L8980a26265a2160B96112j18189N9379b54301A06249d478A07711
$$ 348232 19380 58360 -126265 -12160 296112 177923 237302 -254301 106249 -4478 107711
16178B10157K92367e1856B2182J3108c9171p588A91767j9241b2528B03582r6105
$$ 210157 502524 -51856 22182 35290 -39171 -46759 191767 172526 -22528 203582 107477
16167A07477L6574A4576c06466A35289M6972a65299j1114A6006J00868F130J59719
$$ 107477 144051 14576 -306466 135289 182261 -165299 -176413 16006 116874 6130 165849
16156A65849J40233A12225K04608d6746L061j1731j17566d2193k3616m9878d1649
$$ 165849 306082 112225 316833 -46746 -43685 -55416 -172982 -42193 -65809 -115687 -41649
16144G9897K55697n5586a40216A16173f2703F5523Q6742a26564M0513j59797A83120
$$ 79897 335594 280008 -140216 116173 -62703 65523 152265 -126564 -86051 -245848 183120
16132b85785K5038A32265a76113F29331d4955B56642c4092m9466f048k09574B44748
$$ -285785 -260747 132265 -176113 629331 -44955 256642 -34092 -83558 -6048 -215622 244748
16120B86686a84817c2776B36772n0352a31269B05542D8238i2811A89293h5656
$$ 286686 -184817 -32776 236772 186420 -131269 205542 48238 -92811 189293 -85656
16109a42908f4615G7861k6384J43609J87461d6895p089A3003K34773f3775A84225
$$ -142908 -64615 77861 51477 195086 382547 -46895 -53984 13003 247776 -63775 184225
16097B40609D3893J23070c5458A08833a12743B62754m2559n514a2795n4491k0734
$$ 240609 43893 166963 -35458 108833 -112743 262754 220195 214681 -12795 -67286 -88020
16086h8020j23206b3526C92305a78083g0307A28004c13979A8306O220a93748L6977
$$ -88020 -211226 -23526 392305 -178083 -70307 128004 -313979 18306 24526 -193748 -156771
16075a56771E7705a34376D1799a55644a8619A22078K6748M10889A9882a6615c267
$$ -156771 57705 -134376 41799 -155644 -18619 122078 148826 559715 19882 -16615 -3267
16063d8882B76877j28377a24196l7757N1277n0934j9860F6892e5413k22333K8972
$$ -48882 276877 148500 -124196 -161953 -110676 -161610 -181470 66892 -55413 -277746 -248774
16052b48774b0178r3485b1374B00069a67042p3691I9403d9949k61435I9858B2472
$$ -248774 -20178 -113663 -21374 200069 -167042 -240733 99403 -49949 -311384 99858 22472
16040A87707J38184A00289M55126f5128m1558l49873a28109a9090G0396a65517
$$ 187707 325891 100289 555415 -65128 -106686 -456559 -128109 -19090 70396 -165517
16029C7731f3753D5074J9736b75358F9705b88779a14898C7479a08150b4983I506
$$ 37731 -63753 45074 64810 -275358 69705 -288779 -114898 37479 -108150 -24983 9506
16017a14949B1190J80542e8964J0645A12171D5826g255I9657l5712J08486K8771
$$ -114949 21190 201732 -58964 -48319 112171 45826 -7255 99657 63945 172431 201202
16006B01202a99957K8805c8802j36378J4521c0640A80084c6053k70804C5619Q1006
$$ 201202 -199957 -171152 -38802 -175180 -160659 -30640 180084 -36053 -306857 35619 116625
15995A16625n5472B2451b68795I6727e2004A14504J3358K2432O8637b29241B14807
$$ 116625 61153 22451 -268795 96727 -52004 114504 127862 150294 218931 -229241 214807
15983a52282A21630K64250q3263p8785J11518j55801f1882A15385b63147a0210
$$ -152282 121630 385880 302617 223832 335350 179549 -61882 115385 -263147 -10210
15972E5396O6590D6454k2652O900b57596M7334A52899b00184J9628E1105h3323
$$ 55396 121986 46454 23802 30702 -257596 -210262 152899 -200184 -180556 51105 -83323
15960g6090a8051A91938E7290H032J32339i8196p9475j48072a57551j9674L6888
$$ -76090 -18051 191938 57290 8032 140371 -98196 -177671 -325743 -157551 -177225 -140337
15949a40337A11019e05I639j68b88988C81707d4212B6129K56022f6390j84720
$$ -140337 111019 -505 9639 9471 -288988 381707 -44212 26129 282151 -66390 -251110
15938b51110a03265r338L1149q4381B80518a69386G9929f1544G3522a47349p9481
$$ -251110 -103265 -112603 -81454 -165835 280518 -169386 79929 -61544 73522 -147349 -226830
15927b26830A07205Q4379l9013J99819b4577k26499E2648a9682q8898d5095A35114
$$ -226830 107205 191584 152571 352390 -24577 -251076 52648 -19682 -108580 -45095 135114
15915c72902C80063d0163A62594a14546b6074A8278L05411a74318l2166A77605
$$ -372902 380063 -40163 162594 -114546 -26074 18278 323689 -174318 -206484 177605
15904e923A57503A9452b19326q5187A24344a77578k61208c7003n8967l3900A80956
$$ -5923 157503 19452 -219326 -304513 124344 -177578 -438786 -37003 -95970 -129870 180956
15892d65693a28093R400C1621j0926N023a42958k2051c3243j70679j53906G8175
$$ -465693 -128093 -118693 31621 20695 25718 -142958 -165009 -33243 -203922 -357828 78175
15880a04902l86504a96094B0347b25469l5684Q8657N9102N20A5670b59444B8185
$$ -104902 -491406 -196094 20347 -225469 -261153 -172496 -113394 -112874 15670 -259444 28185
15868a19667G9277h9173a8443B8935J18101k7923D6802J37632b14068l5845k12339
$$ -119667 79277 -89173 -18443 28935 147036 119113 46802 184434 -214068 -249913 -462252
15857d62252E8628K2383J32793m8698e8413R81B19222a17470I0079J17325b9631
$$ -462252 58628 81011 213804 165106 -58413 -57432 219222 -117470 90079 207404 -29631
15845A50019a01589b3423l69904B45193b59302J02488m0034o1671c5523A77690
$$ 150019 -101589 -23423 -393327 245193 -259302 -156814 -196848 -258519 -35523 177690
15834B46667b99981J32928d2411A18089b36913a7099j6988B28280A12433i1943
$$ 246667 -299981 -167053 -42411 118089 -236913 -17099 -34087 228280 112433 -91943
15823a50120b4953m1822q1638A05507b68972A69365B1189a88758A70660c79148
$$ -150120 -24953 -66775 -148413 105507 -268972 169365 21189 -188758 170660 -379148
15812C0288f3250n94726a60406C05849a72236B19704N540f1179k19664d4248o3231
$$ 30288 -63250 -657976 -160406 305849 -172236 219704 225244 -61179 -280843 -44248 -107479
15801a07479l12476A21869L61081A96482E3570c54479a40157o2816l0858H1703
$$ -107479 -419955 121869 482950 196482 53570 -354479 -140157 -202973 -233831 81703
15790i1570j19223A3407J99049c1613B276h6181A1815i9292C36259b53406q4503
$$ -91570 -210793 13407 212456 -31613 2276 -86181 11815 -99292 336259 -253406 -337909
15779c37909a11426l1265A31455a47372K656K145J7874B9781K7833b03767O9743
$$ -337909 -111426 -142691 131455 -147372 -144716 -142571 -124697 29781 57614 -203767 -134024
15768a34024C8420J62317c52110I9466a96358j76857e9894B01087d2190F1928
$$ -134024 38420 200737 -352110 99466 -196358 -373215 -59894 201087 -42190 61928
15757b28996G8514J85555E8748a48304D2600b17701A98604L823r8675N4897K28745
$$ -228996 78514 264069 58748 -148304 42600 -217701 198604 202427 103752 158649 387394
15746C87394a90749i1875n7765G4573b03824C06319D8399f1033j65257q0235e2972
$$ 387394 -190749 -91875 -149640 74573 -203824 306319 48399 -61033 -226290 -306525 -52972
15734E5108L999K5575C5340c7795F9114J97084I9702L4998c71687J9457A70592
$$ 55108 59107 84682 35340 -37795 69114 266198 99702 134700 -371687 -352230 170592
15722a12009j71815k53517I7757d6681P344k84377o5191A61036m6298c45955b7654
$$ -112009 -283824 -537341 97757 -46681 -39337 -323714 -388905 161036 114738 -345955 -27654
15710b64286i2633j02501A003a1115j89328g2276A5110b05580b9364m8447F3842
$$ -264286 -92633 -195134 1003 -11115 -200443 -72276 15110 -205580 -29364 -77811 63842
15698c43008B28595c10650c1789D7355e4051p7847A87833a99477A41434a23369
$$ -343008 228595 -310650 -31789 47355 -54051 -131898 187833 -199477 141434 -123369
15687A97901b21038i1748b6737j30083j06011D2764J10964a47094K6426j76945
$$ 197901 -221038 -91748 -26737 -156820 -262831 42764 153728 -147094 -120668 -297613
15677b97613H3033d2740B03701D7746J6854P1653E2733J34245d06750b2147B51906
$$ -297613 83033 -42740 203701 47746 64600 136253 52733 186978 -406750 -22147 251906
15665G756K37470m6857A0143a22116L0985J8480B60567A4539c01717B221a25436
$$ 7756 245226 198369 10143 -122116 -91131 -72651 260567 14539 -301717 2221 -125436
15653A41605g8246j13824C75548f0215k53748M7191Q8843A10827d2732j39159
$$ 141605 -78246 -192070 375548 -60215 -313963 -266772 -177929 110827 -42732 -181891
15643a81891A44067P3040F2083b67207E5526M22110e337q8974k7030j26780I6996
$$ -181891 144067 217107 62083 -267207 55526 477636 -5337 -94311 -121341 -248121 96996
15631c98996d138B074b35731O9109B21911j4827a04659o8932B68547a47124C0321
$$ -398996 -4138 2074 -235731 -166622 221911 207084 -104659 -173591 268547 -147124 30321
15619b07399a5995n3611B43493A14435g4572A63217j7563a12840C41376a41736
$$ -207399 -15995 -69606 243493 114435 -74572 163217 145654 -112840 341376 -141736
15608A09955b25107J01811e7565A59587K75369A96775d3435i534j45157E2509
$$ 109955 -225107 -123296 -57565 159587 434956 196775 -43435 -9534 -154691 52509
15597H225L68575d05116g3153C0223a10290A83545J03753a52706B47329d9682
$$ 8225 376800 -405116 -73153 30223 -110290 183545 287298 -152706 247329 -49682
15586a99083e2584A82474E9812b88133a06212B41819j5138d3199B63157d757l13130
$$ -199083 -52584 182474 59812 -288133 -106212 241819 226681 -43199 263157 -4757 -317887
15575c17887J04276g8919k60826a50680j77463A62445C5792J02128b86391b4852
$$ -317887 -213611 -78919 -339745 -150680 -328143 162445 35792 137920 -286391 -24852
15564C57784A23630d18189A44132E9749O6661a39372b2632j65478d9898j22762
$$ 357784 123630 -418189 144132 59749 126410 -139372 -22632 -188110 -49898 -172660
15554a72660C04309B3857b45364n1288i3225J1085j55527a05274E1026b77970
$$ -172660 304309 23857 -245364 -296652 -93225 -82140 -237667 -105274 51026 -277970
15543e4354A24884d7399j71855d7849q853D66425a56070r03A14940a9517j16861
$$ -54354 124884 -47399 -219254 -47849 -56702 466425 -156070 -156973 114940 -19517 -136378
15532a36378n015n2302Q5069o4584a4064F5165J2440J58611a29250C06369b07480
$$ -136378 -141393 -193695 -108626 -173210 -14064 65165 77605 236216 -129250 306369 -207480
15520A49318e5638K3061l6060J2692j3225C4465a52372B14959a26607A39032J68428
$$ 149318 -55638 -32577 -68637 -55945 -69170 34465 -152372 214959 -126607 139032 307460
15509C07460a6594C97958A63271b40314c6985q8336B76991C7180K733M88485a41888
$$ 307460 -16594 397958 163271 -240314 -36985 -125321 276991 37180 39913 528398 -141888
15497a30973C05722a1767A3349h6546B3059P8562j0497h9132l27979A44764B085
$$ -130973 305722 -11767 13349 -86546 23059 101621 91124 -89132 -417111 144764 2085
15485a49864M551B58370j19893a25038C2983J43853a05981p7663P4027a246A61216
$$ -149864 -145313 258370 138477 -125038 32983 176836 -105981 -183644 -109617 -1246 161216
15473A13993a0072l00831j15400a84425A08080D5110d5970k77071b7534n0186
$$ 113993 -10072 -310903 -426303 -184425 108080 45110 -45970 -323041 -27534 -77720
15463g7720A47844d0870A12898C718a24217A29125N4259p8322c46429J43791R1313
$$ -77720 147844 -40870 112898 3718 -124217 129125 183384 105062 -346429 -202638 -111325
15452a11325M2337B42489m5034p0165R2759b99816g9378A21010b28646M1411L5017
$$ -111325 -68988 242489 197455 127290 220049 -299816 -79378 121010 -228646 -187235 -152218
15441a52218C9372f3894j35924j98724H6748a59339A86247B0005b78049E1130
$$ -152218 39372 -63894 -199818 -398542 86748 -159339 186247 20005 -278049 51130
15430a0144k65735c6515I9559A396b0759j21224j2298B36230O595F2927k8189
$$ -10144 -275879 -36515 99559 1396 -20759 -141983 -154281 236230 242825 62927 34738
15419C4738K31004b5404G3270L65150b44862A34747E2394a10962B59581o8995
$$ 34738 265742 -25404 73270 438420 -244862 134747 52394 -110962 259581 190586
15409A90586d28659a9690E8136B5184J05154a43921d614A40131R3638a84101q2706
$$ 190586 -428659 -19690 58136 25184 130338 -143921 -4614 140131 233769 -184101 -266807
15398b66807d9055B9676L13081j37186b3086A58927k3945C0966c9538k92240J26857
$$ -266807 -49055 29676 342757 205571 -23086 158927 134982 30966 -39538 -331778 -204921
15387b04921F8502J09232f5336B98429D8015L3809c70684B11381K8511o6121l4650
$$ -204921 68502 177734 -65336 298429 48015 81824 -370684 211381 239892 173771 139121
15376A39121j2522P0569a79433e2595C61040B94J26812i7822H556i5183A71643
$$ 139121 126599 197168 -179433 -52595 361040 294 127106 -97822 8556 -95183 171643
15364A71018R262c4476G7490a54104A77273b81474L63a18423J8747B15691h5415
$$ 171018 180280 -34476 77490 -154104 177273 -281474 -281111 -118423 -99676 215691 -85415
15352B9673P9677K16222o8116A15841h9769q8582c260D08567a22598A25631K20931
$$ 29673 109350 325572 257456 115841 -89769 -178351 -3260 408567 -122598 125631 346562
15341C46562c51904A05132a00769M8230B17321b23038B28764A323J56331K0269
$$ 346562 -351904 105132 -100769 -52539 217321 -223038 228764 1323 157654 177923
15331A77923K3159J1247E4793O1379E7889L6722K3382a08418b007E0720k0538
$$ 177923 201082 212329 54793 116172 57889 94611 117993 -108418 -2007 50720 30182
15320C0182b00380h570p0140k6098K4162A69268J03873f8744o3028P813A8184
$$ 30182 -200380 -8570 -78710 -104808 -80646 169268 273141 -68744 -131772 -123959 18184
15308A23255a15064p4741M2952m5348H8433B6072e3116A16602J30415f5132B76838
$$ 123255 -115064 -189805 -146853 -192201 88433 26072 -53116 116602 247017 -65132 276838
15296a05426c9376E3319a50299J3132E25118d07115E86752a58152C49860c29026
$$ -105426 -39376 53319 -150299 -137167 525118 -407115 586752 -158152 349860 -329026
15285B36791l06e7060k04480Q2556G4322b20812g8235C66617K16460B3068K33851
$$ 236791 236485 -57060 -261540 -178984 74322 -220812 -78235 366617 583077 23068 256919
15274B56919m2894m4124b6929A32967O77K36816a87810i903q9883j19033A54909
$$ 256919 214025 169901 -26929 132967 133644 370460 -187810 -9903 -99786 -218819 154909
15262I3734q188d4539B63226J55703h16B57894a9655B81231J72231f0492C40938
$$ 93734 85546 -44539 263226 418929 -816 257894 -19655 281231 453462 -60492 340938
15250B40961K0415M88993O83965J79441k87974N34936p24859l06301A39860a69089
$$ 240961 261376 750369 1434334 1613775 1325801 1860737 1135878 829577 139860 -169089
15239a71052A53562m4623J62728D1804K61104j07113b03044E2565a16620j93578
$$ -171052 153562 108939 271667 41804 302908 195795 -203044 52565 -116620 -310198
15229c10198a42985B09641c62487g19A95384A7541P6621a03760A51528i2009I5579
$$ -310198 -142985 209641 -362487 -719 195384 17541 94162 -103760 151528 -92009 95579
15217A77296D9939a49813k94597J15549D9546B0097K6587J90235C6913J20442
$$ 177296 49939 -149813 -444410 -328861 49546 20097 46684 236919 36913 157355
15207A57355N6751F5798b22754B44205b72512B59170I1561C8074N9M0362n290
$$ 157355 214106 65798 -222754 244205 -272512 259170 91561 38074 38133 78495 73205
15196G3205b37278A15293a5643B6085K64736r9630Q1291L00260e3343B74902D0342
$$ 73205 -237278 115293 -15643 26085 290821 191191 272482 572742 -53343 274902 40342
15184A19008P3610C0698O0954J16595B8075d6661p0615A84636m7561O9074N2519
$$ 119008 192618 30698 91652 208247 28075 -46661 -117276 184636 137075 206149 258668
15173B58668d9586C71310F133L2628M61445A23547B3832K34630G5260L80593p7795
$$ 258668 -49586 371310 6133 38761 500206 123547 23832 258462 75260 455853 378058
15162C78058b37216A03150L91595e9281j47810A44090c9203C6553J1585J34760
$$ 378058 -237216 103150 494745 -59281 -207091 144090 -39203 36553 48138 182898
15152A82898M5347E1991J26102K9388d3893A38566n6591l6766f3522A94489J66487
$$ 182898 228245 51991 178093 207481 -43893 138566 81975 45209 -63522 194489 360976
15141C60976A04330J0536M9595J59132O9994M3552c7521A84498Q435a36006e1940
$$ 360976 104330 114866 164461 323593 393587 437139 -37521 184498 192933 -136006 -51940
15129C08037d4226B96948q481k6463D1288J10294K5304F0872M52078B07089B1019
$$ 308037 -44226 296948 288467 262004 41288 151582 176886 60872 512950 207089 21019
15117a52381B6947M77422F6065p159L35507c46463A86491a32318C71143F840J82590
$$ -152381 26947 504369 66065 58906 394413 -346463 186491 -132318 371143 6840 189430
15106A89430e2673A87001h8750G1539M6180L38883i6821A66188C1498K23070G1302
$$ 189430 -52673 187001 -88750 71539 117719 456602 -96821 166188 31498 254568 71302
15094A37214Q4880h6990C00620j20762D8477K14424J72365B06372H3463L34255
$$ 137214 222094 -86990 300620 179858 48477 262901 435266 206372 83463 417718
15084D17718o4935J670a18951A99686F1248O2263L8707l893R2789K31973k40729
$$ 417718 352783 354453 -118951 199686 61248 123511 162218 158325 251114 483087 242358
15073B42358q4021D8885J10159e5058E4188L31091C5176b1991A17140d4978B75438
$$ 242358 158337 48885 159044 -55058 54188 385279 35176 -21991 117140 -44978 275438
15061A52927B5216d2883E2178K95901j52960a58897A13852J00090f209H9191J54458
$$ 152927 25216 -42883 52178 348079 195119 -158897 113852 213942 -6209 89191 243649
15050B43649F3068a14239C37772j28938o6694L41002j85252A48356k5859L37505
$$ 243649 63068 -114239 337772 208834 142140 483142 297890 148356 122497 460002
15040D60002A35281O3211b93054E7005J22874J23146f9177k39258A15520C0912
$$ 460002 135281 198492 -293054 57005 179879 303025 -69177 -308435 115520 30912
15029C17266I42b631B77865q0846d4780A97812D0260J38094H4606m0089M32131
$$ 317266 942 -2631 277865 197019 -44780 197812 40260 178354 84606 44517 476648
15018D76648j45852J45222k30321o2267A5080L25542d2039B14466f7308B63065
$$ 476648 330796 476018 245697 183430 15080 340622 -42039 214466 -67308 263065
15007A63150c1732A89848K23797A73905K01710A79070J23154A06062P1287J20210
$$ 163150 -31732 189848 413645 173905 375615 179070 302224 106062 177349 297559
14997B97559a30015A51333p4920K23640e7221G6141j5368K13889o2374a60409
$$ 297559 -130015 151333 76413 300053 -57221 76141 60773 274662 212288 -160409
14986B72543H7683J55531J16488A70307J03551A18129M90289a61123E67545B19863
$$ 272543 87683 243214 359702 170307 273858 118129 608418 -161123 567545 219863
14975B5887J17356M1416q3316J62034K77656k29151A46249k6209K70286J99293
$$ 25887 143243 184659 101343 263377 541033 311882 146249 120040 390326 589619
14965E89619k45923j67934l4651K16073O0209F0595K40521j0425q2458K57632
$$ 589619 343696 175762 141111 357184 417393 60595 301116 290691 208233 465865
14955D65865A83711Q3196K7541L5711d7321B78739P2906F0489R9345a00357B09227
$$ 465865 183711 266907 294448 330159 -47321 278739 351645 60489 159834 -100357 209227
14943D13127j89792N3652k6337K47795K2770b17418B39823A17885C6612L10686
$$ 413127 223335 276987 250650 498445 521215 -217418 239823 117885 36612 347298
14933C47298J26236k33876K33637A55081L36995j15103N9647A43093L98288F089
$$ 347298 473534 239658 473295 155081 492076 376973 436620 143093 541381 6089
14922A12709M8578M5388K48081A16379J91002F9748K51230C3882K68523A22051
$$ 112709 161287 206675 454756 116379 307381 69748 320978 33882 302405 122051
14911D55396j21448P3303k0923n6245j20708K67655j24474c9110D85144k35979
$$ 455396 333948 407251 386328 330083 209375 477030 352556 -39110 485144 249165
14901B49165K37800J93663n0892B13897K82211j66827J12209J72552A48178R1425
$$ 249165 486965 680628 629736 213897 496108 329281 441490 614042 148178 239603
14891B39603p8808J3816K07837A74074J36802G7149K12931j04422q3363K84524
$$ 239603 160795 174611 382448 174074 310876 77149 290080 185658 102295 386819
14881C86819A68861J58081O3158J43196B42902M20441A74179j1409K41233f7757
$$ 386819 168861 326942 390100 533296 242902 663343 174179 162770 404003 -67757
14870B57013J76175j18241K75482j84483J04356G1869P80677m24858M5671J51445
$$ 257013 433188 314947 590429 405946 510302 71869 852546 427688 473359 624804
14860F24804N4352k06939j27012A12405K84640l5691L31254l05210J2191n1579
$$ 624804 679156 472217 345205 112405 397045 361354 692608 387398 399589 348010
14850C48010A38399K90102A90026K95007N7229B60490J93345J37014k63884a58284
$$ 348010 138399 428501 190026 485033 542262 260490 453835 590849 326965 -158284
14839C84248R636M1764L08960q5673j40460M0556Q5144j97171L016K85154j13385
$$ 384248 393884 435648 744608 658935 518475 559031 644175 447004 450020 735174 621789
14828F21789l10326J19319M09978D12303K57478B54389J95644J97363k936j7680
$$ 621789 311463 430782 840760 412303 669781 254389 450033 647396 644460 626780
14818F26780k17234J57310j16345N53919D71783O1647p9082P9398K82608k97825
$$ 626780 409546 566856 450511 1004430 471783 533430 454348 533746 816354 518529
14808E18529j65202K58954J02197k43479J54181r7346L7539j10862K25083j47604
$$ 518529 353327 612281 714478 470999 625180 527834 565373 454511 679594 531990
14798E31990O2054P4333J75030l18618J69242A63841M09747R686N7908j87713
$$ 531990 594044 668377 843407 524789 694031 163841 573588 583274 641182 453469
14788D53469A87912L99716j11666J63256J53984k74625q0395P9927j29313K28817
$$ 453469 187912 587628 475962 639218 793202 518577 438182 518109 388796 617613
14778F17613K00392k85843K56276j07937Q9120j14186k90772O8759K95342k09689
$$ 617613 818005 532162 788438 680501 769621 655435 364663 433422 728764 519075
14768E19075J79119k91887L71074j70500j56004m1313k01752M32822N7219j10841
$$ 519075 698194 406307 777381 606881 450877 409564 207812 640634 697853 587012
14758E87012L34547l25243K40377M752j68991r552J99607r3678j36859j00282
$$ 587012 921559 596316 836693 841445 672454 662902 862509 768831 631972 531690
14748E31690K65197k27412K04221q105J15435l37689K78244J76851k62868p110
$$ 531690 796887 569475 773696 765591 881026 543337 821581 998432 735564 728454
14738G28454j93537M30735k48840q2840R1341j63659J52920o1026m1775B60616
$$ 728454 534917 965652 716812 633972 725313 561654 714574 653548 611773 260616
14727F32402M08544m00340L55480r0389l52007N28064E35612L71650j8011l51063
$$ 632402 1040946 640606 996086 905697 553690 1081754 535612 907262 889251 538188
14717E38188L25089k56125N8279q4778N9966m9692J10871r1373L66262l35181
$$ 538188 863277 607152 665431 580653 640619 590927 701798 610425 976687 641506
14707F41506M19748m21023M25175j27900k15934O8944J65359o9846K00996l07587
$$ 641506 1061254 640231 1065406 937506 721572 790516 955875 886029 1087025 779438
14697G79438L02763k38178L60787k55821r6737k82188N47520l44233L2189K21344
$$ 779438 1082201 844023 1204810 948989 852252 570064 1117584 773351 805540 1026884
14687A026884j78111J66436l85933M83666j90502o3076J84786R5347j15631j78076
$$ 1026884 848773 1015209 629276 1112942 922440 859364 1044150 1139497 1023866 845790
14677H45790K69346k77806k3776J43945N8825K21412l22502J70477k85146P6366
$$ 845790 1115136 837330 813554 957499 1016324 1237736 915234 1085711 800565 876931
14667H76931L5456j23196O84805m74743J48761k69360n4009k3676K71405J25016
$$ 876931 912387 789191 1473996 999253 1148014 878654 824645 800969 1072374 1197390
14657A197390J94680j98332j73288K11743k01028L07052j75306j37184L12159
$$ 1197390 1392070 1193738 1020450 1232193 1031165 1338217 1162911 1025727 1337886
14648A337886j71839J22294j71826p9736l2056J33661l88188O86546k49081O8904
$$ 1337886 1166047 1288341 1116515 1036779 1004723 1138384 750196 1436742 1187661 1256565
14638A256565k8051J2949K66491l01287L21129o9622R9858j04222k37152J71353
$$ 1256565 1228514 1241463 1507954 1206667 1527796 1458174 1558032 1453810 1216658 1388011
14628A388011K79460j50042o0064K08157k84088N4834m90528O18561m07043K45679
$$ 1388011 1667471 1517429 1457365 1665522 1381434 1436268 945740 1564301 1157258 1402937
14618A402937J03477j58500K60480k2191Q0878k08335J28537L3886l3429q6213
$$ 1402937 1506414 1347914 1608394 1586203 1667081 1458746 1587283 1621169 1587740 1501527
14608A501527L33228q2496j37794M7210K2019L43428j78751k23281l5148j67018
$$ 1501527 1834755 1752259 1614465 1661675 1683694 2027122 1848371 1625090 1589942 1422924
14598A422924O339J77935K51569m36414K07797L69821Q5357k44866N34591m65773
$$ 1422924 1429263 1607198 1858767 1422353 1630150 1999971 2085328 1840462 2375053 1909280
14588A909280J43169q3667j36095N4812L77950m04602M2425N03858n15221L69136
$$ 1909280 2052449 1968782 1832687 1887499 2265449 1860847 1903272 2407130 1891909 2261045
14578B261045k60327M9729K19630k07263n2364J85624r3778J07687j65130J50810
$$ 2261045 2000718 2050447 2270077 2062814 2010450 2196074 2102296 2209983 2044853 2195663
14568B195663K33309n03456M45261J61670k01040J2123L47664l5113K69908J53253
$$ 2195663 2428972 1925516 2370777 2532447 2331407 2343530 2691194 2656081 2925989 3079242
14558C079242k85060M73604P86607m38969J62615J24217O67556J71478J343687
$$ 3079242 2794182 3267786 4054393 3615424 3778039 3902256 4569812 4741290 6084977
14549F084977K416113M408417J1197401J8595136m083148j6162716A1040422n218060
$$ 6084977 8501090 12909507 24106908 42702044 38618896 22456180 11040422 5822362
14541E822362k583397k80384m81748m77941K87643k26190R6709j42769J1943M32539
$$ 5822362 3238965 2958581 2476833 1998892 2286535 2060345 2157054 2014285 2026228 2458767
14531B458767j82397j35904n7213K43679m288j11922j02300K05100K00218O4567
$$ 2458767 2276370 2140466 2083253 2326932 2322644 2210722 2108422 2313522 2513740 2578307
14521B578307P8408j36195L78487k08789m6688J85833J73398k25929J45206l57741
$$ 2578307 2656715 2520520 2899007 2690218 2643530 2829363 3002761 2776832 2922038 2564297
14511B564297K43482L0412r0368L32181j5305m8731K9859J95039J38584r3044
$$ 2564297 2807779 2838191 2747823 3080004 3064699 3015968 3045827 3240866 3379450 3286406
14501C286406K60167o24316M51928j80004Q0319P5935P7477j71683L13440l64371
$$ 3286406 3546573 2922257 3374185 3194181 3274500 3350435 3427912 3256229 3569669 3205298
14491C205298P06938k84844L9585J42674J3693k79587K36696j26814L97814k59595
$$ 3205298 3912236 3627392 3666977 3809651 3823344 3543757 3780453 3653639 4051453 3791858
14481C791858N4503o5537N137K84095M7992J41304m5467Q2002J37733l60038M01801
$$ 3791858 3846361 3780824 3785961 4070056 4118048 4259352 4213885 4295887 4433620 4073582 4475383
14470D475383o1997R1838J1055k9946Q7159N00258o63538L06933M51934r4768
$$ 4475383 4413386 4505224 4516279 4486333 4573492 5073750 4410212 4717145 5169079 5074311
14460E074311l22947N74498o62091M77360J82236q8328J17951o7144j39506L66306
$$ 5074311 4751364 5325862 4663771 5141131 5323367 5235039 5352990 5285846 5146340 5512646
14450E512646O5424k49455O53205m47749K44217P4425J71665j68701P06520m10085
$$ 5512646 5578070 5328615 5981820 5534071 5778288 5852713 6024378 5855677 6562197 6152112
14440F152112L14040l5162q4246o607J2134M09994P6111n2496K63240l2159j8411
$$ 6152112 6466152 6430990 6346744 6340137 6352271 6762265 6838376 6785880 7049120 7016961 6998550
14429F998550o0327L91344K6082k233L09893O1443L4834j09200K73510J9278L16948
$$ 6998550 6938223 7329567 7355649 7353416 7663309 7724752 7759586 7650386 7923896 7943174 8260122
14418H260122L5207Q9491J15291M53666J42038k07551J97443K96859M8165l06128
$$ 8260122 8295329 8384820 8500111 8953777 9095815 8888264 9085707 9382566 9430731 9124603
14408I124603N49480q0469L33638J12733l52K12791N00345r3055K50245k8675
$$ 9124603 9674083 9593614 9927252 10039985 10039633 10252424 10752769 10659714 10909959 10881284
14398A0881284M46849K16442L71679P7940l49554N25399K63374k0948M75259R9714
$$ 10881284 11328133 11544575 11916254 11994194 11644640 12170039 12433413 12412465 12887724 12987438
14388A2987438L44917K84927L8958M0415K50704L66486J68707N71551L3828L46335
$$ 12987438 13332355 13617282 13656240 13696655 13947359 14313845 14482552 15054103 15087931 15434266
14378A5434266K82975J91148K25948K33581L41166P84068m1023L37037K23599
$$ 15434266 15717241 15908389 16134337 16367918 16709084 17493152 17452129 17789166 18012765
14369A8012765M24051N45941M45959N22438J68808P44799j22375L78579R84861
$$ 18012765 18436816 18982757 19428716 19951154 20119962 20864761 20742386 21120965 22105826
14360B2105826J83318Q31424M73917K69916O19912K47043P83027N22479N84144
$$ 22105826 22289144 23120568 23594485 23864401 24484313 24731356 25514383 26036862 26621006
14351B6621006R52572O28966Q32752J21046J068719Q20631R62433O63752J065786
$$ 26621006 27573578 28202544 29035296 29156342 30225061 31045692 32008125 32671877 33737663
14342C3737663P60686P82839Q08065J145451J081007J151430R36298J345959J116966
$$ 33737663 34498349 35281188 36089253 37234704 38315711 39467141 40403439 41749398 42866364
14333D2866364J590503J121193J491028J267059J505080J639754J535726K137966
$$ 42866364 44456867 45578060 47069088 48336147 49841227 51480981 53016707 55154673
14325E5154673J440592K245050K026808J670905K460534K623748K139618K637128
$$ 55154673 56595265 58840315 60867123 62538028 64998562 67622310 69761928 72399056
14317G2399056K589525K664514K867017L654113L210073L659250L774907L567474
$$ 72399056 74988581 77653095 80520112 84174225 87384298 91043548 94818455 98385929
14309I8385929M716510M133376M560972M824607N371549N446173O193777N888754
$$ 98385929 103102439 107235815 111796787 116621394 121992943 127439116 133632893 139521647
14301A39521647O783816P020530P614136P913440Q408758R240990R115448J0365406
$$ 139521647 146305463 153325993 160940129 168853569 177262327 186503317 195618765 205984171
14293B05984171J0341348J1444393J2043092J2155477J3154368J3938893J4245740
$$ 205984171 216325519 227769912 239813004 251968481 265122849 279061742 293307482
14286B93307482J4704412J5546668J5775292J6088452J5927273J6015998J5576227
$$ 293307482 308011894 323558562 339333854 355422306 371349579 387365577 402941804
14279D02941804J5487229J4443907J3442243J2390324J0965973Q796285N549344
$$ 402941804 418429033 432872940 446315183 458705507 469671480 478467765 484017109
14272D84017109J418059l54041k500799m038697j578786n188081p583004r518813
$$ 484017109 485435168 485081127 482580328 478541631 476962845 471774764 464191760 454672947
14264D54672947j0953550j2980986j3903741j5202158j5624794j6280449j6507999
$$ 454672947 443719397 430738411 416834670 401632512 386007718 369727269 353219270
14257C53219270j6896517j6053843j5519568j4745060j4120679j4013745j3243201
$$ 353219270 336322753 320268910 304749342 290004282 275883603 261869858 248626657
14250B48626657j2713548j1817538j1407661j0435857j0088223r122952q649269
$$ 248626657 235913109 224095571 212687910 202252053 192163830 183040878 174391609
14243A74391609q081969q026960p722245o943611o407178o076901n469400n811138
$$ 174391609 166309640 158282680 150560435 143616824 137209646 131132745 125663345 119852207
14235A19852207m960381n183119m497679m328775l778711l806461l697550l288829
$$ 119852207 114891826 109708707 105211028 100882253 97103542 93297081 89599531 86310702
14227H6310702l356337l548229l053309k535590k741419k338204k287568k029413
$$ 86310702 82954365 79406136 76352827 73817237 71075818 68737614 66450046 64420633
14219F4420633k441938j912412k093764k193527j597264j739388j113475j576903
$$ 64420633 61978695 60066283 57972519 55778992 54181728 52442340 51328865 49751962
14211D9751962j806713j613813j322827j129602n27175j542317j140367j659599
$$ 49751962 47945249 46331436 45008609 43879007 43351832 41809515 40669148 39009549
14203C9009549p86501j093892o34258r71874q89259j104626j024320q39842o71612
$$ 39009549 38223048 37129156 36494898 35523024 34633765 33529139 32504819 31664977 30993365
14194C0993365n53989q71778q87493o74415p36957n86870m22815o54468r97472
$$ 30993365 30439376 29567598 28680105 28005690 27268733 26681863 26259048 25604580 24607108
14185B4607108l88808n81610l86860n60507n13537m67588m03553m81125n33868
$$ 24607108 24218300 23636690 23249830 22689323 22175786 21708198 21304645 20823520 20289652
14176B0289652j96687m04930m40191l96578p99397P4747n78239j36967k90872
$$ 20289652 20092965 19688035 19247844 18851266 18051869 18126616 17548377 17411410 17120538
14167A7120538k28516p89354Q725l79460m89863j41425n89547K16045l74996N5210
$$ 17120538 16892022 16102668 16111393 15731933 15242070 15100645 14511098 14727143 14352147 14407357
14157A4407357j88446p25239j4765n44922N1449J12059m96220J14306n73589j78159
$$ 14407357 14218911 13493672 13478907 12933985 12985434 13097493 12601273 12715579 12141990 11963831
14147A1963831j88773j80755K33030n96524k34762J89367k91567r6199m1087l37997
$$ 11963831 11775058 11594303 11827333 11230809 10996047 11185414 10893847 10797648 10756561 10418564
14137A0418564j19448l15773k83548K4070J62990j57220l34484p1176j88238k23271
$$ 10418564 10299116 9983343 9699795 9723865 9886855 9729635 9395151 9323975 9135737 8912466
14127H912466j39869j36708O8245l37684N3322n0243k11415l82747J71925Q01
$$ 8912466 8772597 8635889 8704134 8366450 8419772 8369529 8158114 7775367 7947292 7948093
14117G948093o38673N02664l4586l85396k1143J68522m36528l3750l284j23707
$$ 7948093 7309420 7812084 7777498 7392102 7370959 7539481 7102953 7069203 7065919 6942212
14107F942212j37640l3910l99605M45884n50237L69209n09798k19672Q577m8762
$$ 6942212 6804572 6770662 6371057 6816941 6266704 6635913 6126115 5906443 5915020 5866258
14097E866258j57652O8642K08207J04945m44962k03671J76331m56352m1102K17338
$$ 5866258 5708606 5777248 5985455 6090400 5645438 5441767 5618098 5161746 5120644 5337982
14087E337982J8301l2170j64829K87506m43719K03281k92054j6863J11958l00330
$$ 5337982 5356283 5324113 5159284 5446790 5003071 5206352 4914298 4897435 5009393 4709063
14077D709063r328l510n05799K82158J16215k84995J01893j8262R0209j52516
$$ 4709063 4699735 4696225 4190426 4472584 4588799 4303804 4405697 4387435 4477644 4325128
14067D325128k8029j37190J87106k61932K31909k12802L47636k65307j21837k33117
$$ 4325128 4297099 4159909 4347015 4085083 4316992 4104190 4451826 4186519 4064682 3831565
14057C831565M40129k60600j93670N5645q2518K47827l65999r9846j65004L15431
$$ 3831565 4271694 4011094 3817424 3873069 3790551 4038378 3672379 3572533 3407529 3722960
14047C722960O3298k65826m12346L80138K2771l19056k36298P7117J60783J56096
$$ 3722960 3786258 3520432 3108086 3488224 3510995 3191939 2955641 3032758 3193541 3349637
14037C349637N3476p7039l97500L40932M4272j1964m38974J28152J42310J8173
$$ 3349637 3403113 3326074 2928574 3269506 3313778 3301814 2862840 2990992 3133302 3151475
14027C151475m4928j51681k56564o392J26050j37453k1918N19533m62606p8745
$$ 3151475 3106547 2954866 2698302 2691910 2817960 2680507 2658589 3178122 2715516 2636771
14017B636771L4644k01346K69850m08839K50261R2338k80277L14412l11920K6832
$$ 2636771 2671415 2470069 2739919 2331080 2581341 2673679 2393402 2707814 2395894 2422726
14007B422726J18530k1793j15366m92033J26793K54641m1588j58532j29011J48062
$$ 2422726 2541256 2519463 2404097 1912064 2038857 2293498 2251910 2093378 1964367 2112429
13997B112429J35005J66886j88036J65219k94736N42245l97667P65842J288604
$$ 2112429 2247434 2414320 2226284 2391503 2096767 2639012 2241345 3007187 4295791
13988D295791L042930R670212K1383165J080620j4211800j1688594n038593k064905
$$ 4295791 7338721 17008933 38392098 39472718 25260918 13572324 8533731 6468826
13980F468826j554636l94908q82589l26691k7363k85577m6887J20682l24054J73119
$$ 6468826 4914190 4519282 3636693 3310002 3282639 2997062 2950175 3070857 2746803 2919922
13970B919922m07389l8116j11851J32931j13742Q0824j85507N9740m17742N41377
$$ 2919922 2512533 2474417 2362566 2495497 2381755 2462579 2277072 2336812 1919070 2460447
13960B460447n44509L23853l66197M79553k95237j83478M83612n42178K91304
$$ 2460447 1915938 2239791 1873594 2353147 2057910 1874432 2358044 1815866 2107170
13951B107170l40717L68586m21944K56000m14640J01879J84565M89853o01699
$$ 2107170 1766453 2135039 1713095 1969095 1554455 1656334 1840899 2330752 1729053
13942A729053J29580J42800l99698K53506J78929n71485M2858K5451Q8536J68339
$$ 1729053 1858633 2001433 1601735 1855241 2034170 1462685 1505543 1530994 1619530 1787869
13932A787869k35165L93294K8691k76801l8724k16513J95813k12310J50296j59203
$$ 1787869 1552704 1945998 1974689 1697888 1659164 1442651 1638464 1426154 1576450 1417247
13922A417247J69439r2082j88700L55922q5576l9733m955r4579K53910l3096j40149
$$ 1417247 1586686 1494604 1305904 1661826 1576250 1536517 1531562 1436983 1690893 1657797 1517648
13911A517648m8615J15354J09668l64095K5429r3125K23084L087j51730L0152
$$ 1517648 1469033 1584387 1694055 1329960 1355389 1262264 1485348 1488435 1336705 1366857
13901A366857k7542K51040j97424p4357r375k36570M50869j70785k30439K47501
$$ 1366857 1339315 1590355 1392931 1318574 1309199 1072629 1523498 1352713 1122274 1369775
13891A369775J14929J16422k24071k41088k27886L41939j28643K79485j62300
$$ 1369775 1484704 1601126 1377055 1135967 908081 1250020 1121377 1400862 1238562
13882A238562L1350q2385q000o7072j31569K17487J77344l77388k2434k1810L0930
$$ 1238562 1269912 1187527 1179527 1112455 980886 1198373 1375717 998329 975895 954085 985015
13871I85015K64816k68857J63438j94353K31767J17489n79671L44400O4688K2727
$$ 985015 1249831 980974 1144412 950059 1181826 1299315 719644 1064044 1128732 1151459
13861A151459k42146N04025m05215R4753k3658j2432J23891M9756N2738j18789
$$ 1151459 909313 1413338 1008123 1102876 1079218 1066786 1190677 1240433 1293171 1174382
13851A174382k98872Q5575J81685m2309n00911O07142m18996L80194k80238L69728
$$ 1174382 875510 961085 1142770 1100461 599550 1206692 787696 1167890 887652 1257380
13841A257380m63067K30298j07132j12405J69379J37194l8172P9386l52044l68984
$$ 1257380 794313 1024611 917479 805074 974453 1111647 1073475 1152861 800817 431833
13831D31833M66697K07054J7919l57875K43447o1843j7775q1013j71852m3333
$$ 431833 898530 1105584 1123503 765628 1009075 947232 929457 848444 676592 633259
13821F33259L00891n106j29479l02475J96388K54911l8280L2343k81706N90283
$$ 633259 934150 929044 799565 497090 693478 948389 910109 942452 660746 1251029
13811A251029l22228j18568J96615P9250j08554m56008M87994N5051p0142j77638
$$ 1251029 928801 810233 1006848 1086098 977544 521536 1009530 1064581 994439 816801
13801H16801O6115k23062K77748j47647l0012j41083K03242J98085k0046j33139
$$ 816801 882916 659854 937602 789955 759943 618860 822102 1020187 1000141 867002
13791H67002K12332j36705j02358k35268K52984n9790j10045p2961L49415l97490
$$ 867002 1079334 942629 840271 605003 857987 798197 688152 615191 964606 567116
13781E67116J6323K62630k7295l42777L88857j49182K26686j91577m6793j53684
$$ 567116 583439 846069 818774 475997 864854 715672 942358 750781 703988 550304
13771E50304O3456R691n8241Q3871K29650k60768J03519k4737R9747k69407K31095
$$ 550304 613760 623451 565210 649081 878731 617963 721482 696745 796492 527085 758180
13760G58180r0136J40230p5245J10036l14470k28011L32012J14287K23499D32737
$$ 758180 668044 808274 733029 843065 528595 300584 632596 746883 970382 432737
13749G44884m8650P3619j23453l19345K75131j67222J40110K24878j06614o1539
$$ 744884 696234 769853 646400 327055 602186 434964 575074 799952 693338 631799
13739F31799j50828J60277p6719O650J72305N851C03555M02338l01835K89577
$$ 631799 480971 641248 564529 571179 743484 749335 303555 705893 404058 693635
13729F93635B18150M90095B83213L86316n5018J2331k37443L21489B96758q116
$$ 693635 218150 708245 283213 669529 614511 626842 389399 710888 296758 288642
13719B88642K45091K3140m5173j01664K3721Q0045L6998N4607j35348m9911J32203
$$ 288642 533733 556873 511700 410036 433757 513802 550800 605407 470059 420148 552351
13708E52351j1708J20656J25378j84579j44256P857q3280J12277n6475J28849
$$ 552351 540643 661299 786677 602098 457842 465699 382419 494696 438221 567070
13698E67070N0110R3884j24853l311j42463j05439L0255L59246l17490J91614
$$ 567070 617180 711064 586211 582900 440437 334998 365253 724499 407009 598623
13688E98623K1219B60663K87464J01858K41405k29513l11264N36654l69760J39087
$$ 598623 619842 260663 548127 649985 891390 661877 350613 887267 517507 656594
13678F56594C14105J61588R8486J6334l629q2056J25192j25928r2602J24003N0421
$$ 656594 314105 475693 574179 590513 586884 504828 630020 504092 411490 535493 585914
13667E85914p9661A46380L19704l7387j84137P7375o9065K63880k39432p9530
$$ 585914 506253 146380 466084 428697 244560 321935 252870 516750 277318 197788
13657A97788L29405K32225j85027p4320A51815K08417L69148R602j28559K0669
$$ 197788 527193 759418 574391 500071 151815 360232 729380 738982 610423 631092
13647F31092j25085o8059J4105J58619j39906m5372A99776P7162J86796j14748
$$ 631092 506007 437948 452053 610672 470766 425394 199776 276938 463734 348986
13637C48986j38849J56684l3198J5443G3717L73683A50271N43807k88069d3311
$$ 348986 210137 366821 333623 349066 73717 447400 150271 694078 406009 -43311
13626F78997k76465R8997A77418L4329J14956K1980J46611J4326J18595l1312
$$ 678997 402532 501529 177418 211747 326703 348683 495294 509620 628215 596903
13616E96903r9089j42126M4125p3965K63379j52564J92977k96519J29282J33138
$$ 596903 497814 355688 399813 325848 589227 436663 629640 333121 462403 595541
13606E95541B93416k3935l9119J1711J27997J81026A81405M86525j36150k33499
$$ 595541 293416 269481 230362 242073 370070 551096 181405 667930 531780 298281
13596B98281N9731K41869k41829J1332J78114J0212j29720j27420E469K92291
$$ 298281 358012 599881 358052 369384 547498 557710 427990 300570 5469 297760
13586B97760j09214K10335A59136j4282N8399k0576K18811j60473J67294A26015
$$ 297760 188546 398881 159136 144854 203253 182677 401488 241015 408309 126015
13575E42226j27112K9084K5708q301m0322j27433K80939A99393J07402q2846J01252
$$ 542226 415114 444198 469906 461605 421283 293850 574789 199393 306795 223949 325201
13564C25201I0064K67302e7036D45140k8874B03898J25348G6584K83919N6651
$$ 325201 90064 357366 -57036 445140 416266 203898 329246 76584 360503 417154
13554D17154J92760q5911j43008A54292j8387L51778Q2905I6044K20626m4188
$$ 417154 609914 524003 380995 154292 135905 487683 570588 96044 316670 272482
13544B72482A20220M56618A33735K10422J92885k08848J58268j40071o8705k6426
$$ 272482 120220 576838 133735 344157 537042 328194 486462 346391 277686 251260
13534B51260o4489K7568J48904I7778K65742c1172E61569i1450E23333o2411j59139
$$ 251260 186771 214339 363243 97778 363520 -31172 561569 -91450 523333 460922 301783
13523C01783a9817A75668J33046q6974K35595F6142K89359C4626L74692A48617
$$ 301783 -19817 175668 308714 221740 457335 66142 355501 34626 409318 148617
13512a24070A36624K09439j46382m837J6740k9977K10056A07613L13026K77418
$$ -124070 136624 346063 199681 194844 211584 181607 391663 107613 420639 698057
13502F98057A29110P6878J19403J70807J8762j42179J7888j51374a286C00118
$$ 698057 129110 205988 325391 496198 514960 372781 390669 239295 -1286 300118
13491B72687a2439b78A52241J07433Q0759M9714j78412f2350A77034p4116F804
$$ 272687 -12439 -278 152241 259674 340433 390147 211735 -62350 177034 102918 6804
13479a41156B94949K8014N2596a8653B15859r6898J16402f3743A82724J21227
$$ -141156 294949 322963 375559 -18653 215859 118961 235363 -63743 182724 303951
13469C03951Q972r1821E1626J63390n5303l6272J39418D7191a6877A37114L83163
$$ 303951 312923 221102 51626 215016 159713 123441 262859 47191 -16877 137114 520277
13458E20277A54392A7976e892E2651K81146A57312n4905M06584A67969b2432B76757
$$ 520277 154392 17976 -5892 52651 333797 157312 102407 508991 167969 -22432 276757
13446i7474B54437J59768A54145K84429r8980K15414k21434k8660j24906h9579
$$ -97474 254437 414205 154145 438574 339594 555008 333574 304914 180008 -89579
13435C18434A52803J9173b5785k45D42769l0722A80954G9214K97006A83111J05574
$$ 318434 152803 171976 -25785 -26030 442769 412047 180954 79214 376220 183111 288685
13424B88685J2954A32496C4665J46500c1422C17509e903B67350l7755L77417A40750
$$ 288685 301639 132496 34665 181165 -31422 317509 -5903 267350 229595 607012 140750
13412A2161b996B94650o5941A03831J56087b2836B07224a30224A45147a62869
$$ 12161 -2996 294650 228709 103831 259918 -22836 207224 -130224 145147 -162869
13401D61531b34226C6496M94959C1318K65570j27547K21915d0370B72911j19242
$$ 461531 -234226 36496 531455 31318 296888 169341 391256 -40370 272911 153669
13391A53669l4384J40827o1636L46954A96364J70145C9474L68633I9360H041Q90
$$ 153669 119285 260112 198476 545430 196364 366509 39474 408107 99360 8041 8931
13380H931a6069C32221j33821K0843K42360j96419L8804H8843M61097k24642i877
$$ 8931 -16069 332221 198400 219243 461603 265184 303988 88843 549940 325298 -9877
13368D56709F041f1178A44312Q4172k2614f2094E38117h998E37696A45508L37729
$$ 456709 6041 -61178 144312 228484 205870 -62094 538117 -8998 537696 145508 483237
13357D83237e9915K5436A07092E0210a271j19332C44361j50319I3947K19246D9252
$$ 483237 -59915 -34479 107092 50210 -1271 -120603 344361 194042 93947 313193 49252
13345B17586h1445B94045M57848l00264r9366J39180B17093n891P3253p3437p2015
$$ 217586 -81445 294045 751893 451629 352263 491443 217093 211202 284455 211018 139003
13334A39003F8234L3273J44771c9643H4267L45531A01559L19042A03217K88137
$$ 139003 68234 101507 246278 -39643 84267 429798 101559 420601 103217 391354
13324C91354b01218B22918a42781C83088A19323m4763J77144A7995M23283A87963
$$ 391354 -201218 222918 -142781 383088 119323 74560 251704 17995 441278 187963
13313C49612k1034B9149J23322j1521D5695O6580b21039A28319F2278R3645p6636
$$ 349612 328578 29149 152471 140950 45695 112275 -221039 128319 62278 155923 79287
13302G9287K79656i0852B55952j21804g1047A93168o1419J13832b7284C36829
$$ 79287 358943 -90852 255952 134148 -71047 193168 131749 245581 -27284 336829
13291G1022L64650e5860D37896A35790A4173J9579K05068P2758j33501j7830D7848
$$ 71022 435672 -55860 437896 135790 14173 33752 238820 311578 178077 160247 47848
13279G1800J75669a57099K6571b2243p803k25579A97093H02J93804j9538D5017
$$ 71800 247469 -157099 -130528 -22243 -30046 -255625 197093 802 194606 175068 45017
13267a20069B74167A8707o564D911Q6840K03605G4237c695C9204J49299k2387
$$ -120069 274167 18707 12143 4911 91751 295356 74237 -3695 39204 188503 166116
13256A66116p1431K16122j9018j15349R2904m1134I9772P5252L07678E1846f4861
$$ 166116 94685 310807 291789 176440 269344 228210 99772 175024 482702 51846 -64861
13244B9152K64292J36336K2278o9182A23130k597J741n9015g932A37492J5037
$$ 29152 293444 429780 452058 382876 123130 120533 122274 63259 -7932 137492 152529
13233A52529a21870A07207J51195c13013B70007b92762E6301J94879A19074L10666
$$ 152529 -121870 107207 258402 -313013 270007 -292762 56301 251180 119074 429740
13223D29740A35556l9840a82371B99176j27252L19055G1416J83719G3939M5636
$$ 429740 135556 95716 -182371 299176 171924 490979 71416 255135 73939 119575
13213A19575K18484A38051J19453p4182A0631L71071a73389D1511K20251l3232
$$ 119575 338059 138051 257504 183322 10631 381702 -173389 41511 261762 228530
13203B28530J17990A31702O2632a24058l2332c0885D9948f4773G8612K4498L2700
$$ 228530 346520 131702 194334 -124058 -156390 -30885 49948 -64773 78612 103110 135810
13192A35810J8416g9449o406K9578q8398O7524A45830a97108B51441b4653F2274
$$ 135810 154226 -79449 -85855 -56277 -144675 -77151 145830 -197108 251441 -24653 62274
13180D4807a30459B60878F1500A6607d9670j89914B56473j28156J19790I9074
$$ 44807 -130459 260878 61500 16607 -49670 -239584 256473 128317 248107 99074
13169C36097a53356A34403R4013j8290a95234R7200c6588p7826A42260E6648L9369
$$ 336097 -153356 134403 228416 210126 -195234 -98034 -36588 -114414 142260 56648 96017
13158I6017L460i7745A41713J13147B7451g2053I4118E592K7226a34461e3562
$$ 96017 99477 -97745 141713 254860 27451 -72053 94118 5592 32818 -134461 -53562
13146i776r9725A42050d4437j08574d9380I9487i1039A709P2967a39593f3750
$$ -9776 -109501 142050 -44437 -153011 -49380 99487 -91039 1709 74676 -139593 -63750
13134A92676p6786J27800d1793k75300B5994M2750C4248h5662D257d8083B42110
$$ 192676 115890 243690 -41793 -317093 25994 68744 34248 -85662 4257 -48083 242110
13122F6062Q1278J9723M994B4830M46075D7180N1032E477M37554E9164P3864a44148
$$ 66062 147340 167063 172057 24830 470905 47180 98212 5477 443031 59164 133028 -144148
13109i384H7581K8947b2478r3797B57017J5614r0020F2931a21624B53438c0739
$$ -9384 87581 116528 -22478 -116275 257017 272631 182611 62931 -121624 253438 -30739
13097D65894A16341B9957J77051I7821h3545B17269b18201g4899A56745c19256
$$ 465894 116341 29957 207008 97821 -83545 217269 -218201 -74899 156745 -319256
13086A42436J38119F4516K4204D058J48849O7233e8384A11984P0032J06331J7580
$$ 142436 280555 64516 88720 4058 152907 220140 -58384 111984 182016 288347 305927
13075C05927A41442m1762J73979d811B19701j8889G9536K44437E0575J34186P3317
$$ 305927 141442 99680 273659 -4811 219701 200812 79536 323973 50575 184761 258078
13064B58078Q0789j21011J31126B1918a2591A56940G7220A2182L51709a25896
$$ 258078 338867 217856 348982 21918 -12591 156940 77220 12182 363891 -125896
13053g172C16580A4050P8739a05147a3246B79972D9573A6704Q5789m5970a62985
$$ -7172 316580 14050 92789 -105147 -13246 279972 49573 16704 102493 56523 -162985
13041A79298J10444a920j56992B73524K2386A40009F4647A5545K86724e7120o2628
$$ 179298 289742 -1920 -158912 273524 295910 140009 64647 15545 302269 -57120 -119748
13030a19748A03922g5782L0316C39216b1402A02945a80236A65477L5749B543M4335
$$ -119748 103922 -75782 -45466 339216 -21402 102945 -180236 165477 201226 2543 46878
13019D6878J60553r8933P953b0595o4322B29966h0670B5766J30515c5826A89403
$$ 46878 207431 108498 116451 -20595 -84917 229966 -80670 25766 156281 -35826 189403
13007c2352F0164K03685D3058f0004C8039K48974A25595L48361A54078J65963
$$ -32352 60164 263849 43058 -60004 38039 287013 125595 473956 154078 320041
12997C20041b30950A60295a0581q8860A30589m038a37496J9696N8432C91940I8836
$$ 320041 -230950 160295 -10581 -99441 130589 126551 -137496 -117800 -59368 391940 98836
12985i8810A10077k3249K18269H2855k9615m220J04021K9963b59669H9747b85062
$$ -98810 110077 86828 305097 82855 53240 49020 153041 183004 -259669 89747 -285062
12973A23500e8040D1785d5733k89106B73862A20777g2054j28009G6329b42998
$$ 123500 -58040 41785 -45733 -334839 273862 120777 -72054 -200063 76329 -242998
12962f4096m4661C72969b8410A10938a66333D151K63704a87832D82637b40889
$$ -64096 -108757 372969 -28410 110938 -166333 4151 267855 -187832 482637 -240889
12951C03223A19440d2761C14666D9962K15475H6119P6361k913i9336D12231m7117
$$ 303223 119440 -42761 314666 49962 265437 86119 162480 159567 -99336 412231 365114
12940C65114A14191Q6296a5652o8821a8834l47639M4420G2390M8661P1075a30449
$$ 365114 114191 200487 -15652 -84473 -18834 -366473 -322053 72390 121051 192126 -130449
12928a52346A13020l6286b32136e2471A66055p2418J721k3037a99158J0008A08905
$$ -152346 113020 76734 -232136 -52471 166055 93637 95358 72321 -199158 -189150 108905
12916G7043L9132J9801a1875j08411J0641B16860c2523B90081j19778E2447Q2378
$$ 77043 116175 135976 -11875 -120286 -109645 216860 -32523 290081 170303 52447 134825
12905A34825q640c8739l3512B62541A5211g118j39529A02809b60472C34468H5182
$$ 134825 126185 -38739 -72251 262541 15211 -7118 -146647 102809 -260472 334468 85182
12893c9717j8919A63289f8839G45e3907F7593P4985m8904B499c3765j38696b1829
$$ -39717 -58636 163289 -68839 745 -53907 67593 142578 93674 2499 -33765 -172461 -21829
12880f7344C62600E4653K77145c0114H2876K52068A20398E8570d13272A106K35193
$$ -67344 362600 54653 331798 -30114 82876 334944 120398 58570 -413272 1106 236299
12869B36299L3969a40099L4152A83282M4869b92147A8509a40663A35878M00l8685
$$ 236299 270268 -140099 -105947 183282 228151 -292147 18509 -140663 135878 136278 97593
12858I7593C2606J8372J13332Q8786a18232B42221a71814J7731B04416L2233a87783
$$ 97593 32606 50978 164310 253096 -118232 242221 -171814 -154083 204416 236649 -187783
12846c99711J07629G5274h936o6987B29041n2292J14409r3913b13789j80968A08122
$$ -399711 -292082 75274 -8936 -75923 229041 176749 291158 197245 -213789 -394757 108122
12834B2906c9745A78744h9296B11290O8585R9539A26349J41057j2388g7415l4144
$$ 22906 -39745 178744 -89296 211290 279875 379414 126349 267406 255018 -77415 -111559
12823a11559D04252n3819b08544A00884a78949E7771A4463b03052A51359K9465
$$ -111559 404252 350433 -208544 100884 -178949 57771 14463 -203052 151359 180824
12813A80824p9466f2926J3878j7075B72696A01053m6237K07464A30488b86637
$$ 180824 101358 -62926 -49048 -66123 272696 101053 54816 262280 130488 -286637
12802d5831J1248k98496A24245L72269b5448A5091k07L90205a84988m6402A1445
$$ -45831 -34583 -333079 124245 496514 -25448 15091 14884 405089 -184988 -231390 11445
12790c26046E4271K79708B4636Q8324a3017A52730N9983f4904k4021A15268b878
$$ -326046 54271 333979 24636 112960 -13017 152730 212713 -64904 -88925 115268 -2878
12778C3359P3991a99271G3200C5760O4976B1383a59153j13727B1499a11910E8522
$$ 33359 107350 -199271 73200 35760 100736 21383 -159153 -272880 21499 -111910 58522
12766B57070F1643d022n9138a9387E1840a7182m90021g3014j25527b7152j58373
$$ 257070 61643 -4022 -63160 -19387 51840 -17182 -507203 -73014 -198541 -27152 -185525
12755a85525B96526A00903M13230D563c42704G5299a1984j79800B4020R8434c3603
$$ -185525 296526 100903 514133 4563 -342704 75299 -11984 -191784 24020 122454 -33603
12743b97762c2654j79571d1743k54551D1273J32491J30976A32097j4544c2063
$$ -297762 -32654 -212225 -41743 -296294 41273 173764 304740 132097 117553 -32063
12732A97651a18812c0127C7810P8671i0727A18099J29598f0058p5602c5776r5936
$$ 197651 -118812 -30127 37810 116481 -90727 118099 247697 -60058 -135660 -35776 -131712
12721a31712B55623M3324f6638A16509a52954f0426p6134n3957B23121m2146L2999
$$ -131712 255623 298947 -66638 116509 -152954 -60426 -136560 -190517 223121 180975 213974
12710B13974e4898j27801D93266A96977f866H2202K28700J4685A25522i3469B91670
$$ 213974 -54898 -182699 493266 196977 -6866 82202 310902 325587 125522 -93469 291670
12698A2698J0789c7357A69183a4957A87836C9821a21735G8226h9879K5244E0018
$$ 12698 23487 -37357 169183 -14957 187836 39821 -121735 78226 -89879 -64635 50018
12686G6695a24192A41507B3420f9356C14712A25294e8557A08605Q378L9062E3594
$$ 76695 -124192 141507 23420 -69356 314712 125294 -58557 108605 116983 156045 53594
12674B18297I0784b22529B65911d2986i231Q93j77883C30489j13030A5646J51484
$$ 218297 90784 -222529 265911 -42986 -9231 -8338 -186221 330489 217459 15646 167130
12663A67130J66087G4036g4918F0476N5539J30177a44026E27059k26419l0905
$$ 167130 333217 74036 -74918 60476 116015 246192 -144026 527059 300640 269735
12653B69735b43839D008J5992J7045J99571h9941E4975K37784M5741A26342J15059
$$ 269735 -243839 4008 20000 37045 236616 -89941 54975 292759 338500 126342 241401
12642B41401E9355Q2909N672b8294F4816L43247k5964c4000C18373G5924b0104
$$ 241401 59355 142264 147936 -28294 64816 408063 382099 -34000 318373 75924 -20104
12630B06270A3875L86801A1410L40174A70340P0381k3964o6748J08330A07468
$$ 206270 13875 400676 11410 351584 170340 240721 216757 150009 258339 107468
12619a42362B72508A1354J00763J44286D7109K72225C0727R3356C6408B921O0700
$$ -142362 272508 11354 112117 256403 47109 319334 30727 124083 36408 2921 63621
12608F3621J34805E6553b76578q7141B31245N5114a25273E01400h0953B70264
$$ 63621 198426 56553 -276578 -363719 231245 286359 -125273 501400 -80953 270264
12597A01630D5144a93645B70060d2859C81902a82653G1475b14804i9760a637m0498
$$ 101630 45144 -193645 270060 -42859 381902 -182653 71475 -214804 -99760 -1637 -42135
12586d2135j80294N5993B77005e7022E0116e8693F3144J21058p505l4099A0197
$$ -42135 -222429 -166436 277005 -57022 50116 -58693 63144 184202 176697 142598 10197
12574D8530c3178j26052A34548G263K69654i7717k14933g6452b4939k5803C27763
$$ 48530 -33178 -159230 134548 7263 276917 -97717 -312650 -76452 -24939 -50742 327763
12562G8997b2915l00773d784G2210O5153N3639H551Q6367m4953i1799k33902e2277
$$ 78997 -22915 -323688 -4784 72210 137363 191002 8551 94918 49965 -91799 -325701 -52277
12549d0827m54927a71883M6582A03318m0992K604k4093K7003K80557j64296e1750
$$ -40827 -495754 -171883 -125301 103318 62326 64930 40837 67840 348397 184101 -51750
12537a71478m5520j98947a63205b4945l3609D15578b5462f091k9058B32646a29931
$$ -171478 -216998 -415945 -163205 -24945 -58554 415578 -25462 -6091 -35149 232646 -129931
12525G5850l4993R094J84674J07075H5951c0042J2290A04799E0885e3559Q196
$$ 75850 40857 49951 234625 341700 85951 -30042 -17752 104799 50885 -53559 -45363
12514d5363B85200D8204K10263A04985b19525b9465j34411c9551B51931f7755
$$ -45363 285200 48204 258467 104985 -219525 -29465 -163876 -39551 251931 -67755
12503c3016B98289f7449j21135A5547J71333c2726B68774p8642a96419A14518
$$ -33016 298289 -67449 -188584 15547 186880 -32726 268774 190132 -196419 114518
12492I7754A2061K06729E2152a04449K8414A39498E2183h0988N460I5708b64734
$$ 97754 12061 218790 52152 -104449 -76035 139498 52183 -80988 -75528 95708 -264734
12480e2979k4720C5008d1597B3422f746j20501A25328N5148C3440J1873b5005
$$ -52979 -77699 35008 -41597 23422 -6746 -127247 125328 180476 33440 45313 -25005
12468e0048A25851d08342C64325A09943a61606A64925a5335B77158i1713n707
$$ -50048 125851 -408342 364325 109943 -161606 164925 -15335 277158 -91713 -97420
12458i7420l27643H0923k286F452K90950c04430A23754b9506J1628D5022c1364
$$ -97420 -425063 80923 78637 6452 297402 -304430 123754 -29506 -17878 45022 -31364
12446a40100k580A34308a49701n5305C26119D6916K97949i6273j47256h217j00300
$$ -140100 -142680 134308 -149701 -205006 326119 46916 344865 -96273 -243529 -8217 -108517
12435a08517B07835a40697D1162c33611A38578b05402B20085g0896L5419C58183
$$ -108517 207835 -140697 41162 -333611 138578 -205402 220085 -70896 -35477 358183
12424b16460B44842F0161i2285p4102O0420M8619a603j13958B57665b54346J18418
$$ -216460 244842 60161 -92285 -166387 -105967 -57348 -1603 -115561 257665 -254346 -135928
12413a35928J0301E9019a29902I6273e8224o6480B80301G9987J15145N304e4469
$$ -135928 -125627 59019 -129902 96273 -58224 -124704 280301 79987 195132 200436 -54469
12401B55403e4259k00380P2867K6939P6499E3043a48884B761h410C8119a02319
$$ 255403 -54259 -254639 -181772 -154833 -78334 53043 -148884 2761 -8410 38119 -102319
12389B07746c4711A25049b0454B6395K26601j00336i3434B7109J05824m3555g6048
$$ 207746 -34711 125049 -20454 26395 252996 152660 -93434 27109 132933 89378 -76048
12377c92075A70339L2593D2561a24174L9270B5329f8171C9111a54653d3744A50387
$$ -392075 170339 202932 42561 -124174 -84904 25329 -68171 39111 -154653 -43744 150387
12365a40700b8307B1724a92650e9103C4793J00061N745a90398F3236e50459b01950
$$ -140700 -28307 21724 -192650 -59103 34793 134854 140599 -190398 63236 -550459 -201950
12353A04363n1070c00754A00354k4526K83087c31905H5324a03346A48826l9858
$$ 104363 53293 -300754 100354 75828 358915 -331905 85324 -103346 148826 108968
12343A08968c96267A55369G5587d5122q4569e707A29320a41832a6910C32906a98152
$$ 108968 -396267 155369 75587 -45122 -129691 -5707 129320 -141832 -16910 332906 -198152
12331a09222c9751a9603h30l68543J73500M1823E3070f9785A18681c63792C3416
$$ -109222 -39751 -19603 -830 -369373 -195873 -154050 53070 -69785 118681 -363792 33416
12319A10744l7321Q9140a20237p0648j0283o6248a11781p6528A90487g270n4164
$$ 110744 73423 162563 -120237 -190885 -201168 -267416 -111781 -188309 190487 -7270 -61434
12308f1434G9776k1099c3582j31865L6460O1706P69A58196O238J431a05791E4497
$$ -61434 79776 58677 -33582 -165447 -128987 -67281 -66512 158196 164434 165865 -105791 54497
12295a82752B49085A9684i502A1982Q7644h0851k27356A60551B4657a4329A79318
$$ -182752 249085 19684 -9502 11982 99626 -80851 -308207 160551 24657 -14329 179318
12283h4441C6041e5307A89992H1577l221a9643A65422r987d9866C73593h6575
$$ -84441 36041 -55307 189992 81577 78356 -19643 165422 155435 -49866 373593 -86575
12271A67576K3618C0677a06197F3872P8330Q0095j4604A8502L34570i0640A10890
$$ 167576 191194 30677 -106197 63872 142202 222297 207693 18502 353072 -90640 110890
12259B81673i638j30944D136L39194f7382B79567a05221B42246A14939k126b6812
$$ 281673 -9638 -140582 4136 343330 -67382 279567 -105221 242246 114939 112813 -26812
12247A59712a50184K8412B80980I0538J76131e0917A36735L9977J60587A755K54804
$$ 159712 -150184 -121772 280980 90538 266669 -50917 136735 176712 337299 1755 256559
12236B56559a83700c7164A16391C8927Q5428P2817J76581h5382A37734J0597Q2096
$$ 256559 -183700 -37164 116391 38927 124355 197172 373753 -85382 137734 148331 230427
12225B30427I2695M33162A41397f4029A54125G6068M32402o351p8563a03115N1363
$$ 230427 92695 525857 141397 -64029 154125 76068 508470 502119 423556 -103115 -51752
12214e1752j01197e7567A90694M6284K4693p4666g4867D24486b26542A70354C9101
$$ -51752 -152949 -57567 190694 236978 261671 187005 -74867 424486 -226542 170354 39101
12202H897b33218A82685q9341A6611f2450R968A18731J561L9417k4676n2967K18269
$$ 8897 -233218 182685 93344 16611 -62450 -52482 118731 120292 159709 135033 82066 300335
12190C00335m2462A22212R6939d5188A65076L83263A44035a20013D10791H2146
$$ 300335 257873 122212 219151 -45188 165076 548339 144035 -120013 410791 82146
12179E28463a65503g0721B97287A02788J42272a7956j40518C75834g6262g337
$$ 528463 -165503 -70721 297287 102788 245060 -17956 -158474 375834 -76262 -7337
12168a60421A395K00729C7769M38287I1487e629G8621d2013j1163A43048a89784
$$ -160421 1395 202124 37769 476056 91487 -5629 78621 -42013 -53176 143048 -189784
12156E0035b91336a27605c2835B71692G0336a30368G7542J83676E5992P1932a32988
$$ 50035 -291336 -127605 -32835 271692 70336 -130368 77542 261218 55992 127924 -132988
12144d0476l8869I0707b11589A67467C4979b10003A58019b8779F7458i1829E19040
$$ -40476 -79345 90707 -211589 167467 34979 -210003 158019 -28779 67458 -91829 519040
12132G7738K02565A23165K92900j21567c0018I1239c4718E8704a9721D08653A47260
$$ 77738 280303 123165 416065 294498 -30018 91239 -34718 58704 -19721 408653 147260
12120a35011D05671I3485R3937a68772g4265n0494C53640d3423r808A98736B6930
$$ -135011 405671 93485 187422 -168772 -74265 -124759 353640 -43423 -53231 198736 26930
12108A77420D5149J7249c17948B08878B932P473R6000c23494A54777j5662a53686
$$ 177420 45149 62398 -317948 208878 2932 10405 106405 -323494 154777 139115 -153686
12096f3305l3770j61341R442L7480A70782a27545A20978A5477O3018P2200a2741
$$ -63305 -97075 -258416 -248974 -211494 170782 -127545 120978 15477 78495 150695 -12741
12084B22911n4781g1610q8079H300J49033I850f059k21872n5308A46550J22000
$$ 222911 168130 -71610 -159689 8300 157333 9850 -6059 -227931 -283239 146550 268550
12073B68550a54251G5405J52281b44628e5544D7617M65769H3095J92201E3037
$$ 268550 -154251 75405 227686 -244628 -55544 47617 513386 83095 275296 53037
12062c0399I8557l0918g6985n6219p5257C76722j13212R18718N56065n69388E77814
$$ -30399 98557 67639 -76985 -133204 -208461 376722 263510 1182228 1738293 1168905 577814
12050a44452F1684P1161o6331J09558b72648e8606D9184J13297F6485K3081m2076
$$ -144452 61684 132845 66514 176072 -272648 -58606 49184 162481 66485 89566 47490
12039D7490a49939C1891a71713F8805g1792H3299D0594a57885d0765G5497b2825
$$ 47490 -149939 31891 -171713 68805 -71792 83299 40594 -157885 -40765 75497 -22825
12027A87455h8189A01448c01048a12265d7637l84012K12884D692J05693Q6241
$$ 187455 -88189 101448 -301048 -112265 -47637 -431649 -218765 4692 110385 196626
12017A96626E2588a30059m9389A03537O0611O3868A09670J13286a34649j0288
$$ 196626 52588 -130059 -179448 103537 164148 228016 109670 222956 -134649 -144937
12007a44937o4476A41502N191E4287c01784E1787g5691H8028b50967r0544i98
$$ -144937 -209413 141502 146693 54287 -301784 51787 -75691 88028 -250967 -341511 -998
11995a95277O9077N8603j12176d9737C0588O6589a26957k681e7311A68276m1602
$$ -195277 -126200 -67597 -179773 -49737 30588 97177 -126957 -129638 -57311 168276 126674
11984A26674a69908q3558g3152E7566b20497A98441e05073d7755m42A54510c67194
$$ 126674 -169908 -253466 -73152 57566 -220497 198441 -505073 -47755 -48197 154510 -367194
11972g7934K979E0232R492e9050A87685H2678O0109a9993k82061A876K72448k5277
$$ -77934 -74955 50232 59724 -59050 187685 82678 142787 -19993 -302054 1876 274324 249047
11960B49047d7982j68626A79630b90453B56968p7930j6717p8711f8356E0734a73109
$$ 249047 -47982 -216608 179630 -290453 256968 179038 162321 83610 -68356 50734 -173109
11948A34667b81574C34581o8190B3111O2732l3228i6409d4206o5911m7531b2130
$$ 134667 -281574 334581 266391 23111 85843 52615 -96409 -44206 -110117 -157648 -22130
11936G0485c2500D3693c03801a17748A84624e2832k89675E6993g619B05139e2306
$$ 70485 -32500 43693 -303801 -117748 184624 -52832 -342507 56993 -7619 205139 -52306
11924a216I8490J16599b68637J18590o0294J01889q9143L4584E636J2561b2430
$$ -1216 98490 215089 -268637 -150047 -210341 -108452 -197595 -163011 5636 18197 -22430
11912b87641B14787n0763A1141a34357e7747k64548B10014g0014B37051J46258
$$ -287641 214787 164024 11141 -134357 -57747 -322295 210014 -70014 237051 383309
11902C83309f4520E3680P8521J4857g473l19004f697k33344J10092q3831A88261
$$ 383309 -64520 53680 132201 147058 -7473 -326477 -6697 -240041 -129949 -213780 188261
11890b60535R1522G3894d0248a2494p8556f219D370L3604g3630J7535B24599k3000
$$ -260535 -169013 73894 -40248 -12494 -91050 -6219 4370 37974 -73630 -56095 224599 201599
11878B01599D6730b51635a09332d0048k3926m56226G4891b6460j31224N6101F1190
$$ 201599 46730 -251635 -109332 -40048 -63974 -520200 74891 -26460 -157684 -101583 61190
11866A74985b1078j35090l8034Q5036A17835d34431d0253n2764M3688j5845G0132
$$ 174985 -21078 -156168 -194202 -109166 117835 -434431 -40253 -93017 -49329 -65174 70132
11854c4852j37116A05967a95172k4954O9017A25664b93233A68902J01761a72133
$$ -34852 -171968 105967 -195172 -220126 -151109 125664 -293233 168902 270663 -172133
11843a34750o620f2645j30690o8991A7976K27883A00536L16030B4348d7391F1915
$$ -134750 -141370 -62645 -193335 -262326 17976 245859 100536 416566 24348 -47391 61915
11831B9904i08j38841A88209r1147l5201g49A56941J13882B7756g3790A7278c1886
$$ 29904 -908 -139749 188209 97062 61861 -749 156941 270823 27756 -73790 17278 -31886
11818A70616A5387h2477j63524C77483d4550j79276B16165i9327D0078a3847E73
$$ 170616 15387 -82477 -246001 377483 -44550 -223826 216165 -99327 40078 -13847 573
11806A13744b35042A02532K29083C6747a15996L7613k2024g810F8302b37287g5227
$$ 113744 -235042 102532 331615 36747 -115996 -78383 -100407 -7810 68302 -237287 -75227
11794a06949q0628E6264L5048a01960C8019a058D99h830A21471J36328n4524l3746
$$ -106949 -187577 56264 91312 -101960 38019 -1058 499 -8830 121471 257799 203275 169529
11782A69529J16708b53248e6157k5402k32774F6155K19286b62561d6597B80899
$$ 169529 286237 -253248 -56157 -81559 -314333 66155 285441 -262561 -46597 280899
11771a78439J9805D2721a60099A08437b25066P0399B29420A0091f6161C3963b21429
$$ -178439 -158634 42721 -160099 108437 -225066 -154667 229420 10091 -66161 33963 -221429
11759C3548J1942K62623a11322N3579A26863b46539R5649E4421j6665b07108h7653
$$ 33548 45490 308113 -111322 -57743 126863 -246539 -150890 54421 37756 -207108 -87653
11747f2523C85881a44263A28970b6002F6369h3365F3710a29552A44551a15304
$$ -62523 385881 -144263 128970 -26002 66369 -83365 63710 -129552 144551 -115304
11736B4034a97413q7417b0058l85140g2526B55614K2137i0515j07996g0805M897
$$ 24034 -197413 -284830 -20058 -405198 -72526 255614 277751 -90515 -198511 -70805 -65908
11725f5908B77952A21149D90O7039J26032a12162A41173j4024l2824b12828c7215
$$ -65908 277952 121149 490 67529 193561 -112162 141173 127149 94325 -212828 -37215
11713A42140B4997L0243R5578o3030J04717K24485j20860n2818A19675C8673d9558
$$ 142140 24997 55240 150818 87788 192505 416990 296130 243312 119675 38673 -49558
11701a79650Q301A09804l9863P4759n114m8132J579j2309J1465K0877a36064A9133
$$ -179650 -171349 109804 69941 144700 139586 91454 93033 80724 92189 113066 -136064 19133
11688i4536C04629j33237a5277j73874C28061b79465A4713P0273l0728J17157
$$ -94536 304629 171392 -15277 -189151 328061 -279465 14713 84986 54258 171415
11678A71415a24664C16251j00053c07781H914h5703E02479e8725k46490B11820
$$ 171415 -124664 316251 216198 -307781 8914 -85703 502479 -58725 -305215 211820
11667a08936L5875A2143O863J66454J09162q4211J45308A55821J5596N0252c3080
$$ -108936 -73061 12143 19006 185460 294622 210411 355719 155821 171417 221669 -33080
11655A64852N8347m4224o1590b70338o2341A51474E348J34241a53472a4414B33676
$$ 164852 223199 178975 117385 -270338 -332679 151474 5348 139589 -153472 -14414 233676
11643a87593A37015b94711C8769j1472b30616c359l48918A079f7048A7997d464
$$ -187593 137015 -294711 38769 27297 -230616 -3359 -352277 1079 -67048 17997 -4464
11631e1796A02726J19607a40664D8762h8839B74730G8982i1853j61325a04497
$$ -51796 102726 222333 -140664 48762 -88839 274730 78982 -91853 -253178 -104497
11620A76317F9464a65692A58952R9143c63281j14773K28545K6603d045A30117
$$ 176317 69464 -165692 158952 258095 -363281 -478054 -249509 -222906 -4045 130117
11609g420A37797c17998J07464D2436d3768J1893B4174a24218F8424b96683D40328
$$ -7420 137797 -317998 -210534 42436 -43768 -31875 24174 -124218 68424 -296683 440328
11597a15316B61961H4567R1502e0263E5922f7824B01603g9277A72422g0539B76396
$$ -115316 261961 84567 176069 -50263 55922 -67824 201603 -79277 172422 -70539 276396
11585A46486J6636o5742Q7053b1284H327a29949A75012b5664A47593J08074b50699
$$ 146486 163122 97380 184433 -21284 8327 -129949 175012 -25664 147593 255667 -250699
11573B0154c561n0314A45339J02721d6120j2859j7823B0699K23134i2497c1668
$$ 20154 -3561 -53875 145339 248060 -46120 -58979 -76802 20699 243833 -92497 -31668
11561a19967B96840J21722a5123H8966R2431J08039b6369A79472a55328A1578
$$ -119967 296840 418562 -15123 88966 181397 289436 -26369 179472 -155328 11578
11550h0831K0784C3017n701P1899b02530B15421o4791J47439j05751A5605L13495
$$ -80831 -60047 33017 27316 99215 -202530 215421 150630 298069 192318 15605 329100
11539C29100D7883J00212J68865B4245K17077E260N0249a5823A05772N2019F7621
$$ 329100 47883 148095 316960 24245 241322 5260 55509 -15823 105772 157791 67621
11527B18115B5398b2088C37683k0631h4294b0427j22387B14082I3192A6115e7044
$$ 218115 25398 -22088 337683 317052 -84294 -20427 -142814 214082 93192 16115 -57044
11515C5476K92746i216D11057b0205A36314B3638N36644a3191E08954C3400F010
$$ 35476 328222 -9216 411057 -20205 136314 23638 560282 -13191 508954 33400 6010
11503A23089f7699A34461i509B92380j23020G409O5599J49816A02460M06939f239
$$ 123089 -67699 134461 -9509 292380 169360 7409 73008 222824 102460 509399 -6239
11491C30517l0078k6518j13271J83262H3349a49442k3008C03669L7205j16737
$$ 330517 300439 273921 160650 343912 83349 -149442 -172450 303669 340874 224137
11481B24137J15544b9613B3612K72152N8834I3320P5899D3927K600e1988C42409
$$ 224137 339681 -29613 23612 295764 354598 93320 169219 43927 46527 -51988 342409
11469a07075a7082j22128A21723g7469C62668A4126M73587H7119a75891B16316
$$ -107075 -17082 -139210 121723 -77469 362668 14126 487713 87119 -175891 216316
11458a46575B82567p1361J19827j35389a29025B58205J71303H8531P8288f9114
$$ -146575 282567 211206 331033 195644 -129025 258205 429508 88531 166819 -69114
11447A68993L00048B11181H381K12640m2686J822E5611J63976i9033A65378J94360
$$ 168993 469041 211181 8381 221021 178335 180157 55611 219587 -99033 165378 359738
11436C59738B8484O0076B8291b92011H2379B7614j478b7396j37172B69698G0825
$$ 359738 28484 88560 28291 -292011 82379 27614 26136 -27396 -164568 269698 70825
11424a0750A28303A1326b3659B35941b44008a09809j68603e4578J2148A04377
$$ -10750 128303 11326 -23659 235941 -244008 -109809 -278412 -54578 -42430 104377
11413A23035d7162q315D1843b8183A56925J04439R2306G0479K36680H0831b1587
$$ 123035 -47162 -55477 41843 -28183 156925 261364 353670 70479 307159 80831 -21587
11401B1477N3883K42830j20120J42129A31823a5017p9875A97801b12807B66839
$$ 21477 75360 318190 198070 340199 131823 -15017 -94892 197801 -212807 266839
11390A33856a94407A79610d8205B44568b78406a24386A4600e4461n15233a48883
$$ 133856 -194407 179610 -48205 244568 -278406 -124386 14600 -54461 -569694 -148883
11379B8151J54414o61m5991g7189A90203k0392G5806K12036J29726B3345b1468
$$ 28151 182565 181904 135913 -77189 190203 169811 75806 287842 417568 23345 -21468
11367e5823C2557a49404J4612j259F6616i1626A921a20070A58161e6863A83480
$$ -55823 32557 -149404 -134792 -136051 66616 -91626 1921 -120070 158161 -56863 183480
11355b11770h4889j79336a07273A4818i6327N133A33737a2400H8559a7543A61597
$$ -211770 -84889 -264225 -107273 14818 -96327 -91194 133737 -12400 88559 -17543 161597
11343i2306A08030K21331b2449j00138A30250b58350D6304J53648a40884k04186
$$ -92306 108030 329361 -22449 -122587 130250 -258350 46304 199952 -140884 -345070
11333c45070J16182j16310C77644a09290D5598e8029k20668c4570p0822D3764
$$ -345070 -228888 -345198 377644 -109290 45598 -58029 -278697 -34570 -105392 43764
11322b64792J00670M8618c4418B9343N159a12317c4745a1331B3813R935J54568
$$ -264792 -164122 -115504 -34418 29343 34502 -112317 -34745 -11331 23813 33748 188316
11311A88316R5779i695j50810a4777A9684a68339L0409m6490i0555J3919K3266
$$ 188316 284095 -9695 -160505 -14777 19684 -168339 -137930 -184420 -90555 -76636 -53370
11300e3370A24117a34849o5231R5916j92399D4151a97675e099l34215j265J59298
$$ -53370 124117 -134849 -200080 -104164 -296563 44151 -197675 -5099 -339314 -340579 -181281
11289a81281A89797b17242N207B7323a08865C01322H4690J19437q3153K21813
$$ -181281 189797 -217242 -212035 27323 -108865 301322 84690 204127 120974 342787
11279C42787a14588B4329a75003b5990D6395g7229A7924a57917A68934b70219
$$ 342787 -114588 24329 -175003 -25990 46395 -77229 17924 -157917 168934 -270219
11268c15356K5484A51493c5193o4884q5885A0197b51131A72179p8240Q8957e3326
$$ -315356 -289872 151493 -35193 -100077 -185962 10197 -251131 172179 93939 182896 -53326
11256b47802B18389b59528A2643a16567c5218A13311A8902R085a54180J3051G0196
$$ -247802 218389 -259528 12643 -116567 -35218 113311 18902 27987 -154180 -141129 70196
11244a16261J9815L4722F1898b87034l64304a25155L0269b7556E6265a77931F7837
$$ -116261 -96446 -61724 61898 -287034 -651338 -125155 -94886 -27556 56265 -177931 67837
11232C07057G3593b5910q3759l9827A44164a93649j79220J66117B18007G9140
$$ 307057 73593 -25910 -109669 -149496 144164 -193649 -372869 -206752 218007 79140
11221a64392c4813q4968A77138d5026C06626a8021l9065J9557d68j43292J4955
$$ -164392 -34813 -119781 177138 -45026 306626 -18021 -57086 -37529 -468 -143760 -128805
11210a28805n5324g8200B11386a01775d4505q4944B46285b75335I9342L84430
$$ -128805 -184129 -78200 211386 -101775 -44505 -129449 246285 -275335 99342 483772
11200D83772f26768a57749B67158E7754c3851H6121K47102a76699g0038q9388
$$ 483772 -626768 -157749 267158 57754 -33851 86121 333223 -176699 -70038 -159426
11190a59426D70418a76898c4992C8588q23g0202D1629N6724c27641G6763i3507
$$ -159426 470418 -176898 -34992 38588 37765 -70202 41629 98353 -327641 76763 -93507
11178a9313l58016b6728P980j37691A32369a63547I0802b70135A72330H3647J03183
$$ -19313 -377329 -26728 -18748 -156439 132369 -163547 90802 -270135 172330 83647 186830
11167A86830A6287R6201h4934o1485k3755g1803B2280J48582M4712b7844B74334
$$ 186830 16287 112488 -84934 -146419 -170174 -71803 22280 170862 215574 -27844 274334
11155B24844I7088a49090G6362g9317b6850A73636J8281o912G9994a60480B68276
$$ 224844 97088 -149090 76362 -79317 -26850 173636 191917 185005 79994 -160480 268276
11143B24566C564K26788b5699C1599a98508C68482A13371d6838B52187g9009A37340
$$ 224566 3564 230352 -25699 31599 -198508 368482 113371 -46838 252187 -79009 137340
11131b15424A84583j5928K13341A72890q716f5770C95442j16888H3262E872Q1423
$$ -215424 184583 168655 381996 172890 164174 -65770 395442 278554 83262 5872 87295
11120H7295c2334G5185a26042B77427j9801n1611D2039K97047b0898A64735n4683
$$ 87295 -32334 75185 -126042 277427 257626 206015 42039 339086 -20898 164735 110052
11109A10052P3615J8770l7052K87009e9206K0771A09736Q887m5471a01497B48946
$$ 110052 183667 202437 165385 452394 -59206 -38435 109736 118623 73152 -101497 248946
11097C05174a14633F9212K17435o9275M0543p4879o1875L7718J24459K23959k8142
$$ 305174 -114633 69212 286647 217372 257915 183036 121161 158879 283338 507297 479155
11086D79155A21415K2061n6115i467C25083q6929J01510R7111r9511G5824P7875
$$ 479155 121415 143476 87361 -9467 325083 238154 339664 436775 337264 75824 153699
11075A53699L73503A51163K38059f6529E67181P5686B94038P3879M2559O3110
$$ 153699 527202 151163 389222 -66529 567181 642867 294038 367917 410476 473586
11065D73586J30552j60829m0997K73920O064K39770j84672k20408P6797J11446
$$ 473586 604138 443309 402312 676232 682296 922066 737394 516986 593783 705229
11055G05229m4817N5937K64960j32183N5223D02332M48699k20125m1340R8281
$$ 705229 660412 716349 981309 849126 904349 402332 851031 630906 589566 687847
11045F87847Q7682k37713M96560l02209l9373j10725q2707L60754j11078J4126
$$ 687847 775529 537816 1034376 732167 692794 582069 499362 860116 749038 763164
11035G63164l0498K62684m59173M35148l69885J95761m2412r2479P0023k9031
$$ 763164 732666 995350 536177 971325 601440 797201 754789 662310 732333 703302
11025G03302m9828K37180k0584k36376j10368L01693k50744k49554L50993j59120
$$ 703302 653474 890654 870070 633694 523326 825019 574275 324721 675714 516594
11015E16594K70094q8643n969J85392m11709M04843k82053o0656B58932K54322
$$ 516594 786688 698045 692076 877468 465759 870602 588549 527893 258932 513254
11005E13254L84152C58837q9187L02432p1812L40742l25944K46087N6119J04457
$$ 513254 897406 358837 269650 572082 500270 841012 515068 761155 817274 921731
10995I21731k3937D37130J90932k6471J66490K78952k45102L43155k43044K07607
$$ 921731 897794 437130 628062 601591 768081 1047033 801931 1145086 902042 1109649
10985A109649J4016j19033J2874j52382O48913l0916P8300J27373p8006O03574
$$ 1109649 1123665 1004632 1017506 865124 1514037 1483121 1561421 1688794 1610788 2214362
10975B214362j66994M65081O02918m83420O28014j50171K63881l29082l83944
$$ 2214362 2047368 2512449 3115367 2631947 3259961 3109790 3373671 3044589 2660645
10966B660645k77049m48859l15308l5480L21213k69463L27394l71146J84171j253
$$ 2660645 2383596 1934737 1619429 1583949 1905162 1635699 1963093 1591947 1776118 1774865
10956A774865J72627k32388k19733k14073O7494n46176R9073k85883J3041k81868
$$ 1774865 1947492 1715104 1495371 1281298 1348792 802616 901689 615806 628847 346979
10946C46979P8607J07775l2326j33796j50773J6953E0444K18033K81043r5174
$$ 346979 425586 533361 501035 367239 216466 233419 50444 268477 549520 454346
10936D54346A30692J26194P1622F5372P9068J00805b26985Q4237D24636A69470
$$ 454346 130692 256886 328508 65372 144440 245245 -226985 -142748 424636 169470
10925c5475B86829n3026q9350F9901j2440K75385f142A72660p7167a65615A691
$$ -35475 286829 233803 144453 69901 57461 332846 -6142 172660 95493 -165615 1691
10913d661j35773A41730E3009g0478B94780j44123h7293f214D5433L5733J0721
$$ -4661 -140434 141730 53009 -70478 294780 150657 -87293 -6214 45433 81166 91887
10902I1887a10566B12453b10608I6105c13129J05409c8328E6236a96650a9600
$$ 91887 -110566 212453 -210608 96105 -313129 -207720 -38328 56236 -196650 -19600
10891e346j31352m5777G8844Q4219f7389b4420j00807I7402C8522a72078j2002
$$ -5346 -136698 -182475 78844 163063 -67389 -24420 -125227 97402 38522 -172078 -184080
10880a84080P6959A67694K10480b87028a22435p664G450g3467A4012a91721h8609
$$ -184080 -107121 167694 378174 -287028 -122435 -130099 7450 -73467 14012 -191721 -88609
10868d0552j0180A33506a52275b4919A68644e9764l6647A14679E649a6721D5291
$$ -40552 -50732 133506 -152275 -24919 168644 -59764 -96411 114679 5649 -16721 45291
10856i6786C6725J58019D3726J6786J5747a6554f126j6691l8345D3493J61581
$$ -96786 36725 194744 43726 60512 76259 -16554 -6126 -22817 -61162 43493 205074
10845B05074a96391e4411A82364f1671j15195d6408j00513o3905A50262i478A82173
$$ 205074 -196391 -54411 182364 -61671 -176866 -46408 -146921 -210826 150262 -9478 182173
10833C6739a05286A10005J67148a94025N8731A47560a26284m8968m7128A93868
$$ 36739 -105286 110005 277153 -194025 -135294 147560 -126284 -175252 -222380 193868
10822A97270O9487e6816B7487e9601a8451p9552m3716F094J9897A398M1967f9235
$$ 197270 266757 -56816 27487 -59601 -18451 -98003 -141719 6094 25991 1398 43365 -69235
10809c56911i7814D6863b05746H9284Q4338h6445E2311b11959k46320b16778C69845
$$ -356911 -97814 46863 -205746 89284 173622 -86445 52311 -211959 -458279 -216778 369845
10797A17706K0712g6178k4727k98515F3809g2908c1536m3372r1342f3144A40157
$$ 117706 138418 -76178 -100905 -399420 63809 -72908 -31536 -74908 -166250 -63144 140157
10785a83365N6516A31466i2204B00595O5950l3805b39932A3087L20024a31808
$$ -183365 -126849 131466 -92204 200595 266545 232740 -239932 13087 333111 -131808
10774b0597j1935A20340a40899B89512A11201R8979m6774L6872d10460a84804
$$ -20597 -32532 120340 -140899 289512 111201 210180 163406 200278 -410460 -184804
10763h5618k1337l7341B1567M5550c20513O0492B37914A12436k8575b65811d8132
$$ -85618 -106955 -144296 21567 67117 -320513 -260021 237914 112436 83861 -265811 -48132
10751a96758A65039a16565d3262j59171A50920C6423c0348q3779C3718J38000
$$ -196758 165039 -116565 -43262 -202433 150920 36423 -30348 -114127 33718 171718
10741A71718R6478b5l24082c4919k43457A09165i7636L2560l24788a55780B20936
$$ 171718 268196 -25 -324107 -34919 -278376 109165 -97636 -65076 -389864 -155780 220936
10729a78369C65235b44704q9423B0049O3118a39528k0503k66305A50921h4995
$$ -178369 365235 -244704 -334127 20049 83167 -139528 -160031 -426336 150921 -84995
10718h6356k06301A24386a69277B55610d5855C5128L8019e12713A84982m0402
$$ -86356 -292657 124386 -169277 255610 -45855 35128 73147 -512713 184982 144580
10708A44580h9151r8196j95933h3306j36842h548k28789h9630B5728b25399A32494
$$ 144580 -89151 -187347 -383280 -83306 -220148 -8548 -237337 -89630 25728 -225399 132494
10696A98085c69726C95143c5487A02509a99883q82A83469o7485d0264A73957b03433
$$ 198085 -369726 395143 -35487 102509 -199883 -200765 183469 115984 -40264 173957 -203433
10684a19645m5939d4525j34214C34604L8342d853k16159A75941g4750j29517c6585
$$ -119645 -165584 -44525 -178739 334604 372946 -4853 -221012 175941 -74750 -204267 -36585
10672a55946B2231L3541c6192d018j40798n314O8853E8642i7436B60395d23233
$$ -155946 22231 55772 -36192 -4018 -144816 -150130 -81277 58642 -97436 260395 -423233
10660H1050c68508B80194c9174j15511A50377c67168G5449K10263c758j79495
$$ 81050 -368508 280194 -39174 -154685 150377 -367168 75449 285712 -3758 -183253
10650a83253B3149a39442l14305b16636O4028k4591D6429J35397D6676a09167
$$ -183253 23149 -139442 -453747 -216636 -152608 -177199 46429 181826 46676 -109167
10639a06327A18589K1979c98140f4615k09039a328m19989h9894j59775B49353
$$ -106327 118589 140568 -398140 -64615 -273654 -1328 -421317 -89894 -249669 249353
10628b68440D9184b27691B88920a1134j31044j17770J27839L5898j81282A68461
$$ -268440 49184 -227691 288920 -11134 -142178 -259948 -132109 -96211 -277493 168461
10617a71907K7634e2207F8126C106N8081j810b40059A71555a33167k47265h3842
$$ -171907 -144273 -52207 68126 3106 61187 59377 -240059 171555 -133167 -380432 -83842
10605D9080J37677b97799b7308j48652N8425C5825a43233k01295B647P1740J70780
$$ 49080 186757 -297799 -27308 -175960 -117535 35825 -143233 -344528 2647 74387 245167
10594B45167j08368D645e7831k894j08757j26706j79505a54416B33535c4900P718
$$ 245167 136799 4645 -57831 -60725 -169482 -296188 -475693 -154416 233535 -34900 -27182
10583b7182j03629B2304a94894e2800j65411B14027b80954J23444e0408r4053
$$ -27182 -130811 22304 -194894 -52800 -218211 214027 -280954 -157510 -50408 -144461
10573a44461j55477g5144r6258N8179H9343a0423I150K2236J64411N2022M0665
$$ -144461 -299938 -75144 -171402 -113223 89343 -10423 9150 31386 195797 247819 288484
10562B88484b56541d5890j77124M6547f7707B34909b07341F9347d18616J91649
$$ 288484 -256541 -45890 -223014 -176467 -67707 234909 -207341 69347 -418616 -226967
10552b26967D765b01209A536a01668M4400C84198a61377k76724a97763m4697A6540
$$ -226967 4765 -201209 1536 -101668 -57268 384198 -161377 -438101 -197763 -242460 16540
10540C88987A25856d11110A89284l7129b05271j64762J55210D8878a14587j4372
$$ 388987 125856 -411110 189284 152155 -205271 -370033 -214823 48878 -114587 -128959
10530a28959D3851b77676J26224j6738A16307h3586j06215I9431a21675D8155
$$ -128959 43851 -277676 -151452 -168190 116307 -83586 -189801 99431 -121675 48155
10519a35874A09513a92309j62570B16927a61562J0934B70660g3235k68345J41508
$$ -135874 109513 -192309 -354879 216927 -161562 -150628 270660 -73235 -341580 -200072
10509b00072C2954j5506b60653Q8647C6394i9894E7685M1069a01831l38114f399
$$ -200072 32954 17448 -260653 -172006 36394 -99894 57685 98754 -101831 -439945 -6399
10497b42266B19671r1791b5051A40658b7506k97849C86919b68741f7587E9278
$$ -242266 219671 127880 -25051 140658 -27506 -325355 386919 -268741 -67587 59278
10486c8321a48j29683C1098P0252L83221A15174M86507m9816k00937J34578j80965
$$ -38321 -148 -129831 31098 101350 484571 115174 601681 551865 350928 485506 304541
10475C04541A13687K07660b1182A63306J12185H4742C7367i817B30917c857B00123
$$ 304541 113687 321347 -21182 163306 275491 84742 37367 -9817 230917 -3857 200123
10463A34389K75073c06143a06081D4765g8579c5905N758B8209J9559A6531b7100
$$ 134389 409462 -306143 -106081 44765 -78579 -35905 -30147 28209 47768 16531 -27100
10451B31557b11321A43626o0995i582j10384m1489F04a15944A19469J81920a61370
$$ 231557 -211321 143626 82631 -9582 -119966 -161455 604 -115944 119469 301389 -161370
10439A363K6693d4850A3543J34571a02455A94721e0046r9908A34449C8485b6572
$$ 1363 28056 -44850 13543 148114 -102455 194721 -50046 -149954 134449 38485 -26572
10427D05666j73152k0855c4478E8959D812i0126k8487j63578C16113J6987b0652
$$ 405666 232514 211659 -34478 58959 4812 -90126 -118613 -282191 316113 333100 -20652
10415A99770p9009c98929N9646C83001j16674F6737a47928I0178d9667K0217H144
$$ 199770 120761 -398929 -339283 383001 266327 66737 -147928 90178 -49667 -29450 8144
10403c6372C6159a30852E3813b2213n930A13365D6372J12736L38458C3235L95615
$$ -36372 36159 -130852 53813 -22213 -28143 113365 46372 159108 497566 33235 428850
10392D28850E0003O0506J01688q7428J3532J2028m6946R884b09290C06931A6042
$$ 428850 50003 110509 212197 124769 138301 150329 103383 113267 -209290 306931 16042
10380E2416K23J15999K22725J48912B28489M8711i6591D54630k24074J2764o7066
$$ 52416 52639 168638 391363 540275 228489 277200 -96591 454630 230556 243320 176254
10369A76254M31327l7003O2360q5106J03358B3653J47171J09973g374C66831A00707
$$ 176254 607581 570578 632938 547832 651190 23653 170824 280797 -7374 366831 100707
10357D41230l2323F2894Q2750J98674A11752M14633j14202O48014B38232n7435
$$ 441230 408907 62894 145644 344318 111752 526385 412183 1060197 238232 180797
10347A80797K19521K28254j66286o3029J49230J44433B60344q7275K65148j03661
$$ 180797 400318 628572 462286 399257 548487 692920 260344 173069 438217 334556
10337C34556o5932A29087J3478K88813a22023A94266N0301D0495J24748O2684
$$ 334556 268624 129087 142565 431378 -122023 194266 244567 40495 165243 227927
10327B27927j6205J03051g0547J9527A58072a78307C81783K19732A46603B6601
$$ 227927 211722 314773 -70547 -51020 158072 -178307 381783 601515 146603 26601
10316h4613j8303H6913c9464G0195f758B01114K304i0153j55683C2205P3534f9878
$$ -84613 -102916 86913 -39464 70195 -6758 201114 203418 -90153 -245836 32205 105739 -69878
10303i7455A59936D0074j7230O6586L22404A18362b32561j6726A69770a67275
$$ -97455 159936 40074 22844 89430 411834 118362 -232561 -249287 169770 -167275
10292h5000j61454R3399c0866j5533J9716C8597a09698L4305A28444e7267B87387
$$ -85000 -246454 -153055 -30866 -46399 -26683 38597 -109698 -75393 128444 -57267 287387
10280a81463E4674J0300d5325l23071J66053O446i7062A72339F1795a85712A46336
$$ -181463 54674 64974 -45325 -368396 -202343 -195897 -97062 172339 61795 -185712 146336
10268B58213c11493D9337c67038G690J38323D2186a80636D19559l4452A58480
$$ 258213 -311493 49337 -367038 7690 146013 42186 -180636 419559 385107 158480
10257a96570A66510L24877k15892c6192j87384e7031B07450B6703a66290L7263
$$ -196570 166510 491387 275495 -36192 -223576 -57031 207450 26703 -166290 -129027
10247a29027r0736I9299l0717b29410J03999k9176b3503A32178a18321A32964
$$ -129027 -219763 99299 68582 -229410 -125411 -154587 -23503 132178 -118321 132964
10236f1595j34504D1622J38242c84255B5745a02768k30819J58642j82320E7423
$$ -61595 -196099 41622 179864 -384255 25745 -102768 -333587 -174945 -357265 57423
10225A58121m6033K14648g1673G5298c0469j17851c7728l93257I8288O6310E5998
$$ 158121 112088 326736 -71673 75298 -30469 -148320 -37728 -430985 98288 164598 55998
10213g9422k6644k2298n74869d2921p1319j25439h9646C71950A27667a80967o1705
$$ -79422 -106066 -128364 -703233 -42921 -114240 -239679 -89646 371950 127667 -180967 -242672
10202b42672J13947j6684E519Q5659k5865k9090q567N0126P1686f5787J5741r9626
$$ -242672 -128725 -145409 5519 91178 65313 36223 27656 77782 149468 -65787 -50046 -149672
10190a49672B0940b54710A0288c63565H8339a53375e4233C28419a67245P5873
$$ -149672 20940 -254710 10288 -363565 88339 -153375 -54233 328419 -167245 -91372
10180i1372I9318a38646H457c27912O5105A71151p9294e6917C3365h4508A45087
$$ -91372 99318 -138646 8457 -327912 -262807 171151 91857 -56917 33365 -84508 145087
10168b30864R2621D37700j39262a74547h4095j87451C897K4114a39148B3958f1539
$$ -230864 -138243 437700 298438 -174547 -84095 -271546 3897 28011 -139148 23958 -61539
10156A49904a40480m60696a1980F5410a15217m012F2115b51472B55261d2175k07597
$$ 149904 -140480 -601176 -11980 65410 -115217 -119229 62115 -251472 255261 -42175 -249772
10145b49772d3618A74090b3704A3985J36226b08457a0599B17636m2287P2226b26067
$$ -249772 -43618 174090 -23704 13985 150211 -208457 -10599 217636 175349 247575 -226067
10133A84586C4327a80338o9382I2153A5774a63424I7601K64148a56130a7587j81877
$$ 184586 34327 -180338 -249720 92153 15774 -163424 97601 361749 -156130 -17587 -199464
10122a99464e9892C8803J0345b69448i7803L5727l8246o7741C0688b38660D297
$$ -199464 -59892 38803 49148 -269448 -97803 -62076 -100322 -168063 30688 -238660 4297
10110a18140l1470j4745I4380a69666e0899B5348a29171A64249h0304m7384o8141
$$ -118140 -149610 -164355 94380 -169666 -50899 25348 -129171 164249 -80304 -127688 -195829
10099a95829R5597b9098A8336a36313a8298k08445A05752b23787p0067A45109
$$ -195829 -100232 -29098 18336 -136313 -18298 -226743 105752 -223787 -293854 145109
10088B02758B2678i4040r8444d1530D0883L8643L6443a54421A6446L4476P9914
$$ 202758 22678 -94040 -192484 -41530 40883 79526 115969 -154421 16446 50922 130836
10077A30836d32854g6661D2169b18341E4201f3195j65998c5808o6133C17243a57969
$$ 130836 -432854 -76661 42169 -218341 54201 -63195 -229193 -35808 -101941 317243 -157969
10065a02389B72953b79835J11184A59417E5626d4452k8401p2154f6102m4581l02674
$$ -102389 272953 -279835 -168651 159417 55626 -44452 -72853 -145007 -66102 -110683 -413357
10054d13357A05229c549A32517E2046a0375a422j60479A35937l2225p964a65610
$$ -413357 105229 -3549 132517 52046 -10375 -1422 -161901 135937 103712 95748 -165610
10042B455K6763b464j21141A5800L35563c85714k44139A4512J34332d47806a03854
$$ 2455 29218 -2464 -123605 15800 351363 -385714 -629853 14512 148844 -447806 -103854
10030b05056A12205a25642m72866a44279r7881P8155A9183L5862J65751H6925
$$ -205056 112205 -125642 -598508 -144279 -242160 -164005 19183 55045 220796 86925
10019G684i162j29199C5285b48134H6094b13978A16624c29186a26706p3011M8046
$$ 7684 -9162 -138361 35285 -248134 86094 -213978 116624 -329186 -126706 -199717 -151671
10008a51671A71145K2263f3832J5890r7677l35073b1068j26277B35057b04495
$$ -151671 171145 193408 -63832 -47942 -145619 -480692 -21068 -147345 235057 -204495
9997C4237K6024d3831G671B593d5804D8908M072c95942h9699j7338N0419B40722
$$ 34237 60261 -43831 7671 2593 -45804 48908 52980 -395942 -89699 -107037 -56618 240722
9984a19239L0904d36F2686a84112k99235K8566a12156A36129D7056d218H7563
$$ -119239 -88335 -436 62686 -184112 -483347 -454781 -112156 136129 47056 -4218 87563
9972c7236q0024o3342L3166R769q9836Q9857M1946A55235b05381G7136b41270
$$ -37236 -117260 -180602 -147436 -137667 -227503 -137646 -95700 155235 -205381 77136 -241270
9960c4439A93046M0055a57980E9002b04213f2642G5959F162c89723E8909b84265
$$ -34439 193046 233101 -157980 59002 -204213 -62642 75959 6162 -389723 58909 -284265
9948A93391h6344G1108K0727a63185A03902h2975F9914a04032M7732j31912e8416
$$ 193391 -86344 71108 91835 -163185 103902 -82975 69914 -104032 -56300 -188212 -58416
9936a88784k22474d8557j36818C02412C1056a65476O0845j58647q7722h0031q2
$$ -188784 -411258 -48557 -185375 302412 31056 -165476 -104631 -263278 -351000 -80031 -80113
9925h0113c6345A41728a20387m04351C1792L1065C457J2073o073N6967Q1524c95098
$$ -80113 -36345 141728 -120387 -524738 31792 62857 3457 15530 9457 66424 147948 -395098
9912D8435c67759a63822P7468m1823B0822A0229a1716k0961j90651d2519j15873
$$ 48435 -367759 -163822 -86354 -128177 20822 10229 -11716 -32677 -223328 -42519 -158392
9901a58392m0029I2869d229j0108k10998b6836a1877k35662g0180j89481A08214
$$ -158392 -198421 92869 -4229 -14337 -225335 -26836 -11877 -247539 -70180 -259661 108214
9889g5124j28431A04337A0104b71800J00832N7544f97A12972b69153j9151J37312
$$ -75124 -203555 104337 10104 -271800 -170968 -113424 -697 112972 -269153 -288304 -150992
9878a50992k02711a39455g77A71158D7198a58679j12874a19759n7254k4986g2297
$$ -150992 -353703 -139455 -777 171158 47198 -158679 -271553 -119759 -177013 -201999 -72297
9866a64933j10353a12683k13162i9964o1930A72304A2941O9210P4588a79374A1106
$$ -164933 -275286 -112683 -325845 -99964 -161894 172304 12941 82151 156739 -179374 11106
9854b28896j14132A8132J30479a979j7269k32152d2948k5250k23700M8505P2169
$$ -228896 -343028 18132 148611 -1979 -19248 -251400 -42948 -68198 -291898 -243393 -171224
9843a71224o9068J13132j22438e7325B34153d1719D7536b15967Q4333Q472K7271
$$ -171224 -240292 -127160 -249598 -57325 234153 -41719 47536 -215967 -131634 -123162 -95891
9832i5891j57220J26365C08503e3419a8877l63173e747j82260k05815A80861a3547
$$ -95891 -253111 -126746 308503 -53419 -18877 -382050 -5747 -188007 -393822 180861 -13547
9820C09071a81510A88367a69526C8780c85940e4307j14717B21443b96774e3870
$$ 309071 -181510 188367 -169526 38780 -385940 -54307 -169024 221443 -296774 -53870
9809A69788o0223k2822a77979d8131C9816J07006o3775l4244e5468k18493H6107
$$ 169788 109565 86743 -177979 -48131 39816 146822 83047 48803 -55468 -273961 86107
9797b20685P9334o4472h7419m2946F1683f482A33529h4423K9164j62111l53246
$$ -220685 -141351 -205823 -87419 -130365 61683 -6482 133529 -84423 -55259 -217370 -570616
9786e70616K41131R2622I0719c74581B707L7032d9803r0853I6365J17731j2644
$$ -570616 -329485 -236863 90719 -374581 2707 39739 -49803 -140656 96365 214096 201452
9775B01452r7179i1628B07098g4528j51642g2435B07309b58493b1415C53607b98239
$$ 201452 104273 -91628 207098 -74528 -226170 -72435 207309 -258493 -21415 353607 -298239
9763A27275f6170A06071k2994a11453f10o8647p5285a698m9633j53437f7087k4987
$$ 127275 -66170 106071 83077 -111453 -610 -69257 -144542 -1698 -51331 -204768 -67087 -92074
9751i2074k3335a4989m9474L1927j46295r2333j76764A30565b90669M993j6999
$$ -92074 -115409 -14989 -64463 -32536 -178831 -271164 -447928 130565 -290669 -285676 -302675
9740c02675d6426j11667A67986l9463B0374c3767j2073j11283k8052F8282a0740
$$ -302675 -46426 -158093 167986 128523 20374 -33767 -45840 -157123 -185175 68282 -10740
9728a03288K7002a2107G4525c05724N8496j72535Q2165J11355A21582a6479A68210
$$ -103288 -76286 -12107 74525 -305724 -247228 -419763 -337598 -226243 121582 -16479 168210
9716C06534a61436B28602a00407B22615b48069B3571A0236J531b08185i6526C83408
$$ 306534 -161436 228602 -100407 222615 -248069 23571 10236 11767 -208185 -96526 383408
9704a34127l02989a1556j67569A10203I936a44506B6867b16237A35496d04423
$$ -134127 -437116 -11556 -179125 110203 9936 -144506 26867 -216237 135496 -404423
9693b1472k25352A11936a53449j68350A20511a82542A6845a59823A7965i3051
$$ -21472 -246824 111936 -153449 -321799 120511 -182542 16845 -159823 17965 -93051
9682b70427A40933a22524d0633n34211K13642a9242A6010g8366l8326a1108k2386
$$ -270427 140933 -122524 -40633 -574844 -361202 -19242 16010 -78366 -116692 -11108 -33494
9671c3494m8138L802b2845j30863E0442f8785A15472j5002i9807l9045B5443K46264
$$ -33494 -81632 -77830 -22845 -153708 50442 -68785 115472 100470 -99807 -138852 25443 271707
9659B71707G0701C5134a16560M3894l5325l5489a4998j87258G1244a79271Q6750
$$ 271707 70701 35134 -116560 -72666 -107991 -143480 -14998 -202256 71244 -179271 -92521
9648i2521c632j19471J0427G4600N208A6037a25088l45125i1236k1199p3531D03224
$$ -92521 -3632 -123103 -112676 74600 79808 16037 -125088 -470213 -91236 -112435 -185966 403224
9635A17957D6465j6576e4071A43955a48689J4178N2791m24467E0751a52222m920
$$ 117957 46465 29889 -54071 143955 -148689 -134511 -81720 -506187 50751 -152222 -157142
9624a57142g8258j03270N2790r700l17945b06152B61699a7008A07569i5312r0326
$$ -157142 -78258 -181528 -128738 -138438 -456383 -206152 261699 -17008 107569 -95312 -185638
9613a85638P1520c9351K682j34179C21212c29159J40218H6676a25324a0607k28512
$$ -185638 -114118 -39351 -36669 -170848 321212 -329159 -188941 86676 -125324 -10607 -239119
9602b39119j15447d9315f29H9989B071J49000m7386a20517B53927G639L1663N2817
$$ -239119 -354566 -49315 -629 89989 2071 151071 103685 -120517 253927 7639 39302 92119
9590I2119O0991a22635A39369a4995j64740I6289M7781a24363N5306j53880K4576
$$ 92119 153110 -122635 139369 -14995 -179735 96289 144070 -124363 -69057 -222937 -198361
9579a98361C52673a57407m5970B3477i794A7273B341a31541j159j1947c2791P797
$$ -198361 352673 -157407 -203377 23477 -9794 17273 2341 -131541 -132700 -144647 -32791 -24994
9567b4994R074B50743A19012e6093C01945c5423A3901R7729a54975o6613q578
$$ -24994 -15920 250743 119012 -56093 301945 -35423 13901 111630 -154975 -221588 -230166
9556b30166a0383k1792k7412k11259A1164L2796a9627r8222M9957I0697f2577
$$ -230166 -10383 -32175 -59587 -270846 11164 43960 -19627 -117849 -67892 90697 -62577
9544E6879i1788j53253L1469P8689B02887a63043a0456p64305b54220A49824c4663
$$ 56879 -91788 -245041 -213572 -134883 202887 -163043 -10456 -774761 -254220 149824 -34663
9532A38494a13473k43711J30539b1885m48461D6382a03080n7484C37530A2994
$$ 138494 -113473 -357184 -226645 -21885 -470346 46382 -103080 -160564 337530 12994
9521B49423f012k2226B3751g9825C0655L09467b52097a25174j9103L2112k12744
$$ 249423 -6012 -28238 23751 -79825 30655 340122 -252097 -125174 -144277 -112165 -324909
9510c24909N3528I3330K805b35627F1560d16989J83853M7454k6782N3715m9033
$$ -324909 -271381 93330 96135 -235627 61560 -416989 -233136 -185682 -212464 -158749 -207782
9499b07782c4349k09963C88850c91265a79939g9099b5729A2198J9305a73727n8770
$$ -207782 -34349 -244312 388850 -391265 -179939 -79099 -25729 12198 31503 -173727 -232497
9488b32497f4093a3790A83704D3278b06304O3670Q194l473I9888Q536f4207E443
$$ -232497 -64093 -13790 183704 43278 -206304 -142634 -134440 -137913 99888 108424 -64207 5443
9475g1975j36675R4748G8806b76879R4945J8330B13594c23129J57689j03588D1108
$$ -71975 -208650 -113902 78806 -276879 -181934 -163604 213594 -323129 -165440 -269028 41108
9463F8019K6405b95538j15503B8529d9897B80087d28818a35945j66670g5390k3187
$$ 68019 94424 -295538 -411041 28529 -49897 280087 -428818 -135945 -302615 -75390 -98577
9452i8577k16457J02909M7600r2685a18389j66218a14383N4257A29847m6655e3201
$$ -98577 -315034 -212125 -164525 -257210 -118389 -284607 -114383 -60126 129847 83192 -53201
9440c98967J41356o5068J56272A6637c61981c7788k31976B7747c88835H9127a8266
$$ -398967 -257611 -322679 -166407 16637 -361981 -37788 -269764 27747 -388835 89127 -18266
9428A18097a89040c3314B06865a03163h48B51219a96513A6883O3769P1992k3690
$$ 118097 -189040 -33314 206865 -103163 -848 251219 -196513 16883 80652 152644 128954
9417A28954c3876j76080I2380B6598d55897b15118Q8300c7487G0677b2652p1214
$$ 128954 -33876 -209956 92380 26598 -455897 -215118 -126818 -37487 70677 -22652 -93866
9406i3866B39674i7125o558b5851k99378j02364C0369i2779n2255A57889f8625
$$ -93866 239674 -97125 -103683 -25851 -325229 -427593 30369 -92779 -145034 157889 -68625
9394a64679m9710i3810p0014r3714H7693c38911D2029a14883E1374a53771F1675
$$ -164679 -214389 -93810 -163824 -257538 87693 -338911 42029 -114883 51374 -153771 61675
9382b31164A57324q707b55682A86384a53979G6108i9743a0341A99150k4524a17417
$$ -231164 157324 148617 -255682 186384 -153979 76108 -99743 -10341 199150 174626 -117417
9370i6190l8423b5531m497j02097c2246C21271d24100h4778G9010G140R4740a36298
$$ -96190 -134613 -25531 -30028 -132125 -32246 321271 -424100 -84778 79010 7140 101880 -136298
9357a07819F7554c8424E0409i610B56586H7216K37091b30560B9618b44784l722
$$ -107819 67554 -38424 50409 -9610 256586 87216 324307 -230560 29618 -244784 -248506
9346b48506a08145j67820D50360H6367a97023C6696c13055d9725j73242C0834
$$ -248506 -108145 -275965 450360 86367 -197023 36696 -313055 -49725 -222967 30834
9335g6316b8551J3305l36642i8292j70157i5899B0022J03949d79543A48651b7856
$$ -76316 -28551 -15246 -351888 -98292 -268449 -95899 20022 123971 -479543 148651 -27856
9323a24032K1368J528k09783a16616r1430P5109A85316b44809b8850A07328p952
$$ -124032 -102664 -101136 -310919 -116616 -208046 -132937 185316 -244809 -28850 107328 99376
9312I9376a60822A1314g3052l2769E6273r528f0781H3322c42238J56715M8284
$$ 99376 -160822 11314 -73052 -105821 56273 46745 -60781 83322 -342238 -185523 -137239
9301a37239r4598a00095j63817B41785c0760j73886p625D58325a92978g5700j08992
$$ -137239 -231837 -100095 -263912 241785 -30760 -204646 -212271 458325 -192978 -75700 -184692
9290a84692I1054E934J88759a77001L122e4364j39126j16902A10767P5513b96850
$$ -184692 91054 5934 194693 -177001 -173879 -54364 -193490 -310392 110767 186280 -296850
9278a78708n5954C57428d61474A61846c9233j3857p8817B4703f7218C19771a1339
$$ -178708 -234662 357428 -461474 161846 -39233 -53090 -131907 24703 -67218 319771 -11339
9266E9638i498n10587J34808B10664d7890k91266E11975a90751D0038M8179J4601
$$ 59638 -9498 -520085 -385277 210664 -47890 -339156 511975 -190751 40038 88217 102818
9255A02818a51014B1216a13294j13720A21174I004a23080M3380k7180B91219a33627
$$ 102818 -151014 21216 -113294 -227014 121174 9004 -123080 -79700 -106880 291219 -133627
9243b12184d1111A0395N0153a23417I8467f515k49776J13970E0923J62718a7835
$$ -212184 -41111 10395 60548 -123417 98467 -6515 -256291 -142321 50923 213641 -17835
9231B41901D2012a76760N0036a8687j45802k7977i3186K8515k064l4321H296a30633
$$ 241901 42012 -176760 -126724 -18687 -164489 -192466 -93186 -64671 -66735 -101056 8296 -130633
9218A50365m6226b62735i2486A31199J53434F6332R5936h1487A20725c9602a4107
$$ 150365 104139 -262735 -92486 131199 284633 66332 162268 -81487 120725 -39602 -14107
9206b78995j32820d8661j16986M5936b8192j31315j12270a01892P568A16420d29299
$$ -278995 -411815 -48661 -165647 -119711 -28192 -159507 -271777 -101892 -94324 116420 -429299
9194e5552K0701J6002f942B31375I4606b72280R9806B2409c93840f5774j399m95040
$$ -55552 -34851 -18849 -6942 231375 94606 -272280 -172474 22409 -393840 -65774 -67173 -562213
9182e62213A31996j8263C5986K5636J19522d8519k27938O5396M8585o4775a00062
$$ -562213 131996 113733 35986 61622 181144 -48519 -276457 -211061 -162476 -227251 -100062
9170b88499Q6158J2744k12567J81772C4139b79133h4432E7474K100R7332f2062
$$ -288499 -202341 -189597 -402164 -220392 34139 -279133 -84432 57474 59574 156906 -62062
9158I5450e7436k28907H320a88191B67644e8619q072j29177c0047j93114P8813
$$ 95450 -57436 -286343 8320 -188191 267644 -58619 -66691 -195868 -30047 -223161 -144348
9147a44348j3998i76j85857c7919A63067d63184a94900B01615e8058A52685b48482
$$ -144348 -158346 -976 -186833 -37919 163067 -463184 -194900 201615 -58058 152685 -248482
9135g3352a025A30350a17111D8251f9143A46542b25281J04921k45802C7587l588
$$ -73352 -1025 130350 -117111 48251 -69143 146542 -225281 -120360 -366162 37587 33999
9124C3999e32778h4508B20880G5665b02234j09419B4373O7877a92895l6993A949
$$ 33999 -532778 -84508 220880 75665 -202234 -311653 24373 92250 -192895 -229888 1949
9112g579I9855c6096a3011B34158c2227j02981o5839N9246j9290M1350l74997
$$ -7579 99855 -36096 -13011 234158 -32227 -135208 -201047 -141801 -161091 -119741 -494738
9101d94738I0868a87409G8163i6312B90625F0299e7323j26578n1441J6743H2762
$$ -494738 90868 -187409 78163 -96312 290625 60299 -57323 -183901 -235342 -218599 82762
9089B03197E5476i3350j42641B27951c9442j48979Q0515k0572J3883A00052b17822
$$ 203197 55476 -93350 -235991 227951 -39442 -188421 -107906 -128478 -114595 100052 -217822
9077e7673l1718C16316i4099A18194a01273l7483R844L588k688B01434m0767b18212
$$ -57673 -89391 316316 -94099 118194 -101273 -138756 -128912 -125324 -128012 201434 160667 -218212
9064C01779c69157a62452C6819h4111D6175O1959b5127o6536l048A00896k6568
$$ 301779 -369157 -162452 36819 -84111 46175 108134 -25127 -91663 -94711 100896 74328
9053G4328l4973c51057a58071N9976I5506e05973a84290M327h0540b2859A94042
$$ 74328 39355 -351057 -158071 -98095 95506 -505973 -184290 -179963 -80540 -22859 194042
9041B15131M1844j09677H328a21770A63167c58512A56309b04724n9447a20768
$$ 215131 256975 147298 8328 -121770 163167 -358512 156309 -204724 -264171 -120768
9030b35696a14250O996k22149l29103J31221A41872d254l68425B79743a65065
$$ -235696 -114250 -107254 -329403 -658506 -527285 141872 -4254 -372679 279743 -165065
9019h2866k14769R9137O5032j55040n1226n512f9684G5990J50633f3396B44678
$$ -82866 -297635 -198498 -133466 -288506 -339732 -345244 -69684 75990 226623 -63396 244678
9007b37819d5662h329H6346b58578G5178d71069b05772F6083q953d1270J466p5203
$$ -237819 -45662 -8329 86346 -258578 75178 -471069 -205772 66083 57130 -41270 -39804 -115007
8995a15007k3449B88379d20303n5917d0415A06892d88143b42288i82E10376d10765
$$ -115007 -138456 288379 -420303 -476220 -40415 106892 -488143 -242288 -982 510376 -410765
8983G1224k3441a80476C0310K15274f1602j57565d2181j41871b671A24872j1138
$$ 71224 47783 -180476 30310 245584 -61602 -219167 -42181 -184052 -2671 124872 113734
8972A13734d9829k04011E5145a19295B98848q3622b95875p064e5646k39638M9908
$$ 113734 -49829 -253840 55145 -119295 298848 215226 -295875 -302939 -55646 -295284 -245376
8961b45376k765D4709p794b2413L180j03953j93529A87199b64663C0108c24014
$$ -245376 -248141 44709 36915 -22413 -19233 -123186 -316715 187199 -264663 30108 -324014
8949b19933J02458D89986A45220J20988q5779a65165D5285a27174a4541k42383
$$ -219933 -117475 489986 145220 266208 180429 -165165 45285 -127174 -14541 -256924
8939b56924a24158k5492p7697E6791K84277A20906E4641O2782m1026K54245A27142
$$ -256924 -124158 -149650 -227347 56791 341068 120906 54641 117423 76397 330642 127142
8927E00027j79536M11977K73187R46333O082422Q977846m801889C648199A337994
$$ 500027 320491 732468 1005655 1951988 8034410 17012256 12210367 3648199 1337994
8917F20065l03702A57623F5988K9859l6400a14019A02531K56264K25215B11986
$$ 620065 316363 157623 65988 95847 59447 -114019 102531 358795 584010 211986
8906A81414i2036B72545d84448A39332g1583L37l1149A6096c67731J45620K32
$$ 181414 -92036 272545 -484448 139332 -71583 -71246 -102395 16096 -367731 -222111 -221879
8895b21879l7142A8040L6539a56007B6516K51096d90803A0375a69977C0853b02562
$$ -221879 -259021 18040 54579 -156007 26516 277612 -490803 10375 -169977 30853 -202562
8883a01895C54130d03553J58652K0195E8669b29620e2198B35519I1258b56379
$$ -101895 354130 -403553 -244901 -224706 58669 -229620 -52198 235519 91258 -256379
8872a42595B0371a36693m6007c9503j12534f6715D2327b28667k0311A8083e3075
$$ -142595 20371 -136693 -182700 -39503 -152037 -66715 42327 -228667 -248978 18083 -53075
8860a50058b2591j97552B17466p5504a5645I3748c09012O8992k06697I7179a7047
$$ -150058 -22591 -220143 217466 141962 -15645 93748 -309012 -240020 -446717 97179 -17047
$$ [...]
##END NTUPLES=NMR SPECTRUM
##END=
