##TITLE=AC1525_ROEFFECT0006_8202208_8TdhNIkwTJ
##JCAMPDX= 6.0         $$ Bruker NMR JCAMP-DX V2.0
##DATA TYPE= NMR SPECTRUM
##DATA CLASS= NTUPLES
##ORIGIN= BRUKER
##OWNER= Administrator
$$ 1.72 TOPSPIN		Version 2.1
$$ 2013-09-26 23:35:18.681 -0700  Administrator@X
$$ Compression mode = diff/dup
##.OBSERVE FREQUENCY= 400.02188249412
##.OBSERVE NUCLEUS= ^1H
##.ACQUISITION MODE= SIMULTANEOUS (DQD)
##.ACQUISITION SCHEME= undefined
##.AVERAGES= 64
##.DIGITISER RES= 22
##SPECTROMETER/DATA SYSTEM= spect
##.PULSE SEQUENCE= noesygpps1d.comp
##.SOLVENT NAME= COFFEE_meoh
##.SHIFT REFERENCE= INTERNAL, COFFEE_meoh, 1, 14.96068
##AUDIT TRAIL= $$ (NUMBER, WHEN, WHO, WHERE, PROCESS, VERSION, WHAT)
$$ ##TITLE= Audit trail, TOPSPIN		Version 2.1
$$ ##JCAMPDX= 5.01
$$ ##ORIGIN= Bruker BioSpin GmbH
$$ ##OWNER= Administrator
$$ $$ E:\/data/COFFEE/nmr/AC1525_ROEFFECT0006_8202208_8TdhNIkwTJ/12/pdata/1/auditp.txt
$$ ##AUDIT TRAIL=  $$ (NUMBER, WHEN, WHO, WHERE, PROCESS, VERSION, WHAT)
(   1,<2013-09-26 23:35:13.525 -0700>,<Administrator>,<X>,<go>,<TOPSPIN 2.1>,
      <created by zg
	started at 2013-09-26 23:23:44.061 -0700,
	POWCHK enabled, PULCHK disabled,
       configuration hash MD5:
       C8 4E 4E 5D D3 5C D8 9E 9F 52 82 E0 59 8A DE 15
       data hash MD5: 64K
       CF 11 13 09 F6 95 B6 3E FC 52 46 02 DA D1 69 A0>)
(   2,<2013-09-26 23:35:16.540 -0700>,<Administrator>,<X>,<proc1d>,<TOPSPIN 2.1>,
      <Start of raw data processing
       efp LB = 0.3 FT_mod = 6 PKNL = 1 PHC0 = 0 PHC1 = 0 SI = 128K 
       data hash MD5: 128K
       CA E3 B6 53 F7 EB 45 5F 02 C7 75 D9 26 A7 F9 6C>)
(   3,<2013-09-26 23:35:17.587 -0700>,<Administrator>,<X>,<proc1d>,<TOPSPIN 2.1>,
      <pk PHC0 = -80.84839 PHC1 = 0 
       data hash MD5: 128K
       78 CB EF A0 52 86 D0 61 43 19 08 E9 6F DE 0A 57>)
(   4,<2013-09-26 23:35:18.040 -0700>,<Administrator>,<X>,<proc1d>,<TOPSPIN 2.1>,
      <abs ABSG = 1 
       data hash MD5: 128K
       A8 44 BB A5 07 F0 CE 48 6B 98 58 58 FC C5 AA A1>)
(   5,<2013-09-26 23:35:18.150 -0700>,<Administrator>,<X>,<proc1d>,<TOPSPIN 2.1>,
      <abs ABSG = 2 
       data hash MD5: 128K
       01 AA 14 8B 8D 67 C8 38 47 10 1D 7B F1 B7 7E 43>)
(   6,<2013-09-26 23:35:18.259 -0700>,<Administrator>,<X>,<proc1d>,<TOPSPIN 2.1>,
      <abs ABSG = 3 
       data hash MD5: 128K
       18 3A 3A 6E 6B 82 BD 92 01 25 21 89 CA 06 C9 46>)
(   7,<2013-09-26 23:35:18.368 -0700>,<Administrator>,<X>,<proc1d>,<TOPSPIN 2.1>,
      <abs ABSG = 4 
       data hash MD5: 128K
       95 E1 0D E7 66 04 9A 60 D1 6A 6A 55 11 95 DD 62>)
(   8,<2013-09-26 23:35:18.462 -0700>,<Administrator>,<X>,<proc1d>,<TOPSPIN 2.1>,
      <abs ABSG = 5 
       data hash MD5: 128K
       95 D4 6D FB 5A C6 BE 50 77 75 7D 5F 77 F9 F4 4D>)
$$ ##END=
$$ 
$$ $$ hash MD5
$$ $$ EE 93 A2 8E 26 ED E8 88 75 E2 0E 14 D6 8E 6B C3
##$RELAX= 
##$RELAX= 
##$RELAX= 
##$RELAX= 
##$RELAX= 
##$RELAX= 
##$RELAX= 
##$RELAX= 
$$ Bruker specific parameters
$$ --------------------------
##$DU= <E:\>
##$EXPNO= 12
$$ [...]
##$TP07= 0
##$TPNAME0= <>
##$TPNAME1= <>
##$TPNAME2= <>
##$TPNAME3= <>
##$TPNAME4= <>
##$TPNAME5= <>
##$TPNAME6= <>
##$TPNAME7= <>
##$TPOAL= (0..7)
0.5 0.5 0.5 0.5 0.5 0.5 0.5 0.5
##$TPOFFS= (0..7)
0 0 0 0 0 0 0 0
##$TUNHIN= 0
##$TUNHOUT= 0
##$TUNXOUT= 0
##$USERA1= <user>
##$USERA2= <user>
##$USERA3= <user>
##$USERA4= <user>
##$USERA5= <user>
##$V9= 5
##$VALIST= <valist>
##$VCLIST= <CCCCCCCCCCCCCCC>
##$VD= 0
##$VDLIST= <DDDDDDDDDDDDDDD>
##$VPLIST= <PPPPPPPPPPPPPPP>
##$VTLIST= <TTTTTTTTTTTTTTT>
##$WBST= 1024
##$WBSW= 4
##$XGAIN= (0..3)
0 0 0 0
##$XL= 0
##$YL= 0
##$YMAX_a= 7230421
##$YMIN_a= -13931405
##$ZGOPTNS= <>
##$ZL1= 120
##$ZL2= 120
##$ZL3= 120
##$ZL4= 120
##$ABSF1= 14.96068
##$ABSF2= -5.597502
##$ABSG= 5
##$ABSL= 3
##$ALPHA= 0
##$AQORDER= 0
##$ASSFAC= 0
##$ASSFACI= 0
##$ASSFACX= 0
##$ASSWID= 0
##$AUNMP= <proc_prof1d_extract.lims>
##$AXLEFT= 0
##$AXNAME= <>
##$AXNUC= <1H>
##$AXRIGHT= 0
##$AXTYPE= 0
##$AXUNIT= <>
##$AZFE= 0.1
##$AZFW= 0.1
##$BCFW= 0
##$BC_mod= 0
##$BYTORDP= 0
##$COROFFS= 0
##$CY= 15
##$DATMOD= 1
##$DC= 0
##$DFILT= <>
##$DTYPP= 0
##$F1P= 0
##$F2P= 0
##$FCOR= 0.5
##$FTSIZE= 131072
##$FT_mod= 6
##$GAMMA= 0
##$GB= 0
##$INTBC= 1
##$INTSCL= 1
##$ISEN= 128
##$LB= 0.3
##$LEV0= 0
##$LPBIN= 0
##$MAXI= 10000
##$MC2= 0
##$MEAN= 0
##$ME_mod= 0
##$MI= 0
##$NCOEF= 0
##$NC_proc= -2
##$NLEV= 6
##$NOISF1= 0
##$NOISF2= 0
##$NSP= 0
##$NTH_PI= 0
##$NZP= 0
##$OFFSET= 14.96068
##$PC= 1
##$PHC0= -80.84839
##$PHC1= 0
##$PH_mod= 1
##$PKNL= yes
##$PPARMOD= 0
##$PPDIAG= 0
##$PPIPTYP= 0
##$PPMPNUM= 2147483647
##$PPRESOL= 1
##$PSCAL= 4
##$PSIGN= 0
##$PYNMP= <proc.py>
##$REVERSE= no
##$SF= 400.020009765649
##$SI= 131072
##$SIGF1= 0
##$SIGF2= 0
##$SINO= 400
##$SIOLD= 131072
##$SPECTYP= <>
##$SREGLST= <1H.CDCl3>
##$SSB= 0
##$STSI= 131072
##$STSR= 0
##$SW_p= 8223.68421052631
##$SYMM= 0
##$S_DEV= 0
##$TDeff= 65536
##$TDoff= 0
##$TI= <>
##$TILT= no
##$TM1= 0
##$TM2= 0
##$TOPLEV= 0
##$USERP1= <user>
##$USERP2= <user>
##$USERP3= <user>
##$USERP4= <user>
##$USERP5= <user>
##$WDW= 1
##$XDIM= 131072
##$YMAX_p= 437833737
##$YMIN_p= -14945
##$CURPLOT= <Network HP LaserJet P1505>
##$CURPRIN= <$Network HP LaserJet P1505>
##$DFORMAT= <normdp>
##$LAYOUT= <+/1D_H.xwp>
##$LFORMAT= <normlp>
##$PFORMAT= <normpl>
##$SURQMSG= 1
$$ End of Bruker specific parameters
$$ ---------------------------------
##NTUPLES= NMR SPECTRUM
##VAR_NAME=  FREQUENCY,     SPECTRUM/REAL,   SPECTRUM/IMAG
##SYMBOL=    X,             R,               I
##VAR_TYPE=  INDEPENDENT,   DEPENDENT,       DEPENDENT
##VAR_FORM=  AFFN,          ASDF,            ASDF
##VAR_DIM=   131072,        131072,          131072
##UNITS=     HZ,            ARBITRARY UNITS, ARBITRARY UNITS
##FACTOR=    0.0627417313425164, 1,          1
##FIRST=     8223.62146879497, 1302,         -72929
##LAST=      0,             3673,            -73492
##MIN=       0,             -14945,          0
##MAX=       8223.62146879497, 437833737,    0
$$ Real data points
##PAGE= N=1
##DATA TABLE= (X++(R..R)), XYDATA
$$ [...]
63801D38344j4797j2580j0172r012r140r232q373p070o260o029n823n393m945
63788C29518m574m180l883l913m111l983l379k672k188j870j695j905k547l032
63774B85586k665j464j78M28J50o47j329j477j292j402k049k635k399j369k95
63759B66963K21J62k13o82j024j059q69o72m89j80J91M55P12J202J763J895J520
63742B69896J137J074J085R52R70J409J990K327K509K755K853K512K006J916K340
63727B97731K902L445M158N062N823O184O134N706N004M412M270M327L955L016
63713C62129K068J556J183L57j012k376l091k993k516k187k009j540p89n66j465
63698C46749k760k997j697J42J351J757J896K186K758L632M646N386N530N079
$$ plain form
63801 438344 423547 410967 400795 391783 382643 373411 365038 357968 351708 345679 339856 334463 329518
63788 329518 324944 320764 316881 312968 308857 304874 301495 298823 296635 294765 293070 291165 288618 285586
63774 285586 282921 281457 281279 281707 281857 281210 279881 278404 277112 275710 273661 271026 268627 267258 266963
63759 266963 267184 267346 267133 266451 265427 264368 263499 262827 262338 262158 262349 262804 263516 264718 266481 268376 269896
63742 269896 271033 272107 273192 274144 275114 276523 278513 280840 283349 286104 288957 291469 293475 295391 297731
63727 297731 300633 304078 308236 313298 319121 325305 331439 337145 342149 346561 350831 355158 359113 362129
63713 362129 364197 365753 366936 367293 366281 363905 360814 357821 355305 353118 351109 349569 348780 348214 346749
63698 346749 343989 340992 339295 339437 340788 342545 344441 346627 349385 353017 357663 363049 368579 373658
63684C73658M242L272K453J889J259K19r41j509j328r62p44l62L87J086J419J702
63668C85740K184K405J953J334J308J676J534N39p92j953k919l716m193m319m309
63653C76472m358m532m790m833m196k903j734j325j270p19L92J441K223L107M146
63638C57121M901N298N804O581P146P155O859O624O576O859P508P930P399O337
63624D50098O086P051Q083Q338Q585R757J1186J1667J1597J2588J5068J7760J9597
63611E97461K0991K2839K5355K8267L1322L4048L5795L6490L6717L6573L5045
63600I40903L1115K5081J8206J1468N215k66m579p576r440j0373j0532j0247j0073
63587I68902j0659j2609j6118k0511k4536k7449k9457l0799l0907k9198k6320
$$ plain form
63684 373658 377900 381172 383625 385514 386773 386992 386051 384542 383214 382252 381508 381146 381533 382619 384038 385740
63668 385740 387924 390329 392282 393616 394924 396600 398134 398673 397881 395928 393009 389293 385100 380781 376472
63653 376472 372114 367582 362792 357959 353763 350860 349126 347801 346531 345812 346204 347645 349868 352975 357121
63638 357121 362022 367320 373124 379705 386851 394006 400865 407489 414065 420924 428432 436362 443761 450098
63624 450098 456184 463235 471318 479656 488241 497998 509184 520851 532448 545036 560104 577864 597461
63611 597461 618452 641291 666646 694913 726235 760283 796078 832568 869285 905858 940903
63600 940903 972018 997099 1015305 1026773 1031988 1031722 1027143 1019567 1010127 999754 989222 978975 968902
63587 968902 958243 945634 929516 909005 884469 857020 827563 796764 765857 736659 710339
63576G10339k3695k1879k0190j8010j5514j2902r852o339l203j196N0J382K879
63563E81870M027M751N491O309O850P173P877R164J0525J1577J2588J3984J5996
63550F98182J9089K3890L0151L6490M1888M6916N2627N8509O2362O2055N6706
63539A188865M6428L2110J5789M34j1452j8937k2416k2749k0873j7804j4556j2033
63527A142806j0901j1387j3295j6426k0829k6202l1381l5197l7699l9678m1016
63516H58795m0623l8258l5248l2741l0368k7471k4589k2543k0783j8207j5168
63505E52796j3143j2470j1898j0627r376q889q685q060p367p310p711p827p471
63492D31962o961o273n057l375j757n90J09M30N37P70J398K328L299M219M972
$$ plain form
63576 710339 686644 664765 644575 626565 611051 598149 588297 581958 578755 577559 577609 578991 581870
63563 581870 585897 590648 596139 602448 609298 616471 624348 633512 644037 655614 668202 682186 698182
63550 698182 717271 741161 771312 807802 849690 896606 949233 1007742 1070104 1132159 1188865
63539 1188865 1235293 1267403 1283192 1283626 1272174 1253237 1230821 1208072 1187199 1169395 1154839 1142806
63527 1142806 1131905 1120518 1107223 1090797 1069968 1043766 1012385 977188 939489 899811 858795
63516 858795 818172 779914 744666 711925 681557 654086 629497 606954 586171 567964 552796
63505 552796 539653 527183 515285 504658 495282 486393 477708 469648 462281 454971 447260 439433 431962
63492 431962 425001 418728 413671 410296 408539 407949 408058 408488 409025 409795 411193 413521 416820 421039 426011
63477D26011N299N138M863M721M431L763L073K680K124Q46o76j397j253j281k071
63462D56271k993l248k867k244j347l1J347K212K399K131J677J340J400J724J791
63447D59562J507J592K646M239N509O463P931J0332J3178J5939J8785K2235K6567
63434E96485L1831L7990M4547N0178N3206N2519M7986M0073K9443J7096M742n408
63422A000688j1600j3431j1735p562j499O090J4523K2851L0287L6342M0589M2576
63410A148119M1956L8572L2528K4421J5425O854m52o165j0099j2136j2621j2457
63398A253945j2649j3805j6089j9425k3595k8329l3334l8140m1974m4139m4587
63387I37879m3945m2730m0769l7613l3434k9176k5796k3366k1120j8282j4815
$$ plain form
63477 426011 431310 436448 441311 446032 450463 454226 457299 459979 462103 462949 462273 460876 459623 458342 456271
63462 456271 453278 450030 447163 444919 443572 443541 444888 447100 449499 451630 453307 454647 456047 457771 459562
63447 459562 461069 462661 465307 469546 475055 481518 489449 499781 512959 528898 547683 569918 596485
63434 596485 628316 666306 710853 761031 814237 866756 914742 954815 984258 1001354 1006096 1000688
63422 1000688 989088 975657 963922 956360 954861 960951 975474 998325 1028612 1064954 1105543 1148119
63410 1148119 1190075 1228647 1261175 1285596 1301021 1307875 1307423 1301258 1291159 1279023 1266402 1253945
63398 1253945 1241296 1227491 1211402 1191977 1168382 1140053 1106719 1068579 1026605 982466 937879
63387 937879 893934 851204 810435 772822 739388 710212 684416 661050 639930 621648 606833
63376F06833j1272q073n197k563m11J072K210L570N336P339R600J2337J5414J8303
63362F54498K0794K3328K6335K9663L2930L6090L9309M2540M5582M8276N0264
63351A049609N0768M9116M5385M0135L3606K5713J6803P909J29n986j0354j3081
63339A289752j4450j4900j4890j4947j5727j7717k0793k4471k8570l3137l7622
63328A052528m0758m1704m0838l8930l5945l1329k5260j8815j2777p020j399L192
63316G60945N165L443j813r507j8147k6243l2495l5999l6420l4145l0205k5820
63304E18759k1773j8202j5019j2306j0223q692p464o428n680n250m936m492l841
63291C94453l123k542k205k023j779j399j141j372k192l284m199m572m197l057
$$ plain form
63376 606833 595561 587488 582291 579728 579317 580389 582599 586169 591505 598844 608444 620781 636195 654498
63362 654498 675292 698620 724955 754618 787548 823638 862947 905487 951069 999345 1049609
63351 1049609 1100377 1149493 1194878 1235013 1268619 1294332 1311135 1319044 1319173 1313187 1302833 1289752
63339 1289752 1275302 1260402 1245512 1230565 1214838 1197121 1176328 1151857 1123287 1090150 1052528
63328 1052528 1011770 970066 929228 890298 854353 823024 797764 778949 766172 759152 757753 760945
63316 760945 766110 769553 767740 758233 740086 713843 681348 645349 608929 574784 544579 518759
63304 518759 496986 478784 463765 451459 441236 432544 425080 418652 412972 407722 402786 398294 394453
63291 394453 391330 388788 386583 384560 382781 381382 380241 378869 376677 373393 369194 364622 360425 357368
63277C57368j474j03M95L74J84N01J187J457P44n85j482j222m8J206J998K420
63261C63020K857L486M183M668M762M560M393M517M875N280N683O086O333O316
63247D31019O300O690P421Q008Q281Q721R820J1468J3192J4723J6059J7213J8219
63234E77134J9180K0111K0923K1714K2766K3987K4776K4827K4636K4716K4730
63223H29500K4093K3153K2913K3662K4703K5514K6237K6890K6907K5986K4605
63212A104163K3110K0874J7023J1593N317j292q064j4573k0240k4978k9213l3134
63200A050586l6344l8198l8219l6319l3075k9609k6694k3932k0365j5812j1134
63189G40885p086l528O1L812P478J0781J3462J5308J6511J7672J9097K0277K0491
$$ plain form
63277 357368 355894 355791 356286 356660 356844 357345 358532 359989 360733 360148 358666 357444 357396 358602 360600 363020
63261 363020 365877 369363 373546 378214 382976 387536 391929 396446 401321 406601 412284 418370 424703 431019
63247 431019 437319 444009 451430 459438 467719 476440 486260 497728 510920 525643 541702 558915 577134
63234 577134 596314 616425 637348 659062 681828 705815 730591 755418 780054 804770 829500
63223 829500 853593 876746 899659 923321 948024 973538 999775 1026665 1053572 1079558 1104163
63212 1104163 1127273 1148147 1165170 1176763 1182080 1180788 1172724 1158151 1137911 1112933 1083720 1050586
63200 1050586 1014242 976044 937825 901506 868431 838822 812128 788196 767831 752019 740885
63189 740885 733799 730271 730332 734144 741622 752403 765865 781173 797684 815356 834453 854730 875221
63176H75221J9838J9244J9342J9769J9637J8523J6788J5063J3651J2379J0832
63165A060287Q607N457J417l109p570j1699j5745k0101k4663k8661l1252l2345
63153I00623l2791l3538l4519l4583l2727k9239k5323k1793j8662j5961j4100
63142F07387j3049j1896r887p439n439l897k252p41l93j440k725l146k889k724
63128E39470k790k738k599k682k838k553j723p64L0P75J566K239K620K763K813
63113E33589K971L466M266M835M578L589K632K293K482K779K869K565J820J051
63099E75785J040K117L649M703N029N104N262N342N165M934M828M623L967K893
63085F34441J709N01q93k320l192l056k157j155m40J22Q55J983L591N598P648
$$ plain form
63176 875221 895059 914303 933645 953414 973051 991574 1008362 1023425 1037076 1049455 1060287
63165 1060287 1068894 1074351 1075768 1072659 1065089 1053390 1037645 1017544 992881 964220 932968 900623
63153 900623 867832 834294 799775 765192 732465 703226 677903 656110 637448 621487 607387
63142 607387 594338 582442 572555 565116 559677 555780 553528 552787 552394 550954 548229 545083 542194 539470
63128 539470 536680 533942 531343 528661 525823 523270 521547 520783 520813 521588 523154 525393 528013 530776 533589
63113 533589 536560 540026 544292 549127 553705 557294 559926 562219 564701 567480 570349 572914 574734 575785
63099 575785 576825 578942 582591 587294 592323 597427 602689 608031 613196 618130 622958 627581 631548 634441
63085 634441 636150 636651 635758 633438 630246 627190 625033 623878 623438 623560 624415 626398 629989 635587 643235
63070F43235R241J0169J0744J1492J2595J3725J4496J5051J6044J7891K0137K1959
63058H16779K3363K5419K8972L3502L7788M1433M4983M8658N1903N4443N6892
63047A264135N9702O2160O3307O3491O3999O5302O6505O6778O6457O6340O6590
63036A974766O6883O7201O7701O7957O7097O4706O1043N6052M8731L8067K4415
63025B604619R408n607k0528l5656n0376o3259p3365q0836q6099q9022q9208q6820
63013A933251q2622p7282p0944o3459n4829m5469l6135k7508j9639j2005m263
63002A439096L220R863J5571K0523K4488K7022K8293K9061K9722K9973K9692K9466
62990A715990K9711K9890K9233K7956K6903K6075K4324K0758J5792J0311M308
$$ plain form
63070 643235 652476 662645 673389 684881 697476 711201 725697 740748 756792 774683 794820 816779
63058 816779 840142 865561 894533 928035 965823 1007256 1052239 1100897 1152800 1207243 1264135
63047 1264135 1323837 1385997 1449304 1512795 1576794 1642096 1708601 1775379 1841836 1908176 1974766
63036 1974766 2041649 2108850 2176551 2244508 2311605 2376311 2437354 2493406 2542137 2580204 2604619
63025 2604619 2614027 2608420 2587892 2552236 2501860 2438601 2365236 2284400 2198301 2109279 2020071 1933251
63013 1933251 1850629 1773347 1702403 1638944 1584115 1538646 1502511 1475003 1455364 1443359 1439096
63002 1439096 1442316 1452179 1467750 1488273 1512761 1539783 1568076 1597137 1626859 1656832 1686524 1715990
62990 1715990 1745701 1775591 1804824 1832780 1859683 1885758 1910082 1930840 1946632 1956943 1961251
62979A961251k989j1764k1057k9778l7781m5499n2726n8372o1647o2996o3456
62968A513186o3315o1966n9045n5079n0771m6274m1658l7544l4525l2206k9667
62957A001136k6921k5003k4313k3749k2160k0023j8751j8698j8794j8151j7030
62946G67543j5983j4975j3905j3258j3519j4265j4593j4115j2977j1164q637o049
62934F14103m393l767l272k380j616j468j375n36P59J457J142L49l62r69j603
62919E96069k230k830l335l346k505j269o76j060j580j386p94p32j396k043k106
62904E68781j968k430l643m806m944l963k807k422k660k563j628l86L75M58J16
62889E35510m32r21r15k78M99R05J050J271J367R14J75o1M29J013J161J060J005
$$ plain form
62979 1961251 1958262 1946498 1925441 1895663 1857882 1812383 1759657 1701285 1639638 1576642 1513186
62968 1513186 1449871 1387905 1328860 1273781 1223010 1176736 1135078 1097534 1063009 1030803 1001136
62957 1001136 974215 949212 924899 901150 878990 858967 840216 821518 802724 784573 767543
62946 767543 751560 736585 722680 709422 695903 681638 667045 652930 639953 628789 620152 614103
62934 614103 609710 605943 602671 600291 598675 597207 595832 595296 596055 597512 598654 599003 598641 597672 596069
62919 596069 593839 591009 587674 584328 581823 580554 579878 578818 577238 575852 575058 574326 572930 570887 568781
62904 568781 566813 564383 560740 555934 550990 547027 544220 541798 539138 536575 534947 534561 534936 535394 535510
62889 535510 535078 534157 533242 532964 533463 534368 535418 536689 538056 538970 539145 539084 539513 540526 541687 542747 543752
62872E43752P87J19p43j301j541j901k581l211l295k804k247k115k292k179j479
62857E16969o34k27k21k59l51o34o04M73K228L174K478R94K5k28l00l12o4J63
62839E22670o4m57l62J00J75k67n68m49m09o92p38j19P67J375J818K481L303L945
62821E32509M248M195L746L075K618K504K462K518L135M234M811M262L511L890
62807E81718N250O193O043N547N580O102O729P502Q542R511R938R902J0019J0840
62793F89416J2463J4564J6734J8871K1238K3942K6655K9186L2143L6410M2031
62782I63653M8199N4393O0801O7554P4292Q0831Q7493R4235J00101J04179J06547
62771A842278J07522J06433J02069R4188Q3712P1368N7045M0668K2938M754j3496
$$ plain form
62872 543752 544539 544658 543915 542614 541073 539172 536591 533380 530085 527281 525034 522919 520627 518448 516969
62857 516969 516335 516108 515887 515628 515277 514643 514039 514512 516740 519914 522392 523386 523411 523183 522883 522571 522507 522670
62839 522670 522606 522149 521787 521887 522062 521795 521227 520778 520369 519677 518939 518820 519587 520962 522780 525261 528564 532509
62821 532509 536757 540952 544698 547773 550391 552895 555357 557875 561010 565244 570055 574317 577828 581718
62807 581718 586968 593161 599204 604751 610331 616433 623162 630664 639206 648717 658655 668557 678576 689416
62793 689416 701879 716443 733177 752048 773286 797228 823883 853069 885212 921622 963653
62782 963653 1011852 1066245 1127046 1194600 1268892 1349723 1437216 1531451 1631552 1735731 1842278
62771 1842278 1949800 2056233 2158302 2252490 2336202 2407570 2464615 2505283 2528221 2532975 2519479
62760B519479l1459m8125o2314p3794q3311r1360r7423j00660j01075r9592r7131
62749A633235r3964q9960q5073p9447p3323o7071o1140n5689n0464m5285m0491
62738H91328l6522l3191k9843k6217k2734j9829j7424j5241j3165j1132r049p115
62726F49866n864n461n306m696l661k739k109j357q6J597L233M486N455O653Q492
62711F48503J0746J2779J4415J6188J8544K1228K3924K7019L1056L5678L9825
62700H99905M3024M5892M9274N3404N7961O2475O6470O9656P2102P3935P4756
62689A568854P3701P0263O4652N7257M8088L7039K4433J0958k775j6478k9926
62678A906066m2626n3742o2537o8941p3491p6516p7637p6443p3445o9812o6214
$$ plain form
62760 2519479 2488020 2439895 2377581 2303787 2220476 2129116 2031693 1931033 1829958 1730366 1633235
62749 1633235 1539271 1449311 1364238 1284791 1211468 1144397 1083257 1027568 977104 931819 891328
62738 891328 854806 821615 791772 765555 742821 722992 705568 690327 677162 666030 656981 649866
62726 649866 644002 638541 633235 628539 624878 622139 620030 618673 618587 620184 623417 627903 633358 640011 648503
62711 648503 659249 672028 686443 702631 721175 742403 766327 793346 824402 860080 899905
62700 899905 942929 988821 1038095 1091499 1149460 1211935 1278405 1348061 1420163 1494098 1568854
62689 1568854 1642555 1712818 1777470 1834727 1882815 1919854 1944287 1955245 1952470 1935992 1906066
62678 1906066 1863440 1809698 1747161 1678220 1604729 1528213 1450576 1374133 1300688 1230876 1164662
62667A164662o2462n8280n3899m9603m5292m0820l6418l2504k9249k6544k4180
62656G05411k1901j9542j7255j5370j3928j2611j1247j0128r647r852j0368j0609
62644E42953j0070q780p392o458n708m505k894j515n97J84P79O88Q0p7M56O08
62628D97752l92j683k053j721j674j853j384k95L88K76J38N85J340K054K861L758
62612D98097M352M665N274O259O796O442O057O755Q504J0426J2069J3634J5274
62599F04604J6948J8819K1259K4427K8219L2427L6637M0256M3158M6013M9414
62588I62181N2706N4300N3220M9855M5103L9298L2171K3629J4170M643m353j2889
62576A314034k1424k9964l7542m2857m5511m6369m6635m6754m6333m4925m2662
$$ plain form
62667 1164662 1102200 1043920 990021 940418 895126 854306 817888 785384 756135 729591 705411
62656 705411 683510 663968 646713 631343 617415 604804 593557 583429 573782 563930 553562 542953
62644 542953 532883 524103 516711 510253 504545 500040 497146 495631 495034 495218 495997 496685 496765 496688 497144 497752
62628 497752 497360 495677 493624 491903 490229 488376 486992 486697 487085 487361 487499 488084 489424 491478 494339 498097
62612 498097 502449 507114 512388 518647 525443 531885 537942 544697 553201 563627 575696 589330 604604
62599 604604 621552 640371 661630 686057 714276 746703 783340 823596 866754 912767 962181
62588 962181 1014887 1069187 1122407 1172262 1217365 1256663 1288834 1312463 1326633 1331276 1326923 1314034
62576 1314034 1292610 1262646 1225104 1182247 1136736 1090367 1043732 996978 950645 905720 863058
62565H63058m0068l7463l4738l1751k8741k6097k3768k1247j8261j5231j2760
62554E72933j0963r592q585q079p921p643o964n996m895l725k749k375k469k158
62540D88819q14R42J865J683J466K122L133L293K384J334P42J30r35j635o52K152
62524E06029N545Q380J0511J2146J3225J3939J5202J7795K1304K4599K7220K9613
62512G05508L2154L4706L7220L9962M2795M4836M5317M4333M2307L9105L4264
62501A142507K7853K0498J2700M640l308j0458j6362k1085k4815k7453k8751k8591
62489A047375k7048k4415k1251j8045j4721j0823o324j916J816N098Q459J1806
62477I50011J4471J6075J6794J6730J5539J2912R078M594k45n497j1150j6752
$$ plain form
62565 863058 822990 785527 750789 719038 690297 664200 640432 619185 600924 585693 572933
62554 572933 561970 552378 543793 535714 527793 520150 513186 507190 502295 498570 495821 493446 490977 488819
62540 488819 488005 488947 490812 492495 493961 496083 499216 502509 504893 506227 506969 507099 506164 504529 503877 506029
62524 506029 511574 519954 530465 542611 555836 569775 584977 602772 624076 648675 675895 705508
62512 705508 737662 772368 809588 849550 892345 937181 982498 1026831 1069138 1108243 1142507
62501 1142507 1170360 1190858 1203558 1208198 1204890 1194432 1178070 1156985 1132170 1104717 1075966 1047375
62489 1047375 1020327 995912 974661 956616 941895 931072 924748 922832 924648 929746 938205 950011
62477 950011 964482 980557 997351 1014081 1029620 1042532 1051610 1056204 1055959 1050462 1039312 1022560
62465A022560k1581k5289k8334l1500l4801l7118l7371l5888l4072l2689l1129
62454F72788k8571k5236k1994j9229j6701j4235j1889r550p020m500k528j240
62442E10095k11R22K058L021L898M725N264N379N317N328N189M427K842O15j870
62427E56999m035n285n647n987p037q240q258o777n197n052o172o948o248m505
62413D71611k936k245k286k543k688k740k940l340l480k822j553n82l84l36L23
62398D41059J254J452Q10L54P93J694K436L158M152M965M957M310L713L222K396
62383D80725J403J065J720K791L792M921O447Q055R323J0226J0838J0963J0612
62370E62881J0330J0614J1319J2097J3038J4425J6182J8130K0507K3650K7322
$$ plain form
62465 1022560 1000979 975690 947356 915856 881055 843937 806566 770678 736606 703917 672788
62454 672788 644217 618981 596987 577758 561057 546822 534933 525383 518363 513863 511335 510095
62442 510095 509884 510806 512864 515885 519783 524508 529772 535151 540468 545796 550985 555412 558254 558869 556999
62427 556999 552964 547679 542032 536045 529008 520768 512510 505733 500536 495484 489312 482364 476116 471611
62413 471611 468675 466430 464144 461601 458913 456173 453233 449893 446413 443591 442038 441456 441072 440736 441059
62398 441059 442313 443765 444575 444929 445722 447416 449852 453010 457162 462127 467084 471394 475107 478329 480725
62383 480725 482128 483193 484913 487704 491496 496417 502864 510919 520242 530468 541306 552269 562881
62370 562881 573211 583825 595144 607241 620279 634704 650886 669016 689523 713173 740495
62359G40495L1007L4813L9408M5037N1113N6871O1962O6206O9190P0301O8923
62348A335326O4594N7360M8081L8018K7941J7899P908j564j0024j7495k4321l0581
62336A513142l6050m0556m4172m6992m8883m9466m8432m5942m2635l9075l5317
62325A035622l1326k7668k5217k4069k3307k2157k0960k0539k0999k1740k2403
62314G75237k3097k3675k3500k2277k0568j9104j7869j6305j4231j2031j0033
62303E72547q243o770n932n644n123l739j932p92p84j366j843k005j792r70M42
62288E26054J857K714L130L511L809L724L479L680M368M842M583L907L423L318
62274E76399L397L475L491L495L759M608N920P188Q243R580J1644J4146J6608
$$ plain form
62359 740495 771502 806315 845723 890760 941873 998744 1060706 1126912 1196102 1266403 1335326
62348 1335326 1399920 1457280 1505361 1543379 1571320 1589219 1597127 1595563 1585539 1568044 1543723 1513142
62336 1513142 1477092 1436536 1392364 1345372 1296489 1247023 1198591 1152649 1110014 1070939 1035622
62325 1035622 1004296 976628 951411 927342 904035 881878 860918 840379 819380 797640 775237
62314 775237 752140 728465 704965 682688 662120 643016 625147 608842 594611 582580 572547
62303 572547 564304 557534 551602 545958 540835 537096 535164 534372 533588 532222 530379 528374 526582 525612 526054
62288 526054 527911 530625 533755 537266 541075 544799 548278 551958 556326 561168 565751 569658 573081 576399
62274 576399 579796 583271 586762 590257 594016 598624 604544 611732 619975 629555 641199 655345 671953
62261F71953J9210K2671K7353L2959L9029M5284N1473N7342O2799O7809P2049
62250A169931P4900P5770P4136O9341O0944M9503L6636K4034J2465J887p890j7010
62238A624647k5831l4743m3577n1521n7846o2574o6121o8380o8586o6261o1950
62227A017257n6802n1568m6352m1160l6161l1424k6938k3061k0396j8855j7419
62216F47121j5351j3231j2082j1816j1328j0100q804q083p591o675n428m422l797
62203E28413l183k380j607j115r39r25p25J06J623L206M162M559N100O189P571
62188E50055Q851R921J0664J0739J0094R394R442J0208J0760J0313R092P993P488
62175F75014P129O187M693L651M186O608J0368J4730J9237K3717K8243L3139L8651
$$ plain form
62261 671953 691163 713834 741187 774146 813175 858459 909932 967274 1030073 1097882 1169931
62250 1169931 1244831 1320601 1394737 1464078 1525022 1574525 1611161 1635195 1647660 1649547 1641657 1624647
62238 1624647 1598816 1564073 1520496 1468975 1411129 1348555 1282434 1214054 1145468 1079207 1017257
62227 1017257 960455 908887 862535 821375 785214 753790 726852 703791 683395 664540 647121
62216 647121 631770 618539 606457 594641 583313 573213 564409 556326 548735 542060 536632 532210 528413
62203 528413 525230 522850 521243 520128 519189 518264 517539 517645 519268 522474 526636 531195 536295 542484 550055
62188 550055 558906 568827 579491 590230 600324 609718 619160 629368 640128 650441 659533 667526 675014
62175 675014 682143 688330 693023 696674 700860 707468 717836 732566 751803 775520 803763 836902 875553
62162H75553M4329M9033N1806N2593N1855M9692M5793M0097L3072K5288J7089
62151A336200Q809Q97o372j3068j9264k4796k9559l3744l7489m0492m2226m2381
62139A056515m0809l7430l2661k7629k3241j9170j4473r260m876k104j7K704N982
62126H53531Q657J0244J1482J3220J5580J8400K1730K5507K9213L2215L4211L5135
62114A109125L4872L3288L0289K5756J9662J2579N730K55l562o226q355j0275
62102A243138j2095j3895j5803j7818j9550k0178j9092j6629j3858j1472r175
62091A073573o385l238m47J529K787L492L616L250K850K948L758N141O818Q576
62077A108268J0371J2326J4534J6873J9033K0741K1892K2490K2574K2157K1305
$$ plain form
62162 875553 919882 968915 1020721 1073314 1125169 1174861 1220654 1260751 1293823 1319111 1336200
62151 1336200 1345009 1345906 1339534 1326466 1307202 1282406 1252847 1219103 1181614 1141122 1098896 1056515
62139 1056515 1015706 978276 945615 917986 894745 875575 861102 851842 846966 844862 844845 847549 853531
62126 853531 862188 872432 883914 897134 912714 931114 952844 978351 1007564 1039779 1073990 1109125
62114 1109125 1143997 1177285 1207574 1233330 1252992 1265571 1271301 1271556 1267994 1261768 1253413 1243138
62102 1243138 1231043 1217148 1201345 1183527 1163977 1143799 1124707 1108078 1094220 1082748 1073573
62091 1073573 1067188 1063950 1063503 1065032 1067819 1071311 1074927 1078177 1081027 1083975 1087733 1092874 1099692 1108268
62077 1108268 1118639 1130965 1145499 1162372 1181405 1202146 1224038 1246528 1269102 1291259 1312564
62066A312564K0279J9669K0098K1693K3895K5932K7390K8211K8369K7755K6238
62055A582093K3643J9819J4981R803M842k0n193j0544j5492k0006k4916l0876
62043A548134l7397m3330m8031n1604n4152n5398n5196n3989n2358n0390m7815
62032I98474m4660m1343l8096l4652l0763k6782k3405k0965j9201j7645j5986
62021F84976j4132j2305j1044j0743j1076j1264j0966j0510j0135r564q620p705
62009E56912p151o516n162l249j472M1J757L728N323O131O454O573O227N177L796
61994E78569K546J344j20j708l005l986m965o014o939p797q915j0204j0942j0525
61980E07339r250q005p248o631n742m877m711n237n501m682l139j953j627j678
$$ plain form
62066 1312564 1332843 1352512 1372610 1394303 1418198 1444130 1471520 1499731 1528100 1555855 1582093
62055 1582093 1605736 1625555 1640536 1650339 1655181 1655161 1649968 1639424 1623932 1603926 1579010 1548134
62043 1548134 1510737 1467407 1419376 1367772 1313620 1258222 1203026 1149037 1096679 1046289 998474
62032 998474 953814 912471 874375 839723 808960 782178 758773 737808 718607 700962 684976
62021 684976 670844 658539 647495 636752 625676 614412 603446 592936 582801 573237 564617 556912
62009 556912 549761 543245 538083 534834 533362 533403 535160 538888 544211 550342 556796 563369 569596 574773 578569
61994 578569 581115 582459 582339 580631 577626 573640 568675 562661 555722 547925 539010 528806 517864 507339
61980 507339 498089 490084 482836 476205 470463 465586 460875 455638 450137 445455 442316 440363 438736 437058
61966D37058j543j288j270j500j666j483p97K89J187J168L03k34O24K507L981
61951D37336M153L449K836K853L594N100P304R744J1727J2974J3950J5473J7850
61938E48343K0483K2407K3284K3640K4109K4615K4521K3417K1504J9330J7411
61927G93064J6078J5245J4251J2259R066N370K055o75l186n617p546q587q950
61914H32827r079q844p560m892j349K303N776R061J1894J3923J5215J5986J5941
61901H91202J4531J1938R096O455L382p54n447r521j2434j4613j6698j8906k0985
61888H37246k2420k2825k2357k1567k0645j9197j7048j4851j3413j2782j2497
61877F37644j2368j2385j2187j1372j0182r154q239o970n407m074k988j616O6
$$ plain form
61966 437058 435515 434227 432957 431457 429791 428308 427511 427800 428987 430155 430458 430224 430848 433355 437336
61951 437336 441489 444938 447774 450627 454221 459321 466625 476369 488096 501070 515020 530493 548343
61938 548343 568826 591233 614517 638157 662266 686881 711402 734819 756323 775653 793064
61927 793064 809142 824387 838638 850897 859963 865333 867388 866713 863527 857910 850364 841777 832827
61914 832827 823748 814904 807344 802452 801103 803406 809182 818243 830137 844060 859275 875261 891202
61901 891202 905733 917671 926767 933222 936604 935850 930403 920882 908448 893835 877137 858231 837246
61888 837246 814826 792001 769644 748077 727432 708235 691187 676336 662923 650141 637644
61877 637644 625276 612891 600704 589332 579150 569996 561757 554787 549380 545306 542318 540702 540768
61864E40768J426K352L641N708P708Q676Q982R859J1878J4569J7331J9976K2497
61851F75371K4960K7674L0931L4438L7397L9262M0080L9977L8756L6245L2761
61840A057852K8865K4724J9945J4162P569Q30n298j0095j2953j3732j3041j1790
61828A087038j0226p752l882R70N807R785J2383J3314J2784J1489R806P250L205
61815A151971k119q031j4277k0703k6347k9978l1669l2814l4239l5260l4935l3392
61803H48207l1363k9193k6882k4532k2075j9149j5743j2583j0264q570p104o016
61791F34733n494n069m222l195k535k180j754j389j480j906k263k617l185l580
61777E93864l269k626k591l265l790l646l210k911k731k770l301l919l541j834
$$ plain form
61864 540768 542194 544546 548187 553895 561603 570279 579261 589120 600998 615567 632898 652874 675371
61851 675371 700331 728005 758936 793374 830771 870033 910113 950090 988846 1025091 1057852
61840 1057852 1086717 1111441 1131386 1145548 1153117 1153947 1148649 1138554 1125601 1111869 1098828 1087038
61828 1087038 1076812 1069060 1065178 1066148 1071955 1081740 1094123 1107437 1120221 1131710 1141516 1148766 1151971
61815 1151971 1149852 1141821 1127544 1106841 1080494 1050516 1018847 986033 951794 916534 881599 848207
61803 848207 816844 787651 760769 736237 714162 695013 679270 666687 656423 647853 640749 634733
61791 634733 629239 624170 619948 616753 614218 612038 610284 608895 607415 605509 603246 600629 597444 593864
61777 593864 590595 587969 585378 582113 578323 574677 571467 568556 565825 563055 559754 555835 552294 550460
61763E50460P0Q62N32m9m53q20j029o10M31J347J456Q88L39L08O97J104J260J129
61745E57922P04n6r91j667j743j250m11N90J396J425M84o97j071l68Q17J932K866
61728E59882L567L836L712L561L612L781L976M175M179L845L587M021M963N514
61714F16211N299M933M922M868M249L325K559J669P8j953l445l832l436k809k141
61699F30497j362m62L82P40J68j202k513k942k534j971j799k176l096m255m973
61684F02502m812m187l905m116m310m210m013l740l081k108j490j677k368l110
61670E55375l801m274l986k766j410q29q95q59o89j090k129k779k309j346r70
61655E25243j193j103l04O13J085J326J786K356K580K318J832J444J400J810K438
$$ plain form
61763 550460 550530 551392 551924 551875 551422 550602 549573 548963 549394 550741 552197 553085 553424 553732 554429 555533 556793 557922
61745 557922 558626 558570 557579 555912 554169 552919 552508 553098 554494 555919 556403 555706 554635 554267 555084 557016 559882
61728 559882 563449 567285 570997 574558 578170 581951 585927 590102 594281 598126 601713 605734 610697 616211
61714 616211 621510 626443 631365 636233 640482 643807 646366 648035 648113 646160 642715 638883 635447 632638 630497
61699 630497 629135 628673 629055 629795 629963 628761 626248 623306 620772 618801 617002 614826 611730 607475 602502
61684 602502 597690 593503 589598 585482 581172 576962 572949 569209 566128 564020 562530 560853 558485 555375
61670 555375 551574 547300 543314 540548 539138 538309 537414 536555 535866 534776 532647 529868 527559 526213 525243
61655 525243 524050 522947 522643 523256 524341 525667 527453 529809 532389 534707 536539 537983 539383 541193 543631
61640E43631K710K380J925J818J677P88n62j188o53j25r43k886m472m710l919
61625E35471k955k303j974j759j339n31L58O76J58o95j134r34m75k66o44j709
61609E19945l285m767n472n276m862n033n828o583o774o525o132n537m674l990
61595D45207m068m748n208n013m596m448m367l903l212k847k929l039k912k773
61581C91144k847k938k733k291k026k226k728l117l129k859k512k125j648j213
61567C56752j068j201j322j299j267j206p86J4N71L15m59r62q87n12j0O49J197
61550C48519J126N02O2K21N09L48q2k10O1L74O10R56J392J657J737J934K323K602
61532C64641K636K692K882K686J536k97j862k602k846l092l176k570j399o04r39
$$ plain form
61640 543631 546341 548721 550646 552464 554141 554929 554367 553179 552526 552401 551458 548572 544100 539390 535471
61625 535471 532516 530213 528239 526480 525141 524610 524968 525644 525802 525107 523973 523039 522564 522298 521654 519945
61609 519945 516660 511893 506421 501145 496283 491250 485422 478839 472065 465540 459408 453871 449197 445207
61595 445207 441139 436391 431183 426170 421574 417126 412759 408856 405644 402797 399868 396829 393917 391144
61581 391144 388297 385359 382626 380335 378309 376083 373355 370238 367109 364250 361738 359613 357965 356752
61567 356752 355684 354483 353161 351862 350595 349389 348603 348617 349188 349503 349044 348082 347195 346683 346673 347322 348519
61550 348519 349645 350147 350209 350430 350939 351287 351205 350995 351056 351430 352040 352996 354388 356045 357782 359716 362039 364641
61532 364641 367277 369969 372851 375537 377073 376776 374914 372312 369466 366374 363198 360628 359229 358625 357686
61517C57686k034k787k533j561n70O4L16J72m26j317k113k517k518k241j788j266
61501C34567q39n92m83n31r08j594k048j648m90N21O41J00l03k34r6l48q68j102
61483C23745o45L76J411J879J688J282J119J148J059R00J006J311J230M78l63
61468C37624n62j95N9l8J6N90J237J250O57L01P55J482J398L17o53m34N72R95
61450C45371L68k69J01J063J494J150P08N32L15L3K40J085J815J762J308J269
61434C58345J725K129K270K433K639K462J707P91K23J21L79Q94J359J291O83K75
61418C79726P22J686K248K101J798J820J973J909J716J646J575J181L85o73j903
61403C97910l106l795l624k976k612k802l159l293l206k933k359j573r95q77j034
$$ plain form
61517 357686 355652 352865 350332 348771 348201 348265 348581 348753 348327 347010 344897 342380 339862 337621 335833 334567
61501 334567 333728 333136 332653 332122 331214 329620 327572 325924 325434 325955 326596 326696 326393 326159 326063 325715 324847 323745
61483 323745 323100 323476 324887 326766 328454 329736 330855 332003 333062 333962 334968 336279 337509 337987 337624
61468 337624 337062 336867 336926 336888 336904 337494 338731 339981 340638 340939 341694 343176 344574 344891 344238 343804 344376 345371
61450 345371 345739 345470 345571 346634 348128 349278 349986 350518 350833 350866 351106 352191 354006 355768 357076 358345
61434 358345 360070 362199 364469 366902 369541 372003 373710 374501 374724 374845 375224 376118 377477 378768 379451 379726
61418 379726 380448 382134 384382 386483 388281 390101 392074 393983 395699 397345 398920 400101 400486 399813 397910
61403 397910 394804 391009 387385 384409 381797 378995 375836 372543 369337 366404 364045 362472 361477 360600 359566
61388C59566j179j251j148o72J4K73j24m22K86J769K834K702J713O48o7l65k20
61371C64357K98R65J587K083K263J869J054N19Q38J708K265K138J864K153L024
61356C88985L904M384M569M701M851N114N755O830P890Q469Q768R359J0252J0715
61342D84546J0225R160Q236P635P036O237N371M633M135L949L918L598K614J037
61328E62330p53k434l745m389m333l974l672l271k483j559j035q70m31N65J617
61313E31563K136K219K473L378M984O894Q442R192R546J0512J2566J4963J6492
61300F35360J6688J5963J4706J2678R475N306J051k420m825o395p472q336r234
61287F72545j0224j0946j0962j0400r933r899r803r031p659o093m339k295n34
$$ plain form
61388 359566 358387 357136 355988 355316 355330 355603 355479 355057 355343 357112 359946 362648 364361 365009 364942 364577 364357
61371 364357 364655 365620 367207 369290 371553 373422 374476 374995 375833 377541 379806 381944 383808 385961 388985
61356 388985 392889 397273 401842 406543 411394 416508 422263 429093 436983 445452 454220 463579 473831 484546
61342 484546 494771 503931 512167 519802 526838 533075 538446 543079 547214 551163 555081 558679 561293 562330
61328 562330 561577 559143 555398 551009 546676 542702 539030 535759 533276 531717 530682 529812 529381 529946 531563
61313 531563 533699 535918 538391 541769 546753 553647 562089 571281 580827 591339 603905 618868 635360
61300 635360 652048 668011 682717 695395 704870 710176 711227 708807 703982 697587 690115 681779 672545
61287 672545 662321 651375 640413 630013 620080 610181 600378 591347 583688 577595 573256 570961 570427
61274E70427J58M0L54J696L225L953M096M467N027M904L845K816K952M312N998
61259F18270P205P914Q664R855J1379J2773J3539J3362J2181J0282Q203O366M781
61246G44774L262J778M31q75k361l995n433o320o473n885m910m233m170m094l188
61231F98308j767j056j436j762q55J045K981M697O482Q040Q648Q390Q210Q557
61217G48482Q803Q429P984Q291R125R419Q595P153N922N181M695M239L794L322
61203H43434K700K000J674K244L791N878Q002J0012J2080J4382J6951J9620K2058
61190I64826K3932K5128K5634K5227K3559K0734J7563J4856J2679J0712R091Q305
61178A182246Q157P524N634L138J296K90r74l327o220q514r912j1082j2591j4348
$$ plain form
61274 570427 570585 570625 570979 572675 575900 579853 583949 588416 593443 598347 602192 605008 607960 612272 618270
61259 618270 625475 633389 642053 651908 663287 676060 689599 702961 715142 725424 733627 739993 744774
61246 744774 748036 749814 750245 749370 747009 743014 737581 731261 724788 718903 713993 709760 705590 701496 698308
61231 698308 696541 695485 694049 692287 691432 692477 695458 700155 706637 714677 723325 731715 739925 748482
61217 748482 757285 765714 773698 781989 791114 800533 809128 816281 822203 827384 832079 836318 840112 843434
61203 843434 846134 848134 849808 852052 855843 861721 869723 879735 891815 906197 923148 942768 964826
61190 964826 988758 1013886 1039520 1064747 1088306 1109040 1126603 1141459 1154138 1164850 1173941 1182246
61178 1182246 1190403 1197927 1203561 1206699 1207995 1208285 1207311 1203984 1197764 1189250 1179338 1168256 1155665 1141317
61164A141317j6065j7687j9165k0284k1012k1704k2629k3551k4085k4167k3814
61153I07154k2704k0557j7788j5225j3106j0842p910m549j501N37J110R8j991
61140G92726m101n394n914o317p015p678p512o051l710j518j19Q46K194M161O370
61125G50968Q605J1085J3909J6802J9602K2539K5750K8939L1795L4332L6584L8426
61113A039336L9939M1517M3248M4550M4940M4730M4406M3656M1686L8391L4599
61102A500998L1094K7860K4393K0347J5677J0455M721j515q155j4846k1068k6550
61090A563411l1409l5728l9217m1543m2741m3075m2710m1906m1284m1315m1561
61079A120922m0880l8581l5070l1396k8424k6416k4964k3204k0546j7387j4772
$$ plain form
61164 1141317 1125252 1107565 1088400 1068116 1047104 1025400 1002771 979220 955135 930968 907154
61153 907154 884450 863893 846105 830880 817774 806932 799022 794473 792972 793509 794619 794717 792726
61140 792726 788625 783231 777317 771000 763985 756307 748795 742744 739034 737516 737397 738243 740437 744598 750968
61125 750968 759573 770658 784567 801369 820971 843510 869260 898199 929994 964326 1000910 1039336
61113 1039336 1079275 1120792 1164040 1208590 1253530 1298260 1342666 1386322 1428008 1466399 1500998
61102 1500998 1532092 1559952 1584345 1604692 1620369 1630824 1635545 1634030 1625875 1611029 1589961 1563411
61090 1563411 1532002 1496274 1457057 1415514 1372773 1329698 1286988 1245082 1203798 1162483 1120922
61079 1120922 1080042 1041461 1006391 974995 946571 920155 895191 871987 851441 834054 819282
61068H19282j3176j1883r932p373n185l994l293k109j12K163M028N220N841O125
61054G85602O433P220Q680J0456J1961J3015J4014J5487J7572J9941K2121K4008
61042I56510K6046K8697L1734L4433L6544L8558M0747M2530M3376M3771M4548
61031A367494M5756M7038M8706N1247N4039N5803N6381N6759N7274N7191N6433
61020A954121N6271N7770O0803O5285P1955Q1069R1572J02552J14443J27964J43391
61009B927196J62020J87014K21441K66920L25554M01386M98140O17741P63274
61000F370686R40339J151402J391672J656234J945833K249064K510131K627133
60992B0842494K505303K125112J560147R33173L62914n4486k47840j97426K5008
$$ plain form
61068 819282 806106 794223 784291 776918 771733 767739 764446 762337 762225 764388 768416 773636 779477 785602
61054 785602 792035 799255 807935 818391 830352 843367 857381 872868 890440 910381 932502 956510
61042 956510 982556 1011253 1042987 1077420 1113964 1152522 1193269 1235799 1279175 1322946 1367494
61031 1367494 1413250 1460288 1508994 1560241 1614280 1670083 1726464 1783223 1840497 1897688 1954121
61020 1954121 2010392 2068162 2128965 2194250 2266205 2347274 2438846 2541398 2655841 2783805 2927196
61009 2927196 3089216 3276230 3497671 3764591 4090145 4491531 4989671 5607412 6370686
61000 6370686 7311025 8462427 9854099 11510333 13456166 15705230 18215361 20842494
60992 20842494 23347797 25472909 27033056 27966229 28329143 28274657 28026817 27829391 27854399
60983B7854399K60118L33597J46729k87366q75373j496498k035692k401831k548704
60974A8949379k490085k287302k013268j722694j446618j200963r92286q19305
60966E976858o76561n59228m63979l87209l25292k76154k38447k09487j85773
60957B654728j65381j48149j33640j20436j07552r5161q3706p3329o4337n7244
60947A605793n2175m8886m7329m7367m8011m7838m6307m4051m1840l9898l8154
60936A103937l6455l4527l2339l0407k9186k8336k7194k5792k4666k3798k2630
60925G88607k1000j9272j7545j5643j3854j2852j2640j2432j1689j0569r201p432
60913F24478n544m342m068l915l092j806q03m00l80l61N6J029K041K223J419M81
$$ plain form
60983 27854399 28114517 28448114 28594843 28307477 27432104 25935606 23899914 21498083 18949379
60974 18949379 16459294 14171992 12158724 10436030 8989412 7788449 6796163 5976858
60966 5976858 5300297 4741069 4277090 3889881 3564589 3288435 3049988 2840501 2654728
60957 2654728 2489347 2341198 2207558 2087122 1979570 1884409 1800703 1727374 1663037 1605793
60947 1605793 1553618 1504732 1457403 1410036 1362025 1314187 1267880 1223829 1181989 1142091 1103937
60936 1103937 1067482 1032955 1000616 970209 941023 912687 885493 859701 835035 811237 788607
60925 788607 767607 748335 730790 715147 701293 688441 675801 663369 651680 641111 631910 624478
60913 624478 618934 614592 610524 606609 603517 601711 600908 600508 600128 599767 599823 600852 602893 605116 606535 607016
60897F07016K00M23N55L27l38j539k956l713l363k650k603l194l605l563l593
60882E77404m027m504m666m686m873n091m909m192l460l628n111o973p437n757
60868E08090l312k099k361k589j805p40k94N1J321L278M658M962M862M821M403
60853E23246L339K387K405L123L581L481L470M119N183N991O072N298L738J630
60839E77063n76k375l433l807l889m032m110l719k874k134j760j228p2J138J415
60824E45607P18k5l20n89j174j692j855k135k951l800l909l384k955k937l153
60809E15446l690m815o109o509n579m099l106k748k499k088j727j552j378j050
60795D68497q01r85j527j818j348l46M27N86N22P29J045R70N99O65J499K412K481
$$ plain form
60897 607016 607216 607639 608194 608521 608183 606644 603688 599975 596612 593962 591359 588165 584560 580997 577404
60882 577404 573377 568873 564207 559521 554648 549557 544648 540456 536996 533368 528257 521284 513847 508090
60868 508090 504778 502679 500318 497729 495924 495184 494890 494941 496262 499540 504198 509160 514022 518843 523246
60853 523246 526585 528972 531377 534500 538081 541562 545032 549151 554334 560325 566397 571695 575433 577063
60839 577063 576487 574112 570679 566872 562983 558951 554841 551122 548248 546114 544354 543126 543054 544192 545607
60824 545607 546325 546300 545980 545391 544217 542525 540670 538535 535584 531784 527875 524491 521536 518599 515446
60809 515446 511756 506941 500832 494323 488744 484645 481539 478791 476292 474204 472477 470925 469547 468497
60795 468497 467696 466711 465184 463366 462018 461672 462099 462685 463207 463936 464981 465951 466550 467215 468714 471126 473607
60778D73607J735J119J330K053K537K662L034M037N218N855N930O077O630P171
60764E28995P238P065P248P802P998P169N459L637K338J705J669K261L370M339
60750E98293M308L183J950J614K047K331K052J676J645J707J352M16r69k576l976
60735F15053m584m261l509k933k681k642k680k501j659j51J386K368K802K907
60721E96915K703K397K624L717N098O028O625P512Q702R620J0039J0345J0856
60708F83181J1503J2174J2839J3375J3785J4460J5667J6838J7108J6501J5963
60697H43394J6076J6430J6370J5804J5038J4303J3649J2873J1475R148O470M468
60685I95498L379K373P12j359l201m621n742o502o850p196q146r755j1416j2431
$$ plain form
60778 473607 475342 476461 477791 479844 482381 485043 488077 492114 497332 503187 509117 515194 521824 528995
60764 528995 536233 543298 550546 558348 566346 573515 578974 582611 584949 586654 588323 590584 593954 598293
60750 598293 602601 605784 607734 609348 611395 613726 615778 617454 619099 620806 622158 622574 621605 619029 615053
60735 615053 610469 606208 602699 599766 597085 594443 591763 589262 587603 587452 588838 591206 594008 596915
60721 596915 599618 602015 604639 608356 613454 619482 626107 633619 642321 651941 661980 672325 683181
60708 683181 694684 706858 719697 733072 746857 761317 776984 793822 810930 827431 843394
60697 843394 859470 875900 892270 908074 923112 937415 951064 963937 975412 984560 991030 995498
60685 995498 998877 1001250 1001962 1000603 997402 992781 987039 980537 973687 966491 958345 948590 937174 924743
60671I24743j2681j2743j3324j4451j5331j5289j4667j4347j4526j4637j4430
60660G68317j4306j4343j3878j2621j1423j1151j1279j0512q655o915o251o134
60648F40849n392l792k281j777k133k485k410k391l033m174n094n437n452n381
60634E89617n129m651m161l705k964j812o67R4P03J475K045J729N87m08m73J52
60618E72432N91L01m87j129j242j104j398k454l798m571m363l582k964k937l414
60603E39881l988m239m004l506l146l073l010k629k043j737j904k103j765r52
60589E01782k48J2k3l28j276k907m346m566l629k614k297k370k108j315m07K36
60573D73596O63J258K303L657M890N836O814Q098R424J0382J1049J1756J2291
$$ plain form
60671 924743 912062 899319 885995 871544 856213 840924 826257 811910 797384 782747 768317
60660 768317 754011 739668 725790 713169 701746 690595 679316 668804 660149 653234 646983 640849
60648 640849 635457 631665 629384 627607 625474 622989 620579 618188 615155 610981 605887 600450 594998 589617
60634 589617 584488 579837 575676 571971 569007 567195 566528 566622 567325 568800 570845 572574 573161 572753 572280 572432
60618 572432 573023 573324 572837 571708 570466 569362 567964 565510 561712 557141 552778 549196 546232 543295 539881
60603 539881 535893 531654 527650 524144 520998 517925 514915 512286 510243 508506 506602 504499 502734 501782
60589 501782 501534 501546 501523 501195 499919 497012 492666 488100 484471 481857 479560 477190 475082 473767 473360 473596
60573 473596 474259 475517 477820 481477 486367 492203 499017 507115 516539 526921 537970 549726 562017
60560E62017J2021J0758Q964O905M310J097k096m522o036o875p092o661n821m836
60546E62133l598j851L13K466M326N897P220Q242Q871R087Q971Q698Q294P450
60532F36519N846L706J661k9j639l178l992l651k831k564k822k584j351P9O94
60517F23864N43M73Q90J394J640J872K342K664K326J576J163J226J179Q94J217
60502F45263K797N102P342R849J3574J8481K3498K8007L2390L6892M0933M3886
60490I08014M5630M5822M3485L7965K9717J9528P629n621j8655k9424l7117m2436
60478A004537m6094m7770m6854m3699l9599l5635l1897k7918k3726k0103j7768
60467F23474j6554j5740j4839j3721j2232j0422q919q350q344p886o770n775n305
$$ plain form
60560 562017 574038 584796 593760 600665 604975 606072 603976 599454 593418 586543 579451 572790 566969 562133
60546 562133 558535 556684 556997 559463 563789 569686 576906 585148 594019 603106 612077 620775 629069 636519
60532 636519 642365 646071 647732 647703 646064 642886 638894 635243 632412 629848 627026 624442 623091 623170 623864
60517 623864 624407 624880 625770 627164 628804 630676 633018 635682 638008 639584 640747 641973 643152 644046 645263
60502 645263 648060 653162 660504 670353 683927 702408 725906 753913 786303 823195 864128 908014
60490 908014 953644 999466 1042951 1080916 1110633 1130161 1137790 1132169 1113514 1084090 1046973 1004537
60478 1004537 958443 910673 863819 820120 780521 744886 712989 685071 661345 641242 623474
60467 623474 606920 591180 576341 562620 550388 539966 531047 522697 514353 506467 499697 493922 488617
60454D88617m785l859l113l045l146k838k482k609k824k480j885j746j819j220
60440D50766N4J022J092O51K57M0n0j73p25j849k804k674j685j001j119j330j036
60423D39436o08n69o75m40OK45L65Q69J878K857L191K730J821R26K24l44p09n91
60405D50612M0O72P88N65O23J126J591J562J068M04j98n53m86J12J239K667L766
60388D65598L799K777J692J483K040K657L013L111K744J812J005J148J938K279
60374D97096J854J430J534J858K147K614L052K667J370L33M57J131J304J059J087
60359E20993J233P92ql3J102K345K589K020J731K386L719N046N929O375O653P087
60343E69959P944R421J1422J3375J4458J4243J2863J0510P063K541k268o140q414
$$ plain form
60454 488617 483832 479973 476860 473815 470669 467831 465349 462740 459916 457436 455551 453805 451986 450766
60440 450766 450820 451842 452934 453585 453842 453882 453832 453659 452934 451085 448281 445607 443922 442921 441802 440472 439436
60423 439436 438828 438259 437584 437144 437150 437395 437760 438629 440507 443364 446555 449285 451106 452032 452256 451912 451203 450612
60405 450612 450652 451324 452112 452677 453300 454426 456017 457579 458647 459051 458853 458300 457814 457926 459165 461832 465598
60388 465598 469397 472174 473866 475349 477389 480046 483059 486170 488914 490726 491731 492879 494817 497096
60374 497096 498950 500380 501914 503772 505919 508533 511585 514252 515622 515955 516412 517543 518847 519906 520993
60359 520993 522226 523018 523010 522977 524079 526424 529013 531033 532764 535150 538869 543915 549844 556219 562872 569959
60343 569959 577903 587324 598746 612121 626579 640822 653685 664195 671258 673799 671531 665391 656977
60330F56977r451j0118j0906j1576j1508j0398q652p029n937n192m463l659k821
60317E55267j953j187q27r24j036p05n6M18N88Q94J846L583N884Q328J0410J1840
60301E92370J2890J4178J5874J7199J6960J4659J0863O486J944k748p159j0206
60289F83310j0963r611p252m834k470K18L252N940P244O550M148R66k187n093
60275F69218p821j0224j2021j3227j4123j4687j4394j2851j0450q174o759o203
60263E38284o070o019n887n440m417k983j869j680k184k544k261j511o50J22N65
60248D95456M21q2k67J56P28J026J296J849K337K221J625J070O61K08j65j62J53
60231E08531N99J436K850M248M857M886N104N445N094M022L170K848K271J141
$$ plain form
60330 656977 647526 637408 626502 614926 603418 593020 584368 577339 571402 566210 561747 558088 555267
60317 555267 553314 552127 551300 550376 549340 548635 548579 548997 549585 550479 552325 555908 561792 570120 580530 592370
60301 592370 605260 619438 635312 652511 669471 684130 694993 701479 703423 700675 693516 683310
60289 683310 672347 662736 655484 650650 648180 648398 651650 657590 664834 671384 675532 676498 674311 669218
60275 669218 661397 651173 639152 625925 611802 597115 582721 569870 559420 551246 544487 538284
60263 538284 532214 526195 520308 514868 510451 507468 505599 503919 501735 499191 496930 495419 494769 494891 495456
60248 495456 495877 495795 495528 495684 496412 497438 498734 500583 502920 505141 506766 507836 508497 508705 508540 508378 508531
60231 508531 509130 510566 513416 517664 522521 527407 532511 537956 543050 547072 550242 553090 555361 556502
60217E56502N15J177K283K706K861L974N934P304P379O996P137P717Q169Q413
60203F29067Q597Q429P526O190N236M929M631L820K955K869L393L399K364J188
60189F94593Q62R25J29j661l217l695l590l715m115m500m983n644n980n500m591
60174F45318m076m161m419m524m417l917k887j707r94p21k12Q70K008K513K282
60159F20956J687J013L94P5L06R83J672K024K042J761J117L56L06J617L678M941
60143F44928M680L860L796M504N128N541O481Q175R817J0682J0939J1000J0787
60130G40318J0053Q840P196M940K183l81k132l135l776m137m132l875l517k946
60116G45499k013q46K33Q93Q14L5o68l51Q25J541R03n36j768k652l585m445m745
$$ plain form
60217 556502 557017 558194 560477 563183 566044 570018 575952 583256 590635 597631 604768 612485 620654 629067
60203 629067 637664 646093 653619 659809 665045 669974 674605 678425 681380 684249 687642 691041 693405 694593
60189 694593 695455 696380 696509 694848 691631 687936 684346 680631 676516 672016 667033 661389 655409 649909 645318
60174 645318 641242 637081 632662 628138 623721 619804 616917 615210 614216 613495 613283 614153 616161 618674 620956
60159 620956 622643 623656 624050 624125 624431 625414 627086 629110 631152 632913 634030 634386 634692 636309 639987 644928
60143 644928 649608 653468 657264 661768 666896 672437 678918 687093 696910 707592 718531 729531 740318
60130 740318 750371 759211 766407 771347 773530 773149 771017 767882 764106 759969 755837 751962 748445 745499
60116 745499 743486 742640 742873 743766 744580 744615 743947 743596 744421 745962 746865 746329 744561 741909 738324 733879 729134
60099G29134m575m590n072n618n723n200m154k874j714p34L79J728K943L773M573
60084G02276N662O617O826O512O522P158P839P872P061N558L657J735Mj740l845
60069G69714o291q712j0729j2026j2235j1286r751q499p950p842p698p240o554
60056F52901n952n647n441n022m540m454m700m591l813k856k092j122L87J897
60042F04955K831L639N092O912Q023Q011P506P145O937O593N870M571K764R77
60028F81826l60j460k741m095n216o307p725r228j0296j0965j1510j1614j0781
60015E89528r450q664q633q604q132p459o533m853k643j071p49q82n24J27L09
60000E21767k7k35O2O67J227J575J793K194K996L875M266M154M148M544M862M622
$$ plain form
60099 729134 724559 719969 714897 709279 703556 698356 694202 691328 689614 688880 689259 690987 693930 697703 702276
60084 702276 707938 714555 721381 727893 734415 741573 749412 757284 764345 769903 773560 775295 775299 773559 769714
60069 769714 763423 754711 743982 731956 719721 708435 698684 690185 682235 674393 666695 659455 652901
60056 652901 646949 641302 635861 630839 626299 621845 617145 612554 608741 605885 603793 602671 603058 604955
60042 604955 607786 611425 616517 623429 631452 639463 646969 654114 661051 667644 673514 678085 680849 681826
60028 681826 681466 680006 677265 673170 667954 661647 653922 644694 634398 623433 611923 600309 589528
60015 589528 580078 571414 562781 554177 546045 538586 532053 527200 524557 523486 522737 521855 521331 521458 521767
60000 521767 521740 521505 521567 522234 523461 525036 526829 529023 532019 535894 540160 544314 548462 553006 557868 562490
59984E62490M097L863L950L868L272K290J209J42j024k371l631m269m022l280
59970E66584k610k138j654j085m54L77J382K075K147K140K779L796M279M017L623
59955E85258L344K819K080J698J609R25n71j769j786j269j348j977k282k115k187
59940E82429k863l615l833l622l572m022m671m928m617m183m059m023l561k633
59926E28227j573m75N83J014L81m75j31J431K665K661K255K409K734K523K142
59911E46371K351L026L669M476N717O712O598N769N259N061M293K893J874J770
59897F05839J987J933J797J857J957J989K233K845L576M237M875N344N396N428
59883F51293O343Q248R895J0028Q797P358O409N764N104M503M147L874L201J725
$$ plain form
59984 562490 566587 570450 574400 578268 581540 583830 585039 585181 584157 581786 578155 573886 569864 566584
59970 566584 563974 561836 560182 559097 558643 559020 560402 562477 564624 566764 569543 573339 577618 581635 585258
59955 585258 588602 591421 593501 595199 596808 597733 597162 595393 593607 592338 590990 589013 586731 584616 582429
59940 582429 579566 575951 572118 568496 564924 560902 556231 551303 546686 542503 538444 534421 530860 528227
59926 528227 526654 526179 526762 527776 528157 527682 527551 528982 531647 534308 536563 538972 541706 544229 546371
59911 546371 548722 551748 555417 559893 565610 572322 578920 584689 589948 595009 599302 602195 604069 605839
59897 605839 607826 609759 611556 613413 615370 617359 619592 622437 626013 630250 635125 640469 645865 651293
59883 651293 657636 665884 675779 685807 694604 701962 708371 714135 719239 723742 727889 731763 734964 736689
59869G36689m71k768m473n520o532p981r449r978r194p748o555n854n283m641
59855F50242m172l968l525k279l94J382K660L865N598P827R878J1051J1049R945
59841F99159P962N353K463j85j988k588k080r19L25J066Q86j17j394k627m067
59826G01249n859p358p753p218o797p156p982q676r038r166r181r180r041q367
59812E88477p071n865n433n366m759l742l241l193k408o55N92K75o15o19N4K04
59796E46635l76j039j768l033m481n106m723m040l302k075n39K79m7o86p21k80
59780E14698O4K22M54P76R83R81P64L60l9j01K76Q75J421J719J592J073O15P59
59762E27492J493K338L002L593M226M816N296N670N855N775N569N448N521N980
$$ plain form
59869 736689 736218 733450 728977 723457 716925 708944 699495 689517 680323 672575 666020 660166 654883 650242
59855 650242 646070 642102 638577 636298 635904 637286 639946 643811 649409 657236 667114 678165 689214 699159
59841 699159 707121 712474 714937 714752 712764 710176 708096 707177 707502 708568 709454 709337 707943 705316 701249
59826 701249 695390 688032 680279 673061 666264 659108 651126 642450 633412 624246 615065 605885 596844 588477
59812 588477 581406 575541 570108 564742 559983 556241 553000 549807 547399 546744 547336 547611 546996 546377 546431 546635
59796 546635 546259 545220 543452 540419 535938 530832 526109 522069 518767 516692 516153 516432 516385 515699 514978 514698
59780 514698 514762 514984 515438 516214 517197 518178 518942 519302 519263 519162 519438 520313 521734 523453 525045 526118 526733 527492
59762 527492 528985 531323 534325 537918 542144 546960 552256 557926 563781 569556 575125 580573 586094 592074
59748E92074P100Q555R226Q372O788N911N938N760M747L544K839K335J477M52
59734F65118j78l33l19k98k93m72r11j326j401j231j116j102r86n99L3O69Q93
59717F56148M31m19r99j062r61r56p85l01k9n44j481j745p88P31J693J639J020
59700F51592N49N20P36Q85Q55P85R38J504K309K781K437J418K26r73k389l747
59684F60426m128l108j567p15o63o27k53J1j99p42j436k264k934l000k573k361
59668F33867k722l269l644m116m982n866o049n288l980k747k019j805j722j390
59654E84268q14j26Q88K471M106M773M187L195K648K409J799N70r62k343l195
59639F03874l332l046k927l161l260k772j791o02P18J908K375J885J030M62J22
$$ plain form
59748 592074 599174 607729 616955 625327 632115 638026 643964 649724 654471 658015 660854 663189 664666 665118
59734 665118 664940 664607 664288 663990 663697 663225 662314 660988 659587 658356 657240 656138 655152 654553 654586 655255 656148
59717 656148 656579 656160 655161 654099 653138 652182 651397 651096 651067 650523 649042 647297 646509 647240 648933 650572 651592
59700 651592 652141 652661 653397 654282 655137 655922 656860 658364 660673 663454 665891 667309 667535 666562 664173 660426
59684 660426 656298 653190 651623 650908 650245 649618 649365 649376 649177 648435 646999 644735 641801 638801 636228 633867
59668 633867 631145 627876 624232 620116 615134 609268 603219 597931 593951 591204 589185 587380 585658 584268
59654 584268 583454 583328 584216 586687 590793 595566 599753 602948 605596 608005 609804 610374 609412 607069 603874
59639 603874 600542 597496 594569 591408 588148 585376 583585 582983 583701 585609 587984 589869 590899 591361 591483
59624E91483j93l0J073K403K536J100p33j736j842j694j621j650j955k628l178
59609E81335k858j607k02O97J277K060K963L337K954K413K283K238J532J62j004
59594E97580j308j017q29r94j242j252r83p30r48j804k764l022k468j963k255
59579E74001l004l251k708k106k244l022l589l290k344j599j560j835j616p10
59565E41123K94Q41J011J181J482J872K400L020L400L236K622J824R47J14k88
59550E65079K8P74J391J724J999K303K545K949L977N674P558R354J1440J4256
59536F31051J7558K0476K2091K1705J8883J3758P358J324k924m767m400k498P5
59523G39690K615M877P027R094J0565J0726R440P339N121K808l7l538p208j0415
$$ plain form
59624 591483 591290 591260 592333 594736 597272 598372 597639 595903 594061 592367 590746 589096 587141 584513 581335
59609 581335 578477 576870 576668 577365 578642 580702 583665 587002 589956 592369 594652 596890 598422 598584 597580
59594 597580 596272 595255 594426 593432 592190 590938 589955 589225 588277 586473 583709 580687 578219 576256 574001
59579 574001 570997 567746 565038 562932 560688 557666 554077 550787 548443 546844 545284 543449 541833 541123
59565 541123 541417 542258 543269 544450 545932 547804 550204 553224 556624 559860 562482 564306 565253 565367 565079
59550 565079 565107 565881 567272 568996 570995 573298 575843 578792 582769 588443 596001 605355 616795 631051
59536 631051 648609 669085 691176 712881 731764 745522 752880 754204 751280 746513 742113 739615 739690
59523 739690 742305 747182 754209 763303 773868 784594 794034 801373 806494 809302 809265 805727 798519 788104
59509G88104j2806j4260j4779j4617j4250j3925j3386j2318j0891r546q330o875
59497F42121n108l594k906k887k823k223j203j35P41J356J764K184K894L942N087
59482F39210O169P384Q919J0494J1645J2382J3284J4736J6390J7533J7785J7161
59470G93092J5668J3130R463N010N51k984m946n219m094j928R37M036O897R461
59456H39074J2093J5139J8549K2057K5397K8272L0473L2244L4075L5893L6825
59445A130091L6032L3292K8350K0353Q817n002j8481k9457l7129m1380m2128l9737
59433A043621l5468l1050k7777k5980k4975k3628k1381j8703j6206j3546r849
59422G95058n077j11M538R192J3961J8233K1711K5036K8680L2002L4227L5603
$$ plain form
59509 788104 775298 761038 746259 731642 717392 703467 690081 677763 666872 657326 648996 642121
59497 642121 637013 633419 630513 627626 624803 622580 621377 621242 621983 623339 625103 627287 630181 634123 639210
59482 639210 645379 652763 661682 672176 683821 696203 709487 724223 740613 758146 775931 793092
59470 793092 808760 821890 831353 836363 836914 833930 828984 823765 819671 817743 818680 822716 829613 839074
59456 839074 851167 866306 884855 906912 932309 960581 991054 1023298 1057373 1093266 1130091
59445 1130091 1166123 1199415 1227765 1248118 1256935 1251933 1233452 1203995 1166866 1125486 1083358 1043621
59433 1043621 1008153 977103 949326 923346 898371 874743 853362 834659 818453 804907 795058
59422 795058 789981 789870 794408 803600 817561 835794 857505 882541 911221 943223 977450 1013053
59410A013053L6461L5545L0617K0839P749o150j8735k8173l2847l2297k7680k0654
59398I77728j2298l736K777M635R36o863j6349k5559l2956l7131l7431l4600l0177
59385G48976k5344k0736j6966j4444j2781j1065r005p157n889m783l426k103j262
59372F14015q36n94o84j075j005J72J822K639K425K356L331M832N849O246O694
59357F46187P653Q925J0116J1135J2218J3645J5516J7761K0339K3184K5926K7976
59345H40581K9114K9787L0395L0645L0007K8572K6804K4548K1031J5950R985M047
59333A121466j525o768j1608j5869j9542k2795k5713k8049k9188k8597k6579k4299
59321H80934k2692k1578k0206j8400j6535j4735j2786j0757r036p755o757o026
$$ plain form
59410 1013053 1049514 1085059 1115676 1136515 1144264 1138114 1119379 1091206 1058359 1026062 998382 977728
59398 977728 965430 961694 964471 969106 970042 963179 946830 921271 888315 851184 813753 779153 748976
59385 748976 723632 702896 685930 671486 658705 647640 638635 631478 625589 620806 617380 615277 614015
59372 614015 613179 612585 611901 610826 609821 609993 611815 614454 616879 619235 622566 627398 633247 639493 646187
59357 646187 653840 662765 672881 684016 696234 709879 725395 743156 763495 786679 812605 840581
59345 840581 869695 899482 929877 960522 990529 1019101 1045905 1070453 1091484 1107434 1117419 1121466
59333 1121466 1119941 1113173 1101565 1085696 1066154 1043359 1017646 989597 960409 931812 905233 880934
59321 880934 858242 836664 816458 798058 781523 766788 754002 743245 734209 726454 719697 713671
59309G13671n522m783l408j780n38N33K175M386O481Q345J0510J2962J5089J6970
59295G75091J9262K1353K1006J6719R442J238o619j3381j7802j8841j7040j4122
59283G76306j1335q876o512m042j369J357L833O161Q867J2040J5021J7281J8952
59270H27684K0135K0573K0493K0795K1612K1604J9652J6368J2965R373M722q98
59258A015078o446j1306j5492j8726k0570k1295k1585k1446k0434j8766j7213
59247H21799j5923j4390j2463j0399q012m881j475J026K240K997M053N329O641
59234G76542Q241J0143J1638J1953J0945Q892O053K763n07l393n839p997j0198
59221H19236j2732j5341j7221j7936j7993j7893j7161j5185j2588j0720r856r002
$$ plain form
59309 713671 708149 703366 699958 698178 697640 698173 700348 704734 711215 719560 730070 743032 758121 775091
59295 775091 794353 815706 836712 853431 862873 864111 857492 844111 826309 807468 790428 776306
59283 776306 764971 756095 749583 745541 744172 745529 749362 755523 764390 776430 791451 808732 827684
59270 827684 847819 868392 888885 909680 931292 952896 972548 988916 1001881 1011254 1015976 1015078
59258 1015078 1008632 997326 981834 963108 942538 921243 899658 878212 857778 839012 821799
59247 821799 805876 791486 779023 768624 760612 755731 754256 755282 757522 760519 764572 769901 776542
59234 776542 784783 794926 806564 818517 829462 838354 844407 847170 846663 843270 837431 829434 819236
59221 819236 806504 791163 773942 756006 738013 720120 702959 687774 675186 664466 654610 645608
59209F45608p566o129n354n005m465l530k392j325n96k32J16O54R90P78M56O00
59193F12608Q94P48N72J157K056K113J627K286M541O686P317P148P419P952Q034
59178F73158Q105R025J0326J0718R991R181R032R380R946J0653J1188J1136J0732
59165H02571J0814J1873J3610J5322J6185J5404J2764R060N455K409l85l191n946
59152I05945q690j1540j4205j6111j7040j7223j6827j5907j4881j4308j4031j3179
59140G32003j1347r257p806o949o030m902m060l765l586k997j994r20P1J055J983
59125F71499K655L071L600M607O026P389Q301Q767R110R668J0496J1309J1713
59112G68211J1591J1287J1218J1329J0991R648P531N585M541M178L674K651J559
$$ plain form
59209 645608 638042 631913 626559 621554 617089 613559 611167 609842 609246 609014 609130 609784 610774 611552 612008 612608
59193 612608 613502 614250 614822 615979 618035 620148 621775 624061 628602 635288 642605 649753 657172 665124 673158
59178 673158 681263 690288 700614 711332 721323 730504 739536 748916 758862 769515 780703 791839 802571
59165 802571 813385 825258 838868 854190 870375 885779 898543 907603 913058 915467 915082 911891 905945
59152 905945 897255 885715 871510 855399 838359 821136 804309 788402 773521 759213 745182 732003
59140 732003 720656 711399 703593 696644 690614 685712 681652 677887 674301 671304 669310 668390 668461 669516 671499
59125 671499 674154 677225 680825 685432 691458 698847 707148 715915 725025 734693 745189 756498 768211
59112 768211 779802 791089 802307 813636 824627 834275 841806 847391 851932 856110 859784 862435 863994
59099H63994Q60K65q45k438l830m584m866m864m436l576k746k350k216k020j906
59084H24442k295l258m438n504o411p302q317r430j0365j0865j1054j1251j1363
59071G22589j0957j0002r022q279p435o277n239m631l999k817j437o83q88j765
59057F49158k907l836m035l528l054l075l078k514j829j689j736j187l56l38j228
59042F14768j857j431m15M80J183J751J929J772K045L345N138O170N792M634M044
59027F49348M914O903Q884J0208J1236J2530J3948J4982J5492J5540J4937J3560
59015G92482J1798J0037Q028N398K423l56k818m896o047o028n623n519m984k880
59001G91015L74L250N231P044Q878R918R899R594R553R508R280Q998Q292O551
$$ plain form
59099 863994 864854 865119 864274 861836 858006 853422 848556 843692 839256 835680 832934 830584 828368 826348 824442
59084 824442 822147 818889 814451 808947 802536 795234 786917 777487 767122 756257 745203 733952 722589
59071 722589 711632 701630 692608 684329 676894 670617 665378 660747 656748 653931 652494 651811 650923 649158
59057 649158 646251 642415 638380 634852 631798 628723 625645 623131 621302 619613 617877 616690 616334 615996 614768
59042 614768 612911 611480 611065 611545 612728 614479 616408 618180 620225 623570 628708 634878 640670 645304 649348
59027 649348 654262 661165 670049 680257 691493 704023 717971 732953 748445 763985 778922 792482
59015 792482 804280 814317 822345 827743 830166 829810 826992 822096 816049 810021 804398 798879 793895 791015
59001 791015 791389 794639 799870 806914 815792 825710 835609 845203 854756 864264 873544 882542 890834 897385
58987H97385M288K740J917M89k007m433o059p548r220r966q975p037m985k230
58973H44359J762N816Q486J0225J2498J5340J7371J7966J7952J8206J8696J9015
58961A007692J8965J8508J7624J6207J3817R999N120K42m201q812j3849j8338
58949A062974k1375k3345k4881k5536k4690k3007k1583k0207j7870j4682j1849
58938H33949r839p944n813m100l240k691j919j333j618k648l530l514k658j719
58924G81383j487k003k558k579k299k265k529k715k641k315j610m30Q51J654J911
58909G60368K188L108M866P116R140J0390J1086J2115J4053J6526J8669J9936
58897H89561K0295K0044J9657J9410J9049J8231J7499J8089K0472K3658K6450
$$ plain form
58987 897385 901673 904413 906330 906819 904812 900379 894320 886772 877552 867586 858611 851574 846589 844359
58973 844359 846121 851937 860423 870648 883146 898486 915857 933823 951775 969981 988677 1007692
58961 1007692 1026657 1045165 1062789 1078996 1092813 1102812 1107932 1108174 1103973 1095161 1081312 1062974
58949 1062974 1041599 1018254 993373 967837 943147 920140 898557 878350 860480 845798 833949
58938 833949 824110 816166 810353 806253 803013 800322 798403 797070 795452 792804 789274 785760 783102 781383
58924 781383 779896 777893 775335 772756 770457 768192 765663 762948 760307 757992 756382 755952 756803 758457 760368
58909 760368 762556 765664 770530 777646 786786 797176 808262 820377 834430 850956 869625 889561
58897 889561 909856 929900 949557 968967 988016 1006247 1023746 1041835 1062307 1085965 1112415
58886A112415K8747L1175L3847L6005L6528L4537K9961K3913J7845J2039N480
58875A402492k393j0577j7634k3234k7914l1953l5065l6764l6523l4174l0551
58864A115710k7073k4200k1179j7798j5281j4564j4669j4015j2538j1401j1181
58853I31811j1592j2424j3457j3771j2529j0318q604p873p416o838o654p222q065
58840H05048q597q821r079r586j0244j0639j0285r251q213p490o535m946l362
58827F98000k571k264j590n53J71N64J300K482L442L854M207M967N942O655O844
58812G31450O468N698M906M316L740K930J975J061J68o54j188j568k304l413m168
58797G49417m242m312m882n370n196m959n397n948n550m345l325k691j824n83
$$ plain form
58886 1112415 1141162 1172337 1206184 1242189 1278717 1313254 1343215 1367128 1384973 1397012 1402492
58875 1402492 1400099 1389522 1371888 1348654 1320740 1288787 1253722 1216958 1180435 1146261 1115710
58864 1115710 1088637 1064437 1043258 1025460 1010179 995615 980946 966931 954393 942992 931811
58853 931811 920219 907795 894338 880567 868038 857720 849116 841243 833827 826989 820335 813113 805048
58840 805048 796451 787630 778551 768965 758721 748082 737797 728546 720333 712843 706308 701362 698000
58827 698000 695429 693165 691575 691022 691193 691757 693057 695539 698981 702835 707042 712009 717951 724606 731450
58812 731450 737918 743616 748522 752838 756578 759508 761483 762544 762712 762058 760870 759302 756998 753585 749417
58797 749417 745175 740863 735981 730611 725415 720456 715059 709111 703561 699216 695891 693200 691376 690793
58783F90793O28J866L450M904N338M906M717N204N564M974L409J220j200l351
58769G32422m880n980o829p001o140m874m083l671l046k459k527k755j899R6J863
58754F78237K512K610L028L857M787N598N940N429M311L390L196L688M732O125
58740G37440P267P633P480P482P742P906P917P866P484O638O060O474P354P623
58726H40366P306P256P474P080N990N166N100N221N084N034N399O021O797P818
58712I27112Q831R374R480R377Q678O829M244J849l83l235o630r634j2118j5039
58698I38735j8709k2013k3819k4164k3696k2891k2019k1039j9325j6396j3005
58687G11659j0544r343q552p721p318p590q015q136p970p505o756o216o233n996
$$ plain form
58783 690793 691421 693287 696737 701641 706979 711885 716602 721806 727370 732344 735753 736973 735773 732422
58769 732422 727542 721562 714733 707732 701592 696718 692635 688964 685918 683459 680932 678177 676278 676374 678237
58754 678237 680749 683359 686387 690244 695031 700629 706569 711998 716309 719699 722895 726583 731315 737440
58740 737440 744707 752340 759820 767302 775044 782950 790867 798733 806217 812855 818915 825389 832743 840366
58726 840366 847672 854928 862402 869482 875472 880638 885738 890959 896043 901077 906476 912497 919294 927112
58712 927112 935943 945317 954797 964174 972852 979681 983925 985774 985391 982156 975526 965892 953774 938735
58698 938735 920026 898013 874194 850030 826334 803443 781424 760385 741060 724664 711659
58687 711659 701115 691772 683220 675499 668181 660591 652576 644440 636470 628965 622209 615993 609760 603764
58673F03764m384j762L57J464K537M230O074P645R207J0872J2321J3548J4701
58660F80574J5062J3548J0403P085M283J525j140k720k991l111l931n000n655
58647G07932n868n593m637l588l486m209m533m029l448k906j461R69K951L599
58633F71693L660L846L666K815K149K243K317J597N62q0m62p35m38N03J315J790
58617F96441K929N244P698R335J0754J2815J4927J5814J5171J3568J1397Q819
58605H24912O143L545R34j470l149m191n212o173o379n942n918o601p006o513
58591G76980n652m749l238r05J603M057O977J0135J2311J3220J3978J4986J5086
58578H54789J3679J1978J1014J0207Q905P709P087O420N646O118Q360J0746J1920
$$ plain form
58673 603764 599380 597618 597975 599439 601976 606206 612280 619925 629132 640004 652325 665873 680574
58660 680574 695636 709184 719587 726672 730955 732480 731340 728620 725629 722518 718587 713587 707932
58647 707932 702064 696471 691834 688246 684760 680551 676018 671989 668541 665635 664174 665143 668094 671693
58633 671693 675353 679199 682865 685680 687829 690072 692389 693986 694548 694468 694006 693271 692833 693336 694651 696441
58617 696441 699370 704614 712312 721647 732401 745216 760143 775957 791128 804696 816093 824912
58605 824912 831055 834600 835534 834064 830915 826724 821512 815339 808960 803018 797100 790499 783493 776980
58591 776980 771328 766579 763341 762436 764039 768096 775073 785208 797519 810739 824717 839703 854789
58578 854789 868468 880446 891460 901667 910572 918281 925368 931788 937434 943552 951912 962658 974578
58565I74578J2975J5498J8991K1971K4314K6593K8257K8336K7107K5281K2388
58554A226289J7674J1850O420J821k349n993q757j0850j2351j2536j1196r786
58542A190236r848j1023j2064j3017j4964j8119k1534k4300k5933k6042k4647
58531I88745k2373j9633j6336j2859j0235q625o846m314k083r85j92J191K498
58518H87953K838K761L100L369K753J690J091R50R71J515K652L370L001K303K035
58503I22352J754J102P75R24K72j672l223l008k243k738m131n074n585o219o240
58488H87046m809k806j441k28J695L524M242M902P099J0297J2834J4641J6624
58475I53620J8276J8229J6517J4138J1082O872K237j780n492r381j2238j2746
$$ plain form
58565 974578 987553 1003051 1022042 1044013 1068327 1094920 1123177 1151513 1178620 1203901 1226289
58554 1226289 1243963 1255813 1262233 1264054 1261705 1255712 1246955 1236105 1223754 1211218 1200022 1190236
58542 1190236 1180388 1169365 1157301 1144284 1129320 1111201 1089667 1065367 1039434 1013392 988745
58531 988745 966372 946739 930403 917544 907309 898684 891838 887524 885441 884456 884264 885455 887953
58518 887953 890791 893552 896652 900021 902774 904464 905555 906505 907476 908991 911643 915013 918014 920317 922352
58503 922352 924106 925208 925983 926907 927179 925507 922284 919276 917033 914295 910164 905090 899505 893286 887046
58488 887046 882237 879431 877990 877762 879457 882981 887223 892125 899224 909521 922355 936996 953620
58475 953620 971896 990125 1006642 1020780 1031862 1038734 1040971 1039191 1033699 1024318 1012080 999334
58463I99334j1861j1345j0887r084o339m254k827p38K064M476O343Q250R801J0213
58449I83146R930R444P514L028k295n726p258q796j0432j0587r302q284p736o187
58435I36459l539j430l16J152L437N332O233P049Q356R676J0823J2225J3730J4747
58421A023934J5443J6187J6192J4456J1480Q338M868O77l057n140o647r095j1371
58408A076265j1260r316q121q325q498q446r336j0645j0271p957n628m083k291
58395I72088j70Q98P77J057K185K788K301J797J693J030l39j091n73L31R19J451
58379I87142K095K715L706N421P103P946Q528R489R847Q701P331P282P723P342
58365A082371P386R623J2660J3754J3269J3696J5201J5880J5686J6109J6550J4958
$$ plain form
58463 999334 987473 976128 965241 956157 949818 945564 942737 941999 944063 948539 954882 963132 972933 983146
58449 983146 993076 1002520 1010034 1013062 1010767 1005041 997783 988987 978555 967968 958666 950382 942646 936459
58435 936459 932920 931490 931174 932326 935763 941095 947328 954377 962733 972409 983232 995457 1009187 1023934
58421 1023934 1039377 1055564 1071756 1086212 1097692 1106030 1110898 1111575 1108518 1103378 1096731 1087636 1076265
58408 1076265 1065005 1055689 1047568 1039243 1030745 1022299 1012963 1002318 992047 984090 978462 974379 972088
58395 972088 971918 972816 973593 974650 976835 979623 981924 983721 985414 986444 986105 985014 984441 984772 985691 987142
58379 987142 989237 991952 995658 1001079 1008182 1016128 1024656 1034145 1043992 1052693 1060024 1067306 1075029 1082371
58365 1082371 1089757 1099380 1112040 1125794 1139063 1152759 1167960 1183840 1199526 1215635 1232185 1247143
58353A247143J1775R305P506M368K16k415l089l556l795k112Q43K503K954M764
58339A276410Q075J0247J0696J1661J3688J4848J4933J6016J8119J8773J7658
58328A431124J7254J8071J7615J5009J2329J0482Q095N307M222M758M454L239
58316A551959L768O181P414O765P184R702J1633J1808J2681J5381J7492J7655
58304A679623J7893J9460K0731K0898K1558K2946K2957K1310K0462K1057K0951
58293A909846J9763J9687K0844K0806J9769K0870K4241K6317K6262K7269L0078
58282B165752L1377L0380L0659L3351L4848L3573L2920L4830L6690L7129L8802
58271B540311M2669M5658M6730M9084N3661N6759N6890N7685O1148O4494O6418
$$ plain form
58353 1247143 1258918 1268223 1275729 1280097 1280313 1277898 1274809 1271253 1267458 1265346 1266189 1268692 1271646 1276410
58339 1276410 1284485 1294732 1305428 1317089 1330777 1345625 1360558 1376574 1394693 1413466 1431124
58328 1431124 1448378 1466449 1484064 1499073 1511402 1521884 1529979 1535286 1539508 1544266 1548720 1551959
58316 1551959 1555727 1561908 1569322 1576087 1583271 1592973 1604606 1616414 1629095 1644476 1661968 1679623
58304 1679623 1697516 1716976 1737707 1758605 1780163 1803109 1826066 1847376 1867838 1888895 1909846
58293 1909846 1929609 1949296 1970140 1990946 2010715 2031585 2055826 2082143 2108405 2135674 2165752
58282 2165752 2197129 2227509 2258168 2291519 2326367 2359940 2392860 2427690 2464380 2501509 2540311
58271 2540311 2582980 2628638 2675368 2724452 2778113 2834872 2891762 2949447 3010595 3075089 3141507
58260C141507O9817P5320P8989P9356P9944Q1926Q1696P8624P7569Q0354Q2694
58249D007796Q2886Q5373R1986R8241J02250J08620J19234J29041J35451J42931
58239E103809J53724J63425J70478J80241J94517K07273K16174K27821K45654
58230F863116K63543K77767K94170L16684L40152L61644L87228M20083M53929
58221I978316M85928N23527N70579O20042O68816P25778P96176Q73010R53501
58212A6195673J048239J163664J292466J432691J598788J801753K037536K308250
58204B8879060K634702L034468L510503M077308M775075N643385O709642Q021253
58196F7285396R657117J1687516J4156256J7110959K0584551K4508155K8701529
$$ plain form
58260 3141507 3211324 3286644 3365633 3444989 3524933 3606859 3688555 3767179 3844748 3925102 4007796
58249 4007796 4090682 4176055 4268041 4366282 4468532 4577152 4696386 4825427 4960878 5103809
58239 5103809 5257533 5420958 5591436 5771677 5966194 6173467 6389641 6617462 6863116
58230 6863116 7126659 7404426 7698596 8015280 8355432 8717076 9104304 9524387 9978316
58221 9978316 10464244 10987771 11558350 12178392 12847208 13572986 14369162 15242172 16195673
58212 16195673 17243912 18407576 19700042 21132733 22731521 24533274 26570810 28879060
58204 28879060 31513762 34548230 38058733 42136041 46911116 52554501 59264143 67285396
58196 67285396 76942513 88630029 102786285 119897244 140481795 164989950 193691479
58189A93691479L2961923L6992678M0064387M0839856L7857851L0439881J9203113
58182D32051168N782569p812425j9684318k8387545l3298326l4798761l3957767
58175B79894595l1895629k9365985k6753511k4220040k1776452j9350824j6918020
58168A09614134j4564502j2409019j0507147q860876p468889o321495n377820
58161D4104386m590218l936272l402816k960263k578565k251117j980053j753175
58153B0651907j555052j385760j249403j136731j035747r47221q74363q09040
58145A1658590p42591o79006o24044n72401n18391m68138m28309l93234l55833
58136F876643l21402k97897k81599k64677k48667k38434k30414k18476k04843
$$ plain form
58189 193691479 226653402 263646080 303710467 344550323 382408174 412848055 432051168
58182 432051168 437833737 430021312 410336994 381949449 348651123 313852362 279894595
58175 279894595 247998966 218632981 191879470 167659430 145882978 126532154 109614134
58168 109614134 95049632 82640613 72133466 63272590 55803701 49482206 44104386
58161 44104386 39514168 35577896 32175080 29214817 26636252 24385135 22405082 20651907
58153 20651907 19096855 17711095 16461692 15324961 14289214 13341993 12467630 11658590
58145 11658590 10915999 10236993 9612949 9040548 8522157 8054019 7625710 7232476 6876643
58136 6876643 6555241 6257344 5975745 5711068 5462401 5223967 4993553 4775077 4570234
58127D570234j94410j84584j70895j56539j46651j38892j29007j19746j15173
58118C214337j11832j04726r6679r2841r0975q5976p9350p5561p3279o8590o2991
58107B271537o0299n9191n6263n2932n2207n2168m9565m6355m5902m6246m3813
58096A706596m0382l9674m0231l8230l4471l2284l1241k8867k5947k4516k3392
58085A347361k0990j9524k1117k2977k1830j9799k0378k1963k1248j9784k0940
58074A116811k3181k2588j9779j8338j8402j7526j6005j5779j5858j4127j2004
58063I23224j2100j3038j1662q746p432p676p218o534p820j0352j1530j1412j1790
58050G95914j2187j1024r329r055r170p647n679n691o729o218m697m494n202m906
$$ plain form
58127 4570234 4375824 4191240 4020345 3863806 3717155 3578263 3449256 3329510 3214337
58118 3214337 3102505 2997779 2901100 2808259 2717284 2631308 2551958 2476397 2403118 2334528 2271537
58107 2271537 2211238 2152047 2095784 2042852 1990645 1938477 1888912 1842557 1796655 1750409 1706596
58096 1706596 1666214 1626540 1586309 1548079 1513608 1481324 1450083 1421216 1395269 1370753 1347361
58085 1347361 1326371 1306847 1285730 1262753 1240923 1221124 1200746 1178783 1157535 1137751 1116811
58074 1116811 1093630 1071042 1051263 1032925 1014523 996997 980992 965213 949355 935228 923224
58063 923224 911124 898086 886424 877678 870246 862570 855352 848818 840998 830646 819116 807704 795914
58050 795914 783727 772703 763374 754319 745149 737502 731823 726132 719403 713185 708488 703994 698792 693886
58036F93886m367n523p185o834n448o002q178r093q459q570r779j0308r993j0227
58022E83920j0601r471p405o483o618o042m776m219m101l182k128k364l031k452
58008E11047j490j996l084k566r91n11q02Q1J773K371K249L232M792M947M194
57993E23246M573N563M911K999K280K769K208N32R2J301J940J068R8k61p42j131
57977E51446m55M36k98k092k637j836j710k526k481j324q49j569k111k057k288
57962E27649k438j299K44m7k030l426l798m769o237o099m283l396m479n461m764
57947D75367l354k269j107J81P28P97J751L401M059L760M562O993R121R883J0494
57932E24367J1627J2087J1306J0488J0120Q809N786K385m7j727l174m384n827
$$ plain form
58036 693886 689519 683996 676811 669977 664529 658527 650349 641256 632797 624227 614448 604140 594147 583920
58022 583920 573319 563848 556443 549960 543342 537300 532524 528305 524204 521022 518894 516530 513499 511047
58008 511047 509557 507561 504477 501911 500920 500409 499607 499688 501461 503832 506081 509313 514105 519052 523246
57993 523246 527819 533382 538293 541292 543572 546341 548549 549081 549173 550474 552414 553482 553580 553319 552577 551446
57977 551446 550991 551427 551129 549037 546400 544564 542854 540328 537847 536523 535674 534105 531994 529937 527649
57962 527649 525211 523912 524156 524109 522079 518653 514855 510086 503849 497750 493467 490071 485592 480131 475367
57947 475367 472013 469744 468637 468818 469546 470343 472094 475495 479554 483314 487876 494869 503990 513873 524367
57932 524367 535994 548081 559387 569875 579995 588804 594590 596975 596928 595201 592027 587643 581816
57919E81816q225j0803j1839j1425j1483j2579j3115j2155j0720r638q458p105
57907D54271o376o118n127l407k417k611k972l280m423o068o578n801n331n444
57893C88318m491k159n17p84j556j453j000q12k00J096J965J850J639J678J087
57878C84661j42o17j37l88j955l059k566j842k165k562j911j047j021j149n33
57863C63567J51J20K22J524L464M945N953O812P118O748O692P528Q286P979P109
57848D38218O538O029N035L825K772J594J60r72j625k432l622m600n248o209p252
57833D32211p090n561m318m388m654l780k107o11N77J593K175K531L479M848N234
57818D20139M134K833K286J851J067Q84J892K908K648J358l27k604n331p174p314
$$ plain form
57919 581816 573591 562788 550949 539524 528041 515462 502347 490192 479472 469834 461376 454271
57907 454271 447895 441777 436650 433243 430826 428215 425243 421963 417540 411472 404894 399093 393762 388318
57893 388318 383827 381668 381151 380367 378811 377358 376358 375546 375346 376442 378407 380257 381896 383574 384661
57878 384661 384519 383902 383765 383377 381422 378363 375797 373955 371790 369228 367317 366270 365249 364100 363567
57863 363567 363718 363838 364060 365584 369048 373993 379946 386758 393876 400624 407316 414844 423130 431109 438218
57848 438218 444756 450785 455820 459645 462417 464011 464171 463199 461574 459142 455520 450920 445672 439463 432211
57833 432211 425121 419560 415242 410854 406200 402420 400313 399702 400279 401872 404047 406578 410057 414905 420139
57818 420139 424273 427106 429392 431243 432310 433194 435086 437994 440642 442000 441673 439069 433738 426564 419250
57803D19250o777o726o762o132n306m932m552l660k943l099l532l430l123l177
57789C55099l229k889k695l034l218k688k029j754j215P8J336J788J978K605L239
57774C43372L394L609M267M447L337J657M92k30r79j493j656k301l824n149n318
57759C43625n042n395o102o461o709p063o622m786k723j770j436n67M71N79J8
57744B90017o5L40L56p2k42j51l50p00n88j65j20n66j111j586j803j217J51J202
57726B83330J182R05J403K256K432J990J620J233L85n19q26q53j236j619j277
57711B90406m90j29k83n48j034j917k571k316j532r77n76l6J47m40j013o77R3
57694B76107L55L66Q73J505J402Q63P70Q95M37j92J76J538K844L810N053O635
$$ plain form
57803 419250 412473 405747 398985 392853 387547 382615 378063 374403 371460 368361 364829 361399 358276 355099
57789 355099 351870 348981 346286 343252 340034 337346 335317 333563 332348 332426 333762 335550 337528 340133 343372
57774 343372 346766 350375 354642 359089 362426 364083 364575 364345 363366 361873 360217 357916 354092 348943 343625
57759 343625 338583 333188 327086 320625 313916 306853 300231 295445 292722 290952 289516 288949 289420 289999 290017
57744 290017 289952 290292 290648 290576 290334 290183 289833 289133 288545 288380 288260 287694 286583 284997 283194 281977 282128 283330
57726 283330 284512 285417 286820 289076 291508 293498 295118 296351 296736 296217 295391 294538 293302 291683 290406
57711 290406 289916 289787 289504 288956 287922 286005 283434 281118 279586 278609 278033 277997 278144 277704 276691 276014 276107
57694 276107 276462 276828 277701 279206 280608 281471 282241 283136 283573 283381 283557 285095 287939 291749 296802 303437
57678C03437Q098R842J2884J7284K2234K7740L4664M3056N1972O0998P0339P8805
57666G41353Q3034P9439O6389M4606J6774j2845l9573o0068p2994p8276p6654
57655F91185o9980o0931n1795m3612l6396k9720k3305j7526j3259j0834r510q355
57643C15962p232o416n794n100m450l930l149j890o89j16j3q1n04j288j710j265
57627B72335n34k61k99k95o04j522k371k439k182k401k903k987k589j955r23L63
57611B48433R38L18n15o42o63j321j832j286o14j162k137j651J43J226P95K3k63
57594B39790n96j314j851j941k013k112j878j618k014k706k739k323k505l111
57580B11069k864j735j260k018k615j919p28l43p73j256j433j309q29j96J51K00
$$ plain form
57678 303437 311535 321377 334261 351545 373779 401519 436183 479239 531211 592209 662548 741353
57666 741353 824387 903826 970215 1014821 1031595 1018750 979177 919109 846115 767839 691185
57655 691185 621205 560274 508479 464867 428471 398751 375446 357920 344661 333827 324317 315962
57643 315962 308730 302314 296520 291420 286970 283040 279891 278001 277312 277196 277183 277102 276598 275310 273600 272335
57627 272335 271801 271540 271241 270946 270342 268820 266449 264010 261828 259427 256524 253537 250948 248993 248070 248433
57611 248433 249371 249689 249174 248532 247869 246548 244716 243430 242816 241654 239517 237866 238009 239235 240030 240053 239790
57594 239790 239194 237880 236029 234088 232075 229963 228085 226467 224453 221747 219008 216685 214180 211069
57580 211069 208205 206470 205210 203192 200577 198658 197930 197587 196814 195558 194125 192816 191987 191791 191942 192142
57564A92142L14L94l8q15j170r15o00m43j49J78J06r4L09J137J425J082J107J884
57546A95854K569K487J970J428Q11K99L54P53O75J50K09J209K215K400J965J210
57530B16558k4j411j892j098p0J09m07q75r76o97K4R27J377J193R07Q99R65R03
57512B16412Q76R43R74J124J642K156K002J288P38N09J81j97j58N2l29j188j607
57495B25418j473j650k344k638k101j493j427j542j455j395j478j426j350j621
57481B02025j793j019K53N13m70j173o95K4J2l31m78p92j353j268k47N37K37l36
57463A93646k52K0j36r8P20J454J090K01j03L2j01j52N64J482J497Q15N85J015
57445B02279J267R30L20m09j252j697j234l76n3k61l11r9p5j64J81R28J512J809
$$ plain form
57564 192142 192456 192850 192812 191997 190827 189912 189312 188869 188720 188898 189004 188910 189219 190356 191781 192863 193970 195854
57546 195854 198423 200910 202880 204308 205119 205418 205772 206525 207200 207350 207559 208768 210983 213383 215348 216558
57530 216558 216534 215123 213231 212133 212063 212172 211765 210890 209914 209217 209241 210168 211545 212738 213645 214544 215509 216412
57512 216412 217288 218231 219205 220329 221971 224127 226129 227417 228155 228664 228845 228648 228490 228542 228213 227025 225418
57495 225418 223945 222295 219951 217313 215212 213719 212292 210750 209295 207900 206422 204996 203646 202025
57481 202025 200232 199213 199466 199979 199509 198336 197641 197665 197677 197346 196868 196076 194723 193455 193208 193745 193982 193646
57463 193646 193394 193414 193278 193180 193900 195354 196444 196645 196542 196574 196473 196321 196885 198367 199864 200679 201264 202279
57445 202279 203546 204476 204796 204387 203135 201438 200204 199828 199775 199514 199203 199104 199029 198865 199046 199974 201486 203295
57427B03295K124K323J892Q39k44r15r82j86J315K431K128Q69Q0K26M07p5q05
57410B14722j153j157j089q70l77J10K65J53Q4J97M13O54Q81J002Q85N31K44N03
57392B15998J356K078J844Q79M13J240K706L443K843J563P88J101J898J930P50
57377B40830n55o47K58O41k17j404j890j794j608j163j79Q68J287J118Q77O99
57361B37121M26J49P6J22J10J34K40J65k33n73m25J48P98J238J228P10J59K21
57343B41814P28Q02J85l09r3L19K49p3q0K25N16O77N60j16j006j088p5Q78P22
57324B44835pj13M87R66J066J232J569J590J075M11J22M73J363K239K458K054
57308B61820J734J798J779J446J377J932K457K271J715J421J327J186J382K254
$$ plain form
57427 203295 205419 207742 209634 210473 210229 209314 208332 208146 209461 211892 214020 214889 214969 215195 215602 215527 214722
57410 214722 213569 212412 211323 210453 210076 210186 210451 210604 210688 210885 211298 211952 212833 213835 214720 215251 215495 215998
57392 215998 217354 219432 221276 222155 222568 223808 226514 229957 232800 234363 235151 236252 238150 240080 240830
57377 240830 240275 239628 239886 240527 240310 238906 237016 235222 233614 232451 232272 233140 234427 235545 236422 237121
57361 237121 237547 237696 237772 237894 238004 238138 238378 238543 238310 237737 237312 237460 238258 239496 240724 241434 241593 241814
57343 241814 242542 243344 243529 243220 243127 243446 243695 243622 243542 243767 244283 244960 245520 245404 244398 243310 243235 244113 244835
57324 244835 244828 244715 245202 246168 247234 248466 250035 251625 252700 253111 253233 253706 255069 257308 259766 261820
57308 261820 263554 265352 267131 268577 269954 271886 274343 276614 278329 279750 281077 282263 283645 285899
57294B85899L201L380K897K445K312K483L126M098M666M576M714N718O769O891
57280C43175O703P478R053J0162J0420J0522J0712J0626J0546J1276J2625J3334
57268D66632J2790J1651J0583R478Q130O679N130L396J957J570K080K397J918
57255E44391J177R04J180J755K461L120L563L876M188M315M119L982M254M546
57241E87831M317L937M230N198O122O747P328P751P663P495Q107R351J0102R886
57227F86065R407R227R009Q487Q159Q567R581J0781J1828J2289J1892J1203J1332
57214H17827J2599J4198J5352J6056J6428J6288J5732J5406J5674J6066J6008
57203I87634J5587J5293J5500J6369J7839J9455K0709K1695K2904K4327K5343
$$ plain form
57294 285899 289100 292480 295377 297822 300134 302617 305743 309841 314507 319083 323797 329515 336284 343175
57280 343175 349878 357356 366409 376571 386991 397513 408225 418851 429397 440673 453298 466632
57268 466632 479422 491073 501656 511134 519264 525943 531073 534469 536426 537996 540076 542473 544391
57255 544391 545568 546472 547652 549407 551868 554988 558551 562427 566615 570930 575049 579031 583285 587831
57241 587831 592148 596085 600315 605513 611635 618382 625710 633461 641124 648619 656726 666077 676179 686065
57227 686065 695472 704699 713708 722195 730354 738921 748502 759283 771111 783400 795292 806495 817827
57214 817827 830426 844624 859976 876032 892460 908748 924480 939886 955560 971626 987634
57203 987634 1003221 1018514 1034014 1050383 1068222 1087677 1108386 1130081 1152985 1177312 1202655
57192A202655K5631K5569K5582K5701K5901K6175K6109K5020K2818K0254J8167
57181A469582J6942J6669J7193J7949J8478J9245K1184K4352K7680L0306L2396
57170A711976L4465L6601L8650M0522M2010M2845M3153M3294M3260M2839M2388
57159B162003M2591M3350M3923M4353M5673M8263N0989N2612N3286N3915N4731
57148B695689N5240N5144N4622N3948N3306N2682N1746N0169M8262M6701M5488
57137C262997M3837M1332L8300L4672K9420K1944J3406N926Q94j340p32K561P838
57124C501055J4012J9903K4004K4619K1157J5115R085M980L688N886J2068K1630
57112C677202L2598M2528M9576N3385N5907O1186P3118R2830J18569J48114J80859
$$ plain form
57192 1202655 1228286 1253855 1279437 1305138 1331039 1357214 1383323 1408343 1431161 1451415 1469582
57181 1469582 1486524 1503193 1520386 1538335 1556813 1576058 1597242 1621594 1649274 1679580 1711976
57170 1711976 1746441 1783042 1821692 1862214 1904224 1947069 1990222 2033516 2076776 2119615 2162003
57159 2162003 2204594 2247944 2291867 2336220 2381893 2430156 2481145 2533757 2587043 2640958 2695689
57148 2695689 2750929 2806073 2860695 2914643 2967949 3020631 3072377 3122546 3170808 3217509 3262997
57137 3262997 3306834 3348166 3386466 3421138 3450558 3472502 3485908 3491834 3492728 3491388 3490656 3493217 3501055
57124 3501055 3515067 3534970 3558974 3583593 3604750 3619865 3628950 3633930 3637618 3643504 3655572 3677202
57112 3677202 3709800 3752328 3801904 3855289 3911196 3972382 4045500 4138330 4256899 4405013 4585872
57101D585872K17775K60638L11857L74284M50293N41187O47526P69271R04849
57092I063552J050329J199826J346134J480743J594616J680492J734451J754761
57084B0904904J740342J691193J607399J482920J300580J040099O97488K96049
57076C0760974j25350n35131r18593j268004j570099j806267j961651k031544
57068B0544335k021921j947584j828560j683990j527281j366573j208147j057478
57060G902801r18041p91494o79234n82345n00265m30965l72535l23499k82090
57051C022333k46663k16683j92131j72110j55216j40964j29567j20596j13170
57042A535233j07079j02327r7911r2492q6127p9787p3417o6139n8155n0721m4035
$$ plain form
57101 4585872 4803647 5064285 5376142 5750426 6200719 6741906 7389432 8158703 9063552
57092 9063552 10113881 11313707 12659841 14140584 15735200 17415692 19150143 20904904
57084 20904904 22645246 24336439 25943838 27426758 28727338 29767437 30464925 30760974
57076 30760974 30635624 30100493 29181900 27913896 26343797 24537530 22575879 20544335
57068 20544335 18522414 16574830 14746270 13062280 11534999 10168426 8960279 7902801
57060 7902801 6984760 6193266 5514032 4931687 4431422 4000457 3627922 3304423 3022333
57051 3022333 2775670 2558987 2366856 2194746 2039530 1898566 1768999 1648403 1535233
57042 1535233 1428154 1325827 1227916 1135424 1049297 969510 896093 829954 771799 721078 677043
57031F77043l6835k8295j8819q859J622J2409K3284L4734M6363N4604N4433M4242
57019H55926K7152O965j4803l6890n5907o8236p3266p2945o9131o2896n5477m8156
57007C32336m1255l4494k8105k2848j9127j6660j4728j2494r712p302o477o991
56995A12143p305o677n836n219m015j744O33K147L195M498N905P177Q755J0482
56981A24139J0690Q025L355j396n508r223j2008j2768j1535r629q125p047n870
56968F3100m033j271J885M366N922P612J0256J3199J5494J7447J9721K1585K1364
56955A96647J8435J3616P806J381n150j0863j4968j7078j7106j5479j3170j0982
56943A33089q927o662m104j284J841N036P939J0886J4764J9526K3800K6534K7939
$$ plain form
57031 677043 640208 611913 593094 584235 585857 598266 621550 656284 702647 757251 811684 855926
57019 855926 883078 890043 875240 838350 782443 714207 640941 567996 498865 435969 380492 332336
57007 332336 291081 256587 228482 205634 186507 169847 155119 142625 132913 125611 119134 112143
56995 112143 104838 98161 92325 87106 83091 81347 81980 84127 87322 91820 97725 104902 113657 124139
56981 124139 134829 142854 146209 144813 139305 130082 118074 105306 93771 84142 76017 68970 63100
56968 63100 59067 57796 59681 64047 69969 77581 87837 101036 116530 133977 153698 175283 196647
56955 196647 215082 228698 236504 237885 232735 221872 206904 189826 172720 157241 144071 133089
56943 133089 124162 117500 113396 112112 113953 118989 126928 137814 152578 172104 195904 222438 250377
56930B50377K8065K5693J9854J1413K085p223j5900k2533k5912k6530k5659k3660
56918A90070k0500j7244j5208j4081j2429r915p542n896m626l578l032k787k239
56905G0993j454j037j030q77l41N05J855L675N020N192N136O321Q597J0624J2202
56890A25381J4420J7510K0325K2205K3682K4772K4085K0402J4122O592j013p654
56878C04829j2294j4500j4687j3471j1387r051o815m113j58M718R345J3410J7790
56865B63616K3073K8787L4333L9687M4841M9253N1900N1156M4914L2275J5253
56854F79088k291j7569k9671l7857m1018l9381l5028k9777k3671j6340q487r48
56842C97050O624J4980K3948L2897M1972N1819O2394P2757Q1441Q6291Q4502P3901
$$ plain form
56930 250377 278442 304135 323989 335402 337487 330264 314364 291831 265919 239389 213730 190070
56918 190070 169570 152326 137118 123037 110608 100693 93151 87255 82629 79051 76019 73232 70993
56905 70993 69539 68502 67472 66595 66254 66759 68614 72289 77309 82501 87637 93958 102555 113179 125381
56890 125381 139801 157311 177636 199841 223523 248295 272380 292782 306904 313496 312483 304829
56878 304829 292535 278035 263348 249877 238490 229439 222624 218511 218353 223071 232416 245826 263616
56865 263616 286689 315476 349809 389496 434337 483590 535490 586646 631560 663835 679088
56854 679088 676797 659228 629557 591700 550682 511301 476273 446496 422825 406485 397998 397050
56842 397050 403674 418654 442602 475499 517471 569290 631684 704441 785882 872173 956675 1030576
56830A030576N4435K8238j249k9907n3660o9778p7778p8808p4467o6393n6371
56819F04838m5955l5996k6784j8338j0174j273R011K0080L0601L9853M8096N5417
56807F69376O0470O0654N3721L9396J9613k570k4142m2568n5968o3543o5682o3347
56795E85410n7566m9674m1342l3657k6497j9362j2498o508j305L764R059J4645
56783C64469K0710K6958L1766L3054K9946K2872J2464l99j3638k4643l2253l7071
56771D34235l9620l9496l6681l2478k8322k4552k0971j7829j5539j3998j2753
56760A51996j1460r856p842n904m872m908n213n072m678m553m687m602l960k879
56746G1510j884j521j764j913j494r77j015j293r67rP98J006P97K79m53p21O8
$$ plain form
56830 1030576 1085011 1113249 1112000 1082093 1028433 958655 880877 802069 727602 661209 604838
56819 604838 558883 522887 496103 477765 467591 466318 475329 495409 526010 565863 613959 669376
56807 669376 729846 790500 844221 883617 903230 900660 876518 833950 777982 714439 648757 585410
56795 585410 527844 478170 436828 403171 376674 357312 344814 338306 337001 340765 349824 364469
56783 364469 385179 412137 443903 476957 506903 529775 542239 541840 528202 503559 471306 434235
56771 434235 394615 355119 318438 285960 257638 233086 212115 194286 178747 164749 151996
56760 151996 140536 130680 122838 116934 112062 107154 101941 96869 92191 87638 82951 78349 74389 71510
56746 71510 69626 68105 66341 64428 62934 61957 60942 59649 58682 58673 59471 60477 61274 61553 61100 60379 60447
56729F0447J205J401P47O11J404J895J263M08M52J085J295Q82M55M60Q80J420
56713G6310J690J624J811K666L392K750R50m44n47M8P16J560K304K009O10n57
56697I6892o04k66l68m53P1N65K54k99j8R44J442Q75m06j723k393j900n12P39
56679I2840J222J305J354J046K12n29p39r02j406j663j069q9N24Q68J359J768
56663I6101J663J237Q51M25n1r4L93O59L29J94Q70J610J496R82R98J341J212P75
56645A10991P77J124J142R69J304J971J987J052j21q72j128r35l62K19M73O74
56629A19265J232J894K089J812J470J174Q28O02O26N35J7n96r48j336k045k468
56613A24151j833m47O39R57Q35O56N94Q00J136J066M32j14k6L16L27J34J06J33
$$ plain form
56729 60447 61652 63053 63800 64411 65815 67710 68973 69381 69833 70918 72213 73095 73550 74010 74890 76310
56713 76310 78000 79624 81435 84101 87493 90243 91193 90749 90202 90250 90966 92526 94830 96839 97449 96892
56697 96892 96288 96022 95654 95201 95272 95837 96091 95792 95774 96718 98160 99035 98629 96906 94513 92613 92101 92840
56679 92840 94062 95367 96721 97767 97979 97450 96711 95809 94403 92740 91671 91582 92106 92974 94333 96101
56663 96101 97764 99001 99852 100277 100226 100132 100525 101184 101513 101707 102577 104187 105683 106665 107663 109004 110216 110991
56645 110991 111768 112892 114034 115003 116307 118278 120265 121317 121196 120324 119196 118261 117899 118118 118591 119265
56629 119265 120497 122391 124480 126292 127762 128936 129764 130366 130992 131527 131544 130948 130000 128664 126619 124151
56613 124151 122318 121871 122510 123467 124302 124958 125552 126352 127488 128554 128986 128872 128846 129162 129489 129623 129729 129862
56595A29862R2K50M79k9j300j812m84J450J930Q26k28k71K15N55N34j4r33j314
56577A29808n38N78Q98P76J376K563L117K827K740L221L487L254L352M234N126
56562A66819N288N088N380O507Q176R591R762Q439O632N393M389K686O53l39O2
56547B44526P98J105J189J109L74r61k071k640l246m056m304l551k478j942k096
56532B21756k778l846m750m663l555k442k131k400k637k619k373j933j443j040
56518A83146n43J46M61k25j520k377k433k157j796j213p12q69j433j488q79m44
56502A65664n93p75n29r2K56N12M19l40j204j137j90M28J48k57j38Jl61p69o15
56483A60428k27k81p77j187j223r26m33J4J80J48K22M86Q30J247J575J336M78
$$ plain form
56595 129862 129954 130204 130683 130654 129354 127542 127058 128508 130438 131264 131036 130765 130980 131535 132069 132055 131122 129808
56577 129808 129270 129848 130746 131522 132898 135461 138578 141405 144145 147366 150853 154107 157459 161693 166819
56562 166819 172107 177195 182575 189082 197258 206849 216611 225050 231682 237075 241464 244150 244803 244464 244526
56547 244526 245324 246429 247618 248727 249101 248140 246069 243429 240183 236127 231823 228272 225794 223852 221756
56532 221756 218978 215132 210382 205719 202164 199722 197591 195191 192554 189935 187562 185629 184186 183146
56518 183146 182603 182749 183210 182985 181465 179088 176655 174498 172702 171489 170777 169908 168475 166987 166108 165664
56502 165664 165071 164296 163767 163675 163931 164443 164862 164522 163318 162181 161991 162419 162567 162310 162172 162173 161812 161043 160428
56483 160428 160201 159920 159143 157956 156733 155807 155374 155388 155568 155716 155938 156424 157254 158501 160076 161412 161890
56466A61890r8L08R86Q30J85K83J123J485J023O88Q87Q73L38L7K99M37K35M99
56448A72308J406J792R97L6J4N40P53P99J203J661J612J296J253J377J231P78
56432A89056J35p84j737k010j376n32m0L57Q57R91N36J48L54O99O95P45J315J900
56414A91309J724R10J60k05k51M2N65Q63P22M49K47r4m35j00J009J928J920J477
56396B02240J320J220O42j07k59K62Q22R20M81k44p09m63J54K70k02k73O52J762
56378B08488J948J237N43N15J127J896K102J334J91j95L95R94Q50K96p7j16K61
56361B21789J228K308K520J723R19P85Q89Q19R10J317J487J196J066J400J668
56346B42024J681K087K937L124K151J156J117J320Q08J52M26J342J891K040K402
$$ plain form
56466 161890 161792 162100 163086 163916 164101 164384 165507 166992 168015 168703 169590 170463 170801 170838 171137 171574 171809 172308
56448 172308 173714 175506 176503 176539 176553 177093 177846 178645 179848 181509 183121 184417 185670 187047 188278 189056
56432 189056 189191 188407 186670 184660 183284 182752 182712 183069 183926 184917 185453 185601 185955 186654 187349 188094 189409 191309
56414 191309 193033 193943 194103 193898 193647 193689 194254 195117 195839 196288 196535 196441 196006 195906 196915 198843 200763 202240
56396 202240 203560 204780 205422 205315 205056 205318 206140 207060 207541 207297 206588 206125 206279 206549 206347 206074 206726 208488
56378 208488 210436 211673 212216 212731 213858 215754 217856 219190 219381 219186 219581 220575 221425 221721 221644 221528 221789
56361 221789 223017 225325 227845 229568 230487 231272 232161 232980 233890 235207 236694 237890 238956 240356 242024
56346 242024 243705 245792 248729 251853 254004 255160 256277 257597 258405 258557 258983 260325 262216 264256 266658
56331B66658K807K558J734J109J030J251J493J504J107P35J214K431L183K929
56317B91743K610K900K894J738L20l4M22O09O08J341K775L887M097L702L136K839
56301C25587L336M562N584N720N381N054M467L512K962L203L304K557J863K310
56287C79402L364L900M063M581N206N442O041P964J0376J1484J1012J0286J0212
56274D73333J0628J1374J2470J3388J3653J3883J5024J6829J8354J9597K1375
56263F39908K3901K6744K9824L3238L6480L9217M2388M7230N3536O0184O7040
56252A099690P4971Q4224R4069J03892J13541J22905J31992J40936J49052J54675
56242B269947J56931J56724J54768J49814J40301J26577J09769Q9672O5817L9674
$$ plain form
56331 266658 269465 272023 273757 274866 275896 277147 278640 280144 281251 281986 283200 285631 288814 291743
56317 291743 294353 297253 300147 301885 302205 302171 302593 303202 303810 305151 307926 311813 315910 319612 322748 325587
56301 325587 328923 333485 339069 344789 350170 355224 359691 363203 366165 369368 372672 375229 377092 379402
56287 379402 382766 386666 390729 395310 400516 405958 411999 419963 430339 441823 452835 463121 473333
56274 473333 483961 495335 507805 521193 534846 548729 563753 580582 598936 618533 639908
56263 639908 663809 690553 720377 753615 790095 829312 871700 918930 972466 1032650 1099690
56252 1099690 1174661 1258885 1352954 1456846 1570387 1693292 1825284 1966220 2115272 2269947
56242 2269947 2426878 2583602 2738370 2888184 3028485 3155062 3264831 3354503 3420320 3459994
56232C459994J3482j2416l8653o3915q5496j02586j16524j27844j35604j39788
56222B650650j41864j42357j40138j34837j27978j20980j13815j06289r9003r2159
56212A431230q4999p7222o9768o3462n7981n2680m7451m2403l7654l3669l0812
56201H33129k8535k5997k3338k1248j9518j7392j5134j3655j2751j1274r110p357
56189F27820o426n556m429l700l662l750l665l692l712l228k451k129k263k236
56175E76921k066k126j841l21J764K623J823P63O14J284K469M073N447N790N483
56160F02700N646O342O678O663P288Q771J0284J1488J2803J4218J5360J6634J8668
56147G43543K0907K2572K4680K9084L5567M2074M7811N4036O1630P0055P8946
$$ plain form
56232 3459994 3473476 3461060 3422407 3358492 3272996 3170410 3053886 2926042 2790438 2650650
56222 2650650 2508786 2366429 2226291 2091454 1963476 1842496 1728681 1622392 1523389 1431230
56212 1431230 1346231 1269009 1199241 1135779 1077798 1025118 977667 935264 897610 863941 833129
56201 833129 804594 778597 755259 734011 714493 697101 681967 668312 655561 644287 635177 627820
56189 627820 621394 615838 611409 607709 604047 600297 596632 592940 589228 586000 583549 581420 579157 576921
56175 576921 574855 572729 570888 570567 572331 574954 576777 577540 578154 579438 581907 585980 591427 597217 602700
56160 602700 608346 614688 621366 628029 635317 644088 654372 665860 678663 692881 708241 724875 743543
56147 743543 764450 787022 811702 840786 876353 918427 966238 1020274 1081904 1151959 1230905
56136A230905Q8423R7365J03403J05246J03354R8106Q9310P7983O6648N7238N0146
56125B168127M5291M2198L8961L3210K4585J4621M306o176j5561k1977k5845l0045
56113B271695l6732m5863n6915o9534q2089r1909r7651r9651r7798r1426q1560
56102A420567p0947o1285n2369m4030l6777l0377k4175j8845j5442j2966r542
56091A043812n827m182m438l858j532N22J229J990L563M741N049N727P076P795
56077A061667P719Q238R410R784R603J0733J2922J3716J2817J2679J4076J5055
56065A198419J5215J6687J9569K0848J9573J8726K0085K1412K0909K0215K0689
56054A412347K0741J9382J8549J9407K0009J9105J8582J9684K0534J9920J9759
$$ plain form
56136 1230905 1319328 1416693 1520096 1625342 1728696 1826802 1916112 1994095 2060743 2117981 2168127
56125 2168127 2213418 2255616 2294577 2327787 2352372 2366993 2371299 2365123 2349562 2327585 2301740 2271695
56113 2271695 2234963 2189100 2132185 2062651 1980562 1888653 1791002 1691351 1593553 1502127 1420567
56102 1420567 1349620 1288335 1235966 1191936 1155159 1124782 1100607 1081762 1066320 1053354 1043812
56091 1043812 1037985 1033803 1029365 1025507 1023975 1024497 1025726 1027716 1031279 1036020 1041069 1046796 1053872 1061667
56077 1061667 1069386 1077624 1087034 1096818 1106421 1117154 1130076 1143792 1156609 1169288 1183364 1198419
56065 1198419 1213634 1230321 1249890 1270738 1290311 1309037 1329122 1350534 1371443 1391658 1412347
56054 1412347 1433088 1452470 1471019 1490426 1510435 1529540 1548122 1567806 1588340 1608260 1628019
56043A628019K1271K2540K2469K3186K5837K7887K7611K7344K9274L1763L2979
56032A920180L4352L7207L9702M0353M1022M3301M5614M6802M8703N2138N4424
56021B403798N4078N3883N6003N8388N9299O0892O4758O8442P0239P2761P7842
56010C100383Q2620Q4769Q6920R1663R6971J00926J06013J14106J22160J27629
56000D114160J33173J41357J49834J56550J64323J75227J86103J94782K04854
55991E620363K18979K33720K46510K61122K80385L00595L19425L41804L71010
55982H193913M01910M30616M62697N03625N49478N95883O47550P09488P77816
55973A3272976Q49400R31451J030906J144053J268227J413556J590991J799822
$$ plain form
56043 1628019 1649290 1671830 1694299 1717485 1743322 1771209 1798820 1826164 1855438 1887201 1920180
56032 1920180 1954532 1991739 2031441 2071794 2112816 2156117 2201731 2248533 2297236 2349374 2403798
56021 2403798 2457876 2511759 2567762 2626150 2685449 2746341 2811099 2879541 2949780 3022541 3100383
56010 3100383 3183003 3267772 3354692 3446355 3543326 3644252 3750265 3864371 3986531 4114160
56000 4114160 4247333 4388690 4538524 4695074 4859397 5034624 5220727 5415509 5620363
55991 5620363 5839342 6073062 6319572 6580694 6861079 7161674 7481099 7822903 8193913
55982 8193913 8595823 9026439 9489136 9992761 10542239 11138122 11785672 12495160 13272976
55973 13272976 14122376 15053827 16084733 17228786 18497013 19910569 21501560 23301382
55965B3301382K040441K328110K680446L104755L613787M240791N023646N991423
55957E2324781P184931Q670918J0515122J2762230J5455845J8629951K2236985
55950A47780763K6122723L0099258L3915194L6965120L8046579L5685667K9000384
55943C77615688J8373377N337317q107911k0108955k9258196l4781009l6692282
55936B72378029l5714718l2888709k9152971k5171007k1362490j7957310j5029233
55929I5101591j2559801j0508341q828638p456306o324029n388215m621405l989487
55921C5425369l457411l007756k633268k318089k043420j803987j601948j430440
55913A7129050j278011j143217j030188r34740q48128p69827p04008o47687n94076
$$ plain form
55965 23301382 25341823 27669933 30350379 33455134 37068921 41309712 46333358 52324781
55957 52324781 59509712 68180630 78695752 91457982 106913827 125543778 147780763
55950 147780763 173903486 204002744 237917938 274883058 312929637 348615304 377615688
55943 377615688 395989065 401326382 393218471 373109516 343851320 309070311 272378029
55936 272378029 236663311 203774602 174621631 149450624 128088134 110130824 95101591
55929 95101591 82541790 72033449 63204811 55748505 49424476 44036261 39414856 35425369
55921 35425369 31967958 28960202 26326934 24008845 21965425 20161438 18559490 17129050
55913 17129050 15851039 14707822 13677634 12742894 11894766 11124939 10420931 9773244 9179168
55904I179168n43786n01496m65130m28831l93321l63369l37956l12434k87397
55895E545448k66554k48647k30042k12424j99512j88960j75770j61122j49701
55886C712716j40688j29541j16747j06806r9935r2303q3447p6562p2460o9578
55876B724649o8829p2147p7303q0080q0494q1300q1791p8957p3553o9219o6452
55865A894524o2875n8496n5292n2565m8043m2792l9915l9097l7379l4528l2786
55854A390756l2071l0350k8078k7518k8281k8143k7496k8319k9524k8289k5412
55843A077275k4374k5340k5025k2526k0444j9922j9235j7809j7283j7766j7124
55832H50427j4812j2822j2087j1348j0128r607r929r762q976q896r618r951j0058
$$ plain form
55904 9179168 8635382 8133886 7668756 7239925 6846604 6483235 6145279 5832845 5545448
55895 5545448 5278894 5030247 4800205 4587781 4388269 4199309 4023539 3862417 3712716
55886 3712716 3572028 3442487 3325740 3218934 3118999 3026696 2943249 2866687 2794227 2724649
55876 2724649 2655820 2583673 2506370 2426290 2345796 2264496 2182705 2103748 2030195 1960976 1894524
55865 1894524 1831649 1773153 1717861 1665296 1617253 1574461 1534546 1495449 1458070 1423542 1390756
55854 1390756 1358685 1328335 1300257 1272739 1244458 1216315 1188819 1160500 1130976 1102687 1077275
55843 1077275 1052901 1027561 1002536 980010 959566 939644 920409 902600 885317 867551 850427
55832 850427 835615 822793 810706 799358 789230 779623 769694 759932 750956 742060 732442 722491 712433
55819G12433j1200j2861j3174j2229j1869j2160j1280r076p539p335o933n661
55807E91116m651m219l169j312J1N51J759M136O330P445Q005Q215P503O112M993
55792F32825L842J403k053m724o054p219q674r337q682p678p303p785r293j1573
55778E47695j3182j3009j2140j2132j2095r983o251l298j512R54M273O027M931
55765D80278K554M19j973n111p907r291r503q861p181n123m153m372m268l400
55751D12108l267m713o389o921o850p306q144q486q011o915n545m562m518m929
55737C25552m809m123l550l084k273j657k231l511l989l505l336l874m195m061
55723B77354m269m770m483l426k953l382l392k360j350j031o40L11J130J590K582
$$ plain form
55819 712433 701233 688372 675198 662969 651100 638940 627660 618584 611045 603710 596777 591116
55807 591116 586465 582246 579077 577765 577776 578327 580086 584222 590552 597997 606002 614217 621720 627832 632825
55792 632825 636667 638070 636017 631293 625239 618020 609346 600009 591327 583649 576346 568561 559268 547695
55778 547695 534513 521504 509364 497232 485137 475154 468903 465605 464093 465047 469320 475347 480278
55765 480278 482832 483251 481278 476167 468260 458969 449466 440605 433424 428301 424148 419776 415508 412108
55751 412108 408841 404128 397739 390818 383968 376662 368518 360032 352021 345106 339561 334999 330481 325552
55737 325552 320743 316620 313070 309986 307713 306056 303825 300314 296325 292820 289484 285610 281415 277354
55723 277354 273085 268315 263832 260406 257453 254071 250679 248319 246969 245938 245298 245609 246739 248329 250911
55708B50911M288N440N341M852M529L478J183j193k512l260m311n392n942o302
55694B51110o931p339o847n626m303l209k532k312j949p06J012K043K309K921
55680B17641M155M914M656M269M361M195L126J665L47j159k958m183m174l320
55666B33535k190r36q0l91j348j207N31K173K294J681J807K617L138L147L064
55651B47835K948K730K653K708K338J403N83J97l68j404k276k753l752n758p607
55636B39477p946o996n885n151m815n039n598n557m463l159k513k182j615j329
55622A77229j954k787k605j454m06Q2M19P10M68m66j557k249k433k284k068k048
55606A56597k285k547k615k470k217k044k195k538k400j453n05m84r22n83M74
$$ plain form
55708 250911 255199 260639 265980 270832 275361 278839 280022 278829 276317 273057 268746 263354 257412 251110
55694 251110 244179 236840 229993 224367 220064 216855 214323 212011 210062 209356 210368 212411 214720 217641
55680 217641 221796 226710 231366 235635 239996 244191 247317 248982 249329 248170 245212 241029 236855 233535
55666 233535 231345 230409 230329 229938 228590 227383 227914 230087 232381 234062 235869 238486 241624 244771 247835
55651 247835 250783 253513 256166 258874 261212 262615 263198 263395 263027 261623 259347 256594 252842 247084 239477
55636 239477 231531 224535 218650 213499 208684 203645 198047 192490 188027 184868 182355 180173 178558 177229
55622 177229 175275 172488 169883 168429 168023 168105 168524 169234 169702 169236 167679 165430 162997 160713 158645 156597
55606 156597 154312 151765 149150 146680 144463 142419 140224 137686 135286 133833 133328 132844 131922 131339 131813
55591A31813Q85J88m34j00M72L37k52n39m08n3N87J344J614J270R32Q88O53J61
55573A39358J69R20J549J581J867L097M431M723M160L588K969J735Q2j187j769
55558A67273j965k022k030k183k513k708k626k515k480k303k082k247k652k567
55544A34380j926j536j634j346k16R00J145Q72P16N74K82L30R35J415J304J179
55528A37374J496J597Q98M2j54kj35l50l71q16k148l391l326k340j809k103k403
55511A22059k150j602j146j008j252j414p55M83Q53l67j838j898q14j11l50q17
55495A07873r87r15o02n5K79J18k6K96N15kp04o69j25O3j04k1K16N3l39l36oK25
55473A04747N78J316J610M92j317k109j551q46n96q8J021J839J547M52o81j336
$$ plain form
55591 131813 132698 132886 132452 132352 132824 133161 132909 132370 131962 131909 132496 133840 135454 136724 137656 138544 139197 139358
55573 139358 139527 140447 141996 143577 145444 148541 152972 157695 161855 165443 168412 170147 170229 169042 167273
55558 167273 165308 163286 161256 159073 156560 153852 151226 148711 146231 143928 141846 139599 136947 134380
55544 134380 132454 130918 129284 127938 127722 128622 129767 130639 131355 131929 132211 132541 133476 134891 136195 137374
55528 137374 138870 140467 141365 141407 141253 141251 141116 140766 140395 139579 137431 134040 130714 128374 126565 124462 122059
55511 122059 119909 118307 117161 116153 114901 113487 112732 113215 114068 113701 111863 109965 109151 109040 108690 107873
55495 107873 106886 105971 105369 105314 105593 105711 105685 105981 106496 106494 105790 105121 104996 105059 104955 104934 105150 105203 104864 104528 104522 104747
55473 104747 105325 106641 108251 108743 107426 105317 103766 102920 102324 102236 103257 105096 106643 107095 106414 105078
55457A05078j102R4J268J051n00j708j382k26M00K50J03M56J038J344J208Q40
55441A08212N27K52l34j379k405k691k037q91J18N77N07L70N82Q39M48n37j130
55424A01028p78j23R1R5L80P11P09P90J495K415K708K293J671J008K83j02J45
55407A14819M77K16m02p22p92j073j493j757k049k448k274j136l1r3p96q17k13
55390I9416j32p02q87m03o8n0N13J758K527K075J093M02j69r21j406j210q09r08
55372A00119j457j908j968j645r58K6J084J933K245J684L47j034j743j776j452
55357I3497p97R7O61N53L43N47N57l28j291q32R50K329K243J288L70l50q48q43
55339I8146l99n9l1m5j20n00q39m26O45J485J637J394R42K76j37J93O91L78m13
$$ plain form
55457 105078 103976 104070 105338 106389 105889 104181 102799 102573 102973 103223 103326 103782 104820 106164 107372 108212
55441 108212 108739 108991 108657 107278 104873 102182 100145 99254 99372 99949 100456 100826 101408 102247 102695 102158 101028
55424 101028 100250 100127 100218 100313 100693 101404 102113 102903 104398 106813 109521 111814 113485 114493 114776 114674 114819
55407 114819 115296 115512 115110 114388 113596 112523 111030 109273 107224 104776 102502 101366 101335 101242 100446 99629 99416
55390 99416 99284 98582 97695 97292 97224 97174 97687 99445 101972 104047 105140 105542 105373 104452 103046 101836 101027 100119
55372 100119 98662 96754 94786 93141 92183 92209 93293 95226 97471 99155 99502 98468 96725 94949 93497
55357 93497 92700 92797 93458 94011 94354 94901 95458 95130 93839 93007 93957 96286 98529 99817 100187 99837 98989 98146
55339 98146 97747 97688 97657 97612 97492 96992 96153 95727 96372 97857 99494 100888 101830 102106 101969 102162 102853 103231 102818
55320A02818l70O43J256O59m23j189j716k017j626p10k48m76n00KJ51l70m99K39
55302I5624O22k20r92o0J932K880K088P83J70L10P48J081Q98R1p83j076q55o18
55284A02623m54j54J71J83j23m56o63p32o30m64n15p92r12o71l19K2N99J352J567
55265I9632P92l41p23j1J173J956J878J175N74N13N16j11j015j075m8R23Q48P9
55247A06735m95o04m43n9M50P20O21M82M32J78k62l28N7Q5o86j446j224k79L95
55228A04329M07P7k21k29K76J003J124L74k99qP20P02j43p18l80K98M49l7n57
55209A07167n49l0M26K82l30p40n49m0L06K83j00o91j057p50J04Q97J294J343
55191A07266R63J7r91j171m61K43M07M32N88M00l62r92p89qP31J246J446R54k59
$$ plain form
55320 102818 102448 103091 104347 105006 104583 103394 101678 99661 98035 97325 97077 96601 96101 96103 96254 95884 95385 95624
55302 95624 96246 96026 95034 94974 96906 99786 101874 102657 102827 103137 103885 104966 105864 105955 105172 104096 103241 102623
55284 102623 102169 102015 102186 102369 102246 101790 101127 100395 99765 99301 98786 97994 97082 96411 96092 96114 96713 98065 99632
55265 99632 100424 100083 99360 99349 100522 102478 104356 105531 106105 106618 107134 107023 106008 104933 104885 105808 106656 106735
55247 106735 106240 105636 105193 105134 105584 106304 106925 107407 107839 108017 107755 107427 107484 107569 106883 105437 104213 103934 104329
55228 104329 104736 104813 104592 104363 104639 105642 106766 107140 106841 106833 107553 108255 108112 107394 107014 107312 107761 107724 107167
55209 107167 106618 106588 107014 107296 106966 106226 105677 105637 105943 106226 106126 105435 104378 103628 103732 104629 105923 107266
55191 107266 108229 108246 107255 106084 105623 105866 106273 106705 107293 107693 107331 106339 105550 105542 106273 107519 108965 109919 109660
55172A09660j452j946j800j317n53K58O52P93J388K352K554J617P38Q75J322J144
55156A16285Q40J286K001J943J335J142J299R59J08n40r05j424j779j239k00P8
55140A21189n84r96m73K20K02l48q54j261j744k084j943j359o97k73j48o2L17
55123A09102Q75J058O03l9m13o49r58j072p89m91m31j46O30J123O38j02P3Q83
55105A09895J011K39k94N0N20L86K3J56P86J373J522J221Q17Q18J275J511R71
55088A22280J40j07K02L84L58O67J226J193K66q03j217r60l48L49O83K71n21p89
55070A23274k80L01L66J13n4p0N4L59N90L54j64l14k0P7k68m04J04O18K96o43
55050A24289j169p47J26N95L55j35k00K75P61Q08O25O66R36J118J069P71J02p99
$$ plain form
55172 109660 108208 106262 104462 103145 102592 102850 103502 104295 105683 108035 110589 112206 112944 113819 115141 116285
55156 116285 117125 118411 120412 122355 123690 124832 126131 127090 127198 126658 125753 124329 122550 121311 121111 121189
55140 121189 120605 119609 119136 119356 119558 119210 118356 117095 115351 113267 111324 109965 109268 108995 108847 108785 109102
55123 109102 109977 111035 111638 111599 111186 110537 109579 108507 107718 107227 106796 106650 107280 108403 109041 108939 109012 109895
55105 109895 110906 111145 110851 110901 111421 111807 111830 111986 112772 114145 115667 116888 117705 118523 119798 121309 122280
55088 122280 122420 122313 122515 122899 123257 123924 125150 126343 126609 125806 124589 123629 123281 123630 124313 124584 124063 123274
55070 123274 122994 123295 123661 123774 123720 123650 123704 124063 124653 125007 124843 124529 124509 124586 124318 123914 124018 124636 124932 124289
55050 124289 123120 122373 122499 123094 123449 123314 123114 123389 124150 124958 125583 126249 127185 128303 129372 130143 130245 129446
55032A29446j239p42J55N56M39L59K73l51j302j646j141o07o28p95o05k49p7o6
55014A21780k36q38j680j934j205j95J43k57p56q25k87Q05K046K747K593J966
54998A23867J339P05j01q59j154r06l69K43Q71J432J760J723J329P68K47k27p46
54981A29922j082p15L63J286J271O32K41K09j18r39j585j439o61K27Q89J146R46
54964A30593N43K86J92L6j31p6J05Q1r3l1L15N90O41O80P85Q10P20N66K34k74
54944A36572m53J15R38J095M46l17o94p11l79K86Q64R54Q93J142J238M73n73n11
54926A41378P78J986K452K973M112N184N624N996O842P634P791P680P702P273
54912B15405N707L371J108q74k722m262n401o559p932q810q494p297n974m667
$$ plain form
55032 129446 128207 127465 127620 128176 128615 128974 129247 128896 127594 125948 124807 124200 123572 122777 122172 121923 121846 121780
55014 121780 121544 120706 119026 117092 115887 115692 115835 115578 114822 113997 113710 114515 116561 119308 121901 123867
54998 123867 125206 125911 125810 124951 123797 122891 122522 122765 123636 125068 126828 128551 129880 130648 130895 130668 129922
54981 129922 128840 128125 128488 129774 131045 131677 131918 132127 132009 131070 129485 128046 127385 127612 128501 129647 130593
54964 130593 131136 131422 131614 131650 131519 131443 131548 131629 131536 131505 131820 132410 133051 133731 134516 135326 136046 136612 136846 136572
54944 136572 136119 136234 137172 138267 138713 138396 137702 136991 136612 136898 137762 138716 139609 140751 141989 142462 141889 141378
54926 141378 142156 144142 146594 149567 153679 158863 164487 170483 177325 184959 192750 200430 208132 215405
54912 215405 221112 224483 225591 224717 221995 217733 212332 205773 197841 189031 180537 173240 167266 162599
54898A62599l168j714p37k68j44l72p87r60r30j246j760j380K41J762J936J392
54882A54464J456K101K422K451K931L717L989L962M776O558Q014Q221P620O795
54868B19477N460L198L60k342m557o214p257p748p862p570o724n544m545m005
54854A64127l827l868l922l605k829k196k264k581k242j262n03l11k56k23o73
54839A33565j451j513m15Q77J316J132J082J083N60k67n11L7N52K88n32j126r81
54822A33696k17N80P73K77k09N0Q90J382J044L72J3j17m02o66m15K66P64R33J204
54803A40218J515J036n28k028k149j134k91j53j13K09L78J46n5j0j93q04j175
54786A34869p87j00K64N09J005J384J168R13J551K810L369K707J805J779K505
$$ plain form
54898 162599 159431 157717 156980 156712 156568 156196 155409 154449 153519 152273 150513 149133 149374 151136 153072 154464
54882 154464 155920 158021 160443 162894 165825 169542 173531 177493 182269 188827 196841 205062 212682 219477
54868 219477 224937 228135 228495 226153 221596 215382 208125 200377 192515 184945 178221 172677 168132 164127
54854 164127 160300 156432 152510 148905 146076 143880 141616 139035 136793 135531 135028 134717 134461 134238 133565
54839 133565 132114 130601 130186 131063 132379 133511 134593 135676 136236 135969 135458 135495 136047 136335 135803 134677 133696
54822 133696 133479 134059 134832 135109 134900 134950 135840 137222 138266 138638 138651 138534 138132 137466 137051 137317 138081 139014 140218
54803 140218 141733 142769 142241 140213 138064 136930 136639 136486 136373 136582 136960 137106 137051 137041 136848 136044 134869
54786 134869 134082 133982 134246 134755 135760 137144 138312 139225 140776 143586 146955 149662 151467 153246 155751
54771A55751L065K976K536K244K321K753L556M845O597Q431R776J0272R826Q330
54757B33279N817K945O71q74k637n282q049r609r619q776p710o599n681n241n031
54742A67604m401l182j923j187j076j438j973k093j337r3O34L90j90j89O59J972
54726A52177L253M167M659M971N375N786N911N806N901O328O602O200N124L680
54712B25940J965j73k759n465p701q900q930q256p567p079o345m880k869j165
54698A55816n10q26j274j106l66K99M19Rp18j523j918j450m75j28r38j958j903
54681A41450q51p4k48p02n67L8L71Q3n12r28r21n35QN38J036J429J386N99o59
54662A40941j563j500o25L52Q15O43J71j76k79l53n23n82l51q2j42l41n8R00J886
$$ plain form
54771 155751 158816 161792 164328 166572 168893 171646 175202 180047 186644 195075 204851 215123 224949 233279
54757 233279 239096 242041 242712 241838 239201 233919 225870 216261 206642 197866 190156 183557 177876 172635 167604
54742 167604 163203 160021 158098 156911 155835 154397 152424 150331 148994 148901 149535 149925 149735 149546 150205 152177
54726 152177 155430 159597 164256 169227 174602 180388 186299 192105 198006 204334 210936 217136 222260 225940
54712 225940 227905 227732 224973 219508 211807 202907 193977 185721 178154 171075 164730 159850 156981 155816
54698 155816 155306 154480 153206 152100 151734 152033 152452 152461 151743 150220 148302 146852 146377 146249 145311 143353 141450
54681 141450 140599 140525 140277 139575 139008 139046 139417 139500 138988 138060 137139 136604 136612 137150 138186 139615 141001 141600 140941
54662 140941 139378 137878 137253 137605 138420 139063 139234 139058 138779 138426 137903 137321 136970 136888 136746 136405 136347 137247 139133
54643A39133K119J509O15o9n17q74j010n79M30J346J327K88q92j326j044p43p35
54626A38978n97J34J201J837J619R31M98N21N12L5o14p84m08j04k30l60K5P28
54608A43922J081P76J05m73o34k53M64R35O94o2o03m20K95R12R36L89k93o74p12
54589A46385o84p73q55o93k27L55O72M92R0J56Q95J484R16o32j828j723o74K88
54571A43644N04l5q47j192p17L1K21q7j04L43N30J69n0L32P57O95N53P89J008
54552A46544O94J31k34n78j001q98J5Q65R36R23J639K234J381l55j038j43Q78
54535A51993R17M56K35J49J9J59N93P27L35K2J83M30M46N72R92J166N93m40j340
54516A58207j855j882j287l49K07J0n65j035j290j264p93j12J67j05l46j26L20
$$ plain form
54643 139133 141252 142761 143376 143307 142790 141916 140906 140327 140757 142103 143430 143718 142826 141500 140456 139713 138978
54626 138978 138381 138515 139716 141553 143172 144103 144601 145122 145634 145669 145055 144271 143863 143759 143529 143169 143194 143922
54608 143922 145003 145779 145884 145411 144777 144524 144988 145923 146617 146555 145952 145532 145827 146739 147675 148064 147771 147097 146385
54589 146385 145701 144928 144073 143380 143153 143508 144180 144672 144762 144918 145813 147297 148213 147581 145753 144030 143356 143644
54571 143644 144148 144113 143266 142074 141357 141388 141609 141522 141418 141761 142291 142460 142410 142742 143499 144194 144747 145536 146544
54552 146544 147238 147369 147135 146557 145556 144658 144673 145538 146474 147397 149036 151270 152651 152296 151258 151115 151993
54535 151993 152910 153366 153601 153750 153769 153928 154521 155248 155583 155605 155788 156218 156664 157236 158228 159394 159987 159547 158207
54516 158207 156352 154470 153183 152834 153041 153051 152486 151451 150161 148897 148104 147992 148159 148054 147708 147582 147902
54499A47902O85J049J354J147K73o55r72p12l19k5J26Q1q3r6J58N62J060J569
54481A53104J654R43q3m98k15q9m70o10N7R15J111Q06P28R80J005N03k27o80o03
54462A58331k08n2m39q69o33R8M57K23J04M02M32k23q28o65k53m27q81p11lK34
54442A54089l30q48n02M29J045Q80K93kL26Q63R07L42k36l12k0K73N25Q20J069
54423A59611J175J255J322J158P38M43M94N60L08m1j29n7j78n39r15j137j037
54406A63031m66L23O53K49k38p6N18P00K61o2L92J292J661J026K8k45M78J365
54388A70890J624J480J566J723J274K97l68m29m48o90o31k7M77L00l08r24j543
54371A74263k016j762o52N55J244J596J716J146rn74Q3Q68N71j75N9J187J808
$$ plain form
54499 147902 148587 149636 150990 152137 152410 151755 150783 150071 149752 149727 149853 149934 149851 149755 149913 150475 151535 153104
54481 153104 154758 155701 155618 155120 154905 154816 154346 153736 153793 154708 155819 156625 157353 158333 159338 159841 159614 158934 158331
54462 158331 158123 158071 157632 156763 156130 156228 156685 156908 157012 157414 157846 157623 156795 156130 155877 155450 154569 153858 153855 154089
54442 154089 153759 152911 152409 152838 153883 154763 155056 155054 155380 156243 157150 157492 157256 156944 156924 157197 157722 158542 159611
54423 159611 160786 162041 163363 164521 165259 165702 166196 166756 167064 167023 166894 166837 166659 166120 165205 164068 163031
54406 163031 162565 162888 163541 163790 163552 163476 163994 164694 164955 164893 165285 166577 168238 169264 169292 169047 169525 170890
54388 170890 172514 173994 175560 177283 178557 178854 178486 178057 177609 176919 176288 176261 176738 177038 176730 175806 174263
54371 174263 172247 170485 169833 170388 171632 173228 174944 176090 176081 175507 175590 176458 177029 176854 176913 178100 179908
54354A79908J388O94K32l55j202j817j962j915j698j021j48K19O9J20N40N96p9
54337A73569q55j143j195j402j533j220o38j31L24Q31J137R55M41J9n9K49Q51
54320A70200J407J507J172R37J164J527J465Q71J51k74k70L6M44Q15J147J514
54304A83813K026K799L880N021N732N682N013M129L376K959K867K689J843K63
54290B32092j427k646l461m142m559m470m019l461k677j535m77j36n12j058j402
54275A96110j445j032k28K22m24j785k630k417j797j417j025j53Q98J361R96K65
54259A85499l43p33r81j039q26m58k01j79k37j44J30M74Q00R32N91k11q56p38
54241A81480p7L67L53K83K76k6n87p84m02l0o4j82k35o69j459j654p94J95M02
$$ plain form
54354 179908 181296 181990 182222 181867 180665 178848 176886 174971 173273 172252 172104 172323 172392 172512 173052 173648 173569
54337 173569 172714 171571 170376 168974 167441 166221 165583 165452 165776 166607 167744 168699 169140 169159 169100 169349 170200
54320 170200 171607 173114 174286 175223 176387 177914 179379 180250 180401 180127 179857 179893 180337 181152 182299 183813
54304 183813 185839 188638 192518 197539 203271 208953 213966 218095 221471 224430 227297 229986 231829 232092
54290 232092 230665 228019 224558 220416 215857 211387 207368 203907 201230 199695 199218 199082 198570 197512 196110
54275 196110 194665 193633 193405 193627 193203 191418 188788 186371 184574 183157 182132 181979 182877 184238 185234 185499
54259 185499 185156 184423 183442 182403 181577 181119 180918 180739 180502 180358 180488 180962 181762 182694 183285 183074 182218 181480
54241 181480 181403 181770 182123 182406 182682 182656 182069 181285 180883 180853 180789 180607 180372 179703 178244 176590 175796 175991 176393
54222A76393K87N88Q41K92n12n87k99o87j417j188j6O59L06J1M73Q73L22p67j440
54203A74132j321n05P07J552J225jq88p99k82J06M58P62O17J21M6N54Q57N86M08
54184A78335P13Q37L10j90n4J84r5l73MM38n4j083j314l99O36Q36K41o01j216
54165A77155j278p63r7L07N11P02P63O24P00J273J779J478O21J70M43P89O81M03
54147A86261M35O87O72J46o17j101j073q67j048j695k223k105j462p63k55J00
54131A75092L41N55R40J485J844J771J431J046N16j93o88n82j04K07J97J39K02
54114A84199L30N25Q17J061J078Q93N73M2o27r60n80J77N99M63J36j09l72o93
54096A87552q20o08k52OJ73L05K96J29J31O24J384J728J319N97J90J40P7oL19
$$ plain form
54222 176393 176680 177268 178109 178401 177889 177302 177003 176316 174899 173711 173695 174354 174660 174671 175144 176017 176339 175572 174132
54203 174132 172811 172306 173013 174565 175790 175789 174901 174102 173820 173926 174384 175146 175763 175884 175930 176484 177341 177927 178335
54184 178335 179048 179885 180195 180005 179951 180135 180040 179667 179671 180109 180055 178972 177658 177259 177895 178731 178972 178371 177155
54165 177155 175877 175114 175017 175324 175835 176537 177300 177924 178624 179897 181676 183154 183775 183945 184388 185177 185858 186261
54147 186261 186696 187383 188055 188201 187584 186483 185410 184543 183495 181800 179577 177472 176010 175247 174992 175092
54131 175092 175433 175988 176928 178413 180257 182028 183459 184505 185021 184828 184140 183558 183454 183661 183858 183997 184199
54114 184199 184529 185054 185871 186932 188010 188903 189476 189518 188891 187931 187351 187528 188127 188590 188726 188617 188245 187552
54096 187552 186732 186124 185872 185878 186051 186356 186652 186781 186912 187536 188920 190648 191967 192564 192754 192894 192971 192965 193284
54077A93284J070J566J318P05K98l5o39j152r17j70J15l36o81k41N89J056J022
54060A96852Q16O06L40k8n07r64r84k83O76J050P39M80O36P20M61M92J405K729
54042B05236L542L614L419L398L741M444N057M831L692K709K939M158N252N555
54028B61587N229M666M174M006M084L876L034J973J358J245J191R10L58n12j493
54013B95686j992j782j591k221l339l953l836l633l602l299k673k486l119l695
53999B54465l125j622n57q64k090l050l052k354j648j315j245j173r92p70o22
53984B29986n94n52k71K20M89K52j08K1N28O42L7p20r92q01m95k04J9R2K11Q17
53964B28577J897K887L539M316N485O592P368Q425J0328J2626J4633J6594J9019
$$ plain form
54077 193284 194354 195920 197238 197943 198241 198206 197567 196415 195498 195328 195443 195107 194426 194185 194774 195830 196852
54060 196852 197668 198274 198614 198586 198079 197115 196131 195848 196524 197574 198313 198793 199429 200149 200610 201102 202507 205236
54042 205236 208778 212392 215811 219209 222950 227394 232451 237282 240974 243683 246622 250780 256032 261587
54028 261587 266816 271482 275656 279662 283746 287622 290656 292629 293987 295232 296423 297333 297691 297179 295686
54013 295686 293694 291912 290321 288100 284761 280808 276972 273339 269737 266438 263765 261279 258160 254465
53999 254465 251340 249718 249161 248297 246207 243157 240105 237751 236103 234788 233543 232370 231378 230608 229986
53984 229986 229392 228840 228569 228789 229278 229530 229422 229443 229971 230613 230650 229930 228938 228137 227642 227438 227457 227549 227760 228577
53964 228577 230474 233361 236900 241216 246701 253293 260661 269086 279414 292040 306673 323267 342286
53951C42286K1201K1532J9262J5017R650L537k847q521j2579j4713j5051j3951
53939C64823j2020r852p664n491l623k385j605q66j74J15M3R1M95R75J204J149
53923C25215R07O86Q49J549K354K733K798L093L763M478N090N779O494O844O563
53908C79195N719M499L205K323K026J796J029o3q53j370k209l375m137m135l862
53893C79788l862m160m680n455o177o263n751n468n890o512o677o486o273n791
53879C00343m594k976j897j935k703l334l285k807k624l075l577l201j878o16
53865B61841l85j128k051k559k512j938r42J18P22N82j29r89j697k183k443k409
53849B41898k126j900j953k005j586q37m08m47l37K00M71n5p09n89m5r3p01q64
$$ plain form
53951 342286 363487 385019 404281 419298 428948 432485 429638 421117 408538 393825 378774 364823
53939 364823 352803 342951 335287 329796 326173 323788 322183 321317 321143 321258 321301 321392 321887 322862 324066 325215
53923 325215 326122 326808 327657 329206 331560 334293 337091 340184 343947 348425 353515 359294 365788 372632 379195
53908 379195 384914 389413 392618 394941 396967 398763 399792 399729 398876 397506 395297 391922 387785 383650 379788
53893 379788 375926 371766 367086 361631 355454 349191 343440 337972 332082 325570 318893 312407 306134 300343
53879 300343 295749 292773 290876 288941 286238 282904 279619 276812 274188 271113 267536 264335 262457 261841
53865 261841 261456 260328 258277 255718 253206 251268 250326 250444 251166 251748 251619 250630 248933 246750 244307 241898
53849 241898 239772 237872 235919 233914 232328 231491 231083 230636 230299 230499 230970 230915 230206 229617 229572 229479 228778 227914
53831B27914l16Q0j25k22L72J113J177O32J13l8J28M46O05L01j91j45N68J124
53813B33536R11M85Q03J914K971L320L123L038L620M749N530N137L943L303L946
53798B80329N099N598N264M675M181L810L754M146M543M355L709L285L338L493
53784C39579L554L856M668N754O825Q091R953J2298J4489J6131J7560J9221K0566
53771D82545J9980J6163R415J204p285j5574k2905k7786k9075k7189k3703j9992
53759C55798j6617j3759j1605j0154r015p709o129m636l613l074k755k629k948
53746B61155l597l761k719q30P08J124N63m08j277j523q72K04P98O70M39N85Q18
53729B52077P66O03O54Q83J198J703K276K436K112J981K489L058K876K030J238
$$ plain form
53831 227914 227598 227678 227553 227331 227703 228816 229993 230625 230738 230700 230828 231274 231879 232180 231989 231844 232412 233536
53813 233536 234447 234932 235735 237649 240620 243940 247063 250101 253721 258470 264000 269137 273080 276383 280329
53798 280329 285428 291026 296290 300965 305146 308956 312710 316856 321399 325754 329463 332748 336086 339579
53784 339579 343133 346989 351657 357411 364236 372327 382280 394578 409067 425198 442758 461979 482545
53771 482545 502525 518688 528103 529307 522022 506448 483543 455757 426682 399493 375790 355798
53759 355798 339181 325422 313817 303663 294648 286939 280810 276174 272561 269487 266732 264103 261155
53746 261155 257558 253797 251078 250248 250956 252080 252643 252235 250958 249435 248563 248767 249565 250235 250674 251259 252077
53729 252077 252843 253446 254100 254983 256181 257884 260160 262596 264708 266689 269178 272236 275112 277142 278380
53714B78380Q52Q43J406K677M101M791M595M159M049M376N141O229P066P110O706
53699C42481O819P664Q348Q170P647P781Q688R451R137P548N059K172p12l272
53685D26981n206o338o804p048p399p700p548o890o126n590n159m498l515k470
53671C44690j751j635k078k628k687k090j342j137j602k139k046j223k31K89J30
53656C22520m05q39q63n25j89j85m69o07k58M44J011J102P85M28L40N28P16P44
53638C24278Q33J244J747J810J425J162J243J171P25P29J946L668M344L600K721
53623C52646K960M151N211N341M459L044J994K042L006L872L917L399L069L390
53609D02501M295N282N599M936L986L791M375M791M580M284M183L543J885J11
$$ plain form
53714 278380 279232 280075 281481 284158 288259 293050 297645 301804 305853 310229 315370 321599 328665 335775 342481
53699 342481 349300 356964 365312 373482 381129 388910 397598 407049 416186 423734 428793 430965 430253 426981
53685 426981 421775 415437 408633 401585 394186 386486 378938 372048 365922 360332 355173 350675 347160 344690
53671 344690 342939 341304 339226 336598 333911 331821 330479 329342 327740 325601 323555 322332 322101 322390 322520
53656 322520 322115 321276 320413 319888 319699 319514 319045 318438 318180 318624 319635 320737 321522 321950 322290 322818 323534 324278
53638 324278 325111 326355 328102 329912 331337 332499 333742 334913 335638 336367 338313 341981 346325 349925 352646
53623 352646 355606 359757 364968 370309 374768 377812 379806 381848 384854 388726 392643 396042 399111 402501
53609 402501 406796 412078 417677 422613 426599 430390 434765 439556 444136 448420 452603 456146 458031 458142
53595D58142n02l7L34m6p98j376j657j702j576j478j634k007k441k893l245l216
53579D33868k802k498k638k863k716k413k392k435j976j127o34q18j213j333j202
53564D04808j010p51m17j59o9j15k83o03r04q27j75Q71J830K216J879J226Q98
53547D08415J105J506J856K322K988L486L577L696M394N466O170O138N736N620
53533D62475O257P650R192J0109J0344J0708J1797J3191J4136J4516J4693J4855
53521E99923J5165J6044J7532J8848J9428K0057K1939K4861K7398K8858K9956
53510H40009L1454L3202L4780L6120L7029L6951L5697L3779L1576K8811K5361
53499A204769K1972J9521J7951J6564J5179J4411J4723J5692J6448J6693J6955
$$ plain form
53595 458142 457640 457603 457937 457891 457093 455717 454060 452358 450782 449304 447670 445663 443222 440329 437084 433868
53579 433868 431066 428568 425930 423067 420351 417938 415546 413111 411135 410008 409374 408556 407343 406010 404808
53564 404808 403798 403047 402630 402471 402402 402287 402004 401401 400497 399670 399495 400366 402196 404412 406291 407517 408415
53547 408415 409520 411026 412882 415204 418192 421678 425255 428951 433345 438811 444981 451119 456855 462475
53533 462475 468732 476382 485574 495683 506027 516735 528532 541723 555859 570375 585068 599923
53521 599923 615088 631132 648664 667512 686940 706997 728936 753797 781195 810053 840009
53510 840009 871463 904665 939445 975565 1012594 1049545 1085242 1119021 1150597 1179408 1204769
53499 1204769 1226741 1246262 1264213 1280777 1295956 1310367 1325090 1340782 1357230 1373923 1390878
53488A390878J7722J8592J8727J8117J7718J8114J8669J8563J8014J7733J7642
53477A590489J7013J5630J3829J1608Q664N331K459K35j982m511o912q921j0897
53464A632035j2951j4521j5264j5610j6089j6711j7397j8338j9511k0577k1536
53453A443530k2789k4175k4798k4374k3898k4247k4811k4335k2605k0450j8477
53442A188571j6638j4848j3235j1802j0398q944p358n487l466j834q68j61P48
53429A094280J815K988M720P260R836J1431J2149J3030J4596J6349J7696J8640
53417A224790J9503K0571K2087K4083K6120K7649K8688K9792L1390L3492L5955
53406A524120L8552M0909M2864M4766M7008M9430N1731N4110N6798N9201O0499
$$ plain form
53488 1390878 1408600 1427192 1445919 1464036 1481754 1499868 1518537 1537100 1555114 1572847 1590489
53477 1590489 1607502 1623132 1636961 1648569 1657233 1662564 1665023 1665258 1663276 1658765 1651853 1642932 1632035
53464 1632035 1619084 1604563 1589299 1573689 1557600 1540889 1523492 1505154 1485643 1465066 1443530
53453 1443530 1420741 1396566 1371768 1347394 1323496 1299249 1274438 1250103 1227498 1207048 1188571
53442 1188571 1171933 1157085 1143850 1132048 1121650 1112706 1105348 1099861 1096395 1094561 1093693 1093532 1094280
53429 1094280 1096095 1099083 1103803 1111063 1120899 1132330 1144479 1157509 1172105 1188454 1206150 1224790
53417 1224790 1244293 1264864 1286951 1311034 1337154 1364803 1393491 1423283 1454673 1488165 1524120
53406 1524120 1562672 1603581 1646445 1691211 1738219 1787649 1839380 1893490 1950288 2009489 2069988
53395B069988O0995O1799O3100O3921O3853O3817O4418O4750O3767O1901O0200
53384B762509N8550N6060N2783M9665M6902M3616L9290L4385K9252K3614J7530
53373C214156J1780O732J661m069j0002j5488k0928k7193l4308m1593m8576n4845
53361B977327n9488o1866o2817o3861o5190o5577o4432o2647o1015n9093n6359
53350B294982n3482n1464n0187m8896m7547m6772m6725m6846m6572m5585m3572
53339A767334m0530l7215l4528l2512l0539k8321k6085k3876k1455j8925j6764
53328A456584j5211j4247j4039j4660j5440j5444j4690j3952j3286j1790r335
53317A304490p364p147p939p858o280m385l389l046k175k30K051L502L902M249
$$ plain form
53395 2069988 2130983 2192782 2255882 2319803 2383656 2447473 2511891 2576641 2640408 2702309 2762509
53384 2762509 2821059 2877119 2929902 2979567 3026469 3070085 3109375 3143760 3173012 3196626 3214156
53373 3214156 3225936 3232668 3234329 3230260 3220258 3204770 3183842 3156649 3122341 3080748 3032172 2977327
53361 2977327 2917839 2855973 2793156 2729295 2664105 2598528 2534096 2471449 2410434 2351341 2294982
53350 2294982 2241500 2190036 2139849 2090953 2043406 1996634 1949909 1903063 1856491 1810906 1767334
53339 1767334 1726804 1689589 1655061 1622549 1592010 1563689 1537604 1513728 1492273 1473348 1456584
53328 1456584 1441373 1427126 1413087 1398427 1382987 1367543 1352853 1338901 1325615 1313825 1304490
53317 1304490 1297126 1289979 1282040 1274182 1267902 1263517 1260128 1257082 1254907 1254677 1256728 1260230 1264132 1268381
53303A268381N647Q093J0732J3157J5770J8760K1429K3014K3771K4749K6676K9328
53291A489507L1903L3632L4169L3656L2412L0561K8116K5379K2872K0762J8677
53280A801646J6223J3394J0342P061L478l34m122p446r844j1497j3487j6714k0508
53267A768192k3226k4373k5221k6910k8950l0273l0855l1349l1744l1570l1113
53256A452608l1291l2332l3430l3759l3192l2021l0661k9637k9126k8611k7526
53245A111022k6273k5818k6341k6986k7074k6755k6272k5387k3892k2056k0182
53234H33986j8271j6445j5112j4258j3133j1254r313q467q938r838j0270j0156
53222F88531j0082j0668j2060j3681j4622j4546j4071j3946j4153j4173j3870
$$ plain form
53303 1268381 1274028 1282121 1292853 1306010 1321780 1340540 1361969 1384983 1408754 1433503 1460179 1489507
53291 1489507 1521410 1555042 1589211 1622867 1655279 1685840 1713956 1739335 1762207 1782969 1801646
53280 1801646 1817869 1831263 1841605 1848666 1852144 1851810 1847688 1840242 1830398 1818901 1805414 1788700 1768192
53267 1768192 1744966 1720593 1695372 1668462 1639512 1609239 1578384 1547035 1515291 1483721 1452608
53256 1452608 1421317 1388985 1355555 1321796 1288604 1256583 1225922 1196285 1167159 1138548 1111022
53245 1111022 1084749 1058931 1032590 1005604 978530 951775 925503 900116 876224 854168 833986
53234 833986 815715 799270 784158 769900 756767 745513 736200 727733 718795 708957 698687 688531
53222 688531 678449 667781 655721 642040 627418 612872 598801 584855 570702 556529 542659
53211E42659j3471j2840j1540r736q365q037q290q363q230q311q503q207p313
53198D21453o598o849p930q926r045q264p164o221n316m039k524j625j949k995
53184C42008l699l701l478l301k838j965j217r80r28p22p33j331j968j774q37
53169C12536j3M20R91J859K293J695N12l68o32o22o55o78m20K73J139J576J234
53152C21140N22J52K05J54k49o44p70q61j042q90k2J188J950J819R46j73q71o87
53134C21867J37P42N97K5l60l84j93J22L51O4p44j334j118o10p58j496j756j052
53116C14100k54m43j505k340k285j765j593j948k297k127j487q00l99m18q74j561
53100B92004j978j787j227p22k28N43J285J256L95l99m84l16n92j151j425j390
$$ plain form
53211 542659 529188 516348 504808 495072 486707 478670 470380 462017 453787 445476 436973 428766 421453
53198 421453 414855 408006 400076 391150 382105 373841 366677 360456 355140 351101 348577 346952 345003 342008
53184 342008 338309 334608 331130 327829 324991 323026 321809 320829 319901 319179 318446 317115 315147 313373 312536
53169 312536 312523 312943 313934 315793 318086 319781 320293 319925 319293 318671 318016 317338 316918 317191 318330 319906 321140
53152 321140 321662 321814 322019 322173 321924 321280 320510 319649 318607 317717 317695 318883 320833 322652 323598 323425 322554 321867
53134 321867 322004 322746 323343 323368 323008 322624 322431 322553 322904 322968 322224 320890 319772 319162 318404 316908 315152 314100
53116 314100 313846 313403 311898 309558 307273 305508 303915 301967 299670 297543 296056 295256 294857 294439 293565 292004
53100 292004 290026 288239 287012 286290 286062 286605 287890 289146 289541 289142 288658 288342 287750 286599 285174 283784
53084B83784j390j298p31Q7N05M25M07O45O73L05J25N76J081P10m96j514j591
53067B82303j042o00n10n46p18j291k068k239j326N7Q75Q86O79O98Q96J278K039
53050B79371K916L129K365J314P81P41O90M55K14P7J04M60J049J279P03l01r35
53033B94412r23o71n73o04m69P3R40J625J596R37K57j09m09p42o99j29L72K85
53015B95169m9q8j8k67n37k59L13L48k55o93m52J5Jn70j098q61K71J445J463K37
52995B94115q63o28M26R09M79j9k5J57K33L24M42M42N75J206J897J731P07j23
52977C01985j83j00n16j072j081m89L44J199J858J990J628J280J171R43M60L40
52961C09757J119K336L035K821J970Q28l85j415k015k146j948j659j574j763j816
$$ plain form
53084 283784 282394 281096 280365 280452 280957 281382 281789 282434 283107 283412 283537 284113 285194 285904 285408 283894 282303
53067 282303 281261 280661 280151 279605 278887 277596 275528 273289 271963 272020 272895 273781 274460 275158 276054 277332 279371
53050 279371 282287 285416 287781 289095 289876 290617 291307 291762 291976 292053 292157 292617 293666 294945 295648 295347 294412
53033 294412 293489 292818 292245 291641 291172 291245 292185 293810 295406 296343 296600 296491 296082 295340 294641 294512 294884 295169
53015 295169 295120 295032 295014 294747 294210 293951 294264 294612 294357 293664 293212 293227 293228 292658 291560 290699 290970 292415 293878 294115
52995 294115 293252 292624 293050 293959 294438 294419 294394 294551 294784 295108 295550 295992 296567 297773 299670 301401 302108 301985
52977 301985 301802 301702 301186 300114 299033 298544 298888 300087 301945 303935 305563 306843 308014 308957 309417 309757
52961 309757 310876 313212 316247 319068 321038 321866 321481 320066 318051 315905 313957 312298 310724 308961 307145
52946C07145j313n01n5j38l60o55j322k046j895p22K92K17l58l74N2N9m80r23
52928B96623j059j338j838j880r73M29J344J163J58p65q87m51l21p30q67j70O27
52911B89065M61m45q87m37J29J69l2p7j95o79j229j419j347j267r68j33Q98J416
52893B83023J315J189J352J333O54k84o01n8O58P85K91l18o74q04r16j129j369
52876B84447j442j190o97j48M65J239J941K091J697J399J523J490P59r9j20M85
52860B93840N13l72r78k52J223K013J609P76L78N06O32J89j010k595l914m630
52844B87928m902m883m381l256j940j141j117j438j458r29k19R4j25l64q0N86
52828B62375J058J089Q47L66m84j443j897j690j292j036p44l54k00l16j31N77
$$ plain form
52946 307145 305832 305331 305276 305138 304778 304123 302801 300755 298860 298138 298430 298647 298289 297915 297967 298026 297546 296623
52928 296623 295564 294226 292388 290508 289535 289964 291308 292471 292629 291864 290977 290526 290205 289475 288608 288438 289065
52911 289065 289526 289081 288194 287757 287886 288055 288023 287946 287751 287072 285843 284424 283077 281810 280842 280709 281607 283023
52893 283023 284338 285527 286879 288212 288866 288582 287981 287923 288581 289366 289657 289339 288665 287861 286945 285816 284447
52876 284447 283005 281815 281118 280970 281435 282674 284615 286706 288403 289802 291325 292815 293574 293475 293355 293840
52860 293840 294353 293981 293003 292751 293974 295987 297596 298372 298750 299256 299888 300077 299067 296472 292558 287928
52844 287928 283026 278143 273762 270506 268566 267425 266308 264870 263412 262483 262264 262358 262233 261869 261789 262375
52828 262375 263433 264522 265369 265735 265251 263808 261911 260221 258929 257893 257149 256795 256595 256279 256148 256725
52812B56725J173J104Q24J088J802K401K909L671M322L946K361M36r76j763k114
52797B77909k067j800j813k396l180l519l169k383j540q99o10p10j017j124p24
52782B50958oM46L15MQ0M88O99O12O75J090J447J389J042N74n9o28o13q9J31k17
52762B58338j85R17K120J962N87m75m40J3J65K10M94P77P68O61P01P28N17J24
52744B67982l49q92j267j020j24Q95J626K162K575K571J990J206O21J77k40l25
52728B77588J70P75P36K7o03o55m82o31j010j109q17o33q76j129p89K8N66M60
52710B71616J79L17Q30J257J311R00J7r80j309o10M13P87N00K69L05J34l20m28
52692B75188J07O82P41O09Q05J083Q33J54j78K82J160J864K181K176J845J123
$$ plain form
52812 256725 257898 259002 259826 260914 262716 265117 268026 271697 276019 279965 282326 282762 281786 280023 277909
52797 277909 275842 274042 272229 269833 266653 263134 259965 257582 256042 255143 254533 253823 252806 251682 250958
52782 250958 250952 251398 251713 251717 251797 252285 252984 253596 254271 255361 256808 258197 259239 259813 259754 259126 258513 258424 258555 258338
52762 258338 258153 259070 261190 263152 263739 263264 262824 262837 263002 263212 263706 264483 265251 265912 266613 267341 267858 267982
52744 267982 267633 266741 265474 264454 264330 265225 266851 269013 271588 274159 276149 277355 277976 278153 277913 277588
52728 277588 277758 278533 279269 279296 278693 278038 277556 276925 275915 274806 273989 273356 272480 271351 270562 270590 271156 271616
52710 271616 271795 272112 272942 274199 275510 276410 276427 275447 274138 273528 273941 274728 275228 275497 275802 275936 275616 275188
52692 275188 275295 275977 276718 277327 278132 279215 280048 280202 280024 280306 281466 283330 285511 287687 289532 290655
52676B90655J50o22o69J42J319K076J984J296N91K54K69L88L44N2l33n71n57k91
52658B96477K42R47J449J341O89N2j19J24M48O32O57N82M58K60j51p90j317j379
52640C00602j187j349j967k306j718n63K52M50O06J222K094K784L322M067N037
52625C11346N662N353M096K428Q98l34j428k532l528m088l996l352k465j550p14
52610C05796k24m27j245j996k140j931j860j696p77P10J617J310N31K81N18O47
52594B99114O74J010J465J437J019R80J585K170K149J701J289J066R88R92Q15
52579C18454K18m42m50J73N18K9o57o81j47K20K57L90P81J023P60P5p09j288j421
52560C17103j120p64o94p79o68m18m08o69p28l19J72K06j58l61j18J95N1m57o19
$$ plain form
52676 290655 290805 290183 289514 289656 290975 293051 295035 296331 296922 297176 297445 297833 298177 298229 297896 297325 296768 296477
52658 296477 296719 297666 299115 300456 301145 301197 301078 301202 301650 302282 302939 303521 303979 304239 304088 303298 301981 300602
52640 300602 299415 298066 296099 293793 292075 291512 291764 292214 292820 294042 296136 298920 302242 306309 311346
52625 311346 317008 322361 326457 328885 329783 329449 328021 325489 321961 317873 313877 310525 308060 306510 305796
52610 305796 305572 305145 303900 301904 299764 297833 295973 294277 293500 294210 295827 297137 297668 297949 298467 299114
52594 299114 299788 300798 302263 303700 304719 305699 307284 309454 311603 313304 314593 315659 316647 317639 318454
52579 318454 318672 318230 317780 317953 318471 318500 317843 317162 317015 317235 317492 317882 318663 319686 320446 320521 319812 318524 317103
52560 317103 315983 315219 314525 313746 313078 312660 312252 311583 310855 310536 310708 310914 310756 310395 310277 310472 310523 310066 309447
52541C09447J8R63J258N90l76q86r07q27p07l21K40N51N43O59J112J423J095M51
52523C14326K55O06P58K13n22o18n2M57N01M62Q44J521K032K268K537L035L561
52506C32184L793L561K813J570L5j375k303k766l059l332l320k686j643r75j280
52491C21217k216k836k586j707o67L59J274J779J653J096M92Ql01k47K98J063
52475C18679J634J904K067K244K426K667L011L316L422L424L467L435L187K955
52461C57838L094L494L583K942J610j16j838l121l826m323m972n514n448m903
52447C38500m522m452m174l461k872k900l169k944k118j237p13m18kO36J210J346
52431C08710R82M87K33J74M2k50n82q94j047o72L50J388J645J191Q42R70J134
$$ plain form
52541 309447 309465 310428 311686 312276 311900 311014 310107 309280 308573 308252 308492 309043 309586 310245 311357 312780 313875 314326
52523 314326 314581 315187 315945 316158 315636 315018 314966 315423 315924 316386 317230 318751 320783 323051 325588 328623 332184
52506 332184 335977 339538 342351 343921 343956 342581 340278 337512 334453 331121 327801 325115 323472 322497 321217
52491 321217 319001 316165 313579 311872 311205 311564 312838 314617 316270 317366 317858 317866 317565 317318 317616 318679
52475 318679 320313 322217 324284 326528 328954 331621 334632 337948 341370 344794 348261 351696 354883 357838
52461 357838 360932 364426 368009 370951 372561 372445 370607 367486 363660 359337 354365 348851 343403 338500
52447 338500 333978 329526 325352 321891 319019 316119 312950 310006 307888 306651 305938 305520 305518 306154 307364 308710
52431 308710 309692 310179 310412 310586 310628 310378 309796 308902 307855 307183 307533 308921 310566 311757 312599 313569 314703
52414C14703J027R74J238J558J792K407L758N461O971Q361R965J1638J2914J3583
52400C96350J3524J2270R403N270Q62k983n901p778q706r004q827p932o243m471
52386C75834l579l640l768l228k197j300p79k75O55J986L108L447L141K882K977
52371C75264L074L051L503M742N865N681M318K958K112J120m14j749k075j635
52357D05815j165q25m10j29l38o63k78Q54J787J885J646J789K064J664O38J25
52341D14459R74K695M131M775N005N305N827O606P603Q443Q712Q719R383J1030
52327E03667J2826J3888J4551J5806J7710J9201J9510J9119J8908J8994J8836
52316F93016J8198J7472J7087J7055J7177J7447J8057J9005J9875K0153J9862
$$ plain form
52414 314703 315730 316704 317942 319500 321292 323699 327457 332918 339889 348250 358215 369853 382767 396350
52400 396350 409874 422144 431547 436817 437679 434696 428795 421017 412311 403307 394480 386548 380305 375834
52386 375834 372255 368615 364847 361619 359422 358122 357343 357068 357723 359709 362817 366264 369405 372287 375264
52371 375264 378338 381389 384892 389634 395499 401180 405498 408456 410568 411688 411274 409525 407450 405815
52357 405815 404650 403825 403415 403286 402948 402285 402007 402861 404648 406533 408179 409968 412032 413696 414334 414459
52341 414459 415433 418128 422259 427034 432039 437344 443171 449777 457380 465823 474535 483254 492637 503667
52327 503667 516493 530381 544932 560738 578448 597649 617159 636278 655186 674180 693016
52316 693016 711214 728686 745773 762828 780005 797452 815509 834514 854389 874542 894404
52305H94404J9694K0233K1125K1329K0347J8823J7663J6878J5745J3955J1988
52294A092184J0233Q297N618K439m33k656m605o524p955q399q124p968q420r221
52280A054466r733r462q235o242l959j889l65N22R81J644L253N802Q235R453R640
52265A054111J0139J1909J4458J6511J7389J7461J7400J7294J6722J5582J4600
52254A223576J4582J5333J5790J5366J4538J3733J2338R593N990K784K94k235
52242A341682n024p084p612p194p070p807r141j0610j1773j2277j2210j2103j2218
52229A219559j2190j1693j1043j0726j0739j0765j0629j0141q942p052n227m204
52217A106208l857l512k796j752m54R07J880K290K716L835N427O648P099P092
$$ plain form
52305 894404 914098 934331 955456 976785 997132 1015955 1033618 1050496 1066241 1080196 1092184
52294 1092184 1102417 1110714 1116332 1118771 1118338 1115682 1111077 1104553 1096598 1088199 1080075 1072107 1063687 1054466
52280 1054466 1044733 1035271 1027036 1020794 1016835 1014946 1014581 1015103 1016084 1017728 1020981 1026783 1035018 1044471 1054111
52265 1054111 1064250 1076159 1090617 1107128 1124517 1141978 1159378 1176672 1193394 1208976 1223576
52254 1223576 1238158 1253491 1269281 1284647 1299185 1312918 1325256 1334849 1340839 1343623 1343917 1341682
52242 1341682 1336658 1329574 1321962 1314768 1307698 1299891 1290750 1280140 1268367 1256090 1243880 1231777 1219559
52229 1219559 1207369 1195676 1184633 1173907 1163168 1152403 1141774 1131633 1122691 1115639 1110412 1106208
52217 1106208 1102351 1098839 1096043 1094291 1093837 1094744 1096624 1098914 1101630 1105465 1110892 1117540 1124639 1131731
52203A131731O970O744O357N787M947L925L269L455M249N089N940P070Q107Q186
52189A211826P169O008N523N415M838L433J436q00k991m890o441p888r496j1223
52175A201919j2745j3587j3281j1711r434p347n885m813l852l068k415j390L83
52162A112774K481M100N067N908O874P357O640M914L156J981J061j56j475k051
52148A158631j388R5J521K283K394K391K882L805M175L034P26j267j969j796j565
52133A173952j308o02N59J957L832O455R320J1603J3370J5511J8332K1137K3368
52120A297486K5409K7777L0195L1952L2798L3010L2883L2483L1670L0094K7440
52109A633197K4047K0935J8831J7390J5775J3853J2334J1790J1998J2302J2186
$$ plain form
52203 1131731 1138701 1145445 1151802 1157589 1162536 1166461 1169730 1173185 1177434 1182523 1188463 1195533 1203640 1211826
52189 1211826 1218995 1225003 1230526 1235941 1240779 1244212 1245648 1244848 1241857 1236967 1230526 1222638 1213142 1201919
52175 1201919 1189174 1175587 1162306 1150595 1141161 1133814 1127929 1123116 1119264 1116196 1113781 1112391 1112774
52162 1112774 1115255 1119355 1124422 1130330 1137204 1144561 1151201 1156115 1159271 1161252 1162313 1162157 1160682 1158631
52148 1158631 1157243 1157338 1158859 1161142 1163536 1165927 1168809 1172614 1176789 1179823 1180549 1179282 1177313 1175517 1173952
52133 1173952 1172644 1172042 1172601 1174558 1178390 1184845 1194165 1205768 1219138 1234649 1252981 1274118 1297486
52120 1297486 1322895 1350672 1380867 1412819 1445617 1478627 1511510 1543993 1575663 1605757 1633197
52109 1633197 1657244 1678179 1697010 1714400 1730175 1744028 1756362 1768152 1780150 1792452 1804638
52098A804638J1454J0148Q596P208N981M402K072p59l663o830j0865j5656k0080
52085A796646k3039k4383k4447k3248k0811j7890j5462j3538j1276q343n430l118
52073A605661j090J177L576N733P635R385J0831J1927J3005J4224J5160J5482
52061A712706J5518J5643J5580J4934J3976J3153J2326J1241J0315J0048R977
$$ plain form
52098 1804638 1816092 1826240 1834836 1842044 1848025 1852427 1854499 1853740 1850077 1843247 1832382 1816726 1796646
52085 1796646 1773607 1749224 1724777 1701529 1680718 1662828 1647366 1633828 1622552 1614209 1608779 1605661
52073 1605661 1604571 1605748 1609324 1615057 1622692 1632077 1642908 1654835 1667840 1682064 1697224 1712706
52061 1712706 1728224 1743867 1759447 1774381 1788357 1801510 1813836 1825077 1835392 1845440 1855417
$$ [...]
##END NTUPLES=NMR SPECTRUM
##END=
