##TITLE=AC1525_ROEFFECT0006_8202208_8TdhNIkwTJ
##JCAMPDX= 6.0         $$ Bruker NMR JCAMP-DX V2.0
##DATA TYPE= NMR SPECTRUM
##DATA CLASS= NTUPLES
##ORIGIN= BRUKER
##OWNER= Administrator
$$ 1.72 TOPSPIN		Version 2.1
$$ 2014-07-31 16:32:53.974 -0700  Administrator@X
$$ Compression mode = diff/dup
##.OBSERVE FREQUENCY= 400.02188249412
##.OBSERVE NUCLEUS= ^1H
##.ACQUISITION MODE= SIMULTANEOUS (DQD)
##.ACQUISITION SCHEME= undefined
##.AVERAGES= 8
##.DIGITISER RES= 22
##SPECTROMETER/DATA SYSTEM= spect
##.PULSE SEQUENCE= zg30
##.SOLVENT NAME= COFFEE_meoh
##.SHIFT REFERENCE= INTERNAL, COFFEE_meoh, 1, 14.98509
##AUDIT TRAIL= $$ (NUMBER, WHEN, WHO, WHERE, PROCESS, VERSION, WHAT)
$$ ##TITLE= Audit trail, TOPSPIN		Version 2.1
$$ ##JCAMPDX= 5.01
$$ ##ORIGIN= Bruker BioSpin GmbH
$$ ##OWNER= Administrator
$$ $$ E:\/data/COFFEE/nmr/AC1525_ROEFFECT0006_8202208_8TdhNIkwTJ/20/pdata/1/auditp.txt
$$ ##AUDIT TRAIL=  $$ (NUMBER, WHEN, WHO, WHERE, PROCESS, VERSION, WHAT)
(   1,<2014-07-31 16:32:43.598 -0700>,<Administrator>,<X>,<go>,<TOPSPIN 2.1>,
      <created by zg
	started at 2014-07-31 16:31:29.265 -0700,
	POWCHK enabled, PULCHK disabled,
       configuration hash MD5:
       16 EA D6 F4 BB 67 03 14 9B FF E7 A0 43 5B 48 2E
       data hash MD5: 64K
       8F 4A A3 E9 94 70 B5 93 6C 45 A4 74 B1 15 3A 2E>)
(   2,<2014-07-31 16:32:48.075 -0700>,<Administrator>,<X>,<proc1d>,<TOPSPIN 2.1>,
      <Start of raw data processing
       efp LB = 0 FT_mod = 6 PKNL = 1 PHC0 = 0 PHC1 = 0 SI = 32K 
       data hash MD5: 32K
       8F 58 83 EE D4 61 6C EE C3 FC A9 67 1B B5 B1 04>)
(   3,<2014-07-31 16:32:48.543 -0700>,<Administrator>,<X>,<proc1d>,<TOPSPIN 2.1>,
      <pk PHC0 = 93.62 PHC1 = 0 
       data hash MD5: 32K
       07 C1 A7 8B A2 C3 6D D0 32 C0 51 D6 7C 39 EF 1C>)
(   4,<2014-07-31 16:32:48.707 -0700>,<Administrator>,<X>,<proc1d>,<TOPSPIN 2.1>,
      <abs ABSG = 1 
       data hash MD5: 32K
       F2 9E E6 43 26 62 69 20 5D 40 58 E2 04 40 89 DE>)
(   5,<2014-07-31 16:32:48.778 -0700>,<Administrator>,<X>,<proc1d>,<TOPSPIN 2.1>,
      <abs ABSG = 2 
       data hash MD5: 32K
       2E 67 E2 95 CF 12 0C FE D7 AE 19 F8 CA 60 B5 07>)
(   6,<2014-07-31 16:32:48.871 -0700>,<Administrator>,<X>,<proc1d>,<TOPSPIN 2.1>,
      <abs ABSG = 3 
       data hash MD5: 32K
       BD 90 BF 95 39 CA 14 FE 84 DE 2C 43 18 B9 F6 87>)
(   7,<2014-07-31 16:32:48.989 -0700>,<Administrator>,<X>,<proc1d>,<TOPSPIN 2.1>,
      <abs ABSG = 4 
       data hash MD5: 32K
       CC 9B 69 54 13 BF 6D F9 27 33 EB 46 BA 10 DA 7F>)
(   8,<2014-07-31 16:32:49.082 -0700>,<Administrator>,<X>,<proc1d>,<TOPSPIN 2.1>,
      <abs ABSG = 5 
       data hash MD5: 32K
       A8 C2 E8 F3 15 50 88 0A 31 D3 7E 01 2E 69 18 1D>)
$$ ##END=
$$ 
$$ $$ hash MD5
$$ $$ 03 77 E0 5D FC 3D 71 17 E4 45 C0 3A B5 64 BD 75
##$RELAX= 
##$RELAX= 
##$RELAX= 
##$RELAX= 
##$RELAX= 
##$RELAX= 
##$RELAX= 
$$ Bruker specific parameters
$$ --------------------------
##$DU= <E:\>
##$EXPNO= 20
##$NAME= <AC1525_ROEFFECT0006_8202208_8TdhNIkwTJ>
$$ [...]
##$TP= (0..7)
150 150 150 150 150 150 150 150
##$TP07= 0
##$TPNAME0= <>
##$TPNAME1= <>
##$TPNAME2= <>
##$TPNAME3= <>
##$TPNAME4= <>
##$TPNAME5= <>
##$TPNAME6= <>
##$TPNAME7= <>
##$TPOAL= (0..7)
0.5 0.5 0.5 0.5 0.5 0.5 0.5 0.5
##$TPOFFS= (0..7)
0 0 0 0 0 0 0 0
##$TUNHIN= 0
##$TUNHOUT= 0
##$TUNXOUT= 0
##$USERA1= <user>
##$USERA2= <user>
##$USERA3= <user>
##$USERA4= <user>
##$USERA5= <user>
##$V9= 5
##$VALIST= <valist>
##$VCLIST= <CCCCCCCCCCCCCCC>
##$VD= 0
##$VDLIST= <DDDDDDDDDDDDDDD>
##$VPLIST= <PPPPPPPPPPPPPPP>
##$VTLIST= <TTTTTTTTTTTTTTT>
##$WBST= 1024
##$WBSW= 4
##$XGAIN= (0..3)
0 0 0 0
##$XL= 0
##$YL= 0
##$YMAX_a= 639469
##$YMIN_a= -543376
##$ZGOPTNS= <>
##$ZL1= 120
##$ZL2= 120
##$ZL3= 120
##$ZL4= 120
##$ABSF1= 14.98509
##$ABSF2= -5.573092
##$ABSG= 5
##$ABSL= 3
##$ALPHA= 0
##$AQORDER= 0
##$ASSFAC= 0
##$ASSFACI= 0
##$ASSFACX= 0
##$ASSWID= 0
##$AUNMP= <proc_prof1d_extract_pilot.lims>
##$AXLEFT= 0
##$AXNAME= <>
##$AXNUC= <1H>
##$AXRIGHT= 0
##$AXTYPE= 0
##$AXUNIT= <>
##$AZFE= 0.1
##$AZFW= 0.1
##$BCFW= 0
##$BC_mod= 0
##$BYTORDP= 0
##$COROFFS= 0
##$CY= 15
##$DATMOD= 1
##$DC= 0
##$DFILT= <>
##$DTYPP= 0
##$F1P= 0
##$F2P= 0
##$FCOR= 0.5
##$FTSIZE= 32768
##$FT_mod= 6
##$GAMMA= 0
##$GB= 0
##$INTBC= 1
##$INTSCL= 1
##$ISEN= 128
##$LB= 0
##$LEV0= 0
##$LPBIN= 0
##$MAXI= 10000
##$MC2= 0
##$MEAN= 0
##$ME_mod= 0
##$MI= 0
##$NCOEF= 0
##$NC_proc= -8
##$NLEV= 6
##$NOISF1= 0
##$NOISF2= 0
##$NSP= 0
##$NTH_PI= 0
##$NZP= 0
##$OFFSET= 14.98509
##$PC= 1
##$PHC0= 93.62
##$PHC1= 0
##$PH_mod= 1
##$PKNL= yes
##$PPARMOD= 0
##$PPDIAG= 0
##$PPIPTYP= 0
##$PPMPNUM= 2147483647
##$PPRESOL= 1
##$PSCAL= 4
##$PSIGN= 0
##$PYNMP= <proc.py>
##$REVERSE= no
##$SF= 400.02
##$SI= 32768
##$SIGF1= 0
##$SIGF2= 0
##$SINO= 400
##$SIOLD= 32768
##$SPECTYP= <>
##$SREGLST= <1H.CDCl3>
##$SSB= 0
##$STSI= 32768
##$STSR= 0
##$SW_p= 8223.68421052631
##$SYMM= 0
##$S_DEV= 0
##$TDeff= 65536
##$TDoff= 0
##$TI= <>
##$TILT= no
##$TM1= 0
##$TM2= 0
##$TOPLEV= 0
##$USERP1= <user>
##$USERP2= <user>
##$USERP3= <user>
##$USERP4= <user>
##$USERP5= <user>
##$WDW= 1
##$XDIM= 32768
##$YMAX_p= 453369373
##$YMIN_p= -698401
##$CURPLOT= <Network HP LaserJet P1505>
##$CURPRIN= <$Network HP LaserJet P1505>
##$DFORMAT= <normdp>
##$LAYOUT= <+/1D_H.xwp>
##$LFORMAT= <normlp>
##$PFORMAT= <normpl>
##$SURQMSG= 1
$$ End of Bruker specific parameters
$$ ---------------------------------
##NTUPLES= NMR SPECTRUM
##VAR_NAME=  FREQUENCY,     SPECTRUM/REAL,   SPECTRUM/IMAG
##SYMBOL=    X,             R,               I
##VAR_TYPE=  INDEPENDENT,   DEPENDENT,       DEPENDENT
##VAR_FORM=  AFFN,          ASDF,            ASDF
##VAR_DIM=   32768,         32768,           32768
##UNITS=     HZ,            ARBITRARY UNITS, ARBITRARY UNITS
##FACTOR=    0.250966925370066, 1,           1
##FIRST=     8223.43324360094, 204008,       -71064
##LAST=      0,             47643,           -141182
##MIN=       0,             -698401,         0
##MAX=       8223.43324360094, 453369373,    0
$$ Real data points
##PAGE= N=1
##DATA TABLE= (X++(R..R)), XYDATA
$$ [...]
19507a32884c0420I9804b87512O6006B86584a0730j31934H2722a79621N1093M7707
$$ -132884 -30420 99804 -287512 -221506 286584 -10730 -142664 82722 -179621 -128528 -80821
19496h0821j00546A70237q2360R0464a14227e0572A23646L278a20434K3881A60241
$$ -80821 -181367 170237 87877 178341 -114227 -50572 123646 126924 -120434 -96553 160241
19484a73786E2364b89905o909J31065P3816j55418n7939A04360d4901k07276D3845
$$ -173786 52364 -289905 -296814 -165749 -91933 -247351 -305290 104360 -44901 -252177 43845
19472A53688a14074B88858j30506B3454d937l7697E3736b36225B04452a61471
$$ 153688 -114074 288858 158352 23454 -4937 -42634 53736 -236225 204452 -161471
19461b78086F2583J33790a45585n2523D5301L80J56579B8471c6967n0285l38439
$$ -278086 62583 196373 -145585 -198108 45301 45681 202260 28471 -36967 -87252 -425691
19450d25691b3657l9528k6905B8617c20106a9529m0811J3745k3512j07736b4425
$$ -425691 -23657 -63185 -90090 28617 -320106 -19529 -60340 -46595 -70107 -177843 -24425
19438F275K1377N3090J49574d47422i0929k77366b8416B6849P8082f1522k32248
$$ 6275 27652 80742 230316 -447422 -90929 -368295 -28416 26849 104931 -61522 -293770
19427b93770J19438g0006B05348a56834A83232a22884n2031A10962b8734G499
$$ -293770 -174332 -70006 205348 -156834 183232 -122884 -174915 110962 -28734 7499
19416A25411d2897j27177J4469O5403k0951B23670b62284c8749j61296E7759a85642
$$ 125411 -42897 -170074 -155605 -90202 -111153 223670 -262284 -38749 -200045 57759 -185642
19404f7156n6212A55582k5691c44843a52885j7563C0428b08082A84425a27114
$$ -67156 -123368 155582 129891 -344843 -152885 -170448 30428 -208082 184425 -127114
19393b0635j46351E098Q1422i2743q4654j08976J32755A95366d8670j69373e2538
$$ -20635 -166986 5098 86520 -92743 -177397 -286373 -153618 195366 -48670 -218043 -52538
19381a49878J688K8627d0592j57350H9763J1301i7675P350n1233J1039P464B67633
$$ -149878 -148190 -119563 -40592 -197942 89763 101064 -97675 -90325 -141558 -130519 -123055 267633
19368a13864A02930b01793I6064a22412k0988o4729E0048b32443Q9755k5388A33562
$$ -113864 102930 -201793 96064 -122412 -143400 -208129 50048 -232443 -142688 -168076 133562
19356C7297a93195i0616k43660d4255o7309F538R2452b11721j1512C1482D626
$$ 37297 -193195 -90616 -334276 -44255 -111564 6538 98990 -211721 -223233 31482 4626
19344A82491a88038D0321c4682a5307o0125A54698J276a47755e4730A21670g7197
$$ 182491 -188038 40321 -34682 -15307 -75432 154698 155974 -147755 -54730 121670 -77197
19332b23534m851F5059l1111a63899A08176a6792p8701j57446J02066d1158B06324
$$ -223534 -228385 65059 33948 -163899 108176 -16792 -95493 -252939 -150873 -41158 206324
19320G3895b45068p2685B87201A29294k008a2989k24465A0642b50096B49657B6408
$$ 73895 -245068 -317753 287201 129294 127286 -12989 -237454 10642 -250096 249657 26408
19308C8621h5377k09189n7454a30567A11J20515D1692M9575j0338c21376J11610
$$ 38621 -85377 -294566 -352020 -130567 111 120626 41692 91267 80929 -321376 -209766
19297b09766l3365J12189K2056G1751b92620j2466A85232b60449L9213O7351a3291
$$ -209766 -243131 -130942 -108886 71751 -292620 -305086 185232 -260449 -221236 -153885 -13291
19285a44867M0577E1777f3591r6201L9623k16308c6035D2422R5205a56476J9676
$$ -144867 -104290 51777 -63591 -159792 -120169 -336477 -36035 42422 137627 -156476 -136800
19274a36800D46763b00166O1388n6868A87343a14405a3834L860c39j67087a7165
$$ -136800 446763 -200166 -138778 -195646 187343 -114405 -13834 -9974 -339 -167426 -17165
19262b50817E0305d1333j76257B30757b7969j8778G7244h5511K5070B4438J87110
$$ -250817 50305 -41333 -217590 230757 -27969 -46747 77244 -85511 -60441 24438 211548
19251B11548D5998j0593c79104A26990a72073J6401c1021A654J58852e0163E5599
$$ 211548 45998 35405 -379104 126990 -172073 -155672 -31021 1654 160506 -50163 55599
19239e4185B76598b54503a9146k30100A83015e9234l42167B9333c03310a11729
$$ -54185 276598 -254503 -19146 -249246 183015 -59234 -401401 29333 -303310 -111729
19228A62492b22257M1500b6245g521k9387P50G2797J57295E8019a81905c193j87396
$$ 162492 -222257 -180757 -26245 -7521 -36908 -36158 72797 230092 58019 -181905 -3193 -190589
19216a90589G5805c24941a20752K1935o7136A1367c20809B59752c5859A81031
$$ -190589 75805 -324941 -120752 -98817 -165953 11367 -320809 259752 -35859 181031
19205G5113d167j76153b4299k12569E13428e8378j33187N8701c7956D0108a67937
$$ 75113 -4167 -180320 -24299 -236868 513428 -58378 -191565 -132864 -37956 40108 -167937
19193A85016a72812A26900P6297a10390k04958a0668j87117C5744J0152a18115
$$ 185016 -172812 126900 203197 -110390 -315348 -10668 -197785 35744 45896 -118115
19182d3504E8085K52447I057a73533B71869g7520A33474A4323L05584c3654O650
$$ -43504 58085 310532 9057 -173533 271869 -77520 133474 14323 319907 -33654 -27004
19171b7004B85580b00967O08c0655j41109A76473G1040f0613A19109b17039I601
$$ -27004 285580 -200967 -200359 -30655 -171764 176473 71040 -60613 119109 -217039 9601
19159I2843a11621N5477o8020j28603f842E614K43491c02957k8705N7341N9639
$$ 92843 -111621 -56144 -124164 -252767 -6842 5614 249105 -302957 -331662 -274321 -214682
19148b14682p4790j9019B2635J36601G6056a24126K1958D8296b26733G0806i2603
$$ -214682 -289472 -308491 22635 159236 76056 -124126 -102168 48296 -226733 70806 -92603
19136A39699c4059E8433L5589J00237a04950j08496h2685A87988b00459o7266
$$ 139699 -34059 58433 94022 194259 -104950 -213446 -82685 187988 -200459 -267725
19126b67725J24865j1548b139k36554h7141m1467A17486b60466A58247P1542a39773
$$ -267725 -142860 -154408 -2139 -238693 -87141 -128608 117486 -260466 158247 229789 -139773
19114a58572j4616O3934B5660K43995d1691r0106l44547J84708I3531b30806E8745
$$ -158572 -173188 -109254 25660 269655 -41691 -131797 -476344 -291636 93531 -230806 58745
19102c89631a64777O6490A51893a70659B4591R0951L5293l9019a71152I1290d70795
$$ -389631 -164777 -98287 151893 -170659 24591 115542 150835 111816 -171152 91290 -470795
19090A19a44144A6587a03117A69931b5177H1686a45868A23702B3247J99821f0076
$$ 119 -144144 16587 -103117 169931 -25177 81686 -145868 123702 23247 223068 -60076
19078a08618M5323D1987M748a23009m6484B7125d23824J85695O875O7455n8257
$$ -108618 -63295 41987 46735 -123009 -169493 27125 -423824 -238129 -231254 -163799 -222056
19067b22056a1229j42976o1907f7961K5491m954l00397C40377A04493k922g3779
$$ -222056 -11229 -154205 -216112 -67961 -42470 -47424 -347821 340377 104493 101571 -73779
19055a03248C5368b39720Q0741q498b0024j83783A19600j9998b15519a492A63784
$$ -103248 35368 -239720 -158979 -167477 -20024 -203807 119600 99602 -215519 -1492 163784
19043b61789g6580k48508a06378A2043g4281B07149b07153N1364D8454J07282
$$ -261789 -76580 -325088 -106378 12043 -74281 207149 -207153 -155789 48454 155736
19033A55736D0558a93830c1957l74458h8251L4128A63199J05829b36860j0221
$$ 155736 40558 -193830 -31957 -406415 -88251 -54123 163199 269028 -236860 -247081
19023b47081R9466j14136A67974c34178C1593b37933b6804j93710C4130a64778
$$ -247081 -147615 -261751 167974 -334178 31593 -237933 -26804 -220514 34130 -164778
19012a02324q4993e8741k25298A28011a37433A56651d2392J7987B30619e5811
$$ -102324 -187317 -58741 -284039 128011 -137433 156651 -42392 -24405 230619 -55811
19001B88332G9396B611c8276M16c81j84477A8456J92212g6842a0734A59024a44040
$$ 288332 79396 2611 -38276 -37860 -381 -184858 18456 210668 -76842 -10734 159024 -144040
18988b67352i906A198a32562C534b2079k22711A17222B8271a74504E9847K47998
$$ -267352 -9906 1198 -132562 3534 -22079 -244790 117222 28271 -174504 59847 307845
18977C07845A400M3892b83450O8147Q4263M5484p9225H6193c8909A3908i5906
$$ 307845 1400 45292 -283450 -215303 -131040 -85556 -164781 86193 -38909 13908 -95906
18965c46350B05674c7354p5385l4745A40745L8504c8791l17032a46980l32300
$$ -346350 205674 -37354 -112739 -147484 140745 179249 -38791 -355823 -146980 -479280
18955d79280b1760E5642I085a04121A18139a82972f9225l3695A68992b95877b141
$$ -479280 -21760 55642 9085 -104121 118139 -182972 -69225 -102920 168992 -295877 -2141
18943h6705C364b47016J0556n2390J40830O8609c5264j67457A27159R773a41185
$$ -86705 3364 -247016 -236460 -288850 -148020 -79411 -35264 -202721 127159 136932 -141185
18931b11928L3520j4325b4597A46733d0518A91573d0243j09887K084A33142a66284
$$ -211928 -178408 -192733 -24597 146733 -40518 191573 -40243 -150130 -148046 133142 -166284
18919g9828j96150J27063k025C802J39623a3268D0463a78064F0110J02148C8986
$$ -79828 -275978 -148915 -150940 3802 143425 -13268 40463 -178064 60110 162258 38986
18907A22744J67005A10448g2160A33897M5436c77680F7458j0030h1714C463a56768
$$ 122744 289749 110448 -72160 133897 179333 -377680 67458 57428 -81714 3463 -156768
18895B46947E5267a31614e5051k85132Q7263a03990A36139a17679c0031l05135
$$ 246947 55267 -131614 -55051 -340183 -252920 -103990 136139 -117679 -30031 -335166
18885c35166F4319a86335A71589b71757a09919e3486k45339A81349F6113J6350
$$ -335166 64319 -186335 171589 -271757 -109919 -53486 -298825 181349 66113 82463
18875H2463a80236A75690n0157a97337g6046j79519C4865a09507b2833j40942
$$ 82463 -180236 175690 125533 -197337 -76046 -255565 34865 -109507 -22833 -163775
18865a63775A56089a35981F6956g467o7082F5083g5n7362m47490b5289G3262a21140
$$ -163775 156089 -135981 66956 -7467 -74549 65083 -75 -57437 -504927 -25289 73262 -121140
18852A04131e8345j26535G4317d04382A21751L4680a38427Q030m3260h3914b3946
$$ 104131 -58345 -184880 74317 -404382 121751 156431 -138427 -130397 -173657 -83914 -23946
18840f4455i315A39662C4869f4752n6053D206h613q8326B2510b40473D07246b26566
$$ -64455 -9315 139662 34869 -64752 -120805 4206 -8613 -96939 22510 -240473 407246 -226566
18827D3655D892R7230a02391H578K55850B0095L54476a24490O1489A08269a05338
$$ 43655 4892 102122 -102391 8578 264428 20095 374571 -124490 -63001 108269 -105338
18815B36773i4567B0159g7809A7702a91798g2778A29808i5678A01084a28085L0000
$$ 236773 -94567 20159 -77809 17702 -191798 -72778 129808 -95678 101084 -128085 -98085
18804i8085E2954b34093g541j46250K3670A27514c1221A31175a48906q4330k4314
$$ -98085 52954 -234093 -7541 -153791 -130121 127514 -31221 131175 -148906 -233236 -257550
18793b57550B45088g8264n6102B0454b4396A59060o576C8041e3505j5620G5979
$$ -257550 245088 -78264 -134366 20454 -24396 159060 152484 38041 -53505 -69125 75979
18781B96850R3217b66905A38979D9152h5352j01651A01744N5606b7136o2043l7451
$$ 296850 390067 -266905 138979 49152 -85352 -187003 101744 157350 -27136 -89179 -126630
18770a26630A50340n2481a50765B73567a24878N5474m9417M6900k9652A75389
$$ -126630 150340 97859 -150765 273567 -124878 -69404 -118821 -71921 -101573 175389
18759F0312c3612k03369B4156a55498j86051A55317b16390j62642k6613a99241
$$ 60312 -33612 -236981 24156 -155498 -341549 155317 -216390 -379032 -405645 -199241
18748a9254j42741A15356Q5198m7671d7320j30697f9190E5411i9739E1021B3677
$$ -19254 -161995 115356 200554 152883 -47320 -178017 -69190 55411 -99739 51021 23677
18736B9777R3091n3330B1341a58414j0183h0456a3746B02434a21368d6295k43222
$$ 29777 122868 69538 21341 -158414 -168597 -80456 -13746 202434 -121368 -46295 -289517
18725b89517A5471a58305B79641a59754E0866b05857C7405c11457a45013j62061
$$ -289517 15471 -158305 279641 -159754 50866 -205857 37405 -311457 -145013 -307074
18715c07074M9112A30445b74843J28523E9965a05240k37005a03818c9855j6776
$$ -307074 -257962 130445 -274843 -146320 59965 -105240 -342245 -103818 -39855 -56631
18705e6631A92621k0940b3521j94734M1196F1729J03865B084d8047I2447a53493
$$ -56631 192621 171681 -23521 -218255 -177059 61729 165594 2084 -48047 92447 -153493
18693g0977r7898H3301h6012j86990Q9318H4129K1523b49373A29316g0655k00781
$$ -70977 -168875 83301 -86012 -273002 -183684 84129 105652 -249373 129316 -70655 -271436
18682b71436J27966i361F1383a2187l67134C4501K2133M0802b5457I5277f7588
$$ -271436 -143470 -9361 61383 -12187 -379321 34501 56634 97436 -25457 95277 -67588
18670b4495k8847o1206j0453c6886k09148h0699r0557k47746a95949i0121A02789
$$ -24495 -53342 -114548 -125001 -36886 -246034 -80699 -171256 -419002 -195949 -90121 102789
18658C31942j12187e2191k26453Q1631E0759a01807C61266i9659I568J92059A7296
$$ 331942 219755 -52191 -278644 -197013 50759 -101807 361266 -99659 9568 201627 17296
18646b85268h855A5171e17383K39277c332H0027L0568c43475a69605k40668L0051
$$ -285268 -8855 15171 -517383 -278106 -3332 80027 110595 -343475 -169605 -410273 -380222
18635c80222J88749C02768b29548c0873j06653I9780Q2598h5247a5799A2243J75616
$$ -380222 -191473 302768 -229548 -30873 -137526 99780 182378 -85247 -15799 12243 187859
18624A87859a80995l4655a1416B48712a89523l5752A53636A8750n524K3912K30492
$$ 187859 -180995 -215650 -11416 248712 -189523 -225275 153636 18750 13226 37138 267630
18613B67630g674p4268A03198K18340b56728a10308a3928I0228b12065A99294
$$ 267630 -7674 -81942 103198 321538 -256728 -110308 -13928 90228 -212065 199294
18602e01527I4594a05045A42083J85478a34498N1649A25910K267e9581A47220
$$ -501527 94594 -105045 142083 327561 -134498 -82849 125910 128177 -59581 147220
18591a49120B3740a66313k7786k4263h6422M2054A8592b81334A17738c10867g3908
$$ -149120 23740 -166313 -194099 -218362 -86422 -44368 18592 -281334 117738 -310867 -73908
18579a56322A89899P1027c72339A46029b59956D06764c10394D01140b15328A1230
$$ -156322 189899 260926 -372339 146029 -259956 406764 -310394 401140 -215328 11230
18568g1631H1169R6384a58493H5891b42500i0734l4884K8886d083A06507N0352
$$ -71631 81169 177553 -158493 85891 -242500 -90734 -125618 -96732 -4083 106507 156859
18557A56859b32420i3353j68004b1658j24478J8199k72168a15552B63464c0204
$$ 156859 -232420 -93353 -261357 -21658 -146136 -127937 -400105 -115552 263464 -30204
18546f186B9892K52971d2148k9529J8129I9741a08779k13359d4143r4276j2585
$$ -6186 29892 282863 -42148 -71677 -53548 99741 -108779 -322138 -44143 -138419 -151004
18535a51004M4647A58916c54684l4613A25934R9689a65218c2905k18031E02181
$$ -151004 -106357 158916 -354684 -389297 125934 225623 -165218 -32905 -250936 502181
18524a04343I1126J01926a9116D8574g3148K0032J1968j97939R9152e7839E1768
$$ -104343 91126 193052 -19116 48574 -73148 -53116 -41148 -239087 -139935 -57839 51768
18512B24832A07639K18755d00438J79689n8627k0469J47338d1422r8786c3424
$$ 224832 107639 326394 -400438 -220749 -279376 -299845 -152507 -41422 -140208 -33424
18501c20448A12121A2141J63225G868f2386q0255f6378k18627l2964A25590d0834
$$ -320448 112121 12141 175366 7868 -62386 -142641 -66378 -285005 -317969 125590 -40834
18489a90686I9611c28463a08969o1153A4112a14773J6297I5952P7832f3583D7676
$$ -190686 99611 -328463 -108969 -170122 14112 -114773 -98476 95952 173784 -63583 47676
18477b84151m5118J20274i2080B05280c7993E0493K0522Q4465i6633q8110b1560
$$ -284151 -329269 -208995 -92080 205280 -37993 50493 71015 155480 -96633 -184743 -21560
18465i2058r431L8210k12363A19598b5937q6718J4905A6047J47828a39633C81524
$$ -92058 -101489 -63279 -275642 119598 -25937 -112655 -97750 16047 163875 -139633 381524
18453A43516L0682a57839A04969b76012B22682a48819k5283A32050b53904i6007
$$ 143516 174198 -157839 104969 -276012 222682 -148819 -174102 132050 -253904 -96007
18442e5557a8473A34038J26242G4964c5335N087N617m1843G3728g628k60884c1808
$$ -55557 -18473 134038 260280 74964 -35335 -30248 -24631 -66474 73728 -7628 -268512 -31808
18429A99047J6097b73609h1193G6470K1215d62404b21216J10396j55381i0433
$$ 199047 215144 -273609 -81193 76470 97685 -462404 -221216 -110820 -266201 -90433
18418A71850P5726b01834b3618B4428Q9495f9141B01626b58030R9177A17279k7708
$$ 171850 247576 -201834 -23618 24428 113923 -69141 201626 -258030 -158853 117279 89571
18407H9571B9554h5177l5830D8829a73509A98891c8632E1867k1232K29577C1293
$$ 89571 29554 -85177 -121007 48829 -173509 198891 -38632 51867 30635 260212 31293
18395A66360b4442A61158i0950b2106E6419a46476l63393A29360c4396B18011
$$ 166360 -24442 161158 -90950 -22106 56419 -146476 -509869 129360 -34396 218011
18384I398K19545i6271a5808F4871a02284A98371f2193D2227a77550E0261f5035
$$ 9398 228943 -96271 -15808 64871 -102284 198371 -62193 42227 -177550 50261 -65035
18372A31766I142a30841m5756A14061a8458B1125J9639N71p642b33896R3457j4489
$$ 131766 9142 -130841 -176597 114061 -18458 21125 40764 41335 33693 -233896 -140439 -154928
18360a54928B23939f8679E2651h3462A14157a35766C4965a36990d1516B4438K45740
$$ -154928 223939 -68679 52651 -83462 114157 -135766 34965 -136990 -41516 24438 270178
18349B70178G5755c23696c0154n2518A05862a87506g5565L4591A02128b18558
$$ 270178 75755 -323696 -30154 -82672 105862 -187506 -75565 -40974 102128 -218558
18338A95233a10811a6566F627b54598H9513b58132i1239A44597L5096b11656a1255
$$ 195233 -110811 -16566 6627 -254598 89513 -258132 -91239 144597 179693 -211656 -11255
18326a34664D5829c99664A76460a77620m8321E4200a21407k9522r3140j30671
$$ -134664 45829 -399664 176460 -177620 -225941 54200 -121407 -150929 -244069 -374740
18316c74740J45508N0870M6826n6997E9905e5862m4088l9693D9390b66967A8349
$$ -374740 -229232 -178362 -131536 -188533 59905 -55862 -99950 -139643 49390 -266967 18349
18304a80501J2457b0247A10442b16285A72981F2533a84139c4600j27561c9121
$$ -180501 -168044 -20247 110442 -216285 172981 62533 -184139 -34600 -162161 -39121
18293i0652k40108A69073a8490j68856j31462f2510g805B1164a31421o293B06365
$$ -90652 -330760 169073 -18490 -187346 -318808 -62510 -7805 21164 -131421 -137714 206365
18281g1035c89k81924R7317p4743A53607d46252E1465g8278A52193E610g1494
$$ -71035 -389 -282313 -184996 -259739 153607 -446252 51465 -78278 152193 5610 -71494
18269D9172j2412N3258d31623B18639h4895A0421K751R5182b04573j84744b0869
$$ 49172 36760 90018 -431623 218639 -84895 10421 13172 108354 -204573 -389317 -20869
18257e4235G2696d7783j49307k7689P1357r5865B31536a44019E6643f0360A05997
$$ -54235 72696 -47783 -197090 -224779 -153422 -249287 231536 -144019 56643 -60360 105997
18245b19260A35275e5837j89563B4653a0358H9817g8175B98795a62199M6060b1016
$$ -219260 135275 -55837 -245400 24653 -10358 89817 -78175 298795 -162199 -116139 -21016
18233A38304Q2304b1210k83432A05500b39002J16040b3010j17764k9384d2809
$$ 138304 220608 -21210 -304642 105500 -239002 -122962 -23010 -140774 -170158 -42809
18222a62442J3207H7653a19935F7904b02917k4496A3149i2034o9851A11840a14586
$$ -162442 -149235 87653 -119935 67904 -202917 -227413 13149 -92034 -161885 111840 -114586
18210I3508a6343A3960a22926G2678f2835k09731A86541e3497j19520G4798J0209
$$ 93508 -16343 13960 -122926 72678 -62835 -272566 186541 -53497 -173017 74798 85007
18199H5007C3133a11402l6098j42525j83196i265j16118F2315c36586C64563I0340
$$ 85007 33133 -111402 -147500 -290025 -473221 -9265 -125383 62315 -336586 364563 90340
18187B6472L87276d0306j40976B14319g029A23882D4398J44820p1217b6103A56553
$$ 26472 413748 -40306 -181282 214319 -7029 123882 44398 189218 118001 -26103 156553
18175a72402m8934A03248C2416c0339D4489a49707F7715a37132A82355h0199A56094
$$ -172402 -221336 103248 32416 -30339 44489 -149707 67715 -137132 182355 -80199 156094
18163B43477c24015C09226A22281P0598q9910F526b04471e8500l5203d0952D4185
$$ 243477 -324015 309226 122281 192879 102969 6526 -204471 -58500 -93703 -40952 44185
18151D1120K32215E7535a00991A7995J1724b44044J17782j3435j87770k698k5088
$$ 41120 273335 57535 -100991 17995 29719 -244044 -126262 -139697 -327467 -330165 -355253
18140c55253A57584a30432f98j42845k2728A28059d3271j26673m2318c6094r8028
$$ -355253 157584 -130432 -698 -143543 -166271 128059 -43271 -169944 -212262 -36094 -134122
18129a34122A03375e6050a5860l6442A6710K80200j01117A9822e2369A98631k3262
$$ -134122 103375 -56050 -15860 -52302 16710 296910 195793 19822 -52369 198631 175369
18118A75369b68460g2940A46528A8138a37816b4710o9786H2180j7298a57010B32336
$$ 175369 -268460 -72940 146528 18138 -137816 -24710 -94496 82180 64882 -157010 232336
18106f3750p2857A66401K17441a01448c1555C22165E6523j5904E07b61593J00856
$$ -63750 -136607 166401 383842 -101448 -31555 322165 56523 40619 507 -261593 -160737
18095a60737D1708N8279a55498q7963j9620g344r5125l08553a55964O1375j97283
$$ -160737 41708 99987 -155498 -243461 -263081 -7344 -102469 -411022 -155964 -94589 -291872
18084b91872a01228H353c16499b8087j98078h8782j92287A63328a94380j36511
$$ -291872 -101228 8353 -316499 -28087 -226165 -88782 -281069 163328 -194380 -330891
18074c30891J1549J56618A4887O9565a65400I7372a19671o5467c5509g748k25367
$$ -330891 -319342 -162724 14887 84452 -165400 97372 -119671 -185138 -35509 -7748 -233115
18063b33115e1534B13226c31096C1558K00273b26643B18652E6507K55299A49946
$$ -233115 -51534 213226 -331096 31558 231831 -226643 218652 56507 311806 149946
18052F4721b10467A17721c55542J19725A66009p3268b3893A50868a87590A13290
$$ 64721 -210467 117721 -355542 -235817 166009 92741 -23893 150868 -187590 113290
18041a24217j56998g4807l27183b4122B8522a26174n0413B28142J4374F7702a37117
$$ -124217 -281215 -74807 -401990 -24122 28522 -126174 -176587 228142 242516 67702 -137117
18029A47658j8142d02003A09549i7320B73665b88753m1049p4307b7021A30818
$$ 147658 129516 -402003 109549 -97320 273665 -288753 -329802 -404109 -27021 130818
18018d8267b0606j86672M8751o4895g2117K9727A70978a87304D0267b00954b3551
$$ -48267 -20606 -207278 -158527 -223422 -72117 -42390 170978 -187304 40267 -200954 -23551
18006E0325f5425E75199a56917B34559c3846j5984n5673H8314b20429g886B52153
$$ 50325 -65425 575199 -156917 234559 -33846 -49830 -105503 88314 -220429 -7886 252153
17994H6873N4789q29c08638i3938B88215a5010B55541A428K38005J4521c30994
$$ 86873 141662 140833 -308638 -93938 288215 -15010 255541 1428 239433 253954 -330994
17982I525a74510H3347M5219m9318b85445A48825c41044J3760b0709o2549B8105
$$ 9525 -174510 83347 128566 79248 -285445 148825 -341044 -327284 -20709 -83258 28105
17970c17845e3378l88747c6915B49826h7427L5431A47578E4856J46961I3838c0300
$$ -317845 -53378 -442125 -36915 249826 -87427 -51996 147578 54856 201817 93838 -30300
17958A78849O8041j15702a12170G7002d0451j03472d1157A80518a96025g263n3490
$$ 178849 246890 131188 -112170 77002 -40451 -143923 -41157 180518 -196025 -7263 -60753
17947f0753k50946D6128L02317j72716M5399a18857j6954A64142b06452j01842
$$ -60753 -311699 46128 348445 175729 221128 -118857 -135811 164142 -206452 -308294
17937c08294A9353b28725g7408A60319b5198j13910C46124j37675f5503C1170
$$ -308294 19353 -228725 -77408 160319 -25198 -139108 346124 208449 -65503 31170
17926I0224l7760L3748a02930A20537J22358d6071j38326b2703D3421c03164F1813
$$ 90224 52464 86212 -102930 120537 242895 -46071 -184397 -22703 43421 -303164 61813
17914b23706Q4747I9394e2983F0112h3899a618j33591k2229A45574P4473b87608
$$ -223706 -138959 99394 -52983 60112 -83899 -1618 -135209 -157438 145574 220047 -287608
17902c7771d74o2884l14299B6853c94904E0045h8867a7598k08663i7152E7434
$$ -37771 -474 -63358 -377657 26853 -394904 50045 -88867 -17598 -226261 -97152 57434
17890g1111F372M31490C7788a36330B83952e7603J2940I5231a49614B14068b12535
$$ -71111 6372 437862 37788 -136330 283952 -57603 -44663 95231 -149614 214068 -212535
17878a1335k42595r558d0951B41153E2658J6450b10716O5022N3913k8784C1189
$$ -11335 -253930 -263488 -40951 241153 52658 69108 -210716 -145694 -91781 -120565 31189
17866a95554E08337F3708a87936E4243d34382G9457g3959A81382J8760o5860a97803
$$ -195554 508337 63708 -187936 54243 -434382 79457 -73959 181382 200142 134282 -197803
17854g682A93879a31209L0953C45733E8746b13287A17226h2766D7289b91916A15042
$$ -7682 193879 -131209 -100256 345733 58746 -213287 117226 -82766 47289 -291916 115042
17842b60423j19597B27994k5409a98006M5148F8484c20670a55339N5754R539D6278
$$ -260423 -380020 227994 202585 -198006 -152858 68484 -320670 -155339 -99585 -90046 46278
17830A61330b34258l8281E6280f1486D9389a38178B03343P2038j05390h2991j27967
$$ 161330 -234258 -272539 56280 -61486 49389 -138178 203343 275381 169991 -82991 -210958
17819b10958J03903m1196c8945f524l74989I3035a57568g5633j17432p5338h7422
$$ -210958 -107055 -148251 -38945 -6524 -381513 93035 -157568 -75633 -193065 -268403 -87422
17807a12045J2767i672p8157J9340C20882j38631M5384i466A35064b51383B6567
$$ -112045 -99278 -9672 -87829 -68489 320882 182251 227635 -9466 135064 -251383 26567
17795B97496b51096h0338k944A14514a39851p12b6355C02780h691E9185K69665
$$ 297496 -251096 -80338 -83282 114514 -139851 -140563 -26355 302780 -8691 59185 328850
17784C28850h3227k16971C5902J6947b13806f4415k12080g2290B57976a20967
$$ 328850 -83227 -300198 35902 52849 -213806 -64415 -276495 -72290 257976 -120967
17773A78989A304O3649K34946F8390J10878B2993P2139b86401J03852B26534q0280
$$ 178989 1304 64953 299899 68390 179268 22993 95132 -286401 -182549 226534 146254
17762A46254J13977a29166j1484M7990C04197a94856I3363d25947B30629a63883
$$ 146254 260231 -129166 -140650 -92660 304197 -194856 93363 -425947 230629 -163883
17751d2669C87713c3838k53605h1772m9219j58274J41355r7184H7344a89121F3498
$$ -42669 387713 -33838 -287443 -81772 -130991 -289265 -147910 -245094 87344 -189121 63498
17739F5595J05565a8580A68788d6043C24983A55398b97274E9369J38685a8577
$$ 65595 171160 -18580 168788 -46043 324983 155398 -297274 59369 198054 -18577
17728A94604p4328l7508K677J67307j06627b17249r9353A91296a56513g0453C69765
$$ 194604 120276 82768 85445 252752 146125 -217249 -316602 191296 -156513 -70453 369765
17716A93096R0822j13550a15602B4849M2945a10732r3589C21861p4057c40396
$$ 193096 283918 170368 -115602 24849 67794 -110732 -204321 321861 247804 -340396
17705g6316j46786a3490B80792k3505h9560j71970E17547b4074r5871A34319b1095
$$ -76316 -223102 -13490 280792 257287 -89560 -261530 517547 -24074 -119945 134319 -21095
17693c6107A76037G8672K10288b16933J8990a7400j43855d0391B69790g0577G0375
$$ -36107 176037 78672 288960 -216933 -197943 -17400 -161255 -40391 269790 -70577 70375
17681A29467l0978m4453b26417A43132o8061a33548I7177a35444J0479B05413
$$ 129467 98489 54036 -226417 143132 75071 -133548 97177 -135444 -124965 205413
17670A53082l7315b13674G3337h15m3093l4029A8451J66769H8498e4239B17735
$$ 153082 115767 -213674 73337 -815 -43908 -77937 18451 185220 88498 -54239 217735
17658a18745J9183A63602a30073j31591N9209e1585A07607b24944B03623N7429
$$ -118745 -99562 163602 -130073 -261664 -202455 -51585 107607 -224944 203623 261052
17648B61052a23594j6682j12279C0459J42222d07268h5258j1907E60984a12687
$$ 261052 -123594 -140276 -252555 30459 172681 -407268 -85258 -97165 560984 -112687
17637B53724a67912M4848A82826H3578K0377f4425j82020A7801K22681j5481f7268
$$ 253724 -167912 -123064 182826 83578 103955 -64425 -246445 17801 240482 225001 -67268
17625B56200q6705B3964J3281h3528G7459K07185a13882B02649G983a47121q4412
$$ 256200 169495 23964 37245 -83528 77459 284644 -113882 202649 7983 -147121 -231533
17614b31533B79769e7348j9188C2672d5636C10523n9882a92591A15191P4245h3836
$$ -231533 279769 -57348 -76536 32672 -45636 310523 250641 -192591 115191 189436 -83836
17602d5325j47524J7681o6262C09026b39767H2120A1428J5978a67000B26132n5354
$$ -45325 -192849 -175168 -241430 309026 -239767 82120 11428 27406 -167000 226132 170778
17591A70778h51B64834j8755A19675h2122j63189E4439M0170b31764A15527C4961
$$ 170778 -851 264834 246079 119675 -82122 -245311 54439 94609 -231764 115527 34961
17579A19386O2901B8939e7084n7765A54664k1230K441I975J85723b41820B84864
$$ 119386 182287 28939 -57084 -114849 154664 133434 135875 9975 195698 -241820 284864
17567A90505j1188I416J58946c75901B10328F3205Q1737J02867a5827j92540A58856
$$ 190505 179317 9416 168362 -375901 210328 63205 144942 247809 -15827 -208367 158856
17555A2594J35844a93362A6789L5393M5953J15666a11859A06900K83890j88815
$$ 12594 148438 -193362 16789 52182 98135 213801 -111859 106900 390790 201975
17545B01975a06575Q159c8795J6262A74928J66347F2500c39934e5324B29404a30332
$$ 201975 -106575 -98416 -38795 -22533 174928 341275 62500 -339934 -55324 229404 -130332
17533H8640J13890I822K287N9329O8988E0436J87828b10855c2263q836C53006
$$ 88640 202530 9822 12109 71438 140426 50436 238264 -210855 -32263 -41099 353006
17521c39705A10086J9308e2587A24607r046K59124O9705a9429k1327C42363I2797
$$ -339705 110086 129394 -52587 124607 115561 374685 444390 -19429 -40756 342363 92797
17509e6173D20643a12891E6557b6629D75698I5907B7294e0521F8978L2987P2252
$$ -56173 420643 -112891 56557 -26629 475698 95907 27294 -50521 68978 101965 174217
17498A74217j5555J91473a41690D77180k00878C2515b24353B75113j731G2045
$$ 174217 158662 350135 -141690 477180 276302 32515 -224353 275113 273382 72045
17487A5704h0736k23079B00108F1280K31500e7339a945A49765I059h3824A97272
$$ 15704 -80736 -303815 200108 61280 292780 -57339 -1945 149765 9059 -83824 197272
17475A7204N6737O2646J8353b65753d5248A09553J98245a07648d391r5031A25863
$$ 17204 73941 136587 154940 -265753 -45248 109553 307798 -107648 -4391 -99422 125863
17463G8862O6276J44444n7686a97661A02936m1785M1808B6894K42194n1317R9833
$$ 78862 145138 289582 231896 -197661 102936 61151 102959 26894 269088 217771 317604
17452C17604B5142L28631A59470p3893K91451F8723d8998B45510b8156C26022
$$ 317604 25142 353773 159470 85577 377028 68723 -48998 245510 -28156 326022
17441A00968J20627J69086n0927c2488B72916j30549J1753b79787A56114R9624
$$ 100968 221595 390681 339754 -32488 272916 142367 154120 -279787 156114 255738
17431B55738R9168j13353m1117K54236A73187J91333H7985M91358m9131d1449
$$ 255738 354906 241553 200436 454672 173187 364520 87985 579343 530212 -41449
17420E4598M01252Q0419j80154h7037C14452l5677A04775L37279f2193A67166
$$ 54598 455850 536269 356115 -87037 314452 278775 104775 442054 -62193 167166
17409A16056D2121K07754K35744B7503d27B02026D6236A838L57486k2575A66239
$$ 116056 42121 249875 485619 27503 -427 202026 46236 1838 359324 336749 166239
17397C81929a4345B49143J67980Q578j58153J71345B12220J12734m2172d947m6972
$$ 381929 -14345 249143 417123 425701 267548 438893 212220 324954 282782 -4947 -51919
17386e1919D64798A05889g9869C89786A06348K70140A82832k4903Q1765m642O8275
$$ -51919 464798 105889 -79869 389786 106348 376488 182832 157929 239694 235052 303327
17375C03327K6198J34933B7131R6696J49919E9426J07122m8581f4752E41077f6388
$$ 303327 329525 464458 27131 123827 273746 59426 166548 117967 -64752 541077 -66388
17363B07694B5966L28963j57117o1095J0439O4285M9802J86558a0834B22668J07566
$$ 207694 25966 354929 197812 136717 147156 211441 261243 447801 -10834 222668 330234
17352C30234j31123J11036A50878K76749j96017g1008A03694J90861L1743j34042
$$ 330234 199111 310147 150878 427627 231610 -71008 103694 294555 326298 192256
17342A92256O1273o4459A9818L1328A9304K58544J9803a184p667A64749J90836
$$ 192256 253529 189070 19818 51146 19304 277848 297651 -1184 -8851 164749 355585
17331C55585F515a45758A24792a00269C00797A33798K14249R2850j23711I6290
$$ 355585 6515 -145758 124792 -100269 300797 133798 348047 440897 317186 96290
17320A69626k1196a63686C65764a6441B0650K96082j21062B2496K65148d976B3486
$$ 169626 148430 -163686 365764 -16441 20650 316732 195670 22496 287644 -4976 23486
17308a4330j10790A91882h68k8934C2803J99275K5222G8335c5712F5825j9144
$$ -14330 -125120 191882 -868 -29802 32803 232078 257300 78335 -35712 65825 46681
17297D6681K19665i8335B60052K228j28757J50838k878H5202L12306E572M15496
$$ 46681 266346 -98335 260052 262280 133523 284361 281483 85202 397508 5572 421068
17286D21068a52373B49358q1635h7709I5458Q5961q0568l5207J40056J85396n5695
$$ 421068 -152373 249358 167723 -87709 95458 181419 100851 65644 205700 391096 335401
17275C35401A41210O1189K01800A55930F0533J10355P5621B2978J36450K0212
$$ 335401 141210 202399 404199 155930 60533 170888 246509 22978 159428 179640
17265A79640b26505D21661F5443L694J53388e1103J283I0684D1528K88097a58865
$$ 179640 -226505 421661 65443 69137 222525 -51103 -49820 90684 41528 329625 -158865
17253D2068J03432L2686M06651A85242J41274l6649A19152J42447K6136k0043
$$ 42068 145500 178186 584837 185242 326516 289867 119152 261599 287735 267692
17243B67692F1494J38469a8395D1939L21916E3933K57551E6643K35267J39569
$$ 267692 61494 199963 -18395 41939 363855 53933 311484 56643 291910 431479
17233D31479j04489A26599K96101j15502C1353K9320K54164j23629a6130D97858
$$ 431479 326990 126599 422700 307198 31353 60673 314837 191208 -16130 497858
17222B90879j28377f2101b7767B56608J58287J12028k30132A09209K85645G6060
$$ 290879 162502 -62101 -27767 256608 414895 526923 296791 109209 394854 76060
17211D36767G8871K22669A34843J68292A34372M75148B82475f3538G4940M1158
$$ 436767 78871 301540 134843 303135 134372 609520 282475 -63538 74940 116098
17201A16098a05804A75641E5843K25896p1276i9922A76396P0459l5791J75966
$$ 116098 -105804 175641 55843 281739 210463 -99922 176396 246855 211064 387030
17191C87030h701C29507A52489P5887J30830n3638G2660M28102m8614q2782o6769
$$ 387030 -8701 329507 152489 228376 359206 305568 72660 500762 452148 369366 302597
17180C02597R5218D4014k1708L95065L8326K2623j64899m894F1050L5877N64049
$$ 302597 397815 44014 22306 417371 455697 478320 313421 308527 61050 96927 660976
17169F60976k74242j66332M1902J7097L19841E2964L22011K76165I2368L20198
$$ 660976 386734 220402 262304 279401 599242 52964 374975 651140 92368 412566
17159D12566k3863K72782k21489M3185J43446A21996K33166L1643r347o8193P6010
$$ 412566 388703 661485 439996 483181 626627 121996 355162 386805 377458 309265 385275
17148C85275j37379K4103R9495j69843K32769r4662M8594j22999n5196o8093J13155
$$ 385275 247896 271999 371494 201651 434420 339758 388352 265353 210157 142064 255219
17137B55219J51953A00125J57972O3842I2920J04057J73723q3785J681G0566M63894
$$ 255219 407172 100125 258097 321939 92920 196977 370700 286915 288596 70566 534460
17126E34460M6949j6825k8958p9000K6435j40196A23962N74157o3017C15844j15800
$$ 534460 581409 564584 535626 456626 483061 342865 123962 698119 635102 315844 200044
17115B00044L87020B91220J58012J27994P5345q4172p1595B39389J01354N404
$$ 200044 587064 291220 449232 577226 652571 568399 496804 239389 340743 346147
17105C46147K44673J19713B09829K12330A78403M54179m5984j69800L5333j20253
$$ 346147 590820 710533 209829 422159 178403 632582 586598 416798 452131 331878
17095C31878O685K41309j41919k942K4097r6138A42167J45265n8715N96223C97294
$$ 331878 338563 579872 437953 435011 459108 362970 142167 287432 228717 824940 397294
17083D46657K02844J97503j61840j78110K29442k16568K0028j44737j42248J07869
$$ 446657 649501 847004 685164 507054 736496 519928 539956 395219 252971 360840
17073C60840P7751K73287l12395K17093j42049J01832M4828M9094l7043k67021
$$ 360840 438591 711878 399483 616576 474527 576359 621187 670281 633238 366217
17063C66217L14950J86981k70079M8295l11490L02507j54245j9714L06323l54320
$$ 366217 681167 868148 598069 646364 334874 637381 483136 463422 769745 415425
17053D15425K50185C05853K87476j65016J75252J74738r6502j36888j37430K45364
$$ 415425 665610 305853 593329 428313 603565 778303 681801 544913 407483 652847
17043F52847R1645l27432N66817l94682J41539k07848Q2363B69903N67322C72674
$$ 652847 744492 417060 983877 589195 730734 522886 605249 269903 837225 372674
17032H73463l35927K51847o5466j90124K68334j50940k13006J79375P677J12065
$$ 873463 537536 789383 723917 533793 802127 651187 438181 617556 625233 737298
17022G37298k20551j80272J72274K23544n1211K4108k6914J59556r1515k04003
$$ 737298 516747 336475 508749 732293 681082 705190 678276 837832 746317 542314
17012E42314K87640j64832o812J56425J21060j19903J54506l38500j44240j97856
$$ 542314 829954 665122 658310 814735 935795 815892 970398 631898 487658 289802
17002B89802M93891J9151j53505M48561n39836J35959K45934q0755k11215J72988
$$ 289802 783693 802844 649339 1097900 558064 694023 939957 859202 647987 820975
16992H20975K40500m17896K13591J57736k52632K62119k54364j55706J16249L78240
$$ 820975 1061475 643579 857170 1014906 762274 1024393 770029 614323 730572 1108812
16982A108812k65480m1304J91105k48179j43433L78524l13406J67860R0525k2489
$$ 1108812 843332 802028 993133 744954 601521 980045 666639 834499 925024 902535
16972I02535q9178J85881m6351n8915j5205K01512J05996l86104J09375M22255
$$ 902535 813357 999238 952887 893972 878767 1080279 1186275 800171 909546 1331801
16962A331801j15308r7996N4986j75741r7033J85919r4375L46077k16071J04282
$$ 1331801 1216493 1118497 1173483 997742 900709 1086628 992253 1338330 1122259 1226541
16952A226541j7250j7537r6936m3792J47963k76768N07481k43238k8199K56384
$$ 1226541 1209291 1191754 1094818 1051026 1198989 922221 1429702 1186464 1158265 1414649
16942A414649k72892L21921j44059l94548L58479J5043p7077j32434K33581K05570
$$ 1414649 1141757 1463678 1319619 925071 1283550 1298593 1221516 1089082 1322663 1528233
16932A528233j85177k52321O32149j95788k45203J416K73717j9261k05504J00530
$$ 1528233 1343056 1090735 1722884 1527096 1281893 1283309 1557026 1537765 1332261 1432791
16922A432791N01970l00553N1796o6749M1321k49730L04965L8171k6470O7170
$$ 1432791 1934761 1634208 1686004 1619255 1660576 1410846 1715811 1753982 1727512 1794682
16912A794682l17589k6490L56596k25730p7177M5736J21164J47366j49026n1468
$$ 1794682 1477093 1450603 1807199 1581469 1504292 1550028 1671192 1818558 1669532 1618064
16902A618064J02390p6255N40838j74815j67451p0117r0359J20577L44849k71552
$$ 1618064 1720454 1644199 2185037 2010222 1842771 1772654 1682295 1802872 2147721 1876169
16892A876169J93999O8537L4844p8815q1540K77947o3728n0019p7694J16842K68272
$$ 1876169 2070168 2138705 2173549 2094734 2013194 2291141 2227413 2177394 2099700 2216542 2484814
16881B484814j02402k73552K84420k17939J50210O7043j90961J05137L60086O0736
$$ 2484814 2382412 2108860 2393280 2175341 2325551 2392594 2201633 2306770 2666856 2727592
16871B727592l47922K33575P8987L10654p43105M96424k14033M8396J56536o7501
$$ 2727592 2379670 2613245 2692232 3002886 2259781 2756205 2542172 2590568 2747104 2679603
16861B679603J71887m3811o3142R2554r3491J98661j44921K65810l84191L27798
$$ 2679603 2851490 2807679 2744537 2837091 2743600 2942261 2797340 3063150 2678959 3006757
16851C006757L98195m85954L86869j0407R9715l66152L70729o0306K02630j23159
$$ 3006757 3404952 2918998 3305867 3295460 3395175 3029023 3399752 3339446 3542076 3418917
16841C418917m0773K81288j97919J01272O87088m40250M36383l87648J52925k30701
$$ 3418917 3378144 3659432 3461513 3562785 4249873 3809623 4246006 3858358 4011283 3780582
16831C780582N94979m6138j44685K06331k07561L83270l48530K93030K48686j78504
$$ 3780582 4375561 4329423 4184738 4391069 4183508 4566778 4218248 4511278 4759964 4581460
16821D581460K13633j22231J73663j01360M74497j37803J63450p9874J04576o3134
$$ 4581460 4795093 4672862 4846525 4745165 5219662 5081859 5245309 5165435 5270011 5206877
16811E206877K89520O650K02142r0452P7010L09521K00474l367N13340p757M9069
$$ 5206877 5496397 5503047 5705189 5614737 5691747 6001268 6201742 6198375 6711715 6703958 6753027
16800F753027k30106K0994L56136K04882J59095J24901Q2977K10035J51033J14999
$$ 6753027 6522921 6543915 6900051 7104933 7264028 7388929 7471906 7681941 7832974 7947973
16790G947973J43112J97172J90743M3867K45631n2875N13845J64309K75564K11624
$$ 7947973 8091085 8288257 8479000 8522867 8768498 8715623 9229468 9393777 9669341 9880965
16780I880965j79196M84957K19805L39577j45933K38120K30778O89600j85821
$$ 9880965 9701769 10186726 10406531 10746108 10600175 10838295 11069073 11758673 11572852
16771A1572852K04922O52576J79828R2056R65011j33585K73779M69258K50619
$$ 11572852 11777774 12430350 12610178 12702234 13667245 13533660 13807439 14276697 14527316
16762A4527316M55041M5717J059920L3562N99264M18027M06950N90801P88059
$$ 14527316 14982357 15028074 16087994 16121556 16720820 17138847 17545797 18136598 18924657
16753A8924657J06734P17375O68789M89920L60779J223395K10656O24497Q33464
$$ 18924657 19031391 19748766 20417555 20907475 21268254 22491649 22702305 23326802 24160266
16744B4160266Q16823J052195P05540R51332J028727O51253J380942Q16813J371270
$$ 24160266 24977089 26029284 26734824 27686156 28714883 29366136 30747078 31563891 32935161
16735C2935161R76761J209378J394609J507707J154571J680164J790675J259588
$$ 32935161 33911922 35121300 36515909 38023616 39178187 40858351 42649026 43908614
16727D3908614J793182J670223J907704K455819J957080K040715K598725K081849
$$ 43908614 45701796 47372019 49279723 51735542 53692622 55733337 58332062 60413911
16719F0413911K824741K370178K929110K735116K839342L320047L034666L576480
$$ 60413911 63238652 65608830 68537940 71273056 74112398 77432445 80467111 84043591
16711H4043591L674568L295286L527404L661857L905591L286595M007324L516208
$$ 84043591 87718159 91013445 94540849 98202706 102108297 105394892 109402216 112918424
16703A12918424L935144L290465L231047L204789L083729K446669K453436J689652
$$ 112918424 116853568 120144033 123375080 126579869 129663598 132110267 134563703 136253355
16695A36253355J613944Q30584P90638K79461j25819p91291j233070j416844k247168
$$ 136253355 137867299 138697883 139488521 139767982 139642163 138850872 137617802 136200958 133953790
16686A33953790k119615l001944k888308l138752l424880l496111l721867l425367
$$ 133953790 131834175 128832231 125943923 122805171 119380291 115884180 112162313 108736946
16678A08736946m118545m040466l457186m076841l160993l567647l357836l567154
$$ 108736946 104618401 100577935 97120749 93043908 89882915 86315268 82957432 79390278
16670G9390278l468799k720704l000613k709251k998836k877045k202161k408987
$$ 79390278 75921479 73200775 70200162 67490911 64492075 61615030 59412869 57003882
16662E7003882k366084k207813k170780j642897k178733j677556j775352j420557
$$ 57003882 54637798 52429985 50259205 48616308 46437575 44760019 42984667 41564110
16654D1564110j743922j404862j415743r57225j273894j345993j011324j246664
$$ 41564110 39820188 38415326 36999583 36042358 34768464 33422471 32411147 31164483
16646C1164483j287127j014294j136119l65113j231495o82651j144282n21324
$$ 31164483 29877356 28863062 27726943 27361830 26130335 25447684 24303402 23782078
16638B3782078n84717r40547m82907o35333o81712o56669p02895n94475l04388
$$ 23782078 23197361 22256814 21773907 21138574 20456862 19800193 19097298 18502823 18198435
16629A8198435m28996o18702p73837q451j003663J02812m33632o82274l71540
$$ 18198435 17769439 17150737 16376900 16368449 15364786 15467598 15033966 14351692 13980152
16620A3980152j49315j25712m58714m60233l82859j4905k85717m22819n12573
$$ 13980152 13830837 13705125 13246411 12786178 12403319 12388414 12102697 11679878 11167305
16611A1167305R135l77355k75890k08761j05078j03121l66101j20823m67769M6546
$$ 11167305 11176440 10799085 10523195 10314434 10209356 10106235 9740134 9619311 9151542 9198088
16601I198088k61052l42061j66913l95190M54634l45423N6937m45011m04830k3552
$$ 9198088 8937036 8594975 8428062 8032872 8487506 8142083 8199020 7754009 7349179 7325627
16591G325627j09672k32303R6380j97429j80671K02553m20019M2101n036k72121
$$ 7325627 7215955 6983652 7080032 6882603 6701932 6904485 6484466 6526567 6521531 6249410
16581F249410j16323l63779j1070K81671l43627k90292j50594K83764m5824l6022
$$ 6249410 6133087 5769308 5758238 6039909 5696282 5405990 5255396 5539160 5493336 5457314
16571E457314k06694k90695J15213j88382K821j75267K5631q6629O1095j40449
$$ 5457314 5250620 4959925 5075138 4886756 4889577 4714310 4739941 4653312 4714407 4573958
16561D573958l22413J29539l98762N92738k56763j72828r676j41929N8520j89658
$$ 4573958 4251545 4381084 3982322 4575060 4318297 4145469 4135793 3993864 4052384 3862726
16551C862726O1901k63254j4864J98007j50375j32018K08764j88594J00582m39765
$$ 3862726 3924627 3661373 3646509 3844516 3694141 3562123 3770887 3582293 3682875 3243110
16541C243110j02358O3118k20568K27156O2149K36687o57526J64273o5882J90398
$$ 3243110 3140752 3203870 2983302 3210458 3272607 3509294 2851768 3016041 2950159 3140557
16531C140557j79361j4355j92506J70762r9590J13183n80395M18014j85814j7888
$$ 3140557 2961196 2946841 2754335 2925097 2825507 2938690 2358295 2776309 2590495 2572607
16521B572607j16718J59937k10569K52330J73262n66831j17980J93120m5J80117
$$ 2572607 2455889 2615826 2405257 2657587 2830849 2264018 2146038 2339158 2339113 2519230
16511B519230m11245L10616j03529J0224q3216q4865R8801K72361n52519L03439
$$ 2519230 2107985 2418601 2315072 2325296 2242080 2157215 2256016 2528377 1975858 2279297
16501B279297n16513O377L91261l25135J37253k81670J76004R5961k52749J14623
$$ 2279297 1762784 1769161 2160422 1835287 1972540 1690870 1866874 1962835 1710086 1824709
16491A824709J41474j09876l08950J45341L88997k01206o200l73095M8903M78903
$$ 1824709 1966183 1856307 1547357 1692698 2081695 1880489 1874289 1501194 1550097 2029000
16481B029000p59652K89118J51225P1501n5515m33988M26948l8553n19381M80498
$$ 2029000 1269348 1558466 1709691 1781192 1725677 1291689 1718637 1680084 1160703 1641201
16471A641201k01606m4331N2692l21858L08161j37350J64641M0210l84482l892
$$ 1641201 1439595 1395264 1447956 1126098 1434259 1296909 1461550 1501760 1117278 1113386
16461A113386M84776m39779L26585o4649j15864J58347m59034L35431m7439r0977
$$ 1113386 1598162 1158383 1484968 1420319 1304455 1462802 1003768 1339199 1291760 1200783
16451A200783K29396j49060q7158J91938j45018J25461j92026L9375j49387J17288
$$ 1200783 1430179 1281119 1193961 1385899 1240881 1366342 1174316 1213691 1064304 1181592
16441A181592K1464j39696M5012l31914L29145j66593J29996M7456P646M4848
$$ 1181592 1203056 1063360 1108372 776458 1105603 939010 1069006 1116462 1124108 1168956
16431A168956j87498J70798j30680o5544j27456K67007N1577J23025m07540J26193
$$ 1168956 981458 1152256 1021576 956032 828576 1095583 1147160 1270185 862645 988838
16421I88838j41156j02447r9827L43664j34443q9771L0955J86575j90409L49606
$$ 988838 847682 745235 645408 989072 854629 764858 795813 982388 791979 1141585
16411A141585j65506L0851j84313m7002K39468j97753O9316o7629J23208k7058
$$ 1141585 976079 1006930 822617 775615 1015083 817330 886646 819017 942225 915167
16401I15167L9741r5370N9392O5841m2702J26140j33283k0427j20535K15175k29738
$$ 915167 954908 859538 918930 984771 942069 1068209 934926 914499 793964 1009139 779401
16390G79401O7944k07992O4970J60852J87893m07078j44410K53165J28354q3460
$$ 779401 847345 639353 704323 865175 1053068 645990 501580 754745 883099 799639
16380G99639m838k4298j3794J1047j39628P3419Q3125j46724O1417q4485J11713
$$ 799639 794801 770503 756709 767756 628128 701547 784672 637948 699365 614880 726593
16369G26593l3258J40939D00359R3692k14045L12879j12022K35158K7091R929
$$ 726593 693335 834274 400359 494051 280006 592885 480863 716021 743112 753041
16359G53041j17474R1440j43501J32072k0836B73438L32149j22804J74299r378
$$ 753041 635567 727007 583506 715578 694742 273438 605587 482783 657082 647704
16349F47704R045J87575B89509K39378k06667O9593J127L33627J80937B03463
$$ 647704 656749 844324 289509 528887 322220 391813 392940 726567 907504 203463
16338C50547J26888M2111j39991Q0592P2886M85745B94073K98016j7938j53768
$$ 350547 477435 519546 379555 460147 533033 1018778 294073 592089 574151 420383
16328D20383r894K0861K10344o8239B18115K88417j18869J00338k03434M3143
$$ 420383 410489 431350 641694 573455 218115 506532 387663 488001 284567 327710
16318C27710p4151k7687l0254K44371J53651n5893k02728J05109K06630A92965
$$ 327710 253559 225872 195618 439989 593640 537747 335019 440128 646758 192965
16307G0782L96733A57913J12152K8742J17077L6670O4370j72681J04915k6304
$$ 70782 467515 157913 270065 298807 415884 452554 516924 344243 449158 422854
16297D22854A89983k0750L89093G5330R7587L91175j90708K9156P0760k00385
$$ 422854 189983 169233 558326 75330 172917 564092 373384 402540 473300 272915
16287B72915q1225J47411l2406J65181B31526J81860j59239J79988j72669K17685
$$ 272915 191690 339101 306695 471876 231526 413386 254147 434135 261466 479151
16277D79151B02036N95484C16395G2332K61030n5924L2718K72881k73708M0416
$$ 479151 202036 797520 316395 72332 333362 277438 310156 583037 309329 349745
16267C49745K30900m1071j9246A57290Q6110j03411J48885c3604F24614G2541
$$ 349745 580645 539574 520328 157290 243400 139989 288874 -33604 624614 72541
16256A88446K828b4633j6915C50605l4j4199M27211C09329q3471J12108I4457
$$ 188446 191274 -24633 -41548 350605 350571 336372 763583 309329 225858 337966 94457
16244A46550M02245A21109L27548k15493k869M24100j16819k18377C0684M35185
$$ 146550 548795 121109 448657 233164 230295 654395 537576 319199 30684 465869
16234D65869j631j69836J7804l7173m9175h3290C24669J16497A74687F052L05956
$$ 465869 464238 294402 312206 275033 225858 -83290 324669 441166 174687 6052 312008
16223C12008A03384J12405g8927D02193A89090b27974B21586R7661J25400I2737
$$ 312008 103384 215789 -78927 402193 189090 -227974 221586 319247 444647 92737
16212B89524o1146j4465a9965F346J42113b40745B43363A05288K88435M9502n9902
$$ 289524 228378 213913 -19965 6346 148459 -240745 243363 105288 393723 443225 383323
16201C83323A22210J00469Q7978I51L48680A48882B2860K01966m1521D4543k2253
$$ 383323 122210 222679 310657 951 349631 148882 22860 224826 183305 44543 22290
16190B2290M45067A95724D5672J86275o1013Q2703M3397k307j01890Q2880a28036
$$ 22290 467357 195724 45672 231947 170934 253637 297034 294727 192837 275717 -128036
16178C99012j07784g5919H0351a04836I1240L18815b6992A28180J12390J7874
$$ 399012 291228 -75919 80351 -104836 91240 410055 -26992 128180 240570 258444
16168B58444D838J81013Q20L14681k50507p3325p5766d5261B54329I7062N58256
$$ 258444 4838 185851 186671 501352 250845 177520 101754 -45261 254329 97062 655318
16157F55318A38773i7043A36749i9415J7712C10230b18032B39084b77912A72325
$$ 655318 138773 -97043 136749 -99415 -81703 310230 -218032 239084 -277912 172325
16146D9594N9307J57958R0243H726K01785r1067m9329O2214L5966J73638I2822
$$ 49594 108901 266859 357102 8726 210511 119444 70115 132329 168295 341933 92822
16134B86823K8841Q5926j02712i3553p9659B07229q8684a90782B55361h047I2658
$$ 286823 315664 401590 298878 -93553 -173212 207229 118545 -190782 255361 -8047 92658
16122A47824J41458j10319J13248H8540b97354E4566a74501A61187J74870C3776
$$ 147824 289282 178963 292211 88540 -297354 54566 -174501 161187 336057 33776
16111B49648B9103J91846C8452J14676f2128g163m4285j24721A93697E8395a03759
$$ 249648 29103 220949 38452 153128 -62128 -7163 -51448 -176169 193697 58395 -103759
16099C73203I8647K07605E4896J13053F7253p516a08805k36857B07116K02262
$$ 373203 98647 306252 54896 167949 67253 59737 -108805 -345662 207116 409378
16089D09378A57281a14266A97442I6024K50763A40711O5200p3497k9982D6713
$$ 409378 157281 -114266 197442 96024 346787 140711 205911 132414 102432 46713
16078G3959K39873g3772r0808c8033B58837A17301K73440j57080a12652a881B14284
$$ 73959 313832 -73772 -164580 -38033 258837 117301 390741 233661 -112652 -1881 214284
16066f188C02877b45647c8149A05920c4208A15106g3607H0105A8107g6897C82475
$$ -6188 302877 -245647 -38149 105920 -34208 115106 -73607 80105 18107 -76897 382475
16054b94671H2388M56105I5129J16542a48566B07068I0195c8437n2094L1906B16655
$$ -294671 82388 538493 95129 211671 -148566 207068 90195 -38437 -90531 -58625 216655
16042A5400K9580b58406B2723L83619d2660A90832e2162H778J57396O3418d7735
$$ 15400 44980 -258406 22723 406342 -42660 190832 -52162 8778 166174 229592 -47735
16030C69223j71999J22330j35918b06165C67770E7706J47197L0473I5047J51187
$$ 369223 197224 319554 183636 -206165 367770 57706 204903 235376 95047 246234
16020B46234a38695O45C2359L63477e144k7724j83245L8622C42891a04277A16484
$$ 246234 -138695 -138050 32359 395836 -5144 -32868 -216113 -177491 342891 -104277 116484
16008g9243j74689L8144A20460f7785a7975F5169J97467D0477F6a05301b085E1166
$$ -79243 -253932 -215788 120460 -67785 -17975 65169 262636 40477 66 -105301 -2085 51166
15995h1327j08084d4851j03257B1644h555j73266n3882G720a89295A14367a3080
$$ -81327 -189411 -44851 -148108 21644 -8555 -181821 -235703 7720 -189295 114367 -13080
15983b18160k03539d7090E9820J11919n5489j6563a39353a6836B19558A8409c18480
$$ -218160 -421699 -47090 59820 171739 116250 99687 -139353 -16836 219558 18409 -318480
15971C85389f2864C28502b15943O7168E9166K78550A31196J45529r8757k6557
$$ 385389 -62864 328502 -215943 -148775 59166 337716 131196 276725 177968 151411
15961A51411a0041I9285Q4355a14731C10217D9306a935A33325p921a83011B8495
$$ 151411 -10041 99285 183640 -114731 310217 49306 -1935 133325 125404 -183011 28495
15949f6586J9879A36948b78783B32408a26742l8509A33114a2647h75A63744n3272
$$ -66586 -46707 136948 -278783 232408 -126742 -165251 133114 -12647 -875 163744 110472
15938A10472J50477B3389L80411A59069l5563L50326A86380f2839j20298a8448
$$ 110472 260949 23389 403800 159069 123506 473832 186380 -62839 -183137 -18448
15927a86464e7477j82064H0218P4577b9805L641A7225b73502H4971l2386a02452
$$ -186464 -57477 -239541 80218 154795 -29805 -26164 17225 -273502 84971 52585 -102452
15915A87415j6029E1147Q8575D4369P9542B3007d6560A98484F0014R053b20994
$$ 187415 171386 51147 139722 44369 123911 23007 -46560 198484 60014 69067 -220994
15903b85398A81259b1268A05547B9582i4035A51127a27851l233E2208D223K73456
$$ -285398 181259 -21268 105547 29582 -94035 151127 -127851 -131084 52208 4223 277679
15892B77679I508P6991O9032k9867A5358b35232F5203k3974e940l71482A33153
$$ 277679 9508 86499 155531 125664 15358 -235232 65203 41229 -5940 -377422 133153
15880b00911E8214N5319a77491c456C22488c52021G8988e6877H3630j0151J48954
$$ -200911 58214 113533 -177491 -3456 322488 -352021 78988 -56877 83630 73479 222433
15869B22433A5654P6026i0895k0265a4925r1918B36479c98987C1077K29570h1496
$$ 222433 15654 91680 -90895 -111160 -14925 -106843 236479 -398987 31077 260647 -81496
15857F051e6102r3930q8493D53325B1288R8162J50218G1333a06664C3735d3404
$$ 6051 -56102 -150032 -238525 453325 21288 119450 269668 71333 -106664 33735 -43404
15845H8905a72095E8729N0248c6791p668j58853o053n3880A19756K01161I6496
$$ 88905 -172095 58729 108977 -36791 -44459 -203312 -209365 -263245 119756 320917 96496
15833B29793c2575k0999A41635o9125K4176J46098b67903E6085P575o321c11C1661
$$ 229793 -32575 -53574 141635 72510 96686 242784 -267903 56085 63660 57339 -311 31661
15820d4420A37864J4030f5626l22103J84116a01511B46350r6837J61797j37611
$$ -44420 137864 151894 -65626 -387729 -203613 -101511 246350 149513 311310 173699
15810A73699b17947N5799A17850b83168D4886f5l74586J19248F1228K08995k7787
$$ 173699 -217947 -162148 117850 -283168 44886 -65 -374651 -255403 61228 270223 242436
15799B42436b09452O1242k19462A04814a48068G4132Q3440g1649F2018a28808
$$ 242436 -209452 -148210 -367672 104814 -148068 74132 157572 -71649 62018 -128808
15788b42336C03059M005D9455J3804c3768F663b43480A09442J42905B9282f3365
$$ -242336 303059 307064 49455 63259 -33768 6663 -243480 109442 252347 29282 -63365
15776C18026A507f5869A81148O070b24006H4641B3794b09011B04827i3906k17556
$$ 318026 1507 -65869 181148 187218 -224006 84641 23794 -209011 204827 -93906 -311462
15765c11462Q5728d2749E2644a47790C8788J69013r3718I33J25609b8727p0876
$$ -311462 -225734 -42749 52644 -147790 38788 207801 114083 933 126542 -28727 -99603
15754i9603B40541c4443j36316K0064e8283l22108a29658j34951a30866j51665
$$ -99603 240541 -34443 -170759 -150695 -58283 -380391 -129658 -264609 -130866 -282531
15744b82531d0100A3500Q5336b2093B28826A5662L51851c9777k87393D6209Q297
$$ -282531 -40100 13500 98836 -22093 228826 15662 367513 -39777 -327170 46209 54506
15733E4506k804a49291A44866r829J9146m3711K2282i1580o1992A24641b75464
$$ 54506 51702 -149291 144866 135037 154183 110472 132754 -91580 -153572 124641 -275464
15721d3914B91238o0647M0504c4680A0459O3195L2625B21J61182a07484A09574
$$ -43914 291238 230591 271095 -34680 10459 73654 106279 221 161403 -107484 109574
15709D88930i3995I6391B7798f435k73620k4921R5454a5019A05753a52679b1205
$$ 488930 -93995 96391 27798 -6435 -280055 -304976 -209522 -15019 105753 -152679 -21205
15697b71840L6914J04764q4375a02554c0379B88380b09782F9062h8788A35844
$$ -271840 -234926 -130162 -214537 -102554 -30379 288380 -209782 69062 -88788 135844
15686E4483M30Q3422a10047C3943J83195I359i9285j95745A637K40621j12375
$$ 54483 54913 138335 -110047 33943 217138 9359 -99285 -295030 1637 242258 129883
15675A29883k441D6784L9880e3276r0135B35809N1121A27970M279J55606a64129
$$ 129883 127442 46784 86664 -53276 -143411 235809 286930 127970 132249 287855 -164129
15663D37493a2549A32230f0475k50632B5771a0346r8708q7822N881B66705a32684
$$ 437493 -12549 132230 -60475 -311107 25771 -10346 -109054 -196876 -190995 266705 -132684
15651A66677j4385J13073c96645a37797l399C18778E4557J72818e2345A10781
$$ 166677 152292 265365 -396645 -137797 -141196 318778 54557 227375 -52345 110781
15640B3891P1831N3704a02614G5886a71535P2328A00456K12918a59237G8786a58047
$$ 23891 95722 149426 -102614 75886 -171535 -99207 100456 313374 -159237 78786 -158047
15628A97085E2766a2998D1999K09700a03841B35018a36985A09799a46019l6581
$$ 197085 52766 -12998 41999 251699 -103841 235018 -136985 109799 -146019 -182600
15618a82600D21159k05948f0067p488j45666B43148j10979a39470G7765b38523
$$ -182600 421159 215211 -60067 -67555 -213221 243148 132169 -139470 77765 -238523
15607b147l50027A80724B2692F199a93196O8906d9406m0494D66132D0682Q9442
$$ -2147 -352174 180724 22692 6199 -193196 -124290 -49406 -89900 466132 40682 130124
15596A30124h2648L7840k8690L6024A64381a14682C39426A06283b73317C68197
$$ 130124 -82648 -44808 -73498 -37474 164381 -114682 339426 106283 -273317 368197
15585a22271c1568n9117k61890a00494D3639g3017j79104A05220a97112Q0024
$$ -122271 -31568 -90685 -352575 -100494 43639 -73017 -252121 105220 -197112 -117088
15575a17088r4109C6166P4272b25834A62385f2602l43784E6259b98191M9190c0962
$$ -117088 -211197 36166 110438 -225834 162385 -62602 -406386 56259 -298191 -249001 -30962
15563a46106A09282J521a69227B51036d4494A0218N8079a74610G1092a69845h437
$$ -146106 109282 110803 -169227 251036 -44494 10218 68297 -174610 71092 -169845 -8437
15551C4275g0382l48105g5384k13610a40914k53790c4577p2220B40329F8686N0836
$$ 34275 -70382 -418487 -75384 -288994 -140914 -394704 -34577 -106797 240329 68686 119522
15540A19522h5240A60216h4174A96675d6652J7383k12893O9992F4693a56643c0546
$$ 119522 -85240 160216 -84174 196675 -46652 -29269 -242162 -172170 64693 -156643 -30546
15528C52369d7876k4447F6950a84339Q0471b5790G1241h8323A91753b47480a05654
$$ 352369 -47876 -72323 66950 -184339 -103868 -25790 71241 -88323 191753 -247480 -105654
15516A99468C3856a20098a6283H2375C2709a47987D8153J13416b23956D19594
$$ 199468 33856 -120098 -16283 82375 32709 -147987 48153 161569 -223956 419594
15505b60068b7170C66175B6985e3398j6033p7567p7721P1194E57c7127k16442
$$ -260068 -27170 366175 26985 -53398 -69431 -146998 -224719 -153525 557 -37127 -253569
15494b53569j2437L3332g3472E0093K7154J10606G3762M22681a69123A67402K4451
$$ -253569 -266006 -232674 -73472 50093 77247 187853 73762 496443 -169123 167402 191853
15483A91853h1318k16784I7644M6274b60567N1926J5330C6232b2714k33487A86651
$$ 191853 -81318 -298102 97644 143918 -260567 -208641 -193311 36232 -22714 -256201 186651
15471b61953a04768J151A47307k8959m4038c4613H0724c94705a8207A06122g0680
$$ -261953 -104768 -103617 147307 118348 74310 -34613 80724 -394705 -18207 106122 -70680
15459a01131k2893B5413R2141a38510a7111j19625K9362B03802f3444k78295d6048
$$ -101131 -124024 25413 117554 -138510 -17111 -136736 -107374 203802 -63444 -341739 -46048
15447A99054a44944M6553C83427h2152b5460k05911N007D9702d25919I6109l408
$$ 199054 -144944 -98391 383427 -82152 -25460 -231371 -226364 49702 -425919 96109 92701
15436I2701A7923c50246A56888J56701F3451O7092m0150J72367a11987l0881O0346
$$ 92701 17923 -350246 156888 313589 63451 130543 90393 262760 -111987 -142868 -82522
15425h2522E3936b20757D8065a83019E3692B0762M45118H5088a56112P135M2370
$$ -82522 53936 -220757 48065 -183019 53692 20762 465880 85088 -156112 -148977 -106607
15414a06607C4742i0861R420D1020K7610b76528B26355M0905e4390n3940c136
$$ -106607 34742 -90861 -81441 41020 68630 -276528 226355 267260 -54390 -108330 -3136
15402B16695m1966a27443E1828b92955a09767D5000j9049L1592f6229B12026H7189
$$ 216695 174729 -127443 51828 -292955 -109767 45000 25951 57543 -66229 212026 87189
15390B7249j2855K06508b24629A77282r182a94932A42079G136b03866A22787D9833
$$ 27249 14394 220902 -224629 177282 168100 -194932 142079 7136 -203866 122787 49833
15378a03747K0881C99124B1547I556L38185H0521A827l04a56981K619A37082c85568
$$ -103747 -82866 399124 21547 9556 347741 80521 1827 1523 -156981 -154362 137082 -385568
15365A67647a0103n1782j2080n1023j34706i3087a8922m3616k833k3456B19846
$$ 167647 -10103 -61885 -73965 -124988 -259694 -93087 -18922 -62538 -65371 -88827 219846
15353g1372A82452l0107a83085L7902I702a27991l74289A5930R4327l1538c21033
$$ -71372 182452 152345 -183085 -145183 9702 -127991 -502280 15930 110257 78719 -321033
15341C2622O6787J95162n1391g7467B8310E527L2523g3994o9890B22259m5070
$$ 32622 99409 294571 243180 -77467 28310 5527 38050 -73994 -143884 222259 177189
15330A77189c7654D2426b2459n8292r8692N2259C6603c3772e384A80361a30678
$$ 177189 -37654 42426 -22459 -80751 -179443 -127184 36603 -33772 -5384 180361 -130678
15318B16769L2058a93712H9847j3326a62669G0821b64472F7076J71507h3011N110
$$ 216769 248827 -193712 89847 76521 -162669 70821 -264472 67076 238583 -83011 -77901
15307g7901C7110a38685A20078L3438B1732L1844K18737p9989e3649n8738A2212
$$ -77901 37110 -138685 120078 153516 21732 53576 272313 192324 -53649 -112387 12212
15295C2072a34395a2398C06337o5362a09116B39306M6924G4291J8873l7397b26308
$$ 32072 -134395 -12398 306337 240975 -109116 239306 286230 74291 93164 55767 -226308
15283A91998K7275j08747h8982c9214a0245I3539n628a70375f2548F9321f4738
$$ 191998 219273 110526 -88982 -39214 -10245 93539 87911 -170375 -62548 69321 -64738
15271A30591a03790A6288R0908Q3528g4901j06031N4343D67034b55780b0715A54563
$$ 130591 -103790 16288 107196 190724 -74901 -180932 -126589 467034 -255780 -20715 154563
15259A7999b2723A79644A5056K66953j33719M2880i2788F7943O0646c82870F8369
$$ 17999 -22723 179644 15056 282009 148290 191170 -92788 67943 128589 -382870 68369
15247i0634B35734a20154j62863A32410e4442A86395G0540l1588R9781C9265J51900
$$ -90634 235734 -120154 -283017 132410 -54442 186395 70540 38952 138733 39265 191165
15236A91165a59173B39957K4452B3026K18898E3373L03672p2345A39273J36324
$$ 191165 -159173 239957 264409 23026 241924 53373 357045 284700 139273 275597
15226B75597m3685J41477L47992N47899L0506J0758q257l27576A30900F4249J61891
$$ 275597 231912 373389 721381 1269280 1299786 1310544 1302287 974711 130900 64249 226140
15215B26140a368C59648P2392a51741j00821E1976a10767k35265B7450a11874
$$ 226140 -1368 359648 432040 -151741 -252562 51976 -110767 -346032 27450 -111874
15204E1808N2600a70621j72313A13112J75376A30367k9239O0076J50889C9751
$$ 51808 104408 -170621 -342934 113112 288488 130367 101128 161204 312093 39751
15193C18114D7291J94536B4752h9625c6489A91541n3705K52835a84579p6470B42226
$$ 318114 47291 241827 24752 -89625 -36489 191541 137836 390671 -184579 -261049 242226
15181I6532J64414j8730e885C47443I4215J61562r8953b7414A25892f095r4037
$$ 96532 260946 242216 -5885 347443 94215 255777 156824 -27414 125892 -6095 -100132
15170a00132B33806n0157l1254E375a19928F1136J46448P9156a27535F8402h899
$$ -100132 233806 183649 152395 5375 -119928 61136 207584 286740 -127535 68402 -8899
15158C7702b0620B72126q5456M3502D3019J92594a04343A3361J20440J79267F0235
$$ 37702 -20620 272126 186670 230172 43019 235613 -104343 13361 133801 313068 60235
15146a83612B11252B8046E133a22471B3752M7053M1511J61782E0518J93418c8875
$$ -183612 211252 28046 5133 -122471 23752 70805 112316 274098 50518 243936 -38875
15134B0641P8310a24460A93906a02940A78916E1130K35237j2669E469R9032b72299
$$ 20641 98951 -124460 193906 -102940 178916 51130 286367 273698 5469 104501 -272299
15122b58174A22633a79047L9272c6671k4365B10388A5818K07103F1344L29276
$$ -258174 122633 -179047 -139775 -36671 -61036 210388 15818 222921 61344 390620
15112C90620j17958q5166a08167A2040g4997F8005N08031k66485J28728i6176
$$ 390620 272662 187496 -108167 12040 -74997 68005 576036 309551 438279 -96176
15101B76968f4166C97241j16136j31148b94270C42960a18542F3715L43396H7340
$$ 276968 -64166 397241 281105 149957 -294270 342960 -118542 63715 407111 87340
15090H5864K2435e8617j19798r00j49637A10928a7509D24745b18079E1335J84730
$$ 85864 108299 -58617 -178415 -179315 -328952 110928 -17509 424745 -218079 51335 236065
15079B36065Q3323A03072m8178a27070C6469Q4664A5468L3253K52578N9746j36118
$$ 236065 319388 103072 54894 -127070 36469 121133 15468 48721 301299 361045 224927
15068B24927c8130B10867n4739K61703c2865A0620J58667a52008A37495J50529
$$ 224927 -38130 210867 156128 417831 -32865 10620 169287 -152008 137495 288024
15058B88024j15613q0206J55353m4616k0500A4329L28463G9675a53210C17742
$$ 288024 172411 92205 247558 202942 182442 14329 342792 79675 -153210 317742
15047I7809J23650a877A24865c3502B73452j09345K37556A16474K79221j31948
$$ 97809 221459 -1877 124865 -33502 273452 164107 401663 116474 395695 263747
15037B63747O1502n5175k7074r6289J40395A02321a18784B63487o7236l0976C2578
$$ 263747 325249 270074 243000 146711 287106 102321 -118784 263487 196251 165275 32578
15025a89921E2041L79101k7445b3222B2359N92791B19292j09577Q1014K06808
$$ -189921 52041 431142 403697 -23222 22359 615150 219292 109715 190729 397537
15015C97537m577j58055e8189A47484A0493l155N99062C6673c3395A37750K29759
$$ 397537 392960 234905 -58189 147484 10493 7338 606400 36673 -33395 137750 367509
15004C67509p4165j35850G4898M35205A24271P223C2170K23041A5163L23480A41500
$$ 367509 293344 157494 74898 510103 124271 131494 32170 255211 15163 338643 141500
14992B87425D1964J18260J80344h4365C25739J14203d5125B35062L98812B34782
$$ 287425 41964 160224 340568 -84365 325739 439942 -45125 235062 633874 234782
14981a67737B71155j27203J304J46984J76155A05950C3968J48477C4407M15663
$$ -167737 271155 143952 145256 292240 468395 105950 33968 182445 34407 450070
14971D50070B20857m0535O3410G6856K72089O3832o7213q4291j14016l5461P5620
$$ 450070 220857 180322 243732 76856 348945 412777 345564 261273 147257 111796 187416
14960A87416J96563j28927H5355i7423C57436r3226m1323E1288L617K97772j34145
$$ 187416 383979 255052 85355 -97423 357436 264210 222887 51288 54905 352677 218532
14949B18532K2828J56687A1588K0699R4450M53325a3485A6582J51196e0817B17727
$$ 218532 241360 398047 11588 32287 126737 580062 -13485 16582 167778 -50817 217727
14937C68434B4903K95219l3084c5401f566D90284A99647J98525j29644i0427A71361
$$ 368434 24903 320122 287038 -35401 -6566 490284 199647 398172 268528 -90427 171361
14925D19574j23879M1020j28258d9319A22269H721K07118G1579L93617E6523J03658
$$ 419574 295695 336715 208457 -49319 122269 8721 215839 71579 465196 56523 160181
14914A60181G3154J16118M7996E7956K25248m1004M6773J05138F6145J26414K38819
$$ 160181 73154 189272 237268 57956 283204 242200 288973 394111 66145 192559 431378
14903D31378q9296a872I1866M19325A09783J71007o1696K12450q1347j35133J65749
$$ 431378 342082 -1872 91866 511191 109783 280790 219094 431544 350197 215064 380813
14892C80813A85213k5710p0840K83915o8970K02826A60691E4896L19880H0541
$$ 380813 185213 159503 88663 372578 303608 506434 160691 54896 374776 80541
14881A92939J44977K10514B2492J60148m5064L32028r0126j3121K32718k94953
$$ 192939 337916 548430 22492 182640 137576 469604 379478 366357 599075 304122
14871C04122k318o2762M7036L1839J66003j43884A18169M71080m9084B58166o8063
$$ 304122 301804 239042 286078 317917 483920 340036 118169 589249 540165 258166 190103
14860A90103L13375B40200J18324A73584K18450N1032D7156N78695A77119J35779
$$ 190103 503478 240200 358524 173584 392034 443066 47156 625851 177119 312898
14850C12898G3698J72392N21645k62021A36499J28337L7567J68728j46005B1423
$$ 312898 73698 246090 767735 505714 136499 264836 302403 471131 325126 21423
14839D81614B26204O0004K53748k37009j24295O4038J62992J03996B24767L99012
$$ 481614 226204 286208 539956 302947 178652 242690 405682 509678 224767 623779
14829F23779A56368J24952m8444K90961j49831M34819C34822J45393o6093N4442
$$ 623779 156368 281320 232876 523837 374006 808825 334822 480215 414122 468564
14819D68564j10820r4914Q2775Q5459A54385l2395N71224l15107J82175A68803
$$ 468564 357744 262830 345605 431064 154385 121990 693214 378107 560282 168803
14808D97120B40813M84449C11772J49261j15201L64143C29448m403L02104p681
$$ 497120 240813 725262 311772 461033 345832 709975 329448 325045 627149 619468
14798F19468m6257L0435k17700M9660N2083J11731A78670M62506q6796o0710J43342
$$ 619468 573211 603646 385946 435606 487689 599420 178670 641176 554380 493670 637012
14787F37012j18909P9901o7315j92658J84577P3872k2532J81766l72957J69716
$$ 637012 518103 598004 530689 338031 522608 596480 573948 755714 382757 552473
14777E52473B63426N1975L72272j56191k59966J77082J10130k34103M17489k44239
$$ 552473 263426 315401 687673 531482 271516 448598 558728 324625 742114 497875
14767D97875M0390A72479K44910N3628J03044j42736J99477Q7666l36683J64715
$$ 497875 538265 172479 417389 471017 574061 431325 630802 718468 381785 546500
14757E46500Q0910k40422L31907k86369K84444j27936k282K708O429J97422k26655
$$ 546500 627410 386988 718895 432526 716970 589034 586752 589460 595889 793311 566656
14746E66656A85012O04778l00096r758J85008k18704L14289k51888J01429k39946
$$ 566656 185012 789790 489694 479936 664944 446240 760529 508641 610070 370124
14736C70124K53080j83456J53507K80408P2905K14420n27168K38913C43578L51683
$$ 370124 623204 439748 593255 873663 946568 1160988 633820 872733 343578 695261
14726F95261k11712L13450J32214k34195j46146N6697q4870n1472K65782n4773
$$ 695261 483549 796999 929213 695018 548872 605569 520699 469227 735009 680236
14716F80236R8065P0448r0804l57626L68943l19746K19994Q7146n093J93431m60834
$$ 680236 778301 848749 757945 400319 769262 449516 669510 756656 751563 944994 484160
14705D84160K58138k36335K64527j15690L88640j55989r1037l10146K30984j61239
$$ 484160 742298 505963 770490 654800 1043440 887451 796414 486268 717252 556013
14695E56013J81950n7164j24322K35730J44074k84731J18459J05678k24876J3825
$$ 556013 737963 680799 556477 792207 936281 651550 770009 875687 650811 664636
14685F64636j08866N01170m91041L20474J46969l53587J17048j4733k81030J35658
$$ 664636 555770 1056940 565899 886373 1033342 679755 796803 782070 501040 636698
14675F36698L05099m19194K95386K55610l73021J98038J47305q9968O9643K04348
$$ 636698 941797 522603 817989 1073599 700578 898616 1045921 955953 1025596 1229944
14665A229944l36680j60084L10682k03248L66313j41689q2982J2736J12409l28874
$$ 1229944 893264 733180 1043862 840614 1206927 1065238 982256 994992 1107401 778527
14655G78527j0724J64021P4618P0273l73425K10993m3913k04497K51367J68947
$$ 778527 767803 931824 1006442 1076715 703290 914283 870370 665873 917240 1086187
14645A086187l2520j00930j28080l0868K39141J09516k30194J15269j41839L06585
$$ 1086187 1053667 952737 824657 793789 1032930 1142446 912252 1027521 885682 1192267
14635A192267q161q1114j82160k9729M0295j22440L47889J05524j22790q7281
$$ 1192267 1184106 1102992 920832 891103 931398 808958 1156847 1262371 1139581 1052300
14625A052300J58088J91149l71077K17780K48546n25731K89424j1013J26513o8370
$$ 1052300 1210388 1401537 1030460 1248240 1496786 971055 1260479 1249466 1375979 1307609
14615A307609k82501j2176M14127o8633j73474l0326N33093n46231M85755k67887
$$ 1307609 1025108 1012932 1427059 1358426 1184952 1154626 1687719 1141488 1627243 1359356
14605A359356j9696k3453j75631l15504M98084J80585O4902j4621L3953l12093
$$ 1359356 1339660 1316207 1140576 825072 1323156 1503741 1568643 1554022 1587975 1275882
14595A275882j05062J39848j06386K25650k1302J9349j81905K99739k91686J74012
$$ 1275882 1170820 1310668 1204282 1429932 1408630 1427979 1246074 1545813 1254127 1428139
14585A428139K94764j63007J98694Q981k48979J90707l16248L71721k43605J50518
$$ 1428139 1722903 1559896 1758590 1767571 1518592 1709299 1393051 1764772 1521167 1671685
14575A671685p6552p505k20389q325L49574j56672K39339k2056J64746k98441
$$ 1671685 1595133 1587628 1367239 1358914 1708488 1551816 1791155 1769099 1933845 1635404
14565A635404L83952k90071p9366J14648P1785k6908j18864L103o3363R7875K15104
$$ 1635404 2019356 1729285 1649919 1764567 1836352 1809444 1690580 1693683 1630320 1728195 1943299
14554A943299k33808J50801J82983k65470M3465L20271k32304J0439K16170j7280
$$ 1943299 1709491 1860292 2043275 1777805 1821270 2141541 1909237 1919676 2135846 2118566
14544B118566J73171r6922K48892O4941j05263o9995j30664L20687K65217N9846
$$ 2118566 2291737 2194815 2443707 2508648 2403385 2333390 2202726 2523413 2788630 2848476
14534B848476j92278K5076O6246N2272M05334j2045L79312J63060M58063J267344
$$ 2848476 2656198 2681274 2747520 2799792 3205126 3193081 3572393 3735453 4193516 5460860
14524E460860J320380L008063N782344J1162473J5148768m621609A5907214G675087
$$ 5460860 6781240 9789303 15571647 26734120 41882888 37261279 15907214 7675087
14515C821131j199402l24288k05609J59093l61968l5168L89304J35724m22657
$$ 3821131 2621729 2297441 2091832 2250925 1888957 1853789 2243093 2378817 1956160
14506A956160p2662O4054J72695J11659j4506J98534l09151m623P8842J82264
$$ 1956160 1883498 1947552 2120247 2231906 2217400 2415934 2106783 2102160 2181002 2363266
14496B363266m4445l7338p0557L56591J34801J5776n36j99424J19875n2857K05515
$$ 2363266 2318821 2281483 2210926 2567517 2702318 2718094 2717558 2518134 2638009 2585152 2790667
14485B790667m7476j45515K0864N68122k05910J89796j15166j3629K6879Q6757
$$ 2790667 2743191 2597676 2618540 3186662 2980752 3170548 3055382 3041753 3068632 3155389
14475C155389O8338J15617L0823J09082j74430j43340L40607l04806K30682r9634
$$ 3155389 3223727 3339344 3370167 3479249 3304819 3161479 3502086 3197280 3427962 3328328
14465C328328o6746L87243N4631k05352J98958J41440k43452K44331O9188k24643
$$ 3328328 3261582 3648825 3703456 3498104 3697062 3838502 3595050 3839381 3908569 3683926
14455C683926j56437K59385J12107o9018J67435o5931L69465k70453j41794M82383
$$ 3683926 3527489 3786874 3898981 3829963 3997398 3931467 4300932 4030479 3888685 4371068
14445D371068K72165n08964M5820J80938j826O4144J71998j02388M7538N7760
$$ 4371068 4643233 4134269 4180089 4361027 4359201 4423345 4595343 4492955 4540493 4598253
14435D598253r5420K74827l8888M4536K06931k7009n0498j74619L81435n54001
$$ 4598253 4502833 4777660 4738772 4783308 4990239 4963230 4912732 4738113 5119548 4565547
14425D565547P89728j36014o4630J93826j73534J86029L82393m731K2422M63113
$$ 4565547 5355275 5219261 5154631 5348457 5174923 5360952 5743345 5738614 5761036 6224149
14415F224149k57109j6200K88076k77110K57257l9594K3669K47782L12176r7330
$$ 6224149 5967040 5950840 6238916 5961806 6219063 6179469 6203138 6450920 6763096 6665766
14405F665766J56379P2691K37670p9832R1338J93042R7945j70322O4865K34343
$$ 6665766 6822145 6894836 7132506 7052674 7144012 7337054 7434999 7264677 7329542 7563885
14395G563885O8974J75642j3506p5907M16310K16373J05467k8224K26998J9196
$$ 7563885 7632859 7808501 7794995 7719088 8135398 8351771 8457238 8429014 8656012 8675208
14385H675208J78425J70475K86047l8774K77040l0932j52232M54467M3015L9331
$$ 8675208 8853633 9024108 9310155 9271381 9548421 9517489 9365257 9819724 9862739 9902070
14375I902070K87764M68312J28207J30259k89165M82585J19317K33333M14588
$$ 9902070 10189834 10658146 10786353 10916612 10627447 11110032 11229349 11462682 11877270
14366A1877270J90237J24571K11811N15499j94997K95022J30836L31003R3487
$$ 11877270 12067507 12192078 12403889 12919388 12724391 13019413 13150249 13481252 13574739
14357A3574739K62812L58393L06461J05093K98164J27437N36545K34436M12819
$$ 13574739 13837551 14195944 14502405 14607498 14905662 15033099 15569644 15804080 16216899
14348A6216899J64791N20764k36260Q74571R4009K53273M23164M42165M28899
$$ 16216899 16381690 16902454 16666194 17540765 17634774 17888047 18311211 18753376 19182275
14339A9182275L53029N77589L85417M02607N09131N40542Q36209L06796J73Q13550
$$ 19182275 19535304 20112893 20498310 20900917 21410048 21950590 22786799 23093595 23093768 23907318
14329B3907318O21214N31620J97248R88961O37603N07569O13949O13970R78361
$$ 23907318 24528532 25060152 25257400 26246361 26883964 27391533 28005482 28619452 29597813
14320B9597813P01024Q54876N32394J130164Q21171O81045R36417J272838J349951
$$ 29597813 30298837 31153713 31686107 32816271 33637442 34318487 35254904 36527742 37877693
14311C7877693O28260Q50317J312225J399693J001828J285900J551749J314972
$$ 37877693 38505953 39356270 40668495 42068188 43070016 44355916 45907665 47222637
14303D7222637J696428J495274J538128J960099J437135J856435K506483J648034
$$ 47222637 48919065 50414339 51952467 53912566 55349701 57206136 59712619 61360653
14295F1360653J818539K595529K286015K613941K570401K851767L191237K811125
$$ 61360653 63179192 65774721 68060736 70674677 73245078 76096845 79288082 82099207
14287H2099207L333326L404119L697721M039958M124453M433126M515404M874616
$$ 82099207 85432533 88836652 92534373 96574331 100698784 105131910 109647314 114521930
14279A14521930N536388N231514N731032O247944O395703P303417P237046Q028836
$$ 114521930 120058318 125289832 131020864 137268808 143664511 150967928 158204974 166233810
14271A66233810Q142399Q728651R041953R303670J0317405J0638434J1042297
$$ 166233810 174376209 183104860 192146813 201450483 211767888 222406322 233448619
14264B33448619J2150961J2217521J3415179J3357387J3963366J4362370J4655805
$$ 233448619 245599580 257817101 271232280 284589667 298553033 312915403 327571208
14257C27571208J4765883J5433767J4442226J4621932J4088415J3327787J2102895
$$ 327571208 342337091 357770858 372213084 386835016 400923431 414251218 426354113
14250D26354113J0998232Q986517N991975J038536j84265l47153o20425L92145
$$ 426354113 437352345 446338862 452330837 453369373 453185108 452837955 452217530 452609675
14242D52609675n139925m690030n561280j0208660j2104273j3263634j3675885
$$ 452609675 447469750 442779720 437218440 427009780 414905507 401641873 387965988
14235C87965988j4391489j3793632j5246999j5487932j5008354j4769721j3847959
$$ 387965988 373574499 359780867 344533868 329045936 314037582 299267861 285419902
14228B85419902j3794362j3217286j2884137j1928997j1787934j0951913j0690061
$$ 285419902 271625540 258408254 245524117 233595120 221807186 210855273 200165212
14221B00165212r397832r190259q753895p803906p904694p552677o758220o534882
$$ 200165212 190767380 181577121 172823226 165019320 157114626 149561949 142803729 136268847
14213A36268847n906702n805464n292164m666158n196068m647276m477036l749355
$$ 136268847 130362145 124556681 119264517 114598359 109402291 104755015 100277979 96528624
14205I6528624l538739l865916l346116l550180k585436l283282k821417k973313
$$ 96528624 92989885 89123969 85777853 82227673 79642237 76358955 73537538 70564225
14197G0564225k389288k140442k517542j945595j934163k274639j565932j903804
$$ 70564225 68174937 66034495 63516953 61571358 59637195 57362556 55796624 53892820
14189E3892820j970640r67214j648833j962650j343364j072777j073889j340086
$$ 53892820 51922180 50954966 49306133 47343483 46000119 44927342 43853453 42513367
14181D2513367q95027j326805j312947j434192n04116j665416n52448n10254j211995
$$ 42513367 41618340 40291535 38978588 37544396 37040280 35374864 34822416 34312162 33100167
14172C3100167q92629o58396j024717p21661n84537r91153p11684p9698r70819
$$ 33100167 32207538 31549142 30524425 29802764 29218227 28227074 27515390 27435692 26464873
14163B6464873n90885j050317J7020r51082l93581m00841n83448n33843o74648
$$ 26464873 25873988 24823671 24840691 23889609 23496028 23095187 22511739 21977896 21303248
14154B1303248m42648m57514m81684k50161k12918m96077m73023n94557j38383
$$ 21303248 20860600 20403086 19921402 19671241 19458323 18962246 18489223 17894666 17756283
14145A7756283k4763n69751n22737k61799j8834o08965r2885l70206l42462q1388
$$ 17756283 17731520 17161769 16639032 16377233 16358399 15749434 15656549 15286343 14943881 14862493
14135A4862493o12324Q066k38673j70596m71117J74813n43344l24921j70069m50402
$$ 14862493 14250169 14258235 14019562 13848966 13377849 13552662 13009318 12684397 12514328 12063926
14125A2063926o2464L9485J6030o87752k07688M4907j71598r49J9673j91410l33724
$$ 12063926 12001462 12040947 12056977 11369225 11161537 11206444 11034846 11033897 11053570 10862160 10528436
14114A0528436m7737m81994j79013J01257J27719m61746k6029l38865P5437j02483
$$ 10528436 10480699 9998705 9819692 9920949 10048668 9586922 9560893 9222028 9297465 9194982
14104I194982K1894j70284r8949l13689j23783l27569L3758J0679l5526r9520
$$ 9194982 9216876 9046592 8947643 8633954 8510171 8182602 8216360 8227039 8191513 8091993
14094H091993k02755k49393J09859j19818k93327J12838k14684J41636k87559
$$ 8091993 7889238 7639845 7749704 7629886 7336559 7449397 7234713 7376349 7088790
14085G088790k6792j16506j66067l1385o3005l21635M223o5950P4926j3867j83021
$$ 7088790 7061998 6945492 6779425 6748040 6685035 6363400 6367623 6301673 6376599 6362732 6179711
14074F179711K0711k87761J67375j39528j16867j28288K18927m90441o5561L13367
$$ 6179711 6200422 5912661 6080036 5940508 5823641 5695353 5914280 5423839 5358278 5671645
14064E671645l49649K55517l97174J16156j19250o9992j22132k89861K22597k33239
$$ 5671645 5321996 5577513 5180339 5296495 5177245 5107253 4985121 4695260 4917857 4684618
14054D684618J60532j00294k02090k387L47514j64628l48296R8731J2962K43119
$$ 4684618 4845150 4744856 4542766 4540379 4887893 4723265 4374969 4473700 4486662 4729781
14044D729781o37623j7623L61358j99807J54198m29286J78230J17980j35177R566
$$ 4729781 4092158 4074535 4435893 4236086 4390284 3960998 4139228 4257208 4122031 4131597
14034D131597K58383m42816L25093q9279k96938m71695M00218q008l78080J2528
$$ 4131597 4389980 3947164 4272257 4182978 3886040 3414345 3814563 3806555 3428475 3441003
14024C441003J78317n7623l9183j62476R3720R2545k39493j34559J03672j61922
$$ 3441003 3619320 3561697 3522514 3360038 3453758 3546303 3306810 3172251 3275923 3114001
14014C114001K56067l17065O6840j03221k57114M03439R0564l03384J6417Q5341
$$ 3114001 3370068 3053003 3119843 3016622 2759508 3162947 3253511 2950127 2966544 3051885
14004C051885J76433k69631O1959j81490J5178j83640j10114M55833m32066q5933
$$ 3051885 3228318 2958687 3020646 2839156 2854334 2670694 2560580 3016413 2584347 2498414
13994B498414Q9754R0433j10780J02432L4825l37292j69118O552J83234j23697
$$ 2498414 2588168 2678601 2567821 2670253 2705078 2367786 2198668 2205220 2388454 2264757
13984B264757L21905j51258o7658j8518K30714m88172J66109q5011J73781l12346
$$ 2264757 2586662 2435404 2367746 2349228 2579942 2091770 2257879 2172868 2346649 2034303
13974B034303N6642k31196L46821j97014K41441M3856K1460j07600o4240L48970
$$ 2034303 2090945 1859749 2206570 2009556 2250997 2294853 2316313 2208713 2144473 2493443
13964B493443N56679J700669M479833R225409J6942660N055746j9113989r158850
$$ 2493443 3050122 4750791 9230624 18456033 35398693 40454439 21340450 12181600
13956A2181600m761849k058190q78954q49250N9124m92581L86854n78149k64203
$$ 12181600 7419751 5361561 4482607 3633357 3692481 3199900 3586754 3008605 2744402
13947B744402O649k6313J45878l04158k54102K74232j92618l8745k38240J53395
$$ 2744402 2751051 2724738 2870616 2566458 2312356 2586588 2393970 2355225 2116985 2270380
13937B270380m4622k59658J20721O8595K2317o737k85420J97407j96134K33889
$$ 2270380 2225758 1966100 2086821 2155416 2177733 2170996 1885576 2082983 1886849 2120738
13927B120738Q0935L0004l01063k1186J0732K25466k76538O0418j11495o8922
$$ 2120738 2201673 2231677 1930614 1909428 1920160 2145626 1869088 1929506 1818011 1749089
13917A749089J92677k58443O2069j53466N62211m62825k39633L29610m2111j39629
$$ 1749089 1941766 1683323 1745392 1591926 2154137 1691312 1451679 1781289 1739178 1599549
13907A599549n8636L79927l17488O30661l80884k13297q9756N4555L61088n01863
$$ 1599549 1540913 1920840 1603352 2234013 1853129 1639832 1550076 1604631 1965719 1463856
13897A463856J35864k96628O3946K07522J32679m10723K72947K54276l11084L7657
$$ 1463856 1599720 1303092 1367038 1574560 1707239 1296516 1569463 1823739 1512655 1550312
13887A550312J73710k08184j26637K3417r4121J43632K23433n28488N14520k24733
$$ 1550312 1724022 1515838 1389201 1412618 1318497 1462129 1685562 1157074 1671594 1446861
13877A446861k01270L4447N3270M12181l89016k76018J44415J41677j44351l03641
$$ 1446861 1245591 1280038 1333308 1745489 1356473 1080455 1224870 1366547 1222196 918555
13867I18555M94682m85342N06920k21288k3889J85510j4359k74471K85695k64262
$$ 918555 1413237 927895 1434815 1213527 1189638 1375148 1360789 1086318 1372013 1107751
13857A107751k59094M74789N6513l19076J77815j45527K63989j21315p8769l3524
$$ 1107751 848657 1323446 1379959 1060883 1238698 1093171 1357160 1235845 1157076 1123552
13847A123552l8979J52454J8790k24973O5906J92631m486p5506l36007M84598
$$ 1123552 1084573 1237027 1255817 1030844 1096750 1289381 1284895 1209389 873382 1357980
13837A357980l16845o0681j87092J18852M06070n08556K35952M5367K37392l52953
$$ 1357980 1041135 980454 793362 912214 1318284 809728 1045680 1091047 1328439 975486
13827I75486q5584K00932j33220r5490N85306m42524K4554j76774N7380j3035
$$ 975486 889902 1090834 957614 862124 1447430 1004906 1029460 852686 910066 897031
13817H97031k0815K66772j68234K63599k30437j07165J7665j81720J76014j50715
$$ 897031 876216 1142988 974754 1238353 1007916 900751 918416 736696 912710 761995
13807G61995J74327K7439j36330K25388J1410r4119K01543l96935K89767j67145
$$ 761995 936322 963761 827431 1052819 1064229 970110 1171653 774718 1064485 897340
13797H97340J31797o1530j22361j0883L2641k35628K96351k30915K41338M058
$$ 897340 1029137 967607 845246 834363 867004 631376 927727 696812 938150 942208
13787I42208j35289J85014j67590k47804Q9723J94347j43504L23837l41221n3962
$$ 942208 806919 991933 824343 576539 666262 860609 717105 1040942 699721 645759
13777F45759M2219J19089L31713k63175k2533k8711j23179K12523k50759p0660
$$ 645759 687978 807067 1138780 875605 853072 824361 701182 913705 662946 592286
13767E92286j36962J98353j3354J07298j6846J14935K18731n02402J10509N0706
$$ 592286 455324 653677 640323 747621 730775 845710 1064441 562039 672548 723254
13757G23254J61989R6050P559C80685J51808N2275J97980k33485J88818j20671
$$ 723254 885243 981293 988852 380685 532493 584768 782748 549263 738081 617410
13747F17410J77233J47202j07424k03908J26115L07350l48377B97710L85462J5277
$$ 617410 794643 941845 834421 630513 756628 1063978 715601 297710 683172 698449
13737F98449J77355l85474K29939J33403l97745K46597j75848K85285O9549k50627
$$ 698449 875804 490330 720269 853672 455927 702524 526676 811961 881510 630883
13727F30883j30124J30010j56972O13565D96151P42O4444J22845q9121k59286
$$ 630883 500759 630769 473797 1087362 496151 496893 561337 684182 595061 335775
13717C35775K90418J52659Q3109k31817R0562J93048m17270K20502k23351o0478
$$ 335775 626193 778852 861961 630144 720706 913754 496484 716986 493635 433157
13707D33157L64897C81744K80010K535j9475j85380o5309L29487C32496K94195
$$ 433157 798054 381744 661754 664289 644814 459434 394125 723612 332496 626691
13697F26691n0000Q0126j40869J9254J35497N4667l19111l1342M83576l21255
$$ 626691 576691 656817 515948 535202 670699 725366 406255 374913 858489 537234
13687E37234L181K4822n6059n2469K1082N7668j06897P2498j1933B28024J08992
$$ 537234 540415 565237 509178 456709 477791 535459 428562 501060 489127 228024 337016
13676C37016M8149K30023J2863L7762j78535J66864J95660j07869j40791q3388
$$ 337016 385165 615188 628051 665813 487278 654142 849802 741933 601142 517754
13666E17754M91B22064K53800A80660M83051K45286D06934M6613B24523K41705
$$ 517754 518245 222064 475864 180660 663711 908997 406934 453547 224523 466228
13656D66228L6757j20821J12112j4155K45371B42944J80254L48863C25130N8253
$$ 466228 502985 382164 494276 480121 725492 242944 423198 772061 325130 383383
13646C83383J54528A62690J5267L79122j15622K01027j21827P0430j91075K66879
$$ 383383 537911 162690 177957 557079 441457 642484 520657 591087 400012 666891
13636F66891B94293j38083O15856l70588K70855j16697J40728j90734p6695J92581
$$ 666891 294293 156210 772066 401478 672333 555636 696364 505630 428935 621516
13626F21516N008k16583N6227O9775k22999J9058J40715j19815j03203l3237K66193
$$ 621516 626524 409941 466168 535943 312944 332002 472717 352902 249699 216462 482655
13615D82655j5857k04825J49075j32528P0960K46859B76783K85671j98956J17175
$$ 482655 466798 261973 411048 278520 349480 596339 276783 562454 363498 480673
13605D80673j39633j3972N820K40180j31116i4509G57658r9595k02511K07558
$$ 480673 341040 327068 332888 573068 441952 -94509 757658 658063 455552 663110
13595F63110j80028A86295J31747j2800L89798q6256A31443L39396A44157J62996
$$ 663110 483082 186295 318042 305242 695040 608784 131443 470839 144157 307153
13585C07153J04889j82771K57385P1779M8818q0855j3810k7433o7349r1976L56907
$$ 307153 412042 229271 486656 558435 607253 526398 512588 485155 417806 325830 682737
13574F82737A66451J34099G223L10253I4065J32906M2578J05738j20513N9946
$$ 682737 166451 300550 7223 317476 94065 226971 269549 375287 254774 314720
13564C14720J32712j05895j9264M1702l8936m5475A10409L2152K54123H0980K1856
$$ 314720 447432 341537 322273 363975 325039 279564 110409 142561 396684 80980 102836
13553A02836j587M22044j47319M3265A91308J3243g7827B03730M4102n4613P8107
$$ 102836 101249 523293 375974 419239 191308 204551 -77827 203730 247832 193219 271326
13542B71326J42607J85274B18281J0204J45268j04651k2426Q6743Q3938B08132
$$ 271326 413933 599207 218281 228485 373753 269102 246676 333419 417357 208132
13531F51694l25354J10797O9307i6182A30824M35540B81476H8240i3261C24658
$$ 651694 326340 437137 506444 -96182 130824 566364 281476 88240 -93261 324658
13520C33611M01676l15221j69126k0173I9538J40748K50383B31292O2308q7579
$$ 333611 735287 420066 250940 230767 99538 240286 490669 231292 293600 206021
13510B06021I5699M12947B34729E7137K8399J26544K50875j3474E9517J51819
$$ 206021 95699 508646 234729 57137 85536 212080 462955 449481 59517 211336
13500B11336M36516g3961C48589o8892k964j35258K2576Q0309p0021Q3284o5696
$$ 211336 647852 -73961 348589 279697 276733 141475 164051 244360 174339 257623 191927
13489A91927b10884D31567j63846J25235K3295j23855j08721J50434m9622L00244
$$ 191927 -210884 431567 267721 392956 416251 292396 183675 334109 284487 584731
13479E84731A83459p1433E4246M30745j34214j54332K97705l0382l3056j62404
$$ 584731 183459 112026 54246 484991 350777 196445 494150 463768 430712 268308
13469B68308Q8918J17415Q8642H4005L00638G0643e3213C45187k4566J37266G0358
$$ 268308 357226 474641 563283 84005 384643 70643 -53213 345187 320621 457887 70358
13457E85212A03750J9035L20724n6175A71078J56559I5711J302J95983N2424A63054
$$ 585212 103750 122785 443509 387334 171078 327637 95711 97013 292996 345420 163054
13445E7761K24252j28890L8043k5369N25510A36690K09347A55419L38198j23221
$$ 57761 282013 153123 191166 165797 691307 136690 346037 155419 493617 370396
13435C70396D6894L39132j65453K16700A30385N2173J9310J86120C0711d075B07152
$$ 370396 46894 386026 220573 437273 130385 182558 201868 387988 30711 -4075 207152
13423B57687F0626M9032K18604k3538I1615K84718F4013j5868K65294q1209F1473
$$ 257687 60626 109658 328262 304724 91615 376333 64013 48145 313439 232230 61473
13411b35717A49053D1566J61999J20482F0123O663j1094J76069l6614M4114J79466
$$ -235717 149053 41566 203565 324047 60123 66786 55692 231761 195147 239261 418727
13400D18727j68694A9865M9998M2312K09021g4282K2667A57717j3879K79476b0121
$$ 418727 250033 19865 69863 112175 321196 -74282 -51615 157717 143838 423314 -20121
13388F6316L99866k06918O1841a6305B36638b10591H438L118L74735r6029A9144
$$ 66316 466182 259264 321105 -16305 236638 -210591 8438 11556 386291 290262 19144
13376C28292A38177m4239K25929j01281G948M22208r1299a52358B72115q2581
$$ 328292 138177 93938 319867 218586 7948 430156 338857 -152358 272115 189534
13366A89534a1187C30451a0537C9081J63080k9173j8279l4921G724K62194A07732
$$ 189534 -11187 330451 -10537 39081 202161 172988 154709 119788 7724 269918 107732
13354A69236L00308j65361H6755l7420K46525j10260J99444R8187B25228E2680
$$ 169236 469544 304183 86755 49335 295860 185600 385044 483231 225228 52680
13343A25979B1088L34333A36425J37024J45002A71198L12929k09656I0373J930
$$ 125979 21088 355421 136425 273449 418451 171198 484127 274471 90373 92303
13333I2303a15599A28514K24211g8878a4394G7617K86041j23747G1095K86329
$$ 92303 -115599 128514 352725 -78878 -14394 77617 363658 239911 71095 357424
13323C57424n5630P3659G2080L50021j65604M0314D2204a03046D10726R46a11783
$$ 357424 301794 375453 72080 422101 256497 296811 42204 -103046 410726 411672 -111783
13311B88808J05762A08459K90512C7212N34790g9959A95892E3838J17500k6355
$$ 288808 394570 108459 398971 37212 572002 -79959 195892 53838 171338 144983
13301A44983P0042I2799J03163C7068K46374E4603P4231m4045L99504D7145L19025
$$ 144983 215025 92799 195962 37068 283442 54603 128834 84789 484293 47145 366170
13290C66170R231C9639j4750K01042J82407E5539K12362L6562J2975j18971n3558
$$ 366170 375401 39639 24889 225931 408338 55539 267901 304463 317438 198467 144909
13279A44909P9647q6886O6613R5104c1330A74507J64734Q7499j78462F3869J88250
$$ 144909 224556 137670 204283 299387 -31330 174507 339241 426740 248278 63869 252119
13268B52119f7986D45733B8062L07021q9479m4036J324J06471n6298j10316M5419
$$ 252119 -67986 445733 28062 335083 245604 201568 202892 309363 253065 142749 188168
13257A88168Q7804A23668Q5922J6252G4428n978M16150m4557A62330K63282B4473
$$ 188168 275972 123668 209590 225842 74428 68450 484600 440043 162330 425612 24473
13245G8094O5465k9010K42875j11900o7908g8223A29205a00131A0634R1879O0322
$$ 78094 143559 114549 357424 245524 177616 -78223 129205 -100131 10634 102513 162835
13234A62835K22032j1645A8463b19680A74476k7505M4231k473f2258H0347r68
$$ 162835 384867 373222 18463 -219680 174476 146971 191202 188729 -62258 80347 79379
13223G9379K2720J55720Q671j13042J51321k366j0675a13988A43571J68580A12896
$$ 79379 102099 257819 266490 153448 304769 302403 291728 -113988 143571 312151 112896
13211B30673a28967A86494k2886a2150r3124B47096A13615J8529K11096r7000
$$ 230673 -128967 186494 163608 -12150 -105274 247096 113615 132144 343240 246240
13201B46240n8465n2509c9789D469J12566f5152F2981b65239C98791c1387D0081
$$ 246240 187775 135266 -39789 4469 117035 -65152 62981 -265239 398791 -31387 40081
13189d1717B36166F8551q630a41131L4162G9419A017R4788c26947f2763B31501
$$ -41717 236166 68551 59921 -141131 -106969 79419 1017 95805 -326947 -62763 231501
13177A55539i7324E4526K09175a18006F3379J1047J35518e052j1521A82730q7828
$$ 155539 -97324 54526 263701 -118006 63379 74426 209944 -5052 -16573 182730 94902
13166I4902M6b63528B50881A18239e8608A58091J32002I7030R8494p7283a27370
$$ 94902 94948 -263528 250881 118239 -58608 158091 290093 97030 195524 118241 -127370
13154a08966C49451G3074d1602C17142b17106N1010a4272A70824N8213j11044
$$ -108966 349451 73074 -41602 317142 -217106 -166096 -14272 170824 229037 117993
13144A17993K09126a82064A63K52340a15486E84450b09015I8670M9843L7442J84577
$$ 117993 327119 -182064 163 252503 -115486 584450 -209015 98670 148513 185955 370532
13133C70532A47047i4366B08597c8788q909r865A0936J7664R9710K77392j20253
$$ 370532 147047 -94366 208597 -38788 -47697 -57562 10936 28600 128310 405702 285449
13122B85449a26873B10090a5079B28453E3789R5389n5264a5657r0031N948D29848
$$ 285449 -126873 210090 -15079 228453 53789 149178 93914 -15657 -105688 -99740 429848
13110a10796B00944n5772A867J07410d21617G0999J26235a69464A24742h593l3132
$$ -110796 200944 145172 1867 109277 -421617 70999 197234 -169464 124742 -8593 -41725
13099d1725C10641A33917N0990b03763B28472C0117M379J57297e0947C6029R8087
$$ -41725 310641 133917 184907 -203763 228472 30117 34496 191793 -50947 36029 134116
13088A34116a79888A38612J34559C8466A2721P7191D4497a88069A13180K81790
$$ 134116 -179888 138612 273171 38466 12721 89912 44497 -188069 113180 394970
13078C94970I4836J15597c00166p2674A70228L6417c30222c8345C61715I5269
$$ 394970 94836 210433 -300166 -372840 170228 206645 -330222 -38345 361715 95269
13067A55830O8777a31150p1332E8273J27868K4435G5281K04261a91184e1987q2370
$$ 155830 224607 -131150 -202482 58273 186141 210576 75281 279542 -191184 -51987 -134357
13056a34357L0979G2131J59745F5166J01181f6952A09083a83962h9988B00273
$$ -134357 -103378 72131 231876 65166 166347 -66952 109083 -183962 -89988 200273
13045f622A15072m6981J47391H5961a88675B39850m9871p5230e3508B17830B6542
$$ -6622 115072 68091 215482 85961 -188675 239850 189979 114749 -53508 217830 26542
13033F5588J01596G4098B352J70344c481j53579c5476a2900A07529d012j17129
$$ 65588 167184 74098 2352 172696 -3481 -157060 -35476 -12900 107529 -4012 -121141
13022a21141l9C26551q03E4228B740a22926f0008k0753A6523K12753q1328F4355
$$ -121141 -121180 326551 325748 54228 2740 -122926 -60008 -80761 16523 229276 147948 64355
13009B09309a92652C02070A12692l3440J12430g0266H5493K06863i7334C78324
$$ 209309 -192652 302070 112692 79252 191682 -70266 85493 292356 -97334 378324
12998e7531P512B10701j04535k3425J40479A0099K19460a58511K8392f4000H0519
$$ -57531 -50019 210701 106166 82741 223220 10099 229559 -158511 -130119 -64000 80519
12986C22457D4555b89469H7165J68452q3120a0993A05289J83464a10013A39238
$$ 322457 44555 -289469 87165 255617 172497 -10993 105289 288753 -110013 139238
12975A299L9488L23697p6070a2695C60575B1497N3858b36198C2604b7198j7357
$$ 1299 40787 364484 288414 -12695 360575 21497 75355 -236198 32604 -27198 -44555
12964d4555J1746A84995P4031I6365J05427E8970B5726K27878A25143K79671e4367
$$ -44555 -32809 184995 259026 96365 201792 58970 25726 253604 125143 404814 -54367
12952d7040C56362B2472O5382K14733B5549O3413a96896A39569J90798b7714B6780
$$ -47040 356362 22472 87854 302587 25549 88962 -196896 139569 330367 -27714 26780
12940I129L0414K63240C9267J75845r6929R4886G3883a39407I7470J36162a90205
$$ 9129 39543 302783 39267 215112 118183 213069 73883 -139407 97470 233632 -190205
12928A1324O0091k6653K81229a85447A94149g8669A64567k6994J24611k5285b24658
$$ 11324 71415 44762 325991 -185447 194149 -78669 164567 137573 262184 236899 -224658
12916D0201q376J54283b02644A43193b65323L1406K9456b4695E9788a37597G987
$$ 40201 31825 186108 -202644 143193 -265323 -233917 -204461 -24695 59788 -137597 7987
12904E9295L48170b57324g5643p8533l962c6475j52822f6379p7109E027a20153
$$ 59295 407465 -257324 -75643 -154176 -158138 -36475 -189297 -66379 -143488 5027 -120153
12892A57629J72046g3349D0407J5426a05629l16652g5920m1910A14399n5091a20879
$$ 157629 329675 -73349 40407 55833 -105629 -422281 -75920 -117830 114399 59308 -120879
12880G5200L99a07647m3795C7965j6368K45620E8242J043J88267i2927B35430
$$ 75200 75599 -107647 -151442 37965 21597 267217 58242 59285 247552 -92927 235430
12868f0848B1325h141B63990A2880J99945G000K86943A05685R3491b42021C10219
$$ -60848 21325 -8141 263990 12880 212825 7000 293943 105685 199176 -242021 310219
12856G7833P8534f3623j10461n4869D9840a49612f7204D7305J15523J30689g7081
$$ 77833 156367 -63623 -174084 -228953 49840 -149612 -67204 47305 162828 293517 -77081
12844G2587P2003h3038J8978D7659a07730B71873b49377A13853E3050J232f6834
$$ 72587 144590 -83038 -64060 47659 -107730 271873 -249377 113853 53050 54282 -66834
12832d0861G9840M01772F8003a84490A10685O6069Q6374B9824P5918l817O1579
$$ -40861 79840 481612 68003 -184490 110685 176754 263128 29824 105742 101925 163504
12821A63504j9607J2008n800b76392C4679J7246O4330L41053d1190j02467O9226
$$ 163504 143897 155905 150105 -276392 34679 51925 116255 457308 -41190 -143657 -74431
12810g4431j58854C0438J6092h3575G6998J33813L2596b37327R5395G9528J15050
$$ -74431 -233285 30438 46530 -83575 76998 210811 243407 -237327 -141932 79528 194578
12799A94578q3844l8959f6094A14224j0086f2090K4937A93565b04612D7908f2189
$$ 194578 110734 71775 -66094 114224 104138 -62090 -37153 193565 -204612 47908 -62189
12787h98l78018E3670J44644b01064C8499b69071B80693d0090A0423b57611B3090
$$ -898 -378916 53670 198314 -201064 38499 -269071 280693 -40090 10423 -257611 23090
12775A64916b20799G7336b24405C36796a61986K4576A3497M8438b06011B45185
$$ 164916 -220799 77336 -224405 336796 -161986 -137410 13497 61935 -206011 245185
12764A32383P3214a45474B31184C1825M3691J017g9522l1120B5500c879k7997
$$ 132383 205597 -145474 231184 31825 75516 76533 -79522 -110642 25500 -3879 -31876
12753c1876l8691A48920A8551f9341I1679K47368c76061B57759l690j22522R9288
$$ -31876 -70567 148920 18551 -69341 91679 339047 -376061 257759 254069 131547 230835
12742B30835B1283K22648a29459B3709a60270F869d4011k09283A43081E7535c29193
$$ 230835 21283 243931 -129459 23709 -160270 6869 -44011 -253294 143081 57535 -329193
12730c18794E2534L09007G2003a36020A58913F3614a1417D4094e8654D8962A4626
$$ -318794 52534 361541 72003 -136020 158913 63614 -11417 44094 -58654 48962 14626
12718b45117A3410q60J05100d7831A24319f1303B38830L8345E1102K76485A45379
$$ -245117 13410 12550 117650 -47831 124319 -61303 238830 277175 51102 327587 145379
12706F8271J86452h5614B86835j35246m7717b217B42141h1641b8401o6332p9432
$$ 68271 254723 -85614 286835 151589 103872 -2217 242141 -81641 -28401 -94733 -174165
12695a74165B3991R0397J03457g4158I549k032B68J51783h0257B80571D7049M83694
$$ -174165 23991 114388 217845 -74158 9549 7517 268 152051 -80257 280571 47049 530743
12683E30743B17529A06537e6601A01495B9969K14823J3358r5470G8024g237j26692
$$ 530743 217529 106537 -56601 101495 29969 244792 258150 162680 78024 -7237 -133929
12672a33929F0245K6914R1261D2501Q0911J24911n5824C0242a25613b3743k79347
$$ -133929 60245 87159 178420 42501 123412 248323 192499 30242 -125613 -23743 -303090
12661c03090E0067J5388b15741j89164A29204O4947j5759J56195i9888B45231
$$ -303090 50067 65455 -215741 -404905 129204 194151 178392 334587 -99888 245231
12650I3395L33694k05289j09604J43071P8168A42506M0578d3370k23620G7123
$$ 93395 427089 221800 112196 255267 333435 142506 183084 -43370 -266990 77123
12639C06013p7717a27846e0916B61214P6281f1436J9102B54681j21652E6520L84035
$$ 306013 228296 -127846 -50916 261214 337495 -61436 -42334 254681 133029 56520 440555
12628D40555F9513a8221A82879L00673b88240C0786K31998a53948D31736b80425
$$ 440555 69513 -18221 182879 483552 -288240 30786 262784 -153948 431736 -280425
12617G4004l233K00578A33979h3938j26365F0482p997c7148C8796K5564L84930
$$ 74004 70771 271349 133979 -83938 -210303 60482 52485 -37148 38796 64360 449290
12606D49290B16336n4982o1406K02506A13174m0885i3824F28725I685a52890K6821
$$ 449290 216336 161354 99948 302454 113174 72289 -93824 628725 9685 -152890 -126069
12595a26069q9173A38479b15983P3029B15049g0512l36171r1712A20535g868k74079
$$ -126069 -215242 138479 -215983 -142954 215049 -70512 -406683 -498395 120535 -7868 -281947
12584b81947b3145E7314N215f5299F161b2021j4899B9506P0899J65745h9916A29158
$$ -281947 -23145 57314 62529 -65299 6161 -22021 -36920 29506 100405 266150 -89916 129158
12571A40224A3729O8660A9591L07647a3461j88715B52739j11149M097j8273a12882
$$ 140224 13729 82389 19591 327238 -13461 -202176 252739 141590 145687 127414 -112882
12559A759N9789a34556E2431J35563C6881a29021m8131N1345B17919a02433l05329
$$ 1759 61548 -134556 52431 187994 36881 -129021 -177152 -125807 217919 -102433 -407762
12548d07762A0535J05359K79196a09871B1302h6845E7827e1883o3774B20305d0432
$$ -407762 10535 115894 395090 -109871 21302 -86845 57827 -51883 -115657 220305 -40432
12536b5333B07987c2587A74691b1038j37020A15490K11797q3388j4683c42311
$$ -25333 207987 -32587 174691 -21038 -158058 115490 327287 243899 229216 -342311
12525C31118d2945A80330i9203a7263C19550A35831k236n3741K78020g9818k85200
$$ 331118 -42945 180330 -99203 -17263 319550 135831 133595 79854 357874 -79818 -365018
12514c65018D67243A90628b68827A09529d4156B7078b33826I3593N7369a07989
$$ -365018 467243 190628 -268827 109529 -44156 27078 -233826 93593 150962 -107989
12503h8155B6318b43037H750h4250k6044j2104d8841j68299C33610h4246j21556
$$ -88155 26318 -243037 8750 -84250 -110294 -122398 -48841 -217140 333610 -84246 -205802
12492b05802B76863a58425j66455h9320j73720A97512I7807J1556J27396E9387
$$ -205802 276863 -158425 -324880 -89320 -263040 197512 97807 109363 236759 59387
12481i6883E979J96954p7095l0154K21071k7661A25416e998A04367R24N8599J7146
$$ -96883 5979 202933 125838 95684 316755 289094 125416 -5998 104367 105291 163890 181036
12469A81036H4195c79523D24140b87637O4210A74498A2482J90987a65466A31449
$$ 181036 84195 -379523 424140 -287637 -223427 174498 12482 203469 -165466 131449
12458g0848C28313h3612C8230c1789a670G3168K92903d0319F0888j9605a21974
$$ -70848 328313 -83612 38230 -31789 -1670 73168 366071 -40319 60888 41283 -121974
12446e9995j96757o9293d8754C06188a8105j80840B37741b2197j6110B10398A7392
$$ -59995 -256752 -326045 -48754 306188 -18105 -198945 237741 -22197 -38307 210398 17392
12434g7244A09355b60505B8210b9994E3557h5050D00746j23363g6931k47799L8416
$$ -77244 109355 -260505 28210 -29994 53557 -85050 400746 277383 -76931 -324730 -286314
12423b86314k20583b24432E4047m508K76084c60160A92147B4620e2679A13311
$$ -286314 -506897 -224432 54047 49539 325623 -360160 192147 24620 -52679 113311
12412c0278j98368A04477m5339e3111A67908P7092B0876a95825f6842B00991O5157
$$ -30278 -228646 104477 59138 -53111 167908 245000 20876 -195825 -66842 200991 266148
12401B66148j31948A5887d6276j37156A53475C9820a72534a4176H9106a49095
$$ 266148 134200 15887 -46276 -183432 153475 39820 -172534 -14176 89106 -149095
12390a0045n6938B12323p9070D1358R2720c51441A69920j9435a54201M7570C5942
$$ -10045 -66983 212323 133253 41358 134078 -351441 169920 150485 -154201 -106631 35942
12378a68061q3174a04042C18962h255q3245C9985a70270A87003a59876k13613
$$ -168061 -251235 -104042 318962 -8255 -91500 39985 -170270 187003 -159876 -373489
12368c73489K1703A68560a03427a2023A98311M3213e011I44N391L78235a06866
$$ -373489 -351786 168560 -103427 -12023 198311 241524 -5011 944 6335 384570 -106866
12356D13066n0218c51369I6181J2625j0881b47919j5310c999B94826g9173A51935
$$ 413066 362848 -351369 96181 108806 97925 -247919 -263229 -3999 294826 -79173 151935
12344A45388J13519N3430a02393B10560a9337j35955A05612K14872a43637K267
$$ 145388 258907 312337 -102393 210560 -19337 -155292 105612 320484 -143637 -141370
12334a41370K3237N7177F6102b68809B3544b04334I9221a38122H5052J22888a14002
$$ -141370 -118133 -60956 66102 -268809 23544 -204334 99221 -138122 85052 207940 -114002
12322a12684j51483A37634e5236A28613n7558a54141r7690a15466G4267b41612
$$ -112684 -264167 137634 -55236 128613 71055 -154141 -251831 -115466 74267 -241612
12311a30029C14144d5293G8902c10287a01369c0259I1097b91714E8298A9537L27849
$$ -130029 314144 -45293 78902 -310287 -101369 -30259 91097 -291714 58298 19537 347386
12300C47386A25258A002e307H0176J80884m9262a55417d566k8641A03584P2244
$$ 347386 125258 1002 -5307 80176 261060 211798 -155417 -4566 -33207 103584 175828
12289A75828b68345A45831c13464a49104b3418k70564J23247A82346Q8118a45511
$$ 175828 -268345 145831 -313464 -149104 -23418 -293982 -170735 182346 270464 -145511
12278H4491I371d9101p5981A06172b52649D9246b4808k91640B11253m1236a57997
$$ 84491 9371 -49101 -125082 106172 -252649 49246 -24808 -316448 211253 170017 -157997
12266A3171a81124e1915A64353b3944j95683g6736C8602a90808C21149A32058
$$ 13171 -181124 -51915 164353 -23944 -219627 -76736 38602 -190808 321149 132058
12255H9320K56679A22319d6437o9361B30844J74149e0083B6400O189M3040h7306
$$ 89320 345999 122319 -46437 -115798 230844 404993 -50083 26400 32589 75629 -87306
12243F9107b58929A80084L09203a20453e5262A44250J97051A25799C52J72617
$$ 69107 -258929 180084 489287 -120453 -55262 144250 341301 125799 352 172969
12233A72969M1771a59861m6572h4573C53443A09512e8282F8239J42972b68097
$$ 172969 214740 -159861 -206433 -84573 353443 109512 -58282 68239 211211 -268097
12222B4917K64201C7235b44928a00208K3331D27043A2824f4940A51243c03437
$$ 24917 289118 37235 -244928 -100208 -76877 427043 12824 -64940 151243 -303437
12211I376K07518a78922B46558b18665B99916A4546K68988E507a3575o2943C86607
$$ 9376 216894 -178922 246558 -218665 299916 14546 283534 5507 -13575 -76518 386607
12199A88038J02839d5392B3073K51961p4048a58073C31224j55603i4752A64936
$$ 188038 290877 -45392 23073 275034 200986 -158073 331224 175621 -94752 164936
12188C66721b60255B13176K26392E0333c2232m2257A42951P1543H4459J32158
$$ 366721 -260255 213176 439568 50333 -32232 -74489 142951 214494 84459 216617
12178B16617J49536A20284K42951A47939K97940G1725J58139J06618j48986G6784
$$ 216617 366153 120284 363235 147939 445879 71725 229864 336482 187496 76784
12167a43823b5302A4414a11328C5394K45084E7664J33516q5256n2403a1710A17717
$$ -143823 -25302 14414 -111328 35394 280478 57664 191180 105924 53521 -11710 117717
12155b1548j5061j56088E8159J76620d1951H7388h1688B54705d8354C15096A50827
$$ -21548 -36609 -192697 58159 234779 -41951 87388 -81688 254705 -48354 315096 150827
12143D2834a36562I2653J04736l4769c52997A26536g5149k47490F0957Q8579k7166
$$ 42834 -136562 92653 197389 162620 -352997 126536 -75149 -322639 60957 149536 122370
12132A22370R0131o312C1652J53512a80114E08264A28334d00410B258L6623f5182
$$ 122370 212501 206189 31652 185164 -180114 508264 128334 -400410 2258 38881 -65182
12120C17224A09291D1409J44384a4089A48123K15143b83363a21863A02432O9120
$$ 317224 109291 41409 185793 -14089 148123 363266 -283363 -121863 102432 171552
12110A71552a20778A8065a65809O1237B46602D4792a95131A01254L3777b0403
$$ 171552 -120778 18065 -165809 -104572 246602 44792 -195131 101254 135031 -20403
12099i0027j96816b4216J0446B86622m7284g4774O82L0637K1070A95565B0701
$$ -90027 -286843 -24216 -13770 286622 239338 -74774 -74092 -43455 -22385 195565 20701
12087A41866a83142Q4738M4318F2038E895a71350c8841l49974H5845a6499p5973
$$ 141866 -183142 -98404 -54086 62038 5895 -171350 -38841 -388815 85845 -16499 -92472
12076i2472D640K30262E533c3488l24335B19607b109C57724e0136B21536b35255
$$ -92472 4640 234902 5533 -33488 -357823 219607 -2109 357724 -50136 221536 -235255
12064i862B13442a15766k7557a1808q6156n0368A02277a30706A75758J73934j29461
$$ -9862 213442 -115766 -143323 -11808 -97964 -148332 102277 -130706 175758 349692 220231
12053B20231d1230l0230B82704h138k5694A46733M1936R32008q4059D69126j43603
$$ 220231 -41230 -71460 282704 -8138 -33832 146733 188669 1120677 1036618 469126 325523
12042C25523m0707a26063A32481a27553A48060L0665a05129l4539F0432J17029
$$ 325523 284816 -126063 132481 -127553 148060 178725 -105129 -139668 60432 177461
12032A77461a1479o5871B9231C789a88116Q3143B24828b31724A89596D6179l205
$$ 177461 -11479 -77350 29231 3789 -188116 -104973 224828 -231724 189596 46179 42974
12021D2974J70014a42261B8572a9812j74229i3920k94190A14140P9545d68343
$$ 42974 212988 -142261 28572 -19812 -194041 -93920 -388110 114140 193685 -468343
12010h3408I508a57419C00393b24880d0962B00687D2603K9223a37142n0421D8526
$$ -83408 9508 -157419 300393 -224880 -40962 200687 42603 71826 -137142 -187563 48526
11998b33514h7209A00416k259c2472C65947c59330J48622I5354C0569J61766a4613
$$ -233514 -87209 100416 98157 -32472 365947 -359330 -210708 95354 30569 192335 -14613
11986A25352b7423D8185J71910A09536h8863E8123c63256B42495b1332j23617
$$ 125352 -27423 48185 220095 109536 -88863 58123 -363256 242495 -21332 -144949
11976a44949m9222A27663C5182b16988A72627h5040K1352A81590N6775q3775k0191
$$ -144949 -194171 127663 35182 -216988 172627 -85040 -63688 181590 238365 154590 134399
11965A34399b853j5044m0170J4850q334A30388L9133l8512h6418J2944D0016b74423
$$ 134399 -2853 -17897 -58067 -43217 -51551 130388 169521 131009 -86418 -73474 40016 -274423
11952b26426H4427j7890p512f5226f10C0736J9598a09227d9816j01365E9569J08603
$$ -226426 84427 66537 59025 -65226 -610 30736 50334 -109227 -49816 -151181 59569 168172
11940A68172a04288k6418D9680J3985a43756A63162F4111J07640q0077A3361a8097
$$ 168172 -104288 -130706 49680 63665 -143756 163162 64111 171751 91674 13361 -18097
11928b10118B91286D7002M7486J14111I2574j2011a39791J5325j4183A11837E590
$$ -210118 291286 47002 94488 208599 92574 80563 -139791 -124466 -138649 111837 5590
11916G9980J93822a36580e605l4582j23627A00570b05913F869b38856A9708R3177
$$ 79980 273802 -136580 -5605 -40187 -163814 100570 -205913 6869 -238856 19708 112885
11905A12885J06738q7527a28627A07928N0779i7663l7665j44410J28621B39004
$$ 112885 219623 132096 -128627 107928 158707 -97663 -135328 -279738 -151117 239004
11894c19141A06944C6469a02861k47745J51644Q0939B84560A1840a29317q726
$$ -319141 106944 36469 -102861 -350606 -198962 -118023 284560 11840 -129317 -138043
11884a38043G928e5049A17808j2804a4709q1035I7109a35882F6731P1603c37854
$$ -138043 7928 -55049 117808 105004 -14709 -95744 97109 -135882 66731 138334 -337854
11872a06724B9687b94006f6342r3323C12551G5975L865J70780b2330F8953f0237
$$ -106724 29687 -294006 -66342 -159665 312551 75975 79840 250620 -22330 68953 -60237
11860a28944E05347a11256k0299I6278a85815p1091A80684m3850f6577j38337
$$ -128944 505347 -111256 -131555 96278 -185815 -256906 180684 136834 -66577 -204914
11850b04914j0841e3338I7305c76141e9911B31289O2760F2242a80315c1905a3042
$$ -204914 -215755 -53338 97305 -376141 -59911 231289 294049 62242 -180315 -31905 -13042
11838b39116F4621A1068J49919b0149l6494j30940K9672D7293N4427a9112A43822
$$ -239116 64621 11068 160987 -20149 -56643 -187583 -157911 47293 101720 -19112 143822
11826e974B81571A6217g6493j82264b3964A41906C9244a17116j80901e4484D2905
$$ -5974 281571 16217 -76493 -258757 -23964 141906 39244 -117116 -298017 -54484 42905
11814a40665I6095H38L83919b56980E0283A1471a73078j29086Q2898B94605J18122
$$ -140665 96095 838 384757 -256980 50283 11471 -173078 -302164 -219266 294605 412727
11803D12727b25900B6357A1453d3962p0778K8350A00395g7656H4460c20379g7975
$$ 412727 -225900 26357 11453 -43962 -114740 -86390 100395 -77656 84460 -320379 -77975
11791a87216a8892j15225b8468k13359a10l720k84873I1706J858M2175e3600O465
$$ -187216 -18892 -134117 -28468 -241827 -110 -3830 -288703 91706 93564 135739 -53600 -47135
11779d7135J3394B25008K9026b02326f7810B84789p4900b64349A7117c3396i92
$$ -47135 -33741 225008 254034 -202326 -67810 284789 209889 -264349 17117 -33396 -992
11767b75346d0215J892A92865a3686j7023k5187j31499I3685a30904A597a40342
$$ -275346 -40215 -38323 192865 -13686 -30709 -55896 -187395 93685 -130904 1597 -140342
11755d2579k37086a09643G0783e8045r309k1138l5509f754l06812e9509A68868
$$ -42579 -279665 -109643 70783 -58045 -67354 -88492 -124001 -6754 -313566 -59509 168868
11743B8094h8063K5015J211A04770a70050A07578f6507J4546K1939A646b09092
$$ 28094 -88063 -63048 -61837 104770 -170050 107578 -66507 -51961 -30022 1646 -209092
11731B23913d12123b05205P9668I8025J9638D4305e8529A80898q2679K4952G321
$$ 223913 -412123 -205205 -125537 98025 117663 44305 -58529 180898 98219 123171 7321
11719I7249b80585E3326g0076I9867e597B83094a4452m43148J65769A27092M0079
$$ 97249 -280585 53326 -70076 99867 -5597 283094 -14452 -457600 -291831 127092 167171
11708A67171H3259P5054F1802b20932a08722k7047B33880c8130J6873m1175B2950
$$ 167171 83259 158313 61802 -220932 -108722 -135769 233880 -38130 -21257 -62432 22950
11696a42612B06793f8349H7821C7048K22495j19104J86562m9648G9435a69020
$$ -142612 206793 -68349 87821 37048 259543 140439 327001 277353 79435 -169020
11685A66893K3717O0121m1224d160k8956m9448C9056g918D70891g997r721j4970
$$ 166893 190610 250731 209507 -4160 -33116 -82564 39056 -7918 470891 -7997 -17718 -32688
11673c2688l9418B37843n8671K7304p3240D370J85910a15542K7434A62434b01108
$$ -32688 -72106 237843 179172 206476 133236 4370 190280 -115542 -88108 162434 -201108
11661d5040B44244l8119H2717c8508a8403B13613J0061A07228a13646k426D9290
$$ -45040 244244 206125 82717 -38508 -18403 213613 223674 107228 -113646 -116072 49290
11649B29159e715A2987N2554b3299B72853r2129R4084e5250H4214l4569c1437
$$ 229159 -5715 12987 65541 -23299 272853 180724 274808 -55250 84214 49645 -31437
11637D14337r9480B7335c9430A05351O9324R6403A745i7934B51533f0426C1493
$$ 414337 314857 27335 -39430 105351 174675 271078 1745 -97934 251533 -60426 31493
11625H4644M6169k8375d8572o4287C9214M6761c24956J27143D5802a70981A36031
$$ 84644 130813 102438 -48572 -112859 39214 85975 -324956 -197813 45802 -170981 136031
11613C1364b94047J13611j90510c5019n8020C09464h6352r6728I4712l1807O762
$$ 31364 -294047 -180436 -370946 -35019 -93039 309464 -86352 -183080 94712 62905 69667
11602F9667a09918A6318Q8494L9682i9580l4291b2710B91089A17951k1965Q760
$$ 69667 -109918 16318 104812 144494 -99580 -133871 -22710 291089 117951 95986 104746
11591A04746m0822J09197b8392l2456j35556Q4121B37097q6143E5184J10425A5307
$$ 104746 63924 173121 -28392 -60848 -196404 -112283 237097 150954 55184 165609 15307
11579d6734A03893d56261B85509I0754b10081g4244h962q8261B02971I8138k9640
$$ -46734 103893 -456261 285509 90754 -210081 -74244 -8962 -97223 202971 98138 68498
11568F8498J97609D6546L76573b77613d1684A61145l9756N4364J01269d890C44067
$$ 68498 266107 46546 423119 -277613 -41684 161145 121389 175753 277022 -4890 344067
11556e1418A97013a56416E7664J37964o4195m4441O0976Q7255e6292K3351n4588
$$ -51418 197013 -156416 57664 195628 131433 86992 147968 235223 -56292 -32941 -87529
11545h7529A20069b34380i0028D63825A77185L84918B35999H4803i7771G7436
$$ -87529 120069 -234380 -90028 463825 177185 562103 235999 84803 -97771 77436
11534A9586g5642C03773C2273f1907A58764R9227n7861B3645a7352o4972q9310
$$ 19586 -75642 303773 32273 -61907 158764 257991 200130 23645 -17352 -82324 -171634
11523a71634A95494F9143e0814n9707r2245A73560d05066a4663G2020a28097j2545
$$ -171634 195494 69143 -50814 -110521 -202766 173560 -405066 -14663 72020 -128097 -140642
11512a40642A32326F363J96520J01116E8013P3878g536k3145b042E4732b06586
$$ -140642 132326 6363 202883 303999 58013 131891 -7536 -30681 -2042 54732 -206586
11500B55785J8348F4814K11148k5337j7660k0588h178A10520P819Q2547F4101
$$ 255785 274133 64814 275962 250625 232965 212377 -8178 110520 118339 200886 64101
11488E7398J45219a47326k42683I6326d3710A09863L28302b0988j18343D74451
$$ 57398 202617 -147326 -390009 96326 -43710 109863 438165 -20988 -139331 474451
11477C25302a83895D08217F7697i9277K7502m5478B05987b0087A47423D3795A7702
$$ 325302 -183895 408217 67697 -99277 -71775 -117253 205987 -20087 147423 43795 17702
11465C24355r6086A00243a50419G2574a34595i853A17655m7262h5859M2875G709
$$ 324355 228269 100243 -150419 72574 -134595 -9853 117655 70393 -85859 -42984 7709
11453B36744j08351m3850j3703e4628C54139j29168p310N7395b08736A13970K38663
$$ 236744 128393 84543 70840 -54628 354139 224971 217661 275056 -208736 113970 352633
11442C52633i9249G4151Q4179J67659l8324F797a13766C81186A57071J54395a63676
$$ 352633 -99249 74151 158330 325989 287665 6797 -113766 381186 157071 311466 -163676
11430G886f7500C3823L3795b20333A84593M8362r5549F7403b5518B23249p4486
$$ 7886 -67500 33823 67618 -220333 184593 232955 137406 67403 -25518 223249 148763
11419A48763K4852j4393N6152H5142g5811q1741A23978l0487b9962B9619L96094
$$ 148763 173615 159222 215374 85142 -75811 -157552 123978 93491 -29962 29619 425713
11408D25713B09443r0373N0198J26117c1527j46555M6008n1165O4124c2628A59689
$$ 425713 209443 119070 169268 295385 -31527 -178082 -132074 -183239 -119115 -32628 159689
11396f269j095A0662J46579G3565c798p4704A64292l0984h2312B53790a6549r9452
$$ -6269 -7364 10662 157241 73565 -3798 -78502 164292 133308 -82312 253790 -16549 -116001
11384a16001r7133Q4029A75816J98639D796A744J5623J01408J79542A06820e2569
$$ -116001 -213134 -129105 175816 374455 4796 1744 17367 118775 298317 106820 -52569
11372b95922H6529M0858M9723h7177o8228A16851b0666j96240B7344e468j13810
$$ -295922 86529 127387 177110 -87177 -155405 116851 -20666 -216906 27344 -5468 -119278
11361a19278J0432C7732a49856A00854a83551B15002a22445E9705i7216A50602
$$ -119278 -108846 37732 -149856 100854 -183551 215002 -122445 59705 -97216 150602
11350a58125f2428n9631b368l5922A31004c89553I987a22800k56582g5675A2292
$$ -158125 -62428 -122059 -2368 -38290 131004 -389553 9987 -122800 -379382 -75675 12292
11338H6595J34753c01404B19097c2782C4173O8124a12438j17551c3410D2774f4557
$$ 86595 221348 -301404 219097 -32782 34173 102297 -112438 -229989 -33410 42774 -64557
11326A51746R203b24H9494B8993b32145F0114K78187A08255K5224b90675g8197
$$ 151746 160949 -224 89494 28993 -232145 60114 338301 108255 133479 -290675 -78197
11314h6244A22824a14737B2745b77828d1639k64862J36398B39827A16483J66924
$$ -86244 122824 -114737 22745 -277828 -41639 -306501 -170103 239827 116483 283407
11304B83407J5550J344I7690D3802J00334J27971f4836E5859J64051e708k39719
$$ 283407 298957 300301 97690 43802 144136 272107 -64836 55859 219910 -5708 -245427
11293b45427e3781n6099A15042a85992A97662J7727c1208A29662a8056e792B87228
$$ -245427 -53781 -109880 115042 -185992 197662 215389 -31208 129662 -18056 -5792 287228
11281a32502n0756n6070b3142E647b03011A73741i7110A73733g198k05829D5762
$$ -132502 -183258 -239328 -23142 5647 -203011 173741 -97110 173733 -7198 -213027 45762
11269G6887d4298j37158A05080a12434q955A21537J8860f0501C0698j2064b00006
$$ 76887 -44298 -181456 105080 -112434 -121389 121537 140397 -60501 30698 18634 -200006
11257C69735a42094k01122g0907j50275O5464a2944p9254L6281J3592k48840a45188
$$ 369735 -142094 -343216 -70907 -221182 -155718 -12944 -92198 -55917 -42325 -291165 -145188
11245a82229G4659b11022h112j27537A36341R513n0079a2082D7474b10869A78576
$$ -182229 74659 -211022 -8112 -135649 136341 145854 95775 -12082 47474 -210869 178576
11233a73995h0787A2862b51736a18840C22604a23185G4957a12983l985j54231
$$ -173995 -80787 12862 -251736 -118840 322604 -123185 74957 -112983 -116968 -271199
11223b71199i7706j89187Q4724l1196h2592G1024a96328c5959j14488I4980l4705
$$ -271199 -97706 -286893 -202169 -233365 -82592 71024 -196328 -35959 -150447 94980 60275
11212F0275d5408r3101B8055o12b57941j45489e2994k02526J4346D788e2519A1167
$$ 60275 -45408 -138509 28055 27443 -257941 -403430 -52994 -255520 -241174 4788 -52519 11167
11199A0512a8658B72490G466f6698k10751A37472a51281I6059a79712g8089A12919
$$ 10512 -18658 272490 7466 -66698 -277449 137472 -151281 96059 -179712 -78089 112919
11187i9375G6891J19392b6385H485K40824i1968B47770H9880a21090r1553j45259
$$ -99375 76891 196283 -26385 8485 249309 -91968 247770 89880 -121090 -212643 -357902
11176c57902G3173A4961F064b46259N3450F1292H042a98528B2182d9708l4505
$$ -357902 73173 14961 6064 -246259 -192809 61292 8042 -198528 22182 -49708 -84213
11165h4213k2705M8207I7985c72004G6853C2602r348a89286A05278a12717A07411
$$ -84213 -106918 -58711 97985 -372004 76853 32602 23254 -189286 105278 -112717 107411
11153i8175L6815l8531j75265H6593b4667j69459d6527j4007g355A01550a03699
$$ -98175 -61360 -99891 -275156 86593 -24667 -194126 -46527 -60534 -7355 101550 -103699
11141g5804B8334J12268J4161J295b58770B5132b2170m6757j23307c0907C16976
$$ -75804 28334 140602 154763 156058 -258770 25132 -22170 -68927 -192234 -30907 316976
11129B01811b09133A05648a07919l4629A29435m8618K42452e8238m4574D0126
$$ 201811 -209133 105648 -107919 -142548 129435 80817 323269 -58238 -102812 40126
11118G0874K6607d09231R1083B57184h4766i430m49199H8022G107a29316j43216
$$ 70874 97481 -409231 -318148 257184 -84766 -9430 -458629 88022 7107 -129316 -272532
11107b72532J27063A71577J17626A22405c91698C18324a4044A04678G639J38240
$$ -272532 -145469 171577 289203 122405 -391698 318324 -14044 104678 7639 145879
11097A45879B3835a48504C08810j10101G3928a20661j65952C79352E6137G704
$$ 145879 23835 -148504 308810 198709 73928 -120661 -286613 379352 56137 7704
11086A15623L9287h2474K325A45849R9144E4354m083h3447C8734K95524A44578
$$ 115623 154910 -82474 -80149 145849 244993 54354 50271 -83447 38734 334258 144578
11074B51658k9548g3658E25499k01607R6831E3266e389j0065G0992J86965f8665
$$ 251658 222110 -73658 525499 323892 420723 53266 -5389 -15454 70992 257957 -68665
11062G8990O2758C5611a19324E2579J91094L5683C0952J57483K10729A03486J71964
$$ 78990 141748 35611 -119324 52579 243673 279356 30952 188435 399164 103486 275450
11051B75450A05192m7581K94997d7923J0515D53293k07840L8579l6928J81708
$$ 275450 105192 57611 352608 -47923 -37408 453293 245453 284032 247104 428812
11041D28812m3925J83883p8326m6238q0762R2813j61492J02678l3569O4083L70220
$$ 428812 384887 568770 490444 444206 363444 456257 294765 397443 363874 427957 798177
11030G98177r0818J919k48101R8765K46230r0412j64737L5883j84534R5416n6221
$$ 798177 707359 709278 461177 559942 806172 715760 551023 586906 402372 497788 441567
11019D41567J28560A73939M59137j06184K86792n2768p3748J27590P3117k69144
$$ 441567 570127 173939 633076 526892 813684 760916 687168 814758 887875 618731
11009F18731p2498o6134o8179J0730j0923J7491L01286k6330k4471j83510J58805
$$ 618731 546233 480099 411920 422650 411727 429218 730504 704174 679703 496193 654998
10998F54998j98678R07L21311k64573K31659k15478J03989j20048M00649D28427
$$ 654998 456320 457227 778538 513965 745624 530146 634135 514087 914736 428427
10987D08469J58103J38454l39479M17322j04446L7085M6566k65904L47731j30853
$$ 408469 566572 705026 365547 782869 678423 715508 762074 496170 843901 713048
10977G13048k69542j79376L3812K53618J95198J52178B40856K83405J72266k53556
$$ 713048 443506 264130 297942 551560 746758 898936 240856 524261 696527 442971
10967D42971J23209N7406J9327J19179k15132J90659J89041D40217K94950p2421
$$ 442971 566180 623586 642913 762092 546960 737619 926660 440217 735167 662746
10957F62746J87735J40203K5787m7475J72476l04366K4954M87391P4866J19424
$$ 662746 850481 990684 1016471 968996 1141472 837106 862060 1349451 1424317 1543741
10947A543741Q2678K48412N4269j76806P83252m3783p3567L38270p25881l41002
$$ 1543741 1626419 1874831 1929100 1752294 2535546 2491763 2418196 2756466 2030585 1689583
10937A689583J69701n53318l68645N36365K35170p608k54617J43117Q3267j66899
$$ 1689583 1859284 1305966 937321 1473686 1708856 1701248 1446631 1589748 1673015 1506116
10927A506116k34150J80522k83089k21776k5401j41053l18209K09092l1203C02385
$$ 1506116 1271966 1452488 1169399 947623 922222 781169 462960 672052 640849 302385
10916C99516j00624J6875m6137E1399L65297G2796c4430B40350n57D2811d5546
$$ 399516 298892 315767 269630 51399 416696 72796 -34430 240350 239793 42811 -45546
10904A90111c03161a3286A2507R4651a50886M5044L489p3911d953r4004B5240
$$ 190111 -303161 -13286 12507 107158 -150886 -105842 -102353 -176264 -4953 -98957 25240
10892b16941B68826A11846L6677R7912r3243A7094P4458a19987A31045J087a6857
$$ -216941 268826 111846 148523 246435 153192 17094 91552 -119987 131045 132132 -16857
10880G4663A5773a88716B46318a32211F3818L0535D6464k1468J00111L1535h5753
$$ 74663 15773 -188716 246318 -132211 63818 94353 46464 24996 125107 156642 -85753
10868d9702A65095c5199j22045A37906a37601c7775k5137M893l09019A05182L1398
$$ -49702 165095 -35199 -157244 137906 -137601 -37775 -62912 -58019 -367038 105182 136580
10857A36580a38250A7838J9459O937f0355j91394I4684a4618r1021A15467e2217
$$ 136580 -138250 17838 37297 44234 -60355 -251749 94684 -14618 -105639 115467 -52217
10845c0758a1115j79670A45370f9309E1761K62328D8897A9363J21703c32960g6265
$$ -30758 -11115 -190785 145370 -69309 51761 314089 48897 19363 141066 -332960 -76265
10833d5664l4023F8957J48943L3256b15509I4006Q89f8623j74554A55485c599
$$ -45664 -79687 68957 217900 251156 -215509 94006 94895 -68623 -243177 155485 -3599
10821G9874J89475G5003d140l8218k40l01904B87364a16923K3386G1762a72672
$$ 79874 269349 75003 -4140 -42358 -42598 -344502 287364 -116923 -93537 71762 -172672
10809c0533n8482M1369H4960a40731M7431j81003a4002B2868N339L7225k1490
$$ -30533 -89015 -47646 84960 -140731 -93300 -274303 -14002 22868 28207 65432 43942
10798D3942G928M84946a35705r3245q670M7818h1591j21708A04598a71738A46620
$$ 43942 7928 492874 -135705 -228950 -237620 -189802 -81591 -203299 104598 -171738 146620
10786A41426b41569J20375k30121C5604b27937a9905F851M7302m093c5500k8696
$$ 141426 -241569 -121194 -351315 35604 -227937 -19905 6851 54153 50060 -35500 -64196
10775f4196j55450i8263b1599a0170A97543C0174L47920b9348G6317l3593a49639
$$ -64196 -219646 -98263 -21599 -10170 197543 30174 378094 -29348 76317 42724 -149639
10763c0386j49666A51513h0945H3391a51761B96554H5786J68452a16836C8698
$$ -30386 -180052 151513 -80945 83391 -151761 296554 85786 254238 -116836 38698
10752B3291a35977p6297j47983d2926j01104l9137A69388C7037a07885j03469
$$ 23291 -135977 -212274 -360257 -42926 -144030 -183167 169388 37037 -107885 -211354
10742b11354I5505d92224g5363k7539A10612D2844A3795b83996i4143M6192B6339
$$ -211354 95505 -492224 -75363 -102902 110612 42844 13795 -283996 -94143 -47951 26339
10730d1015a9071n3277r7387e2912A61847b46344f3248o5686h219A72400a38745
$$ -41015 -19071 -72348 -169735 -52912 161847 -246344 -63248 -128934 -8219 172400 -138745
10718D2766b29014g8691A42057l6988a36904D791b8149k10950J4242L6672j33793
$$ 42766 -229014 -78691 142057 105069 -136904 4791 -28149 -239099 -224857 -188185 -321978
10707c21978m8145a27135O263o9584J9570D2387a62104K6741n1565D1626a91582
$$ -321978 -370123 -127135 -120872 -190456 -170886 42387 -162104 -135363 -186928 41626 -191582
10695C8223J09099J8694a16869G1049g5741j4427k27444N8364N7625D4951a22145
$$ 38223 147322 166016 -116869 71049 -75741 -90168 -317612 -259248 -201623 44951 -122145
10683H7610N5855c4513a0876D6680b78814a09802A4065O9924b75419e7312a561
$$ 87610 143465 -34513 -10876 46680 -278814 -109802 14065 83989 -275419 -57312 -1561
10671A8220K21663n8911f4412j67657B3687K181b25446C0682J64381b89777C682
$$ 18220 239883 180972 -64412 -232069 23687 25868 -225446 30682 195063 -289777 3682
10659d3879o3309b4802F4583g9365p4559b804C2558R8136h8626B34427a69290
$$ -43879 -107188 -24802 64583 -79365 -153924 -2804 32558 130694 -88626 234427 -169290
10647F6157a49935B32767A08642C7067J84812c08251G5873A1971h9929A75764
$$ 66157 -149935 232767 108642 37067 221879 -308251 75873 11971 -89929 175764
10636A89236c40244J59018M5122k23251a2884j80850Q3331r7008A922i9421K487
$$ 189236 -340244 -181226 -136104 -359355 -12884 -193734 -110403 -207411 1922 -99421 -96934
10625i6934q5042Q761j92183a15357J1441A22544a29994A0612a78669L5651C4253
$$ -96934 -181976 -173215 -365398 -115357 -103916 122544 -129994 10612 -178669 -143018 34253
10613F2726e3448b2688k61698A7026d8770j45744B53176a53761j27314h1934A62883
$$ 62726 -53448 -22688 -284386 17026 -48770 -194514 253176 -153761 -281075 -81934 162883
10601a19956i685B21726a62401o1477I0115M4703k7399L2071l3585a86404C5689
$$ -119956 -9685 221726 -162401 -223878 90115 134818 107419 139490 105905 -186404 35689
10589a44407B87848a23616N0240B33516A11553a01491D2439a29179G5050b3005
$$ -144407 287848 -123616 -73376 233516 111553 -101491 42439 -129179 75050 -23005
10578E3764j4986a07442B29044b6081j43544p2803b9477n7159A27064Q299b31203
$$ 53764 38778 -107442 229044 -26081 -169625 -242428 -29477 -86636 127064 135363 -231203
10566A03048G489N4833i5749J832j60765C159K02418a12311B57917c84072A29922
$$ 103048 7489 62322 -95749 -93917 -254682 3159 205577 -112311 257917 -384072 129922
10554h9971l6663A42651h6217A87593c5441j29289A55220K92a533j6394p1157
$$ -89971 -126634 142651 -86217 187593 -35441 -164730 155220 155512 -1533 -17927 -89084
10543h9084m31176K35262J21309N9564k3394j07815A05286b1327A37462a31402
$$ -89084 -520260 -284998 -163689 -104125 -127519 -235334 105286 -21327 137462 -131402
10532A27603d3834A9768a03302m90172A40339R6671d2604A58330a81143I8423
$$ 127603 -43834 19768 -103302 -593474 140339 237010 -42604 158330 -181143 98423
10521A4081O8851b10169a7478m0280K5340j81420b7151j89484B40431c56566B83035
$$ 14081 82932 -210169 -17478 -57758 -32418 -213838 -27151 -216635 240431 -356566 283035
10509A78667b93910a45499b0823F0232a80175D0553b4933j55840C4369c07712
$$ 178667 -293910 -145499 -20823 60232 -180175 40553 -24933 -180773 34369 -307712
10498c72758A65070a1675j24820A82438I1070l5961a4650k03195e6517j03007
$$ -372758 165070 -11675 -136495 182438 91070 55109 -14650 -217845 -56517 -159524
10488a59524j64687B99699J00178E8245b3408H424g2945A6866a1028l9301j85603
$$ -159524 -324211 299699 399877 58245 -23408 8424 -72945 16866 -11028 -50329 -235932
10477b35932C5798b9607o9648D6832b10653b1214j98005a00361n3310E0280b70382
$$ -235932 35798 -29607 -99255 46832 -210653 -21214 -219219 -100361 -153671 50280 -270382
10465A25818A0547Q9103b47788A6402e4739E9863j3489P7071R0441R9490b3198
$$ 125818 10547 99650 -247788 16402 -54739 59863 46374 123445 213886 313376 -23198
10453G6867K45557j22190R4919M1454K17704k67461a60308j52154R5787A18685
$$ 76867 322424 200234 295153 336607 554311 286850 -160308 -312462 -216675 118685
10442A34151B7886J30671h6754A99365r2844l6406d40342a06076C9140a75987
$$ 134151 27886 158557 -86754 199365 106521 70115 -440342 -106076 39140 -175987
10431a1126A98186b22k82346A57610b45411a7827n2295B05554p1359l4007b38794
$$ -11126 198186 -222 -282568 157610 -245411 -17827 -70122 205554 134195 100188 -238794
10419C5946J2118a82763O0258k6690r7119c6801l5736G4877a34057k119j28746
$$ 35946 48064 -182763 -122505 -149195 -246314 -36801 -72537 74877 -134057 -136176 -264922
10408b64922g2101c1420j17370A93168e7026A93596B3985r004a56748B05628h2184
$$ -264922 -72101 -31420 -148790 193168 -57026 193596 23985 14981 -156748 205628 -82184
10396B30188h4365l5930K8984D0759I543J62552a0477D39513b20013A0220a9357
$$ 230188 -84365 -120295 -91311 40759 9543 172095 -10477 439513 -220013 10220 -19357
10384g1132A18202a21073B11652N2492m3501i6628A90865c12077A39308j4803
$$ -71132 118202 -121073 211652 264144 220643 -96628 190865 -312077 139308 124505
10374A24505m1220c01074h8591C4677B345q40N7037J5571c2063A38529K00732
$$ 124505 83285 -301074 -88591 34677 2345 1505 58542 74113 -32063 138529 339261
10363C39261F8288a07322C65562l8620O0410A35109a70024B59770a2809A06730
$$ 339261 68288 -107322 365562 326942 387352 135109 -170024 259770 -12809 106730
10352D0120c5370J3538D44355A33078J05199C8080L62291j03983J8217a0811D60715
$$ 40120 -35370 -21832 444355 133078 238277 38080 400371 296388 314605 -10811 460715
10340E29504A35949K81120j27722K39518k0079A76249L77013A58849J92848A57335
$$ 529504 135949 417069 289347 528865 508786 176249 553262 158849 351697 157335
10329e707n6279B0244R6281Q9197J43519J62656r5306H7430L8492J90020H1253
$$ -5707 -61986 20244 116525 205722 349241 511897 416591 87430 125922 315942 81253
10317B25287J08l5983K68906A90492H3580M8252O7151I4759p039f4275H6425F328
$$ 225287 225395 189412 458318 190492 83580 131832 198983 94759 87720 -64275 86425 6328
10304A23119i2812B4115J94951a39653j29494A10166b28766I8265B8457f2409
$$ 123119 -92812 24115 219066 -139653 -269147 110166 -228766 98265 28457 -62409
10293B26384K9657r8946J71806J31279e7672B40643A0842R9170A9402b54921C2718
$$ 226384 256041 157095 328901 460180 -57672 240643 10842 110012 19402 -254921 32718
10281F3757J68229c3283B00840k9078B0989b63503P0935c5472H2832P5515a48416
$$ 63757 231986 -33283 200840 171762 20989 -263503 -192568 -35472 82832 158347 -148416
10269A83238i5990M5345A04756J07562b23595C11618g8453A44741d9164k22880
$$ 183238 -95990 -50645 104756 212318 -223595 311618 -78453 144741 -49164 -272044
10259b72044i6004f152A55559A8492a57195L2887G5741b86425P8128A18079J13564
$$ -272044 -96004 -6152 155559 18492 -157195 -124308 75741 -286425 -208297 118079 231643
10248B31643a77934B8048J48098a86377Q6735N718B28676p9776m56a9045m7604
$$ 231643 -177934 28048 176146 -186377 -99642 -93924 228676 148900 148444 -19045 -66649
10237f6649B00562C57a81234C69002C7806L23430h2446B89969f6366f792A07350
$$ -66649 200562 357 -181234 369002 37806 361236 -82446 289969 -66366 -6792 107350
10225B54218D5488J24886K61526a51297P609L5937I9902a84621q851k49991b17883
$$ 254218 45488 170374 431900 -151297 -143688 -107751 99902 -184621 -193472 -443463 -217883
10213E5262A8560c80362B36493n1193J3663d8115j05738P2726b6759A48387F3621
$$ 55262 18560 -380362 236493 185300 198963 -48115 -153853 -81127 -26759 148387 63621
10201a45822e3037J6975l736k04066e4014l0795m9537H3629F545L15136c17828
$$ -145822 -53037 -36062 -39798 -243864 -54014 -84809 -134346 83629 6545 321681 -317828
10189i3319b7222O479j24530j05008i5093j73090J06330p8512J00449c2198A12606
$$ -93319 -27222 -20743 -145273 -250281 -95093 -268183 -161853 -240365 -139916 -32198 112606
10177c5089j56i532k31901r0066e3192k3353J6782G7321d29344g9041c5867C48956
$$ -35089 -35245 -9532 -241433 -331499 -53192 -76545 -59763 77321 -429344 -79041 -35867 348956
10164c0243D1529J39775K9697a0684I4934a80733A70438a12514A4435b77241a06638
$$ -30243 41529 181304 211001 -10684 94934 -180733 170438 -112514 14435 -277241 -106638
10152A13648m8831b69158Q3304I4207c22896c9953C2724a04800c5041k9964j24978
$$ 113648 64817 -269158 -185854 94207 -322896 -39953 32724 -104800 -35041 -65005 -189983
10141a89983k07128D5539c1151k7900j0054l62281d5125F1006d05062a88386K9410
$$ -189983 -397111 45539 -31151 -59051 -69105 -431386 -45125 61006 -405062 -188386 -158976
10130a58976r8593a1279r3147F1796N7646D7275a02980o4416P4980c4111E3251
$$ -158976 -257569 -11279 -104426 61796 119442 47275 -102980 -167396 -92416 -34111 53251
10118b0091n845l77663i0761o8980R78j31790i387H771a21397j50320b8219A0883
$$ -20091 -25936 -403599 -90761 -159741 -158763 -290553 -9387 8771 -121397 -271717 -28219 10883
10105B40858e4648A07591c7553j55223n7858B39704o3157i6006K8840n5180G1995
$$ 240858 -54648 107591 -37553 -192776 -250634 239704 176547 -96006 -67166 -122346 71995
10093a34016C38830c14704e559r7659f234I3904b16831m6546R5084L4839r3660
$$ -134016 338830 -314704 -5559 -103218 -6234 93904 -216831 -263377 -168293 -133454 -227114
10082b27114a08945j05264A28885B9104a10476E9284A9258a77974A15638a45541
$$ -227114 -108945 -214209 128885 29104 -110476 59284 19258 -177974 115638 -145541
10071a36769j13584A46379i0313l8078B86621b04593L0668l2391A01136b60974
$$ -136769 -250353 146379 -90313 -128391 286621 -204593 -173925 -206316 101136 -260974
10060C908b53000J22001N07m2835d6590A13976a05947k5791o373j06741J13340
$$ 3908 -253000 -130999 -130492 -173327 -46590 113976 -105947 -131738 -138111 -244852 -131512
10049a31512k21457J36155a05922r1586A96916G700K929b69126I8951e831j02025
$$ -131512 -352969 -216814 -105922 -197508 196916 7700 10629 -269126 98951 -5831 -107856
10038a07856l9784D9666c44519E4228J72554a33328A06636a0543j10977A09397
$$ -107856 -147640 49666 -344519 54228 226782 -133328 106636 -10543 -121520 109397
10027B3122a71677d8094H9001a8151j51201p9540e1773A88610F8211a89505A89181
$$ 23122 -171677 -48094 89001 -18151 -169352 -248892 -51773 188610 68211 -189505 189181
10015a79982B02654f6241D1793d42606a12425F2249h1728r1C14988j48810A2145
$$ -179982 202654 -66241 41793 -442606 -112425 62249 -81728 -81819 314988 166178 12145
10003C40144C7340l859b03336A98525d21455K01569B44593A21372e902l05575
$$ 340144 37340 33481 -203336 198525 -421455 -219886 244593 121372 -5902 -311477
9993c11477M2136A88670a43178N2957M04B35848d2429o1492N0956j01441A31436
$$ -311477 -269341 188670 -143178 -90221 -89817 235848 -42429 -103921 -52965 -154406 131436
9981i6610A1065a40121A96132R4543I6676e9646p1657L6325L7424r5893e1347
$$ -96610 11065 -140121 196132 290675 96676 -59646 -131303 -94978 -57554 -153447 -51347
9969b17714F1243J24547b73300P8463g7968k58051J47086p611A30518c811o2035
$$ -217714 61243 185790 -273300 -194837 -77968 -336019 -188933 -196544 130518 -3811 -65846
9958f5846K3624j02777M3887f595l54757f7195G5515J27986d573k54781L4482
$$ -65846 -42222 -144999 -101112 -6595 -361352 -67195 75515 203501 -4573 -259354 -224872
9947b24872M3000G9123b25675C7566K66546e4684m8593k16006h122l39906c9032
$$ -224872 -181872 79123 -225675 37566 304112 -54684 -103277 -319283 -8122 -348028 -39032
9935d54267J23463e7013C8547g493j67761o4807q4946N9730o0201J24935Q0893
$$ -454267 -330804 -57013 38547 -7493 -175254 -240061 -325007 -265277 -325478 -200543 -119650
9924a19650B54489a02601H4232K16058c22157J29120Q8318G8149q001d3736k13066
$$ -119650 254489 -102601 84232 300290 -322157 -193037 -104719 78149 70148 -43736 -256802
9913b56802J24704a7384j05400E68303i349B7080K342b83094I9992J30476b88802
$$ -256802 -132098 -17384 -122784 568303 -9349 27080 29422 -283094 99992 230468 -288802
9901a9206H1625h8048k89366b976A6807g2955b8244m8890B34733a67953n1439
$$ -19206 81625 -88048 -377414 -2976 16807 -72955 -28244 -77134 234733 -167953 -219392
9890b19392P4281p9729k39165C33494A0764b4187o4083a7513l57743e2867j14767
$$ -219392 -145111 -224840 -464005 333494 10764 -24187 -88270 -17513 -375256 -52867 -167634
9879a67634N5813L7889j9488k41467e8304p005j71473B47086d2601A4037b37070
$$ -167634 -111821 -73932 -93420 -334887 -58304 -65309 -236782 247086 -42601 14037 -237070
9867A21603K15253p3162b02489j70851d2252k53396J18209A47110b68082B29720
$$ 121603 336856 263694 -202489 -373340 -42252 -295648 -177439 147110 -268082 229720
9856b75006k8862a18397p9407B7250h07n1566p7128D18382b04670A79185a78227
$$ -275006 -303868 -118397 -197804 27250 -807 -52373 -129501 418382 -204670 179185 -178227
9844A48836b12180L3588f7468A99720a93823I65K7912j599c31002G3210D923c33737
$$ 148836 -212180 -178592 -67468 199720 -193823 965 28877 27278 -331002 73210 4923 -333737
9831a67327A348e4586A11420D6757P6277J19678A18795b03874Q1969k23994H4578
$$ -167327 1348 -54586 111420 46757 123034 242712 118795 -203874 -121905 -345899 84578
9819A92098f0205n8433R289o0497B43650a1530B7248K11842c25344c6360A02259
$$ 192098 -60205 -118638 -109349 -169846 243650 -11530 27248 239090 -325344 -36360 102259
9807F7565a32584q1319e2965C24841b51826a04181j47400B0758M835L4698b86280
$$ 67565 -132584 -213903 -52965 324841 -251826 -104181 -251581 20758 25593 60291 -286280
9795A4363f23275K02570J45444a1408A02723a65644M4729j06288B65889j12555
$$ 14363 -623275 -420705 -275261 -11408 102723 -165644 -120915 -227203 265889 153334
9785A53334M8640b26559N5230A25092a93059k50645B11146b5662k14148o595B4082
$$ 153334 201974 -226559 -171329 125092 -193059 -443704 211146 -25662 -239810 -246405 24082
9773C2635b7166j94982F7497b943j34211m2568B9615J62379E874c40119i3141
$$ 32635 -27166 -222148 67497 -2943 -137154 -179722 29615 191994 5874 -340119 -93141
9761c36625a06059a2154n6921A750h3260J0720A17918i5257d4114A05467c81523
$$ -336625 -106059 -12154 -69075 1750 -83260 -72540 117918 -95257 -44114 105467 -381523
9749e0564E678J45377J0359B6672a72495E0459g3648J4443j03455N0866q7137
$$ -50564 5678 151055 161414 26672 -172495 50459 -73648 -59205 -162660 -111794 -198931
9738a98931K4752h4361f787k7900k26185N130a1227A22208O3923R2669j28738
$$ -198931 -174179 -84361 -6787 -34687 -260872 -255742 -11227 122208 186131 278800 150062
9727A50062f8190n2202k12792A24451d4115k85330A21080b04268A00848e496p1721
$$ 150062 -68190 -120392 -333184 124451 -44115 -329445 121080 -204268 100848 -5496 -77217
9716g7217p3224A71615h6693K1928k49823M6931f0400j56130j5679g2886k32368
$$ -77217 -150441 171615 -86693 -64765 -314588 -267657 -60400 -216530 -232209 -72886 -305254
9705c05254a01509j71031D51739f0571A5110a88847h4936l17873J55918f6637
$$ -305254 -101509 -272540 451739 -60571 15110 -188847 -84936 -402809 -246891 -66637
9694A42898g8587B8842a45114N0825n2509J7244l5910H7718p388f5404j34642
$$ 142898 -78587 28842 -145114 -94289 -146798 -129554 -165464 87718 80330 -65404 -200046
9683b00046c5910j18174J6096k17665A79481b08939A54672a87991B70947a32689
$$ -200046 -35910 -154084 -137988 -355653 179481 -208939 154672 -187991 270947 -132689
9672E5402c05661R0479R4915k3908O2123j29111D0865j9971a80906L8432A17904
$$ 55402 -305661 -215182 -120267 -144175 -82052 -211163 40865 20894 -180906 -142474 117904
9660h8962F1434P0507m1745b22525A83334g5009C7021O0206B4323R8404J12525
$$ -88962 61434 131941 90196 -222525 183334 -75009 37021 97227 24323 122727 235252
9649B35252a6690J208l15101i0104k5930h108i56m0202A4098J33592e2449F9565
$$ 235252 -16690 -15482 -330583 -90104 -116034 -8108 -956 -41158 14098 147690 -52449 69565
9636B93120c24493P2159A88000b0236q7787A27143a90055d0197k64935A47847
$$ 293120 -324493 -252334 188000 -20236 -108023 127143 -190055 -40197 -305132 147847
9625b00835D55520a55455A62257d1196q5722p9643K2404G7743a32861b8637A99436
$$ -200835 455520 -155455 162257 -41196 -126918 -206561 -184157 77743 -132861 -28637 199436
9613b50706J01491i339k95421B7186a22778D2166a848m1427j50252H3374L5960
$$ -250706 -149215 -9339 -304760 27186 -122778 42166 -1848 -43275 -193527 83374 119334
9602A19334a26195c0875k22444J21294e1117j75894c7803o1565F9039L0139c85710
$$ 119334 -126195 -30875 -253319 -132025 -51117 -227011 -37803 -99368 69039 99178 -385710
9590a84661F1977P8888a47206N7922j96123h4289c9290j98541c8894m8901A9221
$$ -184661 61977 140865 -147206 -89284 -285407 -84289 -39290 -237831 -38894 -87795 19221
9578c91601i0354K5851l05300F4449c27873g3191m8940l9298P7986L9271H8212
$$ -391601 -90354 -64503 -369803 64449 -327873 -73191 -122131 -161429 -83443 -44172 88212
9566c01134A201L38539d83771A3647J09287d2214C6997c6974k10062B7137J20139
$$ -301134 1201 339740 -483771 13647 122934 -42214 36997 -36974 -247036 27137 147276
9555A47276a15982o6562c1345l0970J15A80736a07735b6937l46064A73033f8124
$$ 147276 -115982 -182544 -31345 -62315 -62200 180736 -107735 -26937 -373001 173033 -68124
9543a06707A05336a96969D9170M1669c18365d6035A81612a17513B5513L0382J09237
$$ -106707 105336 -196969 49170 90839 -318365 -46035 181612 -117513 25513 55895 165132
9532A65132B9371P061e6406j95219p0240q202J32296l6162A65604M777L482a14956
$$ 165132 29371 36432 -56406 -251625 -321865 -330067 -197771 -233933 165604 170381 173863 -114956
9519E3984J07378l3814f2982j68813D054a98680d3483a3605j28022a2044B90851
$$ 53984 161362 127548 -62982 -231795 4054 -198680 -43483 -13605 -141627 -12044 290851
9507h8637A03550k5413K16112A33291c83926a09290B0332c17833A13162b61701
$$ -88637 103550 78137 294249 133291 -383926 -109290 20332 -317833 113162 -261701
9496b5023m30990a02148J0424A5601g9400M432q3774N7402j60401l2717e3881
$$ -25023 -456013 -102148 -91724 15601 -79400 -74968 -158742 -101340 -261741 -294458 -53881
9484B05397j2659I878e02446C3179e1851A01501b22922b9590I0435e1100j94191
$$ 205397 192738 9878 -502446 33179 -51851 101501 -222922 -29590 90435 -51100 -245291
9473b45291c267j29901I037i7869F7698i390r9612A8715g5375J3283k61658J34960
$$ -245291 -3267 -133168 9037 -97869 67698 -9390 -109002 18715 -75375 -62092 -323750 -188790
9461a88790j0276H5726a94342A29455i703m523A6859a30940j43534A1067O8180
$$ -188790 -199066 85726 -194342 129455 -9703 -14226 16859 -130940 -274474 11067 79247
9450G9247c12560B72228A35521J23803b7227A89851P5886c7003A63319a236D00699
$$ 79247 -312560 272228 135521 259324 -27227 189851 265737 -37003 163319 -1236 400699
9438I8453c7109k85801D3316a90134f5123j34845b82l09436M2284H9633b09981
$$ 98453 -37109 -322910 43316 -190134 -65123 -199968 -282 -309718 -267434 89633 -209981
9426A24929a05113C7550a89119A60992a18708j87410B5767P8327B089K03646M9179
$$ 124929 -105113 37550 -189119 160992 -118708 -306118 25767 104094 2089 205735 254914
9415B54914b8334E8352c50892J56985o3459C1511a30062K0110l0584C44834c25361
$$ 254914 -28334 58352 -350892 -193907 -257366 31511 -130062 -109952 -140536 344834 -325361
9403b6803j64957k6769A13618O6502b81345a04011L5741j89685b7375m62779J54555
$$ -26803 -191760 -218529 113618 180120 -281345 -104011 -68270 -257955 -27375 -490154 -335599
9392c35599c1575E2642L7647N8760D2057a38600o7760a9492C82902a42618H5635
$$ -335599 -31575 52642 90289 149049 42057 -138600 -206360 -19492 382902 -142618 85635
9380E6628O3672a32057n6272H4255a68397n7197j54543i699n33667B00974a57278
$$ 56628 120300 -132057 -188329 84255 -168397 -225594 -380137 -9699 -543366 200974 -157278
9368b54471K8507H8731J34307a6320E9262g6958p4489N0987a3078l1684A44037
$$ -254471 -225964 88731 223038 -16320 59262 -76958 -151447 -100460 -13078 -44762 144037
9356A05160f1510J9157n9117m6635B30405A8997a5373F4562c06246g6235H7332
$$ 105160 -61510 -42353 -101470 -148105 230405 18997 -15373 64562 -306246 -76235 87332
9344A85795b84193A0468R0849d4340B4962a12799d1329j43960e6021C72946a60892
$$ 185795 -284193 10468 101317 -44340 24962 -112799 -41329 -185289 -56021 372946 -160892
9332a22715c828p3924D5905a06725r5719A80304d00017A69926h0061a2155r5455
$$ -122715 -3828 -77752 45905 -106725 -202444 180304 -400017 169926 -80061 -12155 -107610
9321a07610J3991L3365k02215g7420k6581c6339B12645p1981j15b6556P255l86815
$$ -107610 -93619 -60254 -262469 -77420 -104001 -36339 212645 140664 140549 -26556 -19301 -406116
9309d06116R0466L8862j21491B25107b8480k87937i3472j94814f5516A92192b5632
$$ -406116 -315650 -276788 -398279 225107 -28480 -316417 -93472 -288286 -65516 192192 -25632
9297c13441H6554a98857D3465b63531A60688a92902Q3555j5259M846j75388a43163
$$ -313441 86554 -198857 43465 -263531 160688 -192902 -109347 -124606 -119760 -295148 -143163
9285c65460A74295F3452b66380M6130f5924A28260m7934a1790l53008a30761j10887
$$ -365460 174295 63452 -266380 -220250 -65924 128260 80326 -11790 -364798 -130761 -241648
9274b41648f4437J9019B22203m9244E4567b36755g7034A58739d8174l18311J8549
$$ -241648 -64437 -45418 222203 172959 54567 -236755 -77034 158739 -48174 -366485 -347936
9263c47936A13424l1725C4950K40784b47248D8805A7760J9186J79525a29234j13123
$$ -347936 113424 81699 34950 275734 -247248 48805 17760 36946 216471 -129234 -242357
9252b42357d2739B30281j13183a84241O3859K4120a7730m3094k80440a02903j37173
$$ -242357 -42739 230281 117098 -184241 -120382 -96262 -17730 -60824 -341264 -102903 -240076
9241b40076A1915a33333d214o9615E101g4813b4914o73487i3477m1880N5547B24171
$$ -240076 11915 -133333 -4214 -73829 5101 -74813 -24914 -698401 -93477 -135357 -79810 224171
9228e515j11634A37800a94325j28172D6041a67430A17767e4470B88377a64410
$$ -5515 -117149 137800 -194325 -322497 46041 -167430 117767 -54470 288377 -164410
9217A53339b4216k06233G9571K61962i6534r1653l7591M5743C9208j1661b11293
$$ 153339 -24216 -230449 79571 341533 -96534 -188187 -225778 -180035 39208 27547 -211293
9205b5490I8007i9993I8002a88143l8982a08526K6739j10896F1680b38208g9373
$$ -25490 98007 -99993 98002 -188143 -227125 -108526 -81787 -192683 61680 -238208 -79373
9193A29834a95076a9847A65802H449J66859c0230F0056b20711g3574n3889K1869
$$ 129834 -195076 -19847 165802 8449 175308 -30230 60056 -220711 -73574 -127463 -105594
9182a05594E9564g0515j28808D1641J9643h330n8242F8545k0055h1681H2288A7762
$$ -105594 59564 -70515 -199323 41641 61284 -8330 -66572 68545 48490 -81681 82288 17762
9169b32028K9931A14523b10500C52305A20815e11515i0494O582J9675j8953o4691
$$ -232028 -202097 114523 -210500 352305 120815 -511515 -90494 -83912 -64237 -83190 -147881
9158a47881A00003A9344b30776f3326j8948l2401k1982D5354c26303e8795a3355
$$ -147881 100003 19344 -230776 -63326 -82274 -114675 -136657 45354 -326303 -58795 -13355
9146H7396b90012L6290q4756g7547k40853B97802e7020j29159l58391b26645A23465
$$ 87396 -290012 -253722 -338478 -77547 -318400 297802 -57020 -186179 -544570 -226645 123465
9134g7711E2839i4411j9375G3824j924O35a49795b7364A56483b25848D1307a54166
$$ -77711 52839 -94411 -113786 73824 71900 72535 -149795 -27364 156483 -225848 41307 -154166
9121a88852j04565A79073O0011A02828O5301d0815j00672f8422B23494H1028J1040
$$ -188852 -293417 179073 239084 102828 168129 -40815 -141487 -68422 223494 81028 92068
9110I2068J02123G795a37290C1013a78746e2582j42715M2929k50968f6090j24434
$$ 92068 194191 7795 -137290 31013 -178746 -52582 -195297 -152368 -403336 -66090 -190524
9099a90524I3886c0357o8323j30958P2490g8468c7309G6357b10617q5979J26736
$$ -190524 93886 -30357 -98680 -229638 -157148 -78468 -37309 76357 -210617 -296596 -169860
9088a69860b1177A33962R5853f0964j37444C54014g896k99903c3928r5059B8733
$$ -169860 -21177 133962 229815 -60964 -198408 354014 -7896 -307799 -33928 -128987 28733
9076c0577p2785j26085I6766a3860k21572A15059a00235A96953g6933C8563a34410
$$ -30577 -103362 -229447 96766 -13860 -235432 115059 -100235 196953 -76933 38563 -134410
9064a23218H8548f0175j28044A29498J27891f1982B12360a45638j06500k1478
$$ -123218 88548 -60175 -188219 129498 257389 -61982 212360 -145638 -252138 -273616
9054b73616C2715c58619J22907g7561j48172l9973A54180a63216j9416B51136
$$ -273616 32715 -358619 -235712 -77561 -225733 -265706 154180 -163216 -182632 251136
9043d59558a03378J7791B51614b6751k40836j566i4196j9972B88332F0705a52239
$$ -459558 -103378 -85587 251614 -26751 -267587 -269153 -94196 -114168 288332 60705 -152239
9031F6121g9174A13156P4029a4964B9415a96868H3904a06267G6941d870k70572
$$ 66121 -79174 113156 187185 -14964 29415 -196868 83904 -106267 76941 -4870 -275442
9020b75442K119A48564b70748R2935m8482j7191A39763o6591a85423l567Q3920
$$ -275442 -273323 148564 -270748 -177813 -226295 -243486 139763 73172 -185423 -188990 -105070
9009a05070J7414D58667b81701a05283j9317J3988A53128e20139a7358j13786
$$ -105070 -87656 458667 -281701 -105283 -124600 -110612 153128 -520139 -17358 -131144
8999a31144b2770P189k46532a30032B50349f6143q5536Q70A65113j6582a46759
$$ -131144 -22770 -15581 -262113 -130032 250349 -66143 -151679 -150809 165113 148531 -146759
8987c1976A45970a03471k97572i0043k7086M8406A37475c8836A3626L24333D0246
$$ -31976 145970 -103471 -401043 -90043 -117129 -68723 137475 -38836 13626 337959 40246
8975e8699l8700b3730l18551C36409b24256M765d4464n4780q1198k60A17305l9778
$$ -58699 -97399 -23730 -342281 336409 -224256 -219491 -44464 -99244 -180442 -180702 117305 77527
8963G7527a96562I869a23685I4683a63152A6058b64752J12132B89314a86305A1837
$$ 77527 -196562 9869 -123685 94683 -163152 16058 -264752 -152620 289314 -186305 11837
8951g7426b4839D5921J80034H2070b164B14960a09072L9736J9769B3333Q9248
$$ -77426 -24839 45921 225955 82070 -2164 214960 -109072 -69336 -49567 23333 112581
8940A12581e749D067a68301B21511A00769a67567I5907d8883q237C1871b09912
$$ 112581 -5749 4067 -168301 221511 100769 -167567 95907 -48883 -57120 31871 -209912
8928a33758i74p1214m3081a2096k92821c4733p8265B55300A17238a95705J7552
$$ -133758 -974 -72188 -115269 -12096 -304917 -34733 -112998 255300 117238 -195705 -178153
8917a78153A05812a37370F9535c08708d261H7717M4724d9765O753k23878D710
$$ -178153 105812 -137370 69535 -308708 -4261 87717 132441 -49765 -43012 -266890 4710
8905a35048B53766f9244F935M5485N5055g5750l71142a73544M5430f1182A49436
$$ -135048 253766 -69244 6935 52420 107475 -75750 -446892 -173544 -128114 -61182 149436
8893A09165b4344j75321B8512b05806O6380I9147A1332g0854A84202c75293g0457
$$ 109165 -24344 -199665 28512 -205806 -139426 99147 11332 -70854 184202 -375293 -70457
8881d5653I9459D9185b22167A88816p6021J03140a9948A88168b2887I1425a79415
$$ -45653 99459 49185 -222167 188816 112795 215935 -19948 188168 -22887 91425 -179415
8869b94992l55813b00161l4369J129F9060a49171q8217A19790m7167L55143c7213
$$ -294992 -650805 -200161 -234530 -233401 69060 -149171 -237388 119790 72623 427766 -37213
8857e2720A20946A2943J44576F0760a59933e4199R406k71970b3041k12883A7258
$$ -52720 120946 12943 157519 60760 -159933 -54199 -44793 -316763 -23041 -235924 17258
8845B2646c50150A67738A6322b23976H6949Q1927b09161M7596e8892F7260M3480
$$ 22646 -350150 167738 16322 -223976 86949 168876 -209161 -161565 -58892 67260 110740
8834A10740a8043b46I6619a09925A22561A4781b0869a7B4505J0125b16642k46239
$$ 110740 -18043 -246 96619 -109925 122561 14781 -20869 -17 24505 34630 -216642 -462881
8822d62881e2167k2466p34j30833A3588O5602G855d9733j8561r8125C7001D818
$$ -462881 -52167 -74633 -75367 -206200 13588 79190 7855 -49733 -68294 -166419 37001 4818
8809a4454k37828e7153D5009a97048B8740a75170F1423F134a65472A0364a54039
$$ -14454 -252282 -57153 45009 -197048 28740 -175170 61423 6134 -165472 10364 -154039
$$ [...]
##END NTUPLES=NMR SPECTRUM
##END=
