##TITLE=AC1525_ROEFFECT0006_8202208_8TdhNIkwTJ
##JCAMPDX= 6.0         $$ Bruker NMR JCAMP-DX V2.0
##DATA TYPE= NMR SPECTRUM
##DATA CLASS= NTUPLES
##ORIGIN= BRUKER
##OWNER= Administrator
$$ 1.72 TOPSPIN		Version 2.1
$$ 2014-07-31 16:45:50.497 -0700  Administrator@X
$$ Compression mode = diff/dup
##.OBSERVE FREQUENCY= 400.02188249412
##.OBSERVE NUCLEUS= ^1H
##.ACQUISITION MODE= SIMULTANEOUS (DQD)
##.ACQUISITION SCHEME= undefined
##.AVERAGES= 64
##.DIGITISER RES= 22
##SPECTROMETER/DATA SYSTEM= spect
##.PULSE SEQUENCE= noesygpps1d.comp
##.SOLVENT NAME= COFFEE_meoh
##.SHIFT REFERENCE= INTERNAL, COFFEE_meoh, 1, 14.97789
##AUDIT TRAIL= $$ (NUMBER, WHEN, WHO, WHERE, PROCESS, VERSION, WHAT)
$$ ##TITLE= Audit trail, TOPSPIN		Version 2.1
$$ ##JCAMPDX= 5.01
$$ ##ORIGIN= Bruker BioSpin GmbH
$$ ##OWNER= Administrator
$$ $$ E:\/data/COFFEE/nmr/AC1525_ROEFFECT0006_8202208_8TdhNIkwTJ/22/pdata/1/auditp.txt
$$ ##AUDIT TRAIL=  $$ (NUMBER, WHEN, WHO, WHERE, PROCESS, VERSION, WHAT)
(   1,<2014-07-31 16:45:45.428 -0700>,<Administrator>,<X>,<go>,<TOPSPIN 2.1>,
      <created by zg
	started at 2014-07-31 16:34:12.374 -0700,
	POWCHK enabled, PULCHK disabled,
       configuration hash MD5:
       16 EA D6 F4 BB 67 03 14 9B FF E7 A0 43 5B 48 2E
       data hash MD5: 64K
       2D 8F 42 F2 20 14 77 77 6D 63 A7 DF D6 B8 79 26>)
(   2,<2014-07-31 16:45:48.582 -0700>,<Administrator>,<X>,<proc1d>,<TOPSPIN 2.1>,
      <Start of raw data processing
       efp LB = 0.3 FT_mod = 6 PKNL = 1 PHC0 = 0 PHC1 = 0 SI = 128K 
       data hash MD5: 128K
       94 47 FD FD E1 9E 1C 84 A9 41 F7 4F 94 98 10 C0>)
(   3,<2014-07-31 16:45:49.486 -0700>,<Administrator>,<X>,<proc1d>,<TOPSPIN 2.1>,
      <pk PHC0 = -84.12231 PHC1 = 0 
       data hash MD5: 128K
       FA 3C 7B 10 53 B4 1B 7D 55 47 EF 34 52 1E 8E F7>)
(   4,<2014-07-31 16:45:49.884 -0700>,<Administrator>,<X>,<proc1d>,<TOPSPIN 2.1>,
      <abs ABSG = 1 
       data hash MD5: 128K
       F0 13 A5 95 5C 67 30 41 D7 8F 63 26 94 15 16 F1>)
(   5,<2014-07-31 16:45:49.976 -0700>,<Administrator>,<X>,<proc1d>,<TOPSPIN 2.1>,
      <abs ABSG = 2 
       data hash MD5: 128K
       63 39 A7 43 0D F3 13 BE 64 A8 90 B9 5D AC F3 D2>)
(   6,<2014-07-31 16:45:50.098 -0700>,<Administrator>,<X>,<proc1d>,<TOPSPIN 2.1>,
      <abs ABSG = 3 
       data hash MD5: 128K
       87 77 F7 4C 7F F9 F9 E3 91 AE 24 16 CA 50 16 89>)
(   7,<2014-07-31 16:45:50.175 -0700>,<Administrator>,<X>,<proc1d>,<TOPSPIN 2.1>,
      <abs ABSG = 4 
       data hash MD5: 128K
       F9 84 6B A3 BE 1F 56 2B 89 8D E2 9E 23 D3 7A 0A>)
(   8,<2014-07-31 16:45:50.282 -0700>,<Administrator>,<X>,<proc1d>,<TOPSPIN 2.1>,
      <abs ABSG = 5 
       data hash MD5: 128K
       D8 2D FA F0 9F EC B3 19 42 6D 8A 87 BA 74 12 F4>)
$$ ##END=
$$ 
$$ $$ hash MD5
$$ $$ 19 B7 14 8D DF 70 E2 2A 0C B9 19 23 DD 03 22 EF
##$RELAX= 
##$RELAX= 
##$RELAX= 
##$RELAX= 
##$RELAX= 
##$RELAX= 
##$RELAX= 
##$RELAX= 
$$ Bruker specific parameters
$$ --------------------------
##$DU= <E:\>
##$EXPNO= 22
$$ [...]
##$TP07= 0
##$TPNAME0= <>
##$TPNAME1= <>
##$TPNAME2= <>
##$TPNAME3= <>
##$TPNAME4= <>
##$TPNAME5= <>
##$TPNAME6= <>
##$TPNAME7= <>
##$TPOAL= (0..7)
0.5 0.5 0.5 0.5 0.5 0.5 0.5 0.5
##$TPOFFS= (0..7)
0 0 0 0 0 0 0 0
##$TUNHIN= 0
##$TUNHOUT= 0
##$TUNXOUT= 0
##$USERA1= <user>
##$USERA2= <user>
##$USERA3= <user>
##$USERA4= <user>
##$USERA5= <user>
##$V9= 5
##$VALIST= <valist>
##$VCLIST= <CCCCCCCCCCCCCCC>
##$VD= 0
##$VDLIST= <DDDDDDDDDDDDDDD>
##$VPLIST= <PPPPPPPPPPPPPPP>
##$VTLIST= <TTTTTTTTTTTTTTT>
##$WBST= 1024
##$WBSW= 4
##$XGAIN= (0..3)
0 0 0 0
##$XL= 0
##$YL= 0
##$YMAX_a= 11590403
##$YMIN_a= -12678412
##$ZGOPTNS= <>
##$ZL1= 120
##$ZL2= 120
##$ZL3= 120
##$ZL4= 120
##$ABSF1= 14.97789
##$ABSF2= -5.580292
##$ABSG= 5
##$ABSL= 3
##$ALPHA= 0
##$AQORDER= 0
##$ASSFAC= 0
##$ASSFACI= 0
##$ASSFACX= 0
##$ASSWID= 0
##$AUNMP= <proc_prof1d_extract.lims>
##$AXLEFT= 0
##$AXNAME= <>
##$AXNUC= <1H>
##$AXRIGHT= 0
##$AXTYPE= 0
##$AXUNIT= <>
##$AZFE= 0.1
##$AZFW= 0.1
##$BCFW= 0
##$BC_mod= 0
##$BYTORDP= 0
##$COROFFS= 0
##$CY= 15
##$DATMOD= 1
##$DC= 0
##$DFILT= <>
##$DTYPP= 0
##$F1P= 0
##$F2P= 0
##$FCOR= 0.5
##$FTSIZE= 131072
##$FT_mod= 6
##$GAMMA= 0
##$GB= 0
##$INTBC= 1
##$INTSCL= 1
##$ISEN= 128
##$LB= 0.3
##$LEV0= 0
##$LPBIN= 0
##$MAXI= 10000
##$MC2= 0
##$MEAN= 0
##$ME_mod= 0
##$MI= 0
##$NCOEF= 0
##$NC_proc= -1
##$NLEV= 6
##$NOISF1= 0
##$NOISF2= 0
##$NSP= 0
##$NTH_PI= 0
##$NZP= 0
##$OFFSET= 14.97789
##$PC= 1
##$PHC0= -84.12231
##$PHC1= 0
##$PH_mod= 1
##$PKNL= yes
##$PPARMOD= 0
##$PPDIAG= 0
##$PPIPTYP= 0
##$PPMPNUM= 2147483647
##$PPRESOL= 1
##$PSCAL= 4
##$PSIGN= 0
##$PYNMP= <proc.py>
##$REVERSE= no
##$SF= 400.020002878763
##$SI= 131072
##$SIGF1= 0
##$SIGF2= 0
##$SINO= 400
##$SIOLD= 131072
##$SPECTYP= <>
##$SREGLST= <1H.CDCl3>
##$SSB= 0
##$STSI= 131072
##$STSR= 0
##$SW_p= 8223.68421052631
##$SYMM= 0
##$S_DEV= 0
##$TDeff= 65536
##$TDoff= 0
##$TI= <>
##$TILT= no
##$TM1= 0
##$TM2= 0
##$TOPLEV= 0
##$USERP1= <user>
##$USERP2= <user>
##$USERP3= <user>
##$USERP4= <user>
##$USERP5= <user>
##$WDW= 1
##$XDIM= 131072
##$YMAX_p= 147699834
##$YMIN_p= -506740799
##$CURPLOT= <Network HP LaserJet P1505>
##$CURPRIN= <$Network HP LaserJet P1505>
##$DFORMAT= <normdp>
##$LAYOUT= <+/1D_H.xwp>
##$LFORMAT= <normlp>
##$PFORMAT= <normpl>
##$SURQMSG= 1
$$ End of Bruker specific parameters
$$ ---------------------------------
##NTUPLES= NMR SPECTRUM
##VAR_NAME=  FREQUENCY,     SPECTRUM/REAL,   SPECTRUM/IMAG
##SYMBOL=    X,             R,               I
##VAR_TYPE=  INDEPENDENT,   DEPENDENT,       DEPENDENT
##VAR_FORM=  AFFN,          ASDF,            ASDF
##VAR_DIM=   131072,        131072,          131072
##UNITS=     HZ,            ARBITRARY UNITS, ARBITRARY UNITS
##FACTOR=    0.0627417313425164, 1,          1
##FIRST=     8223.62146879497, -365,         -16208
##LAST=      0,             609,             -16218
##MIN=       0,             -506740799,      0
##MAX=       8223.62146879497, 147699834,    0
$$ Real data points
##PAGE= N=1
##DATA TABLE= (X++(R..R)), XYDATA
$$ [...]
$$ plain form
62950 415417 432678 451149 470860 491649 513408 536226 560161 585070 610715 636823 663002
62939 663002 688884 714477 740103 765860 791426 816556 841460 866422 891283 915571 938953
62928 938953 961275 982285 1001570 1018601 1032580 1042394 1047052 1046181 1039953 1028695 1012783 992690
62916 992690 968807 941362 910818 878236 844906 811725 779254 748230 719522 693594 670422
62905 670422 650011 632594 618255 606751 597906 591867 588788 588494 590652 595012 601330 609249 618453
62892 618453 628849 640435 653081 666480 680254 694088 707888 721785 735834 749705 762872
62881 762872 775121 786572 797131 806188 812961 816965 818018 815982 810691 802029 789975 774663 756454
62868 756454 735840 713245 689036 663740 638020 612393 587112 562385 538563 516025 495033
$$ packed form
62950D15417J7261J8471J9711K0789K1759K2818K3935K4909K5645K6108K6179
62939F63002K5882K5593K5626K5757K5566K5130K4904K4962K4861K4288K3382
62928I38953K2322K1010J9285J7031J3979R814M658q71o228j1258j5912k0093
62916I92690k3883k7445l0544l2582l3330l3181l2471l1024k8708k5928k3172
62905F70422k0411j7417j4339j1504q845o039l079k94K158M360O318P919R204
62892F18453J0396J1586J2646J3399J3774J3834J3800J3897J4049J3871J3167
62881G62872J2249J1451J0559R057O773M004J053k036n291q662j2054j5312j8209
62868G56454k0614k2595k4209k5296k5720k5627k5281k4727k3822k2538k0992
$$ plain form
62857 495033 475650 457674 440673 424375 409046 395191 382816 371353 360398 350159 340946 332598
62845 332598 324696 317108 309941 303155 296625 290508 285217 280955 277531 274632 272080 269805 267755 265899
62831 265899 264239 262840 261905 261670 262083 262687 263053 263225 263533 263976 264108 263587 262575 261407 260066 258220 255756
62814 255756 253035 250508 248221 245890 243423 241110 239204 237538 235827 234216 233194 232927 232967 232734 232028
62799 232028 230963 229660 228219 226784 225406 223947 222331 220781 219648 219100 219109 219562 220216 220717 220935 221141
62783 221141 221599 222108 222280 222142 222100 222294 222398 222129 221630 221187 220848 220504 220118 219677 219114 218478 218057 218092 218476
62764 218476 218913 219302 219746 220235 220551 220550 220372 220291 220444 220799 221283 221827 222320 222657 222877 223166 223647 224197 224581 224758
62744 224758 224953 225373 225954 226431 226599 226399 225882 225223 224709 224548 224651 224748 224733 224744 224873 224983 224889 224575 224137 223642
$$ packed form
62857D95033j9383j7976j7001j6298j5329j3855j2375j1463j0955j0239r213q348
62845C32598p902p588p167o786o530o117n291m262l424k899k552k275k050j856
62831B65899j660j399r35k35M13O04L66J72L08M43J32n21j012j168j341j846k464
62814B55756k721k527k287k331k467k313j906j666j711j611j022k67M0k33p06
62799B32028j065j303j441j435j378j459j616j550j133n48RM53O54N01K18K06
62783B21141M58N09J72j38m2J94J04k69m99m43l39l44l86m41n63o36m21L5L84
62764B18476M37L89M44M89L16jj78q1J53L55M84N44M93L37K20K89M81N50L84J77
62744B24758J95M20N81M77J68k00n17o59n14j61J03R7j5J1J29J10r4l14m38m95
$$ plain form
62724 223642 223258 223361 224266 225842 227602 229202 230689 232200 233681 235058 236493 238240 240294 242408 244436
62709 244436 246432 248396 250136 251493 252596 253789 255370 257476 260083 263030 266120 269312 272781 276734
62695 276734 281239 286322 292113 298797 306500 315318 325341 336539 348720 361806 376061 391864 409265
62682 409265 428021 448075 469822 493818 520347 549349 580634 614042 649471 686763 725531
62671 725531 765076 804545 843119 879992 914214 944737 970628 991118 1005520 1013297 1014255 1008465
62659 1008465 996020 977088 952359 923179 891035 856908 821166 784011 745917 707703 670276
62648 670276 634291 600005 567498 536937 508529 482305 458175 436160 416353 398629 382629
62637 382629 368114 355105 343622 333536 324749 317269 310931 305312 300116 295420 291364 287821 284607
$$ packed form
62724B23642l84J03R05J576J760J600J487J511J481J377J435J747K054K114K028
62709B44436J996J964J740J357J103J193J581K106K607K947L090L192L469L953
62695B76734M505N083N791O684P703Q818J0023J1198J2181J3086J4255J5803J7401
62682D09265J8756K0054K1747K3996K6529K9002L1285L3408L5429L7292L8768
62671G25531L9545L9469L8574L6873L4222L0523K5891K0490J4402P777R58n790
62659A008465j2445j8932k4729k9180l2144l4127l5742l7155l8094l8214l7427
62648F70276l5985l4286l2507l0561k8408k6224k4130k2015j9807j7724j6000
62637C82629j4515j3009j1483j0086q787p480o338n619n196m696m056l543l214
$$ plain form
62624 284607 281806 279611 277996 276808 276039 275743 275802 276118 276941 278665 281303 284469 287974 292154 297451 303904
62608 303904 311179 319001 327432 336738 347092 358440 370691 384025 398882 415618 434325 454987
62596 454987 477603 501980 527666 554353 582162 611223 641061 670653 699011 725396 749087
62585 749087 769350 785716 797931 805585 808067 804990 796481 783012 765255 744122 720538 695047
62573 695047 667854 639447 610800 582729 555330 528363 502030 477048 454074 433308 414593
62562 414593 397597 381872 367054 353126 340396 329112 319156 310141 301727 293846 286661 280338 274836
62549 274836 269932 265434 261308 257588 254272 251361 248893 246898 245377 244296 243483 242512 240936 238799 236730
62534 236730 235330 234594 234082 233485 232785 231965 230963 229954 229327 229259 229523 229844 230216 230725 231261 231668 232014 232472
$$ packed form
62624B84607k801k195j615j188p69k96N9L16Q23J724K638L166L505M180N297O453
62608C03904P275P822Q431R306J0354J1348J2251J3334J4857J6736J8707K0662
62596D54987K2616K4377K5686K6687K7809K9061K9838K9592K8358K6385K3691
62585G49087K0263J6366J2215P654K482l077q509j3469j7757k1133k3584k5491
62573F95047k7193k8407k8647k8071k7399k6967k6333k4982k2974k0766j8715
62562D14593j6996j5725j4818j3928j2730j1284r956r015q414p881p185o323n502
62549B74836m904m498m126l720l316k911k468j995j521j081q13r71j576k137k069
62534B36730j400p36n12n97p00q20j002j009o27o8K64L21L72N09N36M07L46M58
$$ plain form
62516 232472 233032 233583 234202 235099 236247 237380 238423 239696 241552 244044 247076 250671 254874 259525 264429
62501 264429 269712 275783 282903 290985 299841 309471 320050 331817 345033 359884 376301 393915 412277
62488 412277 431048 449988 468827 487220 504710 520710 534581 545787 553946 558813 560323 558611
62476 558611 553826 545934 534929 521283 505946 489746 472972 455667 438118 420810 404015 387708
62464 387708 371898 356823 342780 329890 318086 307292 297518 288761 280849 273468 266484 260179 254957
62451 254957 250807 247287 244059 241168 238679 236347 233905 231470 229384 227790 226540 225374 223981 222092
62437 222092 219832 217802 216541 216010 215870 216075 216785 217851 218912 219998 221584 223949 226888 230178 233918
62422 233918 238226 242970 248079 253820 260472 267955 276045 284786 294442 305149 316890 329702 343646
$$ packed form
62516B32472N60N51O19Q97J148J133J043J273J856K492L032L595M203M651M904
62501B64429N283O071P120Q082Q856R630J0579J1767J3216J4851J6417J7614J8362
62488D12277J8771J8940J8839J8393J7490J6000J3871J1206Q159M867J510j712
62476E58611m785p892j1005j3646j5337j6200j6774j7305j7549j7308j6795j6307
62464C87708j5810j5075j4043j2890j1804j0794r774q757p912p381o984o305n222
62451B54957m150l520l228k891k489k332k442k435k086j594j250j166j393j889
62437B22092k260k030j261n31j40K05P10J066J061J086J586K365K939L290L740
62422B33918M308M744N109N741O652P483Q090Q741R656J0707J1741J2812J3944
$$ plain form
62409 343646 358566 374070 389786 405498 421037 436110 450289 463116 474180 483073 489306 492421
62397 492421 492298 489285 483872 476337 466841 455752 443590 430703 417325 403916 391070 379009 367473
62384 367473 356207 345220 334512 323957 313686 304183 295680 287759 279894 272168 265046 258682 252831
62371 252831 247329 242228 237491 232991 228821 225243 222270 219587 216973 214490 212228 210155 208347 207052
62357 207052 206360 206012 205760 205679 205937 206412 206844 207297 208175 209703 211631 213613 215698 218239 221272 224261 226590
62340 226590 228225 229695 231433 233325 234951 236043 236564 236436 235455 233509 230759 227576 224348 221314 218489
62325 218489 215731 212899 209989 207098 204326 201720 199265 196885 194527 192288 190386 188935 187820 186883
62311 186883 186109 185582 185321 185306 185561 186043 186511 186731 186806 187129 187944 189088 190253 191366 192575 193916 195157
$$ packed form
62409C43646J4920J5504J5716J5712J5539J5073J4179J2827J1064Q893O233L115
62397D92421j23l013n413p535r496j1089j2162j2887j3378j3409j2846j2061j1536
62384C67473j1266j0987j0708j0555j0271r503q503p921p865p726p122o364n851
62371B52831n502n101m737m500m170l578k973k683k614k483k262k073j808j295
62357B07052o92l48k52q1K58M75M32M53Q78J528J928J982K085K541L033K989K329
62340B26590J635J470J738J892J626J092N21j28r81j946k750l183l228l034k825
62325B18489k758k832k910k891k772k606k455k380k358k239j902j451j115r37
62311A86883p74n27k61j5K55M82M68K20P5L23Q15J144J165J113J209J341J241
$$ plain form
62294 195157 196059 196730 197640 199210 201433 203943 206437 208899 211425 214033 216732 219628 222742 225766 228281
62279 228281 230227 232005 234028 236339 238707 240991 243275 245735 248559 251963 256150 261197 267045 273663
62265 273663 281206 289937 300011 311374 323865 337397 352025 367869 384969 403125 421807 440279
62253 440279 457872 474129 488673 501098 511137 518900 524731 528804 530969 531057 529162 525500 520136
62240 520136 512958 503913 493154 481058 468170 455103 442321 429980 417990 406249 394801 383821
62228 383821 373466 363688 354188 344633 334936 325274 315850 306729 297951 289665 282019 274999 268460 262284
62214 262284 256451 250996 245959 241381 237351 234056 231697 230264 229439 228883 228573 228676 229103 229474 229597 229698
62198 229698 230031 230501 230902 231307 231959 232882 233859 234737 235514 236184 236730 237212 237641 237792 237400 236605 235954 235869 236272
$$ packed form
62294A95157R02O71R10J570K223K510K494K462K526K608K699K896L114L024K515
62279B28281J946J778K023K311K368K284K284K460K824L404M187N047N848O618
62265B73663P543Q731J0074J1363J2491J3532J4628J5844J7100J8156J8682J8472
62253D40279J7593J6257J4544J2425J0039P763N831M073K165Q8j895l662n364
62240E20136p178r045j0759j2096j2888j3067j2782j2341j1990j1741j1448j0980
62228C83821j0355r778r500r555r697r662r424r121q778q286p646p020o539o176
62214B62284n833n455n037m578m030l295k359j433q25n56l10J03M27L71J23J01
62198B29698L33M70M01M05O52R23R77Q78P77O70N46M82M29J51l92p95o51q5M03
$$ plain form
62179 236272 236811 237303 237880 238774 240106 241821 243783 245911 248271 251032 254381 258490 263495 269481 276520
62164 276520 284773 294454 305671 318368 332493 348077 365089 383338 402600 422674 443200 463544
62152 463544 483029 501129 517307 530827 541003 547585 550771 550946 548603 544297 538386 530805 521318
62139 521318 509901 496730 481986 466046 449743 434029 419354 405739 393407 382922 374583 368127
62127 368127 363195 359759 357873 357348 357921 359470 361765 364230 366282 367787 368913 369617 369532 368309 365867
62112 365867 362320 357889 352820 347261 341201 334649 327838 321093 314562 308183 301889 295762 290049 285132
62098 285132 281359 278753 276937 275526 274569 274482 275534 277509 279875 282145 284140 286022 288157 290865 294174
62083 294174 297774 301195 304077 306396 308446 310496 312456 313970 314913 315703 317076 319682 323916 329936 337605
$$ packed form
62179B36272N39M92N77Q94J332J715J962K128K360K761L349M109N005N986P039
62164B76520Q253R681J1217J2697J4125J5584J7012J8249J9262K0074K0526K0344
62152D63544J9485J8100J6178J3520J0176O582L186J75k343m306n911p581r487
62139E21318j1417j3171j4744j5940j6303j5714j4675j3615j2332j0485q339o456
62127C68127m932l436j886n25N73J549K295K465K052J505J126P04q5j223k442
62112C65867l547m431n069n559o060o552o811o745o531o379o294o127n713m917
62098B85132l773k606j816j411r57q7J052J975K366K270J995J882K135K708L309
62083B94174L600L421K882K319K050K050J960J514R43P90J373K606M234O020P669
$$ plain form
62068 337605 346491 356156 366541 377938 390518 403875 417043 428952 438963 447026 453346 457978
62056 457978 460844 462046 461886 460458 457500 452812 446621 439311 430938 421362 410782 399823 389057 378705
62042 378705 368896 359931 352083 345315 339411 334333 330227 327105 324679 322610 320845 319589 318930 318609 318297
62027 318297 318082 318555 320315 323468 327687 332685 338476 345241 353072 361908 371584 381877 392493 403036
62013 403036 412950 421590 428421 433184 435858 436621 435934 434487 432760 430587 427413 423062 418041 412971 407931
61998 407931 402622 397090 392062 388505 386984 387485 389734 393545 398834 405331 412391 419254 425553 431513
61984 431513 437589 443958 450427 456747 462883 468963 475128 481505 488247 495487 503272 511594 520513 530157
61970 530157 540544 551436 562452 573353 584109 594603 604354 612694 619215 623903 626835 627936 627154
$$ packed form
62068C37605Q886R665J0385J1397J2580J3357J3168J1909J0011Q063O320M632
62056D57978K866J202j60j428k958m688o191p310q373r576j0580j0959j0766j0352
62042C78705r809q965p848o768n904n078m106l122k426k069j765j256o59l21l12
62027C18297k15M73J760L153M219M998N791O765P831Q836R676J0293J0616J0543
62013D03036R914Q640O831M763K674P63o87j447j727k173l174m351n021n070n040
61998D07931n309n532n028l557j521N01K249L811N289O497P060O863O299N960
61984D31513O076O369O469O320O136O080O165O377O742P240P785Q322Q919R644
61970E30157J0387J0892J1016J0901J0756J0494R751Q340O521M688K932J101p82
$$ plain form
61957 627154 624673 620738 615387 608664 601008 593164 585552 577996 570163 562029 553701 545016 535674 525662
61943 525662 515272 504688 493858 482827 471844 460953 449711 437585 424564 411180 397982
61932 397982 385190 372786 360736 349079 337973 327715 318556 310401 302813 295374 288001 280849 274048
61919 274048 267677 261890 256854 252493 248436 244297 239999 235836 232286 229772 228441 228072 228238 228663 229400
61904 229400 230616 232284 234226 236421 239038 242104 245231 247810 249427 250035 249829 249087 248010 246609 244735
61889 244735 242355 239713 237148 234805 232684 230881 229485 228308 226973 225427 224103 223450 223474 223898 224625
61874 224625 225750 227214 228712 230012 231181 232429 233793 235066 235965 236347 236313 236154 236216 236738 237771 239150
61858 239150 240578 241790 242732 243540 244383 245352 246487 247816 249376 251281 253714 256774 260374 264480 269418
$$ packed form
61957F27154k481l935n351o723p656p844p612p556p833q134q328q685r342j0012
61943E25662j0390j0584j0830j1031j0983j0891j1242j2126j3021j3384j3198
61932C97982j2792j2404j2050j1657j1106j0258r159q155p588p439p373p152o801
61919B74048o371n787n036m361m057m139m298m163l550k514j331l69J66M25P37
61904B29400J216J668J942K195K617L066L127K579J617O08k06p42j077j401j874
61889B44735k380k642k565k343k121j803j396j177j335j546j324o53K4M24P27
61874B24625J125J464J498J300J169J248J364J273Q99L82l4j59O2N22J033J379
61858B39150J428J212R42Q08Q43R69J135J329J560J905K433L060L600M106M938
$$ plain form
61843 269418 275657 283241 291671 300453 309510 318934 328606 338354 348259 358473 368796 378732 387968 396549
61829 396549 404626 412208 419172 425352 430580 434769 437895 439855 440431 439612 437806 435571 433216 430899 428953
61814 428953 427824 427731 428677 430697 433816 437777 442203 447016 452312 457746 462462 465749 467432 467478 465636
61799 465636 461790 456323 449791 442408 434118 425014 415364 405305 394875 384306 374014 364261 355033
61786 355033 346299 338165 330664 323581 316624 309756 303297 297622 292836 288754 285164 281977 279163 276687
61772 276687 274703 273588 273548 274267 275253 276463 278277 280834 283823 287080 290987 296033 302229 309311 317266
61757 317266 326321 336541 347817 360214 373982 389181 405515 422619 440295 458397 476676 494864
61745 494864 512789 530267 546904 562095 575272 586109 594526 600506 604061 605383 604957 603368 601076
$$ packed form
61843B69418O239P584Q430Q782R057R424R672R748R905J0214J0323R936R236Q581
61829C96549Q077P582O964O180N228M189L126J960N76q19j806k235k355k317j946
61814D28953j129r3R46K020L119L961M426M813N296N434M716L287J683M6j842
61799D65636l846n467o532p383q290r104r650j0059j0430j0569j0292r753r228
61786C55033q734q134p501p083o957o868o459n675m786m082l590l187k814k476
61772B76687j984j115m0P19R86J210J814K557K989L257L907N046O196P082P955
61757C17266R055J0220J1276J2397J3768J5199J6334J7104J7676J8102J8279J8188
61745D94864J7925J7478J6637J5191J3177J0837Q417N980L555J322m26j589k292
$$ plain form
61732 601076 598494 596200 594844 594775 595961 598270 601635 605862 610510 615025 618830 621231 621501 619191 614177
61717 614177 606340 595486 581737 565773 548464 530430 512058 493652 475346 457146 439327 422577
61705 422577 407449 393871 381548 370579 361253 353340 346080 338949 332092 325895 320470 315662 311329
61692 311329 307479 304211 301564 299326 297094 294671 292287 290213 288313 286276 284212 282594 281641 281091 280628
61677 280628 280178 279704 279090 278387 277874 277691 277631 277471 277285 277251 277371 277601 278030 278700 279379 279773 279908 280103 280557
61658 280557 281127 281503 281498 281158 280709 280372 280191 280017 279644 278981 278106 277227 276608 276397 276501 276667 276715 276636 276513 276449
61638 276449 276583 277008 277633 278195 278444 278313 277911 277468 277230 277305 277586 277933 278398 279148 280173 281248 282250 283359
61620 283359 284855 286757 288754 290436 291611 292406 293071 293713 294252 294639 294941 295136 295009 294411 293460 292265 290629
$$ packed form
61732F01076k582k294j356o9J186K309L365M227M648M515L805K401K70k310n014
61717F14177p837j0854j3749j5964j7309j8034j8372j8406j8306j8200j7819j6750
61705D22577j5128j3578j2323j0969r326p913p260p131o857o197n425m808m333
61692C11329l850l268k647k238k232k423k384k074j900k037k064j618r53n50m63
61677B80628m50m74o14p03n13j83o0j60j86l4J20K30M29O70O79L94J35J95M54
61658B80557N70L76nl40m49l37j81j74l73o63q75q79o19k11J04J66M8p9j23o4
61638B76449J34M25O25N62K49j31m02m43k38P5K81L47M65P50J025J075J002J109
61620B83359J496J902J997J682J175P95O65O42N39L87L02J95j27n98r51j195j636
$$ plain form
61603 290629 288319 285516 282684 280045 277538 275289 273659 272667 271755 270359 268476 266442 264420 262395 260482
61588 260482 258878 257513 256020 254146 252053 250130 248538 247020 245216 243145 241231 239763 238482 236891
61574 236891 234864 232686 230576 228485 226376 224375 222599 221079 219906 219138 218531 217714 216699 215858 215289
61559 215289 214650 213821 213254 213302 213573 213389 212626 211732 211146 211128 211918 213480 215218 216435 217120 217897 219193 220848
61541 220848 222547 224126 225368 225931 225685 224853 223622 221910 219671 217139 214552 211857 208959 206092 203654
61526 203654 201727 199993 198130 196169 194411 193080 192128 191369 190771 190489 190547 190639 190433 189990 189621 189331 188652
61509 188652 187118 184722 181803 178681 175543 172500 169573 166643 163568 160345 157109 154063 151446 149480
61495 149480 148243 147577 147129 146483 145330 143660 141842 140319 139204 138277 137356 136519 135871 135334 134797 134343 134127
$$ packed form
61603B90629k310k803k832k639k507k249j630r92r12j396j883k034k022k025j913
61588B60482j604j365j493j874k093j923j592j518j804k071j914j468j281j591
61574B36891k027k178k110k091k109k001j776j520j173p68o07q17j015q41n69
61559B15289o39q29n67M8K71j84p63q94n86j8P90J562J738J217O85P77J296J655
61541B20848J699J579J242N63k46q32j231j712k239k532k587k695k898k867k438
61526B03654j927j734j863j961j758j331r52p59n98k82N8R2k06m43l69k90o79
61509A88652j534k396k919l122l138l043k927k930l075l223l236l046k617j966
61495A49480j237o66m48o46j153j670j818j523j115r27r21q37o48n37n37m54k16
$$ plain form
61478 134127 134128 134129 133917 133408 132671 131923 131360 130889 130168 129043 127825 126965 126564 126403 126335 126397 126571 126711 126777 126896
61458 126896 127143 127403 127550 127638 127798 128052 128284 128350 128188 127924 127817 128006 128309 128451 128476 128743 129478 130529 131617
61439 131617 132630 133589 134579 135830 137620 139883 142069 143637 144559 145155 145621 145947 146157 146261 146050 145345 144390
61422 144390 143652 143173 142458 141172 139572 138122 137009 136244 135940 136176 136774 137511 138364 139289 139938 139955 139464 138932
61404 138932 138567 138192 137687 137192 136799 136363 135784 135223 134851 134578 134254 133992 134084 134596 135253 135765 136163 136755 137722
61385 137722 138824 139561 139648 139305 139012 139079 139510 140173 140906 141543 142020 142519 143325 144499 145767 146753 147223 147164 146775
61366 146775 146403 146306 146449 146633 146810 147079 147396 147532 147377 147037 146609 146133 145851 146159 147095 148159 148911 149521 150399
61347 150399 151497 152375 152887 153365 154091 155000 156044 157507 159658 162286 164866 167153 169435 172107 175171
$$ packed form
61478A34127JJk12n09p37p48n63m71p21j125j218q60m01j61o8O2J74J40O6J19
61458A26896K47K60J47Q8J60K54K32O6j62k64j07J89L03J42K5K67P35J051J088
61439A31617J013R59R90J251J790K263K186J568R22N96M66L26K10J04k11p05r55
61422A44390p38m79p15j286j600j450j113p65l04K36N98P37Q53R25O49J7m91n32
61404A38932l65l75n05m95l93m36n79n61l72k73l24k62R2N12O57N12L98N92R67
61385A37722J102P37Q7l43k93O7M31O63P33O37M77M99Q06J174J268R86M70n9l89
61366A46775l72r7J43J84J77K69L17J36j55l40m28m76k82L08R36J064P52O10Q78
61347A50399J098Q78N12M78P26R09J044J463K151K628K580K287K282K672L064
$$ plain form
61332 175171 178196 180737 182672 184167 185417 186538 187652 188918 190361 191757 192804 193393 193620 193532 193009
61317 193009 191960 190565 189250 188355 187898 187668 187531 187528 187635 187572 187027 186006 184836 183824 183083 182619 182361 182069
61299 182069 181472 180621 179864 179358 178833 178023 177093 176407 176057 175895 175853 175938 176002 175890 175794 176093 176755 177214 176972 176130
61279 176130 175207 174633 174543 174873 175470 176190 176991 177892 178832 179705 180550 181537 182704 183877 184990 186321 188227
61262 188227 190747 193613 196605 199718 202991 206366 209803 213455 217626 222484 227874 233463 239019 244438
61248 244438 249464 253614 256622 258835 260913 263093 265024 266323 266991 267137 266638 265374 263615 261814 260120
61233 260120 258360 256440 254444 252402 250296 248366 247059 246496 246214 245675 244837 244067 243624 243457 243434 243548 243871
61216 243871 244476 245460 246918 248893 251418 254582 258444 262865 267539 272212 276805 281334 285848 290425 295071
$$ packed form
61332A75171L025K541J935J495J250J121J114J266J443J396J047N89K27q8n23
61317A93009j049j395j315q95m57k30j37lJ07o3n45j021j170j012p41m64k58k92
61299A82069n97q51p57n06n25q10r30o86l50j62m2Q5O4j12r6K99O62M59k42q42
61279A76130r23n74r0L30N97P20Q01R01R40Q73Q45R87J167J173J113J331J906
61262A88227K520K866K992L113L273L375L437L652M171M858N390N589N556N419
61248B44438N026M150L008K213K078K180J931J299O68J46m99j264j759j801j694
61233B60120j760j920j996k042k106j930j307n63k82n39q38p70m43j67k3J14L23
61216B43871O05R84J458J975K525L164L862M421M674M673M593M529M514M577M646
$$ plain form
61201 295071 299501 303164 305623 306915 307459 307713 307948 308211 308352 308119 307406 306394 305334 304173 302561 300287
61185 300287 297598 294957 292543 290161 287646 285203 283233 281857 280811 279855 279138 278972 279357 279972 280635 281514
61169 281514 282767 284243 285771 287558 290066 293544 297917 303029 308724 314728 320726 326535 331932 336327
61155 336327 338973 339626 338736 336849 334106 330477 326176 321595 317017 312649 308737 305346 302173 298902 295694
61140 295694 293080 291407 290623 290485 290689 290849 290715 290518 290821 291945 293722 295816 298037 300237 302249 304082
61124 304082 305965 307993 309940 311640 313405 315790 319006 322765 326628 330348 333977 337823 342256 347273
61110 347273 352279 356568 360137 363828 368539 374461 381181 388288 395640 403171 410782 418519 426645 435370
61096 435370 444563 453830 462823 471409 479525 486939 493183 497742 500352 501163 500642 499303 497457 495138 492121
$$ packed form
61201B95071M430L663K459J292N44K54K35K63J41k33p13j012j060j161j612k274
61185C00287k689k641k414k382k515k443j970j376j046r56p17j66L85O15O63Q79
61169B81514J253J476J528J787K508L478M373N112N695O004N998N809N397M395
61155C36327K646O53q90j887k743l629m301m581m578m368l912l391l173l271l208
61140B95694k614j673p84j38K04J60j34j97L03J124J777K094K221K200K012J833
61124C04082J883K028J947J700J765K385L216L759L863L720L629L846M433N017
61110C47273N006M289L569L691M711N922O720P107P352P531P611P737Q126Q725
61096D35370R193R267Q993Q586Q116P414O244M559K610Q11n21j339j846k319l017
$$ plain form
61081 492121 488069 482756 476244 468798 460598 451596 441735 431222 420521 410057 399952 390013 379957
61068 379957 369678 359391 349471 340184 331609 323839 317105 311595 307218 303666 300695 298233 296333 295130
61054 295130 294802 295374 296552 297906 299210 300475 301666 302566 302972 302871 302330 301404 300226 299101 298402 298450 299499
61037 299499 301671 304789 308454 312494 317272 323365 330945 339615 348871 358560 368826 379694 390876
61024 390876 401990 412870 423587 434188 444566 454596 464250 473487 482101 489867 496796 503096 508884
61011 508884 514071 518462 521831 523917 524576 523940 522255 519520 515460 509900 502920 494608 484919 473958
60997 473958 462214 450316 438635 427267 416267 405690 395464 385379 375286 365265 355592 346553
60985 346553 338264 330698 323883 317966 313010 308845 305301 302435 300281 298496 296647 294852 293759 293748 294503
$$ packed form
61081D92121m052n313o512p446q200r002r861j0513j0701j0464j0105r939j0056
61068C79957j0279j0287r920r287q575p770o734n510m377l552k971k462j900j203
61054B95130l28N72J178J354J304J265J191R00M06j01n41r26j178j125o99M8J049
61037B99499K172L118L665M040M778O093P580Q670R256R689J0266J0868J1182
61024C90876J1114J0880J0717J0601J0378J0030R654R237Q614P766O929O300N788
61011E08884N187M391L369K086O59o36j685k735m060n560o980q312r689j0961
60997D73958j1744j1898j1681j1368j1000j0577j0226j0085j0093j0021r673r039
60985C46553q289p566o815n917m956m165l544k866k154j785j849j795j093j1P55
$$ plain form
60970 294503 295517 296693 298250 300338 303002 306257 309948 313725 317450 321482 326338 332228 339063 346687
60956 346687 354847 363195 371613 380411 389928 400071 410478 421024 431883 443158 454728 466389
60944 466389 478001 489526 501054 512662 524169 535260 545987 556836 568126 579645 591139
60933 591139 602821 615049 627806 640963 654848 670091 686997 705428 725222 746342 768765
60922 768765 792578 818198 846274 877533 912939 953650 1000471 1053616 1113403 1180868 1257312
60911 1257312 1343827 1442087 1555468 1688662 1846385 2032986 2252902 2510717 2811328 3161450
60901 3161450 3571049 4052414 4618153 5280658 6050317 6926643 7884501 8867909 9800113
60892 9800113 10603553 11217136 11607966 11782572 11794232 11731967 11685506 11704370 11778748 11851440
$$ packed form
60970B94503J014J176J557K088K664L255L691L777L725M032M856N890O835P624
60956C46687Q160Q348Q418Q798R517J0143J0407J0546J0859J1275J1570J1661
60944D66389J1612J1525J1528J1608J1507J1091J0727J0849J1290J1519J1494
60933E91139J1682J2228J2757J3157J3885J5243J6906J8431J9794K1120K2423
60922G68765K3813K5620K8076L1259L5406M0711M6821N3145N9787O7465P6444
60911A257312Q6515R8260J13381J33194J57723J86601K19916K57815L00611L50122
60901C161450M09599M81365N65739O62505P69659Q76326R57858R83408R32204
60892I800113Q03440O13583L90830J74606J1660o2265m6461J8864P4378P2692
$$ plain form
60882 11851440 11844971 11684747 11315290 10716109 9914267 8980314 8003059 7058282 6191799 5421911
60872 5421911 4750128 4169282 3668164 3235615 2863349 2545445 2276182 2049368 1859127
60863 1859127 1700031 1566465 1452868 1354844 1269568 1195071 1129633 1071821 1020564 974983 934346
60852 934346 898126 865827 836802 810428 786255 763707 741878 720042 698239 677016 656725
60841 656725 637406 619199 602422 587241 573615 561486 550711 540949 531932 523816 516911 511167
60829 511167 506234 501954 498437 495735 493783 492651 492468 493146 494457 496373 499017 502379 506436 511443 517668
60814 517668 524840 532293 539694 547215 554942 562595 570019 577494 585275 593097 600467 607199 613424 619172
60800 619172 624218 628289 631272 633202 634171 634212 633286 631391 628622 625065 620706 615604 610076 604458 598670
$$ packed form
60882A1851440o469j60224l69457n99181q01842r33953r77255r44777q66483p69888
60872E421911o71783n80846n01118m32549l72266l17904k69263k26814j90241
60863A859127j59096j33566j13597r8024q5276p4497o5438n7812n1257m5581m0637
60852I34346l6220l2299k9025k6374k4173k2548k1829k1836k1803k1223k0291
60841F56725j9319j8207j6777j5181j3626j2129j0775r762r017q116o905n744
60829E11167m933m280l517k702j952j132j83O78J311J916K644L362M057N007O225
60814E17668P172P453P401P521P727P653P424P475P781P822P370O732O225N748
60800F19172N046M071K983J930R69M1r26j895k769l557m359n102n528n618n788
$$ plain form
60785 598670 592243 584898 576933 568934 561212 553610 545803 537699 529521 521537 513727 505846 497755 489560
60771 489560 481381 473225 465197 457604 450623 444004 437338 430517 423742 417220 411065 405369 400116 395132
60757 395132 390293 385629 380979 375783 369601 362732 355906 349486 343394 337763 333049 329345 326047 322484
60743 322484 318559 314533 310436 306006 301048 295646 290095 284779 280032 275952 272398 269199 266315 263763
60729 263763 261540 259652 258108 256849 255798 255011 254642 254710 255020 255334 255533 255608 255623 255703 255954 256371 256886 257430
60711 257430 257899 258147 258195 258330 258797 259515 260234 260840 261252 261238 260672 259855 259173 258513 257457 256033 254791 253997
60693 253997 253276 252220 250935 249649 248206 246312 244066 241827 239667 237297 234535 231535 228566 225710
60679 225710 222863 219932 217004 214298 211906 209641 207294 204978 203006 201427 199942 198351 196837 195699
$$ packed form
60785E98670o427p345p965p999p722p602p807q104q178p984p810p881q091q195
60771D89560q179q156q028p593o981o619o666o821o775o522o155n696n253m984
60757C95132m839m664m650n196o182o869o826o420o092n631m714l704l298l563
60743C22484l925m026m097m430m958n402n551n316m747m080l554l199k884k552
60729B63763k223j888j544j259j051p87l69O8L10L14J99P5J5Q0K51M17N15N44
60711B57430M69K48M8J35M67P18P19O06M12j4n66q17o82o60j056j424j242p94
60693B53997p21j056j285j286j443j894k246k239k160k370k762l000k969k856
60679B25710k847k931k928k706k392k265k347k316j972j579j485j591j514j138
$$ plain form
60665 195699 195055 194919 195262 195823 196107 195885 195545 195707 196608 198059 199831 201769 203621 205151 206511 208185
60649 208185 210438 212998 215442 217745 220206 222915 225487 227440 228639 229215 229135 228164 226326 224150 222203
60634 222203 220504 218646 216386 213848 211183 208356 205369 202443 199821 197542 195507 193609 191702 189630
60620 189630 187403 185292 183565 182178 180815 179188 177317 175531 174214 173464 173016 172542 171939 171234 170353 169253
60604 169253 168174 167470 167143 166842 166359 165891 165706 165845 166196 166638 167008 167219 167503 168250 169427 170492 171119 171722
60586 171722 172950 174894 177121 179341 181643 184151 186781 189415 191994 194445 196700 198893 201331 204160
60572 204160 207205 210180 212928 215345 217228 218384 218913 219218 219628 220027 219992 219308 218221 217111 216062 214908
60556 214908 213583 212176 210718 209199 207790 206745 206018 205282 204440 203813 203606 203420 202612 200998 198910 196710
$$ packed form
60665A95699o44j36L43N61K84k22l40J62R01J451J772J938J852J530J360J674
60649B08185K253K560K444K303K461K709K572J953J199N76q0r71j838k176j947
60634B22203j699j858k260k538k665k827k987k926k622k279k035j898j907k072
60620A89630k227k111j727j387j363j627j871j786j317p50m48m74o03p05q81j100
60604A69253j079p04l27l01m83m68j85J39L51M42L70K11K84P47J177J065O27O03
60586A71722J228J944K227K220K302K508K630K634K579K451K255K193K438K829
60572B04160L045K975K748K417J883J156N29L05M10L99l5o84j087j110j049j154
60556B14908j325j407j458j519j409j045p27p36q42o27k07j86q08j614k088k200
$$ plain form
60540 196710 194510 192355 190383 188737 187462 186518 185747 184846 183577 182054 180686 179753 179152 178603 177966 177316
60524 177316 176759 176334 176056 175966 176086 176375 176727 176950 176764 175930 174533 173043 171923 171183 170474 169641 168931 168590
60506 168590 168535 168601 168879 169493 170211 170608 170562 170319 170081 169875 169767 169883 170151 170346 170466 170778 171414 172206 173034 174043
60486 174043 175321 176561 177286 177311 176865 176344 176011 175827 175525 174962 174385 174173 174393 174842 175505 176594 178115 179797
60468 179797 181582 183800 186619 189656 192443 195027 197829 201075 204629 208228 211594 214451 216680 218425
60454 218425 219880 221057 221870 222290 222304 221884 221173 220521 220116 219736 219099 218311 217831 218082 219298 221543 224672
60437 224672 228350 232329 236653 241485 246836 252560 258410 263982 268788 272585 275435 277318 277965 277283 275690
60422 275690 273703 271426 268756 265913 263321 261107 259111 257359 256123 255467 255114 254876 254927 255531 256699 258218
$$ packed form
60540A96710k200k155j972j646j275r44p71r01j269j523j368r33o01n49o37o50
60524A77316n57m25k78r0J20K89L52K23j86q34j397j490j120p40p09q33p10l41
60506A68590n5O6K78O14P18L97m6k43k38k06j08J16K68J95J20L12O36P92Q28J009
60486A74043J278J240P25K5m46n21l33j84l02n63n77k12K20M49O63J089J521J682
60468A79797J785K218K819L037K787K584K802L246L554L599L366K857K229J745
60454B18425J455J177Q13M20J4m20p11o52m05l80o37p88m80K51J216K245L129
60437B24672L678L979M324M832N351N724N850N572M806L797K850J883O47o82j593
60422B75690j987k277k670k843k592k214j996j752j236o56l53k38N1O04J168J519
$$ plain form
60406 258218 259909 261775 264032 267005 270893 275548 280608 285897 291654 298426 306739 316856 328731 342165
60392 342165 356956 372844 389351 405901 422065 437442 451293 462582 470526 474821 475212 471193
60380 471193 462486 449646 433894 416509 398490 380545 363037 346049 329772 314673 301088 288874
60368 288874 277757 267779 259038 251232 243920 237111 231114 225930 221216 216826 212885 209337 205902 202557
60354 202557 199615 197187 195020 193020 191504 190631 189926 188756 187064 185351 184055 183222 182702 182330 181903 181226
60338 181226 180332 179563 179299 179558 179940 180051 179886 179707 179575 179272 178689 178068 177719 177678 177848 178226 178773 179232 179361
60319 179361 179266 179233 179307 179273 179013 178671 178477 178588 179034 179615 179934 179737 179177 178581 178078 177649 177383 177387 177561 177709 177800
60298 177800 177887 177915 177925 178287 179342 180861 182266 183377 184525 185909 187259 188284 189108 190074 191316 192676
$$ packed form
60406B58218J691J866K257K973L888M655N060N289N757O772Q313J0117J1875J3434
60392C42165J4791J5888J6507J6550J6164J5377J3851J1289P944M295L91m019
60380D71193q707j2840j5752j7385j8019j7945j7508j6988j6277j5099j3585j2214
60368B88874j1117r978q741p806p312o809n997n184m714m390l941l548l435l345
60354B02557k942k428k167k000j516q73p05j170j692j713j296q33n20l72m27o77
60338A81226q94p69k64K59L82J11j65j79j32l03n83o21l49m1J70L78N47M59J29
60319A79361r5l3P4l4k60l42j94J11M46N81L19j97n60n96n03m29k66MJ74J48R1
60298A77800Q7K8J0L62J055J519J405J111J148J384J350J025Q24R66J242J360
$$ plain form
60282 192676 193897 194849 195672 196705 198137 199773 201336 202859 204523 206243 207772 209145 210623 212141 213243
60267 213243 213682 213783 214100 214932 216220 217607 218595 218946 219018 219413 220247 221148 221991 223200 225139 227569 230040
60250 230040 232585 235723 239877 244927 250253 255157 259354 263061 266452 269072 270093 269178 266755 263441
60236 263441 259543 255253 250926 246838 242960 239243 235940 233347 231399 229746 228166 226663 225232 223806
60222 223806 222440 221407 220938 220938 221038 220992 220962 221269 221902 222504 222901 223354 224124 225130 226337 228165 231035 234714
60204 234714 238594 242517 246773 251382 255882 259923 263475 266390 268293 269069 268954 267935 265574 261695 256828
60189 256828 251676 246522 241393 236416 231692 227167 222915 219238 216228 213595 211220 209475 208618 208195 207528
60174 207528 206555 205766 205449 205435 205528 205779 206300 207026 207698 207981 207670 206916 206122 205550 205154 204854 204681 204535 204148
$$ packed form
60282A92676J221R52Q23J033J432J636J563J523J664J720J529J373J478J518J102
60267B13243M39J01L17Q32J288J387R88L51P2L95Q34R01Q43J209J939K430K471
60250B30040K545L138M154N050N326M904M197L707L391K620J021r15k423l314
60236B63441l898m290m327m088l878l717l303k593j948j653j580j503j431j426
60222B23806j366j033m69%J00m6l0L07O33O02L97M53P70J006J207J828K870L679
60204B34714L880L923M256M609M500M041L552K915J903P76j15j019k361l879m867
60189B56828n152n154n129m977m724m525m252l677l010k633k375j745q57m23o67
60174B07528r73p89l17j4R3K51N21P26O72K83l11p54p94n72l96l00j73j46l87
$$ plain form
60155 204148 203486 202944 202876 203190 203606 204025 204413 204578 204446 204292 204362 204460 204257 203842 203609 203725 204031 204393 204854 205474
60135 205474 206278 207272 208338 209199 209736 210186 210834 211660 212526 213476 214607 215822 217026 218406 220135 221985
60119 221985 223605 225138 227166 230002 233320 236499 239084 240928 242179 243194 244299 245569 246915 248272
60105 248272 249536 250434 250725 250489 249992 249324 248370 247093 245664 244286 243050 241947 240921 239945 239127 238612
60089 238612 238298 237815 236939 235883 235036 234564 234412 234490 234671 234744 234639 234588 234852 235412 236067 236688 237239 237726 238301
60070 238301 239247 240635 242185 243653 245154 246879 248708 250362 251727 252781 253406 253542 253348 252943 252243 251342
60054 251342 250770 250996 251888 253007 254163 255305 256154 256555 257000 258232 260342 262775 265171 267626 270115 272283
60038 272283 273968 275466 277058 278675 280192 281692 283223 284587 285574 286164 286379 286157 285461 284331 282792
$$ packed form
60155B04148o62n42o8L14M16M19L88J65j32j54P0R8k03m15k33J16L06L62M61O20
60135B05474Q04R94J066Q61N37M50O48Q26Q66R50J131J215J204J380J729J850
60119B21985J620J533K028K836L318L179K585J844J251J015J105J270J346J357
60105B48272J264Q98K91k36m97o68r54j277j429j378j236j103j026r76q18n15
60089B38612l14m83q76j056q47m72j52P8J81P3j05n1K64N60O55O21N51M87N75
60070B38301R46J388J550J468J501J725J829J654J365J054O25J36j94m05p00r01
60054B51342n72K26Q92J119J156J142Q49M01M45J232K110K433K396K455K489K168
60038B72283J685J498J592J617J517J500J531J364R87N90K15k22o96j130j539
$$ plain form
60023 282792 280935 279066 277518 276237 274845 273159 271377 269706 268109 266504 264930 263438 262038 260824
60009 260824 259905 259147 258250 257143 256042 255076 254120 253123 252310 251945 252116 252827 254095 255829 257829 259938 262061
59992 262061 264034 265758 267485 269675 272428 275324 277953 280341 282712 285045 287074 288628 289795 290800
59978 290800 291728 292331 292114 290750 288366 285297 281688 277570 273168 268812 264544 260184 255778 251667 248078
59963 248078 244966 242316 240215 238563 237021 235418 233911 232687 231795 231352 231539 232262 233129 233951 234887 235960
59947 235960 236805 237161 237258 237386 237361 236769 235508 233790 231767 229519 227256 225198 223300 221374 219429 217644
59931 217644 216018 214331 212443 210432 208396 206317 204168 202056 200163 198585 197223 195810 194100 192100
59917 192100 190109 188485 187401 186798 186504 186373 186384 186589 186910 187062 186808 186290 185913 185902 186139 186446 186809 187283
$$ packed form
60023B82792j857j869j548j281j392j686j782j671j597j605j574j492j400j214
60009B60824r19p58q97j107j101r66r56r97q13l65J71P11J268J734K000K109K123
59992B62061J973J724J727K190K753K896K629K388K371K333K029J554J167J005
59978B90800R28O03k17j364k384l069l609m118m402m356m268m360m406m111l589
59963B48078l112k650k101j652j542j603j507j224q92m43J87P23Q67Q22R36J073
59947B35960Q45L56R7J28k5n92j261j718k023k248k263k058j898j926j945j785
59931B17644j626j687j888k011k036k079k149k112j893j578j362j413j710k000
59917A92100j991j624j084o03k94j31J1K05L21J52k54n18l77j1K37L07L63M74
$$ plain form
59899 187283 187882 188687 189841 191292 192677 193661 194331 195129 196402 198054 199581 200453 200518 200086 199573 199116 198624
59882 198624 198070 197555 197104 196628 196094 195544 194952 194249 193502 192869 192370 191934 191640 191718 192281 193274 194664 196447
59864 196447 198471 200530 202652 205009 207526 209920 212116 214273 216261 217565 217911 217673 217404 217182 216640
59849 216640 215407 213374 210762 208128 206045 204578 203273 201831 200511 199673 199250 199002 198964 199304 199903 200484
59833 200484 201059 201914 203188 204723 206280 207713 208926 209912 210768 211552 212218 212803 213560 214673 216036 217485
59817 217485 219102 221030 223117 225056 226851 228861 231399 234462 237813 241088 243906 246075 247728 249069
59803 249069 250039 250398 250084 249278 248136 246710 245144 243742 242760 242242 242043 241946 241834 241876 242480 243884 245827
59786 245827 247848 249822 252007 254560 257302 260008 262632 265102 267136 268476 269258 269888 270590 271172 271271 270692
$$ packed form
59899A87283N99Q05J154J451J385R84O70P98J273J652J527Q72O5m32n13m57m92
59882A98624n54n15m51m76n34n50n92p03p47o33m99m36k94P8N63R93J390J783
59864A96447K024K059K122K357K517K394K196K157J988J304L46k38k69k22n42
59849B16640j233k033k612k634k083j467j305j442j320q38m23k48l8L40N99N81
59833B00484N75Q55J274J535J557J433J213R86Q56P84O66N85P57J113J363J449
59817B17485J617J928K087J939J795K010K538L063L351L275K818K169J653J341
59803B49069R70L59l14q06j142j426j566j402r82n18j99r7j12M2O04J404J943
59786B45827K021J974K185K553K742K706K624K470K034J340P82O30P02N82R9n79
$$ plain form
59770 270692 269499 267902 266159 264548 263273 262306 261347 260023 258161 255903 253580 251495 249738 248151 246543
59755 246543 244987 243825 243327 243455 244077 245286 247309 250195 253788 257948 262513 267091 271176 274538 277258
59740 277258 279339 280619 281212 281742 282918 284991 287735 290710 293324 294873 294842 293229 290442 286912 282862
59725 282862 278350 273400 268147 262899 258004 253589 249530 245670 241972 238447 235123 232177 229886 228345
59711 228345 227357 226632 225964 225214 224345 223552 223123 223068 223057 222814 222313 221508 220209 218432 216613 215222 214342 213776
59693 213776 213380 213059 212666 212183 211840 211832 212023 212159 212228 212417 212795 213237 213578 213734 213798 214102 214940 216089 216884 216982
59673 216982 216794 216916 217389 217839 218079 218181 218163 218055 218154 218797 219855 220872 221659 222470 223564 224965 226617 228439
59655 228439 230193 231682 233166 235274 238335 242044 245854 249458 252771 255729 258291 260544 262655 264790
$$ packed form
59770B70692j193j597j743j611j275r67r59j324j862k258k323k085j757j587j608
59755B46543j556j162m98J28O22J209K023K886L593M160M565M578M085L362K720
59740B77258K081J280N93N30J176K073K744K975K614J549l1j613k787l530m050
59725B82862m512m950n253n248m895m415m059l860l698l525l324k946k291j541
59711B28345r88p25o68p50q69p93m29n5j1k43n01q05j299j777j819j391q80n66
59693B13776l96l21l93m83l43qJ91J36O9J89L78M42L41J56O4L04Q38J149P95R8
59673B16982j88J22M73M50K40J02j8j08R9O43J058J017P87Q11J094J401J652J822
59655B28439J754J489J484K108L061L709L810L604L313K958K562K253K111K135
$$ plain form
59641 264790 267073 269454 271570 272924 273332 273090 272646 272174 271526 270497 269096 267604 266408 265677 265226 264703
59625 264703 263874 262662 261089 259322 257713 256576 255905 255451 255055 254704 254326 253718 252753 251519 250247 249218
59609 249218 248690 248721 249026 249198 249164 249276 249868 250793 251544 251762 251565 251344 251323 251387 251358 251297 251431 251831 252334 252756 253006
59588 253006 252967 252545 251954 251656 251847 252178 252204 251941 251739 251703 251495 250690 249093 246773 243958 240949 237969 235098
59570 235098 232395 229961 227768 225598 223324 221137 219271 217617 215882 214129 212851 212402 212578 212869 213066
59555 213066 213456 214403 215835 217279 218389 219275 220167 220960 221393 221549 221721 221805 221325 220237 219259 219126 219842 220949
59537 220949 222103 223074 223559 223508 223384 223647 224139 224328 223958 223060 221593 219616 217611 216139 215208 214447 213752
59520 213752 213251 212768 211950 210871 209929 209116 208006 206578 205408 204892 204860 205186 206139 207747 209359 210336 210829
$$ packed form
59641B64790K283K381K116J354M08k42m44m72o48j029j401j492j196p31m51n23
59625B64703q29j212j573j767j609j137o71m54l96l51l78o08r65j234j272j029
59609B49218n28L1L05J72l4J12N92R25P51K18j97k21k1O4k9o1J34M00N03M22K50
59588B53006l9m22n91k98J91L31K6k63k02l6k08q05j597k320k815l009k980k871
59570B35098k703k434k193k170k274k187j866j654j735j753j278m49J76K91J97
59555B13066L90R47J432J444J110Q86Q92P93M33J56J72Q4m80j088r78j33P16J107
59537B20949J154R71M85n1j24K63M92J89l70q98j467j977k005j472r31p61o95
59520B13752n01m83q18j079r42q13j110j428j170n16l2L26R53J608J612R77M93
$$ plain form
59503 210829 211423 212270 213047 213556 213930 214302 214615 214773 214704 214298 213519 212576 211823 211419 211181 210768 210013 209077 208341
59484 208341 208069 208162 208303 208262 208009 207612 207182 206858 206654 206406 206077 205956 206260 206631 206447 205649 204856 204534 204430
59465 204430 204048 203321 202601 202212 202264 202666 203118 203259 203066 202940 203267 204069 205249 206882 208969 211116 212829
59448 212829 214140 215615 217775 220700 224227 228283 232951 238412 244943 252818 261985 271772 281032 288671
59434 288671 294056 296955 297312 295362 291946 288361 285635 284018 283258 283102 283271 283229 282434 280835 278770 276379
59418 276379 273418 269686 265312 260537 255524 250467 245596 240933 236297 231659 227274 223323 219716 216412
59404 216412 213676 211784 210646 209942 209492 209267 209173 209087 209062 209257 209622 209799 209432 208493 207279 206134 205218 204522
59386 204522 204040 203837 203948 204295 204756 205269 205833 206523 207547 209120 211189 213401 215497 217569 219810 222225
$$ packed form
59503B10829N94Q47P77N09L74L72L13J58o9m06p79r43p53m04k38m13p55r36p36
59484B08341k72R3J41m1k53l97m30l24k04k48l29j21L04L71j84p98p93l22j04
59465B04430l82p27p20l89N2M02M52J41j93j26L27Q02J180J633K087K147J713
59448B12829J311J475K160K925L527M056M668N461O531P875R167R787R260P639
59434B88671N385K899L57j950l416l585k726j617p60j56J69m2p95j599k065k391
59418B76379k961l732m374m775n013n057m871m663m636m638m385l951l607l304
59404B16412k736j892j138p04m50k25r4q6k5J95L65J77l67r39j214j145r16o96
59386B04522m82k03J11L47M61N13N64O90J024J573K069K212K096K072K241K415
$$ plain form
59370 222225 224762 227478 230306 232902 235089 237322 240284 244098 248284 252433 256513 260555 264516 268501
59356 268501 272685 276870 280469 283086 284810 285889 286425 286486 286189 285513 284312 282571 280380 277614 274063
59341 274063 269947 265930 262486 259598 257172 255351 254206 253518 253131 253210 253922 255190 257022 259771 263751
59326 263751 268844 274756 281412 288762 296470 304151 311817 319698 327729 335487 342619 349075 354872 359822
59312 359822 363526 365547 365568 363464 359293 353355 346341 339317 333343 329081 326811 326576 327965 329867 330891
59297 330891 330155 327445 322774 316299 308696 301027 293985 287562 281566 276018 270908 266097 261722 258262
59283 258262 255910 254289 253102 252583 252928 253687 254246 254617 255251 256252 257307 258274 259421 261050 263232 265876
59267 265876 268835 271938 275134 278539 282241 286163 290234 294532 299142 304101 309586 315861 322840 330010
$$ packed form
59370B22225K537K716K828K596K187K233K962L814M186M149M080M042L961L985
59356B68501M184M185L599K617J724J079N36O1k97o76j201j741k191k766l551
59341B74063m116m017l444k888k426j821j145o88l87P9P12J268J832K749L980
59326B63751N093N912O656P350P708P681P666P881Q031P758P132O456N797M950
59312C59822L704K021K1k104m171n938p014p024n974m262k270k35J389J902J024
59297C30891p36k710m671o475p603p669p042o423n996n548n110m811m375l460
59283B58262k352j621j187n19L45P59N59L71O34J001J055R67J147J629K182K644
59267B65876K959L103L196L405L702L922M071M298M610M959N485O275O979P170
$$ plain form
59253 330010 337047 344182 351712 359438 366913 374002 380785 387132 392707 397241 400515 402268 402419 401205
59239 401205 398773 394850 389152 381938 373807 365124 355988 346649 337535 328943 320995 313803 307408 301638
59225 301638 296331 291626 287741 284645 282170 280259 278751 277160 275069 272701 270723 269511 268901 268534 268139
59210 268139 267584 267021 266916 267604 268871 270273 271774 273717 276272 279317 282876 287255 292623 298709 304903
59195 304903 310426 314432 316233 315579 312571 307470 300800 293521 286697 280929 276296 272787 270463 269222
59181 269222 268735 268757 269312 270531 272458 275051 278239 281962 286135 290531 294711 298271 301214 303820 306066
59166 306066 307513 307927 307649 307074 306164 304789 303191 301653 300024 298055 295975 294168 292501 290597 288633
59151 288633 287248 286643 286364 286051 285847 285943 286232 286646 287419 288766 290583 292620 294715 296751 298615 300294
$$ packed form
59253C30010P037P135P530P726P475P089O783O347N575M534L274J753J51j214
59239D01205k432l923n698p214q131q683r136r339r114q592p948p192o395n770
59225C01638n307m705l885l096k475j911j508j591k091k368j978j212o10l67l95
59210B68139n55n63j05O88J267J402J501J943K555L045L559M379N368O086O194
59195C04903N523M006J801o54l008n101o670p279o824n768m633l509k324j241
59181B69222m87K2N55J219J927K593L188L723M173M396M180L560K943K606K246
59166C06066J447M14k78n75r10j375j598j538j629j969k080j807j667j904j964
59151B88633j385o05k79l13k04R6K89M14P73J347J817K037K095K036J864J679
$$ plain form
59135 300294 301755 302684 302620 301429 299403 296837 293736 289997 285684 281061 276478 272204 268231 264298 260324
59120 260324 256669 253752 251540 249698 248087 246759 245602 244406 243250 242406 241840 241177 240190 238987 237735
59105 237735 236525 235543 234955 234632 234270 233803 233337 232777 231941 231102 230897 231561 232641 233624 234466 235345 236265 237160
59087 237160 238106 239213 240477 241871 243448 245271 247373 249797 252492 255211 257762 260310 263184 266436
59073 266436 269909 273678 277987 282728 287380 291574 295371 298858 301838 304047 305402 305890 305460 304138 302020
59058 302020 299069 295180 290518 285536 280615 275878 271394 267280 263577 260282 257417 254824 251990 248496
59044 248496 244604 241007 237985 235247 232580 230093 227755 225300 222817 220900 219870 219309 218681 218051 217800
59029 217800 217948 218195 218438 218864 219635 220755 222206 224042 226401 229462 233249 237432 241545 245559 249985
$$ packed form
59135C00294J461R29o4j191k026k566l101l739m313m623m583m274l973l933l974
59120B60324l655k917k212j842j611j328j157j196j156q44n66o63r87j203j252
59105B37735j210r82n88l23l62m67m66n60q36q39k05O64J080R83Q42Q79R20Q95
59087B37160R46J107J264J394J577J823K102K424K695K719K551K548K874L252
59073B66436L473L769M309M741M652M194L797L487K980K209J355M88m30j322k118
59058C02020k951l889m662m982m921m737m484m114l703l295k865k593k834l494
59044B48496l892l597l022k738k667k487k338k455k483j917j030n61o28o30k51
59029B17800J48K47K43M26P71J120J451J836K359L061L787M183M113M014M426
$$ plain form
59014 249985 255311 261550 268428 275756 283401 291151 298819 306308 313460 319988 325706 330639 334790 337952
59000 337952 339853 340360 339522 337589 335017 332212 329223 325934 322550 319557 317121 314928 312737 310696 308890
58985 308890 306901 304169 300630 296740 292987 289579 286489 283559 280584 277437 274143 270851 267781 265135
58971 265135 262953 261086 259442 258141 257241 256447 255348 253860 252178 250382 248414 246366 244437 242675 241083
58956 241083 239891 239335 239217 239128 239063 239347 239976 240552 240911 241263 241606 241566 241027 240436 240225 240322 240437 240452 240356 240206
58936 240206 240330 241180 242765 244619 246490 248726 251794 255818 260699 266251 272070 277728 283289 289192 295393
58921 295393 301110 305609 308779 310710 311317 310746 309622 308396 306819 304492 301585 298657 296061 293969 292652
58906 292652 292348 293030 294586 296977 299972 303066 305958 308796 311714 314507 317062 319648 322405 324883 326520
$$ packed form
59014B49985N326O239O878P328P645P750P668P489P152O528N718M933M151L162
59000C37952J901N07q38j933k572k805k989l289l384k993k436k193k191k041j806
58985C08890j989k732l539l890l753l408l090k930k975l147l294l292l070k646
58971B65135k182j867j644j301r00p94j099j488j682j796j968k048j929j762j592
58956B41083j192n56j18q9o5K84O29N76L59L52L43m0n39n91k11R7J15J5r6j50
58936B40206J24Q50J585J854J871K236L068M024M881N552N819N658N561N903O201
58921B95393N717M499L170J931O07n71j124j226j577k327k907k928k596k092j317
58906B92652l04O82J556K391K995L094K892K838K918K793K555K586K757K478J637
$$ plain form
58891 326520 327270 327413 327068 326258 325109 323596 321453 318763 316297 314823 314300 314208 314383 315117 316674 319145
58875 319145 322582 326874 331655 336676 342061 347903 353937 359928 366023 372300 378305 383528 388043 392202
58861 392202 395980 399146 401808 404189 406022 406678 405846 403586 399876 394602 387967 380468 372484 364190 355790
58846 355790 347508 339498 332053 325677 320579 316361 312559 309241 306650 304549 302458 300322 298407 296698
58832 296698 294950 293163 291466 289689 287620 285582 284105 283066 281770 279943 278067 276634 275582 274625
58818 274625 273672 272747 271846 271030 270421 270045 269925 270287 271362 273041 275073 277579 280974 285413 290643 296427
58802 296427 302755 309649 317100 325225 334142 343700 353571 363630 373930 384374 394763 405130 415697
58789 415697 426490 437262 447730 457576 466325 473548 479128 483009 484790 483953 480500 474974 467847 459243
$$ packed form
58891C26520P50J43l45q10j149j513k143k690k466j474n23r2J75P34J557K471
58875C19145L437M292M781N021N385N842O034N991O095O277O005N223M515M159
58861C92202L778L166K662K381J833O56q32k260l710n274o635p499p984q294q400
58846C55790q282q010p445o376n098m218l802l318k591k101k091k136j915j709
58832B96698j748j787j697j777k069k038j477j039j296j827j876j433j052r57
58818B74625r53r25r01q16o09l76j20L62J075J679K032K506L395M439N230N784
58802B96427O328O894P451Q125Q917R558R871J0059J0300J0444J0389J0367J0567
58789D15697J0793J0772J0468R846Q749P223N580L881J781q37l453n526p127q604
$$ plain form
58775 459243 449260 438240 426653 415012 403893 393770 384816 377078 370758 366013 362553 359746 357092
58762 357092 354394 351559 348574 345572 342632 339559 336127 332410 328621 324811 320991 317279 313579 309353
58748 309353 304202 298508 293046 288069 283242 278302 273298 268309 263475 259228 255928 253286 250675 247999
58734 247999 245772 244337 243524 243078 242913 242926 243083 243757 245412 247852 250278 252223 253974 255914 257942 259735
58718 259735 261166 262221 262834 263035 262996 262856 262704 262747 263137 263565 263448 262606 261437 260361 259428 258545 257688 256715
58700 256715 255336 253444 251270 249043 246745 244270 241658 239068 236675 234591 232780 231119 229686 228807
58686 228807 228591 228672 228694 228803 229259 229838 230122 230200 230498 231078 231656 232261 233198 234376 235303 235856 236405 237077 237457
58667 237457 237256 236730 236210 235667 235007 234385 233963 233657 233284 232746 232020 231273 230941 231296 231932 232135 231780 231395 231312
$$ packed form
58775D59243r983j1020j1587j1641j1119j0123q954p738o320m745l460k807k654
58762C57092k698k835k985l002k940l073l432l717l789l810l820l712l700m226
58748C09353n151n694n462m977m827m940n004m989m834m247l300k642k611k676
58734B47999k227j435q13m46j65J3J57O74J655K440K426J945J751J940K028J793
58718B59735J431J055O13K01l9j40j52M3L90M28j17q42j169j076r33q83q57r73
58700B56715j379j892k174k227k298k475k612k590k393k084j811j661j433q79
58686B28807k16Q1K2J09M56N79K84P8K98N80N78O05R37J178R27N53N49O72L80
58667B37457k01n26n20n43o60o22m22l06l73n38p26p47l32L55O36K03l55l85q3
$$ plain form
58648 231312 231286 231104 231016 231350 232135 233311 234957 237108 239700 242825 246720 251398 256615 262258 268363 274704
58632 274704 280807 286468 291836 296897 301299 304802 307512 309556 310963 311956 312917 313945 314811 315394 315768
58617 315768 315910 315843 316073 317246 319231 321099 322172 322515 322316 321429 319767 317495 314522 310351 304778 298239
58601 298239 291172 283548 275325 266857 258514 250327 242364 235019 228609 223071 218335 214516 211472 208660
58587 208660 205817 203338 201614 200420 199358 198479 198093 198252 198827 199773 200972 202131 203214 204684 206965
58572 206965 209972 213473 217624 222751 228825 235470 242337 249197 255817 261934 267196 271065 273038 273071 271509
58557 271509 268596 264468 259611 254743 250049 245140 240000 235446 232255 230333 229072 228097 227246 226279 225096
58542 225096 223978 223263 222982 223055 223451 223883 223767 222863 221634 220641 219915 219226 218615 218307 218422 219113 220655 223109
$$ packed form
58648B31312k6j82q8L34P85J176J646K151K592L125L895M678N217N643O105O341
58632B74704O103N661N368N061M402L503K710K044J407R93R61J028Q66N83L74
58617C15768J42o7K30J173J985J868J073L43j99q87j662k272k973m171n573o539
58601B98239p067p624q223q468q343q187p963p345o410n538m736l819l044k812
58587B08660k843k479j724j194j062q79l86J59N75R46J199J159J083J470K281
58572B06965L007L501M151N127O074O645O867O860O620O117N262L869J973L3j562
58557B71509k913m128m857m868m694m909n140m554l191j922j261r75q51r67j183
58542B25096j118p15k81P3L96M32j16r04j229r93p26o89o11l08J15O91J542K454
$$ plain form
58524 223109 226150 229492 233166 237177 241309 245535 250183 255324 260381 264695 268125 270793 272641 273643
58510 273643 274049 273994 273193 271435 269088 266710 264408 261931 259165 256220 253302 250708 248669 246979 245171
58495 245171 243289 242053 241946 242618 243550 244833 246828 249532 252753 256554 260975 265605 269908 273782 277404
58480 277404 280788 283867 286769 289630 292351 294881 297428 300142 302873 305599 308786 312978 318362 324963
58466 324963 332864 341906 351596 361650 372181 382986 393119 401632 408323 413314 416454 417699 417624 416867
58452 416867 415382 412934 410008 407507 405638 403738 401159 397776 393650 388698 382846 376207 369143 362286
58438 362286 356322 351481 347364 343438 339514 335616 331759 328078 324906 322457 320753 319957 320368 321880 323948
58423 323948 326326 329338 333143 337269 341249 345158 349115 352725 355463 357211 358018 357819 356711 355055 352913
$$ packed form
58524B23109L041L342L674M011M132M226M648N141N057M314L430K668J848J002
58510B73643M06n5q01j758k347k378k302k477k766k945k918k594k039j690j808
58495B45171j882j236j07O72R32J283J995K704L221L801M421M630M303L874L622
58480B77404L384L079K902K861K721K530K547K714K731K726L187M192N384O601
58466C24963P901R042R690J0054J0531J0805J0133Q513O691M991L140J245p5p57
58452D16867j485k448k926k501j869j900k579l383m126m952n852o639p064o857
58438C62286n964m841m117l926l924l898l857l681l172k449j704p96M11J512K068
58423C23948K378L012L805M126L980L909L957L610K738J748Q07j99j108j656k142
$$ plain form
58408 352913 349895 345878 341297 336371 330759 324429 318168 312636 307580 302541 297686 293288 289074 284868
58394 284868 281242 278739 276959 275281 273977 273787 274809 276625 279134 282404 286101 289860 293919 298608
58380 298608 303554 308092 312055 315386 317436 317583 316188 314052 311232 307321 302606 297966 293771 289786
58366 289786 286043 282940 280579 278797 277776 277899 279081 280951 283516 286901 290612 293809 296248 298223
58352 298223 299707 300259 299733 298470 296869 295235 293807 292446 290619 288283 286371 285769 286249 287078 288152
58337 288152 289704 291424 292875 294416 296684 299435 301866 303901 306184 309000 312103 315439 319112 322759
58323 322759 325861 328503 331012 333057 333961 333715 332787 331175 328575 325235 321711 317935 313521 308775 304432
58308 304432 300559 296681 292867 289737 287525 286060 285469 285939 286978 287854 288604 289661 290799 291464 291861 292568
$$ packed form
58408C52913l018m017m581m926n612o330o261n532n056n039m855m398m214m206
58394B84868l626k503j780j678j304j90J022J816K509L270L697L759M059M689
58380B98608M946M538L963L331K050J47j395k136k820l911m715m640m195l985
58366B89786l743l103k361j782j021J23J182J870K565L385L711L197K439J975
58352B98223J484N52n26j263j601j634j428j361j827k336j912o02M80Q29J074
58337B88152J552J720J451J541K268K751K431K035K283K816L103L336L673L647
58323C22759L102K642K509K045R04k46r28j612k600l340l524l776m414m746m343
58308C04432l873l878l814l130k212j465n91M70J039Q76P50J057J138O65L97P07
$$ plain form
58292 292568 293352 293530 293300 293426 293767 293453 292446 291685 291628 291885 292310 293219 294449 295424 296265 297685 299694 301565
58274 301565 303152 305070 307490 309950 312466 315580 319139 322282 324840 327556 330716 333694 336116 338325
58260 338325 340402 341817 342370 342550 342705 342736 342709 342825 342798 342287 341879 342616 344587 347125 350235 354525 359812
58243 359812 365218 370717 377132 384457 391612 398053 404240 410272 415464 419579 423154 426295 428409 429423
58229 429423 430005 430352 430027 429195 428674 428539 428019 427029 426442 426647 427163 427876 429251 431144 432893 434782 437895
58212 437895 442320 447017 451683 457109 463449 469815 475902 482395 489395 496080 502262 508647 515214 521029
58198 521029 525985 531007 536267 541013 545464 550868 557299 563414 568869 574874 581821 588565 594779 601837
58184 601837 610497 619809 629165 639350 650624 661860 672647 684202 697141 710364 723208 736738
$$ packed form
58292B92568P84J78k30J26L41l14j007p61n7K57M25R09J230R75Q41J420K009J871
58274C01565J587J918K420K460K516L114L559L143K558K716L160K978K422K209
58260C38325K077J415N53J80J55L1k7J16k7n11m08P37J971K538L110M290N287
58243C59812N406N499O415P325P155O441O187O032N192M115L575L141K114J014
58229D29423N82L47l25q32n21j35n20r90n87K05N16P13J375J893J749J889L113
58212D37895M425M697M666N426O340O366O087O493P000O685O182O385O567N815
58198E21029M956N022N260M746M451N404O431O115N455O005O947O744O214P058
58184F01837Q660R312R356J0185J1274J1236J0787J1555J2939J3223J2844J3530
$$ plain form
58172 736738 751789 767628 783646 800455 818252 835961 853065 870434 888454 906267 923678
58161 923678 941686 960277 978006 994706 1012208 1031356 1050775 1069730 1089609 1111355 1134021
58150 1134021 1157228 1182402 1210145 1239052 1268567 1300294 1334978 1371021 1407638 1446628 1489260
58139 1489260 1534297 1580896 1630438 1683602 1738705 1795018 1854644 1919005 1986675 2056872 2131792
58128 2131792 2213122 2299583 2390414 2487815 2593361 2705571 2823840 2951157 3090094 3239822
58118 3239822 3400121 3574336 3765177 3971712 4194029 4436630 4703634 4995306 5313501
58109 5313501 5665941 6060738 6501642 6993535 7547734 8176944 8890684 9702035 10634328
58100 10634328 11716122 12976602 14453646 16200353 18275079 20730429 23620551 27013379
$$ packed form
58172G36738J5051J5839J6018J6809J7797J7709J7104J7369J8020J7813J7411
58161I23678J8008J8591J7729J6700J7502J9148J9419J8955J9879K1746K2666
58150A134021K3207K5174K7743K8907K9515L1727L4684L6043L6617L8990M2632
58139A489260M5037M6599M9542N3164N5103N6313N9626O4361O7670P0197P4920
58128B131792Q1330Q6461R0831R7401J05546J12210J18269J27317J38937J49728
58118C239822J60299J74215J90841K06535K22317K42601K67004K91672L18195
58109E313501L52440L94797M40904M91893N54199O29210P13740Q11351R32293
58100A0634328J081794J260480J477044J746707K074726K455350K890122L392828
$$ plain form
58092 27013379 30986959 35621522 41007414 47254443 54479361 62787176 72271360 83004689
58084 83004689 94961177 107859699 120990081 133117171 142581952 147699834 147382784 141645593
58076 141645593 131614980 119010146 105482472 92231400 79968947 69032416 59491083
58069 59491083 51247815 44150349 38062592 32868934 28457556 24724117 21579152 18938695
58061 18938695 16717195 14838852 13247189 11896225 10740940 9743176 8878070 8126562
58053 8126562 7467314 6881561 6359069 5892668 5471829 5086947 4734813 4414407 4121446
58044 4121446 3851586 3604562 3380438 3175549 2986369 2813611 2658324 2517305 2386302
58035 2386302 2264527 2152246 2047088 1946514 1851267 1762815 1679991 1601339 1528117 1461678
$$ packed form
58092B7013379L973580M634563N385892O247029P224918Q307815R484184J0733329
58084H3004689J1956488J2898522J3130382J2127090R464781N117882l17050n737191
58076A41645593j0030613j2604834j3527674j3251072j2262453j0936531r541333
58069E9491083q243268p097466o087757n193658m411378l733439l144965k640457
58061A8938695k221500j878343j591663j350964j155285r97764q65106p51508
58053H126562o59248n85753n22492m66401m20839l84882l52134l20406k92961
58044D121446k69860k47024k24124k04889j89180j72758j55287j41019j31003
58035B386302j21775j12281j05158j00574r5247q8452q2824p8652p3222o6439
$$ plain form
58025 1461678 1400384 1342259 1288277 1239848 1195362 1152421 1111426 1073793 1038519 1003669 969656
58014 969656 938070 908616 879919 852077 825866 800674 775610 751464 729351 708603 688080
58003 688080 668319 650312 633429 616568 600122 584884 570241 555394 541136 528480 516754
57992 516754 504878 493329 482976 473235 463278 453834 445828 438373 430125 421547 413854 406701 398910
57979 398910 390588 382588 374674 366114 357391 349448 341892 333731 325291 317681 310950 304409 298199 292908
57965 292908 288162 283210 278400 274564 271439 268171 264882 262263 260088 257642 255128 253222 251597 249306
57951 249306 246275 243119 239851 236091 232112 228430 224791 220740 216763 213567 210720 207257 203223 199353
57937 199353 195710 191919 188335 185619 183501 181271 179121 177717 176794 175490 173837 172553 171603 170252 168411
$$ packed form
58025A461678o1294n8125n3982m8429m4486m2941m0995l7633l5274l4850l4013
58014I69656l1586k9454k8697k7842k6211k5192k5064k4146k2113k0748k0523
58003F88080j9761j8007j6883j6861j6446j5238j4643j4847j4258j2656j1726
57992E16754j1876j1549j0353r741r957r444q006p455q248q578p693p153p791
57979C98910q322q000p914q560q723p943p556q161q440p610o731o541o210n291
57965B92908m746m952m810l836l125l268l289k619k175k446k514j906j625k291
57951B49306l031l156l268l760l979l682l639m051l977l196k847l463m034l870
57937A99353l643l791l584k716k118k230k150j404r23j304j653j284r50j351j841
$$ plain form
57922 168411 166673 165106 163220 161046 159160 157669 156221 154875 153986 153415 152832 152523 152843 153217 152855 152187
57906 152187 152340 153356 154216 154534 154896 155480 155704 155456 155470 156105 156752 156778 156230 155360 154282 153296 152709 152143 150796
57887 150796 148593 146353 144639 143162 141519 139810 138268 136844 135395 133841 132059 130045 128155 126737
57873 126737 125591 124260 122699 121167 119655 118016 116479 115367 114481 113386 112174 111270 110674 110089 109641
57858 109641 109720 110182 110444 110341 110269 110529 111162 112270 113842 115379 116397 117182 118372 119959 121453 122862 124676
57841 124676 126976 129410 132042 135333 139260 143270 147258 151732 156827 161873 166203 169793 172897 175631
57827 175631 178078 180266 181898 182515 182015 180598 178337 175270 171810 168386 164792 160526 155731 151142 147132
57812 147132 143478 140019 136809 133647 130219 126769 123878 121544 119224 116859 115072 114230 114038 114216 114792
$$ packed form
57922A68411j738j567j886k174j886j491j448j346q89n71n83l09L20L74l62o68
57906A52187J53J016Q60L18L62N84K24k48J4O35O47K6n48q70j078r86n87n66j347
57887A50796k203k240j714j477j643j709j542j424j449j554j782k014j890j418
57873A26737j146j331j561j532j512j639j537j112q86j095j212r04n96n85m48
57858A09641P9M62K62j03p2K60O33J108J572J537J018P85J190J587J494J409J814
57841A24676K300K434K632L291L927M010L988M474N095N046M330L590L104K734
57827A75631K447K188J632O17n00j417k261l067l460l424l594m266m795m589m010
57812A47132l654l459l210l162l428l450k891k334k320k365j787q42j92J78N76
$$ plain form
57797 114792 115576 116103 116370 116868 117633 118042 117881 117871 118695 120131 121554 122708 123560 123949 123895 123795 123884 123844 123344
57778 123344 122626 122162 122054 122052 121882 121268 119916 117804 115277 112705 110222 107866 105650 103467 101269 99357
57762 99357 98065 97132 95882 94114 92333 90973 89952 89108 88494 87983 87142 85837 84501 83512 82714 81815
57746 81815 80771 79516 77795 75606 73399 71462 69499 67201 64871 63093 62053 61534 61338 61373 61535 61797
57730 61797 62230 62738 63063 63248 63735 64781 66052 67114 67976 68827 69556 69951 70177 70646 71505 72565 73656
57713 73656 74771 75919 77024 77915 78314 78002 77118 76150 75491 75146 74926 74717 74441 74032 73583 73289 73105 72704
57695 72704 71926 71008 70214 69503 68768 68113 67640 67149 66341 65218 64092 63280 62900 62829 62783 62544 62186 61915 61688
57676 61688 61275 60743 60502 60715 60949 60656 59763 58586 57396 56313 55394 54642 53993 53425 52920 52301 51342 50138
$$ packed form
57797A14792P84N27K67M98P65M09j61j0Q24J436J423J154Q52L89n4j00Q9m0n00
57778A23344p18m64j08kj70o14j352k112k527k572k483k356k216k183k198j912
57762I9357j292r33j250j768j781j360j021q44o14n11q41j305j336r89p98q99
57746H1815j044j255j721k189k207j937j963k298k330j778j040n19j96L5J62K62
57730F1797M33N08L25J85M87J046J271J062Q62Q51P29L95K26M69Q59J060J091
57713G3656J115J148J105Q91L99l12q84r68o59l45k20k09k76m09m49k94j84m01
57695G2704p78r18p94p11p35o55m73m91q08j123j126q12l80p1m6k39l58k71k27
57676F1688m13n32k41K13K34k93q93j177j190j083r19p52o49n68n05o19r59j204
$$ plain form
57658 50138 49090 48410 47916 47451 47179 47264 47565 47871 48173 48482 48605 48369 47845 47149 46253 45250 44528 44336 44345
57639 44345 43945 42879 41305 39387 37165 34792 32574 30675 28924 26978 24632 21998 19492 17542 16230
57624 16230 15273 14344 13330 12280 11286 10425 9670 8850 7893 7077 6727 6655 6255 5247 3975 2821 1747
57607 1747 640 -290 -856 -1325 -2101 -3157 -4098 -4740 -5245 -5792 -6365 -6890 -7329 -7680 -8041 -8569 -9238 -9719 -9717 -9368
57587 -9368 -9106 -9199 -9577 -10034 -10417 -10631 -10608 -10292 -9576 -8326 -6450 -3852 -331 4322 10062 16709 24414 33734
57569 33734 45108 58539 74001 91857 112487 135502 159429 182022 200713 213093 217511 213527
57557 213527 201851 184005 162083 138467 115275 93874 74840 58208 43715 31061 20212
57546 20212 11333 4330 -1343 -6222 -10385 -13727 -16456 -19000 -21545 -23962 -26153 -28149 -29918 -31350
$$ packed form
57658E0138j048o80m94m65k72Q5L01L06L02L09J23k36n24o96q96j003p22j92R
57639D4345m00j066j574j918k222k373k218j899j751j946k346k634k506j950j312
57624A6230r57r29j014j050r94q61p55q20r57q16l50p2m00j008j272j154j074
57607A747F40b90n66m69p76j056r41o42n05n47n73n25m39l51l61n28o69m81KL49
57587i368K62r3l78m57l83k14K3L16P16J250J876K598c31D322N740O647P705R320
57569C3734J1374J3431J5462J7856K0630K3015K3927K2593J8691J2380M418l984
57557B13527j1676j7846k1922k3616k3192k1401j9034j6632j4493j2654j0849
57546B0212q879D330a343m879m163l342k729k544k545k417k191j996j769j432
$$ plain form
57532 -31350 -32436 -33285 -33943 -34404 -34767 -35218 -35855 -36643 -37526 -38437 -39294 -40087 -40901 -41745 -42504 -43191 -44079 -45387
57514 -45387 -47000 -48701 -50504 -52459 -54278 -55511 -56135 -56655 -57587 -59043 -60839 -62738 -64514 -65979 -67083
57499 -67083 -67897 -68468 -68772 -68794 -68619 -68462 -68677 -69591 -71180 -73015 -74677 -76158 -77671 -79197 -80467 -81358 -82058
57482 -82058 -82830 -83790 -84916 -86131 -87331 -88497 -89746 -91111 -92369 -93239 -93775 -94340 -95214 -96387 -97703 -99014
57466 -99014 -100180 -101117 -101905 -102686 -103465 -104151 -104768 -105420 -106068 -106567 -106999 -107696 -108801 -109995 -110794 -111040 -110964 -110884 -110969
57447 -110969 -111194 -111433 -111577 -111649 -111779 -112032 -112311 -112506 -112680 -113007 -113540 -114126 -114614 -115073 -115702 -116538 -117409 -118240 -119225
57428 -119225 -120532 -121951 -123108 -124007 -125037 -126379 -127716 -128646 -129125 -129274 -129071 -128570 -128199 -128414 -129099 -129679 -129845
57411 -129845 -129898 -130273 -131051 -132030 -133051 -134063 -135010 -135806 -136396 -136810 -137234 -137995 -139313 -141001 -142589 -143774 -144656
$$ packed form
57532c1350j086q49o58m61l63m51o37p88q83r11q57p93q14q44p59o87q88j308
57514d5387j613j701j803j955j819j233o24n20r32j456j796j899j776j465j104
57499f7083q14n71l04k2J75J57k15r14j589j835j662j481j513j526j270q91p00
57482h2058p72r60j126j215j200j166j249j365j258q70n36n65q74j173j316j311
57466i9014j166r37p88p81p79o86o17o52o48m99m32o97j105j194p99k46P6Q0q5
57447a10969k25k39j44p2j30k53k79j95j74l27n33n86m88m59o29q36q71q31r85
57428a19225j307j419j157q99j030j342j337r30m79j49K03N01L71k15o85n80j66
57411a29845n3l75p78r79j021j012r47p96n90m14m24p61j318j688j588j185q82
$$ plain form
57394 -144656 -145500 -146460 -147609 -149032 -150708 -152388 -153786 -154884 -155934 -157146 -158482 -159744 -160807 -161656 -162296
57379 -162296 -162735 -163079 -163516 -164142 -164879 -165683 -166761 -168335 -170269 -172122 -173646 -174998 -176358 -177602 -178542 -179266
57363 -179266 -179982 -180701 -181346 -182072 -183180 -184721 -186427 -188026 -189424 -190630 -191689 -192732 -193821 -194816 -195607 -196462
57347 -196462 -197778 -199435 -200737 -201212 -201199 -201414 -202132 -203060 -203915 -204813 -206042 -207627 -209257 -210612 -211689 -212787
57331 -212787 -214152 -215701 -217150 -218339 -219318 -220186 -221029 -222030 -223397 -225076 -226708 -228022 -229154 -230407 -231833
57316 -231833 -233206 -234355 -235310 -236124 -236745 -237175 -237622 -238390 -239595 -241078 -242592 -244035 -245466 -246933 -248400 -249854
57300 -249854 -251376 -253035 -254776 -256518 -258319 -260278 -262293 -264111 -265675 -267237 -269028 -270945 -272678 -274043
57286 -274043 -275051 -275765 -276288 -276876 -277813 -279111 -280498 -281803 -283252 -285217 -287752 -290485 -293004 -295227 -297372
$$ packed form
57394a44656q44r60j149j423j676j680j398j098j050j212j336j262j063q49o40
57379a62296m39l44m37o26p37q04j078j574j934j853j524j352j360j244r40p24
57363a79266p16p19o45p26j108j541j706j599j398j206j059j043j089r95p91q55
57347a96462j316j657j302m75J3k15p18r28q55q98j229j585j630j355j077j098
57331b12787j365j549j449j189r79q68q43j001j367j679j632j314j132j253j426
57316b31833j373j149r55q14o21m30m47p68j205j483j514j443j431j467j467j454
57300b49854j522j659j741j742j801j959k015j818j564j562j791j917j733j365
57286b74043j008p14n23n88r37j298j387j305j449j965k535k733k519k223k145
$$ plain form
57271 -297372 -299632 -301973 -304220 -306259 -308127 -309940 -311757 -313546 -315294 -317075 -318939 -320745 -322255 -323439
57257 -323439 -324605 -326097 -327919 -329814 -331659 -333590 -335716 -337892 -339914 -341807 -343778 -345965 -348365 -350906
57243 -350906 -353447 -355754 -357686 -359453 -361469 -363854 -366219 -368093 -369533 -371135 -373459 -376565 -380148 -383945
57229 -383945 -387855 -391745 -395391 -398703 -401861 -405085 -408391 -411689 -415047 -418665 -422611 -426756 -430985 -435297
57215 -435297 -439656 -443960 -448252 -452741 -457444 -461995 -466050 -469816 -473923 -478780 -484251 -489981 -495773 -501535
57201 -501535 -507091 -512257 -517093 -521883 -526880 -532138 -537613 -543254 -548968 -554636 -560290 -566214 -572699 -579672
57187 -579672 -586740 -593669 -600700 -608263 -616432 -624782 -632738 -639977 -646504 -652428 -657629 -661574 -663516 -662989
57173 -662989 -660106 -655287 -648866 -641190 -633044 -625642 -620042 -616697 -615555 -616341 -618580 -621649 -625112 -629003
$$ packed form
57271b97372k260k341k247k039j868j813j817j789j748j781j864j806j510j184
57257c23439j166j492j822j895j845j931k126k176k022j893j971k187k400k541
57243c50906k541k307j932j767k016k385k365j874j440j602k324l106l583l797
57229c83945l910l890l646l312l158l224l306l298l358l618l946m145m229m312
57215d35297m359m304m292m489m703m551m055l766m107m857n471n730n792n762
57201e01535n556n166m836m790m997n258n475n641n714n668n654n924o485o973
57187e79672p068o929p031p563q169q350p956p239o527n924n201l945j942N27
57173f62989K883M819O421P676Q146P402N600L345J142p86k239l069l463l891
$$ plain form
57159 -629003 -633605 -639041 -645189 -651926 -659221 -666993 -675018 -683082 -691194 -699627 -708720 -718553 -728770 -738806
57145 -738806 -748332 -757435 -766340 -775126 -783773 -792355 -800995 -809659 -818152 -826300 -834032 -841265 -847856 -853710
57131 -853710 -858911 -863691 -868281 -872839 -877530 -882663 -888660 -895830 -904159 -913375 -923186 -933450 -944133 -955213
57117 -955213 -966617 -978226 -989976 -1001944 -1014235 -1026744 -1039171 -1051368 -1063490 -1075663 -1087680
57106 -1087680 -1099268 -1110555 -1121996 -1133920 -1146384 -1159379 -1172859 -1186597 -1200354 -1214223 -1228492
57095 -1228492 -1243094 -1257435 -1270847 -1283021 -1294129 -1304920 -1316691 -1330673 -1347155 -1365391 -1384419
57084 -1384419 -1403755 -1423342 -1443376 -1464346 -1486906 -1511423 -1537854 -1566130 -1596377 -1628654 -1662886
57073 -1662886 -1699193 -1737926 -1779160 -1822486 -1867476 -1914051 -1962259 -2012071 -2063568 -2116950 -2172160
$$ packed form
57159f29003m602n436o148o737p295p772q025q064q112q433r093r833j0217j0036
57145g38806r526r103q905q786q647q582q640q664q493q148p732p233o591n854
57131h53710n201m780m590m558m691n133n997p170q329r216r811j0264j0683j1080
57117i55213j1404j1609j1750j1968j2291j2509j2427j2197j2122j2173j2017
57106a087680j1588j1287j1441j1924j2464j2995j3480j3738j3757j3869j4269
57095a228492j4602j4341j3412j2174j1108j0791j1771j3982j6482j8236j9028
57084a384419j9336j9587k0034k0970k2560k4517k6431k8276l0247l2277l4232
57073a662886l6307l8733m1234m3326m4990m6575m8208m9812n1497n3382n5210
$$ plain form
57062 -2172160 -2228897 -2287177 -2347514 -2410331 -2475609 -2543288 -2613559 -2686533 -2762129 -2840571 -2922487
57051 -2922487 -3008204 -3097437 -3190026 -3286449 -3387253 -3492514 -3602302 -3717134 -3837513 -3963572
57041 -3963572 -4095737 -4235246 -4383383 -4540627 -4707071 -4883259 -5070029 -5267993 -5477768
57032 -5477768 -5700310 -5936467 -6186708 -6451915 -6733943 -7034751 -7355514 -7697282 -8061963
57023 -8061963 -8451860 -8868784 -9314545 -9791891 -10304052 -10853762 -11443690 -12077599 -12760376
57014 -12760376 -13497506 -14295529 -15162656 -16108147 -17141762 -18275127 -19523557 -20906022 -22444516
57005 -22444516 -24165346 -26101424 -28293219 -30789598 -33651306 -36956113 -40802978 -45315961
56997 -45315961 -50649855 -56994943 -64576049 -73644880 -84466602 -97298820 -112363096 -129817894
$$ packed form
57062b172160n6737n8280o0337o2817o5278o7679p0271p2974p5596p8442q1916
57051b922487q5717q9233r2589r6423j00804j05261j09788j14832j20379j26059
57041c963572j32165j39509j48137j57244j66444j76188j86770j97964k09775
57032e477768k22542k36157k50241k65207k82028l00808l20763l41768l64681
57023h061963l89897m16924m45761m77346n12161n49710n89928o33909o82777
57014a2760376p37130p98023q67127r45491j033615j133365j248430j382465j538494
57005b2444516j720830j936078k191795k496379k861708l304807l846865m512983
56997d5315961n333894o345088p581106r068831j0821722j2832218j5064276j7454798
$$ plain form
56989 -129817894 -149743093 -172134007 -196893389 -223816491 -252575946 -282714823 -313651115
56982 -313651115 -344693863 -375069105 -403954161 -430526849 -454036402 -473869780 -489548581
56975 -489548581 -500625197 -506561219 -506740799 -500677694 -488288645 -470031699 -446827620
56968 -446827620 -419852873 -390339795 -359444110 -328167324 -297316108 -267499051 -239156363
56961 -239156363 -212602606 -188061790 -165684959 -145550892 -127659907 -111935337 -98238930
56954 -98238930 -86392552 -76196542 -67444463 -59937206 -53493522 -47953020 -43174990 -39038578
56946 -39038578 -35443215 -32305590 -29555104 -27132119 -24987940 -23082761 -21382578 -19858451
56938 -19858451 -18487066 -17249299 -16127850 -15107311 -14175592 -13323211 -12541122 -11820634 -11155076
$$ packed form
56989a29817894j9925199k2390914k4759382k6923102k8759455l0138877l0936292
56982c13651115l1042748l0375242k8885056k6572688k3509553j9833378j5678801
56975d89548581j1076616n936022j79580O063105J2389049J8256946K3204079
56968d46827620K6974747K9513078L0895685L1276786L0851216K9817057K8342688
56961b39156363K6553757K4540816K2376831K0134067J7890985J5724570J3696407
56954i8238930J1846378J0196010Q752079P507257O443684N540502M778030M136412
56946c9038578L595363L137625K750486K422985K144179J905179J700183J524127
56938a9858451J371385J237767J121449J020539R31719Q52381P82089P20488O65558
$$ plain form
56929 -11155076 -10539886 -9971056 -9444825 -8958671 -8510958 -8099182 -7719377 -7366891 -7036456
56920 -7036456 -6721748 -6416710 -6118149 -5826543 -5544397 -5274603 -5019889 -4782093 -4561211
56911 -4561211 -4355754 -4164175 -3985340 -3817863 -3660120 -3511121 -3370528 -3237670 -3111404
56902 -3111404 -2991063 -2876662 -2767999 -2664374 -2565384 -2471189 -2381737 -2296406 -2214665 -2136469
56892 -2136469 -2061777 -1990254 -1921656 -1855986 -1793120 -1732763 -1674871 -1619640 -1567012 -1516634 -1468320
56881 -1468320 -1422009 -1377372 -1334022 -1292142 -1252260 -1214440 -1178253 -1143514 -1110406 -1078863 -1048500
56870 -1048500 -1019216 -991188 -964223 -937787 -911760 -886502 -862047 -837966 -814158 -791067 -768877
56859 -768877 -747124 -725407 -703850 -682611 -661454 -640174 -619012 -598461 -579076 -561524 -546295
$$ packed form
56929a1155076O15190N68830N26231M86154M47713M11776L79805L52486L30435
56920g036456L14708L05038K98561K91606K82146K69794K54714K37796K20882
56911d561211K05457J91579J78835J67477J57743J48999J40593J32858J26266
56902c111404J20341J14401J08663J03625R8990R4195Q9452Q5331Q1741P8196
56892b136469P4692P1523O8598O5670O2866O0357N7892N5231N2628N0378M8314
56881a468320M6311M4637M3350M1880L9882L7820L6187L4739L3108L1543L0363
56870a048500K9284K8028K6965K6436K6027K5258K4455K4081K3808K3091K2190
56859g68877K1753K1717K1557K1239K1157K1280K1162K0551J9385J7552J5229
$$ plain form
56848 -546295 -533149 -521373 -510666 -501211 -492788 -484545 -475915 -467123 -458457 -449637 -440208 -430019 -418980
56835 -418980 -406890 -393877 -380493 -366992 -352991 -338172 -322826 -307364 -291824 -276339 -261621
56824 -261621 -248551 -237631 -229237 -223832 -221327 -220564 -220054 -219072 -217656 -215886 -213679 -211087 -208226 -204997
56810 -204997 -201248 -197165 -193090 -189057 -184808 -180204 -175326 -170299 -165210 -160137 -155041 -149837 -144737 -140274
56796 -140274 -136722 -133700 -130644 -127496 -124613 -122201 -120153 -118380 -116983 -116058 -115483 -114847 -113506 -110795 -106327
56781 -106327 -100074 -92315 -83736 -75491 -68705 -63737 -60210 -57757 -56264 -55341 -54169 -52218 -49673 -46815
56767 -46815 -43436 -39250 -34434 -29225 -23316 -16189 -7835 1355 11325 22418 34828 48253 61983
56754 61983 74961 85849 93485 97398 97828 95421 91093 85870 80498 75311 70684 67331 65826 66070
$$ packed form
56848e46295J3146J1776J0707R455Q423Q243Q630Q792Q666Q820R429J0189J1039
56835d18980J2090J3013J3384J3501J4001J4819J5346J5462J5540J5485J4718
56824b61621J3070J0920Q394N405K505P63N10R82J416J770K207K592K861L229
56810b04997L749M083M075M033M249M604M878N027N089N073N096N204N100M463
56796a40274L552L022L056L148K883K412K048J773J397R25N75O36J341K711M468
56781a06327O253P759Q579Q245O786M968L527K453J493R23J172J951K545K858
56767d6815L379M186M816N209N909P127g835A355R970J1093J2410J3425J3730
56754F1983J2978J0888P636L913M30k407m328n223n372n187m627l353j505K44
$$ plain form
56740 66070 67631 70410 74591 80146 86898 95006 104966 117164 131719 148618 167458 186967 205077
56727 205077 219575 228600 230909 226296 215936 201982 186627 171542 157878 146263 136703 128857
56715 128857 122586 118114 115672 115265 116793 120206 125512 132778 142107 153432 166376 180399 194868
56702 194868 208764 220470 228246 230962 228352 220871 209698 196656 183557 171437 160597 151253
56690 151253 143731 138049 133786 130599 128584 127942 128530 129985 132224 135611 140553 146979 154256 161643 168710
56675 168710 175152 180278 183021 182624 179149 173250 165739 157524 149573 142564 136647 131711 127681 124330
56661 124330 121168 117871 114672 112000 109916 108216 106863 105951 105359 104844 104364 103971 103510 102798 101971 101324
56645 101324 100883 100497 100214 100182 100219 99915 99153 98235 97546 97355 97848 99000 100457 101839 103047 104038 104545 104441
$$ packed form
56740F6070J561K779M181N555O752Q108R960J2198J4555J6899J8840J9509J8110
56727B05077J4498R025K309m613j0360j3954j5355j5085j3664j1615r560p846
56715A28857o271m472k442m07J528L413N306P266R329J1325J2944J4023J4469
56702A94868J3896J1706P776K716k610p481j1173j3042j3099j2120j0840r344
56690A51253p522n682m263l187k015o42N88J455K239L387M942O426P277P387P067
56675A68710O442N126K743l97l475n899p511q215p951p009n917m936m030l351
56661A24330l162l297l199k672k084j700j353r12n92n15m80l93m61p12q27o47
56645A01324m41l86k83l2L7l04p62r18o89j91M93J152J457J382J208R91N07j04
$$ plain form
56627 104441 104185 104435 105302 106434 107677 109110 110519 111474 111987 112579 113551 114657 115561 116183 116521 116601 116739
56610 116739 117344 118325 119080 119240 119066 118938 118884 118760 118581 118449 118403 118514 118865 119359 119801 120183 120648 121138 121447
56591 121447 121583 121715 121749 121415 120854 120620 120963 121468 121619 121337 120843 120356 120117 120326 120829 121172 121156 121067 121243 121706
56571 121706 122332 123037 123605 123709 123340 122943 122924 123280 123875 124754 125978 127364 128642 129737 130724 131683 132647 133592
56553 133592 134456 135339 136566 138248 139927 141058 141780 142691 143874 144735 144915 144818 144993 145517 146236 147134 148096
56536 148096 148709 148668 148127 147403 146607 145759 144929 144008 142660 140763 138688 136936 135735 135086 134849 134625 133897
56519 133897 132547 130924 129306 127641 125986 124735 124132 123944 123846 123783 123677 123210 122242 121172 120570 120671 121406
56502 121406 122607 123932 124948 125523 125889 126156 126161 125993 126161 126917 127800 128185 127963 127408 126746 126189 125995 126167
$$ packed form
56627A04441k56K50Q67J132J243J433J409R55N13N92R72J106R04O22L38Q0J38
56610A16739O05R81P55J60j74j28n4j24j79j32m6J11L51M94M42L82M65M90L09
56591A21447J36J32L4l34n61k34L43N05J51k82m94m87k39K09N03L43j6q9J76M63
56571A21706O26P05N68J04l69l97j9L56N95Q79J224J386J278J095R87R59R64R45
56553A33592Q64Q83J227J682J679J131P22R11J183Q61J80r7J75N24P19Q98R62
56536A48096O13m1n41p24p96q48q30r21j348j897k075j752j201o49k37k24p28
56519A33897j350j623j618j665j655j251o03j88r8o3j06m67r68j070o02J01P35
56502A21406J201J325J016N75L66K67Nj68J68P56Q83L85k22n55o62n57j94J72
$$ plain form
56484 126167 126394 126573 127012 127854 128745 129410 130045 130751 131085 130718 130114 129966 130267 130531 130677 131079 131857 132691 133280
56465 133280 133595 133748 133974 134608 135750 137068 138193 139120 139985 140761 141504 142549 144078 145754 147185 148464
56449 148464 149842 151191 152213 152925 153462 153690 153492 153194 153155 153146 152674 151714 150632 149500 148080 146422 144962
56432 144962 144026 143566 143370 143163 142633 141686 140621 139790 139225 138811 138535 138293 137807 137100 136705 136955 137390 137342 136769
56413 136769 136017 135135 134033 132984 132315 131812 131095 130356 130029 129911 129363 128322 127370 126826 126410 125858 125247 124641
56395 124641 123956 123280 122850 122669 122599 122728 123131 123404 123039 122236 121715 121716 121816 121767 121857 122276 122753 123031 123215 123443
56375 123443 123664 123902 124355 125074 125864 126612 127365 128061 128513 128669 128601 128316 127900 127694 127856 127939 127452 126701 126454
56356 126454 126858 127334 127525 127627 127742 127609 127205 126939 127020 127183 127237 127341 127527 127511 127218 126964 126900 126760 126429 126262
$$ packed form
56484A26167K27J79M39Q42Q91O65O35P06L34l67o04j48L01K64J46M02P78Q34N89
56465A33280L15J53K26O34J142J318J125R27Q65P76P43J045J529J676J431J279
56449A48464J378J349J022P12N37K28j98k98l9rm72r60j082j132j420j658j460
56432A44962r36m60j96k07n30r47j065q31n65m14k76k42m86p07l95K50M35m8n73
56413A36769p52q82j102j049o69n03p17p39l27j18n48j041r52n44m16n52o11o06
56395A24641o85o76m30j81p0J29M03K73l65q03n21JJ00m9R0M19M77K78J84K28
56375A23443K21K38M53P19P90P48P53O96M52J56o8k85m16k06J62Q3m87p51k47
56356A26454M04M76J91J02J15j33m04k66Q1J63N4J04J86j6k93k54o4j40l31j67
$$ plain form
56336 126262 126497 126802 126744 126331 125789 125142 124361 123661 123329 123369 123510 123485 123223 122945 123045 123656 124372 124667 124566 124572
56316 124572 124981 125673 126496 127383 128068 128200 127878 127620 127679 127787 127748 127838 128386 129265 130052 130502 130723 131002 131491 131998
56296 131998 132149 131880 131580 131516 131457 131186 131055 131486 132254 132838 133280 133985 134841 135270 135126 134855 134707 134479 134084
56277 134084 133760 133596 133492 133642 134403 135596 136558 137060 137544 138338 139242 140047 140837 141592 142070 142282 142557 142967
56259 142967 143233 143306 143489 143855 144106 144176 144343 144611 144580 144158 143799 143821 144010 144100 144112 144104 144100 144368 145157 146093 146489 146367
56237 146367 146457 147038 147572 147707 147832 148291 148779 148963 149054 149357 149771 150106 150417 150727 150956 151338 152295 153713 154965
56218 154965 155901 157079 158742 160293 161219 161846 162718 163808 164820 165744 166679 167622 168721 170258 172071 173559
56202 173559 174568 175675 177312 179208 181017 182811 184629 186190 187493 189086 191292 193764 196131 198493
$$ packed form
56336A26262K35L05n8m13n42o47p81p00l32M0J41k5k62k78J00O11P16K95j01O
56316A24572M09O92Q23Q87O85J32l22k58N9J08l9R0N48Q79P87M50K21K79M89N07
56296A31998J51k69l00o4n9k71j31M31P68N84M42P05Q56M29j44k71j48k28l95
56277A34084l24j64j04J50P61J193R62N02M84P94R04Q05P90P55M78K12K75M10
56259A42967K66P3J83L66K51P0J67K68l1m22l59K2J89R0J2qmK68P89R36L96j22
56237A46367R0N81N34J35J25M59M88J84R1L03M14L35L11L10K29L82R57J418J252
56218A54965R36J178J663J551R26O27Q72J090J012R24R35R43J099J537J813J488
56202A73559J009J107J637J896J809J794J818J561J303J593K206K472K367K362
$$ plain form
56188 198493 200936 203244 205449 208003 211012 213952 216578 219393 222802 226464 230011 233729 238018 242778
56174 242778 247794 253167 258943 264943 271333 278687 287107 296003 305152 315160 326441 338629 351573
56161 351573 366038 382726 401402 421710 444124 469310 497262 527879 561768 599650 641464
56150 641464 686765 735492 787619 842566 899627 958521 1018870 1079585 1139297 1196912 1251210
56139 1251210 1300555 1343590 1379612 1407745 1426421 1434382 1431607 1418751 1396412 1365574 1327933 1284985
56127 1284985 1237382 1185845 1131868 1076839 1021227 965484 910877 858538 808465 760398 714927
56116 714927 672720 633426 596438 562147 531316 503737 478580 455584 434868 416041 398586
56105 398586 382733 368923 356793 345602 335246 325906 317176 308560 300433 293520 287786 282717 278285
$$ packed form
56188A98493K443K308K205K554L009K940K626K815L409L662L547L718M289M760
56174B42778N016N373N776O000O390P354Q420Q896R149J0008J1281J2188J2944
56161C51573J4465J6688J8676K0308K2414K5186K7952L0617L3889L7882M1814
56150F41464M5301M8727N2127N4947N7061N8894O0349O0715N9712N7615N4298
56139A251210M9345M3035L6022K8133J8676P961k775j2856k2339l0838l7641m2948
56127A284985m7603n1537n3977n5029n5612n5743n4607n2339n0073m8067m5471
56116G14927m2207l9294l6988l4291l0831k7579k5157k2996k0716j8827j7455
56105C98586j5853j3810j2130j1191j0356r340q730q616q127o913n734n069m432
$$ plain form
56092 278285 274680 271545 268430 265596 263434 261540 259306 256998 255258 253989 252703 251514 250799 250322 249652
56077 249652 249039 248859 248720 248139 247631 248029 249170 250318 251447 252996 254804 256430 258161 260574 263411 265945
56061 265945 268123 270340 272511 274445 276689 279900 283812 287899 292501 298135 304257 310054 316043 323492
56047 323492 332581 342452 352819 364270 377231 391853 408696 428365 450744 475676 503918 536158
56035 536158 571485 608082 644971 681743 717045 748948 776665 800636 821214 838618 853794
56024 853794 867775 880270 890069 896592 899785 899035 893802 885078 874655 863029 849322 832920 813702
56011 813702 790953 763737 732419 698545 663428 628076 594096 563102 535379 510450 488591
56000 488591 470386 455312 442319 431370 422822 415831 409181 403252 399348 397350 395909 394559 393809
$$ packed form
56092B78285l605l135l115k834k162j894k234k308j740j269j286j189p15m77o70
56077B49652o13j80j39n81n08L98J141J148J129J549J808J626J731K413K837K534
56061B65945K178K217K171J934K244L211L912M087M602N634O122N797N989P449
56047C23492R089R871J0367J1451J2961J4622J6843J9669K2379K4932K8242L2240
56035E36158L5327L6597L6889L6772L5302L1903K7717K3971K0578J7404J5176
56024H53794J3981J2495R799O523L193p50n233q724j0423j1626j3707j6402j9218
56011H13702k2749k7216l1318l3874l5117l5352l3980l0994k7723k4929k1859
56000D88591j8205j5074j2993j0949q548o991o650n929l904j998j441j350p50
$$ plain form
55987 393809 393429 392665 391883 392031 392684 392663 392320 393154 395291 397513 399689 402947 407398 411879 416089 420884
55971 420884 426308 431372 435936 440782 445687 449451 452000 454526 457441 460115 462595 465596 468882 471707
55957 471707 474697 479138 484584 489448 493711 498653 504161 508987 513498 519355 526442 532980 538824 545731
55943 545731 554082 562274 569756 577808 586813 595625 604109 613512 623851 633771 643454 654748 667900
55930 667900 681102 693737 707132 721621 735968 750208 765849 782693 798711 813674 829608
55919 829608 847097 864624 882166 901757 923659 945676 967190 990144 1015101 1040188 1065045
55908 1065045 1091913 1121592 1152222 1183283 1216781 1253187 1290280 1327471 1367178 1410504 1455683
55897 1455683 1502213 1552189 1606057 1661483 1717920 1777790 1841747 1907625 1975631 2049367 2129985
$$ packed form
55987C93809l80p64p82J48O53k1l43Q34K137K222K176L258M451M481M210M795
55971D20884N424N064M564M846M905L764K549K526K915K674K480L001L286K825
55957D71707K990M441N446M864M263M942N508M826M511N857P087O538N844O907
55943E45731Q351Q192P482Q052R005Q812Q484R403J0339R920R683J1294J3152
55930F67900J3202J2635J3395J4489J4347J4240J5641J6844J6018J4963J5934
55919H29608J7489J7527J7542J9591K1902K2017K1514K2954K4957K5087K4857
55908A065045K6868K9679L0630L1061L3498L6406L7093L7191L9707M3326M5179
55897A455683M6530M9976N3868N5426N6437N9870O3957O5878O8006P3736Q0618
$$ plain form
55886 2129985 2214665 2302716 2397569 2500679 2609435 2723478 2847017 2982283 3126894 3280506
55876 3280506 3447644 3631083 3829175 4042869 4278381 4539651 4825666 5138913 5488624
55867 5488624 5881827 6319709 6807310 7358203 7985213 8696706 9508195 10448412 11548970
55858 11548970 12839881 14362214 16172470 18325453 20865245 23843146 27332838 31419974
55850 31419974 36194249 41764596 48263259 55815390 64514988 74429056 85558388 97692123
55842 97692123 110231509 122125369 131970262 138254657 139751898 136004996 127633913 116152006
55834 116152006 103333042 90579472 78694234 68021916 58655514 50543606 43553460
55827 43553460 37544349 32406646 28043833 24352772 21236808 18617121 16419358 14565820
$$ packed form
55886B129985Q4680Q8051R4853J03110J08756J14043J23539J35266J44611J53612
55876C280506J67138J83439J98092K13694K35512K61270K86015L13247L49711
55867E488624L93203M37882M87601N50893O27010P11493Q11489R40217J100558
55858A1548970J290911J522333J810256K152983K539792K977901L489692M087136
55850C1419974M774275N570347O498663P552131Q699598R914068J1129332J2133735
55842I7692123J2539386J1893860R844893O284395J497241l746902q371083j1481907
55834A16152006j2818964j2753570j1885238j0672318r366402q111908o990146
55827D3553460o009111n137703m362813l691061l115964k619687k197763j853538
$$ plain form
55819 14565820 12990702 11649248 10504374 9517104 8656479 7905761 7250946 6672888 6156177
55810 6156177 5695218 5285136 4915320 4577166 4269543 3991276 3735862 3498456 3280599
55801 3280599 3083249 2901893 2732880 2577976 2438272 2309737 2188954 2077432 1976261
55792 1976261 1882116 1792469 1709352 1634157 1563877 1496213 1433468 1377657 1326484 1277873 1233876
55781 1233876 1196293 1162579 1129744 1098453 1069732 1041330 1010910 979527 948733 917438 884739
55770 884739 852683 823197 795199 767489 741513 718525 696973 675386 655033 637134 620252
55759 620252 603038 586779 572681 559317 545310 531887 520285 509254 497640 486871 478263 470317
55747 470317 461266 451988 443846 435888 426797 417481 409221 401173 392177 383142 375316 368009 360296 353126
$$ packed form
55819A4565820j575118j341454j144874r87270q60625p50718o54815n78058n16711
55810F156177m60959m10082l69816l38154l07623k78267k55414k37406k17857
55801C280599j97350j81356j69013j54904j39704j28535j20783j11522j01171
55792A976261r4145q9647q3117p5195p0280o7664o2745n5811n1173m8611m3997
55781A233876l7583l3714l2835l1291k8721k8402l0420l1383l0794l1295l2699
55770H84739l2056k9486k7998k7710k5976k2988k1552k1587k0353j7899j6882
55759F20252j7214j6259j4098j3364j4007j3423j1602j1031j1614j0769q608p946
55747D70317r051r278q142p958r091r316q260q048q996r035p826p307p713p170
$$ plain form
55733 353126 347464 342149 335866 329510 324440 320092 315494 311432 308886 306939 304431 302098 300961 300082
55719 300082 298138 295721 294022 292622 290708 289079 288829 289270 289203 289047 289764 290911 291654 292470 293890 294757
55703 294757 293693 291229 288611 285659 281621 277035 272812 268513 263385 258108 253698 249663 245031 240235
55689 240235 236268 232954 229807 227568 227007 227088 226139 224031 221517 218368 214002 209169 205195 202152 199397
55674 199397 197165 195942 194976 193097 190423 187732 184872 181344 177740 174911 172361 169056 165281 162082
55660 162082 159484 156780 154081 152011 150378 148622 147083 146389 146066 145190 143869 142707 141361 139112 136352
55645 136352 134079 132318 130418 128467 127008 125828 124390 123067 122620 122813 122796 122437 122086 121521 120441 119450
55629 119450 119290 119550 119391 119018 119113 119354 118891 117844 116953 116147 114816 113142 111831 110836 109643 108441 107747
$$ packed form
55733C53126n662n315o283o356n070m348m598m062k546j947k508k333j137q79
55719C00082j944k417j699j400j914j629k50M41o7j56P17J147P43Q16J420Q67
55703B94757j064k464k618k952m038m586m223m299n128n277m410m035m632m796
55689B40235l967l314l147k239n61Q1r49k108k514l149m366m833l974l043k755
55674A99397k232j223r66j879k674k691k860l528l604k829k550l305l775l199
55660A62082k598k704k699k070j633j756j539o94l23q76j321j162j346k249k760
55645A36352k273j761j900j951j459j180j438j323m47J93j7l59l51n65j080r91
55629A19450j60K60j59l73R5K41m63j047q91q06j331j674j311r95j193j202o94
$$ plain form
55612 107747 107226 106182 104881 104157 104040 104023 104244 105126 106184 106550 106378 106459 106804 106851 106740 106995 107268 106769 105706
55593 105706 105001 104751 104296 103601 103285 103412 103526 103701 104383 105359 106093 106829 108139 109612 110332 110474 111112 112548
55575 112548 114072 115293 116435 117432 117952 118274 118961 119772 120077 120175 120914 122162 123008 123385 124121 125365 126343
55558 126343 126755 127074 127289 126677 125115 123397 121948 120267 117914 115073 111951 108585 105370 102827 100744
55543 100744 98489 96181 94543 93572 92455 90860 89252 87867 86477 85255 84752 84823 84651 84019 83556 83561 83652
55526 83652 83714 84057 84478 84261 83439 82915 83036 83069 82488 81734 81253 80756 79929 79036 78350 77711 77033 76553 76204 75494
55506 75494 74332 73305 72795 72481 71990 71433 71004 70656 70407 70425 70609 70580 70221 69709 69046 68155 67353 67042 66991
55487 66991 66637 66045 65786 65922 65976 65917 66259 67094 67911 68505 69246 70299 71371 72364 73501 74698 75564 76144
$$ packed form
55612A07747n21j044j301p24j17j7K21Q82J058L66j72Q1L45M7j11K55K73m99j063
55593A05706p05k50m55o95l16J27J14J75O82R76P34P36J310J473P20J42O38J436
55575A12548J524J221J142R97N20L22O87Q11L05R8P39J248Q46L77P36J244R78
55558A26343M12L19K15o12j562j718j449j681k353k841l122l366l215k543k083
55543A00744k255k308j638r71j117j595j608j385j390j222n03P1j72o32m63NR1
55526H3652O2L43M21k17q22n24J21L3n81p54m81m97q27q93o86o39o78m80l49p10
55506G5494j162j027n10l14m91n57m29l48k49J8J84k9l59n12o63q91q02l11n1
55487F6991l54n92k59J36N4n9L42Q35Q17N94P41J053J072R93J137J197Q66N80
$$ plain form
55469 76144 76918 78005 79122 80284 81680 82930 83416 83391 83725 84481 84769 84159 83182 82255 81175 79977 79194
55452 79194 78919 78529 77736 77012 76664 76403 76113 76078 76148 75673 74703 74209 74633 75174 75028 74452 74027 73736 73392 73192
55432 73192 73204 72998 72361 71736 71409 70952 69990 68885 68094 67495 66853 66327 65932 65114 63473 61467 59848 58786
55414 58786 58027 57464 57122 56927 56895 57168 57601 57720 57351 56859 56544 56299 56055 56010 56157 56155 55892 55652 55496 55107
55394 55107 54454 53998 53968 54055 54060 54205 54558 54795 54780 54754 54735 54425 53922 53780 54142 54545 54815 55302 55981 56229 55844
55373 55844 55388 55122 54554 53547 52909 53188 53765 53814 53413 53030 52665 52256 52227 52813 53427 53482 53322 53601 54230 54664
55353 54664 54771 54732 54450 53772 52978 52459 52211 52109 52305 52856 53409 53704 54001 54553 55117 55438 55673 55896 55785
55334 55785 55292 55018 55318 55634 55345 54700 54228 53837 53234 52737 52827 53284 53548 53599 53773 54000 53988 53869 53997 54357
$$ packed form
55469G6144P74J087J117J162J396J250M86k5L34P56K88o10r77r27j080j198p83
55452G9194k75l90p93p24l48k61k90l5P0m75r70m94M24N41j46n76m25k91l44k00
55432G3192J2k06o37o25l27m57r62j105p91n99o42n26l95q18j641k006j619j062
55414E8786p59n63l42j95l2K73M33J19l69m92l15k45k44m5J47kk63k40j56l89
55394E5107o53m56l0Q7NJ45L53K37j5k6j9l10n03j42L62M03K70M87O79K48l85
55373E5844m56k66n68j007o38K79N77M9m01l83l65m09k9N86O14N5j60K79O29M34
55353E4664J07l9k82o78p94n19k48j02J96N51N53K95K97N52N64L21K35K23j11
55334E5785m93k74L00L16k89o45m72l91o03m97R0M57K64N1J74K27j2j19J28L60
$$ plain form
55314 54357 54781 55473 56651 57936 58734 59022 59166 59193 58883 58322 57828 57481 57217 57142 57253 57148 56494 55522 54575
55295 54575 53553 52255 50908 49794 48800 47935 47820 48928 50674 52037 52793 53408 53997 54251 54208 54232 54223 53645
55277 53645 52432 51247 50745 51031 51859 52893 53762 54293 54665 55014 55089 54682 54199 54282 54991 55836 56464 56888 57169
55258 57169 57353 57588 57858 57745 56869 55477 54168 53233 52633 52395 52566 52929 53207 53387 53516 53421 53024 52651 52584
55239 52584 52590 52326 51920 51675 51506 51219 51044 51291 51726 51871 51750 51772 52043 52362 52704 53176 53640 53933 54285 55000
55219 55000 55864 56384 56445 56264 55925 55460 55133 55103 55036 54636 54271 54421 54815 54806 54401 54124 54007 53536 52600 51712 51195
55198 51195 50833 50433 50138 50070 50180 50531 51238 52088 52650 52797 52704 52445 52080 51975 52436 53133 53458 53411 53484 53772
55178 53772 53861 53630 53451 53484 53427 53136 52908 52958 53085 53050 52852 52535 52148 51974 52378 53320 54402 55407 56402 57307
$$ packed form
55314E4357M24O92J178J285P98K88J44K7l10n61m94l47k64p5J11j05o54r72r47
55295E4575j022j298j347j114r94q65j15J108J746J363P56O15N89K54m3K4rn78
55277E3645j213j185n02K86Q28J034Q69N31L72L49P5m07m83Q3P09Q45O28M24K81
55258E7169J84K35K70j13q76j392j309r35o00k38J71L63K78J80J29r5l97l73o7
55239E2584Ok64m06k45j69k87j75K47M35J45j21K2K71L19L42M72M64K93L52P15
55219E5000Q64N20O1j81l39m65l27l0o7m00l65J50L94rm05k77j17m71r36q88n17
55198E1195l62m00k95o8J10L51P07Q50N62J47r3k59l65j05M61O97L25m7P3K88
55178E3772Q9k31j79L3n7k91k28N0J27l5j98l17l87j74M04R42J082J005R95R05
$$ plain form
55158 57307 57827 57831 57420 56671 55708 54983 54929 55333 55544 55287 54837 54426 54036 53758 53818 54101 54188 53933 53584 53346 53276
55137 53276 53593 54516 55743 56575 56667 56264 55699 55148 54849 54993 55326 55359 55059 54854 54916 54970 54825 54593 54295 53795
55117 53795 53203 52851 52790 52777 52817 53198 53929 54634 55074 55315 55345 55079 54724 54578 54425 53780 52795 52257 52542 53207
55097 53207 53777 54270 54729 54877 54584 54166 53905 53753 53695 53906 54326 54592 54590 54572 54531 54083 53188 52415 52179 52280 52492
55076 52492 53012 53943 54879 55474 55935 56543 57098 57289 57212 57113 56959 56681 56494 56572 56750 56881 57171 57782 58409 58647
55056 58647 58502 58225 57901 57562 57392 57476 57557 57401 57143 56997 56902 56765 56785 57169 57693 57912 57653 57099 56541 56251
55036 56251 56329 56512 56343 55721 55033 54602 54364 54280 54591 55335 56006 56099 55712 55249 54839 54455 54298 54585 55136 55583
55016 55583 55847 56047 56112 55921 55680 55709 55925 55923 55574 55151 54904 54829 54933 55357 56105 56927 57582 58081 58527 58834 58799
$$ packed form
55158E7307N20Mm11p49r63p25n4M04K11k57m50m11l90k78O0K83Q7k55l49k38p0
55137E3276L17R23J227Q32R2m03n65n51k99J44L33L3l00k05O2N4j45k32k98n00
55117E3795n92l52o1j3M0L81P31P05M40K41L0k66l55j46j53o45r85n38K85O65
55097E3207N70M93M59J48k93m18k61j52n8K11M20K66kj8m1m48q95p73k36J01K12
55076E2492N20R31R36N95M61O08N55J91p7r9j54k78j87P8J78J31K90O11O27K38
55056E8647j45k77l24l39j70Q4Q1j56k58j46r5j37K0L84N24K19k59n54n58k90
55036E6251P8J83j69o22o88m31k38q4L11P44O71R3l87m63m10l84j57K87N51M47
55016E5583K64K00O5j91k41K9K16kl49m23k47p5J04M24P48Q22O55M99M46L07l5
$$ plain form
54995 58799 58441 58164 58409 59142 59818 59957 59638 59284 59141 59181 59407 59881 60486 60992 61422 62016 62759 63271 63243 62756
54975 62756 62094 61521 61269 61422 61721 61785 61575 61343 61137 60753 60254 60055 60303 60598 60541 60211 59865 59565 59322 59285
54955 59285 59465 59594 59495 59359 59397 59499 59487 59435 59465 59474 59299 58988 58701 58522 58528 58785 59115 59138 58731 58210 57897 57787
54933 57787 57741 57683 57467 56916 56228 55952 56327 56958 57372 57549 57627 57520 57135 56676 56356 56096 55810 55710 55965 56345
54913 56345 56526 56512 56459 56343 56170 56225 56759 57622 58537 59492 60486 61177 61224 60832 60520 60474 60510 60567 60833 61398 62110
54892 62110 62763 63215 63380 63327 63302 63445 63578 63435 62968 62320 61697 61404 61707 62450 63047 63150 63039 63129 63389 63602
54872 63602 63884 64465 65167 65557 65543 65417 65344 65209 64957 64757 64805 65161 65772 66464 66979 67199 67289 67486 67853 68353
54852 68353 68932 69418 69563 69370 69178 69214 69326 69329 69366 69674 70252 71007 71950 73012 73956 74779 75905 77651 79805
$$ packed form
54995E8799l58k77K45P33O76J39l19l54j43M0K26M74O05N06M30N94P43N12k8m87
54975F2756o62n73k52J53K99O4k10k32k06l84m99j99K48K95n7l30l46l00k43l7
54955E9285J80J29r9j36L8J02j2n2L0Rj75l11k87j79OK57L30K3m07n21l13j10
54933E7787m6n8k16n51o88k76L75O31M14J77P8j07l85m59l20k60k86j00K55L80
54913E6345J81j4n3j16j73N5N34Q63R15R55R94O91M7l92l12m6L6N7K66N65P12
54892F2110O53M52J65n3k5J43J33j43m67o48o23k93L03P43N97J03j11R0K60K13
54872F3602K82N81P02L90j4j26p3j35k52k00M8L56O11O92N15K20R0J97L67N00
54852F8353N79M86J45j93j92L6J12LL7L08N78P55R43J062R44Q23J126J746K154
$$ plain form
54833 79805 82070 84626 87836 91590 95362 98707 101355 103062 103814 104018 104059 103775 102704 100701 97991 94839
54817 94839 91554 88613 86312 84393 82410 80316 78346 76530 74781 73272 72275 71685 71139 70528 69984 69519
54801 69519 69118 69067 69724 70986 72444 73956 75645 77427 79028 80458 82004 83766 85628 87720 90416
54786 90416 93787 97406 100718 103332 104995 105661 105608 105149 104284 102905 101179 99312 97076 94083 90507 87048
54770 87048 84170 81800 79691 77625 75303 72635 70195 68808 68563 68672 68413 67736 66863 65867 64843 64055
54754 64055 63639 63509 63640 64083 64554 64501 63785 62914 62393 62204 62097 62021 62026 62060 62107 62258 62468 62508 62321 62129 62102 62215
54732 62215 62515 63132 63826 63994 63390 62529 62083 62135 62306 62302 62049 61555 60997 60758 61038 61523 61739 61630 61584 61915
54712 61915 62531 63095 63318 63145 62746 62344 62048 61920 62127 62798 63728 64494 64923 65229 65626 66091 66610 67333 68290
$$ packed form
54833G9805K265K556L210L754L772L345K648J707P52K04M1k84j071k003k710l152
54817I4839l285k941k301j919j983k094j970j816j749j509r97n90n46o11n44m65
54801F9519m01n1O57J262J458J512J689J782J601J430J546J762J862K092K696
54786I0416L371L619L312K614J663O66n3m59q65j379j726j867k236k993l576l459
54770H7048k878k370k109k066k322k668k440j387k45J09k59o77q73r96j024p88
54754F4055m16j30J31M43M71n3p16q71n21j89j07p6NL4M7J51K10M0j87j92k7J13
54732F2215L00O17O94J68o04q61m46N2J71mk53m94n58k39K80M85K16j09m6L31
54712F1915O16N64K23j73l99m02k96j28K07O71R30P66M29L06L97M65N19P23R57
$$ plain form
54693 68290 69202 69817 70239 70724 71292 71765 72076 72368 72844 73716 75197 77397 80219 83444 86889 90473 94198
54676 94198 98124 102275 106534 110693 114601 118168 121292 123937 126230 128300 129967 130803 130533 129284 127447
54661 127447 125467 123683 122114 120371 118046 115224 112421 109933 107470 104513 100856 96777 92854 89628
54647 89628 87266 85512 84104 83180 82999 83377 83772 83973 84341 85270 86759 88642 90882 93429 96091 98757
54631 98757 101500 104236 106548 108095 108973 109387 109169 107940 105696 102903 100021 97161 94259 91381 88740
54616 88740 86470 84485 82557 80540 78473 76513 74829 73591 72919 72724 72686 72518 72190 71782 71250 70507 69640
54599 69640 68823 68104 67437 66838 66343 65927 65664 65779 66275 66690 66574 66072 65645 65340 64851 64229 63977 64313 64814
54580 64814 64998 64885 64788 64846 64982 65054 64943 64704 64668 65070 65611 65706 65246 64714 64496 64556 64831 65420 66178 66627 66558
$$ packed form
54693F8290R12O15M22M85N68M73L11K92M76Q72J481K200K822L225L445L584L725
54676I4198L926M151M259M159L908L567L124K645K293K070J667Q36k70j249j837
54661A27447j980j784j569j743k325k822k803k488k463k957l657m079l923l226
54647H9628k362j754j408r24j81L78L95K01L68R29J489J883K240K547K662K666
54631I8757K743K736K312J547Q78M14k18j229k244k793k882k860k902k878k641
54616H8740k270j985j928k017k067j960j684j238o72j95l8j68l28m08n32p43q67
54599F9640q17p19o67n99m95m16k63J15M96M15j16n02m27l05m89o22k52L36N01
54580F4814J84j13r7N8J36P2j11k39l6M02N41R5m60n32k18O0K75N89P58M49o9
$$ plain form
54559 66558 66324 66245 66131 65720 65188 64900 64967 65370 66176 67259 68118 68345 68071 67624 67045 66300 65692 65576 65800
54540 65800 65804 65284 64469 63876 63953 64797 65954 66713 66805 66588 66378 65977 65201 64453 64252 64474 64655 64823 65403 66347
54520 66347 67011 67019 66709 66568 66661 66795 66892 66951 66947 66928 66997 67073 66914 66481 66074 65968 66133 66385 66617 66728 66564 66116
54498 66116 65630 65361 65347 65550 66058 66883 67618 67618 66675 65357 64499 64411 64730 65033 65330 65817 66368 66584 66328 65925
54478 65925 65761 65890 66123 66278 66292 66228 66268 66523 66790 66741 66429 66345 66755 67266 67316 66877 66379 66132 66152 66467 67158
54457 67158 68057 68723 68875 68676 68444 68293 68151 68004 67977 68169 68536 68958 69358 69718 69987 70100 70135 70341 70841 71383
54437 71383 71578 71379 71096 70913 70685 70302 69973 69931 70036 69928 69482 68919 68508 68336 68325 68364 68396 68441 68490 68426 68123
54416 68123 67653 67227 66945 66755 66678 66860 67326 67895 68425 68925 69355 69550 69437 69155 68846 68558 68429 68656 69150
$$ packed form
54559F6558k34p9j14m11n32k88O7M03Q06J083Q59K27k74m47n79p45o08j16K24
54540F5800Mn20q15n93P7Q44J157P59R2k17k10m01p76p48k01K22J81J68N80R44
54520F6347O64Ql10j41R3J34R7N9mj9O9P6j59m33m07j06J65K52K32J11j64m48
54498F6116m86k69j4K03N08Q25P35%r43j318q58q8L19L03K97M87N51K16k56m03
54478F5925j64J29K33J55J4o4M0K55K67m9l12q4M10N11N0m39m98k47K0L15O91
54457F7158Q99O66J52j99k32j51j42j47k7J92L67M22M00L60K69J13L5K06N00N42
54437G1383J95j99k83j83k28l83l29m2J05j08m46n63m11j72j1L9L2M5M9o4l03
54416F8123m70m26k82j90p7J82M66N69N30N00M30J95j13k82l09k88j29K27M94
$$ plain form
54397 69150 69507 69513 69387 69339 69206 68807 68362 68225 68391 68626 68919 69439 70151 70814 71276 71513 71486 71261 71165 71500 72140
54376 72140 72704 73074 73443 73920 74393 74763 75012 75014 74592 73851 73211 73016 73273 73782 74333 74692 74628 74116 73461 73080
54356 73080 73127 73329 73272 72863 72483 72504 72783 72845 72548 72233 72167 72216 72247 72448 72944 73411 73474 73256 73183 73393 73685 73895
54334 73895 73972 73819 73443 73137 73167 73360 73390 73356 73624 74163 74491 74360 74118 74247 74826 75550 76018 75969 75469 74921 74693
54313 74693 74729 74770 74823 75091 75510 75749 75728 75728 75894 75998 75849 75598 75445 75333 75178 75146 75467 76045 76492 76486 75983 75200
54291 75200 74502 74241 74531 75174 75755 75872 75390 74639 74248 74582 75374 76067 76444 76714 77097 77625 78315 79142 79825
54272 79825 79960 79538 79049 78934 79169 79540 80038 80755 81582 82299 82876 83449 84021 84440 84688 85037 85781 86893 88019
54253 88019 88832 89347 89853 90603 91640 92899 94326 95855 97413 99006 100714 102529 104312 105890 107056
$$ packed form
54397F9150L57Oj26m8j33l99m45j37J66K35K93N20P12O63M62K37k7k25r6L35O40
54376G2140N64L70L69M77M73L70K49Km22p41o40j95K57N09N51L59o4n12o55l81
54356G3080M7K02n7m09l80K1K79O2k97l15o6M9L1K01M96M67O3k18p3K10K92K10
54334G3895P7j53l76l06L0J93L0l4K68N39L28j31k42J29N79P24M68m9n00n48k28
54313G4693L6M1N3K68M19K39k1%J66J04j49k51j53j12j55l2L21N78M47on03p83
54291G5200o98k61K90O43N81J17m82p51l91L34P92O93L77K70L83N28O90Q27O83
54272G9825J35m22m89j15K35L71M98P17Q27P17N77N73N72M19K48L49P44J112J126
54253H8019Q13N15N06P50J037J259J427J529J558J593J708J815J783J578J166
$$ plain form
54238 107056 107463 106824 105348 103706 102347 101098 99641 98055 96577 95055 93133 90878 88817 87369 86521
54223 86521 85993 85460 84696 83827 83320 83409 83668 83534 83083 82773 82567 81965 80953 80255 80375 80909 81110 80742 80071
54204 80071 79394 78899 78691 78650 78448 77974 77569 77600 78003 78429 78676 78746 78690 78587 78567 78666 78778 78856 78977 79138 79217 79267
54182 79267 79550 80087 80413 80074 79192 78321 77848 77776 77904 78019 78015 78070 78552 79549 80601 81154 81189 81142 81303 81562 81738
54161 81738 81847 81952 81991 81891 81772 81907 82469 83341 84179 84671 84742 84537 84230 83952 83846 84058 84589 85255 85835 86208
54141 86208 86364 86366 86354 86438 86519 86307 85631 84662 83800 83356 83347 83543 83671 83681 83746 84027 84440 84779 84951 85026 85099 85246 85499
54118 85499 85721 85640 85190 84712 84554 84592 84432 84021 83691 83613 83575 83360 83027 82701 82392 82130 82019 82076 82245 82619 83353
54097 83353 84314 85151 85776 86424 87077 87292 86799 85941 85213 84737 84421 84322 84453 84509 84190 83620 83129 82755 82317 81829
$$ packed form
54238A07056M07o39j476j642j359j249j457j586j478j522j922k255k061j448q48
54223H6521n28n33p64q69n07Q9K59j34m51l10k06o02j012o98J20N34K01l68o71
54204H0071o77m95k08m1k02m74m05L1M03M26K47P0n6j03k0R9J12P8J21J61P9N0
54182G9267K83N37L26l39q82q71m73p2J28J15mN5M82R97J052N53L5m7J61K59J76
54161H1738J09J05L9j00j19J35N62Q72Q38M92P1k05l07k78j06K12N31O66N80L73
54141H6208J56Kj2Q4Q1k12o76r69q62m44rJ96J28J0O5K81M13L39J72P5P3J47K53
54118H5499K22q1m50m78j58L8j60m11l30p8l8k15l33l26l09k62j11N7J69L74P34
54097H3353R61Q37O25O48O53K15m93q58p28m76l16r9J31N6l19n70m91l74m38m88
$$ plain form
54077 81829 81471 81254 81020 80790 80746 80945 81283 81739 82350 82946 83225 83104 82782 82450 82132 81860 81732 81756 81776 81661
54057 81661 81395 80970 80360 79657 79102 78886 79022 79411 79951 80527 80993 81256 81348 81396 81542 81850 82247 82562 82706 82820
54037 82820 83180 83894 84748 85363 85565 85564 85722 86143 86541 86587 86303 86044 86137 86641 87368 87986 88168 87837 87304 87012
54017 87012 87128 87487 87861 88098 88065 87733 87329 87126 87052 86821 86492 86562 87277 88133 88398 87993 87594 87842 88623 89174
53997 89174 88866 87875 87005 86818 87069 87200 87192 87530 88386 89339 90056 90785 91846 93048 93962 94602 95435 96843 98848
53978 98848 101288 103995 106900 110158 114123 118999 124621 130704 137134 143772 150098 155339 158902 160500
53964 160500 159961 157210 152500 146487 139973 133591 127693 122428 117908 114273 111495 109220 107029 104918
53950 104918 103273 102292 101735 101337 101159 101328 101739 102269 103052 104246 105708 107209 108781 110575 112508 114354
$$ packed form
54077H1829l58k17k34k30m4J99L38M56O11N96K79j21l22l32l18k72j28K4K0j15
54057H1661k66m25o10p03n55k16J36L89N40N76M66K63R2M8J46L08L97L15J44J14
54037H2820L60P14Q54O15K02jJ58M21L98M6k84k59R3N04P27O18J82l31n33k92
54017H7012J16L59L74K37l3l32m04k03p4k31l29P0P15Q56K65m05l99K48P81N51
53997H9174l08r91q70j87K51J31qL38Q56R53P17P29J061J202R14O40Q33J408K005
53978I8848K440K707K905L258L965M876N622O083O430O638O326N241L563J598
53964A60500n39k751m710o013o514o382n898n265m520l635k778k275k191k111
53950A04918j645r81n57l98j78J69M11N30P83J194J462J501J572J794J933J846
$$ plain form
53934 114354 116081 117812 119559 121295 123146 125234 127367 129206 130695 132117 133741 135629 137682 139665
53920 139665 141249 142283 142970 143584 144138 144561 145054 145905 147040 148090 148933 149824 150977 152294 153560 154633
53904 154633 155361 155528 154976 153664 151580 148752 145377 141767 138139 134525 130870 127124 123325 119746 116808
53889 116808 114660 112923 111098 109138 107402 106102 105104 104247 103560 103129 102960 103036 103294 103495 103320 102689 101848
53872 101848 101085 100464 99893 99332 98889 98760 99045 99580 100035 100239 100339 100521 100736 100821 100767 100686 100609 100509 100461 100618
53852 100618 101102 101988 103263 104669 105790 106500 107159 108176 109571 111131 112824 114756 116929 119339 122126
53837 122126 125325 128571 131416 133838 136178 138730 141723 145473 150130 155396 160914 166856 173644 181190
53823 181190 188905 196474 204080 211843 219539 227079 234776 242894 251210 259164 266098 271239 273822 273483
$$ packed form
53934A14354J727J731J747J736J851K088K133J839J489J422J624J888K053J983
53920A39665J584J034O87O14N54M23M93Q51J135J050Q43Q91J153J317J266J073
53904A54633P28J67n52j312k084k828l375l610l628l614l655l746l799l579k938
53889A16808k148j737j825j960j736j300r98q57o87m31j69P6K58K01j75o31q41
53872A01848p63o21n71n61m43j29K85N35M55K04J00J82K15Q5n4q1p7j00m8J57
53852A00618M84Q86J275J406J121P10O59J017J395J560J693J932K173K410K787
53837A22126L199L246K845K422K340K552K993L750M657N266N518N942O788P546
53823A81190P715P569P606P763P696P540P697Q118Q316P954O934N141K583l39
$$ plain form
53809 273483 270436 265185 258347 250678 242891 235264 227768 220602 214238 208823 203963 199296 194891 190894
53795 190894 187127 183355 179675 176371 173578 171257 169272 167294 164912 162043 159030 156132 153202 150087
53781 150087 147055 144521 142504 140682 138820 136930 135119 133486 132080 130763 129217 127290 125220 123390
53767 123390 121937 120713 119500 118125 116496 114683 112883 111244 109858 108922 108638 108836 109003 108832 108510 108268
53751 108268 107959 107349 106566 105955 105608 105345 105055 104767 104465 104098 103750 103544 103396 103077 102535 101970 101545 101187 100712
53732 100712 100097 99588 99533 100041 100816 101442 101847 102288 102864 103323 103454 103419 103485 103638 103701 103662 103641 103641 103613 103677 104003 104537
53710 104537 105068 105571 106238 107173 108242 109287 110312 111434 112780 114494 116667 119178 121686 123868 125685
53695 125685 127379 129233 131333 133554 135722 137679 139209 140066 140231 140053 139922 139855 139573 138938 138055 137017
$$ packed form
53809B73483l047n251o838p669p787p627p496p166o364n415m860m667m405l997
53795A90894l767l772l680l304k793k321j985j978k382k869l013k898k930l115
53781A50087l032k534k017j822j862j890j811j633j406j317j546j927k070j830
53767A23390j453j224j213j375j629j813j800j639j386r36k84J98J67j71l22k42
53751A08268l09o10p83o11l47k63k90k88l02l67l48k06j48l19n42n65m25l58m75
53732A00712o15n09n5N08P75O26M05M41N76M59J31l5O6J53O3l9k1%k8O4L26N34
53710A04537N31N03O67R35J069J045J025J122J346J714K173K511K508K182J817
53695A25685J694J854K100K221K168J957J530Q57J65j78j31o7k82o35q83j038
$$ plain form
53679 137017 135843 134711 133873 133219 132315 131012 129708 128745 127890 126733 125308 123929 122606 121042 119142
53664 119142 117150 115288 113604 112137 110938 109916 108970 108298 108223 108606 108726 107979 106515 105027 104031 103534
53648 103534 103266 103044 102864 102770 102722 102578 102213 101704 101354 101468 102033 102651 102877 102643 102299 102213 102425 102688 102757 102531
53628 102531 102050 101543 101367 101717 102402 103135 103942 105052 106367 107399 107842 107976 108330 109136 110208 111207 111891
53611 111891 112246 112472 112770 113090 113288 113538 114282 115646 117203 118483 119476 120416 121340 122094 122616 122942 123100 123235
53593 123235 123710 124786 126275 127769 129110 130377 131513 132291 132653 132849 133181 133734 134400 135003 135405 135612 135801
53576 135801 136162 136734 137416 138071 138585 138904 139040 138933 138350 137142 135635 134463 133877 133533 133118 132855 133062 133581
53558 133581 134017 134337 134782 135303 135573 135545 135588 135968 136526 136968 137193 137240 137155 136995 136827 136675 136566 136614 136903 137315
$$ packed form
53679A37017j174j132q38o54r04j303j304r63q55j157j425j379j323j564j900
53664A19142j992j862j684j467j199j022r46o72p5L83J20p47j464j488r96m97
53648A03534k68k22j80r4m8j44l65n09l50J14N65O18K26k34l44q6K12K63O9k26
53628A02531m81n07j76L50O85P33Q07J110J315J032M43J34L54Q06J072R99O84
53611A11891L55K26K98L20J98K50P44J364J557J280R93R40R24P54N22L26J58J35
53593A23235M75J076J489J494J341J267J136P78L62J96L32N53O66O03M02K07J89
53576A35801L61N72O82O55N14L19J36j07n83j208j507j172n86l44m15k63K07N19
53558A33581M36L20M45N21K70k8M3L80N58M42K25M7q5j60j68j52j09M8K89M12
$$ plain form
53538 137315 137634 137762 137692 137398 136955 136637 136630 136735 136686 136670 137143 138158 139251 140060 140684 141334 141998 142655 143496 144670
53518 144670 145998 147181 148116 148844 149321 149514 149682 150287 151593 153426 155378 157186 158898 160707 162639 164527
53502 164527 166255 167956 169856 171985 174235 176624 179360 182580 186143 189723 193075 196256 199611 203439
53488 203439 207587 211526 214916 217904 220682 222971 224316 224712 224538 223857 222257 219505 216003 212367 208850
53473 208850 205420 202154 199283 196920 195006 193439 192115 190872 189571 188236 187029 186086 185413 184934 184553
53458 184553 184227 183984 183867 183861 183904 183922 183835 183565 183099 182517 181906 181347 180970 180906 181073 181219 181322 181723 182609 183584 184069
53437 184069 184015 183859 183858 183918 184038 184461 185238 186105 187028 188434 190614 193217 195682 197991 200593 203713 207036
53420 207036 210113 212820 215423 218379 222078 226633 231851 237407 243041 248561 253832 258833 263673 268504
$$ packed form
53538A37315L19J28p0k94m43l18pJ05m9j6M73J015J093Q09O24O50O64O57Q41J174
53518A44670J328J183R35P28M77J93J68O05J306J833J952J808J712J809J932J888
53502A64527J728J701J900K129K250K389K736L220L563L580L352L181L355L828
53488B03439M148L939L390K988K778K289J345L96j74o81j600k752l502l636l517
53473B08850l430l266k871k363j914j567j324j243j301j335j207r43o73m79l81
53458A84553l26k43j17oM3J8q7k70m66n82o11n59l77o4J67J46J03M01Q86R75M85
53437A84069n4j56jO0J20M23P77Q67R23J406K180K603K465K309K602L120L323
53420B07036L077K707K603K956L699M555N218N556N634N520N271N001M840M831
$$ plain form
53406 268504 273509 278996 285304 292506 300332 308495 316932 325655 334552 343554 352838 362603 372710 382744
53392 382744 392443 401883 411268 420672 430018 439198 448144 456872 465486 474143 482963 491971 501039 509916
53378 509916 518389 526400 533990 541192 548135 555184 562702 570637 578566 586229 593752 601221 608360 614863
53364 614863 620790 626325 631279 635201 637917 639614 640446 640353 639346 637644 635393 632473 628699 624070 618754
53349 618754 613003 607170 601560 596098 590286 583706 576475 569068 561743 554339 546613 538558 530328 522039
53335 522039 513730 505483 497434 489720 482462 475804 469906 464887 460781 457525 454965 452932 451338 450230
53321 450230 449668 449602 449901 450518 451515 452951 454792 457019 459709 462928 466578 470460 474495 478842 483758 489381
53305 489381 495665 502512 509950 518146 527200 536987 547253 557874 568908 580448 592592 605544 619508
$$ packed form
53406B68504N005N487O308P202P826Q163Q437Q723Q897R002R284R765J0107J0034
53392C82744R699R440R385R404R346R180Q946Q728Q614Q657Q820R008R068Q877
53378E09916Q473Q011P590P202O943P049P518P935P929P663P523P469P139O503
53364F14863N927N535M954L922K716J697Q32r3j007j702k251k920l774m629n316
53349F18754n751n833n610n462n812o580p231p407p325p404p726q055q230q289
53335E22039q309q247q049p714p258o658n898n019m106l256k560k033j594j108
53321D50230n62o6K99O17R97J436J841K227K690L219L650L882M035M347M916N623
53305D89381O284O847P438Q196R054R787J0266J0621J1034J1540J2144J2952J3964
$$ plain form
53292 619508 634387 649809 665675 682478 700755 720360 740640 761276 782550 804672 827288
53281 827288 849929 872623 895685 919076 942358 965272 987950 1010450 1032390 1053287 1073060
53270 1073060 1091981 1110202 1127556 1143801 1158801 1172406 1184372 1194540 1203000 1209877 1215058 1218284
53258 1218284 1219413 1218420 1215094 1209022 1199973 1188141 1173886 1157463 1139146 1119474 1099078 1078300
53246 1078300 1057142 1035607 1013854 992009 970055 948050 926376 905574 885905 867133 848782
53235 848782 830624 812869 795815 779382 763140 746814 730617 714987 700164 686218 673294
53224 673294 661564 650921 640964 631422 622445 614406 607525 601721 596730 592250 587984 583614 578787 573263
53210 573263 567162 561009 555376 550406 545770 541112 536494 532333 528965 526309 524024 521934 520269 519393
$$ packed form
53292F19508J4879J5422J5866J6803J8277J9605K0280K0636K1274K2122K2616
53281H27288K2641K2694K3062K3391K3282K2914K2678K2500K1940K0897J9773
53270A073060J8921J8221J7354J6245J5000J3605J1966J0168Q460O877N181L226
53258A218284J129r93l326o072r049j1832j4255j6423j8317j9672k0396k0778
53246A078300k1158k1535k1753k1845k1954k2005k1674k0802j9669j8772j8351
53235H48782j8158j7755j7054j6433j6242j6326j6197j5630j4823j3946j2924
53224F73294j1730j0643r957r542q977q039o881n804m991m480m266m370m827n524
53210E73263o101o153n633m970m636m658m618m161l368k656k285k090j665q76
$$ plain form
53196 519393 519398 520044 521047 522272 523692 525439 527927 531654 536692 542553 548693 554998 561654 568799 576526
53181 576526 585008 594329 604253 614435 624735 635112 645304 654948 663973 672636 681147 689464 697375
53168 697375 704609 710877 716018 720043 722914 724439 724579 723664 722012 719512 715864 711072 705287 698341 689929
53153 689929 680214 669780 658986 647785 636209 624543 612909 601133 589148 577147 565199 553140
53141 553140 540986 529041 517448 506048 494842 484145 473991 463852 453275 442491 432026
53130 432026 422006 412182 402399 392725 383275 374209 365758 358024 350924 344452 338760 333802 329187 324661
53116 324661 320428 316753 313502 310400 307396 304439 301130 297053 292275 287151 281764 276006 270076 264447
53102 264447 259312 254412 249467 244488 239650 235111 230989 227303 223930 220757 217801 215033 212212 209097
$$ packed form
53196E19393NO46J003J225J420J747K488L727N038N861O140O305O656P145P727
53181E76526Q482R321R924J0182J0300J0377J0192R644R025Q663Q511Q317P911
53168F97375P234O268N141M025K871J525J40r15j652k500l648m792n785o946q412
53153F89929r715j0434j0794j1201j1576j1666j1634j1776j1985j2001j1948j2059
53141E53140j2154j1945j1593j1400j1206j0697j0154j0139j0577j0784j0465
53130D32026j0020r824r783r674r450r066q451p734p100o472n692m958m615m526
53116C24661m233l675l251l102l004k957l309m077m778n124n387n758n930n629
53102B64447n135m900m945m979m838m539m122l686l373l173k956k768k821l115
$$ plain form
53088 209097 205754 202399 199066 195678 192338 189274 186526 183920 181291 178525 175542 172453 169654 167506
53074 167506 166004 164972 164348 163982 163368 162038 160143 158189 156290 154142 151789 149822 148635 147905 147084
53059 147084 146096 145213 144534 143858 142970 141809 140441 139060 137946 137267 136939 136763 136623 136438 136039 135253 134141
53042 134141 133050 132364 132186 132254 132174 131706 130880 129870 128888 128114 127612 127251 126894 126701 127018 127888 128883 129587 130047
53023 130047 130574 131285 132077 132869 133593 134117 134459 134948 135841 136831 137296 137027 136386 135728 135047 134246 133420 132638 131704
53004 131704 130382 128806 127474 126825 126869 127205 127412 127373 127162 126709 125841 124752 124082 124241 124894 125452 125900 126675
52986 126675 127864 128993 129683 130061 130419 130812 131164 131483 131800 132102 132443 132876 133184 132980 132217 131340 130759 130387
52968 130387 129898 129228 128571 127985 127259 126193 124854 123583 122738 122404 122332 122211 121968 121691 121367 120901 120357 119935
$$ packed form
53088B09097l343l355l333l388l340l064k748k606k629k766k983l089k799k148
53074A67506j502j032o24l66o14j330j895j954j899k148k353j967j187p30q21
53059A47084r88q83o79o76q88j161j368j381j114o79l28j76j40j85l99p86j112
53042A34141j091o86j78O8q0m68q26j010r82p74n02l61l57j93L17Q70R95P04M60
53023A30047N27P11P92P92P24N24L42M89Q93R90M65k69o41o58o81q01q26p82r34
53004A31704j322j576j332o49M4L36K07l9k11m53q68j089o70J59O53N58M48P75
52986A26675J189J129O90L78L58L93L52L19L17L02L41M33L08k04p63q77n81l72
52968A30387m89o70o57n86p26j066j339j271q45l34p2j21k43k77l24m66n44m22
$$ plain form
52950 119935 119663 119375 119043 118901 119127 119622 120188 120720 121126 121276 121195 121145 121357 121750 122049 122050 121710 121123 120530 120225
52930 120225 120346 120799 121414 122047 122522 122689 122610 122506 122476 122409 122257 122161 122188 122166 121951 121685 121618 121766 121912 121871 121639
52909 121639 121381 121343 121666 122224 122722 123026 123243 123453 123582 123647 123898 124495 125220 125695 125796 125696 125615 125714 126107 126750
52889 126750 127369 127721 127890 128142 128473 128552 128172 127591 127295 127460 127758 127739 127360 127097 127483 128589 130015 131381
52871 131381 132664 134003 135312 136262 136640 136618 136566 136633 136601 136209 135514 134819 134275 133755 133145 132533 131952 131176 130029
52852 130029 128738 127688 126945 126320 125807 125574 125535 125341 124897 124556 124683 125263 126079 126934 127603 127850 127736 127661 127891
52833 127891 128249 128443 128490 128604 128826 128996 128972 128714 128244 127672 127156 126735 126364 126158 126379 127030 127733 128218 128667
52814 128667 129311 129917 129977 129304 128161 126903 125773 124981 124683 124821 125199 125673 126161 126539 126758 126995 127469 128109
$$ packed form
52950A19935k72k88l32j42K26M95N66N32M06J50q1n0K12L93K99Jl40n87n93l05
52930A20225J21M53O15O33M75J67p9j04l0o7j52r6K7k2k15k66o7J48J46m1k32
52909A21639k58l8L23N58M98L04K17K10J29O5K51N97P25M75J01j00q1R9L93O43
52889A26750O19L52J69K52L31P9l80n81k96J65K98j9l79k63L86J106J426J366
52871A31381J283J339J309R50L78k2n2O7l2l92o95o95n44n20o10o12n81p76j147
52852A30029j291j050p43o25n13k33l9j94m44l41J27N80Q16Q55O69K47j14p5K30
52833A27891L58J94M7J14K22J70k4k58m70n72n16m21l71k06K21O51P03M85M49
52814A28667O44O06O0o73j143j258j130p92k98J38L78M74M88L78K19K37M74O40
$$ plain form
52796 128109 128591 128698 128494 128189 128008 128160 128737 129580 130373 130928 131292 131599 131879 131977 131638 130756 129589 128603 127997
52777 127997 127506 126801 125920 125174 124776 124755 125083 125635 126115 126277 126220 126296 126747 127551 128508 129314 129655 129514 129308 129509
52757 129509 130111 130710 131045 131196 131242 131049 130487 129644 128683 127666 126651 125781 125177 124763 124334 123747 123030 122339
52739 122339 121811 121435 121061 120602 120153 119863 119723 119574 119279 118812 118239 117760 117683 118202 119204 120382 121501 122481
52721 122481 123360 124323 125683 127580 129755 131750 133241 134040 133926 132833 131157 129471 127915 126179 124160
52706 124160 122232 120712 119430 118155 117118 116679 116630 116301 115375 114244 113431 112993 112671 112389 112301 112448 112646
52689 112646 112761 112865 113035 113170 113145 113060 113168 113574 114140 114686 115150 115541 115859 116113 116349 116567 116724 116817 116899 116956
52669 116956 116908 116774 116703 116765 116806 116636 116284 115948 115779 115798 115998 116369 116851 117302 117556 117523 117273 117027 116952 116952 116811 116536
$$ packed form
52796A28109M82J07k04l05j81J52N77Q43P93N55L64L07K80R8l39q82j167r86o06
52777A27997m91p05q81p46l98k1L28N52M80J62n7P6M51Q04R57Q06L41j41k06K01
52757A29509O02N99L35J51M6j93n62q43r61j017j015q70o04m14m29n87p17o91
52739A22339n28l76l74m59m49k90j40j49k95m67n73m79p7N19J002J178J119R80
52721A22481Q79R63J360J897K175J995J491P99j14j093j676j686j556j736k019
52706A24160j928j520j282j275j037m39m9l29r26j131q13m38l22k82q8J47J98
52689A12646J15J04J70J35k5q5J08M06N66N46M64L91L18K54K36K18J57R3Q2N7
52669A16956m8j34p1O2M1j70l52l36j69J9K00L71M82M51K54l3k50k46p5%j41k75
$$ plain form
52647 116536 116426 116707 117297 118012 118802 119632 120331 120749 120952 121042 120942 120574 120186 120234 120919 122005 123083 123895 124438
52628 124438 124907 125478 126010 126106 125616 124932 124519 124298 123834 123099 122647 122905 123588 124005 123773 123075 122362 121940 121792
52609 121792 121683 121462 121255 121306 121667 122163 122647 123122 123622 124086 124433 124679 124960 125463 126263 127119 127567 127373 126831
52590 126831 126454 126440 126637 126943 127459 128217 129034 129707 130165 130401 130448 130473 130681 131043 131293 131237 130920 130467 129991 129668
52570 129668 129649 129770 129613 128980 128141 127447 126901 126318 125753 125548 125944 126819 127794 128546 129046 129515 130139 130847 131412
52551 131412 131715 131782 131611 131185 130644 130231 130025 129920 129925 130249 130998 132010 133069 134049 134789 135144 135287 135670 136460
52532 136460 137282 137759 138036 138425 138737 138459 137515 136425 135600 134886 133964 132929 132223 132090 132312 132453 132267 131803
52514 131803 131202 130516 129782 129203 129012 129136 129185 128916 128558 128501 128817 129265 129635 129875 129978 130020 130296 131098 132306
$$ packed form
52647A16536j10K81N90P15P90Q30O99M18K03R0j00l68l88M8O85J086J078Q12N43
52628A24438M69N71N32R6m90o84m13k21m64p35m52K58O83M17k32o98p13m22j48
52609A21792j09k21k07N1L61M96M84M75N00M64L47K46K81N03Q00Q56M48j94n42
52590A26831l77j4J97L06N16P58Q17O73M58K36M7K5K08L62K50n6l17m53m76l23
52570A29668j9J21j57o33q39o94n46n83n65k05L96Q75R75P52N00M69O24P08N65
52551A31412L03O7j71m26n41m13k06j05NL24P49J012J059R80P40L55J43L83P90
52532A36460Q22M77K77L89L12k78r44j090q25p14r22j035p06j33K22J41j86m64
52514A31803o01o86p34n79j91J24M9k69l58n7L16M48L70K40J03M2K76Q02J208
$$ plain form
52495 132306 133430 134095 134297 134176 133819 133393 133169 133241 133396 133465 133625 134132 134913 135676 136298 136809 137020 136523 135217
52476 135217 133605 132374 131791 131597 131413 131059 130582 130153 129968 130113 130457 130749 130899 131118 131727 132855 134294
52459 134294 135629 136497 136749 136454 135789 134978 134300 134022 134192 134528 134631 134362 133926 133570 133305 132987 132534 131981
52441 131981 131373 130751 130251 130095 130432 131195 132131 132949 133480 133743 133886 134089 134487 135120 135851 136369 136441 136170 135901
52422 135901 135805 135704 135399 134998 134790 134915 135323 135983 136918 138061 139279 140506 141715 142760 143444 143739 143752 143464
52404 143464 142738 141679 140743 140309 140252 140138 139730 139141 138534 137928 137341 136910 136722 136659 136627 136856 137698 139037 140172
52385 140172 140511 140239 140025 140187 140480 140655 140817 141044 141075 140701 140206 140095 140511 141231 142116 143205 144436 145617
52367 145617 146700 147798 148893 149756 150216 150272 149984 149451 148922 148619 148435 148027 147265 146354 145493 144696 143957 143321
$$ packed form
52495A32306J124O65K02j21l57m26k24P2J55O9J60N07P81P63O22N11K11m97j306
52476A35217j612j231n83j94j84l54m77m29j85J45L44K92J50K19O09J128J439
52459A34294J335Q68K52k95o65q11o78k78J70L36J03k69m36l56k65l18m53n53
52441A31981o08o22n00j56L37P63R36Q18N31K63J43K03L98O33P31N18P2k71k69
52422A35901r6j01l05m01k08J25M08O60R35J143J218J227J209J045O84K95J3k88
52404A43464p26j059r36m34n7j14m08n89o07o06n87m31j88o3l2K29Q42J339J135
52385A40172L39k72k14J62K93J75J62K27L1l74m95j11M16P20Q85J089J231J181
52367A45617J083J098J095Q63M60N6k88n33n29l03j84m08p62r11q61p97p39o36
$$ plain form
52349 143321 142704 141973 141263 140935 141067 141278 141216 140899 140421 139674 138634 137630 137004 136639 136169 135525 134968 134660
52331 134660 134479 134224 133811 133284 132788 132471 132291 132060 131808 131910 132596 133513 134096 134235 134254 134332 134400 134584 135309 136764
52311 136764 138608 140444 142335 144618 147374 150391 153531 156887 160502 164105 167139 169007 169314 168044
52297 168044 165587 162540 159391 156364 153551 151115 149257 147966 146924 145797 144590 143624 143148 143084 143185
52282 143185 143295 143406 143559 143808 144180 144583 144803 144735 144556 144618 145183 146358 148132 150329 152573 154480 155929
52265 155929 157023 157817 158225 158223 157977 157693 157448 157272 157281 157612 158248 159003 159717 160342 160836 161090 161092 161149 161753 163107
52245 163107 164847 166351 167323 167995 168780 169879 171242 172777 174435 176107 177613 178877 180106 181698 183899
52230 183899 186548 189245 191749 194128 196551 199112 201932 205184 208819 212447 215742 218889 222340 226198
$$ packed form
52349A43321o17p31p10l28J32K11o2l17m78p47j040j004o26l65m70o44n57l08
52331A34660j81k55m13n27m96l17j80k31k52J02O86R17N83J39J9P8O8J84P25J455
52311A36764J844J836J891K283K756L017L140L356L615L603L034J868L07j270
52297A68044k457l047l149l027k813k436j858j291j042j127j207r66m76o4J01
52282A43185J10J11J53K49L72M03K20o8j79O2N65J175J774K197K244J907J449
52265A55929J094P94M08kk46k84k45j76RL31O36P55P14O25M94K54KN7O04J354
52245A63107J740J504R72O72P85J099J363J535J658J672J506J264J229J592K201
52230A83899K649K697K504K379K423K561K820L252L635L628L295L147L451L858
$$ plain form
52216 226198 230126 233868 237528 241282 245150 249180 253577 258501 263956 269953 276498 283315 289963 296477
52202 296477 303529 311645 320521 329482 338348 347389 356579 365429 373602 381271 388743 396098 403286 410270
52188 410270 416916 423021 428609 434014 439430 444590 449044 452684 455790 458633 461232 463466 465270 466674
52174 466674 467723 468442 468829 468869 468550 467907 467041 466055 464920 463422 461352 458849 456475 454844 454116 453926 453856
52157 453856 453945 454671 456477 459354 462962 467033 471550 476487 481612 486695 491758 496965 502329 507785 513409
52142 513409 519277 525093 530338 534867 539093 543425 547802 551920 555653 559018 561953 564373 566301 567748
52128 567748 568623 568969 569069 569093 568793 567792 566030 563686 560850 557607 554262 551139 548195 545134 541874 538613
52112 538613 535520 532686 530270 528324 526544 524622 522819 521728 521412 521238 520748 520181 519904 519745 519311 518684
$$ packed form
52216B26198L928L742L660L754L868M030M397M924N455N997O545O817O648O514
52202B96477P052Q116Q876Q961Q866R041R190Q850Q173P669P472P355P188O984
52188D10270O646O105N588N405N416N160M454L640L106K843K599K234J804J404
52174D66674J049P19L87M0l19o43q66r86j135j498k070k503k374j631p28j90p0
52157D53856Q9P26J806K877L608M071M517M937N125N083N063N207N364N456N624
52142E13409N868N816N245M529M226M332M377M118L733L365K935K420J928J447
52128E67748Q75L46J00K4l00j001j762k344k836l243l345l123k944l061l260l261
52112E38613l093k834k416j946j780j922j803j091l16j74m90n67k77j59m34o27
$$ plain form
52096 518684 518325 518457 518886 519362 519740 519803 519331 518465 517740 517537 517663 517613 517167 516577 516230 516263 516495 516630 516454 515952
52076 515952 515287 514619 513844 512601 510592 507932 505038 502242 499651 497340 495454 494019 492868 491900 491269
52061 491269 491130 491322 491486 491428 491249 491188 491452 492080 492840 493376 493617 493891 494474 495147 495430 495155 494572 493986 493519
52042 493519 493204 493055 493022 493062 493223 493487 493666 493655 493720 494262 495373 496880 498737 501062 503773 506532 509084 511388
52024 511388 513386 514963 516242 517648 519530 521916 524692 527827 531360 535379 540029 545344 551061 556830
52010 556830 562616 568657 575030 581557 588152 594908 601786 608541 615091 621641 628333 635115 642067 649470
51996 649470 657362 665377 673259 681197 689382 697565 705370 712791 720000 726873 733069 738463 743168 747177
51982 747177 750300 752361 753203 752581 750385 746963 742981 738934 734878 730618 725972 720968 715936 711341 707386
$$ packed form
52096E18684l59J32M29M76L78O3m72q66p25k03J26n0m46n90l47L3K32J35j76n02
52076E15952o65o68p75j243k009k660k894k796k591k311j886j435j151r68o31
52061D91269j39J92J64n8j79o1K64O28P60N36K41K74N83O73K83k75n83n86m67
52042D93519l15j49l3M0J61K64J79j1O5N42J111J507J857K325K711K759K552K304
52024E11388J998J577J279J406J882K386K776L135L533M019M650N315N717N769
52010E56830N786O041O373O527O595O756O878O755O550O550O692O782O952P403
51996F49470P892Q015P882P938Q185Q183P805P421P209O873O196N394M705M009
51982G47177L123K061Q42o22k196l422l982m047m056m260m646n004n032m595l955
$$ plain form
51967 707386 703905 700779 698237 696520 695429 694518 693643 692965 692486 691987 691509 691515 692436 694215 696500 699078 701978
51950 701978 705254 708869 712814 717245 722396 728295 734563 740614 746101 751077 755699 759955 763783 767248
51936 767248 770352 772731 773859 773564 772129 769841 766660 762440 757332 751786 746180 740554 734764 728815
51922 728815 722953 717346 711790 705911 699665 693413 687438 681578 675478 669020 662279 655212 647685 639789
51908 639789 631916 624445 617522 611138 605254 599775 594505 589211 583721 578006 572201 566458 560684 554527
51894 554527 547715 540310 532472 524064 514704 504187 492684 480540 468049 455469 443061 431016
51882 431016 419453 408536 398524 389642 381982 375553 370349 366277 363062 360245 357384 354307 351180
51869 351180 348228 345376 342223 338422 333941 328931 323561 318112 313049 308751 305237 302323 299995 298384
$$ packed form
51967G07386l481l126k542j717j091r11q75o78m79m99m78OR21J779K285K578K900
51950G01978L276L615L945M431N151N899O268O051N487M976M622M256L828L465
51936G67248L104K379J128k95j435k288l181m220n108n546n606n626n790n949
51922G28815n862n607n556n879o246o252n975n860o100o458o741p067p527p896
51908F39789p873p471o923o384n884n479n270n294n490n715n805n743n774o157
51894E54527o812p405p838q408r360j0517j1503j2144j2491j2580j2408j2045
51882D31016j1563j0917j0012q882p660o429n204m072l215k817k861l077l127
51869C51180k952k852l153l801m481n010n370n449n063m298l514k914k328j611
$$ plain form
51855 298384 297429 296817 296300 295920 295894 296406 297532 299215 301317 303783 306706 310080 313512 316410 318481 319891
51839 319891 320902 321564 321825 321751 321494 321151 320744 320241 319498 318256 316337 313831 311059 308347 305857 303568
51823 303568 301395 299340 297549 296213 295453 295330 295942 297381 299580 302292 305246 308284 311329 314287 317018
51808 317018 319517 322099 325358 329773 335337 341704 348702 356394 364484 371858 377046 379077 377713 373055
51794 373055 365380 355423 344385 333430 323243 314191 306644 300911 297023 294759 293831 293886 294427 294931 295039
51779 295039 294557 293317 291209 288326 284929 281234 277310 273232 269262 265765 262965 260779 258922 257188
51765 257188 255610 254362 253546 253109 252939 252962 253042 252864 252015 250273 247775 244843 241627 237999 233856 229439
51749 229439 225239 221597 218558 216086 214272 213237 212946 213229 213907 214826 215819 216751 217547 218157 218594 219061 219909
$$ packed form
51855B98384r55o12n17l80k6N12J126J683K102K466K923L374L432K898K071J410
51839C19891J011O62K61p4k57l43m07n03p43j242j919k506k772k712k490k289
51823C03568k173k055j791j336p60j23O12J439K199K712K954L038L045K958K731
51808C17018K499K582L259M415N564O367O998P692Q090P374N188K031j364m658
51794C73055p675r957j1038j0955j0187r052p547n733l888k264r28N5N41N04J08
51779B95039m82j240k108k883l397l695l924m078l970l497k800k186j857j734
51765B57188j578j248q16m37j70K3Q0j78q49j742k498k932l216l628m143m417
51749B29439m200l642l039k472j814j035k91K83O78R19R93R32P96O10M37M67Q48
$$ plain form
51732 219909 221315 223068 224758 226088 226978 227458 227633 227638 227514 227215 226809 226455 226025 224972 222856 219907 216768
51715 216768 213846 211226 209105 207770 207102 206547 205773 205024 204625 204486 204363 204319 204641 205453 206707 208404 210463
51698 210463 212464 213872 214561 214890 215200 215438 215356 214855 214038 213069 212089 211231 210589 210206 210147 210547 211522 213028
51680 213028 214868 216838 218857 220962 223164 225335 227173 228287 228379 227394 225553 223204 220651 218095 215675
51665 215675 213475 211480 209630 207966 206670 205894 205597 205584 205662 205703 205657 205591 205680 206069 206782 207794 209138 210809
51647 210809 212642 214417 216042 217521 218787 219720 220332 220787 221182 221431 221356 220831 219844 218518 217073 215637
51631 215637 214103 212306 210336 208510 207022 205802 204770 204041 203769 203896 204204 204551 204957 205477 206086 206724
51615 206724 207413 208326 209695 211585 213785 215979 218000 219859 221560 222975 223889 224074 223424 222191 221020
$$ packed form
51732B19909J406J753J690J330Q90M80J75Nj24k99m06l54m30j053k116k949l139
51715B16768k922k620k121j335o68n55p74p49l99j39j23m4L22Q12J254J697K059
51698B10463K001J408O89L29L10K38q2n01q17r69r80q58o42l83n9M00R75J506
51680B13028J840J970K019K105K202K171J838J114R2r85j841k349k553k556k420
51665B15675k200j995j850j664j296p76k97j3P8M1m6o6Q9L89P13J012J344J671
51647B10809J833J775J625J479J266R33O12M55L95K49p5n25r87j326j445j436
51631B15637j534j797j970j826j488j220j032p29k72J27L08L47M06N20O09O38
51615B06724O89R13J369J890K200K194K021J859J701J415R14J85o50j233j171
$$ plain form
51600 221020 220530 220815 221498 222258 223066 223880 224391 224281 223555 222464 221240 220067 219138 218459 217633 216082 213610
51583 213610 210603 207597 204746 201827 198733 195757 193295 191364 189667 188133 187119 186919 187306 187824 188392
51568 188392 189253 190448 191742 193130 195003 197583 200522 203306 205804 208183 210499 212699 214899 217348
51554 217348 220152 223262 226661 230358 234212 237988 241548 244776 247299 248504 247923 245501 241596 236875
51540 236875 232214 228389 225719 224075 223208 222919 222932 222864 222486 221862 221138 220305 219262 218003 216567 214887 212895
51523 212895 210728 208694 206965 205446 203988 202613 201443 200485 199657 198992 198678 198786 199098 199352 199636 200384
51507 200384 201909 204015 206153 207909 209325 210801 212779 215494 218945 223033 227718 233001 238723 244376
51493 244376 249119 252099 252863 251563 248796 245239 241446 237918 235171 233589 233255 234020 235672 237978 240681
$$ packed form
51600B21020m90K85O83P60Q08Q14N11j10p26j091j224j173r29o79q26j551k472
51583B13610l007l006k851k919l094k976k462j931j697j534j014k00L87N18N68
51568A88392Q61J195J294J388J873K580K939K784K498K379K316K200K200K449
51554B17348K804L110L399L697L854L776L560L228K523J205n81k422l905m721
51540B36875m661l825k670j644q67k89J3o8l78o24p24q33j043j259j436j680j992
51523B12895k167k034j729j519j458j375j170r58q28o65l14J08L12K54K84P48
51507B00384J525K106K138J756J416J476J978K715L451M088M685N283N722N653
51493B44376M743K980P64j300k767l557l793l528k747j582l34P65J652K306K703
$$ plain form
51478 240681 243625 246881 250562 254522 258449 262217 265912 269443 272430 274687 276666 279282 283384 289544
51464 289544 298140 309358 323073 338900 356359 374878 393752 412337 430332 447671 464070 478837
51452 478837 491175 500514 506442 508507 506350 500035 490062 477052 461554 444167 425656 406763 387996
51439 387996 369772 352655 337276 323917 312344 302117 292932 284590 276832 269447 262467 256089 250378
51426 250378 245246 240681 236835 233787 231359 229276 227415 225832 224580 223602 222799 222126 221584 221107 220555 219905
51410 219905 219379 219205 219266 219238 219097 219212 219758 220289 220235 219603 218844 218205 217581 216970 216563 216350 216089 215794 215820 216268
51390 216268 216662 216469 215646 214417 212785 210634 208118 205621 203380 201383 199563 197875 196269 194757 193447
51375 193447 192374 191403 190465 189739 189413 189348 189186 188726 188053 187397 186968 186814 186705 186347 185854 185816 186662 188159 189812
$$ packed form
51478B40681K944L256L681L960L927L768L695L531K987K257J979K616M102O160
51464B89544Q596J1218J3715J5827J7459J8519J8874J8585J7995J7339J6399J4767
51452D78837J2338R339N928K065k157o315r973j3010j5498j7387j8511j8893j8767
51439C87996j8224j7117j5379j3359j1573j0227r185q342p758p385o980o378n711
51426B50378n132m565l846l048k428k083j861j583j252r78q03o73n42m77n52o50
51410B19905n26j74O1k8j41J15N46N31n4o32p59o39o24o11m07k13k61k95K6M48
51390B16268L94j93q23j229j632k151k516k497k241j997j820j688j606j512j310
51375A93447j073r71r38p26l26o5j62m60o73o56m29j54j09l58m93l8Q46J497J653
$$ plain form
51356 189812 191566 193726 196334 199054 201717 204590 207979 211881 216113 220517 224857 228706 231673 233706
51342 233706 235110 236322 237662 239146 240428 241006 240568 239163 236991 234098 230311 225575 220365 215634 212137
51327 212137 209770 207795 205722 203700 201976 200423 198920 197807 197480 197640 197521 196843 196092 195760 195736 195634
51311 195634 195400 195338 195761 196788 198318 200068 201775 203490 205500 207901 210428 212839 215259 217978 221022
51296 221022 224151 227203 230313 233777 237807 242385 247328 252521 258102 264338 271375 279253 288193 298711
51282 298711 311307 326134 343014 361687 382004 403986 427677 452828 478618 503764 526978
51271 526978 547290 563954 576228 583393 585005 581109 572219 559065 542288 522420 500137 476392
51259 476392 452130 428005 404538 382406 362223 344069 327571 312516 299119 287560 277607 268828
$$ packed form
51356A89812J754K160K608K720K663K873L389L902M232M404M340L849K967K033
51342B33706J404J212J340J484J282N78m38j405k172k893l787m736n210m731l497
51327B12137k367j975k073k022j724j553j503j113l27J60j19o78p51l32k4j02
51311A95634k34o2M23J027J530J750J707J715K010K401K527K411K420K719L044
51296B21022L129L052L110L464M030M578M943N193N581O236P037P878Q940J0518
51282B98711J2596J4827J6880J8673K0317K1982K3691K5151K5790K5146K3214
51271E26978K0312J6664J2274P165J612l896q890j3154j6777j9868k2283k3745
51259D76392k4262k4125k3467k2132k0183j8154j6498j5055j3397j1559r953q779
$$ plain form
51247 268828 260974 253939 247584 241896 237168 233719 231387 229541 227616 225515 223444 221506 219558 217459
51233 217459 215328 213459 211949 210529 208841 206817 204673 202624 200796 199324 198290 197553 196887 196310 196081
51218 196081 196300 196767 197343 198181 199459 201045 202645 204122 205499 206770 207855 208699 209335 209931 210764 211975
51202 211975 213305 214330 215028 215782 216692 217218 216790 215514 213894 212086 209863 207234 204617 202326 200272
51187 200272 198310 196619 195537 195184 195403 195976 196792 197829 198990 199940 200219 199713 198939 198619 198937 199392 199453
51170 199453 199138 198899 199131 199928 201120 202389 203404 204028 204399 204776 205336 206119 207049 207910 208404 208349 207867 207272
51152 207272 206800 206432 205990 205393 204815 204543 204648 204886 204995 205016 205168 205496 205841 206180 206731 207607 208566 209237 209472
51133 209472 209341 208948 208424 207972 207702 207446 206902 205983 204866 203780 202880 202303 202091 202057 201958 201849 201987 202319 202381
$$ packed form
51247B68828p854p035o355n688m728l449k332j846j925k101k071j938j948k099
51233B17459k131j869j510j420j688k024k144k049j828j472j034p37o66n77k29
51218A96081K19M67N76Q38J278J586J600J477J377J271J085Q44O36N96Q33J211
51202B11975J330J025O98P54R10N26m28j276j620j808k223k629k617k291k054
51187B00272j962j691j082l53K19N73Q16J037J161R50K79n06p74l20L18M55O1
51170A99453l15k39K32P97J192J269J015O24L71L77N60P83R30Q61M94n5m82n95
51152B07272m72l68m42n97n78k72J05K38J09K1J52L28L45L39N51Q76R59O71K35
51133B09472j31l93n24m52k70k56n44r19j117j086r00n77k12l4r9j09J38L32O2
$$ plain form
51114 202381 201950 201564 202052 203644 205791 207825 209489 210900 212334 214106 216351 218768 220831 222323 223451
51099 223451 224328 224674 224271 223426 222599 221753 220467 218639 216689 214997 213549 212313 211620 211838 212815 213936
51083 213936 214727 215176 215509 215861 216260 216713 217136 217255 216825 215961 215098 214500 213996 213345 212709 212423 212370 211988 211064
51064 211064 210147 209877 210194 210544 210674 210792 211000 211026 210603 209793 208832 207903 207148 206636 206251 205847 205603 205963 207103
51045 207103 208707 210415 212190 214082 215854 217116 217698 217696 217274 216606 215855 214998 213823 212280 210701 209448
51029 209448 208517 207746 207254 207322 207886 208483 208752 208751 208707 208724 208850 209174 209710 210292 210730 211013 211258 211539 211821 212061
51009 212061 212313 212750 213553 214732 216072 217375 218716 220342 222284 224171 225517 226135 226258 226265 226313 226185 225566
50992 225566 224468 223338 222662 222482 222410 222061 221377 220536 219748 219169 218853 218656 218319 217760 217207 216895 216720 216368
$$ packed form
51114B02381m31l86M88J592K147K034J664J411J434J772K245K417K063J492J128
51099B23451Q77L46m03q45q27q46j286j828j950j692j448j236o93K18R77J121
51083B13936P91M49L33L52L99M53M23J19m30q64q63n98n04o51o36k86n3l82r24
51064B11064r17k70L17L50J30J18K08K6m23q10r61r29p55n12l85m04k44L60J140
51045B07103J604J708J775J892J772J262N82km22o68p51q57j175j543j579j253
51029B09448r31p71m92O8N64N97K69jm4J7J26L24N36N82M38K83K45K81K82K40
51009B12061K52M37Q03J179J340J303J341J626J942J887J346O18J23PM8j28o19
50992B25566j098j130o76j80p2l49o84q41p88n79l16j97l37n59n53l12j75l52
$$ plain form
50974 216368 215810 215438 215599 216156 216747 217356 218372 219995 221870 223469 224668 225730 226830 227900 228929 230137
50958 230137 231743 233789 236279 239307 242901 246886 251058 255440 260258 265767 272131 279322 286985 294512
50944 294512 301402 307490 312736 316944 319848 321351 321489 320257 317695 314106 309919 305301 300101 294282
50930 294282 288249 282657 277944 274134 271062 268701 267227 266751 267091 267896 268970 270319 271922 273702 275835
50915 275835 278829 282984 287913 292896 297670 302614 308195 314521 321473 328940 336744 344569 352156 359518
50901 359518 366848 374304 381965 389864 397970 406184 414442 422744 430999 438930 446206 452620 458091 462584
50887 462584 466177 469138 471821 474440 476990 479386 481618 483774 485974 488291 490733 493307 496201 499977
50873 499977 505509 513607 524593 538230 554135 572222 592676 615517 640349 666593 693895 722181
$$ packed form
50974B16368n58l72J61N57N91O09J016J623J875J599J199J062J100J070J029J208
50958B30137J606K046K490L028L594L985M172M382M818N509O364P191P663P527
50944B94512O890O088N246M208K904J503J38j232k562l589m187m618n200n819
50930B94282o033n592m713l810l072k361j474m76L40Q05J074J349J603J780K133
50915B75835K994M155M929M983M774M944N581O326O952P467P804P825P587P362
50901C59518P330P456P661P899Q106Q214Q258Q302Q255P931P276O414N471M493
50887D62584L593K961K683K619K550K396K232K156K200K317K442K574K894L776
50873D99977N532Q098J0986J3637J5905J8087K0454K2841K4832K6244K7302K8286
$$ plain form
50861 722181 751305 780751 809678 837267 863024 886788 908423 927577 943805 956930 967122
50850 967122 974576 979299 981357 981238 979778 977745 975577 973441 971376 969246 966638 962872 957280 949632
50836 949632 940356 930175 919442 907910 895173 881103 865765 849142 831238 812268 792422 771553
50824 771553 749410 726193 702572 679132 656074 633500 611686 590919 571304 552914 535969
50813 535969 520678 507003 494705 483553 473427 464271 456037 448614 441788 435411 429589 424591 420511
50800 420511 417148 414266 411763 409562 407550 405780 404533 403997 403986 404159 404435 405015 406058 407492 409157 410978
50784 410978 413022 415429 418269 421427 424704 428107 431929 436416 441482 446912 452722 459084 465952 473068
50770 473068 480423 488465 497670 508037 519254 531263 544444 559195 575552 593407 613007 635038
$$ packed form
50861G22181K9124K9446K8927K7589K5757K3764K1635J9154J6228J3125J0192
50850I67122P454M723K058j19j460k033k168k136k065k130k608l766n592p648
50836I49632r276j0181j0733j1532j2737j4070j5338j6623j7904j8970j9846k0869
50824G71553k2143k3217k3621k3440k3058k2574k1814k0767j9615j8390j6945
50813E35969j5291j3675j2298j1152j0126r156q234p423o826o377n822m998m080
50800D20511l363k882k503k201k012j770j247n36j1J73K76N80J043J434J665J821
50784D10978K044K407K840L158L277L403L822M487N066N430N810O362O868P116
50770D73068P355Q042R205J0367J1217J2009J3181J4751J6357J7855J9600K2031
$$ plain form
50758 635038 660158 688585 720246 755192 793727 836137 882432 932434 986031 1043268 1104108
50747 1104108 1168136 1234479 1302070 1370026 1437717 1504428 1568966 1629698 1684951 1733343 1773827
50736 1773827 1805668 1828553 1842696 1848698 1847287 1839184 1825244 1806686 1785123 1762255 1739487 1717859
50724 1717859 1698268 1681526 1667984 1657194 1648133 1639712 1630883 1620384 1606787 1589045 1566788 1539907
50712 1539907 1508092 1471046 1429070 1383050 1333851 1281988 1228030 1173094 1118686 1066090 1016103
50701 1016103 969328 926422 887854 853571 823143 796297 773143 753861 738367 726409 717802
50690 717802 712357 709633 708974 709768 711513 713698 715845 717712 719238 720224 720287 719202 717135 714371 710977
50675 710977 706839 701930 696321 690030 683030 675413 667402 659113 650412 641002 630668 619495 607939
$$ packed form
50758F35038K5120K8427L1661L4946L8535M2410M6295N0002N3597N7237O0840
50747A104108O4028O6343O7591O7956O7691O6711O4538O0732N5253M8392M0484
50736A773827L1841K2885J4143O002j411q103j3940j8558k1563k2868k2768k1628
50724A717859j9591j6742j3542j0790r061q421q829j0499j3597j7742k2257k6881
50712A539907l1815l7046m1976m6020m9199n1863n3958n4936n4408n2596m9987
50701A016103m6775m2906l8568l4283l0428k6846k3154j9282j5494j1958q607
50690G17802n445k724o59P94J745K185K147J867J526R86O3j085k067k764l394
50675G10977m138m909n609o291p000p617q011q289q701r410j0334j1173j1556
$$ plain form
50662 607939 596648 586161 576734 568425 561247 555178 550115 545947 542729 540711 540219 541455 544342 548529
50648 548529 553634 559540 566471 574794 584820 596775 610795 626870 644897 664926 687307 712485
50636 712485 740698 771936 806101 843034 882329 923258 964907 1006410 1047056 1086309 1123771
50625 1123771 1159103 1191885 1221455 1246875 1267129 1281481 1289664 1291730 1287785 1278063 1263255 1244563
50613 1244563 1223315 1200716 1177999 1156589 1137716 1121877 1108908 1098553 1090730 1085159 1081050 1077401
50601 1077401 1073493 1068884 1062956 1054709 1043131 1027655 1008238 985128 958756 929831 899383 868539
50589 868539 838223 809094 781723 756732 734673 715783 699958 687010 676969 670068 666500 666287
50577 666287 669363 675690 685121 697271 711658 727972 746024 765419 785486 805594 825321 844209
$$ packed form
50662F07939j1291j0487r427q309p178o069n063m168l218k018m92J236K887M187
50648E48529N105N906O931Q323J0026J1955J4020J6075J8027K0029K2381K5178
50636G12485K8213L1238L4165L6933L9295M0929M1649M1503M0646L9253L7462
50625A123771L5332L2782K9570K5420K0254J4352Q183K066l945r722j4808j8692
50613A244563k1248k2599k2717k1410j8873j5839j2969j0355p823n571m109l649
50601A077401l908m609n928q247j1578j5476j9417k3110k6372k8925l0448l0844
50589H68539l0316k9129k7371k4991k2059j8890j5825j2948j0041o901l568k13
50577F66287L076O327R431J2150J4387J6314J8052J9395K0067K0108J9727J8888
$$ plain form
50565 844209 861612 877041 890515 902246 912100 919693 925050 928808 931628 933671 934786 934894 934008 932052
50551 932052 928988 925042 920617 916053 911646 907853 905284 904477 905818 909537 915642 923885 934032 946161
50537 946161 960452 976623 993829 1011264 1028683 1046200 1063737 1081036 1098190 1115839 1134588
50526 1134588 1154281 1173808 1191338 1204529 1210816 1208171 1196096 1175952 1150317 1122047 1093732 1067408
50514 1067408 1044242 1024419 1007589 993472 981967 972849 965708 960206 956141 953194 950811 948404 945451
50501 945451 941332 935247 926488 914663 899667 881614 860972 838582 815336 791907 768857 746816
$$ packed form
50565H44209J7403J5429J3474J1731R854P593N357L758K820K043J115J08q86j956
50551I32052l064l946m425m564m407l793k569q07J341L719O105Q243J0147J2129
50537I46161J4291J6171J7206J7435J7419J7517J7537J7299J7154J7649J8749
50526A134588J9693J9527J7530J3191O287k645j2075k0144k5635k8270k8315k6324
50514A067408k3166j9823j6830j4117j1505r118p141n502m065k947k383k407k953
50501I45451m119o085q759j1825j4996j8053k0642k2390k3246k3429k3050k2041
$$ [...]
##END NTUPLES=NMR SPECTRUM
##END=
