##TITLE=AC1526_ROEFFECT0006_8213789_DTOzV0TmO8
##JCAMPDX= 6.0         $$ Bruker NMR JCAMP-DX V2.0
##DATA TYPE= NMR SPECTRUM
##DATA CLASS= NTUPLES
##ORIGIN= BRUKER
##OWNER= Administrator
$$ 1.72 TOPSPIN		Version 2.1
$$ 2013-10-04 18:52:57.383 -0700  Administrator@X
$$ Compression mode = diff/dup
##.OBSERVE FREQUENCY= 400.02188249412
##.OBSERVE NUCLEUS= ^1H
##.ACQUISITION MODE= SIMULTANEOUS (DQD)
##.ACQUISITION SCHEME= undefined
##.AVERAGES= 8
##.DIGITISER RES= 22
##SPECTROMETER/DATA SYSTEM= spect
##.PULSE SEQUENCE= zg30
##.SOLVENT NAME= COFFEE_meoh
##.SHIFT REFERENCE= INTERNAL, COFFEE_meoh, 1, 14.98509
##AUDIT TRAIL= $$ (NUMBER, WHEN, WHO, WHERE, PROCESS, VERSION, WHAT)
$$ ##TITLE= Audit trail, TOPSPIN		Version 2.1
$$ ##JCAMPDX= 5.01
$$ ##ORIGIN= Bruker BioSpin GmbH
$$ ##OWNER= Administrator
$$ $$ E:\/data/COFFEE/nmr/AC1526_ROEFFECT0006_8213789_DTOzV0TmO8/10/pdata/1/auditp.txt
$$ ##AUDIT TRAIL=  $$ (NUMBER, WHEN, WHO, WHERE, PROCESS, VERSION, WHAT)
(   1,<2013-10-04 18:52:51.180 -0700>,<Administrator>,<X>,<go>,<TOPSPIN 2.1>,
      <created by zg
	started at 2013-10-04 18:51:45.508 -0700,
	POWCHK enabled, PULCHK disabled,
       configuration hash MD5:
       C8 4E 4E 5D D3 5C D8 9E 9F 52 82 E0 59 8A DE 15
       data hash MD5: 64K
       82 3F EB BB 20 93 BD C3 1F 7B 60 DE 47 A2 BB A2>)
(   2,<2013-10-04 18:52:53.977 -0700>,<Administrator>,<X>,<proc1d>,<TOPSPIN 2.1>,
      <Start of raw data processing
       efp LB = 0 FT_mod = 6 PKNL = 1 PHC0 = 0 PHC1 = 0 SI = 32K 
       data hash MD5: 32K
       52 62 71 0C F3 DE 84 E4 64 43 2D A9 95 A7 4B 3E>)
(   3,<2013-10-04 18:52:54.258 -0700>,<Administrator>,<X>,<proc1d>,<TOPSPIN 2.1>,
      <pk PHC0 = 93.76831 PHC1 = 0 
       data hash MD5: 32K
       8B BF F4 20 44 6C 71 B8 2A 42 40 49 36 FA DF 58>)
(   4,<2013-10-04 18:52:54.336 -0700>,<Administrator>,<X>,<proc1d>,<TOPSPIN 2.1>,
      <abs ABSG = 1 
       data hash MD5: 32K
       B2 09 D8 2D C0 82 59 38 A1 62 C8 0D A7 1B 0D 5B>)
(   5,<2013-10-04 18:52:54.414 -0700>,<Administrator>,<X>,<proc1d>,<TOPSPIN 2.1>,
      <abs ABSG = 2 
       data hash MD5: 32K
       A5 6F D3 13 C0 44 E7 51 DC A9 E5 AA 53 E2 92 D8>)
(   6,<2013-10-04 18:52:54.461 -0700>,<Administrator>,<X>,<proc1d>,<TOPSPIN 2.1>,
      <abs ABSG = 3 
       data hash MD5: 32K
       A7 34 62 8D 2F 90 32 F8 D9 1D 95 24 A9 AD 92 36>)
(   7,<2013-10-04 18:52:54.508 -0700>,<Administrator>,<X>,<proc1d>,<TOPSPIN 2.1>,
      <abs ABSG = 4 
       data hash MD5: 32K
       FE D3 B0 4A 78 D7 66 DC 7E 17 B6 23 ED 77 9B D3>)
(   8,<2013-10-04 18:52:54.570 -0700>,<Administrator>,<X>,<proc1d>,<TOPSPIN 2.1>,
      <abs ABSG = 5 
       data hash MD5: 32K
       D8 35 AD 31 C2 BA 4F 68 28 91 E3 0A 09 9B FF 42>)
$$ ##END=
$$ 
$$ $$ hash MD5
$$ $$ AC 97 F4 A1 71 73 B0 CA A0 60 9A 7E A8 1D CC D9
##$RELAX= 
##$RELAX= 
##$RELAX= 
##$RELAX= 
##$RELAX= 
##$RELAX= 
##$RELAX= 
$$ Bruker specific parameters
$$ --------------------------
##$DU= <E:\>
##$EXPNO= 10
$$ [...]
##$TP= (0..7)
150 150 150 150 150 150 150 150
##$TP07= 0
##$TPNAME0= <>
##$TPNAME1= <>
##$TPNAME2= <>
##$TPNAME3= <>
##$TPNAME4= <>
##$TPNAME5= <>
##$TPNAME6= <>
##$TPNAME7= <>
##$TPOAL= (0..7)
0.5 0.5 0.5 0.5 0.5 0.5 0.5 0.5
##$TPOFFS= (0..7)
0 0 0 0 0 0 0 0
##$TUNHIN= 0
##$TUNHOUT= 0
##$TUNXOUT= 0
##$USERA1= <user>
##$USERA2= <user>
##$USERA3= <user>
##$USERA4= <user>
##$USERA5= <user>
##$V9= 5
##$VALIST= <valist>
##$VCLIST= <CCCCCCCCCCCCCCC>
##$VD= 0
##$VDLIST= <DDDDDDDDDDDDDDD>
##$VPLIST= <PPPPPPPPPPPPPPP>
##$VTLIST= <TTTTTTTTTTTTTTT>
##$WBST= 2048
##$WBSW= 25
##$XGAIN= (0..3)
0 0 0 0
##$XL= 0
##$YL= 0
##$YMAX_a= 642274
##$YMIN_a= -540698
##$ZGOPTNS= <>
##$ZL1= 120
##$ZL2= 120
##$ZL3= 120
##$ZL4= 120
##$ABSF1= 14.98509
##$ABSF2= -5.573092
##$ABSG= 5
##$ABSL= 3
##$ALPHA= 0
##$AQORDER= 0
##$ASSFAC= 0
##$ASSFACI= 0
##$ASSFACX= 0
##$ASSWID= 0
##$AUNMP= <proc_prof1d_extract_pilot.lims>
##$AXLEFT= 0
##$AXNAME= <>
##$AXNUC= <1H>
##$AXRIGHT= 0
##$AXTYPE= 0
##$AXUNIT= <>
##$AZFE= 0.1
##$AZFW= 0.1
##$BCFW= 0
##$BC_mod= 0
##$BYTORDP= 0
##$COROFFS= 0
##$CY= 15
##$DATMOD= 1
##$DC= 0
##$DFILT= <>
##$DTYPP= 0
##$F1P= 0
##$F2P= 0
##$FCOR= 0.5
##$FTSIZE= 32768
##$FT_mod= 6
##$GAMMA= 0
##$GB= 0
##$INTBC= 1
##$INTSCL= 1
##$ISEN= 128
##$LB= 0
##$LEV0= 0
##$LPBIN= 0
##$MAXI= 10000
##$MC2= 0
##$MEAN= 0
##$ME_mod= 0
##$MI= 0
##$NCOEF= 0
##$NC_proc= -8
##$NLEV= 6
##$NOISF1= 0
##$NOISF2= 0
##$NSP= 0
##$NTH_PI= 0
##$NZP= 0
##$OFFSET= 14.98509
##$PC= 1
##$PHC0= 93.76831
##$PHC1= 0
##$PH_mod= 1
##$PKNL= yes
##$PPARMOD= 0
##$PPDIAG= 0
##$PPIPTYP= 0
##$PPMPNUM= 2147483647
##$PPRESOL= 1
##$PSCAL= 4
##$PSIGN= 0
##$PYNMP= <proc.py>
##$REVERSE= no
##$SF= 400.02
##$SI= 32768
##$SIGF1= 0
##$SIGF2= 0
##$SINO= 400
##$SIOLD= 32768
##$SPECTYP= <>
##$SREGLST= <1H.CDCl3>
##$SSB= 0
##$STSI= 32768
##$STSR= 0
##$SW_p= 8223.68421052631
##$SYMM= 0
##$S_DEV= 0
##$TDeff= 65536
##$TDoff= 0
##$TI= <>
##$TILT= no
##$TM1= 0
##$TM2= 0
##$TOPLEV= 0
##$USERP1= <user>
##$USERP2= <user>
##$USERP3= <user>
##$USERP4= <user>
##$USERP5= <user>
##$WDW= 1
##$XDIM= 32768
##$YMAX_p= 445212108
##$YMIN_p= -740714
##$CURPLOT= <Network HP LaserJet P1505>
##$CURPRIN= <$Network HP LaserJet P1505>
##$DFORMAT= <normdp>
##$LAYOUT= <+/1D_H.xwp>
##$LFORMAT= <normlp>
##$PFORMAT= <normpl>
##$SURQMSG= 1
$$ End of Bruker specific parameters
$$ ---------------------------------
##NTUPLES= NMR SPECTRUM
##VAR_NAME=  FREQUENCY,     SPECTRUM/REAL,   SPECTRUM/IMAG
##SYMBOL=    X,             R,               I
##VAR_TYPE=  INDEPENDENT,   DEPENDENT,       DEPENDENT
##VAR_FORM=  AFFN,          ASDF,            ASDF
##VAR_DIM=   32768,         32768,           32768
##UNITS=     HZ,            ARBITRARY UNITS, ARBITRARY UNITS
##FACTOR=    0.250966925370066, 1,           1
##FIRST=     8223.43324360094, 97294,        -3133
##LAST=      0,             155605,          -87901
##MIN=       0,             -740714,         0
##MAX=       8223.43324360094, 445212108,    0
$$ Real data points
##PAGE= N=1
##DATA TABLE= (X++(R..R)), XYDATA
$$ [...]
19504d3535j19348j41064J01402A61927a95470k05245a08155k8165A36784h3068
19493C8723a28375a7717A17445b51085k5872M3582I9464k3540i0555A36816c22112
19481e6483B2104n371a74038D2576a36653A10531g0676o2029m7416N5758B04384
19469B0343N1468h0862A56958a80494e9051K3672A68618B8627i1431d1013B9141
19457a71093B36254b46520I0548a14482l59044C070a83258k90976I6091b78123
19446b0461A91202a59146D7905K1102P1742r531b83352b1890j72256Q4946A79725
19434c07101j28298a45422R610F6141J41039c59387J46561E8708M9912L3214h206
19422a11636L2114A4801c5652B72138A5934P6226a9199o7078j41654e9649e979
$$ y = [-43535, -162883, -303947, -202545, 161927, -195470, -400715, -108155, -136320, 136784, -83068, 38723, -128375, -17717, 117445, -251085, -276957, -233375, 99464, 75924, -90555, 136816, -322112, -56483, 22104, 16733, -174038, 42576, -136653, 110531, -70676, -132705, -180121, -124363, 204384, 20343, 71811, -80862, 156958, -180494, -59051, -35379, 168618, 28627, -91431, -41013, 29141, -171093, 236254, -246520, 90548, -114482, -473526, 3070, -183258, -474234, 96091, -278123, -20461, 191202, -159146, 47905, 69007, 140749, 131218, -283352, -21890, -194146, -109200, 179725, -307101, -435399, -145422, -135812, 66141, 207180, -359387, -212826, 58708, 108620, 141834, -8206, -111636, -79522, 14801, -35652, 272138, 15934, 92160, -19199, -86277, -227931, -59649, -5979]
19410b5817K291A2485b38854D1203J5399a81596h4946j68528a11910k01995B53656
19398a35746E4112a9774F1779B0633a92003g9748B9047b75324l8300F4798J1236
19387G6034b65780J1412A71546a39797K2283N0298A314a64997e3649b2351m58002
19376d80353B7974d3134G3712K5728a45169l23715A70078b4474j09084b9236B33204
19364i9987B575J5113e6742j00311c9237B10640a61931E7618b83146Q3278i3751
19352g7845A07515a20891j1063A89647a26546A14361b4596k98069a42883d4700
19341b68014M6576b0165B5163j1996e949A95739K5399a9467k57178Q2868A40013
19329F1632J09353g0659B5911b54408N4093D9979c03743d4593j96093E5043a85046
$$ y = [-25817, -23526, 12485, -238854, 41203, 56602, -181596, -84946, -253474, -111910, -313905, 253656, -135746, 54112, -19774, 61779, 20633, -192003, -79748, 29047, -275324, -313624, 64798, 76034, -265780, -254368, 171546, -139797, -117514, -67216, 1314, -164997, -53649, -22351, -480353, 27974, -43134, 73712, 99440, -145169, -468884, 170078, -24474, -133558, -29236, 233204, -99987, 2575, 17688, -56742, -157053, -39237, 210640, -161931, 57618, -283146, -199868, -93751, -77845, 107515, -120891, -131954, 189647, -126546, 114361, -24596, -322665, -142883, -44700, -268014, -221438, -20165, 25163, 13167, -5949, 195739, 221138, -19467, -276645, -193777, 140013, 61632, 170985, -70659, 25911, -254408, -200315, 49979, -303743, -44593, -240686, 55043, -185046]
19317H6570C5794b26225e4084A6857M8242J0387K13137A20238o0115A260b77469
19305a83689r6304d5348J3655n1186A11305D9074f9060K9107Q615j13097j47662
19294b92097B06284c7295B12254a95039B79939a11714C0443a49809B33458J81258
19284D14716A19157B834J51099b21354l09301a6663p2712A47512l0850g5464B25961
19272H3808e8333D1855b2000k93772J49465J5920N349L7614B3363a03514F7349
19260b73233F3878B5981P2689a57805P3753n20723a03339A01803a87390B89215
19249c8822A99243a84709A54579G2259a55828k50387J55744J05336m2013A20983
19238f4883B9388A591d25665g5215a6011A7358b06667A56044a48877m1635G6399
$$ y = [86570, 35794, -226225, -54084, 16857, 65099, 75486, 288623, 120238, 60123, 1260, -277469, -183689, -279993, -45348, -31693, -82879, 111305, 49074, -69060, -39953, -31338, -144435, -292097, 206284, -37295, 212254, -195039, 279939, -111714, 30443, -149809, 233458, 414716, 119157, 2834, 153933, -221354, -530655, -16663, -89375, 147512, 116662, -75464, 225961, 83808, -58333, 41855, -22000, -315772, -166307, -150387, -145038, -107424, 23363, -103514, 67349, -273233, 63878, 25981, 98670, -157805, -84052, -604775, -103339, 101803, -187390, 289215, -38822, 199243, -184709, 154579, 72259, -155828, -406215, -250471, -145135, -187148, 120983, -64883, 29388, 1591, -425665, -75215, -16011, 17358, -206667, 156044, -148877, -190512, 76399]
19226B3941h375D0365f6074A27826g0303l2612r8680B46216d26651m9249i8967
19214a05082A1860a77019q981A76266N4257A11704A6153c8145B3088a94640j41218
19203c35858a6566j11374k17266H7906c1461G8406A9648K8522c40654D8765L0220
19192G8985b16799C5275j0645L3319a54341r0768M6046j70142i1766q5736A21929
19180a76632D2886a80418L178O1722A64815b74498j5519C68848c193k87517F2315
19168b50487r8394g0296I6034a29084j05243g356B92076a75832n9148j29716A30387
19156h3601j42465E1706R8994a26873A0895K6842M6043a62993b4018A55722J1788
19145A67510A4822J5144a85080e8591A73289a9879A72601g9952B14810c7073j05572
$$ y = [23941, -8375, 40365, -66074, 127826, -70303, -102915, -201595, 246216, -426651, -475900, -98967, -105082, 11860, -177019, -186000, 176266, 230523, 111704, 16153, -38145, 23088, -194640, -335858, -16566, -127940, -345206, 87906, -31461, 78406, 19648, 48170, -340654, 48765, 78985, -216799, 35275, 24630, 57949, -154341, -245109, -199063, -369205, -91766, -177502, 121929, -176632, 42886, -180418, -177240, -115518, 164815, -274498, -290017, 368848, -3193, -290710, 62315, -250487, -348881, -70296, 96034, -129084, -234327, -7356, 292076, -175832, -234980, -364696, 130387, -83601, -226066, 51706, 150700, -126873, 10895, 37737, 83780, -162993, -24018, 155722, 167510, 14822, 29966, -185080, -58591, 173289, -19879, 172601, -79952, 214810, -37073, -142645]
19134a42645d1634D1771j7408r793J65558N8730b65866c5749D4184K6809a12423
19122E6054k4808a57778N9221j25211h7510A15872b53676J00477n0636r110M717
19111b08228a6681b127j17931L2188P918J1882j32211i0753B4301O667G648a10305
19098a80481e0179g956k9548j55374j14428J23459N0065A27903j4598b00171f792
19086h8239d2149n8928D6754J9690a70317Q3240d116l34801H2068a17279j07638
19075b24917B89364b77798A41325a34568C51399a7213k87008a51660l30669A05777
19064a01910j67493i5301H2461M087c91j22439A20149d6566A91338a74689L7714
19053a36975I1839b21520B31034K39405a28658C6665a71856R714b8150A62322
$$ y = [-142645, -41634, 41771, 24363, 14570, 180128, 238858, -265866, -35749, 44184, 70993, -112423, 56054, 31246, -157778, -98557, -223768, -87510, 115872, -253676, -153199, -203835, -212945, -208228, -16681, -2127, -120058, -87870, -79952, -68070, -200281, -90753, 24301, 30968, 7648, -110305, -180481, -50179, -7956, -37504, -192878, -307306, -183847, -133782, 127903, 113305, -200171, -6792, -88239, -42149, -101077, 46754, 66444, -170317, -87077, -4116, -338917, 82068, -117279, -224917, 289364, -277798, 141325, -134568, 351399, -17213, -304221, -151660, -482329, 105777, -101910, -269403, -95301, 82461, 86548, -391, -122830, 120149, -46566, 191338, -174689, -136975, 91839, -221520, 231034, 470439, -128658, 36665, -171856, -162142, -28150, 162322]
19042A29996a71515l0764f6662A24606M741g5385c3553j47253g8274c0261A35767
19030d1552f415B08871p6438J96274i0950m62l7880A5080c11583F3831B3770m891
19018A8879c31577A61124a77812A72175a76121e6431A7258P8818m1303J88001
19008B42774C2821P9553a39034O4384b9684j1090l2909j03375c2340k08882a6604
18996a44593A41849C2335P5131m484J46396a46607e6576l03623b3777B82377r8585
18985A83792c3346j92820E3488d7218j17279I8592a74888G1526a26242D4409Q2333
18974A26742B5164b7986l30533a10166A30804d3132a2299j59075o8037j0717E5664
18962a22483l61317J0442K22698E2615P05N0940c21188A3148e2927j74385f8402
$$ y = [129996, -171515, -202279, -66662, 124606, 129347, -75385, -33553, -180806, -78274, -30261, 135767, -41552, -6415, 208871, 132433, 328707, -90950, -91412, -129292, 15080, -311583, 63831, 23770, 18879, -331577, 161124, -177812, 172175, -176121, -56431, 17258, 96076, 54773, 242774, 32821, 112374, -139034, -74650, -29684, -40774, -73683, -177058, -32340, -241222, -16604, -144593, 141849, 32335, 107466, 102982, 249378, -146607, -56576, -360199, -23777, 282377, 183792, -33346, -226166, 53488, -47218, -164497, 98592, -174888, 71526, -126242, 44409, 126742, 25164, -27986, -358519, -110166, 130804, -43132, -12299, -171374, -239411, -250128, 55664, -122483, -483800, -473358, -250660, 52615, 53320, 104260, -321188, 13148, -52927, -227312, -68402]
18950b08462B03058d04637a43914j85867J03884f2060A98377b6448k11198h2913
18939a95887I7682a62334e7698m0495j13685G4560a00344K2690j42137H3796h6536
18927f5322o1350d0693l0750L2625A9652a03271G2925m766a06146M653a4217k06778
18915b20995n4577h0997m317B73867A16616P8368b41049Q4501A15723a67587A40893
18903F0428J20561a44885k8561j370C07836B3197a09930D5374I300c5322q9639
18892a24961A34067E3166K812b34560C18812a57331l2694A44843J58184q6951
18882B16076E417M8416C737b8761A70405e8943j9882L6588B14806a87521b9436
18870a75338A07229e8417A45916b56441E0628J75936k7645a09632f611k08427
$$ y = [-208462, 203058, -404637, -143914, -329781, -225897, -62060, 198377, -26448, -237646, -82913, -195887, 97682, -162334, -57698, -98193, -211878, 74560, -100344, -77654, -219791, 83796, -86536, -65322, -126672, -40693, -71443, -38818, 19652, -103271, 72925, 68159, -106146, -101493, -14217, -220995, -275572, -80997, -85314, 273867, 116616, 194984, -241049, -156548, 115723, -167587, 140893, 60428, 180989, -144885, -173446, -174816, 307836, 23197, -109930, 45374, 9300, -35322, -124961, 134067, 53166, 55978, -234560, 318812, -157331, -190025, 144843, 303027, 216076, 5417, 53833, 3737, -28761, 170405, -58943, -78825, -42237, 214806, -187521, -29436, -175338, 107229, -58417, 145916, -256441, 50628, 226564, 198919, -109632, -6611, -215038]
18860b15038D6715c20666C8968a37783G8499m740J20412g6851r6732B45639a96429
18848b0262A19618a52950b9153C21427d09655B15299C5344M8963a97729R621f6967
18836a72164b3982j69154g996G5144J26404e7191J0242a3775m0760A56284b11650
18824I576L733K6551Q5762i3752A9433J26020K64252G8073J38008p7278K2688
18813A61491B8010M6232c08629B03366f4815H7762k4625a03254J4609D3881a89440
18801a79108A4364b41834A25506E5174c25858F6425b28981a09712j54650G0414
18790a07574F0242J14181o9970B3724K20343e977j56111R038A22573N1874a11055
18778b0978B02893a63219F219f6441j26236K5809b4166m62429f3183q4100G1771
$$ y = [-215038, 46715, -320666, 38968, -137783, 78499, 73759, 194171, -76851, -173583, 245639, -196429, -20262, 119618, -152950, -29153, 321427, -409655, 215299, 35344, 84307, -197729, -188108, -66967, -172164, -23982, -193136, -7996, 75144, 201548, -57191, -46949, -13775, -54535, 156284, -211650, 9576, 13309, 39860, 125622, -93752, 19433, 145453, 409705, 78073, 216081, 138803, 161491, 28010, 74242, -308629, 203366, -64815, 87762, 63137, -103254, -88645, 43881, -189440, -179108, 14364, -241834, 125506, 55174, -325858, 66425, -228981, -109712, -264362, 70414, -107574, 60242, 174423, 104453, 23724, 244067, -5977, -162088, -153050, 122573, 174447, -111055, -20978, 202893, -163219, 6219, -66441, -192677, -166868, -24166, -486595, -63183, -147283, 71771]
18766E0146c56111A97334N2961c70773a5344D082b38226C1953O972g4028n3291
18755a27319A99923b50832A60914F9639b42266d2842r9268A07467c67879M3080
18745c24799a06199k08165r1040J01801A40057a72074A25636a27315K8314C6g459
18733C60718c00300J48901A66381a90773D1573e4658o021J8120C4000d27675a22328
18721i8163m1852j05028M906e7314k0160k08725J22936A2305f9249C7863e28953
18709F7030b13185j23985A7759b1025l13907A24288c49674G5059b44094N8480
18699a85614j48822E7209d239k50460g757j52433G3430e9208a0196B13640E5770
18687e7688k76663A67785c57122B57162a92219L0758G6845a6728j17026I3095
$$ y = [50146, -356111, 197334, 250295, -370773, -15344, 4082, -238226, 31953, 38925, -74028, -127319, 199923, -250832, 160914, 69639, -242266, -42842, -142110, 107467, -367879, -324799, -106199, -314364, -405404, -303603, 140057, -172074, 125636, -127315, -99001, 36, -7459, 360718, -300300, -151399, 166381, -190773, 41573, -54658, -60679, -42559, 34000, -427675, -122328, -98163, -140015, -245043, -240137, -57314, -77474, -286199, -163263, 12305, -69249, 37863, -528953, 67030, -213185, -337170, 17759, -21025, -334932, 124288, -349674, 75059, -244094, -185614, -334436, 57209, -4239, -254699, -7757, -160190, 73430, -59208, -10196, 213640, 55770, -57688, -334351, 167785, -357122, 257162, -192219, -161461, 76845, -16728, -133754, 93095]
18676b20450O5171D1213J00768M6417B6677K95447a58278B80599d9204r386m23200
18665d81790a5080n9475o2683j01248J15358e5819j40803L3083j77178d4777I6650
18653A18536a79034o4419c6940F5649g5267k74488r1906g66k2350k19261g0969
18641c20486C4859A0089b91014A71070d32129J34546d3741D110b2118j24k5285
18630d7527G8871j2537A6191a61024E4616d10377f9034B01372m1421b08802h8337
18618C3623R1328l0755b45302D4884f1751n4163C5755K8554c11407e3815m1781
18607i5596D21930F0177c42522D7022q153c90838B75141f3330A16545i4639D1327
18595c34535g9775j41507C7942I573K24761i6979j31080A45467a1429j43898F8446
$$ y = [-220450, -155279, 41213, 141981, 188398, 26677, 322124, -158278, 280599, -49204, -58590, -481790, -15080, -74555, -137238, -238486, -123128, -55819, -196622, -163539, -340717, -44777, 96650, 118536, -179034, -243453, -36940, 65649, -75267, -349755, -441661, -766, -23116, -242377, -70969, -320486, 34859, 10089, -291014, 171070, -432129, -297583, -43741, 4110, -22118, -22242, -47527, 78871, 66334, 16191, -161024, 54616, -410377, -69034, 201372, 159951, -208802, -88337, 33623, 124951, 94196, -245302, 44884, -61751, -115914, 35755, 64309, -311407, -53815, -95596, 421930, 60177, -342522, 47022, 38869, -390838, 275141, -63330, 116545, -94639, 41327, -334535, -79775, -221282, 37942, 9573, 234334, -96979, -228059, 145467, -11429, -155327, 68446]
18583d4833j44711o054A45805n5623H463a27204a2575j03616k1726K6907J420
18572a09590d6215l8858j49051A47165a77267c9232k70589I9096j4023e6972H7763
18560e70613h4678A0631a56604C06465a11609B2746C667c7705k85518a54326N7
18549a54269I128P6521a98987f7601B01643O5153J5912r5571k9509n2830b16662
18537H6528b13500p3922J14085e7180j37343A65400m3901J06688J39019B4242
18526A72734c22235A30642A1537C336M69823g1126l06072a77720P8903r7851l03514
18515e00182A09926c31257A68274F6198a36339D95262b2570r0604j26247j05508
18505c44929a06736L4645A9894g3647A94691c7937k34342I9744a62939A01932
$$ y = [-44833, -189544, -195598, 145805, 90182, 8463, -127204, -12575, -116191, -137917, -111010, -109590, -46215, -85073, -234124, 147165, -177267, -39232, -309821, 99096, 85073, -56972, 87763, -570613, -84678, 10631, -156604, 306465, -111609, 22746, 3667, -37705, -323223, -154326, -154269, 9128, 85649, -198987, -67601, 201643, 266796, 282708, 187137, 157628, 104798, -216662, 86528, -213500, -287422, -173337, -57180, -194523, 165400, 121499, 228187, 367206, 24242, 172734, -322235, 130642, 11537, 3336, 473159, -71126, -377198, -177720, -98817, -196668, -500182, 109926, -331257, 168274, 66198, -136339, 495262, -22570, -113174, -239421, -344929, -106736, -72091, 19894, -73647, 194691, -37937, -272279, 99744, -162939, 101932]
18494A9494b00075j56303J11898m96234a21219r856p0950C80447b4057j80532
18484b04589c4587j04229m1621Q1422M8452k3070A86191b87284F6687J44500B5679
18472c82880i4395A06656L8702F1513a31738a8826A68322k1791a24819C09717
18461H451R4286k6486d7917A59056J23649J57965a74825f6714A4854a15522j41293
18450b56815k80699K45600d1912j22327A28978c00236J43150B60h3458C7253R224
18439D6477b23459A93113B7284N1845f1566A84276a86705b9743B80888e3053A28428
18427E4196c3812j17367M886d7857j60080F1670b2871k96372a39386a7935B5328
18415e3330I5929b00101b8530k53519a03050B7013a00050C6262R7587h7457I6706
$$ y = [19494, -200075, -356378, -244480, -740714, -121219, -131075, -202025, 380447, -24057, -204589, -34587, -138816, -180437, -99015, -50563, -73633, 186191, -287284, 66687, 211187, 25679, -382880, -94395, 106656, 145358, 61513, -131738, -18826, 168322, 146531, -124819, 309717, 8451, 102737, 76251, -47917, 159056, 282705, 440670, -174825, -66714, 14854, -115522, -256815, -537514, -291914, -41912, -164239, 128978, -300236, -157086, 260, -83458, 37253, 46477, -223459, 193113, 27284, 79129, -61566, 184276, -186705, -29743, 280888, -53053, 128428, 54196, -33812, -151179, -146293, -47857, -207937, 61670, -22871, -319243, -139386, -17935, 25328, -53330, 95929, -200101, -28530, -282049, -103050, 27013, -100050, 36262, 133849, -87457, 96706]
18403A60366J53804f9678a4802j50809A86718b7390E5132R1013P8592j05964m8316
18392G0457j9729a62772A16777d4237d33m8015A33146b57643p1646G7014a49300
18380a8231m9885F3084a11745A60799l5648e0539C9245c18829f543k99869J50748
18369a55664P7297a1726C8869Q8022Q5152H6332J93528a15684M8443j98487A50728
18357A59250a03138I6675A5377Q8441a18914M4374o4074r6613a5342k30230G1943
18345c07258A88502B6485E117b21037d8343C0882K19071j02408F0098b43849K9438
18334b14411A23141J01811c30655a33869b3845j50623M2992j02073c1894k19506
18324b51400P4801j34707A87313g8869A07340N85b0312m3259k40892B5547a55971
$$ y = [160366, 314170, -69678, -14802, -165611, 186718, -27390, 55132, 146145, 224737, 118773, 70457, 50728, -162772, 116777, -44237, -433, -48448, 133146, -257643, -329289, 77014, -149300, -18231, -68116, 63084, -111745, 160799, 125151, -50539, 39245, -318829, -6543, -306412, -155664, -78367, -11726, 38869, 126891, 212043, 86332, 279860, -115684, -67241, -265728, 150728, 159250, -103138, 96675, 15377, 103818, -118914, -74540, -138614, -235227, -15342, -245572, 71943, -307258, 188502, 26485, 5117, -221037, -48343, 30882, 249953, 147545, 60098, -243849, -214411, 123141, 224952, -330655, -133869, -23845, -174468, -131476, -233549, -31894, -251400, -176599, -311306, 187313, -78869, 107340, 107925, -20312, -63571, -304463, 25547, -155971]
18312F3604J21493m0449a58776J0696B78863b28472f5570p0971g066G2996J39932
18301B12928b21466g4318b3569C55487a60244G1492a77928k0313L1839Q1227B5764
18289h597B43829A15405J32119a28679I254J23142b60156H2772b88073i3365A63990
18277a31421p8154N8380C7717a19561a7267l6495j79797i0496C24643F0111a65917
18265h8053j56825a13448A60725c01262e0656k73476e6674P174j69127E8604A6330
18253D15891n1813b31106C41490D164R1062c11665J34617J626A55727l3222c7497
18241e5928A79264a02312n7860p8618B23526h9295o3141r2639j65788a52927e7736
18229H7632J06844A9530J0700J094a54981I8898f8306k29120h3180m9028A20955
$$ y = [63604, 185097, 144648, -158776, -148080, 278863, -228472, -65570, -136541, -7066, 72996, 212928, -221466, -74318, -23569, 355487, -160244, 71492, -177928, -198241, -166402, -85175, 25764, -8597, 243829, 115405, 247524, -128679, 9254, 132396, -260156, 82772, -288073, -93365, 163990, -131421, -209575, -151195, 37717, -119561, -17267, -53762, -233559, -90496, 324643, 60111, -165917, -88053, -244878, -113448, 160725, -301262, -50656, -324132, -56674, -49500, -218627, 58604, 16330, 415891, 364078, -231106, 341490, 4164, 95226, -311665, -177048, -175422, 155727, 122505, -37497, -55928, 179264, -102312, -160172, -238790, 223526, -89295, -152436, -245075, -410863, -152927, -57736, 87632, 194476, 19530, 30230, 31324, -154981, 98898, -68306, -297426, -83180, -132208, 120955]
18217c38771R3209J03826B87911f4821H4296h8203k490M0825q0604L2600k94375
18206c92247F1367a05233J4768A94617E1866K80692o8354d15805A3415J79337
18196A92752c11619j07355B35152g2972A43347A749g9880b861B74569h0128m34357
18185e14485B7223b00013F4789L0599b97764b3930A30327b67417d4828C47358
18174a72075B3457K97060l4094a59967A6698J13615e5878A6532M8979J08048P5060
18163B48619k9243a80262Q2917C01063I9270b52140E7032a47542N4160H3047c22525
18151A40377b2902A95180B5546J5676c6526k09616I5833g5351E9268P1981a64969
18139a04401J6224A44713N3242f8285j58754c8735l555k9557o4607k3933B4241
$$ y = [-338771, -245562, -141736, 287911, -64821, 84296, -88203, -90693, -49868, -130472, -97872, -392247, 61367, -105233, -90465, 194617, 51866, 332558, 264204, -415805, 13415, 192752, -311619, -418974, 235152, -72972, 143347, 1749, -79880, -2861, 274569, -80128, -514485, 27223, -200013, 64789, 95388, -297764, -23930, 130327, -267417, -44828, 347358, -172075, 23457, 320517, 286423, -159967, 16698, 130313, -55878, 16532, 65511, 173559, 248619, 219376, -180262, -97345, 301063, 99270, -252140, 57032, -147542, -93382, 83047, -322525, 140377, -22902, 195180, 25546, 41222, -36526, -246142, 95833, -75351, 59268, 131249, -164969, -104401, -88177, 144713, 197955, -68285, -227039, -38735, -42290, -71847, -136454, -160387, 24241]
18127b8665G2725J33715a0154D69615a37286O3273Q441b6277j44383B13372a57806
18115A25697A4953i4206E7171J07082a21952o7893O0438j14680J01683K4107H0951
18103d67710a72756A31676M8867b7480j79637l3508k7921A36548a84153b0683
18092e3592B23978A02696I196J74822E0766h3205A70498M7303i6470k08738d2191
18080h4803a7727k85458N268a07428a946q7950o9951D07618b74120A30941l9243
18069I1698k3405M78B1550L4249a30823K7141I8283M970e7294j61832a5188B14267
18056b07751B05543a34681A21286c02355f9061j87412B62424L2917C3905a54484
18045b93526a07533k41688J65317A45420l2539a45927A5595b43384C1293N9a48146
$$ y = [-28665, 72725, 206440, -10154, 469615, -137286, -74013, -65572, -26277, -170660, 213372, -157806, 125697, 14953, -94206, 57171, 164253, -121952, -189845, -129407, -244087, -142404, -118297, 80951, -467710, -172756, 131676, 180543, -27480, -207117, -240625, -268546, 136548, -184153, -20683, -53592, 223978, 102696, 9196, 184018, 50766, -83205, 170498, 217801, -96470, -305208, -42191, -84803, -17727, -303185, -297917, -107428, -1946, -89896, -159847, 407618, -274120, 130941, 91698, 68293, 68771, 21550, 55799, -130823, -103682, 98283, 103253, -57294, -219126, -15188, 214267, -207751, 205543, -134681, 121286, -302355, -69061, -256473, 262424, 295341, 33905, -154484, -293526, -107533, -349221, -183904, 145420, 112881, -145927, 15595, -243384, 31293, 31352, -148146]
18033A66138c4802l0552a0651F8771a18828J1890L2288k05412B30440b41710a00904
18021d7780o6406A02773a67777A30302f1547j70847D3698c9223j07078H5987a81596
18009g601j50427l3149A54841a43549K7882r9870H4300b89529a25306A00444d08268
17997A75481e7621B17420h2216p1987F1799j0507j8954P1320J8428J2925d2042
17985h8513c5171j024A26431a31096B31055c399G1730b03042B68078J898C6799
17973h3138H2463b9409n6291j70510a25181A38385a11566B29034a19135G0581
17962g0944K670j2050D4681i8935E00698a31018A16636A2229h0650L8321G8363
17950A20212b88282B58102j11323a54445B04544a15641A17705J07806a21523A36168
$$ y = [166138, -34802, -65354, -10651, 68771, -118828, -106938, -74650, -280062, 230440, -241710, -100904, -47780, -114186, 102773, -167777, 130302, -61547, -232394, 43698, -39223, -146301, 85987, -181596, -7601, -158028, -191177, 154841, -143549, -115667, -215537, 84300, -289529, -125306, 100444, -408268, 175481, -57621, 217420, -82216, -154203, 61799, 51292, 32338, 103658, 122086, 135011, -42042, -88513, -35171, -36195, 126431, -131096, 231055, -3399, 71730, -203042, 268078, 269976, 36799, -83138, 82463, -29409, -85700, -256210, -125181, 138385, -111566, 229034, -119135, 70581, -70944, -68274, -80324, 44681, -98935, 500698, -131018, 116636, 12229, -80650, -42329, 78363, 120212, -288282, 258102, 146779, -154445, 204544, -115641, 117705, 225511, -121523, 136168]
17939a7585j27825A73925g5439D72303A02862c35898F2847R9735o1293b4629a048
17927f1600G5003a33095A24019j1528J956b71808E2181k4013l432M9475K39817
17916C14028c47954A25361B1746a81900B88312b17219g9705A16581c28649I4573
17905D6205a6391B8285J43385b15635C56663A56568b08980q6074H2490J29444
17895B11934J55563d4917A30749g3156b5272B43860j06392b60915a23564B4213
17884g8898b2109B66622a38178e5076F6490j4745i3726j96809I4984f6466A74898
17872H7191a24652F9376i5762B15758n869F6330B2543b4207j8577A8986e5892
17860d2231j84308J00469D6354a53242b0435k835A29149b69152A09733h6073H9382
$$ y = [-17585, -145410, 173925, -75439, 472303, 102862, -335898, 62847, 162582, 101289, -24629, -1048, -61600, 75003, -133095, 124019, 112491, 114447, -271808, 52181, 28168, 24736, 74211, 314028, -347954, 125361, 21746, -181900, 288312, -217219, -79705, 116581, -328649, 94573, 46205, -16391, 28285, 171670, -215635, 356663, 156568, -208980, -295054, 82490, 211934, 367497, -44917, 130749, -73156, -25272, 243860, 137468, -260915, -123564, 24213, -78898, -22109, 266622, -138178, -55076, 66490, 51745, -93726, -290535, 94984, -66466, 174898, 87191, -124652, 69376, -95762, 215758, 209889, 66330, 22543, -24207, -42784, 18986, -55892, -42231, -226539, -126070, 46354, -153242, -20435, -23270, 129149, -269152, 109733, -86073, 89382]
17848E196a53077A97673a87249c3944c669r4716L6982H5377h1623C73206a59673
17836F5482b30223A30824c2425D8854b0404l6311E4602j8939N5881a55956D71987
17824d3160j05742B16766J50906K279p9864a49264J9570A78944c46567f0239C3147
17812B78164b4702A59469a99608A43139R9688d1254j83892Q7058f0610j37352
17802a97962g3400B75500a99814A74644A6809P2265k8382K5089c5802j37770c9239
17790c01642H9936J69763j14086c9027j8621A30154m7912b42196A48447J93207
17780C41654e4937j02583d2228j49000G8046a44436D1322d07131h8104C30047
17769I8588a46277M7117G5856a13534L2656r6545b7618o939j96089b0325A83496
$$ y = [5196, -153077, 197673, -187249, -33944, -3669, -98385, -61403, 85377, -81623, 373206, -159673, 65482, -230223, 130824, -32425, 48854, -20404, -56715, 54602, 35663, 91544, -155956, 471987, -43160, -148902, 216766, 367672, 369951, 290087, -149264, -129694, 178944, -346567, -60239, 33147, 278164, -24702, 159469, -199608, 143139, 242827, -41254, -225146, -138088, -60610, -197962, -73400, 275500, -199814, 174644, 16809, 89074, 60692, 85781, -35802, -173572, -39239, -301642, 89936, 259699, 145613, -39027, -57648, 130154, 82242, -242196, 148447, 341654, -54937, -157520, -42228, -191228, 78046, -144436, 41322, -407131, -88104, 330047, 98588, -146277, -99160, 75856, -113534, -80878, -177423, -27618, -34557, -230646, -20325, 183496]
17757a42639c8497j35671I7666a7480B04716c2265A84642m1144k7031b11585B46488
17745a22254e7825d930H5463C7236K25624A0217a58877K3777A84626n8235g3359
17733a65318a4720j91315D5663j9745a10132r5408f4962B60000D3915b33099Q0512
17722a52587d8914L093A11199a69774I3866k3373A4304J55297k9788b3010N030
17711a7980E909K28919i2941a1741A54207b9659j98260B34275a36935J160C82914
17699a9670j90341A61059d1605A67309p1237J37579a28585B17285h2477B76652
17688d7944D2307L36339f9159j13848B41662J04998c5155j4304G7466K27620M5262
17677C50348p5731D0234J58481A4110K00357b5788A67054G9147b87396A48509
$$ y = [-142639, -38497, -174168, 97666, -17480, 204716, -32265, 184642, 143498, 116467, -211585, 246488, -122254, -57825, -4930, 85463, 37236, 262860, 10217, -158877, -135100, 184626, 126391, -73359, -165318, -14720, -206035, 45663, 25918, -110132, -205540, -64962, 260000, 43915, -233099, -152587, -48914, -45821, 111199, -169774, 93866, 70493, 14304, 169601, 139813, -23010, -17980, 5909, 234828, -92941, -11741, 154207, -29659, -227919, 234275, -136935, -135775, 382914, -19670, -210011, 161059, -41605, 167309, 96072, 233651, -128585, 217285, -82477, 276652, -47944, 42307, 378646, -69159, -183007, 241662, 346660, -35155, -49459, 77466, 305086, 350348, 274617, 40234, 198715, 14110, 214467, -25788, 167054, 79147, -287396, 148509]
17666b31071A11471k1779i0140B30084a67764B56651q8165K30139a44411C22499
17655A78935F2180b18825C21422G0621b36340A8605a87229e4825j61711A23616
17644f5811o3987J2983q2121B76960b73785B36360p9746a20312m0476B02950a27542
17632A15952a87029A53710D8288K5144d53C17036f1099E8513J60436e5862A46148
17620f0930a5381q3538a7620O067A62191a5133F9932l153e2248A58004R9024N0167
17608C07195d9701k9235k89354b2357A55706J27046m7188e7271C66274J79847
17598E46121C0996L53034j24731I670a39906A34277b79086C8706J38013n8100
17588A18619a36146B52309h1395E11574a41237B59030C1156i7155B7847K04254
$$ y = [-231071, 111471, 89692, -90140, 230084, -167764, 256651, 168486, 398625, -144411, 322499, 178935, 62180, -218825, 321422, 70621, -236340, 18605, -187229, -54825, -216536, 123616, -65811, -129798, -116815, -198936, 276960, -273785, 236360, 156614, -120312, -160788, 202950, -127542, 115952, -187029, 153710, 48288, 73432, -453, 317036, -61099, 58513, 218949, -55862, 146148, -60930, -15381, -98919, -17620, -11553, 162191, -15133, 69932, 66779, -52248, 158004, 257028, 307195, -49701, -78936, -368290, -22357, 155706, 282752, 235564, -57271, 366274, 546121, 30996, 384030, 259299, 9670, -139906, 134277, -279086, 38706, 176719, 118619, -136146, 252309, -81395, 511574, -141237, 259030, 31156, -97155, 27847, 232101]
17578B32101b06367G0849c7154o571A5794L68013G1201e6246B35661F4815j6838
17567D7977M6611i026c929H5517K35280f8251B60685j19245K0357D7391J01821
17556A49212a49177B53398a5490o2022k43980C23948j30452b03343B64434a73274
17545B661J87196a36974D30e0148j19448A85993A4569J12037K69962A76838a3677
17533D3782k1551J67850h3473A20222J03024n048F1002e5766B70224C8700J68791
17522B07491M6652e8748E7670J17982q2742J13016N8791J0589A35384K05519b77356
17510B56302E1035A4071h536j88960I9415k6328J64374m1096H6157A4714a19894
17498A30486J11126K27173j67009O9324b4462j0206B5446J91795H4444J02706
$$ y = [232101, -206367, 70849, -37154, -43725, 15794, 383807, 71201, -56246, 235661, 64815, 47977, 94588, -9026, -3929, 85517, 320797, -68251, 260685, 141440, 161797, 47391, 149212, -149177, 253398, -15490, -77512, -321492, 323948, 193496, -203343, 264434, -173274, 2661, 189857, -136974, 430, -50148, -169596, 185993, 14569, 126606, 396568, 176838, -13677, 43782, 22231, 190081, -83473, 120222, 223246, 218198, 61002, -55766, 270224, 38700, 207491, 254143, -58748, 57670, 175652, 92910, 205926, 264717, 275306, 135384, 340903, -277356, 256302, 51035, 14071, -8536, -197496, 99415, 73087, 237461, 196365, 86157, 14714, -119894, 130486, 241612, 468785, 301776, 371100, -24462, -34668, 25446, 217241, 84444, 187150]
17488A87150O1017M1692j41341g3476C46230i5371B14161c1905m4546A09814B1883
17476D57237A15330B030L37516j55625j5232P5566D7855J7776M34127a92805I3791
17464a7084A76285a67998A68448o7654k970K96279q3653A23046l3584A5776K43551
17453B59327P3441p9709j00562L90133q7484j69120A20643R30m1713M39898J38742
17442F58500B40131K26700a3022F68417B72452n7838N1885J27789D2306M56745
17432D99051A41892J37789r041q3234K68712j37745I1592L68694R6884H8493N57
17421H9050K04528j35933N1210K36107E6525J93035P1609R6303c6271H2162L66632
17410D48794i7127A33831l7038A1811K20194H8655K49821K49711k90657j2511
$$ y = [187150, 248167, 289859, 148518, -73476, 346230, -95371, 214161, -31905, -76451, 109814, 21883, 457237, 115330, 2030, 339546, 183921, 168689, 244255, 47855, 65631, 499758, -192805, 93791, -17084, 176285, -167998, 168448, 100794, 97824, 394103, 310450, 123046, 89462, 15776, 259327, 332768, 253059, 152497, 542630, 455146, 286026, 120643, 121573, 79860, 519758, 658500, 240131, 466831, -13022, 668417, 272452, 214614, 266499, 394288, 42306, 499051, 141892, 279681, 270640, 187406, 456118, 318373, 91592, 460286, 557170, 88493, 89050, 293578, 157645, 208855, 444962, 56525, 249560, 321169, 417472, -36271, 82162, 448794, -97127, 133831, 96793, 11811, 232005, 88655, 338476, 588187, 297530, 285019]
17400B85019E8503L40614j6635g7362B2296L54584c6934B57117R0857n8446G4143
17388B7405K55650I9212G00P28387D7556d3650B51553j04627L05785H7030K62184
17377C49214j51311k4593i8436A43434L6920q8985K70571j78042l7441M0245b48858
17365B18328k263q1622J55630l206J00305j61705J7705I311K28121O5559R855
17354C12846A39338J88702c7850C04076p6567J83572L182K207A67309L3208P4780
17343B75297q2744Q0917J17566F0320J14641q0571J30777A12552K30462K5362
17333C68376O2059q0240A40892J73761K3952j32187H9873K57782J10211k20205
17323B37661i5220B02597C9191J34376A7867K76582O3273j41760K4337L74836
$$ y = [285019, 58503, 399117, 382482, -77362, 22296, 376880, -36934, 257117, 347974, 289528, 74143, 27405, 283055, 99212, 700, 729087, 47556, -43650, 251553, 146926, 452711, 87030, 349214, 197903, 173310, -98436, 143434, 180354, 91369, 361940, 183898, 146457, 186702, -248858, 218328, 216065, 134443, 290073, 286867, 387172, 225467, 243172, 9311, 237432, 302991, 312846, 139338, 328040, -37850, 304076, 227509, 411081, 414263, 416470, 167309, 200517, 275297, 192553, 273470, 391036, 60320, 174961, 94390, 225167, 112552, 343014, 368376, 430435, 350195, 140892, 314653, 338605, 206418, 89873, 347655, 457866, 237661, -95220, 202597, 39191, 173567, 17867, 294449, 357722, 215962, 240299, 615135]
17313F15135E1910J43020l3878O7737J57988A54168K48561g053A75007K54813
17303D29820B09654N55121C00227a154C56382J16533A45363M5768n374C0852J95971
17292B26823m0090J18528j11209J66094b61045C26227L1732j14995E2920K53355
17282C06275l8291j08027J82326f6372B72837k7667J52475J52282I9624l309J92383
17271B88698J02144A47869O7384N611K21231J65910J04336B81465R6776K24020
17261F02261A12251B2440K66929J83544k10095J00745M0152E7376M05474p7236
17251C85614A77061K94836j69960R5933A80856J96805j18548j0277J78169O3945
17241D90950B5728J86898Q1308J85368k03152J60177m0017c0342B44598J39051
$$ y = [615135, 51910, 194930, 161052, 228789, 386777, 154168, 402729, -7053, 175007, 429820, 209654, 764775, 300227, -1154, 356382, 472915, 145363, 191131, 185757, 30852, 226823, 186733, 305261, 194052, 360146, -261045, 326227, 357959, 242964, 52920, 306275, 267984, 159957, 342283, -66372, 272837, 245170, 397645, 549927, 99624, 96315, 288698, 390842, 147869, 215253, 220864, 442095, 608005, 712341, 281465, 378241, 602261, 112251, 22440, 289369, 472913, 262818, 363563, 403715, 57376, 462850, 385614, 177061, 471897, 301937, 397870, 180856, 377661, 259113, 248836, 427005, 490950, 25728, 212626, 293934, 479302, 276150, 436327, 396310, -30342, 244598, 383649]
17231C83649N3454B01282K24137J14717B52966j23616J49602L05279j86703j96287
17221B01241J1800M32599k37734n5228r4757J8477j10241J95895J90344j00330
17211D52066B25372p3666M1494K08700j64277Q2007K69619k06702D6545J32704
17201A79249L45771A48562K02779K20486j61369N7447J32217B18502J67677o6935
17191C19244j11229R418M45067m2851B95912q6294J27398M7502C5790N25297j10951
17180D50136o9885r7458M39310A88644P9026r8181J78811J82835J10978C10091
17169D30188L4260B04020L55684K04339C48019j511j62703L50485k33792J24869
17159D25367M9668L158J9393A17488L03356K52086j57619o1419K25423B59891
$$ y = [383649, 437103, 201282, 425419, 540136, 252966, 129350, 278952, 584231, 397528, 201241, 213041, 645640, 407906, 352678, 257921, 276398, 166157, 362052, 552396, 452066, 225372, 151706, 193200, 401900, 237623, 319630, 589249, 382547, 46545, 179249, 525020, 148562, 351341, 571827, 410458, 467905, 600122, 218502, 386179, 319244, 208015, 217433, 662500, 619649, 295912, 209618, 337016, 384518, 35790, 561087, 450136, 380251, 282793, 722103, 188644, 267670, 169489, 348300, 531135, 642113, 310091, 430188, 464448, 204020, 559704, 764043, 348019, 346508, 183805, 534290, 300498, 425367, 475035, 478193, 497586, 117488, 420844, 672930, 515311, 453892, 679315, 259891]
17148C94820J63013B46253M0343K97883k63761J27779o2526j00518C5377M55620
17138D90997j79791A24834K40147A77249M89741j46487J30894j23910m8965j9920
17128D58602o61K65487k80817R7102N8486j44081P8330j84965K83533B38734q75
17117B37859M35325k41138L55743C48371M19751k9990j35826p2546K06766k12335
17107E24191l5209J75583B06086L04684l7819j30970O4271N76705D25974Q3573
17097E09547J83474K7639k92600p4020J73998L8567J82258k43458K15150q5233
17087F35322j5519j70319J43088n8721M34716l77937k08452L66662K923k86364
17077D65399J83523l11423K72169R8368k06733L56111k64218K29950C93815K31908
$$ y = [394820, 557833, 246253, 286596, 584479, 320718, 448497, 385971, 285453, 35377, 490997, 311206, 124834, 364981, 177249, 666990, 520503, 651397, 527487, 478522, 458602, 457941, 723428, 442611, 539713, 598199, 454118, 532448, 347483, 631016, 238734, 237859, 673184, 432046, 787789, 348371, 768122, 738132, 602306, 529760, 736526, 524191, 488982, 664565, 206086, 510770, 472951, 341981, 406252, 982957, 425974, 509547, 693021, 720660, 428060, 354040, 528038, 566605, 748863, 505405, 720555, 635322, 619803, 449484, 592572, 533851, 968567, 590630, 382178, 748840, 751763, 465399, 648922, 337499, 609668, 708036, 501303, 857414, 593196, 823146, 393815, 625723]
17067F25723L42018m1609m29263M67520r520m10200k51726N23245l24903L99677
17057H90962r3915k25114J73425L34329l81283J38537j15685k9138O5435l9074
17047G18479K36182n2489m0848j87870Q4304o8344J17773l63363N47198m39865
17037E51157K63764A89179O40819j34528L8720j62367N20534k51415J74546l46547
17027F68941R8760O3489p5297L62978k45990M11350m13647J82638O7838m15801
17017G05259K26868k40434M37413n287j13763n004j45452J34997j46690l68402
17007D79505M57263l3274J48143K94207m17329r6687L31410J17900k91683j73104
16997H16351o3619J32742L01504l57231q5573K96287P7844L1511l72029M83796
$$ y = [625723, 967741, 926132, 496869, 964389, 954869, 544669, 292943, 816188, 491285, 890962, 797047, 571933, 745358, 1079687, 698404, 836941, 721256, 692118, 757553, 718479, 954661, 902172, 861324, 673454, 757758, 689414, 807187, 443824, 991022, 551157, 814921, 189179, 829998, 695470, 734190, 571823, 1092357, 840942, 1015488, 668941, 767701, 831190, 755893, 1118871, 872881, 1284231, 870584, 1053222, 1121060, 705259, 932127, 691693, 1129106, 1123819, 1010056, 1005052, 859600, 994597, 847907, 479505, 936768, 903494, 1051637, 1345844, 928515, 831828, 1163238, 1281138, 989455, 816351, 752732, 885474, 1186978, 829747, 744174, 1040461, 1118305, 1149816, 777787, 1261583]
16987A261583j99255J62867k43677j75578o0372K27317J8916J35120k88790N49437
16977A387568k72504K08285j91825k65327N12704k6599J68862l43160L44437k88593
16967A233848l6542P064J39253r2004J96513L45575m64035k7257K69137j69997
16957A401555j11065K99206k71285P5578J41268J02809m32067M82676l57550P814
16947A338939k1027k60623N03170J52700j59020p0752M05495p00156L88748n6705
16937A520769Q1334m450N4317q4731M39001O2878j80427l22525L21287k36910
16927A650543j37552J40310K43510L03995n69463M55300l35435R999K77087P1688
16917B109982l47063K42211j40985k31978L47041K19350k69038P9071l2052q6690
$$ y = [1261583, 1062328, 1225195, 981518, 805940, 745568, 972885, 991801, 1126921, 838131, 1387568, 1115064, 1323349, 1131524, 866197, 1378901, 1352302, 1521164, 1178004, 1522441, 1233848, 1197306, 1204370, 1343623, 1251619, 1448132, 1793707, 1329672, 1302415, 1571552, 1401555, 1290490, 1589696, 1318411, 1393989, 1535257, 1638066, 1205999, 1688675, 1331125, 1338939, 1317912, 1057289, 1560459, 1713159, 1554139, 1483387, 1888882, 1188726, 1577474, 1520769, 1602103, 1597653, 1651970, 1567239, 2006240, 2069118, 1888691, 1566166, 1887453, 1650543, 1512991, 1653301, 1896811, 2200806, 1631343, 2086643, 1751208, 1761207, 2038294, 2109982, 1762919, 2005130, 1864145, 1632167, 1979208, 2198558, 1929520, 2008591, 1976539, 1889849]
16907A889849R1838L44880l82631K25808p9163J64685m3983Q6101j05j63076J52223
16896B286426r0375J37911k25718M05412k29150J35229K95868k07080K01309m47312
16886B262520K51408j39341K03322J52599k1484q268Q7700N1359P50J07812k99322
16875B649055K81141J62097l28833K2893M11515l25747K09810J67123j54165M09789
16865C504678l39164J9728L46171M2024j55395J5737J73533p1000J10803K21184
16855C868299m3707j09722O3396K04059N1946l63360J45599N07499l89907K55072
16845D189174l4151R9271K6577Q4528P08N0398K37353K3189m9657K9811n4111
16834D603090M07100j95680J61683P0515N29943l07158J83903j90498J85368J48397
$$ y = [1889849, 1981687, 2326567, 1943936, 2169744, 2090581, 2255266, 2211283, 2297384, 2297279, 2134203, 2286426, 2196051, 2333962, 2108244, 2513656, 2284506, 2419735, 2715603, 2508523, 2709832, 2262520, 2513928, 2374587, 2577909, 2730508, 2709024, 2700756, 2788456, 2839815, 2840565, 2948377, 2649055, 2930196, 3092293, 2763460, 2786353, 3197868, 2872121, 3081931, 3249054, 3094889, 3504678, 3165514, 3185242, 3531413, 3573437, 3418042, 3433779, 3607312, 3536312, 3647115, 3868299, 3824592, 3714870, 3778266, 3982325, 4034271, 3670911, 3816510, 4324009, 3934102, 4189174, 4155023, 4254294, 4280871, 4365399, 4366107, 4416505, 4653858, 4677047, 4627390, 4657201, 4603090, 5010190, 4814510, 4976193, 5046708, 5576651, 5269493, 5453396, 5262898, 5448266, 5596663]
16824E596663O50578n09389K67735O7940L62022J4713Q8165K75543m5627J25986
16814F894329l56019P32279j19185J40767l282j17085N52324K78666l51340P88071
16804H439525j81131K36733K41384k19829N20391m9817P74502n0370J45640M45625
16794A0302653n762L02644L7391N28693k6214M32167K17779K94797K67719R97466
16784A3349333j73458J22574M61485K55534N95326M40676J32357M60074N64692
16775A6208593K54060M39613R02122N13455P58274J08371P66553Q39734P36572
16766B1527347M38243P06580P81573J091739N11792J164582J043106Q95141J391430
16757B9551533J121370J226283J524711J193974J279063J715323J635829K073927
$$ y = [5596663, 6247241, 5737852, 6005587, 6073527, 6435549, 6450262, 6538427, 6813970, 6768343, 6894329, 6538310, 7270589, 7151404, 7292171, 7288889, 7171804, 7724128, 8002794, 7651454, 8439525, 8258394, 8495127, 8736511, 8516682, 9037073, 8987256, 9761758, 9711388, 9857028, 10302653, 10296891, 10599535, 10636926, 11165619, 11139405, 11571572, 11789351, 12084148, 12351867, 13349333, 13175875, 13298449, 13759934, 14015468, 14610794, 15051470, 15183827, 15643901, 16208593, 16462653, 16902266, 17804388, 18317843, 19076117, 19184488, 19951041, 20790775, 21527347, 21965590, 22672170, 23453743, 24545482, 25057274, 26221856, 27264962, 28160103, 29551533, 30672903, 31899186, 33423897, 34617871, 35896934, 37612257, 39248086, 41322013]
16749D1322013K033812K036703K413124J851984K836908J925744L286096K950297
16741F0656681L399624L386230L823067L975526M445906M238090N271118N115182
16733I4311424N801065N780759O310376O496229O817115P096760P047061P437819
16725A47098608P617321O888124O149984O155992N383833M134108L550923J920172
16717A88899065O48206n87670j893379l351581m428857n259271n920176o867041
16709A61239296p023150p306566p769995p455394p282972p420422o709385o638388
16701A03633024o147407o212992n087616n451213m601237m922804m101655l812457
16693F3295643l717585l487144l386549k468955l282218k005035k615653j940740
$$ y = [41322013, 43355825, 45392528, 47805652, 49657636, 52494544, 54420288, 57706384, 60656681, 64056305, 67442535, 71265602, 75241128, 79687034, 83925124, 89196242, 94311424, 100112489, 105893248, 112203624, 118699853, 125516968, 132613728, 139660789, 147098608, 154715929, 161604053, 167754037, 173910029, 179293862, 183427970, 186978893, 188899065, 189547271, 188959601, 187066222, 183714641, 179285784, 174026513, 168106337, 161239296, 154216146, 146909580, 139139585, 131684191, 124401219, 116980797, 110271412, 103633024, 97485617, 91272625, 86185009, 80733796, 76132559, 71209755, 67108100, 63295643, 59578058, 56090914, 52704365, 50235410, 46953192, 44948157, 42332504, 40391764]
16685D0391764k166078j932065j308812k263067j570888j037445j878155p40459
16677B7494795j252722j059520j179767r04479r65765q66948r34250o45327p22818
16668A8963199o61399r22814m55436p21847n58553n96220m25347p45610k54216
16659A3621757j65311r88177j60785j00520k97205l65561m58326l75075k05130
16650A0505667l84594l62105j09766l70238k43966j31302k86083j90205k93925
16641H133483l64342j37368l890n78801j12360l28730J99319k63598k55229j85775
16631F102709J76381p4702k99030k14574J54702l76524j50320N80J1375j82418
16621E148179j44232j79029K19991n30194J46872n81826N54184j92875q3695m85169
$$ y = [40391764, 38225686, 36293621, 34984809, 32721742, 31150854, 30113409, 28235254, 27494795, 26242073, 25182553, 24002786, 23098307, 22132542, 21265594, 20331344, 19686017, 18963199, 18301800, 17378986, 16923550, 16201703, 15643150, 15046930, 14621583, 13875973, 13621757, 13456446, 12468269, 12307484, 12206964, 11909759, 11544198, 11085872, 10710797, 10505667, 10121073, 9758968, 9649202, 9278964, 9034998, 8903696, 8617613, 8427408, 8133483, 7769141, 7631773, 7627883, 7049082, 6936722, 6607992, 6807311, 6543713, 6288484, 6102709, 6279090, 6204388, 5905358, 5690784, 5845486, 5468962, 5318642, 5319222, 5330597, 5148179, 5003947, 4824918, 5044909, 4514715, 4661587, 4079761, 4633945, 4441070, 4357375, 3872206]
16611C872206N30642m98460k764k242J07181p3008k94561J508q0827J7362j90384
16600C386653L5004k01780K36961o55777L62121J65990k91198N7544l33970K94954
16590C056502j00446l99160J71031k48606J74237n1060k01609K31749m1847m23042
16580B167749K63460k48285L12891l41131r494J75560j33966O8408J1142N3381
16570B319715j54479J13886k99225L52398k33632n46057M55636L443q9342n3153
16560A869190l12821K70698J12296J1954k39858J33948j45109k25152J49972j28689
16550A496429J71585j58278k526r1025K56473j03181l05918K42656l66505p4570
16540A065140N37338o14624M82372l233l00428L81187k19848r5583K42674p2680
$$ y = [3872206, 4402848, 3904388, 3901624, 3899382, 4006563, 3933555, 3638994, 3640502, 3559675, 3577037, 3386653, 3421657, 3219877, 3456838, 2801061, 3163182, 3329172, 3037974, 3095518, 2761548, 3056502, 2956056, 2556896, 2727927, 2479321, 2653558, 2602498, 2400889, 2632638, 2590791, 2167749, 2431209, 2182924, 2495815, 2154684, 2145190, 2320750, 2186784, 2255192, 2266334, 2319715, 2165236, 2279122, 1979897, 2332295, 2098663, 1552606, 2008242, 2011685, 1922343, 1869190, 1556369, 1827067, 1939363, 1951317, 1711459, 1845407, 1700298, 1475146, 1625118, 1496429, 1668014, 1509736, 1507210, 1416185, 1672658, 1569477, 1263559, 1506215, 1139710, 1065140, 1602478, 987854, 1470226, 1466993, 1166565, 1547752, 1327904, 1232321, 1474995, 1402315]
16530A402315k27930n9937J05120N8368E84296P73939l79339L72316n26878j62687
16520F61647L10870K3993M22843k15614k06661j25909m1460K36527j03985J72999
16510A135250l19227K12557p9897Q292N4077l922m3702j34953M9189M49490m93812
16499H33342O5055L15477m14673K18996k52526J52197J75956j18909k34147L55953
16489A096721m78183K19951L89247E97432R806J16277J22895L950m1598k57075
16479E51687J78931j66001K87218C41757L65134r2462j32697K09756l15594K02587
16469E78481o5388J91223j02667J80797K23307C72082M14767p8348k05550q9073
16459D13878M49330l43079K18808C14341L72975k5022j44647L3202J29752C19218
$$ y = [1402315, 1174385, 1114448, 1219568, 1277936, 584296, 1358235, 978896, 1351212, 824334, 661647, 972517, 996510, 1419353, 1203739, 997078, 871169, 829709, 1066236, 962251, 1135250, 816023, 1028580, 948683, 956975, 1011052, 1007130, 963428, 828475, 877664, 1327154, 833342, 898397, 1213874, 799201, 1018197, 765671, 917868, 1093824, 974915, 740768, 1096721, 618538, 838489, 1227736, 597432, 607238, 723515, 846410, 850360, 808762, 551687, 730618, 564617, 851835, 341757, 706891, 614429, 481732, 691488, 375894, 578481, 513093, 704316, 601649, 782446, 1005753, 372082, 786849, 708501, 502951, 413878, 863208, 520129, 738937, 314341, 687316, 662294, 517647, 550849, 680601, 319218]
16448G33177k28216J61527j56966J2668O9362j60141q3084q4376K81699k5076
16438E20574o6057j21972K43789j7844M8189O7424R914n9376k16846J40417j23860
16427D24352K48045q4459k60259A51462M42574L452k09760j0823M1197M89252
16417I07354C74758j15655K38213q3610q7755K13345j26520m8520L91508k01369
16407E54395A62110J0460J16521A28120K67091j04223L88724j75099M8692j48418
16397D04887j5020j46412N7752K73583j38362P1986l5896B29470M71959l40707
16387C60722J84553j25854J44317k74561L92192k15491L5132n4049j59652o8783
16377B18526J2811K66822k08536J98264J51712B43384L48258k18060k8507L8133
$$ y = [733177, 504961, 666488, 509522, 522190, 591552, 431411, 348327, 263951, 545650, 520574, 454517, 332545, 576334, 558490, 606679, 674103, 684017, 624641, 407795, 548212, 424352, 672397, 587938, 327679, 151462, 594036, 597488, 387728, 376905, 418102, 907354, 374758, 259103, 497316, 413706, 325951, 539296, 412776, 364256, 755764, 554395, 162110, 172570, 289091, 128120, 395211, 290988, 679712, 504613, 553305, 404887, 389867, 243455, 301207, 574790, 436428, 508414, 472518, 229470, 701429, 360722, 545275, 419421, 563738, 289177, 681369, 465878, 501010, 446961, 287309, 218526, 231337, 498159, 289623, 487887, 639599, 243384, 591642, 373582, 345075, 383208]
16367C83208j24867K6816K47220B01321B5627K7214K04095j9280N900M11144k38386
16356D16314j54929I8871C1821O5928K14830J75554J36965A45362J29273J65626
16346D40261j40712A43474K49428A90750L55994B40643O2892k6619J24397j30022
16336B71291j4471J94561M099k6384A3043M6526M24747j77899O8307j78585m6953
16325A49186J47470o2758k3671L39725j43403K36801k08868j67724D0124b81C11361
16313B09556J9837G4496J68607O7117K09573A07253J53630C7267K0700K39467
16303B97434o5602c157C89107G5844L94381j83916H9467Q7210K4890J16877o5181
16292B53263M6834J41945B05640n8824J75279K6049E5235R4856J38381n0836K8364
$$ y = [383208, 258341, 285157, 532377, 201321, 25627, 52841, 256936, 237656, 243556, 654700, 416314, 261385, 98871, 31821, 97749, 312579, 488133, 625098, 145362, 274635, 440261, 299549, 143474, 392902, 190750, 546744, 240643, 303535, 276916, 401313, 271291, 256820, 451381, 455480, 429096, 13043, 59569, 484316, 306417, 374724, 196139, 149186, 296656, 233898, 210227, 549952, 406549, 643350, 434482, 266758, 40124, -281, 311361, 209556, 229393, 74496, 243103, 310220, 519793, 107253, 260883, 37267, 57967, 297434, 231832, -3157, 389107, 75844, 470225, 286309, 89467, 176677, 201567, 318444, 253263, 300097, 442042, 205640, 146816, 322095, 348144, 55235, 150091, 288472, 237636, 266000]
16281B66000K25973j25461r8333B8609f9465B05275p8894L04971A30921F2645
16270e3525B22801E7550J54744D4196Q6024J60496A45124F2565K36565a08837
16259A21753J79922j28903J57817a76444I751K7883f9375D4555K52530a9018C35610
16247B39425e6140C07808H6204K13796j18354p8902O3096Q9335J8768L983Q6912
16236C64838F3357B1900h1891D04489p4924I1769l3386e1267F8737M8282K31089
16225C48108A3119a04866A20093O5662L56919A74454J79981A57797P9310L6036
16215B73143H3260R0362E9190J74976O3135r8212N7090o9057E1909c0577B05459
16203a1433l9273B17343E8764J94532l9542Q23n0108L7980l4615a97791A6804
$$ y = [266000, 491973, 366512, 268179, 28609, -69465, 205275, 126381, 431352, 130921, 62645, -53525, 222801, 57550, 212294, 44196, 130220, 290716, 145124, 62565, 299130, -108837, 121753, 301675, 172772, 330589, -176444, 9751, 37634, -69375, 44555, 297085, -19018, 335610, 239425, -56140, 307808, 86204, 300000, 181646, 102744, 165840, 255175, 273943, 277926, 364838, 63357, 21900, -81891, 404489, 329565, 91769, 58383, -51267, 68737, 117019, 348108, 13119, -104866, 120093, 185755, 542674, 174454, 354435, 157797, 237107, 273143, 83260, 173622, 59190, 234166, 297301, 199089, 256179, 187122, 51909, -30577, 205459, -11433, -50706, 217343, 58764, 253296, 213754, 214577, 164469, 202449, 167834, -197791, 16804]
16191A08525K39508o0470a86572B85977A0656c0251G6251h0764m799D6789K6367
16180G3156J02110g7082l3521e76A19077C5571J84210C4566K97543k2767j40184
16169A69158J77983A6372J6793J86269q2570J34981o6654i4750C35307f4668b662
16157A34637n7639N0275J7186n4790J38445L2663G1121J1894a0530n779A61796
16145c11809f2759B184P2872K07537c72914B55987A26123F0303J17356a796B75751
16133b61613C02860j19556Q2808F0343M58753k10014A7219K60486A00489a43539
16122B80075p3843i2797J5119k0594C89933e8708h125E0332d43360B5966K9823
16111E5789a41266I3563a12880D02162h3376A10191J51017a63832A52079K01172
$$ y = [108525, 348033, 287563, -186572, 285977, 10656, -30251, 76251, -80764, -85563, 46789, 73156, 175266, -77082, -110603, -576, 119077, 35571, 219781, 34566, 332109, 309342, 169158, 347141, 16372, 33165, 219434, 136864, 271845, 205191, -94750, 335307, -64668, -2662, 134637, 76998, 127273, 144459, 89669, 228114, 260777, 71121, 83015, -10530, -16309, 161796, -311809, -62759, 2184, 75056, 282593, -372914, 255987, 126123, 60303, 177659, -1796, 275751, -261613, 302860, 183304, 266112, 60343, 519096, 309082, 17219, 277705, 100489, -143539, 280075, 206232, -92797, -77678, -98272, 389933, -58708, -8125, 50332, -443360, 25966, 55789, -141266, 93563, -112880, 402162, -83376, 110191, 261208, -163832, 152079, 353251]
16101C53251A36742K58334m6273o8668A25583f4503A3837a98554D22811k08568
16091B14243f9894H2756j6873a67343C21124F1596a09063A10123C1370J12084
16081A43454K82036A08980q884g480o7656E468a03010B82148b37503A00019C3966
16069B64647o1635a01799l5863B11297B3191d3498A13980A5809b49302L6928i3061
16057b70301A44395l789A8744M6479k0107J76680b38895A99289B7552a9794p2726
16046i2520A6964K34807a49132H8296a73886A74426f5382A34271n7781K71269
16036C47759H3067a03546D3787J92378D6904J21009b25858E1528a04739E5504
16025a20693j15652I4115a74232k31304a9669B12725H6276e9387l7636A49586
$$ y = [353251, 136742, 395076, 348803, 280135, 125583, -64503, 13837, -198554, 422811, 214243, -69894, 82756, 65883, -167343, 321124, 61596, -109063, 110123, 31370, 143454, 425490, 108980, 100096, -7480, -75136, 5468, -103010, 282148, -237503, 100019, 33966, 264647, 203012, -101799, -137662, 211297, 23191, -43498, 113980, 15809, -249302, -212374, -93061, -270301, 144395, 140606, 18744, 65223, 45116, 221796, -238895, 199289, 27552, -19794, -92520, 16964, 251771, -149132, 88296, -173886, 174426, -65382, 134271, 76490, 347759, 83067, -103546, 43787, 236165, 46904, 167913, -225858, 51528, -104739, 55504, -120693, -236345, 94115, -174232, -405536, -19669, 212725, 86276, -59387, -97023, 149586]
16014a12301a1343A14070E5030K468b70499a34623a3818B45828g9255k1411j56922
16003b57588A43280b57477B02728a82011P9494C7249J9953a11806A08187f4505
15992c7190C1117Q0195a46037a0277B1053c6290A08247m3137J52694K49682j99417
15981B68069G2591M65732A40039A7082M61698A12302b25055D99216c49143a14430
15970a14893N4335j02082H9412M136a0378k92770A27065C2408J43357F354c57302
15958i1865r6879A17197f6109j95971B78797a35166a1291B89338h4554B65672
15947F4682f5817A80979a526A65602b06363a4307A50424b00790R8773m7911j05965
15936b55893a17480A92720f5961a2163A13665a18926p3067P0202B5062h1086k3983
$$ y = [-112301, -11343, 114070, 55030, 57498, -270499, -134623, -13818, 245828, -79255, -100666, -257588, 143280, -257477, 202728, -182011, -102517, 37249, 57202, -111806, 108187, -64505, -37190, 31117, 111312, -146037, -10277, 21053, -36290, 108247, 65110, 217804, 467486, 268069, 72591, 538323, 140039, 17082, 478780, 112302, -225055, 499216, -349143, -114430, -114893, -60558, -162640, 89412, 93548, -10378, -303148, 127065, 32408, 175765, 6354, -357302, -91865, -188744, 117197, -66109, -262080, 278797, -135166, -11291, 289338, -84554, 265672, 64682, -65817, 180979, -1526, 165602, -206363, -14307, 150424, -200790, -102017, -149928, -255893, -117480, 192720, -65961, -12163, 113665, -118926, -191993, -121791, 25062, -81086, -105069]
15925a05069B04587O8692o0175K0038g8957D7016a10147r3600C349O7126i1360
15913b24543M5354P3699m5758A96978b9309B80300h8860j51880D90K4863K62339
15902B87692b99594A5685a57165M6339o5356P5063A80970a00634J1601F0944J85408
15891B46352O887a27520F9268a03792A1804J52647d9191A62338n4198f6153k4
15880f6177j17423o2615n0749I3234a02826K1185A98872D7274j3687K6478h3428
15868A99004K274e1830l01635G1590K4187d8366o1761k21204A03706g5628j34634
15857b10262i2851p8867a3920k97271e4403G7560e3429A71979h8440K0766k51657
15846c19331A57867Q2321c2803A33398j4798D4650a6583k7193o7904J9312B3211
$$ y = [-105069, 204587, 273279, 213104, 233142, -78957, 47016, -110147, -203747, 3349, 70475, -91360, -224543, -179189, -105490, -151248, 196978, -29309, 280300, -88860, -240740, 490, 25353, 287692, -299594, 15685, -157165, -110826, -176182, -101119, 180970, -100634, -89033, 60944, 246352, 253239, -127520, 69268, -103792, 11804, 164451, -49191, 162338, 108140, -66153, -66177, -183600, -246215, -296964, 93234, -102826, -81641, 198872, 47274, 33587, 60065, -83428, 199004, 201278, -51830, -353465, 71590, 95777, -48366, -110127, -331331, 103706, -75628, -210262, -92851, -171718, -13920, -311191, -54403, 77560, -53429, 171979, -88440, -67674, -319331, 157867, 240188, -32803, 133398, 118600, 44650, -16583, -43776, -111680, -92368, 23211]
15834a02900G8221a07223A23051P3820c5100H149Q8380a10173M2243A7699K9271
15823D6970d4373A51306a95765B53157n6156r3326m4301M1585a4835A21247B7722
15811A73042i8930r5193g5184A82148D7769a4467j32367A66562f0434A6962h0846
15799h2081C2315e4912C23352a49010A5175e7212K4730o7398A4160L45814a05625
15787a33594A34295J74474g1512H2244d64224b9852k04733f1805A84167q9931
15777I4236R5316e863F440a50422A47967a75899A0490J46462E653a29875A62588
15765A1341b66436A46434b89169k1461C86792a63578i276B11298c1704A84500
15754E7018K50474q6715b38835B0198f3461J1207n7979B6097N0483b8295B3508
$$ y = [-102900, 78221, -107223, 123051, 196871, -35100, 8149, 96529, -110173, -67930, 17699, 46970, -44373, 151306, -195765, 253157, 197001, 103675, 59374, 100959, -14835, 121247, 27722, 173042, -98930, -194123, -75184, 182148, 47769, -14467, -146834, 166562, -60434, 16962, -80846, -82081, 32315, -54912, 323352, -149010, 15175, -57212, -32482, -99880, 14160, 359974, -105625, -133594, 134295, 308769, -71512, 82244, -464224, -29852, -234585, -61805, 184167, 94236, 189552, -5863, 6440, -150422, 147967, -175899, 10490, 156952, 5653, -129875, 162588, 11341, -266436, 146434, -289169, -310630, 386792, -163578, -9276, 211298, -31704, 184500, 57018, 307492, 220777, -238835, 20198, -63461, -52254, -110233, 26097, 76580, -28295, 23508]
15742A87189a19678A83394a6120j75857c6234A6274R8138j8879e3448j32640E0598
15730A43051a1225p6560A46844F3326J11496g8623m37695G9340P7175a99713c0960
15718A1180a3463r46M159A49032C4500g7867Q957j24378b5712j41645E022a10987
15705A11179g5908l26029E5673K60372f1097A36827C6989K0523c07798J32164
15695a75634r0344f4516m3352E2964J36189J9626A0527d3351B00791b1397m500
15684b5897N875A55035b00069B91625g3310A6160J69834c10092D0473b1413A4854
15672C18757i282j08183D789a02535A85644D4739b07510P9017B73161j12908f1625
15660A51711A5730a06547C91990G353f5245H9079b8303D4866b38141J11603m8471
$$ y = [187189, -119678, 183394, -16120, -191977, -36234, 16274, 114412, 95533, -53448, -186088, 50598, 143051, -11225, -87785, 146844, 63326, 174822, -78623, -516318, 79340, 156515, -199713, -30960, 11180, -13463, -14409, -10250, 149032, 34500, -77867, -68910, -193288, -25712, -167357, 5022, -110987, 111179, -75908, -401937, 55673, 316045, -61097, 136827, 36989, 57512, -307798, -175634, -265978, -64516, -107868, 52964, 189153, 208779, 10527, -43351, 200791, -21397, -25897, -20022, 155035, -200069, 291625, -73310, 16160, 185994, -310092, 40473, -21413, 14854, 318757, -9282, -117465, 4789, -102535, 185644, 44739, -207510, -128493, 273161, 160253, -61625, 151711, 15730, -106547, 391990, 7353, -65245, 89079, -28303, 44866, -238141, -126538, -175009]
15649a75009A03153e269j28368A01145J4655a39188Q949E1920N4576I167N6327
15638F5494f6141j13672g5564c720B01857A6288a97557B38815b02993i5498A29840
15626A96429c89344e7077a4114o480n6779n1978B89355n0946b26283C7157a85060
15614H1185b09354e9164A32265l9786f6932I3437j234E320M0066N191Q5028K7799
15602A63404b60422D44703A9648a34218O885b2455j51928h023A00143b08174m07048
15591f15222H5803a48351B78596b909D8335J35057n2484d10946J69632B36426
15580c44o3192n5902A16870D9062K20410D1179b3090r8558N9459C60248d9513
15568D9854a83652L7276j00308e0319F4311G354J49118a14905B87612a05810A04288
$$ y = [-175009, 103153, -5269, -133637, 101145, 115800, -139188, -130239, 51920, 106496, 9167, 65494, -66141, -179813, -75564, -3720, 201857, 16288, -197557, 238815, -202993, -95498, 129840, 196429, -389344, -57077, -14114, -20594, -77373, -129351, 289355, 238409, -226283, 37157, -185060, 81185, -209354, -59164, 132265, 92479, -66932, 93437, 92203, 5320, 45386, 50577, 135605, 163404, -260422, 444703, 19648, -134218, -127333, -22455, -174383, -8023, 100143, -208174, -615222, 85803, -148351, 278596, -2909, 48335, 183392, 130908, -410946, -241314, 236426, -344, -63536, -119438, 116870, 49062, 269472, 41179, -23090, -121648, -62189, 360248, -49513, 49854, -183652, -146376, -246684, -50319, 64311, 7354, 156472, -114905, 287612, -105810, 104288]
15556B42738a33308A40520L1259l8875J03151J6224h9325a8428k07712b508m338
15545f846l9485b1579A51375g0209L0971A12647B3372c5870A56647B9724K4330
15534E4054j9302h9627J9076R994N999j59772b6107j79560D7956M6875L82399
15523D77230e0626r3333n1680b7887j60630E4835C683a4997B4139a15859G8348
15511a42814C86047A75637m7917a73718m7848c6652j66758I0552K40531j27106
15501B03977A587K92114H9800R83b4367A02541A5951J38354B8893a60782l32953
15490d93735b218A24621b3901G7621M4126B3842O0411K15912k4361c2141D7890
15478B50371D8952b85000G5306a39697b4938A6130a00796H9945m918l6541a35195
$$ y = [242738, -133308, 140520, 171779, 132904, 236055, 252279, -89325, -18428, -226140, -2508, -6846, -46331, -21579, 151375, -70209, -39238, 112647, 23372, -35870, 156647, 29724, 54054, 34752, -89627, -70551, -60557, -54558, -214330, -26107, -205667, 47956, 94831, 477230, -50626, -143959, -195639, -27887, -188517, 54835, 3683, -14997, 24139, -115859, 78348, -142814, 386047, 175637, 127720, -173718, -221566, -36652, -203410, 90552, 331083, 203977, 1587, 293701, 89800, 90783, -24367, 102541, 15951, 154305, 28893, -160782, -493735, -2218, 124621, -23901, 77621, 121747, 23842, 84253, 300165, 275804, -32141, 47890, 250371, 48952, -285000, 75306, -139697, -24938, 16130, -100796, 89945, 85027, 48486, -135195]
15466B50804d9410j90236I1479N5823l0349i4740B4562Q9599P289b7666A59999
15454A40560a75784A45390N842J79845j51658J8709m4482n8287a14507j13444
15444b27951d1435o8759A91113b05509j91822H129J53235p0733K90761f7430F9761
15432a06696G2246J02313N7083J13650h3854D961d5934E3235K28206a14368A36438
15420B75923A15904b347j41630e7725B09310Q243J0915i6795B68653D7522J34640
15409A82162a15961D5130a60384A75740M1232B0966K12647c5561d983p9826D1790
15397a76937C5557i4724j37407B11090a26601B35291j398J6487a09225l8722a0162
15385G2573B3136J44709E1481Q9051N7452N7972c42667B36328F4962J73821i0767
$$ y = [250804, -49410, -239646, 91479, 147302, 116953, -94740, 24562, 114161, 121450, -27666, 159999, 140560, -175784, 145390, 151232, 331077, 179419, 198128, 153646, 95359, -114507, -227951, -41435, -110194, 191113, -205509, -397331, 8129, 161364, 90631, 381392, -67430, 69761, -106696, 72246, 174559, 231642, 345292, -83854, 4961, -45934, 53235, 281441, -114368, 136438, 275923, 115904, -2347, -143977, -57725, 209310, 217553, 228468, -96795, 268653, 47522, 182162, -115961, 45130, -160384, 175740, 216972, 20966, 233613, -35561, -4983, -84809, 41790, -176937, 35557, -94724, -232131, 211090, -126601, 235291, 233893, 250380, -109225, -147947, -10162, 72573, 23136, 167845, 51481, 140532, 197984, 255956, -342667, 236328, 64962, 238783, -90767]
15373D3913c662E4834J14761l3295k1477L4658k4369R3114a64368N5787C6819
15361a87647f229A63620J62177e3113j79693M0133A72695H6172a16977A88219
15350C23817c09629A26453O256C9474A8629J44222c9750k0779I1656K35154J6316
15339C43126q9110O9334F1936b00681b4960D5350N7696D930L03557N1900O7510
15328D27897h0883C19171o8474J19453b38727A29839a45898C08643A25016K6526
15318A51542m0718j3073a13442A34158i89C09783a15788M1503C93592D8334J46730
15307A95064r4925P5916J29896j07329h4312E6729N0116O2162o0278K58812A41991
15295C30987A7042M84994A49838O7365b06773C49550j55965o1575Q3246a13962
$$ y = [43913, -3662, 54834, 169595, 136300, 114823, 149481, 125112, 218226, -164368, -108581, 36819, -187647, -6229, 163620, 325797, -53113, -232806, -192673, 172695, 86172, -116977, 188219, 323817, -309629, 126453, 132709, 39474, 18629, 162851, -39750, -60529, 91656, 326810, 343126, 254016, 323350, 61936, -200681, -24960, 45350, 103046, 4930, 308487, 360387, 427897, -80883, 319171, 250697, 370150, -238727, 129839, -145898, 308643, 125016, 151542, 110824, 97751, -113442, 134158, -989, 309783, -115788, -74285, 393592, 48334, 195064, 100139, 176055, 305951, 198622, -84312, 56729, 106845, 169007, 108729, 367541, 141991, 330987, 17042, 502036, 149838, 217203, -206773, 349550, 193585, 132010, 215256, -113962]
15284H4122p606l1642J03416J4653d6754J8526D64247j98614j30640J27093o9235
15273A92851O4678j9871J21456K407L9807N8025A40213O4382q3137M1849L31925
15262D95232a92072A65025N0462m9652N4979K11223E8749K58767j19919J7611
15252B15208J1249K88330p446L77080M40918r4510P8618j37569D90085J05255
15242E95340B86925b8958C33409J74810A74155F4025a8217C27342j23793H1791
15231C65696A68258M6662q4582D1549N13620A21527L24165c4921j06392d5611
15220C83574C4935L13345C930J23958A1432J7576L13938b9223j01075F1354i3546
15208B59981h1600C28435D4241R0886N7574K21905L1904j47590p1020c9804I5942
$$ y = [84122, 76516, 44874, 148290, 162943, -46754, -28228, 464247, 265633, 134993, 262086, 192851, 257529, 237658, 359114, 361521, 401328, 459353, 140213, 204595, 121458, 163307, 495232, -192072, 165025, 215487, 165835, 220814, 432037, 58749, 317516, 197597, 215208, 226457, 514787, 507341, 884421, 1325339, 1230829, 1309447, 1171878, 490085, 595340, 286925, -28958, 333409, 508219, 174155, 64025, -18217, 327342, 203549, 81791, 365696, 168258, 214920, 130338, 41549, 555169, 121527, 445692, -34921, -141313, -45611, 383574, 34935, 348280, 3930, 127888, 11432, 29008, 342946, -29223, -130298, 61354, -93546, 259981, -81600, 328435, 44241, 135127, 192701, 414606, 446510, 298920, 227900, -39804, 95942]
15196B21421L34571A42125J2605l9108e085B59676j12807M4181e2376A47850h8200
15184A33598R1449O2639j30593P9919m1527Q2368j22917m6941J68000m1771j4962
15173B19262J04808L2501i0456B67785K11847A44087L29687j24423A56450g0395
15162C30010J58418R5650k69087j07174P5510N7571A19415K33659k2536k0541
15152C09997p1458A10735B1812K69672R5375L9237G5164J86862k8137n4937L59236
15141E38188A78926H6076J25393o0061P1843K32472A51581k3462J81637A50727
15130C28790i1300E25890I3863d6377D86536A51382a52704B96321K66320D4626
15119A66331K52538M2416f541I496L22562F8018L37489j19059J56325D0400J89721
$$ y = [221421, 555992, 142125, 154730, 115622, -5085, 259676, 146869, 191050, -52376, 147850, -88200, 133598, 225047, 287686, 157093, 237012, 195485, 277853, 154936, 107995, 275995, 234224, 219262, 324070, 356571, -90456, 267785, 479632, 144087, 473774, 349351, 156450, -70395, 330010, 488428, 584078, 314991, 207817, 283327, 340898, 119415, 353074, 330538, 309997, 238539, 110735, 21812, 291484, 386859, 426096, 75164, 262026, 233889, 178952, 538188, 178926, 86076, 211469, 151408, 223251, 455723, 151581, 128119, 309756, 150727, 328790, -91300, 525890, 93863, -46377, 486536, 151382, -152704, 296321, 562641, 44626, 166331, 418869, 461285, -6541, 9496, 332058, 68018, 405507, 286448, 442773, 40400, 230121]
15108B30121A04544m9197J76779j10858K16648J17263k18121f8594C57641P8983
15098D36624j70933F9518N0365K84516R9417B39871J33373A57673F0505M72521
15088E33026A64281J13795k7288j13971K32499A53724j0520J79580j6365A1678
15077G7431K66568F9556J79271F883J85193L30323A24256L68974j24797j27032
15067B41401K47682A85224d5043B00670I9394L1390J91777j9686J01774A85055
15056B35967J39330N81J29810M0578B35398J14095K51355A79687J61040K35693
15046E76420j73753A10231K32679A30135R7570J3462q9351K16404f8199C45201
15035F06518B03338K53909m5483j61993k1368L32626k66916a34076E24848k4432
$$ y = [230121, 104544, 55347, 232126, 121268, 337916, 455179, 237058, -68594, 357641, 436624, 265691, 69518, 119883, 404399, 503816, 239871, 373244, 157673, 60505, 533026, 164281, 278076, 250788, 136817, 369316, 153724, 143204, 322784, 306419, 11678, 77431, 343999, 69556, 248827, 6883, 192076, 522399, 124256, 493230, 368433, 241401, 489083, 185224, -45043, 200670, 99394, 130784, 322561, 302875, 404649, 185055, 235967, 375297, 375878, 505688, 546266, 235398, 349493, 600848, 179687, 340727, 576420, 402667, 110231, 342910, 130135, 227705, 241167, 151816, 368220, -68199, 345201, 606518, 203338, 457247, 411764, 249771, 228403, 561029, 294113, -134076, 524848, 500416]
15025E00416K0469k03206j54794J22904m8895K51308k18833o3473L19927j28891
15015C96932p2733C4532K84797J9957K21872j61116q4506j29309K56377B03105
15004C48847Q0022J62941k83189P8934l5827K1256K37004M9909A52282J87220
14994C39502J87654k03200f2592C98466M8478M6545J79846k52484j48944J06934
14984C78841K7962N557J44297P5121j10405q2395K06836J7914B41214J2483J94816
14973D48513R9869q6521p8041K27127L23403A91031J42664K27757p9135j73989
14963C08328K31103K5310j83587J90772n3553K6394K01013l49563J26429k35633
14953B87013J17606j62868K91911P659L3457B83488J31309P2531J36608r8650
$$ y = [500416, 520885, 317679, 162885, 285789, 236894, 488202, 269369, 205896, 525823, 396932, 324199, 34532, 319329, 339286, 561158, 400042, 315536, 186227, 442604, 203105, 348847, 428869, 591810, 308621, 387555, 351728, 372984, 609988, 659897, 152282, 339502, 527156, 323956, -62592, 398466, 446944, 493489, 673335, 420851, 271907, 378841, 406803, 412360, 556657, 631778, 521373, 438978, 645814, 663728, 241214, 253697, 448513, 548382, 461861, 383820, 610947, 934350, 191031, 333695, 561452, 482317, 308328, 539431, 564741, 381154, 571926, 518373, 544767, 745780, 396217, 522646, 287013, 404619, 241751, 533662, 541321, 574778, 283488, 414797, 487328, 623936, 525286]
14943E25286L19264k74315J07979C32676L35694l14714j12635K09766K93930k0950
14933G23767l33080M94071k03298J5202j05413n5304J41033k86071J06172J16441
14923F13520B96460M20350o4678J01816C68454j68835N77241k32759k2825l0894
14913D90382J03221J824k23675N90005l50566j83327K24572K32170B54679M50872
14903G05551A50825R7202M19486J29564Q6042m32118J67971N4720j61228R4741
14893F07205B02333M23657j15981n0551J37792K14338J19072m02229K07093k02865
14883E32659L00779k78072L2731j25563J22121J44036B82049P82367D64478P6467
14873E40945l0497A60468K73212M790L15447j17539k1738l4421j9002K24240L3444
$$ y = [525286, 844550, 570235, 678214, 332676, 668370, 353656, 241021, 450787, 744717, 723767, 390687, 884758, 681460, 696662, 591249, 535945, 676978, 390907, 497079, 613520, 296460, 716810, 652132, 753948, 368454, 199619, 776860, 544101, 521276, 490382, 593603, 595427, 371752, 961757, 611191, 427864, 652436, 884606, 254679, 705551, 150825, 248027, 667513, 797077, 883119, 451001, 618972, 673692, 512464, 607205, 202333, 625990, 510009, 459458, 597250, 811588, 930660, 528431, 735524, 532659, 833438, 555366, 588097, 462534, 584655, 728691, 282049, 1064416, 464478, 540945, 510448, 160468, 433680, 438470, 753917, 636378, 614640, 580219, 561217, 785457, 818901]
14862H18901p6066J80011J3292j1047k9558n2340J13579j76379J79725n8807k56097
14851F45214k72947K47233J7273K2399M80788n54565N3941J37874N2980r427k34051
14840E86712L64730l71808K97895k43436M0236j74450j5290M3403M4238K19840
14830G92070K55457l66337r8417K59688C76111M15620L3848l53157M56740l29655
14820E99507J26267q0234O0570q339J48633j98898L52595j56979J30081j38521
14810H34682J76744m38726p6047j45002P14600k06779M9216M060J91664j51745
14800I52667n7199J96749l93426N17172j6736m00814K48978j04024L75914r1278
14790A228003m84707J52091j5920R9195J338j83211N09862m66633O9362K16821
$$ y = [818901, 742835, 922846, 936138, 925091, 895533, 843193, 956772, 780393, 960118, 901311, 645214, 372267, 619500, 636773, 659172, 1139960, 585395, 639336, 777210, 830190, 820763, 586712, 951442, 579634, 877529, 634093, 674329, 499879, 484589, 527992, 572230, 792070, 1047527, 681190, 582773, 842461, 376111, 791731, 825579, 472422, 929162, 599507, 725774, 645540, 706110, 697771, 846404, 647506, 1000101, 843122, 973203, 834682, 1011426, 572700, 496653, 351651, 1066251, 859472, 908688, 912748, 1104412, 952667, 895468, 1092217, 698791, 1215963, 1199227, 798413, 1047391, 943367, 1319281, 1228003, 743296, 895387, 879467, 978662, 980000, 796789, 1306651, 840018, 909380, 1126201]
14780A126201n41827L81385j6100j49860p544L77742r3275j54991k32304L86960
14770A076387j57296P7241J06594L6923j57420j57057Q6888K57896J21298j02830
14760A188624j17151J32963j64401M0845M4234K09666n00619N45397k55624J80453
14750A304387j53710l9618J05261E54065L68778r5612L43518n7641O5694q0238
14740A098564L92233k17094j56136L66387j11913J35640l06118K15657l84678
14731A032542L15825l46017K45384n58813L30383L05155P026J09040k74712L14096
14721A479909k81675J90840j99034N20540p19865K49070N38366m40449O6395o847
14711A397250k10603J63500k66925N3179r2137K63655K1490L03672L6691k21043
$$ y = [1126201, 584374, 965759, 949659, 799799, 792255, 1169997, 1076722, 921731, 689427, 1076387, 919091, 996332, 1102926, 1139849, 982429, 825372, 912260, 1170156, 1291454, 1188624, 1071473, 1204436, 1040035, 1080880, 1125114, 1334780, 834161, 1379558, 1123934, 1304387, 1150677, 1111059, 1216320, 554065, 922843, 827231, 1170749, 1113108, 1178802, 1098564, 1490797, 1273703, 1117567, 1483954, 1372041, 1507681, 1201563, 1417220, 1032542, 1348367, 1002350, 1247734, 688921, 1019304, 1324459, 1331485, 1440525, 1165813, 1479909, 1198234, 1389074, 1190040, 1710580, 990715, 1239785, 1778151, 1337702, 1404097, 1397250, 1186647, 1350147, 1083222, 1136401, 1044264, 1307919, 1329409, 1633081, 1669772, 1448729]
14701A448729r491M86101o04594L0215n6867K10357m133L90678l31962j95377
14691A363656J83655K0925k77910K84930o0590K15776k54369k3628J6994r5061
14681A374378K9374J51981j59550L35736j31603L9388j48021J63367L07237m04069
14671A558218k3786N0955k03180L53744J35181j01081J24474k49759k47488J69387
14661A566665K69450j327Q3004j00808L7394l54890N02152m63797L64884j68194
14651A734533J05248j8045J75286l21732L78970j00628k89524J16027j52305L49419
14641A977249p0690o3797M39536l73961k6846J1729K8462L18620r6721j32625
14631B010956O1482P7349j36013K53480p0171p8163p7781O2497J71609k92316
$$ y = [1448729, 1439238, 1925339, 1320745, 1350960, 1294093, 1504450, 1500317, 1890995, 1559033, 1363656, 1547311, 1568236, 1290326, 1575256, 1514666, 1730442, 1476073, 1452445, 1469439, 1374378, 1403752, 1555733, 1396183, 1731919, 1600316, 1639704, 1491683, 1655050, 1962287, 1558218, 1534432, 1585387, 1382207, 1735951, 1871132, 1770051, 1894525, 1644766, 1397278, 1566665, 1836115, 1834788, 1917792, 1816984, 1854378, 1499488, 2001640, 1537843, 1902727, 1734533, 1839781, 1821736, 1997022, 1675290, 2054260, 1953632, 1664108, 1780135, 1627830, 1977249, 1906559, 1842762, 2282298, 1908337, 1881491, 1893220, 1921682, 2240302, 2143581, 2010956, 2072438, 2149787, 2013774, 2267254, 2197083, 2118920, 2041139, 2103636, 2275245, 1982929]
14621A982929L54264k00986L52902m43909K01951K15422l54656L44671j01054
14612B351534L81649m80697K80462J25860l18728J43401j78566M1752J98399k40219
14602B304847K36469j86418j10464L94883k980J56944l12650M0714J92686J09507
14592B823538K19656l70074R3985K7189K3449J24789J6070J21821k9487n4489
14582B996447Q7803k70094P5315L99294k81935j26441L32967J59712J26945o8253
14572C431760K59310o10665P27452r85928R69799j84076l46054K11071K47085
14563C719754k40321K93562K74753Q946M2719J06882L57676R2800P0765J05436
14553D832972O02902J47213Q40410R94393J901728N204915Q832197O696593O42256
$$ y = [1982929, 2337193, 2136207, 2489109, 2045200, 2247151, 2462573, 2107917, 2452588, 2351534, 2733183, 2252486, 2532948, 2658808, 2340080, 2483481, 2304915, 2346667, 2545066, 2304847, 2541316, 2354898, 2244434, 2639317, 2636337, 2793281, 2480631, 2521345, 2714031, 2823538, 3043194, 2673120, 2767105, 2794294, 2817743, 2942532, 2958602, 3080423, 3050936, 2996447, 3084250, 2814156, 2889471, 3288765, 3006830, 2880389, 3213356, 3373068, 3500013, 3431760, 3691070, 3080405, 3807857, 2821929, 3791728, 3607652, 3261598, 3472669, 3719754, 3479433, 3772995, 4047748, 4056694, 4099413, 4206295, 4563971, 4656771, 4727536, 4832972, 5435874, 5583087, 6423497, 7417890, 9319618, 14524533, 23356730, 30053323, 30695579]
14544C0695579q460704q629170n788573k079102j054522p65149j05531K8709l22039
14535C519498j82901J35274j87113L89192j10851l3722J68099Q9833j22775n4996
14525C609538K14868j24972J47550J56688l69247L20255o8282L08801k75181J87232
14515D107250R0722j26434M4662N2250L06592k23351K72845j03159j2618R2058
14505D500817l00509L72504k418j28897K88423K16936k29754j64749L84036k85543
14495D650846L59415P122K74232k74220J73218l64493M44515M0849l23945K88165
14485E275704J79698J63463o5710P85j42818K42715K17821j15054P6106M5089
14475E877799J48919q3963j2490R6511R5966K05871m74711N66496j27787N27775
$$ y = [30695579, 22234875, 13605705, 7817132, 5738030, 4683508, 3918359, 3812828, 3841537, 3519498, 3336597, 3471871, 3284758, 3673950, 3563099, 3529377, 3697476, 3787309, 3664534, 3609538, 3824406, 3699434, 3846984, 4003672, 3634425, 3954680, 3886398, 4195199, 3920018, 4107250, 4197972, 4071538, 4116200, 4168450, 4475042, 4251691, 4524536, 4421377, 4408759, 4500817, 4200308, 4572812, 4570394, 4441497, 4729920, 4946856, 4717102, 4552353, 4936389, 4650846, 5010261, 5017383, 5291615, 5017395, 5190613, 4826120, 5270635, 5311484, 4987539, 5275704, 5455402, 5618865, 5553155, 5553940, 5411122, 5653837, 5871658, 5756604, 5832710, 5877799, 6026718, 5942755, 5930265, 6026776, 6122742, 6328613, 5853902, 6420398, 6292611, 6820386]
14465F820386k47203j59381M51123l91556N76130n5567m00425M28639l44958M27232
14455G104420K13051q5670J77711l18123L88110K8327N8259M3456K32247N80627
14445H422415m89562K19367p2525j10340L76238J08826j67179K35587J25717R6977
14435H745521o8751M17846J23660k7177M4194K89467r9744M73393l13666J84949
14425I769692o8453J60732N55306j07706J7746L19876J04060J61508k67044N43692
14415A1189409J90116N94154n60477N0877L79428L09992j07683M83427k52860
14406A2276383M10391K69105k05890K49868K57868L2842L69013N61321k71094
14397A3949807L04542K15239J29286K27110L2380P16640K53742K32979O9357N61043
$$ y = [6820386, 6573183, 6413802, 6864925, 6473369, 7049499, 6993932, 6593507, 7022146, 6677188, 7104420, 7317471, 7231801, 7409512, 7091389, 7479499, 7507826, 7566085, 7609541, 7841788, 8422415, 7932853, 8152220, 8079695, 7969355, 8345593, 8454419, 8287240, 8522827, 8648544, 8745521, 8676770, 9094616, 9218276, 9191099, 9235293, 9524760, 9425016, 9898409, 9584743, 9769692, 9701239, 9861971, 10417277, 10309571, 10327317, 10647193, 10751253, 10912761, 10645717, 11189409, 11379525, 11973679, 11413202, 11464079, 11843507, 12153499, 12045816, 12529243, 12276383, 12686774, 12955879, 12749989, 12999857, 13257725, 13290567, 13659580, 14220901, 13949807, 14254349, 14469588, 14598874, 14825984, 14858364, 15575004, 15828746, 16061725, 16131082, 16692125]
14387A6692125j98350M02703J39737K00620L96062J45185M10513J37264L29428
14378A8655287L20796L83924J48662N64282L90829K25303M39046J72560L53139
14369B1653828O61148K48388L08625K95117N30584O39407N44875J73984O92766
14360B5748722M59113K96380P64630N71157Q14046O56348L96558K47260O54193
14351C0608407N27082Q62372Q08915N53808R22965P76846P22639P74478J033557
14342C7591069Q76139Q82812P63254J379293J014993O58775J133836J339952J665831
14333D7305954O96881J535765J107682J444239J259165J991491J419895J430684
14325E8191756J892132J786087J761867K244108K275376J897711K293734K342399
$$ y = [16692125, 16493775, 16896478, 17036215, 17236835, 17632897, 17778082, 18188595, 18325859, 18655287, 18976083, 19360007, 19508669, 20072951, 20463780, 20689083, 21128129, 21300689, 21653828, 22314976, 22563364, 22871989, 23167106, 23697690, 24337097, 24881972, 25055956, 25748722, 26207835, 26504215, 27268845, 27840002, 28654048, 29310396, 29706954, 29954214, 30608407, 31135489, 31997861, 32806776, 33360584, 34283549, 35060395, 35783034, 36557512, 37591069, 38467208, 39350020, 40113274, 41492567, 42507560, 43166335, 44300171, 45640123, 47305954, 48002835, 49538600, 50646282, 52090521, 53349686, 55341177, 56761072, 58191756, 60083888, 61869975, 63631842, 65875950, 68151326, 70049037, 72342771, 74685170]
14317G4685170K778678K544439K752865K986115K940897L463229L095632L677969
14309I8924994L776417M069521M468496M045902M459859N236849N563878N520691
14301A36066607N775267O094898O722380O967349P294351P247448Q430843Q586580
14293A93185723R329064R252476R981891J0516827J1232960J1503879J2002600
14286B67005420J2193895J2743859J3036868J2741100J1687842J4660319J4569557
14279C58638860J4650912J4133874J3770522J2822163J1796635J0343508P154726
14272D43311200J900908k644466l185478n488943q41903m075296n178789o702458
14264D17094775r776442j1690195j3712531j4756287j4437735j4285144j4282629
$$ y = [74685170, 77463848, 80008287, 82761152, 85747267, 88688164, 92151393, 95247025, 98924994, 102701411, 106770932, 111239428, 115285330, 119745189, 124982038, 130545916, 136066607, 141841874, 147936772, 154659152, 161626501, 168920852, 176168300, 184599143, 193185723, 202514787, 211767263, 221749154, 232265981, 243498941, 255002820, 267005420, 279199315, 291943174, 304980042, 317721142, 329408984, 344069303, 358638860, 373289772, 387423646, 401194168, 414016331, 425812966, 436156474, 443311200, 445212108, 442567642, 439382164, 433893221, 433051318, 428976022, 423797233, 417094775, 407318333, 395628138, 381915607, 367159320, 352721585, 338436441, 324153812]
14257C24153812j4096727j3619051j3129783j2753018j2971313j2393850j1975025
14250B33215045j1780459j1347286j0772424r802383r972803q779476q191900
14243A62568314p568574p593911p082551o425271o038037n700486n127131m992003
14235A12040350n061282m285063m217368m034377l721939l344726l362762l443639
14227H0569194k913273l271792k557634k715935k402856k354953j876633k278518
14219F0197600j934413j881033j609597k282600j095029j648956j634241j112289
14211D6999442j614257j363284r91900j301823j039276r87283r18339j763670
14203C7019610n11426j170248q96455n89656j259539p87581r65016r78141k56735
$$ y = [324153812, 310057085, 296438034, 283308251, 270555233, 257583920, 245190070, 233215045, 221434586, 210087300, 199314876, 189512493, 179539690, 170760214, 162568314, 154999740, 147405829, 140323278, 133898007, 127859970, 122159484, 117032353, 112040350, 106979068, 102694005, 98476637, 94442260, 90720321, 87375595, 84012833, 80569194, 77655921, 74384129, 71826495, 69110560, 66707704, 64352751, 62476118, 60197600, 58263187, 56382154, 54772557, 52489957, 51394928, 49745972, 48111731, 46999442, 45385185, 44021901, 43030001, 41728178, 40688902, 39701619, 38783280, 37019610, 36508184, 35337936, 34441481, 33851825, 32592286, 31804705, 30839689, 29861548, 29604813]
14194B9604813n78062q33698m49449j010067k26042p82295p51316o27166K16990
14185B4563708j043055n74962o07717l17823l00465q66080k27702p4964n85460
14176A9965480n69062m31266k54125m32401k32182r34547J59875j10366n64387
14167A6597019k44047l50624l15006M7008o13898k02040m84970n2185j74618l53864
14157A3852775l01022l71842J37056l40009j73307j62527k04740k10557o70462
14148A1555365M00277l01353o06032M06033o14724k02k34230l2722l99455j69618
14138A0003339J57744j30350n83810K36829j49026o8888n47363J202L76498l69692
14128H926483j03766m60928n5233K5919m45247J10577K62611k99463l08973O2993
$$ y = [29604813, 29026751, 28193053, 27743604, 26733537, 26507495, 25725200, 24973884, 24346718, 24563708, 23520653, 22945691, 22337974, 22020151, 21719686, 20853606, 20625904, 20550940, 19965480, 19396418, 18965152, 18711027, 18278626, 18046444, 17111897, 17271772, 17161406, 16597019, 16352972, 16002348, 15687342, 15734350, 15120452, 14918412, 14433442, 14381257, 14206639, 13852775, 13551753, 13179911, 13316967, 12976958, 12803651, 12641124, 12436384, 12225827, 11555365, 11955642, 11654289, 11048257, 11454290, 10839566, 10839364, 10605134, 10572412, 10172957, 10003339, 10161083, 10030733, 9446923, 9683752, 9534726, 9465838, 8918475, 8919677, 9296175, 8926483, 8822717, 8361789, 8306556, 8332475, 7887228, 7997805, 8260416, 7960953, 7651980, 7714973]
14118G714973J87174l92485m8572j35592q5297q4568j83177l1220j19757k67731
14108F553748J96708m38421L21062k77499R1671l12425J84924k68217O1515m28
14098F112638l16984L73984m23553J952l95402L17681q2357l11783K08436j78509
14088E306103L4392K92072n39981j16312j75615J25157P1847k2025j1834L5351
14078D999155l80897R0029j11842O8651j90356J01327j46127j96539J12109k45961
14068D099549L36012k71701l4564L45741m64688L02651j47959j46705J70193k73176
14058C915353o0342K41077j49499p2941M6965k77740J2935k163k81802L12012
14048C683855k29247k01774J84371K42021l59347Q3342J088j87522L5438o2905
$$ y = [7714973, 7902147, 7509662, 7461090, 7325498, 7240201, 7155633, 6972456, 6941236, 6821479, 6553748, 6750456, 6312035, 6633097, 6355598, 6447269, 6134844, 6319768, 6051551, 6113066, 6112638, 5795654, 6169638, 5746085, 5748037, 5352635, 5670316, 5587959, 5276176, 5484612, 5306103, 5340495, 5632567, 5092586, 4976274, 4800659, 4925816, 4997663, 4975638, 4963804, 4999155, 4618258, 4708287, 4596445, 4665096, 4474740, 4576067, 4429940, 4233401, 4345510, 4099549, 4435561, 4163860, 4129296, 4475037, 4010349, 4313000, 4165041, 4018336, 4188529, 3915353, 3855011, 4096088, 3946589, 3873648, 3920613, 3642873, 3655808, 3653645, 3371843, 3683855, 3454608, 3252834, 3437205, 3679226, 3319879, 3403221, 3404309, 3216787, 3252225, 3189320]
14038C189320l6315l24550L78063j98813k63314L68966k0008J14201m6477j58490
14028C002583N0915J21317k77866N8220j90994J13859j61345o3550l4091K91610
14018B910658j37075k26930J7757r153M0604p6795J05911P3102j79587k0395L03691
14007B801788j43971k99882L06816k52298L3596K27766Q8389n17379K83921j37007
13997B391739K6546L5634k21423L59149J42564j78117M38627R49541R70182L889901
13987H804343Q411357P951047L506696n778203q000515n018688k814577j732814
13979E328646o26667o50008j61139n68950k03290l15592K58651n61976M06921
13970B906596m18167J86244m82254J60278n1368J70927l11288R8310m52010M76766
$$ y = [3189320, 3153005, 2828455, 3206518, 3007705, 2744391, 3113357, 3093349, 3207550, 3161073, 3002583, 3053498, 3174815, 2896949, 2955169, 2764175, 2878034, 2716689, 2653139, 2619048, 2910658, 2773583, 2546653, 2564410, 2555257, 2595861, 2519066, 2624977, 2698079, 2518492, 2498097, 2801788, 2657817, 2357935, 2664751, 2412453, 2446049, 2673815, 2762204, 2244825, 2528746, 2391739, 2418285, 2453919, 2232496, 2591645, 2734209, 2556092, 2994719, 3944260, 4914442, 8804343, 17215700, 25166747, 28673443, 22895240, 14894725, 9876037, 7061460, 5328646, 4701979, 4051971, 3890832, 3321882, 3118592, 2803000, 3061651, 2499675, 2906596, 2488429, 2674673, 2192419, 2352697, 2301329, 2472256, 2160968, 2259278, 1807268, 2284034]
13960B284034j59712l1094J56044n6171n61193N14854j35667J84176m88306L82536
13950B089501J28528k72187j24064k35336M07534k35572R6594n6079K3994j24694
13940A698219P1274j78312K65646j54926k44893M1094j3582L17950p8321l31354
13930A392795K11483j40718J30362o1052J74185J60698j90733J86803k28684k55212
13920A379927p4842L31070l4128k11405n7979K32644J86820n05820K62093p509
13910A500871J97309k77689n1445r9985J06364L2937K4336J0321Q9889k70878
13900A262030J61834K06426k76279k01176K17097j7222J3976K48329l42523K87801
13890A560293l87743J91106j02452J13677k92529J39683J14191k08118J81924
$$ y = [2284034, 2124322, 2093228, 2249272, 2193101, 1631908, 2146762, 2011095, 2195271, 1706965, 2089501, 2218029, 1945842, 1821778, 1586442, 1993976, 1758404, 1854998, 1798919, 1822913, 1698219, 1769493, 1591181, 1856827, 1701901, 1457008, 1498102, 1484520, 1802470, 1724149, 1392795, 1604278, 1463560, 1593922, 1532870, 1707055, 1867753, 1677020, 1863823, 1635139, 1379927, 1305085, 1636155, 1602027, 1390622, 1332643, 1565287, 1752107, 1246287, 1508380, 1500871, 1698180, 1420491, 1369046, 1269061, 1375425, 1408362, 1432698, 1443019, 1532908, 1262030, 1423864, 1630290, 1354011, 1152835, 1369932, 1352710, 1366686, 1615015, 1272492, 1560293, 1172550, 1363656, 1261204, 1374881, 1082352, 1222035, 1336226, 1128108, 1310032]
13881A310032j29920k14649O8941J49590j12356J78565j40732L02634J0192k19164
13871A203133j9258N8713k71242O0589Q7834j91704K90562r0967J88390k85102
13861A030948J10374N9506j6114j64210j91878J3025M26854k36524P5491j58242
13851I49230J05067J94431l02942J57232R5154k25457k17285J28870M9138j02062
13841H31376J64073R132K97377k49683L897L4726k13529j23658J91585J01736
13831A047032n3062k84206k13514K90189K91517j57957L7329o5896k38977K98609
13821I51064k39926K22256K9401k67755j16283K55468R8991M2358o6000j87153
13811G22421Q0173K01085k2580k46022K9668k13416j43525J93085L27387k41492
$$ y = [1310032, 1180112, 965463, 1034404, 1183994, 1071638, 1250203, 1109471, 1412105, 1422297, 1203133, 1183875, 1242588, 971346, 1031935, 1119769, 928065, 1218627, 1127660, 1316050, 1030948, 1141322, 1200828, 1184714, 1020504, 828626, 841651, 1268505, 1031981, 1107472, 949230, 1054297, 1248728, 945786, 1103018, 1198172, 972715, 755430, 884300, 933438, 831376, 995449, 1004581, 1301958, 1052275, 1056172, 1090898, 877369, 753711, 945296, 1047032, 993970, 709764, 496250, 786439, 1077956, 919999, 957328, 891432, 652455, 951064, 711138, 933394, 962795, 695040, 578757, 834225, 933216, 975574, 909574, 722421, 802594, 1003679, 981099, 735077, 764745, 551329, 407804, 600889, 928276, 686784]
13801F86784L58084J53097q7706l25005j7381N878p7999j5657j0223O8294q8742
13790F49424K56604k69806L01705k80713K76951j37851n2965L9208p3058J67878
13780H77377j29502k4738M5508K61856k38243l07688J63625K96285j20674L1348
13770H55154J52252m85494J10123j58140J19113K8438J92756k93022Q9794r5843
13760E15131J57886p5440J32654k02071L87818j62971K00924m42420J22573o0393
13750E73691Q2903J88597q4024J27426r275l01925j743j22894J59516O5623O8580
13739G46475J50843n8874k11184k4860j05876K72942J37138k36807j38409Q5603
13729F16991k31925J84218n5722J59079j49355j36020J71678J00210l05461K68758
$$ y = [686784, 1044868, 1197965, 1110259, 785254, 767873, 773751, 695752, 680095, 669872, 738166, 649424, 906028, 636222, 937927, 657214, 934165, 796314, 743349, 782557, 709499, 877377, 747875, 723137, 768645, 1030501, 792258, 484570, 648195, 944480, 823806, 855154, 1007406, 521912, 632035, 473895, 593008, 621446, 814202, 521180, 610974, 515131, 673017, 597577, 730231, 528160, 915978, 753007, 953931, 511511, 634084, 573691, 656594, 845191, 761167, 888593, 879318, 577393, 575650, 452756, 612272, 677895, 746475, 897318, 838444, 627260, 602400, 496524, 769466, 906604, 669797, 531388, 616991, 385066, 569284, 513562, 672641, 523286, 387266, 558944, 659154, 353693, 622451]
13719F22451j97606m3485K77530k49434M6921J59603B77800K79506J27626A98437
13708F04234k49191M91797N3886C81445K90554j24066j72307o249J80878K56003
13698H06258j94082j13586O319k42360P5765J16511n3913m0813n5789Q4481J76529
13687E65320k20815K34223k35123o4311J22544J74052j88159J98589j71230J73589
13677E88679M53104E20720j3427n0532K3853K5163j03302n6784J52659B44091
13666C39708J86312B40524N78143k88117K21896l46094L91819B75823K28258J83691
13656F87772C13807K45062j61548L47897j91977j45288J84734k72634K24139A67123
13645A09517L75032L6935j10772M5256j34907r5155L38237k53700K17786Q3936
$$ y = [622451, 424845, 381360, 658890, 409456, 456377, 615980, 277800, 557306, 684932, 198437, 604234, 355043, 846840, 900726, 381445, 671999, 547933, 375626, 369377, 550255, 806258, 612176, 498590, 504909, 262549, 338314, 454825, 400912, 360099, 304310, 388791, 565320, 344505, 578728, 343605, 279294, 401838, 575890, 387731, 586320, 415090, 588679, 1041783, 520720, 507293, 456761, 480614, 505777, 402475, 345691, 498350, 244091, 339708, 526020, 240524, 818667, 530550, 752446, 406352, 798171, 275823, 504081, 687772, 313807, 558869, 397321, 745218, 553241, 407953, 592687, 320053, 544192, 167123, 109517, 484549, 521484, 410712, 455968, 321061, 225906, 564143, 310443, 528229, 612165]
13635F12165m2661q8430A42345J55311o2456J58945l8865J82142B58393J00462
13625C58855M0747D9413Q14056l16357A39617a87904D17490J09259p6534j53563
13615B96652O187L22051j72386n7442j10924K2898K19226a99447D05756A65799
13604D21024j79788C3021J71845L1444J24910r8262K79807A52388J58273H2455
13593B26521d5138D32465j47877J05076L60901A66112L29169A43559N12907B15802
13582A09272L67046L15j14710K42854A16765J98863K16843K8844j56909A63865
13571C75434j824A19594K4367L76407J1117l3181k39410J36197o1609Q8217p3480
13560C48219J67705l2882j35654j62506J79835e0464E80899k03091C4203a18702
$$ y = [612165, 569504, 481074, 142345, 297656, 235200, 394145, 355280, 537422, 258393, 358855, 399602, 49413, 863469, 547112, 139617, -187904, 417490, 526749, 450215, 296652, 302839, 624890, 452504, 395062, 284138, 307036, 526262, -199447, 405756, 165799, 421024, 241236, 33021, 204866, 236310, 361220, 262958, 542765, 152388, 310661, 82455, 226521, -45138, 432465, 284588, 389664, 750565, 166112, 495281, 143559, 656466, 215802, 109272, 476318, 476633, 361923, 604777, 116765, 315628, 532471, 561315, 404406, 163865, 375434, 373610, 119594, 143961, 520368, 531485, 498304, 258894, 395091, 333482, 421699, 348219, 515924, 483042, 347388, 184882, 364717, -50464, 580899, 377808, 34203, -118702]
13549A86162o6364M66170A21376L80278p2472Q159N5163j95959J91315l641k08438
13538B75781N5130P5930M72J54547B42264J69252m2736P7388m4254K0144A67229
13526C17475M1904j10137J14927j2675j53711m0029J43764J18228B05293a9749
13515i192B88452K5182G8911J68404j0222K573K11967A67709L47336n7000c8730
13503B29990C4112R0051L977n3149K92918P8821M973B04972J21483M0386J41238
13492E08079E9544e9434E21259A97874Q0661J12557A32355M90843d1751A04420
13481A30007O7436K70863k4182j72606K58231A29368L03995k300F0176J66037
13471B26213I5737R5061F0865K72096p7207N1457F7390J6670J98634A41055c6775
$$ y = [186162, 119798, 585968, 121376, 501654, 429182, 437341, 492504, 296545, 487860, 484219, 275781, 330911, 406841, 407313, 561860, 242264, 411516, 368780, 446168, 401914, 422058, 167229, 317475, 359379, 249242, 364169, 351494, 197783, 157754, 301518, 419746, 205293, -19749, -9192, 288452, 313634, 78911, 247315, 237093, 239666, 451633, 167709, 515045, 458045, -38730, 229990, 34112, 124163, 128140, 74991, 367909, 446730, 451703, 204972, 326455, 366841, 508079, 59544, -59434, 521259, 197874, 278535, 391092, 132355, 623198, -41751, 104420, 130007, 197443, 468306, 444124, 271518, 529749, 129368, 433363, 431063, 60176, 226213, 95737, 190798, 60865, 332961, 255754, 307211, 67390, 84060, 282694, 141055, -36775]
13459c8074D46269C6611J8616J15139o5370M3638b7683A98528o1707o5654Q3028
13448A54195R1981J26903A75553K40169k06534r0221J91213F4829L35982A26942
13437C78986A88515k5063O0187J10984p7322J43529r1119j49021K43818q8760
13427C15748A45421J17471b2501D03046M5332O3058k31832j35274L09069p6253
13417C77146j38073I903M15814j52505b4324A8583M17225A27554K70356G4996
13406A97993J04278g4166C42215A46111J41557j936J06768j23740D4419J73002
13396B17421m7650L2990L455B9094J07384K47066q9560Q391m2710a05907B28082
13384C07035a486A51669J1710o7400L29341B359a2277A06280J27105L08155k17689
$$ y = [-38074, 446269, 36611, 55227, 170366, 104996, 148634, -27683, 198528, 136821, 71167, 154195, 246176, 373079, 175553, 415722, 209188, 118967, 310180, 64829, 400811, 126942, 378986, 188515, 163452, 223639, 334623, 257301, 400830, 309711, 160690, 404508, 315748, 145421, 262892, -22501, 403046, 448378, 511436, 279604, 144330, 453399, 377146, 239073, 9903, 425717, 273212, -24324, 18583, 435808, 127554, 397910, 74996, 197993, 302271, -74166, 342215, 146111, 287668, 285732, 392500, 268760, 44419, 217421, 169771, 202761, 206216, 29094, 136478, 383544, 293984, 302375, 259665, -105907, 228082, 307035, -1486, 151669, 163379, 95979, 425320, 2359, -12277, 106280, 233385, 541540, 323851]
13373C23851l4153l0917K2457J05659j48479J31430j55933n6820J30618K68276
13363E55989j70651A61570a2297H4465J20775b4369C27676A58541p6800L48784
13353D30525n5874J62771p6609j88223N4690B4606R8458J43161j07432K18534
13343C77327b8449D36252A40457P1736I0140J28727J73568A74715B3484L75078
13333C98562J30893D4675J02661K42292Q8822A84275K7504P1891I8341C9864J96409
13322B36273a33474H1392L0454n3803L97339k01017R8423j23937J92042r8632
13312C22261A22087a30993A79636O4156I4295L1191K72003H9298M00464k34702
13302B55060c0527A98059a8687B88957a28144M4382B88635a3079E08258A51702
$$ y = [323851, 289698, 258781, 281238, 386897, 238418, 369848, 213915, 157095, 287713, 555989, 385338, 161570, -12297, 84465, 205240, -24369, 327676, 158541, 81741, 430525, 374651, 537422, 460813, 272590, 327280, 24606, 123064, 266225, 158793, 377327, -28449, 436252, 140457, 212193, 90140, 218867, 392435, 174715, 23484, 398562, 529455, 44675, 147336, 389628, 478450, 184275, 211779, 283670, 98341, 39864, 236273, -133474, 81392, 111846, 58043, 455382, 254365, 352788, 228851, 420893, 322261, 122087, -130993, 179636, 243792, 94295, 125486, 397489, 89298, 489762, 255060, -30527, 198059, -18687, 288957, -128144, -83762, 288635, -13079, 508258, 151702]
13291a00456H3421K60786a42257B3536P4694B196b45048A83347n1204O2817G1193
13279a11336a6794B50252o5426g7900A61855d315C1503A4196R6209I145K29519
13268B38664J4698I9400a90028I2953R8804Q716a04811n0223e9409j59867J06060
13257a13216A49047a3042A62145J28989p1429I614J39195F589c22539H1140J0522
13246I1662J579J59491H1958K15247Q5098a50928B67303m7954E2888c8214E2224
13234F5360A2163L21253d0878D96827j46238E3889K06896a8874A72201l3863R4447
13223B32785f4728B63930o146J74612F6785d0882I0446e8812B94906B8201c9936
13211B96530K7167f6810B44289b03108G6438a88242G9133B9580i5115A15837c0029
$$ y = [-100456, 83421, 344207, -142257, 23536, 98230, 2196, -245048, 183347, 132143, 194960, 71193, -111336, -16794, 250252, 184826, -77900, 161855, -4315, 31503, 14196, 110405, 9145, 238664, 253362, 99400, -190028, 92953, 191757, 200473, -104811, -155034, -59409, -219276, -113216, 149047, -13042, 162145, 291134, 219705, 9614, 148809, 6589, -322539, 81140, 91662, 93241, 252732, 81958, 297205, 382303, -150928, 267303, 219349, 52888, -38214, 52224, 65360, 12163, 333416, -40878, 496827, 350589, 53889, 260785, -18874, 172201, 138338, 232785, -64728, 263930, 257784, 432396, 66785, -40882, 90446, -58812, 294906, 28201, -39936, 296530, 323697, -66810, 244289, -203108, 76438, -188242, 79133, 29580, -95115, 115837, -30029]
13199C2552a97977A9834k662J32542a50500C35832j04446H2206a1907l8205B28132
13187F6709J1666k8282K7963Q7164M2913a93675A71892f9389C2645a18744J3358
13176a05386B582O5468a00501B86565L2233C0473a80667B54753j11335B9925P4513
13165A04438m8835i840A19941b5094E5740J00958E3707J12088c4284A59980g1599
13153G6847L502C9778Q0852C1725d6017B38377q1323c0641A42110a73031P1808
13142a01223G7190j1283D870a56398B61330A29775K5311a56634g7420B11380J67868
13131C79248G8034b23563a4589B88790N9498A01085a53206A8578Q7180K4452h4663
13119I7682b58428A69491d047B35110b4829C81398j16873a1559A7001J1489J34728
$$ y = [32552, -197977, 19834, 17172, 149714, -150500, 335832, 231386, 82206, -11907, -50112, 228132, 66709, 78375, 50093, 78056, 165220, 208133, -193675, 171892, -69389, 32645, -118744, -105386, 2582, 68050, -100501, 286565, 318798, 30473, -180667, 254753, 143418, 29925, 104438, 55603, -9840, 119941, -25094, 55740, 156698, 53707, 165795, -34284, 159980, -71599, 76847, 80349, 39778, 120630, 31725, -46017, 238377, 157054, -30641, 142110, -173031, -101223, 77190, 65907, 4870, -156398, 261330, 129775, 155086, -156634, -77420, 211380, 379248, 78034, -223563, -14589, 288790, 348288, 101085, -153206, 18578, 105758, 130210, -84663, 97682, -258428, 169491, -4047, 235110, -24829, 381398, 264525, -11559, 17001, 28490, 163218]
13108A63218k1615F2645J23797g7346A40219a6504B52986e7354A05173d5417k42260
13097b87677B9877a01616F8382J64901A3119K4265P9125B9848L296j2555J87216
13086B07805J82303h2231B27733f6294A72607K9218j6602p0059J80478G388b14187
13074E27068c9994D3539J33894M7647L2118L4919D8485J94949I0478L94425a07382
13062C21326b0813B82936A12202N5040J02582D2220l416f4712C6667Q5306a3264
13050A61944P3932c5311I2942J27593P994b61029d7810O941B80120b5111j89320
13039b14431D3285P2844K2806n8832A6500P8870a06824G9131J86702G2102F517
13027F5967a99882A47351P1613i0471j2036A96358k5307D5185R820L020K7275
$$ y = [163218, 141603, 62645, 186442, -77346, 140219, -16504, 252986, -57354, 105173, -45417, -287677, 29877, -101616, 68382, 233283, 13119, 37384, 116509, 29848, 33144, 20589, 207805, 390108, -82231, 227733, -66294, 172607, 201825, 185223, 115164, 295642, 7388, -214187, 527068, -39994, 43539, 177433, 225080, 257198, 292117, 48485, 243434, 90478, 484903, -107382, 321326, -20813, 282936, 112202, 167242, 269824, 42220, 38804, -64712, 36667, 121973, -13264, 161944, 235876, -35311, 92942, 220535, 228529, -261029, -47810, -40869, 280120, -25111, -214431, 43285, 116129, 138935, 80103, 16500, 95370, -106824, 79131, 265833, 72102, 6517, 65967, -199882, 147351, 218964, -90471, -102507, 196358, 171051, 45185, 55005, 58025, 85300]
13016H5300L98568j59842L2572p2904j06255e9467F4024d9678B99686F6099J25583
13005A91682J31247A21519m9091Q1829B2316K15796d3469D7751K05619b17192
12994a74330A52651g230B03483K4947c26401g7959H8667K72177A29258O6141G1958
12982a39338c2579l5737j6150J0551a7712r5470B8617i547l82271A23187A3613
12970A38333J90474J60416a10126C25634j18247a52969B88147E9491M0018a0745
12959A09214N3330b40605A57651L1214j7892k917L8477a33925q0758A83777i8181
12947a828q3206B58585b08696k1884D9597j0585m470J50947A6117P5356d6672
12935h6125B02205K10276a17093E2752b0180A33413g3881C80127q2404j39623
$$ y = [85300, 483868, 324026, 356598, 283694, 177439, -59467, 64024, -49678, 299686, 66099, 191682, 322929, 121519, 72428, 154257, 22316, 238112, -43469, 47751, 253370, -217192, -174330, 152651, -7230, 203483, 228430, -326401, -77959, 88667, 360844, 129258, 195399, 71958, -139338, -32579, -68316, -84466, -73915, -17712, -113182, 28617, -9547, -391818, 123187, 13613, 138333, 328807, 489223, -110126, 325634, 207387, -152969, 288147, 59491, 99509, -10745, 109214, 162544, -240605, 157651, 188865, 170973, 168056, 206533, -133925, -214683, 183777, -98181, -1828, -85034, 258585, -208696, -230580, 49597, 39012, 34542, 185489, 16117, 91473, -46672, -86125, 202205, 412481, -117093, 52752, -20180, 133413, -73881, 380127, 297723, 158100]
12925A58100K9616B7881g5891a9725k50730B24084b04252R8641b9529k27744A07798
12913I557K27966h4467B75848b80859A93485A2274d66099C17669D1111j2348b07376
12901E7893b4824C13681b7678B15274b93589A31325l4997D6417O492g8971p2781
12890a51752I9272P038O4078m1862K92839j05737D0836K85814E1930a40068b7724
12878H7951J47353c2150n7373q9880B07264O405O6767j17064b501D2817J77414
12867B20231c9320q5631c8423k05364C0523a21478P615e5297j38539j13734J24453
12856a83117B61319j6682d03077a8282n7842j08240A45626b56945e4706H415L7239
12845D5654g4067k3830B13951g9236G6596O0034a12628M7672D7948a27009q3074
$$ y = [158100, 187716, 27881, -75891, -19725, -270455, 224084, -204252, -105611, -29529, -257273, 107798, 9557, 237523, -84467, 275848, -280859, 193485, 12274, -466099, 317669, 41111, 28763, -207376, 57893, -24824, 313681, -27678, 215274, -293589, 131325, 96328, 46417, 52909, -78971, -151752, 99272, 106310, 170388, 128526, 421365, 315628, 40836, 326650, 51930, -140068, -27724, 87951, 235304, -32150, -89523, -179403, 207264, 213669, 280436, 163372, -2501, 42817, 220231, -39320, -124951, -38423, -243787, 30523, -121478, -113863, -55297, -193836, -307570, -183117, 261319, 244637, -403077, -18282, -76124, -184364, 145626, -256945, -54706, 8415, 45654, -74067, -97897, 213951, -79236, 76596, 136630, -112628, -64956, 47948, -127009, -210083]
12834b10083A77556F1002b33565A44254f0331j33747R6571j00740j11792C4098
12823c4004G7647K7755L7633B240a34586M1767C43402a08237j07378B26326b45031
12811e6146B16999P6610g1930E9435A0236O3126g7826j53895B78271o4896a56528
12799c3735A57705c2714j20414O1629j11379B04522p4315b2746G5115d6753k78637
12788c25390i8257K0528C0374A382L16714b78683B75939h0400B0551a34542F8388
12776A45626m4150J99178F6959a4878k71150B57990d5031I4640i886A659J80303
12765A81962g324G1201i7546C6848J16900a56630n4259N153j68827D9381G997
12753c9894r2772k95142A06106b4475A73506K6235e1714j52015A4600L428b61739
$$ y = [-210083, 177556, 61002, -233565, 144254, -60331, -194078, -97507, -198247, -310039, 34098, -34004, 77647, 105402, 143035, 2240, -134586, -92819, 343402, -108237, -215615, 226326, -245031, -56146, 216999, 293609, -71930, 59435, 10236, 73362, -77826, -231721, 278271, 213375, -156528, -33735, 157705, -32714, -153128, -91499, -202878, 204522, 130207, -22746, 75115, -46753, -325390, -98257, -77729, 30374, 1382, 318096, -278683, 275939, -80400, 20551, -134542, 68388, 145626, 101476, 300654, 66959, -14878, -286028, 257990, -45031, 94640, -9886, 1659, 181962, -7324, 71201, -97546, 36848, 153748, -156630, -210889, -205736, -374563, 49381, 7997, -39894, -132666, -427808, 106106, -24475, 173506, 199741, -51714, -203729, 14600, 18028, -261739]
12741a8321j38109m4392h3956E627c08351A27757K4514E5044K07731j12111K15118
12730C65782g964j38799f2113E4915a18613A30076J99255b63988P4331a8209A70955
12718A06827a10152b0488B08752a44457j87711J59244B37690h0770b4550B73873
12707D56104i625B52324p3117J16885b9805q7210A2925K27470f6880B33020D6202
12695e4186l94580G8177a27669A94548q2457k5657M4397a58077j6379b042F5141
12683A86089F9769J86783A2696K1638K2220J17626B9840L05450o7678j4215O0503
12672C13900a36984B01090G2150J32542Q3556F061b19011A84397D9745D527i9853
12660C83618I1731L4996J4289C6101J82097A4177J71990J8871a70757B69714C3316
$$ y = [-18321, -156430, -200822, -83956, 5627, -308351, 127757, 152271, 55044, 262775, 150664, 365782, -7964, -146763, -62113, 54915, -118613, 130076, 329331, -263988, -189657, -18209, 170955, 106827, -110152, -20488, 208752, -144457, -332168, -172924, 237690, -80770, -24550, 273873, 456104, -9625, 252324, 179207, 296092, -29805, -117015, 12925, 240395, -66880, 233020, 46202, -54186, -448766, 78177, -127669, 194548, 112091, 86434, 130831, -158077, -174456, -2042, 65141, 186089, 69769, 256552, 12696, 34334, 56554, 174180, 29840, 335290, 267612, 253397, 313900, -136984, 201090, 72150, 204692, 288248, 6061, -219011, 184397, 49745, 4527, -99853, 383618, 91731, 126727, 141016, 36101, 218198, 14177, 186167, 205038, -170757, 269714, 33316]
12648I33L89800A74309K581b05464B8361i7624A95784C1661J19002a26453j15764
12637b42217A4333a13282C9167K57623G2401L9405D4708J13463O5148C9845J01105
12626A40950L77134A37625H337J2819J30176a84667A76474R7025j5917j18239
12616A39343a22925A87750C4369c7652B17131i317A87071E6329O423a30503m6486
12605a76989A06405b34979j55816A53893k8792J92680d6005j78986C8215N9675
12595I7890h898B70556E6914b05096b2705q735k01764J3372i3898D34873F7691
12583C0157L7703i1236H3671a01010A80678e1972O573C27165g58k4517B94448
12571a78956d3806F9785q580e5631A42155a94491A11227E3240L42822H2069a72654
$$ y = [933, 390733, 174309, 176890, -205464, 28361, -97624, 195784, 31661, 150663, -126453, -242217, 14333, -113282, 39167, 296790, 72401, 111806, 44708, 158171, 223319, 39845, 140950, 518084, 137625, 8337, 21156, 151332, -184667, 176474, 273499, 257582, 139343, -122925, 187750, 34369, -37652, 217131, -9317, 187071, 56329, 62752, -130503, -176989, 106405, -234979, -390795, 153893, 125101, 317781, -46005, -224991, 38215, 97890, -8898, 270556, 56914, -205096, -22705, -31440, -233204, -219832, -93898, 434873, 67691, 30157, 67860, -91236, 83671, -101010, 180678, -51972, -45399, 327165, -758, -25275, 294448, -178956, -43806, 69785, 61205, -55631, 142155, -194491, 111227, 53240, 396062, 82069, -172654]
12559A87136d25429J15108a52748E204L768a24762a6614j2917A974a54055A41762
12547c55764A61869K4018N5381a67155C2032Q316K10385H0830l513J54776p4765
12536A57328C2387a92104H3095j7895q848a81327A91700a65150l8266d7052j73678
12525b20730g8371C9004P8490b66382I6324J07453p0994a64806B50809n3432a5286
12513C28999a40580D2230J04798K83975j21760o2118c29485C44624I8729b797
12502a20168j49427A23997c8344A62944p4955L9052c8669k54608J02794B43308
12491A38831M11K1564G6993a4383A8313M2959B6519a50482j5401F745K7223J06408
12479A40376j8826n8290J20200a28521a1419B2199J72126b42407A22552E9089
$$ y = [187136, -425429, -310321, -152748, 5204, 8972, -124762, -16614, -29531, 1974, -154055, 141762, -355764, 161869, 185887, 241268, -167155, 32032, 40348, 250733, 80830, 77317, 232093, 157328, 32387, -192104, 83095, 65200, 56352, -181327, 191700, -165150, -203416, -47052, -220730, -78371, 39004, 117494, -266382, 96324, 203777, 132783, -164806, 250809, 197377, -15286, 328999, -140580, 42230, 147028, 431003, 309243, 247125, -329485, 344624, 98729, -2797, -120168, -269595, 123997, -38344, 162944, 87989, 127041, -38669, -293277, -190483, 243308, 138831, 139242, 160806, 76993, -14383, 18313, 61272, 26519, -150482, -165883, 6745, 33968, 140376, 121550, 63260, 183460, -128521, -11419, 22199, 194325, -242407, 122552, 59089]
12468a73408N5536c4292k6328A19101a41616k9335b2248B58388F7710k7323N4252
12457I4639a87141b2839k79388a06866A58801O7111h7860H005J17173R7105h1909
12445B19763J20804H8705h0940A2158J73536c85152a17171n6157j27655i2040
12434E7794J14803Q2206d8260A25105b46229k27504A01706d3488C68184B0377
12423G2197l92a13304l1745B25082g4230p0794F3558k9471e8508A32684j1148
12412A21536a09034j435r6810c1044p6598A2994a43301n3864B10190A9208J52261
12401A71469a55175I6051b14641F1211P661b36598L7373F9045R3360j8315e0016
12389b20337A21727a91333n1103c6975k15253R8858j03188B6183J0001b09621
$$ y = [-173408, -117872, -34292, -60620, 119101, -141616, -170951, -22248, 258388, 67710, 40387, 94639, -187141, -22839, -302227, -106866, 158801, 225912, -87860, 8005, 125178, 222283, -81909, 219763, 340567, 88705, -80940, 12158, 185694, -385152, -117171, -173328, -300983, -92040, 57794, 172597, 254803, -48260, 125105, -246229, -473733, 101706, -43488, 368184, 20377, 72197, 71805, -113304, -145049, 225082, -74230, -145024, 63558, 34087, -58508, 132684, 121536, -109034, -110469, -207279, -31044, -107642, 12994, -143301, -197165, 210190, 19208, 171469, -155175, 96051, -214641, 61211, 68872, -236598, -199225, 69045, 162405, 144090, -50016, -220337, 121727, -191333, -242436, -36975, -252228, -153370, -256558, 26183, 36184, -209621]
12378f2491B57553a79522M1933f8219j5598A74049n6485b12418L9092G4256O9495
12367A43751m0979b68380h23A6722K46968j10554F5997b90179i0235H9074J64708
12356B53782b26868F4284g8754E2769N5014b31662i1137K3327j01204o9379A34178
12344a14874L9615j24473l5872C9381b70280b0914C23811A06341L5875i9856a8770
12332C26056a81006B69255q3926b41101D5763b19407J6688A83358b81941I1784
12321c42621b0474G8438P0067d83153J51146K2200I2022K44032B0373a88270K0839
12310a67431g0428j38380B32197p5241a51294A26893M2336B7752a93307C21093
12299D6977f1825A23725J7157K21892M7702F7974a26280C7051j5538d0236A20480
$$ y = [-62491, 257553, -179522, -137589, -68219, -83817, 174049, 117564, -212418, -173326, 74256, 143751, 102772, -268380, -823, 16722, 263690, 153136, 65997, -290179, -90235, 89074, 253782, -226868, 64284, -78754, 52769, 107783, -231662, -91137, -67810, -169014, -238393, 134178, -114874, -75259, -199732, -235604, 39381, -270280, -20914, 323811, 106341, 142216, -99856, -18770, 326056, -181006, 269255, 185329, -241101, 45763, -219407, -202719, 183358, -281941, 91784, -342621, -20474, 78438, 148505, -483153, -332007, -309807, 92022, 336054, 20373, -188270, -167431, -70428, -208808, 232197, 156956, -151294, 126893, 169229, 27752, -193307, 321093, 46977, -61825, 123725, 140882, 362774, 410476, 67974, -126280, 37051, 21513, -40236, 120480]
12287A52429E8299J4598b40629A05479J24232A03835L2235A1655d2113A33683
12276G4357J24351d6283A66551J39368A3508J4052J24209a00975J6685j53832
12266b38122A2894a75819A65731p93l9874K36954B2301a09139B68160P1282A59178
12254A6288K7830a85579B71822A24313J49616a05689j1423A44327C8165J29984
12244A68149f5321B83884H1891L4493E7153J0171b92335H8083J86415C1566i2484
12232B08390K03783A98156d30516D40005G1941b6956D01402f458A88801q8251
12222A00550K43957j70556K68702j79412P5962J64828j54641D0511J88052I0774
12211A57878h6755B09653K64585A02745a21411l7647c2764B40082b1869B71480
$$ y = [152429, 58299, 72897, -240629, 105479, 229711, 103835, 136070, 11655, -42113, 133683, 74357, 198708, -46283, 166551, 305919, 13508, 27560, 151769, -100975, -84290, -238122, 12894, -175819, 165731, 164938, 125064, 362018, 22301, -109139, 268160, 339442, 159178, 16288, 44118, -185579, 271822, 124313, 273929, -105689, -117112, 144327, 38165, 168149, -65321, 283884, 81891, 116384, 57153, 67324, -292335, 88083, 274498, 31566, -92484, 208390, 412173, 198156, -430516, 440005, 71941, -26956, 401402, -6458, 188801, 100550, 344507, 173951, 442653, 263241, 339203, 504031, 349390, 40511, 228563, 90774, 157878, -86755, 209653, 474238, 102745, -121411, -159058, -32764, 240082, -21869, 271480]
12200A28300a52315C21197b25053N3786I3145K10673p1772Q3277a16827A82331
12189B27984r2795f6885A83775B4158b8121J2941H24a25699G3461b3443E7528
12177A55219O9335o6567a96970R0852A89646L8396G4627R7377N5436f9636A24634
12165c1876D29061g7261i944B04945A1651J03472g2969C6180b42619A57918B1331
12153F6324J4238M9844J20768C4221M89509f6812K5115B32709h9210C85727F0795
12141d6507h96I9022K8679a63981B43651b49858m6741G4492a20626K5781C0338
12129a93173C7282a63899b2179m35550A8322h0087A16003a28096n393A08800J48613
12118B57413a70811A09344c34673e9013A85444e9295j17753K7339b0338r2307
$$ y = [128300, -152315, 321197, -225053, -171267, 93145, 303818, 232046, 315323, -116827, 182331, 227984, 135189, -66885, 183775, 24158, -28121, -15180, 824, -125699, 73461, -23443, 57528, 155219, 224554, 157987, -196970, -106118, 189646, 228042, 74627, 172004, 227440, -69636, 124634, -31876, 429061, -77261, -9944, 204945, 11651, 115123, -72969, 36180, -242619, 157918, 21331, 66324, 80562, 130406, 251174, 34221, 523730, -66812, -41697, 232709, -89210, 385727, 60795, -46507, -896, 99022, 127701, -163981, 243651, -249858, -296599, 74492, -120626, -94845, 30338, -193173, 37282, -163899, -22179, -457729, 18322, -80087, 116003, -128096, -133489, 108800, 257413, -170811, 109344, -334673, -59013, 185444, -59295, -177048, -149709, -20338, -112645]
12108a12645C95775E6297R8602h7907A67201J41377E6664a20353j17169A4741
12097E2367J05648M0333a21036N6200j37483G8505b3771k55211i0072j94748A82525
12085h5673Q183j47304r9492i1193A18113a83544k28487a74182B290O0413L02064
12074C64767e4235D6405b10603A39656B2164J44148k1976M5805b01814G7243j6161
12063F1082Q9861M780c32345g3160j793c113C23330b15628A23656J83492J48163
12052D55311M89278j09172k43490k24010a67319a3059C21999A35227l7522c3590
12041D19726a30168K7421A22844l0994R0180h7639A09057G514a01193H0610J53386
12030B33996l1701q2819L9919a35490o0344H3047a12897D5545a0650r512A32066
$$ y = [-112645, 395775, 56297, 154899, -87907, 167201, 308578, 56664, -120353, -237522, 14741, 52367, 158015, 198348, -121036, -64836, -202319, 78505, -23771, -278982, -90072, -284820, 182525, -85673, -77490, -224794, -324286, -91193, 118113, -183544, -412031, -174182, 2290, 62703, 364767, -54235, 46405, -210603, 139656, 22164, 166312, 144336, 190141, -201814, 77243, 61082, 150943, 155723, -332345, -73160, -74953, -3113, 323330, -215628, 123656, 307148, 455311, 944589, 835417, 591927, 367917, -167319, -13059, 321999, 135227, 97705, -33590, 419726, -130168, -102747, 122844, 91850, 182030, -87639, 109057, 7514, -101193, 80610, 233996, 202295, 119476, 159395, -135490, -195834, 83047, -112897, 45545, -10650, -20162, 132066]
12018A85795R7704C4021J48357b57753B00571k2067C7008J80907h9670A47836
12007a19538N9543C8393M918M0233J49370J3320a18145q1618A59256P5400d75305
11995a5363j65704n5758B3645P7082J18038d0114j22361c5567A5649g7567L0676
11984d6891O977d669r2866C25372a9939l01941f5915j59013q2868J39217O3601
11973a04978H5623c77824C52676a75886E222J05377b2987A57617J31327a70824
11962C07567b71432A22629a18006A89820J22229C4542b8119j81922e2392j31016
11952a83408C00600C7806O9823a38857H0536J61275l6000a61211c9681n4692F2271
11940c54279B735g6214k9725j04084q0499J10035J0568A25651n1933d6490j10363
$$ y = [185795, 283499, 34021, 182378, -257753, 200571, 178504, 37008, 217915, -89670, 147836, -119538, -59995, 38393, 43311, 83544, 232914, 246234, -118145, -199763, 159256, 234656, -475305, -15363, -181067, -236825, 23645, 100727, 218765, -40114, -162475, -35567, 15649, -77567, -46891, -39914, -4669, -97535, 325372, -19939, -321880, -65915, -224928, -307796, -168579, -104978, 85623, -377824, 352676, -175886, 5222, 110599, -22987, 157617, 288944, -170824, 307567, -271432, 122629, -118006, 189820, 312049, 34542, -28119, -210041, -52392, -183408, 300600, 37806, 107629, -138857, 80536, 241811, 205811, -161211, -39681, -94373, 62271, -354279, 2735, -76214, -105939, -210023, -290522, -180487, -169919, 125651, 73718, -46490, -156853]
11929a56853A13450J96742B4625L11210A22395N534i3756B12102c35695h8048
11918a50810H3064a30218L3442F7272b73853e3830j12633k40153i8325M1868A27994
11906a46888c2366q1275A91918i0054L2652o8714G8305J11810K5847A0466J47
11895A0613O4638n709J27544n9035A5927e1343l80600b06721B95893a59433g6481
11883a79851k84856A19199c32825J52747E5866L18119C1509G156b67786A09233
11872A72752j8088d3365p9764n34863B65295A3176h38o4289B11834E1123b77815
11860b23385C2196d48781C2498M0810a63119A17428m1148b626C9855e5492k21848
11849b77340A17121b65265B94103e4879F4261b10119C7459P2549a68586a0704
$$ y = [-156853, 113450, 310192, 24625, 335835, 122395, 127929, -93756, 212102, -335695, -88048, -150810, 83064, -130218, -96776, 67272, -273853, -53830, -166463, -406616, -98325, -56457, 127994, -146888, -32366, -113641, 191918, -90054, -57402, -126116, 78305, 190115, 215962, 10466, 10613, 75251, 69542, 197086, 138051, 15927, -51343, -431943, -206721, 295893, -159433, -76481, -179851, -464707, 119199, -332825, -180078, 55866, 373985, 31509, 7156, -267786, 109233, 172752, 154664, -43365, -123129, -657992, 265295, 13176, -838, -65127, 211834, 51123, -277815, -223385, 32196, -448781, 32498, 73308, -163119, 117428, 76280, -2626, 39855, -55492, -277340, 117121, -265265, 294103, -54879, 64261, -210119, 37459, 110008, -168586, -10704]
11838h1183r1895b7575A24318c0262A15632R2138I0469d0789o9342j84287Q5644
11827b08774h3805j4379F7036a10466B39392g9997k28493A93023d8488A18416
11816G152b78138J37064r990j1408p0095E0956j8160N9582g1326k59726a45026
11804A52787J07902l2578o451c8762E4726K10057e483j11990A75868b62348J16423
11793a45925B9640K9732K7837a2242j38598j17497a2315j86664C50246d661A58817
11781b5837q0596A36109i5831E1704c4451A73589a54685f0077l4750J7201J6746
11770f0880A96054n9711a01889b4294k7971a685A82139B2054b36037d5133C45296
11758b38636N0341A5531L18224j66357j0679b23542B81656J53572E7950K9017
$$ y = [-81183, -173078, -27575, 124318, -30262, 115632, 207770, 90469, -40789, -110131, -294418, -208774, -83805, -98184, 67036, -110466, 239392, -79997, -308490, 193023, -48488, 118416, 7152, -278138, -141074, -151064, -162472, -232567, 50956, 32796, 92378, -71326, -331052, -145026, 152787, 260689, 228111, 221660, -38762, 54726, 264783, -5483, -117473, 175868, -262348, -145925, 29640, 59372, 87209, -12242, -150840, -268337, -12315, -198979, 350246, -4661, 158817, -25837, -106433, 136109, -95831, 51704, -34451, 173589, -154685, -60077, -94827, -77626, -60880, 196054, 136343, -101889, -24294, -52265, -1685, 182139, 22054, -236037, -45133, 345296, -238636, -188295, 15531, 333755, 167398, 156719, -223542, 281656, 435228, 57950, 86967]
11748H6967C9483a19954f33l84603A45590a60153C4267b84900A81606a05328j32696
11737b38024P9618E7080M5927c60275C37420j30757A9890J59829c53802E1209
11726A30846c05717C8302g0525q0047A35526f770n4896k48204f1554m5225a0975
11714c71363C6872J15867a21601k2258A77365D7827f1118B2403Q2276K1796m8024
11703G8451h4185A91085a41002a6368A92629o8901k1494b0939n7760n7742A45920
11691a73390A31373A7108o562K45793j16060d2560D5083K8800b00544d7355j23423
11680a70778Q1946B14306J11540j40913l1382J37724h5350D0045b94787B46317
11669h2325k3587o1634K186i119m6224I7156O31A1118f5113C336R5695K12981
$$ y = [86967, 39483, -119954, -633, -385236, 145590, -160153, 34267, -284900, 181606, -105328, -238024, -158406, 57080, 103007, -360275, 337420, 206663, 19890, 179719, -353802, 51209, 130846, -305717, 38302, -70525, -150572, 135526, -6770, -61666, -309870, -61554, -106779, -10975, -371363, 36872, 152739, -121601, -143859, 177365, 47827, -61118, 22403, 104679, 126475, 78451, -84185, 191085, -141002, -16368, 192629, 123728, 102234, -20939, -78699, -136441, 145920, -173390, 131373, 17108, 10546, 256339, 140279, -42560, 45083, 73883, -200544, -47355, -170778, -88832, 214306, 325846, 184933, 153551, 291275, -85350, 40045, -294787, 246317, -82325, -105912, -167546, -165360, -9119, -55343, 97156, 97787, 11118, -65113, 3336, 99031, 312012]
11657C12012C8208a15962D11869k03290H8454B5982h1088c8369P923B76541d8224
11645A9105a23917A21036J0821B4380J73495a27681l6989h796j20720C3641J91240
11634B24881I3577O3423E940h7831C3360b45863A2450a68017E1162K73682i4453
11622B67626a45343j06946I6430O1601C73O0549A2609g2159l66720b06687I5367
11610i6656A64472C6354L6981J77578a30171O3548k9887A15132K7666a38734c3261
11598C21022H9006R1836E6517a9243j97253g5120A6745M89283E7881b07283F1121
11586e2235r8089N2392B14650r1591a72603f472A02773L3252J77520B1655f0120
11574B02956K018b52228J18141N4888B08075j03901L79251A14680i4090G9945
$$ y = [312012, 38208, -115962, 411869, 208579, 88454, 25982, -81088, -38369, -30446, 276541, -48224, 19105, -123917, 121036, 131857, 24380, 197875, -127681, -164670, -8796, -129516, 33641, 224881, 93577, 157000, 5940, -87831, 33360, -245863, 12450, -168017, 51162, 324844, -94453, 267626, -145343, -252289, 96430, 158031, 373, 60922, 12609, -72159, -438879, -206687, 95367, -96656, 164472, 36354, 73335, 250913, -130171, -66623, -96510, 115132, 142798, -138734, -33261, 321022, 89006, 180842, 56517, -19243, -216496, -75120, 16745, 506028, 57881, -207283, 61121, -52235, -150324, -97932, 214650, 123059, -172603, -6472, 102773, 136025, 313545, 21655, -60120, 202956, 204974, -252228, -134087, -79199, 208075, 104174, 483425, 114680, -94090, 79945]
11563B77812f3195K4922C2367J58833e8134C50371B0693a74515d1923C4059J02120
11552A36179C7062a29722b2666A16830a01657A8161l544N1235K9223A7084a84986
11540A14439A3656g917j13792A09342L2860a11707F13J7447J17435j5606c5186
11528B18295h5371L3334A55881a03929j37742h8037k73854G5290J78353m8981
11518B04662R1817D4456K25101a08497e2252e475C7071F097i4022C77633D9143
11506A27882c37132A92169a59325a6940G1864K78150j52375n3429K25161f856
11495A82511m603H7299C3570R9789o2535c32752C35194D3947K56019F0092O7563
11484A27655a38605B37537H6090K80698F3900J7788O7167j404C1566J04091J48044
$$ y = [277812, -63195, -38273, 32367, 191200, -58134, 350371, 20693, -174515, -41923, 34059, 136179, 37062, -129722, -22666, 116830, -101657, 18161, 14617, 65852, 95075, 17084, -184986, 114439, 13656, -7917, -121709, 109342, 142202, -111707, 613, 18060, 135495, 119889, -35186, 218295, -85371, -52037, 155881, -103929, -241671, -88037, -361891, 75290, 253643, 204662, 296479, 44456, 269557, -108497, -52252, -5475, 37071, 6097, -94022, 377633, 49143, 127882, -337132, 192169, -159325, -16940, 71864, 350014, 197639, 144210, 369371, -6856, 182511, 177908, 87299, 33570, 133359, 70824, -332752, 335194, 43947, 299966, 60092, 127655, -138605, 237537, 86090, 366788, 63900, 81688, 148855, 147451, 31566, 135657, 283701]
11473B83701b1421C66276A01424L37662J55636A07948g3818c2343B60033b5256
11462A10533J31917k9486F2328P4836K45087A27104o1883j5662a20935H2993P9101
11451A62094p06a34546D27814a47800A15473n1668O4962K14299b9747l29269D5757
11439A64212M0515J92983b27198d4742C6669J46373o170C9971J19306J11449E4700
11427a49618F2266c12572A04524g8976B08207A539J14371l2417J11990F9868J04919
11416A74787M5221D3943D977a42431H3515c7653B31327c0484o7142A21491n4264
11405F7227J03381D7199J77983N3024K30792k12825E9587a25046e5695p8187F1977
11393b13431K7883m3783C83586g8989C15291e1635C7255b7022j43949h1550A15098
$$ y = [283701, -21421, 366276, 101424, 439086, 594722, 107948, -73818, -32343, 260033, -25256, 110533, 242450, 212964, 62328, 137164, 382251, 127104, 65221, 49559, -120935, 82993, 162094, 161388, -134546, 427814, -147800, 115473, 63805, 128767, 343066, -29747, -359016, 45757, 164212, 204727, 397710, -227198, -44742, 36669, 183042, 176872, 39971, 159277, 270726, 54700, -149618, 62266, -312572, 104524, -78976, 208207, 1539, 115910, 83493, 195483, 69868, 174787, 220008, 43943, 4977, -142431, 83515, -37653, 231327, -30484, -97626, 121491, 67227, 170608, 47199, 225182, 278206, 508998, 296173, 59587, -125046, -55695, -133882, 61977, -213431, -185548, -229331, 383586, -78989, 315291, -51635, 37255, -27022, -170971, -81550, 115098]
11381c20556P9651C8778P022a05191L6447c1300k2128A34120b32111l0636B830
11369A80469k6179l2598k3288a15030A37824a17749F6425K39739J2442a7184C3044
11357a04284i352j32353I9608c93910a91179B8961L7718B7229P1087g867r96B76628
11344H4630K8875P9542a99403B15900D3113A6535J24874b7862j8098B58189b9324
11332A86718o7593Q9459F2153K7030m232J05822g0318k39192a2543B9589O8415
11321I8004f2292A17477O974O3707a71827f906r1924j08550C05791f3729k63803
11310c27532a12954d7649E7468R1717N9117k2852i9015G6920b47980a6484q8981
11299a05465A15869O9677f6931H3495b35495A10113h9161a2324I051a4276l95148
$$ y = [-320556, -240905, 38778, 45800, -105191, -68744, -31300, -53428, 134120, -232111, -262747, 2830, 180469, 154290, 121692, 98404, -115030, 137824, -117749, 66425, 306164, 318606, -17184, 33044, -104284, -9352, -141705, 99608, -393910, -191179, 28961, 66679, 27229, 98316, -7867, -8863, 276628, 84630, 113505, 193047, -199403, 215900, 43113, 16535, 141409, -27862, -45960, 258189, -29324, 186718, 119125, 208584, 62153, 89183, 84951, 190773, -70318, -309510, -12543, 29589, 98004, -62292, 117477, 124451, 188158, -171827, -6906, -98830, -207380, 305791, -63729, -327532, -112954, -47649, 57468, 149185, 208302, 185450, -99015, 76920, -247980, -16484, -105465, 115869, 185546, -66931, 83495, -235495, 110113, -89161, -12324, 9051, -14276, -409424]
11288d09424A97227G3148J23847b43152e9138k06727m6826a37631m5019M9032
11278a33618j07486A50954c1655l18551Q2859c051E7873a38818e8151A05477b2690
11266F2971b29947J04274O2243i742m136C17709e3890O802B54155h5957K1136
11255f4821j70090Q7308P0765B09094G0386a26959n8062d9848n5408l32577a76939
11243A66637J0312h2528a7351B03786a27748A31610k6358b47094M7353C0364a38454
11231C73772g022G2984K2430a8513A96950a78955c0377p4673K873C98987i057
11219e403G3109a69304j38142A30962J5884d1888j5186D3411a11567K1873l8751
11208a28445l36371d8296k76372c5472J2814l8420j845p5855p6920G6844L7561
$$ y = [-409424, 197227, 73148, 196995, -243152, -59138, -265865, -312691, -137631, -182650, -133618, -241104, 150954, -31655, -350206, -267347, -3051, 57873, -138818, -58151, 105477, -22690, 62971, -229947, -125673, -63430, -9742, -13878, 317709, -53890, -47088, 254155, -85957, -64821, -234911, -147603, -76838, 209094, 70386, -126959, -185021, -49848, -105256, -437833, -176939, 166637, 176949, -82528, -17351, 203786, -127748, 131610, 105252, -247094, -199741, 30364, -138454, 373772, -7022, 72984, 95414, -18513, 196950, -178955, -30377, -105050, -102177, 398987, -9057, -5403, 73109, -169304, -307446, 130962, 146846, -41888, -57074, 43411, -111567, -89694, -128445, -464816, -48296, -324668, -35472, -22658, -61078, -62923, -138778, -215698, 76844, 114405]
11197A14405i8149A2018d56589a76937F9952J21181b04507i107j47011P4148j6776
11186i8746B9889R4050L4456B5879b03531A34548A9308e2786D7577L9232a56703
11174A07040O2358h76F612L175b66108A23006e3616j08612A3600i8861r3593N952
11162a86502b2657O400j70379B5799J27955h2297j11220A31024d6566A67710p9906
11151H7804B9087N3930J3279D0222g6957B0503K61509o6336a84899j17760f8852
11139a35515l1723K5258a8901j17683A04160J59709A03675a15158c7798k53010
11129b90808I3442l4656N0714d0047A90053p7412K0199J91428A23508b01887A1255
11117A49544d2287A85471a54247D1504M15254C3041M42551A10245J30962a42698
$$ y = [114405, -98149, 12018, -456589, -176937, 69952, 191133, -204507, -9107, -156118, -81970, -98746, 29889, 123939, 158395, 25879, -203531, 134548, 19308, -52786, 47577, 86809, -156703, 107040, 169398, -876, 6612, 9787, -266108, 123006, -53616, -162228, 13600, -98861, -192454, -186502, -22657, -16257, -186636, 25799, 153754, -82297, -193517, 131024, -46566, 167710, 87804, 29087, 83017, 96296, 40222, -76957, 20503, 282012, 215676, -184899, -302659, -68852, -135515, -167238, -141980, -18901, -136584, 104160, 263869, 103675, -115158, -37798, -290808, 93442, 58786, 109500, -40047, 190053, 112641, 132840, 324268, 123508, -201887, 11255, 149544, -42287, 185471, -154247, 41504, 456758, 33041, 475592, 110245, 241207, -142698]
11106b0610B2708b25177B16141l0296J15687r5019K25706a0054p3975B84340n7311
11095B27029m8019k2245A6092L45005A64154J82351q8080O0495j04410O9891M104
11084B88505H4734l8843J69504l8552J4183J25203B3553M66992j44611J20795
11074D66729A67654K4285G3182L09250j34828L86950A84300N62369B35441K51049
11064D86490A83325K33072A75859K46375K38826k14601j16435Q8496r5001L08415
11054F31934j68475J38182J37083j03213J05280L9013N2407j07237j99848J60908
11044F86034N6290P4230r3624j30047Q7915r5238k23572K03465L49429k56558
11034F58324j29492K82748l78304L62511k76723M90379J20848E05855J92385J80786
$$ y = [-20610, 22708, -225177, 216141, 185845, 301532, 206513, 432219, -10054, -84029, 284340, 227029, 179010, 156765, 16092, 361097, 164154, 346505, 258425, 318920, 214510, 284401, 288505, 84734, 45891, 215395, 176843, 191026, 316229, 23553, 490545, 345934, 466729, 167654, 191939, 73182, 382432, 247604, 634554, 184300, 746669, 235441, 486490, 183325, 416397, 175859, 422234, 661060, 446459, 330024, 418520, 323519, 631934, 463459, 601641, 738724, 635511, 740791, 779804, 832211, 724974, 525126, 686034, 742324, 816554, 722930, 592883, 680798, 585560, 361988, 565453, 914882, 658324, 528832, 811580, 433276, 795787, 519064, 1009443, 1130291, 505855, 698240, 879026]
11024H79026Q941k82441N5379j20596K01681P6329j09274j06453A87128M41258
11014F28386J79949j50848j8120k56216q7066L28089L29570m15640K57473j33313
11004F62264q0379O46J50248k23248K22129q9885J29452R260l2101k23811P4130
10993E98705J95560j83459q2210M34054R403l1347R4590r7638l30042L33596r3606
10982H47606O915O67593l39224L6480M44971J1692J13239J19870K78483J06882
10972B294507O77016n3427l01151j89082k79358K22685l86661j5928l54205k48632
10962A365764K14970P3644k01613K44727l03091Q1125k48175K91169j08931K0010
10952A429599k19969m96428J62884p600m04331r9446M9347h2786C85134r9817
$$ y = [879026, 887967, 605526, 660905, 540309, 741990, 818319, 709045, 602592, 187128, 628386, 808335, 657487, 639367, 383151, 296085, 624174, 953744, 538104, 795577, 662264, 581885, 582531, 732779, 509531, 731660, 641775, 771227, 780487, 748386, 524575, 598705, 794265, 610806, 528596, 962650, 972053, 940706, 1035296, 937658, 607616, 941212, 847606, 854521, 1522114, 1182890, 1219370, 1664341, 1676033, 1789272, 1909142, 2187625, 2294507, 2971523, 2918096, 2616945, 2427863, 2148505, 2371190, 1984529, 1968601, 1614396, 1365764, 1580734, 1654378, 1452765, 1697492, 1394401, 1475526, 1227351, 1518520, 1409589, 1429599, 1209630, 713202, 876086, 868486, 464155, 364709, 414056, -82786, 385134, 285317]
10942B85317l0744b6680m9083I6842J50978n8945C6584J79665d7766F1094R7757
10931A58851C8909J94002j7594j0897o7623l8210J42504a49176b2747I6617o560
10920I0057M9330J92769a12183m7601A68731J93731b8506A46472N9156E1498M0797
10909I2295a67779j0327f0474k83414h3607j59047C3055b28901O6457D12477A9142
10897A34879d0933H1430b83061A32744d31909A16284E7070R269O9631a14423A51828
10885A2202a84563I4874J6557c64517B08235a7017A34428c1974j10955F1921a69135
10873b33727E174K27966b41283Q6992M7298k432l49996A30428a05695K1355B32453
10861A4271J01954o325i8641C77051A76735H1633J00600c17835i9789j67338A63104
$$ y = [285317, 254573, -26680, -75763, 96842, 247820, 188875, 36584, 216249, -47766, 61094, 158851, 38909, 232911, 215317, 204420, 136797, 98587, 241091, -149176, -22747, 96617, 90057, 139387, 332156, -112183, -159784, 168731, 362462, -28506, 146472, 205628, 51498, 92295, -167779, -178106, -60474, -343888, -83607, -242654, 33055, -228901, -162444, 412477, 19142, 134879, -40933, 81430, -283061, 132744, -431909, 116284, 57070, 66339, 135970, -114423, 151828, 12202, -184563, 94874, 111431, -364517, 208235, -17017, 134428, -31974, -142929, 61921, -169135, -233727, 5174, 233140, -241283, -154291, -106993, -109425, -459421, 130428, -105695, -84340, 232453, 14271, 116225, 109900, -98641, 377051, 176735, 81633, 182233, -317835, -99789, -267127, 163104]
10849A1477a25516B14274a09543A29995b0218A16767i1744A14873a71397I0988
10838B8410a29111d3514B61894H4264a95394I2100B1798K11824d6690k08383a779
10826B69957K174a41883g0751C14673a72868c2344l90325I5577e2850b1684B264
10814b05366q8387G4985k8960K06003M2883a44929F2326h6890A51767A2843c04520
10802b94498o635a43808o1292N6543j33510h0833A07502a08474j4790a4770F1059
10790c8590k36787E1099b46930b7832j16760b1136D3788a68536J5430B6303J27411
10779A53714g6387I350J57585L2854H5871C6021i2866k7075B4973J30489b56072
10767A03411a45211I004d6696B46836a22428o4479c9749B32915m1797c21232c2255
$$ y = [11477, -125516, 214274, -109543, 129995, -20218, 116767, -91744, 114873, -171397, 90988, 28410, -129111, -43514, 261894, 84264, -195394, 92100, 21798, 233622, -46690, -255073, -1779, 269957, 272131, -141883, -70751, 314673, -172868, -32344, -422669, 95577, -52850, -21684, 2264, -205366, -293753, 74985, 46025, 252028, 294911, -144929, 62326, -86890, 151767, 12843, -304520, -294498, -301133, -143808, -205100, -148557, -282067, -80833, 107502, -108474, -123264, -14770, 61059, -38590, -275377, 51099, -246930, -27832, -144592, -21136, 43788, -168536, -153106, 26303, 153714, -76387, 9350, 166935, 199789, 85871, 36021, -92866, -119941, 24973, 155462, -256072, 103411, -145211, 9004, -46696, 246836, -122428, -186907, -39749, 232915, 191118, -321232, -32255]
10755b50381h1116B6384B159e8874A13098h4496p1917A27544a91889B24581n3093
10744A71488O5683J11713a27086b6522m8191k5907K2525A1669a95323p1907a9712
10732b43933P3582C23014j03084b07640A0905h4616J7072m2692I4899D2119a40245
10720a28263J8602A12886B0999b56092I3527a14129p6692N3158O2727D8330g4918
10708b14350J00848k2517O0456q9170Q2317p6644e8866l56942A7888P4785c3972
10696A57161D2313h0244m3864O1044b6898j88216A3314K07181a20957n7446K0147
10685a58256p7078k31722h716A63278a02970a2711k65737a28178B3063e7347g557
10673f9663q0689A09373a60418j03423Q2899q5996E3137J49917a08886A3262R4549
$$ y = [-250381, -81116, 26384, 2159, -58874, 113098, -84496, -156413, 127544, -191889, 224581, 171488, 237171, 348884, -127086, -26522, -74713, -100620, -78095, 11669, -195323, -267230, -19712, -243933, -170351, 323014, 219930, -207640, 10905, -84616, -67544, -110236, 94899, 42119, -140245, -128263, -109661, 112886, 20999, -256092, 93527, -114129, -190821, -137663, -74936, 48330, -74918, -214350, -113502, -136019, -75563, -164733, -82416, -159060, -58866, -415808, 17888, 92673, -33972, 157161, 42313, -80244, -124108, -63064, -26898, -215114, 13314, 220495, -120957, -178403, -158256, -235334, -467056, -8716, 163278, -102970, -12711, -278448, -128178, 23063, -57347, -7557, -69663, -150352, 109373, -160418, -263841, -180942, -266938, 53137, 203054, -108886, 13262, 107811]
10662A07811a57750l6982Q1636r6476D4768b5724k80541a43185L5476A83097a56498
10650A28870m9226a16219G9096b32025h2398f210k80339c0408I6956M7127J15065
10639B59148D1593a44643O933j13826A79316k5451m2155a64973I0848J48474b11796
10627b58962i7544b4311j43002r6436J22012A38572c4203A69776o5175b47806
10616D5169c1536q543I2414a07317g084B6193a8898j4805F6072b09855p0882L5144
10604b45593j77962J70122O4104I5958b0790n5974F0671c14382L7885c3665A33520
10592C00281B1194J7711i8507A70783D8596K6138b90625N1040H140a9508k5976
10581d5484I4638m6713a54858A33008J0966J050c3676k78189a03232c8752k23956
$$ y = [107811, -157750, -194732, -113096, -209572, 44768, -25724, -306265, -143185, -107709, 183097, -156498, 128870, 79644, -116219, 79096, -232025, -82398, -6210, -286549, -30408, 96956, 144083, 259148, 41593, -144643, -137710, -251536, 179316, 153865, 111710, -164973, 90848, 239322, -211796, -258962, -97544, -24311, -167313, -263749, -141737, 138572, -34203, 169776, 104601, -247806, 45169, -31536, -40079, 92414, -107317, -7084, 26193, -18898, -33703, 66072, -209855, -280737, -245593, -423555, -253433, -189329, 95958, -20790, -76764, 60671, -314382, -276497, -33665, 133520, 300281, 21194, 38905, -98507, 170783, 48596, 74734, -290625, -239585, 8140, -19508, -45484, 94638, 47925, -154858, 133008, 143974, 145024, -33676, -311865, -103232, -38752, -262708]
10570b62708J12066K0745a3009E5279K08836a30901A6274J14424b80564J28418
10560a52146O5817B69914B4912b77436a00934M8610A61580i4086k60148a60708
10549g4107j50847l369D20018C6910L6974L0754m5179c45431E161c46207G1472
10537b42992e5824A76018a4227G1428M9294J09499c54383B65711g7263m6177m0031
10526a63471B00112a95278R1246B58536c59364B5119a50996D2103K84761f3786
10515A45532g211j47099L7428A59565J224K360a17556F5248e4882j72023f4555
10503C7122J83320i3604k4002B3741J34038a08107B6050c00460a06954m0657j20697
10492b68308I0150c07701e1766q4719K9914A63909f5630B81119E386J20988K05092
$$ y = [-262708, -150642, -129897, -13009, 55279, 264115, -130901, 16274, 130698, -280564, -152146, -86329, 269914, 24912, -277436, -100934, -52324, 161580, -94086, -354234, -160708, -74107, -224954, -228323, 420018, 36910, 73884, 104638, 59459, -345431, 5161, -346207, 71472, -242992, -55824, 176018, -14227, 71428, 120722, 230221, -354383, 265711, -77263, -123440, -163471, 200112, -195278, -104032, 258536, -359364, 25119, -150996, 42103, 326864, -63786, 145532, -7211, -154310, -116882, 159565, 160789, 163149, -117556, 65248, -54882, -226905, -64555, 37122, 220442, -93604, -117606, 23741, 157779, -108107, 26050, -300460, -106954, -147611, -268308, 90150, -307701, -51766, -136485, -106571, 163909, -65630, 281119, 5386, 126374, 331466]
10481C31466F0861N46349O8171C16927A50120k838J7927i5812a8946E4511a04721
10469a34303e0409r8080b2421G6908O8084n9326J03349g2265A36759D5225Q35
10458D6060O1702N9190e8861J9110a3386A47879c5375j3193j21903b218A17690
10446B46130c58512I3309a89070j71965E1920P5775q075K29991i6371B42460a76699
10434A74672C7360J58546Q304E4914Q196a28636o9500B9097c82868B40454j15271
10423A25183F1203Q2915c6765A47490c5436j4538j15707B06579d2706C2659J87358
10412B20017c06506c0509B56532r2836f9477j66716N6235A46692B4643L6681b46094
10400a38836e632A62736b98902J16547H3679a23704M4734A14680J42081A12963
$$ y = [331466, 60861, 607210, 675381, 316927, 150120, 147282, 165209, -95812, -18946, 54511, -104721, -134303, -50409, -148489, -22421, 76908, 144992, 85666, 189015, -72265, 136759, 45225, 46060, 107762, 166952, -58861, -39751, -13386, 147879, -35375, -48568, -170471, -2218, 117690, 246130, -358512, 93309, -189070, -361035, 51920, 127695, 119620, 349611, -96371, 242460, -176699, 174672, 37360, 195906, 204210, 54914, 63110, -128636, -198136, 29097, -382868, 240454, 125183, 61203, 144118, -36765, 147490, -35436, -49974, -165681, 206579, -42706, 32659, 220017, -306506, -30509, 256532, 163696, -69477, -236193, -179958, 146692, 24643, 61324, -246094, -138836, -5632, 162736, -298902, -182355, 83679, -123704, -78970, 114680, 256761, 112963]
10389G8218a90232b0419i434F8632b7639n8167C1756a07124b6222A55861J2713
10378A68574K29501j54292r0529a70015A38492J82075j12277l3372K81654j56770
10368B99802J95266k46050K32127B31668n5441J92919j63457o5970H109h8298
10357B15349F5769a13796B27549K00604A14664M04246k1829J09833k41669m699
10347C60546j36541j7540M5646L65097j50902A69454B6189b93500H5924J28978
10337B14902G1836h136I8919j1098M83352A80218a28540A68949e4865A87582q2305
10326A05277J8404a9827E052K52934A15122P2868b6292K656F6620j0246b7590
10314C32774r1661d7625E2282e5048B01551q5442b44974I7554a46868f3538j33149
$$ y = [78218, -190232, -20419, -9434, 68632, -27639, -85806, 31756, -107124, -26222, 155861, 168574, 398075, 243783, 153254, -170015, 138492, 320567, 208290, 174918, 456572, 299802, 495068, 249018, 481145, 231668, 176227, 369146, 205689, 139719, 8109, -88298, 215349, 65769, -113796, 227549, 428153, 114664, 518910, 497081, 606914, 365245, 360546, 224005, 206465, 252111, 617208, 466306, 169454, 26189, -293500, 85924, 214902, 71836, -8136, 98919, 87821, 571173, 180218, -128540, 168949, -54865, 187582, 105277, 123681, -19827, 5052, 257986, 115122, 187990, -26292, -23636, 66620, 56374, -27590, 332774, 241113, -47625, 52282, -55048, 201551, 116109, -244974, 97554, -146868, -63538, -196687]
10303a96687B245g5578l61609F456L99551F3734Q3886a63314H5169J38460a5851
10291B35988h0679A90363n2161E1239i5180k01704a1515I5045b3866j6470h068
10279e365A78614a93496A22199A1308a4418q2311l5637J2246B5923a9948o4115
10268h4063A75169h128j27841l8830D5195a28528B52571A10110M0659L69122C3186
10256C72707n6373A46379R5384F5334A1829b29901F0423c8732B06060B5097a26620
10244H7674b5108q4564M1384l6467j53818C1308a56841a1874A61746e260B00055
10232A58505H169b14810I8399a65746j955B24639I3483b04014L9482P8082j50495
10221b36945A4227e48984A45142O1958K065G1109b15189N3983l94913a13142A59781
$$ y = [-196687, 2245, -75578, -437187, 6456, 406007, 63734, 147620, -163314, 85169, 223629, -15851, 235988, -80679, 190363, 138202, 51239, -95180, -296884, -11515, 95045, -23866, -40336, -8068, -5365, 178614, -193496, 122199, 11308, -14418, -96729, -132366, -120120, 25923, -19948, -84063, 175169, -8128, -135969, -174799, 45195, -128528, 252571, 110110, 150769, 519891, 33186, 372707, 316334, 146379, 241763, 65334, 11829, -229901, 60423, -38732, 206060, 25097, -126620, 87674, -25108, -109672, -68288, -104755, -258573, 31308, -156841, -11874, 161746, -5260, 200055, 158505, 8169, -214810, 98399, -165746, -167701, 224639, 93483, -204014, -164532, -86450, -236945, 14227, -548984, 145142, 207100, 209165, 71109, -215189, -161206, -556119, -113142, 159781]
10209a9113j66409A13255M0620Gi9243I6936O9071g7783A18422d1500i665F8415
10196e3720A1344M9729b38696G2737g5266k46497J17603i1885l51806a88677k05586
10185c94263a79054F4332c43844a15776B62320D5015b20570k52335G7128j2059
10175F5069d0390l07829J66018r940A65629A3689b75591o3363a66085q9624Q8064
10164a67645k65494h6371A11562J74901a06536A40472A2646K87704D5767J41288
10154A87055d27026a65061A40349b40043E3133H703i8026e752k99407J06618c6542
10142a83939B31416F240f2060C0435m111a7980A70825b80647E8973J7251A982
10130a42047j33618m2563Q5052i1533A37999c73923A3923f2024p2460O3955B31931
$$ y = [-19113, -185522, 113255, 153875, 7, -99243, 96936, 166007, -77783, 118422, -41500, -9665, 68415, -53720, 11344, 61073, -238696, 72737, -75266, -321763, -204160, -91885, -443691, -188677, -394263, -179054, 64332, -343844, -115776, 262320, 45015, -220570, -472905, 77128, 65069, -40390, -348219, -182201, -192141, 165629, 13689, -275591, -338954, -166085, -255709, -167645, -433139, -86371, 111562, 286463, -106536, 140472, 12646, 300350, 45767, 187055, -427026, -165061, 140349, -240043, 53133, 8703, -98026, -5752, -305159, -198541, -36542, -183939, 231416, 6240, -62060, 30435, 26324, -17980, 170825, -280647, 58973, 76224, 1982, -142047, -275665, -318228, -233176, -91533, 137999, -373923, 13923, -62024, -134484, -70529, 231931]
10118c33254b2396n4990B88930c4053k88877J07243M0966k7392Q7037a224C1376
10106a56934o8630g3507B81994a12557I2624a89838F1704J40796b23930j043k14464
10095d39437b01374b8846B12867i5410A37826g9853j44512C4861N1279B2751d8038
10083I0100j0011J15187C4178J23861b2356G1056a66795E0541R3037c41451C12841
10071a88026g3215k49152A66908a11247H5912b31094H4389R271i5508L1214l38614
10060d02908a5580f530j41046e1792k5122m6186n7423H4418d0867j2497k58111
10049c11475g9495k3005j71379K3994R4472j7747G7329g4625k22136d040k081
10038f121B13109k0937b0580B87509H0301b46401A30478b21293A73010a15620
$$ y = [-333254, -22396, -77386, 288930, -34053, -322930, -215687, -174721, -202113, -115076, -1224, 31376, -156934, -225564, -73507, 281994, -112557, 92624, -189838, 61704, 202500, -223930, -224973, -439437, -201374, -28846, 212867, -95410, 137826, -79853, -224365, 34861, 86140, 22751, -48038, 90100, 80089, 195276, 34178, 158039, -22356, 71056, -166795, 50541, 143578, -341451, 312841, -188026, -73215, -322367, 166908, -111247, 85912, -231094, 84389, 93660, -95508, -64294, -402908, -15580, -6530, -147576, -51792, -76914, -123100, -180523, 84418, -40867, -53364, -311475, -79495, -102500, -273879, -249885, -155413, -173160, 77329, -74625, -296761, -4040, -6121, 213109, 192172, -20580, 287509, 80301, -246401, 130478, -221293, 173010, -115620]
10027a09332p9150L7375f7679K6855n2917o9798N5633j49260J08271O4434A51087
10015a19504q7172C62128a2314q1596k7077K031j9659d0170E5557b01265e4674
10003d06547h6798n1320L9911j16582b8346j32762k7919j3450L1807c7238l93774
9992d31012a90754O3769e3816A37765c47740R4940i2411n0154g608F1175O0323
9981A21498a76814j41395B49236e3513k02626L9082I9996c20304a18534o9960
9971a88494M7021a3173j0728I5808g0203A18035B8694h2657k9187A5003N5084
9960G0087b03163Q8965k10030A05694M0288j8634b0161j94208A63554d7877j96212
9949b44089A32318d99442c2144j82084K2220A39505a60488C9740g6887o6171k75220
$$ y = [-109332, -188482, -151107, -67679, -40824, -93741, -163539, -107906, -257166, -148895, -84461, 151087, -119504, -206676, 362128, -12314, -93910, -120987, -118956, -138615, -40170, 55557, -201265, -54674, -406547, -86798, -138118, -98207, -214789, -28346, -161108, -189027, -202477, -170670, -37238, -431012, -190754, -126985, -53816, 137765, -347740, -252800, -92411, -142565, -7608, 61175, 121498, -176814, -318209, 249236, -53513, -256139, -217057, 99996, -320304, -118534, -188494, -141473, -13173, -23901, 95808, -70203, 118035, 28694, -82657, -111844, 15003, 70087, -203163, -114198, -324228, 105694, 145982, 127348, -20161, -214369, 163554, -47877, -244089, 132318, -499442, -32144, -214228, -192008, 139505, -160488, 39740, -76887, -143058, -418278]
9938d18278A51949l9742o618b11976B1193R0653a25177A45141e7513B31684F7221
9926I9662c7321k02845d4786r6819A42778B6814b84672i5284a8476D10018a42344
9914F0750a00794A32089b58078B4608a30513n5678f3352j43253N4507j61539A040
9902a33212B40527j16526E2609O917J98851c8788k96110J08133E262b06711p0154
9891b76865j21321a57855e6231F586b14281A32877K8708b29017m2721R1405g1023
9879a26844A65381J50702c3757C3618b49613m5082H1811l2971a19673B10728e1980
9867E8829L1452l3647E165b83841e190j27337A4108b32155I7986a73091o9294
9856b42385a6481A25371e8780A23492a62553g1606j46883D7925a17552K2563m4551
$$ y = [-418278, 151949, 112207, 105589, -211976, 21193, 111846, -125177, 145141, -57513, 231684, 67221, 99662, -37321, -240166, -44786, -141605, 142778, 26814, -284672, -95284, -18476, 410018, -142344, 60750, -100794, 132089, -258078, 24608, -130513, -186191, -63352, -206605, -152098, -313637, 1040, -133212, 240527, 124001, 52609, 59526, 258377, -38788, -334898, -226765, 5262, -206711, -276865, -398186, -157855, -56231, 6586, -214281, 132877, 161585, -229017, -271738, -180333, -71023, -126844, 165381, 316083, -33757, 33618, -249613, -294695, 81811, 48840, -119673, 210728, -51980, 58829, 90281, 56634, 5165, -283841, -5190, -132527, 14108, -232155, 97986, -173091, -242385, -16481, 125371, -58780, 123492, -162553, -71606, -218489, 47925, -117552, -94989, -139540]
9845a39540f3401H166a19792j01450F8824k8392a60154A32415f5350l29100i6602
9833B1701c4000H36c6069p3609L5983B42662e9804j66748j04032L4045A05716
9821d22371a99807r3773a21531A23576e0877l769A52072b79983A47462b18919
9810a86484l9571A60585a98441A48849a84352q9680B02142R8853a99395I2833
9799b59990H7858d86925A01948D1440a73057A8277a96920i287o1830F7758K2457
9788I0215k8381a03868n2723B35269j13982a68059n9491r0437M247Q7520n1936
9777b78156H724a59438I3839j7417k2554a47461j5547R56m6624N1001M8951j85362
9765b94086f8026r5079Q0903j03857m8253l3374J12940j11125F757b23403D7795
$$ y = [-139540, -63401, 8166, -119792, -221242, 68824, 40432, -160154, 132415, -65350, -394450, -96602, 21701, -34000, 836, -36069, -109678, -73695, 242662, -59804, -226552, -330584, -296539, 105716, -422371, -199807, -293580, -121531, 123576, -50877, -54646, 152072, -279983, 147462, -218919, -186484, -226055, 160585, -198441, 148849, -184352, -274032, 202142, 300995, -199395, 92833, -259990, 87858, -486925, 101948, 41440, -173057, 18277, -196920, -9287, -71117, 67758, 90215, 61834, -103868, -156591, 235269, 121287, -168059, -227550, -317987, -313740, -226220, -278156, 8724, -159438, 93839, 76422, 53868, -147461, -163008, -162052, -208676, -157675, -108724, -294086, -68026, -163105, -82202, -186059, -234312, -267686, -154746, -265871, 6757, -223403, 47795]
9753a13191j67444A31715E175h4995G9399k2203d9349A95328G0676P5620e8819
9741A80102C6083h0935J0276m6887a7116H2301d71986D5680a0928B045e8181j87471
9729b45652a02726l11943F4091i2126d4999q4433B5353i6719A02607A0495c24905
9717A18800C628a02441A00675C7935i3762R533k64376J70521n8711A94468a71584
9705B17430a69154K5177p0214O8801m9899D1097a70902j56294a27831a1392m01257
9694d12649a83376O8267I5821O7875a55812a6012B40242b51525C75493G5933b17435
9682a65847f795m9542B5714c17157K2065e578A14005a6515k88078f5435B38168
9670D0709b7481A50991f5321k12052A66123P8652b26032G2475C2692e13111a98596
$$ y = [-113191, -280635, 131715, 5175, -84995, 79399, 57196, -49349, 195328, 70676, 146296, -58819, 180102, 36083, -80935, -70659, -117546, -17116, 82301, -471986, 45680, -10928, 2045, -58181, -245652, -102726, -414669, 64091, -92126, -44999, -129432, 25353, -96719, 102607, 10495, -324905, 118800, 3628, -102441, 100675, 37935, -93762, -84229, -348605, -178084, -236795, 194468, -171584, 217430, -169154, -143977, -214191, -145390, -195289, 41097, -170902, -327196, -127831, -11392, -412649, -183376, -115109, 95821, 163696, -155812, -16012, 240242, -251525, 375493, 75933, -217435, -165847, -6795, -56337, 25714, -317157, -295092, -5578, 114005, -16515, -304593, -65435, 238168, 40709, -27481, 150991, -65321, -277373, 166123, 244775, -226032, 72475, 32692, -513111, -198596]
9658A38038b42835d1664A32971g0811D8771K467b7836A07150J02946a16440D7311
9646A21455i2991j81920j91537a84202b2883C59J8680K26860b10560E575c76308
9634a97867Q616L4160N3507b6161k64485J08359q8170H2678a2025p8850J7616
9623g3259C64919b5113e944k60601M5101B1078J52J65478H7263A8775O2349f553
9610A03236k0210R6231A7805P7357d5B94217a27326e7107i305d60A1231c8038
9597a32562A64752l4944k6366h8194b1240A48134g3947j70168M2228K6935o8145
9586b43097B7919L2596h262k9662H8779k0607i5915A75911b00194o9607a8290
9574A6494b41175h523B02961B8030b16634I3136a0522j09336K0581r2181Q2940
$$ y = [138038, -242835, -41664, 132971, -70811, 48771, 51238, -27836, 107150, 210096, -116440, 47311, 121455, -92991, -274911, -466448, -184202, -22883, 359, 19039, 245899, -210560, 5575, -376308, -197867, -189251, -155091, -101584, -26161, -290646, -182287, -270457, 82678, -12025, -90875, -73259, 364919, -25113, -5944, -266545, -221444, 21078, 21230, 186708, 87263, 18775, 81124, -6553, 103236, 83026, 179257, 17805, 95162, -45, 294217, -127326, -57107, -9305, -460, 11231, -38038, -132562, 164752, 129808, 103442, -88194, -21240, 148134, -73947, -244115, -201887, -174952, -243097, 27919, 60515, -8262, -37924, 88779, 68172, -95915, 175911, -200194, -269801, -18290, 16494, -241175, -8523, 202961, 28030, -216634, 93136, -10522, -119858, -99277, -191458, -108518]
9563a08518a218k46345J1126a5072p3638j49808c4857j85869f2498C54199I2856
9551A58175b1135B43810b10613J03831B58661A23756A8910J26221c3985A5923
9540C1449b8841I3800c42833b5478j30014d6959A26792D0226O7009k5096J39535
9529B21674I5167a75902n7196j53194a90209m1035j56976H6102B1656b74531Q4780
9518a89751C1854e0996j10239j02492a22320A62171b28091J00375n3540Q8337
9508i2919A26091c7150F5949C1609K9815N7973c20906A54119D2633a03839D8193
9496A94008q4047D1607b61257a23659A51435n8218D5236d42309e7813o9168I3308
9484c23679J11110E1312j8600p602c2821A8546h8604A27b58977I0863j6864a29027
$$ y = [-108518, -1218, -247563, -236437, -15072, -88710, -238518, -34857, -220726, -62498, 354199, 92856, 158175, -21135, 243810, -210613, -106782, 258661, 123756, 18910, 145131, -33985, 15923, 31449, -28841, 93800, -342833, -25478, -155492, -46959, 126792, 40226, 107235, 82139, 221674, 95167, -175902, -233098, -386292, -190209, -231244, -388220, 86102, 21656, -274531, -189751, 31854, -50996, -161235, -263727, -122320, 162171, -228091, -127716, -181256, -92919, 126091, -37150, 65949, 31609, 61424, 119397, -320906, 154119, 42633, -103839, 48193, 194008, 109961, 41607, -261257, -123659, 151435, 93217, 45236, -442309, -57813, -126981, 93308, -323679, -212569, 51312, 32712, 25110, -32821, 18546, -88604, 127, -258977, 90863, 73999, -129027]
9471c75480N6651A40773c74668A35859b00724e7591A22935E3892c83671A4881
9460a11163K7860A4522a07186A57368o1676f0422p3926K0398H0491a58109A38020
9448c93321a43929A08027a5562j20189C72059A04211A740a64910F8296O9768a29069
9436A0229J54207b14124O3882j4894F0948g1431r2057d5720H6293a58971p4198
9425b33169A17755b41505f9108b9468j06606K9475m3039B7701a15119k04326a26987
9413a94114A5830a13559H670P0051b66910j47326J74505J04503A9100M1418d26972
9401g9342m2820p6092k6080R1401L154c628l1089A42371c23053L7577M4575R7694
9389a43207j74799R0915E4277a57043K1693a3369o6965j0629k49959m6958J89403
$$ y = [-375480, -318829, 140773, -374668, 135859, -200724, -57591, 122935, 53892, -383671, 14881, -111163, -83303, 14522, -107186, 157368, 95692, -60422, -134348, -113950, 80491, -158109, 138020, -393321, -143929, 108027, -15562, -135751, 372059, 104211, 1740, -164910, 68296, 138064, -129069, 10229, 164436, -214124, -150242, -165136, 60948, -71431, -163488, -45720, 86293, -158971, -233169, 117755, -241505, -69108, -29468, -136074, -106599, -149638, 27701, -115119, -319445, -126987, -194114, 15830, -113559, 8670, 78721, -266910, -414236, -239731, -135228, 19100, 60518, -426972, -79342, -122162, -198254, -224334, -132933, -129779, -3628, -34717, 142371, -323053, -285476, -240901, -143207, -318006, -227091, 54277, -157043, -135350, -13369, -80334, -90963, -340922, -387880, -198477]
9378a98477g0603j33334b3547k936j21592r5064E2983e9165j96094A11478j84
9367A11294g5059q7537e8990I3280C5560l566a5802j37198l03386B8218b25063
9355I3542m2845K6285K8526d5505p2146p182j10786H2876C061d11055C03859j14088
9343A89771b28274R7579D2244i2510k15769h1744k64424g7270m13013C3400c79283
9331a35272B2975a82425D5437L5861b00063J8372j30289a44402k2730B7617M119
9320C1736a2715k985j08892a1621k0894r7665A85987f182m06643D23468c36133
9308A70329L6543a12270E1780J61199c39303f4154I9361f8322j45523D095e3168
9296B4153M5041O6695k9932a37614A99933r6106b21584D8550f6568J7292o8254
$$ y = [-198477, -70603, -203937, -23547, -26483, -148075, -243139, 52983, -59165, -255259, 111478, 111294, -75059, -162596, -58990, 93280, 35560, 31994, -15802, -153000, -456386, 28218, -225063, 93542, 50697, 76982, 105508, -45505, -117651, -124833, -235619, 82876, 3061, -411055, 303859, 189771, -228274, -130695, 42244, -92510, -308279, -81744, -346168, -77270, -490283, 33400, -379283, -135272, 22975, -182425, 45437, 81298, -200063, -181691, -311980, -144402, -167132, 27617, 31736, -12715, -15700, -124592, -11621, -32515, -130180, 185987, -6182, -412825, 423468, -336133, 170329, 206872, -112270, 51780, 212979, -339303, -64154, 99361, -68322, -213845, 4095, -53168, 24153, 69194, 135889, 105957, -137614, 199933, 103827, -221584, 48550, -66568, -49276, -117530]
9285a17530k49238C0288J26713a73366P4584F1790a27096A1866a12214J4651j48362
9274b45925A0349L2943K32036a09369B3904d03256e1716r298l979k5113A73790
9262a60741L5082B04925b69251A94901D7333L94957b1495A01958C2436e3131o4405
9251a17536k12490A87158d55354g3723A77462F883c8934G2033C0833b4991F2255
9239c0630A18857A1218b00779i9140j19278f4181o3708A57533b22668c1098o862
9228c7960A6770M3146a39585d6163i203r9401k58730I0729l5007R013b78593a20395
9215A73373c68864B08153a08438B95330a03121j02891A51090B8049e5074k872
9205e7946G9776b47788P3235j23640A26562b6518p7132m2478M2047A3052a21837
$$ y = [-117530, -366768, 30288, 157001, -173366, -98782, 61790, -127096, 11866, -112214, -97563, -245925, 10349, 43292, 275328, -109369, 23904, -403256, -51716, -61014, -64993, -90106, 173790, -160741, -125659, 204925, -269251, 194901, 47333, 442290, -21495, 101958, 32436, -53131, -117536, -330026, 187158, -455354, -73723, 177462, 6883, -38934, 72033, 30833, -24991, 62255, -30630, 118857, 11218, -200779, -99140, -218418, -64181, -127889, 157533, -222668, -31098, -37960, 16770, 59916, -139585, -46163, -9203, -108604, -367334, 90729, 55722, 64735, -278593, -120395, 173373, -368864, 208153, -108438, 295330, -103121, -206012, 151090, 28049, -55074, -57946, 79776, -247788, -174553, -298193, 126562, -26518, -103650, -146128, -104081, 13052, -121837]
9193e8182j1019k136B1982i4667j2220j75748A35217o0554J47537d39836b8848
9181a1454G2060f9376j86783C8296b53038i9515b7312P048A6374a13910L8944
9170g4966k56036B89637b28420Q2010A92227e2424l10269A58599a9319j23697
9160a43016B5003d2562n6594j78639H006M73286a96559A12369L0696b60016A42108
9148A34792b11290G3574a31076m5609d5207a7314k18181a11252N2234r4742p6402
9137b30162B10492b2595j72465A8420a00052B34229a39894d8912l39614p6799
9127d65325a45785O1716o507A50541a0016A6843a58233c1491j5591E65311c08366
9115e28008D1183b12842a1138l03954Q0148C1421N0632a6560G4460A0656A338
$$ y = [-58182, -69201, -71337, 21982, -94667, -106887, -282635, 135217, 74663, 222200, -439836, -28848, -11454, 72060, -69376, -256159, 38296, -253038, -99515, -27312, -20264, 16374, -113910, -74966, -331002, 289637, -228420, -146410, 192227, -52424, -362693, 158599, -19319, -143016, 25003, -42562, -99156, -277795, 8006, 481292, -196559, 112369, 143065, -260016, 142108, 134792, -211290, 73574, -131076, -176685, -45207, -17314, -235495, -111252, -59018, -153760, -230162, 210492, -22595, -195060, 18420, -100052, 234229, -139894, -48912, -388526, -465325, -145785, -84069, -90576, 150541, -10016, 16843, -158233, -31491, -47082, 565311, -308366, -528008, 41183, -212842, -11138, -315092, -234944, 31421, 82053, -16560, 74460, 10656, 1338]
9103d3788k14374Q3857M1734H6211J5430a38957j32081e821k1609A65677c60377
9091a16231j8125l7272a6619k94414J06014g5974e726m6077E6007i3987C31693
9079b89399J28142N6807F4656j8311K03095d91065a33996k6987n1654c1945j42347
9068a74292C3427d5519J3539C7364e5160o2175k24893m366C0793J549c0730A21050
9055b77404A02165R9479M3917g9470l6758A3653b80075A22189B453J15840f7838
9043b26672i925C15231b53836h9973A70372b1407j20298j8823j13589J01733N1109
9032a21275q7167h3883j89318H0997Q2994i3087A83726B2581f2283j46929O7471
9021a41741B1633a84606A68898b84319g3519A41932j6780a65082A591e0355G980
$$ y = [-43788, -258162, -174305, -132571, 86211, 101641, -138957, -271038, -5821, -27430, 165677, -360377, -116231, -134356, -171628, -16619, -311033, -205019, -75974, -5726, -51803, 56007, -93987, 331693, -289399, -161257, -104450, 64656, 46345, 249440, -491065, -133996, -160983, -212637, -31945, -174292, 33427, -45519, -31980, 37364, -55160, -117335, -342228, -346594, 30793, 32342, -30730, 121050, -277404, 102165, 201644, 245561, -79470, -116228, 13653, -280075, 122189, 2453, 118293, -67838, -226672, -9925, 315231, -253836, -89973, 170372, -21407, -141705, -160528, -274117, -172384, -121275, -208442, -83883, -273201, 80997, 163991, -93087, 183726, 22581, -62283, -209212, -141741, 21633, -184606, 168898, -284319, -73519, 141932, 125152, -165082, 1591, -50355, 7980]
9009a09867j21659A7065N3344a23107E4980a74297D8497b14398N3207P2105o5454
8998a54540C0715b0835B8051a3270B8011q881d7130h513m2527m01224A11298a82896
8985C75851a53010G4565b81597A59786d4675j73338j62984a89354A95849a64163
8974H9736a3681A10101a28141C4573R4829D6276b87282i0693M3563A24199e5399
8962A16195D1732b43587b5384l918k49953F0376J07672l1834a48586d9065A71564
8950E89O9026f5663p1882E4794a79762Q7328B64994A15277d5167A53009J57014
8939C10023D6543K23762j23542O5404M2655M8470A23413L00532e7626A57968l1678
8928A26290O8734J72567E9090R59117K061248L924655K358299j50516D414636
$$ y = [-109867, -231526, 17065, 70409, -123107, 54980, -174297, 48497, -214398, -161191, -89086, -154540, 30715, -20835, 28051, -13270, 28011, 19130, -47130, -8513, -51040, -452264, 111298, -182896, 375851, -153010, 74565, -281597, 159786, -44675, -218013, -380997, -189354, 195849, -164163, 89736, -13681, 110101, -128141, 34573, 129402, 46276, -287282, -90693, -47130, 124199, -55399, 116195, 41732, -243587, -25384, -29302, -279255, 60376, 168048, 136214, -148586, -49065, 171564, 589, 69615, -65663, -137545, 54794, -179762, -92434, 264994, 115277, -45167, 153009, 310023, 46543, 270305, 146763, 212167, 254822, 303292, 123413, 423945, -57626, 157968, 126290, 195024, 367591, 59090, 1018207, 3079455, 7004110, 9362409, 9211893, 4414636]
8918B209845I34662D04197K2995q4511A18810K52946j21403D0513J25959J3335
8908A79807M0679R8549a76067A79063c03957A3978a13089k7931j27628A67287
8897b56015B37366B2600a06158j62358B4870b34824f311A40377d65782b25338
8886B24981b7310H2602b43244F1719b3969l9173K3479A5174J21013a54935o9022
8875b23957A08875a81983A02247b757A1200a39279B74296j32257b36285A11092
$$ y = [2209845, 934662, 404197, 427192, 342681, 118810, 371756, 250353, 40513, 166472, 179807, 220486, 319035, -176067, 179063, -303957, 13978, -113089, -141020, -268648, 167287, -256015, 237366, 22600, -106158, -268516, 24870, -234824, -6311, 140377, -465782, -225338, 224981, -27310, 82602, -243244, 61719, -23969, -63142, -39663, 15174, 136187, -154935, -223957, 108875, -181983, 102247, -2757, 11200, -139279, 274296, 142039, -236285, 111092]
$$ [...]
##END NTUPLES=NMR SPECTRUM
##END=
