##TITLE=AC1526_ROEFFECT0006_8213789_DTOzV0TmO8
##JCAMPDX= 6.0         $$ Bruker NMR JCAMP-DX V2.0
##DATA TYPE= NMR SPECTRUM
##DATA CLASS= NTUPLES
##ORIGIN= BRUKER
##OWNER= Administrator
$$ 1.72 TOPSPIN		Version 2.1
$$ 2013-10-04 19:05:54.666 -0700  Administrator@X
$$ Compression mode = diff/dup
##.OBSERVE FREQUENCY= 400.02188249412
##.OBSERVE NUCLEUS= ^1H
##.ACQUISITION MODE= SIMULTANEOUS (DQD)
##.ACQUISITION SCHEME= undefined
##.AVERAGES= 64
##.DIGITISER RES= 22
##SPECTROMETER/DATA SYSTEM= spect
##.PULSE SEQUENCE= noesygpps1d.comp
##.SOLVENT NAME= COFFEE_meoh
##.SHIFT REFERENCE= INTERNAL, COFFEE_meoh, 1, 14.96084
##AUDIT TRAIL= $$ (NUMBER, WHEN, WHO, WHERE, PROCESS, VERSION, WHAT)
$$ ##TITLE= Audit trail, TOPSPIN		Version 2.1
$$ ##JCAMPDX= 5.01
$$ ##ORIGIN= Bruker BioSpin GmbH
$$ ##OWNER= Administrator
$$ $$ E:\/data/COFFEE/nmr/AC1526_ROEFFECT0006_8213789_DTOzV0TmO8/12/pdata/1/auditp.txt
$$ ##AUDIT TRAIL=  $$ (NUMBER, WHEN, WHO, WHERE, PROCESS, VERSION, WHAT)
(   1,<2013-10-04 19:05:49.994 -0700>,<Administrator>,<X>,<go>,<TOPSPIN 2.1>,
      <created by zg
	started at 2013-10-04 18:54:20.352 -0700,
	POWCHK enabled, PULCHK disabled,
       configuration hash MD5:
       C8 4E 4E 5D D3 5C D8 9E 9F 52 82 E0 59 8A DE 15
       data hash MD5: 64K
       4C 8C 72 E8 8D D3 F7 F7 DD A1 7F AB FB 3C B4 56>)
(   2,<2013-10-04 19:05:52.869 -0700>,<Administrator>,<X>,<proc1d>,<TOPSPIN 2.1>,
      <Start of raw data processing
       efp LB = 0.3 FT_mod = 6 PKNL = 1 PHC0 = 0 PHC1 = 0 SI = 128K 
       data hash MD5: 128K
       B9 B0 21 99 69 9B B5 7A 68 33 8C 3E 37 1C FC C1>)
(   3,<2013-10-04 19:05:53.791 -0700>,<Administrator>,<X>,<proc1d>,<TOPSPIN 2.1>,
      <pk PHC0 = -83.70483 PHC1 = 0 
       data hash MD5: 128K
       1C 50 7A CC D9 03 02 52 B1 0F B7 4D 07 8E 07 F8>)
(   4,<2013-10-04 19:05:54.166 -0700>,<Administrator>,<X>,<proc1d>,<TOPSPIN 2.1>,
      <abs ABSG = 1 
       data hash MD5: 128K
       9C EA F9 20 E1 CA E6 98 BD 31 31 EF 70 5A BD FD>)
(   5,<2013-10-04 19:05:54.244 -0700>,<Administrator>,<X>,<proc1d>,<TOPSPIN 2.1>,
      <abs ABSG = 2 
       data hash MD5: 128K
       CC 48 A0 08 84 DD E4 3B 40 D0 37 93 D9 3C F4 AE>)
(   6,<2013-10-04 19:05:54.338 -0700>,<Administrator>,<X>,<proc1d>,<TOPSPIN 2.1>,
      <abs ABSG = 3 
       data hash MD5: 128K
       D4 58 65 C9 8F 13 2D C4 6E 8E A7 19 F6 31 0D E0>)
(   7,<2013-10-04 19:05:54.416 -0700>,<Administrator>,<X>,<proc1d>,<TOPSPIN 2.1>,
      <abs ABSG = 4 
       data hash MD5: 128K
       45 3D 0F 56 36 0E AB 52 25 78 6A 0E 30 07 EB A8>)
(   8,<2013-10-04 19:05:54.478 -0700>,<Administrator>,<X>,<proc1d>,<TOPSPIN 2.1>,
      <abs ABSG = 5 
       data hash MD5: 128K
       BB 06 41 D9 66 E3 26 BA 5C 12 26 87 3F C9 C6 1D>)
$$ ##END=
$$ 
$$ $$ hash MD5
$$ $$ 87 B4 42 C1 AA 56 31 FF 23 7F 1F C5 EF 34 DF 0B
##$RELAX= 
##$RELAX= 
##$RELAX= 
##$RELAX= 
##$RELAX= 
##$RELAX= 
##$RELAX= 
##$RELAX= 
$$ Bruker specific parameters
$$ --------------------------
##$DU= <E:\>
##$EXPNO= 12
$$ [...]
##$TP07= 0
##$TPNAME0= <>
##$TPNAME1= <>
##$TPNAME2= <>
##$TPNAME3= <>
##$TPNAME4= <>
##$TPNAME5= <>
##$TPNAME6= <>
##$TPNAME7= <>
##$TPOAL= (0..7)
0.5 0.5 0.5 0.5 0.5 0.5 0.5 0.5
##$TPOFFS= (0..7)
0 0 0 0 0 0 0 0
##$TUNHIN= 0
##$TUNHOUT= 0
##$TUNXOUT= 0
##$USERA1= <user>
##$USERA2= <user>
##$USERA3= <user>
##$USERA4= <user>
##$USERA5= <user>
##$V9= 5
##$VALIST= <valist>
##$VCLIST= <CCCCCCCCCCCCCCC>
##$VD= 0
##$VDLIST= <DDDDDDDDDDDDDDD>
##$VPLIST= <PPPPPPPPPPPPPPP>
##$VTLIST= <TTTTTTTTTTTTTTT>
##$WBST= 2048
##$WBSW= 25
##$XGAIN= (0..3)
0 0 0 0
##$XL= 0
##$YL= 0
##$YMAX_a= 12278548
##$YMIN_a= -21495009
##$ZGOPTNS= <>
##$ZL1= 120
##$ZL2= 120
##$ZL3= 120
##$ZL4= 120
##$ABSF1= 14.96084
##$ABSF2= -5.597342
##$ABSG= 5
##$ABSL= 3
##$ALPHA= 0
##$AQORDER= 0
##$ASSFAC= 0
##$ASSFACI= 0
##$ASSFACX= 0
##$ASSWID= 0
##$AUNMP= <proc_prof1d_extract.lims>
##$AXLEFT= 0
##$AXNAME= <>
##$AXNUC= <1H>
##$AXRIGHT= 0
##$AXTYPE= 0
##$AXUNIT= <>
##$AZFE= 0.1
##$AZFW= 0.1
##$BCFW= 0
##$BC_mod= 0
##$BYTORDP= 0
##$COROFFS= 0
##$CY= 15
##$DATMOD= 1
##$DC= 0
##$DFILT= <>
##$DTYPP= 0
##$F1P= 0
##$F2P= 0
##$FCOR= 0.5
##$FTSIZE= 131072
##$FT_mod= 6
##$GAMMA= 0
##$GB= 0
##$INTBC= 1
##$INTSCL= 1
##$ISEN= 128
##$LB= 0.3
##$LEV0= 0
##$LPBIN= 0
##$MAXI= 10000
##$MC2= 0
##$MEAN= 0
##$ME_mod= 0
##$MI= 0
##$NCOEF= 0
##$NC_proc= -2
##$NLEV= 6
##$NOISF1= 0
##$NOISF2= 0
##$NSP= 0
##$NTH_PI= 0
##$NZP= 0
##$OFFSET= 14.96084
##$PC= 1
##$PHC0= -83.70483
##$PHC1= 0
##$PH_mod= 1
##$PKNL= yes
##$PPARMOD= 0
##$PPDIAG= 0
##$PPIPTYP= 0
##$PPMPNUM= 2147483647
##$PPRESOL= 1
##$PSCAL= 4
##$PSIGN= 0
##$PYNMP= <proc.py>
##$REVERSE= no
##$SF= 400.020009700946
##$SI= 131072
##$SIGF1= 0
##$SIGF2= 0
##$SINO= 400
##$SIOLD= 131072
##$SPECTYP= <>
##$SREGLST= <1H.CDCl3>
##$SSB= 0
##$STSI= 131072
##$STSR= 0
##$SW_p= 8223.68421052631
##$SYMM= 0
##$S_DEV= 0
##$TDeff= 65536
##$TDoff= 0
##$TI= <>
##$TILT= no
##$TM1= 0
##$TM2= 0
##$TOPLEV= 0
##$USERP1= <user>
##$USERP2= <user>
##$USERP3= <user>
##$USERP4= <user>
##$USERP5= <user>
##$WDW= 1
##$XDIM= 131072
##$YMAX_p= 316276374
##$YMIN_p= -11693
##$CURPLOT= <Network HP LaserJet P1505>
##$CURPRIN= <$Network HP LaserJet P1505>
##$DFORMAT= <normdp>
##$LAYOUT= <+/1D_H.xwp>
##$LFORMAT= <normlp>
##$PFORMAT= <normpl>
##$SURQMSG= 1
$$ End of Bruker specific parameters
$$ ---------------------------------
##NTUPLES= NMR SPECTRUM
##VAR_NAME=  FREQUENCY,     SPECTRUM/REAL,   SPECTRUM/IMAG
##SYMBOL=    X,             R,               I
##VAR_TYPE=  INDEPENDENT,   DEPENDENT,       DEPENDENT
##VAR_FORM=  AFFN,          ASDF,            ASDF
##VAR_DIM=   131072,        131072,          131072
##UNITS=     HZ,            ARBITRARY UNITS, ARBITRARY UNITS
##FACTOR=    0.0627417313425164, 1,          1
##FIRST=     8223.62146879497, -1048,        -85145
##LAST=      0,             1055,            -86608
##MIN=       0,             -11693,          0
##MAX=       8223.62146879497, 316276374,    0
$$ Real data points
##PAGE= N=1
##DATA TABLE= (X++(R..R)), XYDATA
$$ [...]
67385 1191884 1192414 1192929 1192636 1191532 1190005 1188361 1186774 1185340 1184025 1182709 1181332 1179941 1178611 1177459 1176636
67370 1176636 1176101 1175465 1174344 1172961 1172104 1172268 1172931 1172969 1171800 1169897 1168088 1166634 1165292 1164113 1163627 1164053
67354 1164053 1164746 1164848 1164266 1163598 1163190 1162750 1161920 1160751 1159488 1158237 1157074 1156091 1155162 1153944 1152375 1150903
67338 1150903 1149934 1149245 1148268 1146776 1145037 1143414 1142101 1141180 1140659 1140413 1140199 1139700 1138558 1136635 1134367 1132593
67322 1132593 1131760 1131465 1131035 1130328 1129672 1129204 1128656 1127777 1126625 1125422 1124341 1123446 1122680 1121949 1121308 1120954 1120877 1120728
67304 1120728 1120184 1119254 1118049 1116551 1114858 1113297 1111931 1110331 1108311 1106544 1105797 1105810 1105649 1105048 1104523 1104181
67288 1104181 1103378 1101874 1100433 1099688 1099077 1097577 1095040 1092138 1089326 1086583 1084020 1082063 1080908 1080254 1079655
67273 1079655 1078825 1077594 1075930 1074128 1072670 1071771 1071190 1070568 1069798 1069059 1068668 1068859 1069549 1070211 1070216 1069353 1067918
67256 1067918 1066211 1064096 1061232 1057662 1053994 1050910 1048617 1046845 1045285 1043846 1042536 1041346 1040362 1039745
67242 1039745 1039442 1039101 1038476 1037750 1037162 1036510 1035334 1033522 1031377 1029124 1026719 1024163 1021621 1019215 1017028
67227 1017028 1015317 1014274 1013510 1012247 1010166 1007706 1005392 1003330 1001480 999871 998292 996321 994064 992316
67213 992316 991532 991156 990489 989711 989319 989008 988024 986491 985404 985155 984901 983713 981713 979703 978164 977027
67197 977027 976069 975095 973901 972388 970643 968808 966956 965129 963308 961317 959043 956781 955051 953946 952973
67182 952973 951668 950064 948337 946379 944039 941559 939357 937468 935546 933464 931593 930318 929450 928294
67168 928294 926378 923981 921796 920114 918555 916736 914867 913406 912337 911256 910028 908843 907614 905937
67154 905937 903839 901981 900736 899531 897587 894984 892514 890739 889691 889276 889305 889144 887991 885756 883251
67139 883251 881281 879836 878378 876603 874624 872613 870610 868640 866772 865006 863242 861419 859624 858031
67125 858031 856788 855945 855446 855151 854851 854287 853236 851670 849785 847806 845789 843706 841660 839820 838103
67110 838103 836117 833636 831005 828896 827593 826663 825374 823365 820849 818353 816353 815056 814288 813613 812744
67095 812744 811891 811478 811494 811358 810568 809208 807628 805915 804061 802402 801366 800764 799896 798517 797185 796349
67079 796349 795555 794071 792063 790579 790380 791150 791986 792288 792012 791246 789867 787725 785166 783164 782653 783592
67063 783592 784901 785445 784942 783791 782367 780800 779205 777683 776183 774750 773847 773948 774763 775331 775012 774054
67047 774054 773012 772038 770986 769859 768791 767825 767011 766580 766709 767193 767578 767579 767191 766593 766145 766273 766941 767329
67029 767329 766477 764402 762304 761510 762303 763829 764962 765170 764734 764346 764484 765065 765593 765561 764771 763527 762624
67012 762624 762927 764612 766942 769054 770930 773220 776151 779133 781579 783635 785706 787632 788888 789463 790047
66997 790047 791244 792972 794736 796253 797734 799776 803012 807552 812626 817136 820741 824130 827914 831594
66983 831594 834174 835682 837484 840795 845330 849793 853413 856580 860027 863946 868095 872389 876990 881943
66969 881943 887059 892250 897695 903521 909466 915084 920288 925557 931535 938461 946034 953746 961275 968603
66955 968603 975879 983281 990958 998971 1007187 1015235 1022724 1029616 1036412 1043880 1052527 1062261 1072599 1083194
66941 1083194 1094161 1105860 1118366 1131241 1143917 1156361 1169205 1183103 1197999 1213229 1228361
66930 1228361 1243748 1260029 1277227 1294630 1311674 1328692 1346582 1365794 1385868 1405984 1425796
66919 1425796 1445681 1466344 1488264 1511400 1535296 1559516 1584074 1609341 1635475 1662110 1688863
66908 1688863 1716011 1744255 1773767 1803872 1833942 1864228 1895392 1927426 1959616 1991568 2023721
66897 2023721 2056564 2089805 2122731 2155124 2187306 2219298 2250432 2279960 2307857 2334853 2361816
66886 2361816 2389090 2416228 2442270 2466438 2488683 2509496 2529107 2547053 2562581 2575318 2585422
66875 2585422 2593224 2598838 2602032 2602371 2599650 2594295 2587134 2578523 2567880 2554374 2537953 2519320 2498978
66862 2498978 2476755 2452397 2426177 2398629 2369959 2340036 2308752 2276072 2241946 2206529 2170392
66851 2170392 2134098 2097570 2060255 2021993 1983352 1945025 1907279 1870151 1833772 1798096 1762566
66840 1762566 1726514 1689845 1653032 1616541 1580628 1545664 1512164 1480278 1449569 1419538 1390123
66829 1390123 1361402 1333057 1304540 1275818 1247575 1220523 1194694 1169598 1144977 1121107 1098319
66818 1098319 1076379 1054603 1032556 1010476 988881 967941 947479 927514 908516 890910 874531
66807 874531 858707 842846 826785 810642 794598 778924 764023 750192 737277 724722 712087
66796 712087 699413 686960 674718 662490 650403 638890 627988 617093 605883 595089 585683 577446
66784 577446 569096 559937 550621 541986 533916 525884 517949 510446 503112 495399 487497 480208 473778 467572
66770 467572 461034 454285 447593 440881 434080 427455 421308 415771 411096 407557 404743 401438 396734 390954
66756 390954 385161 380124 376072 372951 370297 367215 363199 358849 355172 352284 349367 345868 342068 338389
66742 338389 334776 331041 327311 323828 320624 317644 314875 312052 308569 304114 299247 294977 291805 289485
66728 289485 287703 286563 286191 286111 285415 283604 281006 278252 275628 273154 271099 269897 269487 269095 267905 265707
66712 265707 262805 259633 256662 254327 252667 251184 249398 247370 245444 243724 242172 240945 240101 239091
66698 239091 237116 234066 230669 227679 225290 223462 222301 221919 222146 222556 222619 221855 220177 218135 216520 215614
66682 215614 215017 214173 212782 210800 208461 206279 204601 203127 201332 199379 198038 197591 197394 196721 195478
66667 195478 193880 192060 190363 189366 189095 188727 187686 186626 186634 187671 188432 187709 185437 182532 180130 178879
66651 178879 178541 178279 177585 176723 176126 175800 175764 176533 178419 180580 181621 181104 179792 178423 177056 175730 174931
66634 174931 174953 175327 175303 174564 173160 171239 169217 167876 167763 168548 169273 169183 168163 166564 164865 163430 162358
66617 162358 161519 160807 160290 160057 159983 159750 159103 158107 157172 156755 156941 157388 157767 158089 158479 158859 159145 159562 160367
66598 160367 161314 161757 161281 160019 158399 156929 156082 155966 156098 155893 155360 154945 154728 154324 153601 152937 152616 152457
66580 152457 152225 151958 151645 151035 150057 149044 148261 147562 146803 146243 146193 146525 146789 146571 145601 143912 142119 141148
66562 141148 141348 142177 142977 143608 144026 143824 142777 141469 140755 140806 141165 141530 141921 142333 142766 143474 144582 145545
66544 145545 145549 144519 143236 142449 142295 142583 143139 143767 144253 144498 144383 143571 141848 139683 138004 137395 137828 139038
66526 139038 140610 141772 141804 140919 140171 140196 140526 140447 140047 139929 140211 140364 139925 138948 137758 136575 135480 134561
66508 134561 133982 133884 134181 134566 134846 135140 135469 135294 133953 131705 129786 129125 129387 129639 129605 129748 130364 131208
66490 131208 132015 132863 133824 134671 135157 135335 135366 135216 134834 134450 134343 134364 134042 133336 132926 133456 134652 135585 135789
66471 135789 135646 135589 135381 134628 133582 132891 132618 132104 130947 129624 128895 128928 129304 129677 130112 130816 131785 132744
66453 132744 133362 133565 133662 134089 134930 135791 136142 135737 134725 133566 132821 132784 133161 133322 132960 132360 131908 131627 131400
66434 131400 131390 131868 132693 133376 133783 134443 135873 137766 139148 139420 138930 138351 137784 136887 135773 135198 135599 136433
66416 136433 136843 136646 136116 135139 133296 130824 128712 127606 127135 126628 126030 125695 125680 125719 125666 125592 125547 125567 125752
66397 125752 126062 126201 126048 126004 126515 127352 127764 127404 126771 126665 127437 128753 129898 130272 129820 129054 128500 128161
66379 128161 127652 126784 125794 125021 124566 124322 124174 124108 124200 124474 124706 124531 123893 123221 122921 122852 122679 122602 123264 124849
66359 124849 126744 128279 129436 130528 131521 132085 132197 132234 132394 132389 131851 130839 129760 128888 128156 127428 126775 126402
66341 126402 126353 126401 126239 125793 125338 125295 125844 126754 127647 128382 129035 129546 129726 129714 130064 131001 131904 131998 131422 131016
66321 131016 131090 131052 130389 129410 128640 128030 127233 126286 125496 124949 124656 124958 126185 128024 129713 130824 131419 131523
66303 131523 131029 130177 129602 129704 130299 130973 131437 131460 130921 130151 129886 130572 131854 132866 132934 132037 130862 130419
66285 130419 131260 132959 134551 135474 135786 135507 134377 132453 130486 129320 129202 129886 131051 132286 133015 132919
66269 132919 132339 131938 132010 132349 132603 132532 132086 131557 131474 132022 132660 132657 131906 130941 130235 129861 129780 130035 130579 131191 131701
66248 131701 132065 132215 132080 131842 131823 132065 132269 132296 132408 132806 133221 133259 133015 132982 133416 134019 134258 133810 132692 131261
66228 131261 130127 129836 130453 131534 132580 133360 133782 133763 133492 133562 134430 135743 136597 136549 136106 136023 136408 136675 136178
66209 136178 134757 132888 131512 131469 132787 134626 136102 137016 137642 138074 138169 137934 137588 137355 137543 138630 140726
66192 140726 142980 144091 143564 142068 140552 139461 138828 138522 138169 137363 136267 135593 135751 136448 137337 138461
66176 138461 139715 140453 140244 139568 139161 139039 138794 138525 138682 139145 139292 138998 138842 139140 139409 139067 138184 137251
66158 137251 136532 135899 135101 134117 133432 133850 135684 138166 140144 141286 142093 142783 142900 142258 141504 141281 141362 141187
66140 141187 140843 140867 141354 141870 142184 142555 143204 143945 144495 144843 145178 145557 145748 145422 144586 143812 143807 144654 145749
66121 145749 146593 147293 148025 148452 148162 147435 146946 146838 146667 146325 146372 147189 148269 148765 148474 147917 147591 147457 147222
66102 147222 146824 146544 146654 147059 147410 147582 147886 148645 149706 150624 151216 151614 151817 151624 151152 150988 151522 152353
66084 152353 152691 152239 151468 151155 151821 153484 155641 157536 158676 159087 158999 158426 157269 155704 154200 153142
66068 153142 152631 152570 152770 153005 153186 153452 153944 154611 155432 156599 158082 159208 159180 158074 156772 155843 155070 154269
66050 154269 153876 154207 154730 154744 154455 154588 155134 155272 154620 153787 153460 153534 153507 153223 152803 152259 151660 151443 152044 153347
66030 153347 154881 156490 158351 160341 161800 162177 161642 160859 160308 160050 160094 160675 161963 163599 164809 165135
66014 165135 164872 164617 164585 164677 165043 166049 167625 169172 170348 171484 172851 174000 174353 174195 174487 175776 177795
65997 177795 180027 182082 183519 184034 184113 184940 187191 190234 192880 194718 196274 198015 199647 200536 200579 200460
65981 200460 201004 202255 203306 203243 202204 201250 201092 201278 200828 199347 197172 194696 192041 189364 186985 185034
65965 185034 183271 181459 179754 178532 177984 178009 178374 178804 179021 178939 178859 179244 180242 181590 183049 184663 186366
65948 186366 187594 187774 187231 187084 188001 189453 190535 191161 191937 193139 194500 195975 197917 200230 202094 203016
65932 203016 203731 205408 208199 211102 213132 214113 214406 214416 214524 215075 216163 217600 219140 220597 221802 222713
65916 222713 223585 224755 226267 227930 229715 231746 233946 236073 238170 240591 243400 246146 248395 250122
65902 250122 251374 251980 251894 251472 251040 250505 249832 249536 250147 251339 252217 252351 251969 251166 249642 247422 245177
65885 245177 243475 242130 240621 238752 236564 233988 231058 228167 225684 223475 221210 218967 217103 215674
65871 215674 214421 213256 212335 211733 211428 211479 211806 211901 211407 210915 211434 212895 213936 213612 212633 212331 212890 213301
65853 213301 212800 211601 210315 209322 208814 208899 209438 210121 210777 211382 211770 211731 211426 211315 211589 211989 212277 212548 212965
65834 212965 213525 214270 215393 216929 218538 219774 220431 220542 220270 219924 219876 220347 221398 223109 225440 227942
65818 227942 230077 231997 234516 238039 241909 245183 247628 249531 250943 251706 252020 252377 252921 253441 253941 254636
65802 254636 255284 255173 254093 252910 252651 253172 253164 251555 248622 245571 243224 241423 239795 238689 238837 240125
65786 240125 241315 241311 240301 239278 238863 239194 240609 243604 248000 252840 257398 261863 266817 272448 278469
65771 278469 284391 289619 293633 296435 298628 300809 302931 304407 304612 303210 300294 296354 291927 287179
65757 287179 282110 277125 272980 270005 267890 266472 266187 267464 270175 274149 279672 286892 295215 304005
65743 304005 313615 324911 337915 351630 365184 378389 391167 403135 413865 422931 429660 433621
65731 433621 435488 436486 436572 434056 427646 418212 407785 397387 386701 375401 363770 352050 340193
65718 340193 328486 317651 307932 298615 288873 278801 269361 261538 255688 251390 247703 243799 239619
65705 239619 235849 233151 231544 230539 229601 228368 226786 225244 224340 224256 224553 224778 225010 225547 226269 226740 226820
65688 226820 226725 226531 226080 225496 225336 225934 226898 227595 228015 228873 230914 234342 238817 243778 248755 253660 258869
65671 258869 264850 271690 279128 287104 296010 306281 317939 330730 344498 359184 374532 390135
65659 390135 405778 421461 436960 451572 464472 475231 483923 490870 496418 500893 504623 507869 510685
65646 510685 512825 514002 514407 514823 515837 516925 516812 514900 511899 508660 504839 499304 491684 482811 473480
65631 473480 463415 451725 438010 422696 406596 390540 375239 361086 347951 335320 322705
65620 322705 309971 297423 285690 275390 266768 259645 253752 248962 245200 242282 239993 238149 236538
65607 236538 234960 233436 232166 231160 230092 228670 226965 225258 223791 222879 222928 223922 225004 225018 223544 221244
65591 221244 219199 218132 218173 219019 220204 221427 222720 224213 225780 227145 228346 229888 232345 235911 240343
65576 240343 245254 250544 256617 264069 273052 283110 293813 305298 317876 331332 345098 358974
65564 358974 373100 387170 400203 411316 420347 427506 432868 436461 438452 438798 436991 432531 425563
65551 425563 416674 406225 394247 380943 366944 352958 339414 326511 314396 303113 292472 282204
65539 282204 272344 263422 256180 250980 247497 244991 242801 240589 238367 236507 235569 235741 236459 236867 236622
65524 236622 235950 234953 233314 230858 228038 225618 224016 223057 222180 220841 219005 217299 216381 216092 215578 214324
65508 214324 212621 210886 209120 207390 206285 206307 207090 207760 207993 208250 209071 210442 211838 212637 212641 212367 212617
65491 212617 213574 214616 215261 215874 217089 218889 220763 222451 224049 225659 227496 230074 233619 237445 240481
65476 240481 242376 243490 243943 243383 241747 239620 237657 236066 234737 233415 231772 229757 227843 226474 225336
65461 225336 223749 221624 219387 217075 214361 211565 209740 209427 210037 210709 211096 211088 210590 209973 209970 210592 210861 210172
65443 210172 209258 209187 210007 211068 212144 213461 214962 216353 217602 218773 219628 220062 220684 222238 224562 226780
65427 226780 228399 229624 230675 231516 232224 232958 233450 233088 231707 229884 228360 227421 226935 226660 226533 226800 227760
65410 227760 229184 230327 230838 231246 232036 232656 232221 230928 229902 229745 230135 230866 232267 234259 235945 236730
65394 236730 237184 238188 239694 240925 241498 241815 242490 243839 245718 247511 248370 247886 246528 245238 244601 244529
65378 244529 244558 244271 243547 242603 241735 240983 240152 239192 238369 237999 238278 239394 241476 244176 246620 248067 248633
65361 248633 249205 250773 253818 258099 262768 266899 270162 273057 276444 280876 286279 292025 297297 301675
65347 301675 305434 309060 312436 314853 315934 316206 316547 317330 318256 318717 318068 315870 312258 307939 303589 299328
65331 299328 294972 290508 286048 281528 276852 272248 268114 264503 261061 257576 254402 252264 251656 252372 253510
65316 253510 254052 253562 252333 250827 249164 247262 245211 243227 241356 239498 237717 236189 234839 233282 231356
65301 231356 229537 228599 228785 229465 229732 229309 228673 228319 228204 228143 228439 229650 231748 233918 235325 235782 235665
65284 235665 235474 235534 235776 235687 234844 233619 232939 233163 233594 233362 232396 231217 230215 229580 229562 230209 230975 231184 230896
65265 230896 230878 231673 233012 234235 234959 235320 235766 236675 238044 239529 240912 242351 244022 245691 246894 247459
65249 247459 247637 247848 248435 249474 250564 251026 250573 249574 248418 246930 244801 242255 239753 237310 234737 232430
65233 232430 231205 231276 232003 232767 233480 234095 234251 233759 232949 232189 231418 230525 229832 229752 230149 230411 230099 229296 228359
65214 228359 227565 226970 226485 226030 225632 225373 225402 226061 227752 230363 233001 234726 235486 235898 236225 236087 235211 233897
65196 233897 232578 231424 230567 230121 229821 229196 228410 228275 229080 230002 230272 230345 231227 233067 235105 236730 237798
65179 237798 238146 237670 236868 236557 236906 237394 237773 238371 239243 239791 239623 239176 239073 239311 239568 239829 240153 240144 239374
65160 239374 238236 237654 237836 237879 236900 235208 234003 234103 235247 236517 237137 236933 236371 236257 237205 239161 241504
65143 241504 243671 245614 247590 249703 251823 253872 255975 258372 261295 264863 268896 272909 276551 279988
65129 279988 283576 287172 290175 292314 293995 295741 297726 300123 303447 308016 313281 318111 321666 323749
65115 323749 324531 324405 323954 323573 323107 322178 320809 319288 317512 315020 311763 308331 305196 302090 298367 293700
65099 293700 288318 282837 277960 273989 270488 266783 262930 259823 258108 257408 256888 256175 255352 254466 253560 252945
65083 252945 252854 252978 252845 252599 252822 253572 254110 253775 252708 251500 250523 249853 249536 249561 249644 249337 248403 247072 245993
65064 245993 245895 247037 248812 250109 250280 249681 249173 249198 249536 249808 249954 250156 250491 250853 251164 251584 252396 253576
65046 253576 254554 254587 253546 252210 251585 251906 252473 252467 251751 250756 249770 248683 247445 246434 246019 245914 245367 244107
65028 244107 242720 241814 241136 239953 238180 236598 235865 235757 235634 235232 234740 234393 234418 235174 236857 239068 241013
65011 241013 242194 242724 243040 243602 244786 246653 248722 250350 251499 252866 255104 258142 261381 264280 266628
64996 266628 268557 270520 272988 275844 278250 279390 279233 278386 277417 276658 276429 276938 277965 279037 279973 280962
64980 280962 282109 283264 284310 285292 286204 287039 288114 289839 291927 293272 293011 291429 289442 287478 285327
64965 285327 282898 280536 278489 276560 274475 272288 270202 268244 266360 264650 263240 262028 260848 259904
64951 259904 259700 260377 261317 261680 261265 260590 260156 259955 259830 259907 260316 260739 260701 260289 260081 260295 260446 260060 259296
64932 259296 258636 258324 258459 259253 260730 262380 263602 264400 265181 265983 266420 266369 266166 265966 265420 264249 262724
64915 262724 261259 259877 258430 257157 256617 257111 258387 259868 261057 261778 262239 262787 263554 264451 265643 267736
64899 267736 271207 275709 280310 284410 288208 292211 296551 300996 305464 310324 316068 322755 329886 336862
64885 336862 343498 349909 356009 361445 366152 370638 375336 379785 382805 383528 382125 379536 376735 374238
64871 374238 371994 369591 366748 363725 361067 358941 356959 354784 352610 350771 349108 347110 344595 341848
64857 341848 339065 336064 332730 329388 326438 323815 321157 318407 315826 313367 310412 306388 301449 296328
64843 296328 291651 287641 284356 281858 279996 278306 276409 274499 273275 273240 274071 274748 274369 272873 270951
64828 270951 269330 268324 268062 268749 270321 272032 272894 272672 272120 272069 272607 273429 274617 276607 279455 282581
64812 282581 285363 287677 289794 292050 294772 298267 302609 307517 312591 317593 322393 326825 330787 334369
64798 334369 337600 340158 341630 342140 342383 342820 343002 341993 339414 335813 331986 328234 324506 320999 318254
64783 318254 316609 315904 315876 316535 317867 319321 320037 319702 318900 318502 318932 320109 321762 323545 325153 326722
64767 326722 328965 332433 336665 340565 343733 346951 351135 356287 361835 367585 373788 380437 387082 393348
64753 393348 399214 404719 409807 414564 419243 423926 428391 432381 435780 438525 440673 442501 444140 445139
64739 445139 444913 443655 442052 439910 435894 429217 420973 413065 406318 400451 395387 391410 388122 384437
64725 384437 379971 375585 372158 369588 367458 365976 365615 366239 367193 368058 368890 369972 371745 374685 378770
64710 378770 383217 387188 390621 394053 397732 401240 403882 405155 404940 403517 401245 398041 393427 387366
64696 387366 380670 374184 367888 361349 354775 348930 344058 339618 335181 330998 327492 324748 322721 321442
64682 321442 320721 320030 319074 318246 318153 318899 320087 321385 322765 324296 325961 327797 330119 333481 338210 343837
64666 343837 349207 353477 356976 360695 364986 369122 372183 373853 374195 373226 371135 368537 366065 363809 361453
64651 361453 358778 355781 352596 349630 347528 346569 346281 346059 346008 346689 348165 349946 351927 354745 358882 363890
64635 363890 368993 374156 380100 387299 395389 403596 411438 418842 425815 432257 438086 443344 448026 451813
64621 451813 454073 454213 452089 448121 443058 437603 432059 426175 419387 411395 402612 393907 385860 378418
64607 378418 371378 365042 360063 356609 353969 351182 347968 344845 342484 341137 340589 340333 339801 338772 337713
64592 337713 337411 338078 339086 339788 340307 341177 342453 343664 344590 345645 347456 350420 354704 360293 366919 374227
64576 374227 382105 390520 399017 406820 413659 420086 426676 433230 439099 444006 448097 451301 453079 452913
64562 452913 450822 447286 442766 437392 431141 424303 417608 411649 406281 400996 395868 391636 388653 386288
64548 386288 383766 381143 379002 377513 376458 375900 376116 376865 377440 377623 378022 379076 380205 380335 379084 377033
64532 377033 374914 372845 370467 367585 364399 361064 357341 353034 348718 345441 343456 341713 339133 336069
64518 336069 333939 333523 334270 335218 335912 336276 336302 336277 336790 338009 339234 339617 339163 338640 338670 339291 340365 342038
64500 342038 344666 348441 353129 358172 363116 367999 373137 378451 383290 387156 390435 394046 398360 402784
64486 402784 406410 408865 410415 411484 412326 413103 413987 414997 415807 415983 415535 415039 415024 415317 415190 414097 412071
64469 412071 409447 406526 403604 401073 399287 398374 398212 398512 399006 399739 401165 403685 407028 410311 412782
64454 412782 414282 414987 415030 414521 413663 412635 411581 410872 411076 412443 414592 416959 419396 422101 425121 428256
64438 428256 431410 434825 438954 444241 450969 459172 468694 479391 491255 504375 519000 535652 554965
64425 554965 577312 602838 631962 665512 704225 748334 797779 852420 911800 975097 1041669
64414 1041669 1111305 1183462 1256517 1328231 1396780 1460888 1519190 1570181 1612819 1646680 1671414
64403 1671414 1686496 1691556 1686476 1671094 1645318 1609711 1565575 1514277 1456828 1394252 1327871 1258971
64391 1258971 1188633 1118261 1049856 985166 924691 867949 814697 765525 721252 682091 647572
64380 647572 617041 590088 566583 546435 529378 515009 502983 493046 484783 477543 470821 464656
64368 464656 459380 454848 450148 444305 437290 430104 423728 418157 412630 406683 400626 395003 389969 385428
64354 385428 381482 378342 375988 374227 373027 372501 372583 373058 373875 375089 376453 377419 377719 377691 377867 378429 379147
64337 379147 379622 379497 378590 376891 374414 371103 367153 363270 360224 358104 356446 355070 354286 354153 354194 354170
64321 354170 354551 355655 356833 357240 357157 357722 359406 361523 363350 364998 366872 368939 370956 372899 374577
64306 374577 375193 373965 371113 367681 364366 361034 357432 353757 350213 346485 342161 337496 333272 330006
64292 330006 327669 326137 325402 325282 325356 325446 325805 326537 327180 327222 326896 327058 328325 330561 333134 335427 337271
64275 337271 339200 342190 346752 352293 357694 362465 366912 371241 375073 378111 380734 383487 386213 388117
64261 388117 388676 388227 387650 387579 387927 388147 387986 387857 388252 388955 389115 388101 385881 382673 378751 374695 371193
64244 371193 368277 365213 361491 357428 353420 349193 344462 339927 336810 335460 335074 334738 334146 333308 332287
64229 332287 331464 331494 332618 334297 335759 336728 337498 338533 340074 341906 343461 344345 344733 344987 344960 344188 342752
64212 342752 341397 340619 340091 339332 338440 337831 337583 337495 337531 337739 337858 337487 336629 335719 335102 334830 334966 335670 336844
64193 336844 338071 339199 340776 343568 347673 352433 357280 362407 368402 375432 383059 390758 398302 405555
64179 405555 412219 417984 422734 426436 428962 430194 430110 428588 425344 420401 414428 408254 402100 395701 389113
64164 389113 382929 377586 372895 368482 364356 360771 357774 355196 352991 351353 350505 350420 350748 351051 351220 351612
64148 351612 352601 354118 355840 357660 359578 361317 362619 363948 366169 369369 372657 375447 378195 381285
64134 381285 383856 384657 383676 382003 380218 377916 374981 372348 370946 370531 370146 369411 368816 368940 369938 371772
64118 371772 374434 377716 381026 383787 386102 388846 392929 398442 404641 410800 416841 423004 429166 434854
64104 434854 439890 444572 449182 453655 457910 462157 466605 471076 475229 479057 482895 486979 491210 495389
64090 495389 499447 503366 506981 509930 511788 512239 511226 508984 505863 502055 497538 492288 486456 480266
64076 480266 473818 467143 460441 454136 448597 443910 440009 436877 434468 432520 430687 428905 427456 426641
64062 426641 426542 427138 428435 430380 432769 435369 438021 440612 443123 445751 448793 452348 456278 460433 464673
64047 464673 468647 472069 475421 479885 486063 493089 499441 504456 508554 512239 515521 518258 520382 521620
64033 521620 521589 520417 518780 517071 514902 511723 507625 503271 499314 496110 493734 492029 490819 490270 490755
64018 490755 492235 494058 495559 496529 496895 496365 494757 492398 489820 487298 484966 483014 481387 479634 477554
64003 477554 475683 474516 473571 471942 469715 468005 467431 467283 466506 464973 463442 462667 462910 463943 465203 466209
63987 466209 467130 468706 471438 475062 478946 482678 486117 489346 492871 497465 503387 510080 516994 524313
63973 524313 532357 540626 548179 554873 561558 568986 577071 585323 593503 601687 610161 619510 630399 643038
63959 643038 657079 672245 688751 706972 727083 749280 774105 802313 834661 871987 915172
63948 915172 964733 1020713 1083292 1153246 1231416 1317966 1412534 1514916 1625043 1742266 1865122
63937 1865122 1991879 2120870 2250202 2377545 2500507 2617019 2725192 2822993 2908252 2978878
63927 2978878 3032973 3068988 3086023 3083982 3063387 3025125 2970341 2900386 2816711 2720943 2615115
63916 2615115 2501624 2382798 2260623 2137011 2014176 1894492 1779932 1671714 1570461
63907 1570461 1476677 1391077 1314452 1247063 1188183 1136388 1090416 1049659 1013910 982924 956347
63896 956347 933827 914983 899362 886518 875966 867033 859074 852012 846338 842281 839290 836696 834627
63883 834627 833797 834568 836773 840459 846228 854625 865633 878892 894099 911106 930088 951825 977357
63870 977357 1006998 1039968 1075284 1112690 1152366 1194110 1237304 1281462 1326165 1370537 1413420
63859 1413420 1454256 1493280 1530581 1565355 1596379 1622923 1644799 1661743 1673179 1678630 1678039 1671597
63847 1671597 1659491 1641931 1619337 1592351 1561674 1527796 1490781 1450358 1406446 1359654 1311152
63836 1311152 1261975 1212654 1163643 1115802 1070114 1026948 985942 946659 909025 873071 838656
63825 838656 805797 775011 746934 721690 698943 678428 660019 643299 627620 612779 599188
63814 599188 587102 576133 565921 556959 550126 545469 541992 538698 535347 531996 528321 523842 518612
63801 518612 513223 508122 503255 498352 493178 487437 480817 473470 466239 460009 454864 450200 445610 441253
63787 441253 437255 433265 428998 424864 421489 418750 415845 412338 408631 405306 402540 400442 399390 399529
63773 399529 400228 400553 400170 399390 398469 397320 395884 394373 393077 392234 392032 392400 392804 392605 391727 390718 390136
63756 390136 390132 390575 391168 391398 390795 389462 388056 387150 386898 387332 388469 389966 391148 391710 392003 392369 392668 392847
63738 392847 393416 394770 396395 397468 398073 399122 401174 403997 407283 411046 415155 419188 423083 427371 432370
63723 432370 437538 442015 445468 448100 450237 452275 454716 457759 461006 463956 466554 468911 470707 471434
63709 471434 471150 470475 469787 468833 467229 464997 462489 460078 458035 456471 455281 454316 453618 453292 453235 453341 453943
63692 453943 455554 458074 460709 462939 465146 467946 471262 474507 477442 480314 483205 485725 487485 488560
63678 488560 489418 490578 492287 494291 495928 496798 497355 498473 500378 502354 503628 504172 504392 504447 504317 504261 504735
63661 504735 505831 507191 508489 509615 510252 509676 507258 503103 498034 492984 488482 484617 481361 478881 477463
63646 477463 477045 476968 476507 475700 475375 476229 478185 480800 483909 487496 491227 494694 498050 501886 506389 511138
63630 511138 515865 520931 526770 533291 540188 547433 554984 562328 568967 575273 582236 590331 599141 608225
63616 608225 617821 628426 640193 653074 667218 682862 700086 719036 740091 763353 788123 813364
63604 813364 838581 863765 888533 911969 933445 953021 970699 985736 997200 1004882 1009173 1010190
63592 1010190 1007754 1002275 995054 987247 978854 969119 957709 944967 931038 915404 897618 878219
63580 878219 858442 839161 820450 802105 784132 766667 749866 734201 720508 709354 700496 693296
63568 693296 687537 683465 681111 680018 679808 680626 682794 686259 690657 695828 702079 709878 719337 729950
63554 729950 740886 751811 763498 777421 794537 814625 837026 861779 889656 920967 954648
63543 954648 988729 1021611 1052773 1082310 1109914 1134361 1153914 1167208 1173908 1174792 1171344 1165143
63531 1165143 1157321 1148377 1138424 1127543 1115859 1103373 1089905 1075140 1058663 1040069 1019270 996679
63519 996679 972801 947649 920957 893024 864960 837792 811675 786337 762045 739618 719544
63508 719544 701523 684986 669699 655709 642978 631349 620741 611184 602672 595073 588199 581910
63496 581910 576143 570841 565960 561575 557880 554837 551950 548755 545612 543531 542911 542885 542391 541568 541461 542583
63480 542583 544507 546834 549756 553391 557301 561092 565018 569449 574134 578399 581831 584340 585849 586414
63466 586414 586511 586704 587088 587347 587248 586676 585358 583083 580263 577867 576708 576960 578307 580172 581904 583135
63450 583135 584059 585079 586240 587402 588927 591624 595901 601394 607666 614786 622996 632330 643029 656042
63436 656042 672565 693033 716799 742659 769463 796422 823128 849287 874226 896798 915983
63425 915983 931434 943298 951799 957414 961297 965060 970113 977484 988018 1002207 1019816 1040188 1063015
63412 1063015 1088272 1115152 1141659 1165728 1186490 1204174 1219095 1231213 1240364 1246361 1248852 1247562
63400 1247562 1242748 1235117 1225257 1213444 1199892 1184697 1167424 1147263 1123977 1098422 1071759 1044363
63388 1044363 1015798 985768 954720 923620 893544 865542 840450 818472 799115 781779 766396
63377 766396 753332 742706 734027 726637 720406 715845 713551 713631 715727 719510 724999 732404 741834 753266
63363 753266 766649 781891 798836 817460 838146 861530 887946 917055 948081 980359 1013607
63352 1013607 1047644 1081868 1114997 1145438 1172018 1194358 1212543 1226671 1236904 1243735 1247650 1248528
63340 1248528 1245862 1239817 1231585 1222281 1211802 1199194 1183901 1166129 1146190 1124245 1100783 1076678
63328 1076678 1052442 1027862 1002757 977728 953799 931593 911281 893090 877292 863663 851403
63317 851403 839794 828770 818717 809731 801024 790928 777719 760816 741313 721180 701902 683919
63305 683919 667081 651234 636377 622684 610565 600412 592129 585137 579038 573989 570128 566843 563073
63292 563073 558386 553491 549513 546898 545153 543502 541574 539427 537159 534740 532264 530064 528429 527243
63278 527243 526109 524743 523138 521443 519935 519040 519059 519722 520269 520161 519647 519511 520388 522361 525015 527749
63262 527749 530168 532337 534601 537112 539701 542314 545283 548941 553140 557430 561618 565885 570458 575479
63248 575479 581178 587750 594917 601933 608294 614385 621201 629491 639272 650087 661595 673841 687137
63235 687137 701802 718009 735695 754448 773608 792705 811872 831660 852346 873609 894961
63224 894961 916241 937542 958912 980380 1001990 1023465 1044032 1063034 1080689 1097850 1115052
63213 1115052 1132129 1148588 1163725 1176356 1185143 1189578 1190095 1186886 1179189 1166353 1149142 1129229
63201 1129229 1107548 1083994 1058728 1032961 1008042 984370 961776 940629 921942 906435 893915
63190 893915 883740 875551 869461 865790 864901 867160 872691 881030 891247 902619 915113 929039 944300
63177 944300 960190 975950 991228 1005994 1020312 1034361 1048377 1062255 1075347 1086942 1096885 1105377
63165 1105377 1112261 1116813 1118327 1116607 1111782 1103886 1092830 1078651 1061634 1042249 1021009 998290
63153 998290 974238 949003 923138 897620 873313 850480 828955 808740 790228 773847 759622
63142 759622 747246 736472 727298 719717 713418 707873 702659 697544 692345 686988 681782 677359 674105 671828
63128 671828 670167 669087 668671 668626 668462 668141 668036 668232 668328 668170 668305 669350 671211 673290 675275 677318 679581
63111 679581 682013 684561 687276 690134 693052 696101 699508 703373 707562 711862 716055 719865 723145 726157
63097 726157 729392 733015 736805 740732 745246 750664 756524 761895 766205 769485 771914 773581 774680 775491
63083 775491 776003 775894 775099 774123 773557 773583 774264 776033 779429 784398 790311 796659 803322 810140 816843 823747
63067 823747 832017 842703 855624 869661 884071 899141 915584 933726 953398 974334 996465 1020004
63055 1020004 1045396 1073188 1103873 1137841 1175236 1215629 1258039 1301645 1346500 1393149 1441530
63044 1441530 1490727 1539980 1589519 1640038 1691661 1743852 1796166 1848656 1901522 1954691 2007757
63033 2007757 2060124 2111136 2160215 2206776 2249763 2287311 2317215 2337973 2349255 2351299 2344097 2327328
63021 2327328 2300964 2265673 2222570 2172769 2117324 2057621 1995665 1933822 1874150 1817889 1765492
63010 1765492 1717106 1673098 1634230 1601316 1574641 1553786 1538121 1527452 1522000 1521839 1526568 1535506
62998 1535506 1547943 1563147 1580492 1599705 1620686 1642957 1665626 1688195 1711029 1734623 1758606
62987 1758606 1781851 1803396 1822796 1839626 1853198 1862952 1868753 1870547 1867866 1859779 1845289 1823923
62975 1823923 1796149 1763177 1726124 1685470 1641538 1595259 1547936 1500386 1452897 1406083 1361130
62964 1361130 1318885 1279256 1241894 1207010 1175039 1145833 1118703 1093129 1068998 1046300 1025068
62953 1025068 1005513 987817 971697 956496 941762 927493 913853 900895 888514 876421 864235
62942 864235 851917 840026 829187 819323 809819 800523 792105 785220 779693 774824 770218 766018 762482
62929 762482 759695 757597 755999 754532 752834 750897 749092 747753 746777 745687 744079 741987 739799 737884
62915 737884 736398 735499 735458 736244 737131 737115 735891 734095 732445 730941 729148 726930 724482 721851 718891 715697
62899 715697 712680 710134 708007 706168 704611 703286 702051 700914 700131 699899 700192 700993 702335 703955 705184
62884 705184 705533 705199 704732 704399 704184 704216 704770 705856 707202 708602 709901 710674 710469 709526 708773 708783 709091 708863
62866 708863 707926 706723 705495 704069 702397 700818 699622 698699 697787 696849 696029 695395 694914 694563 694336 694243 694388
62849 694388 695009 696291 698104 699999 701506 702474 703128 703825 704781 706002 707357 708580 709350 709578 709625 709957 710614
62832 710614 711269 711865 712767 714080 715282 715960 716541 717755 719603 721441 722979 724585 726634 729211 732518
62817 732518 736838 741805 746374 749955 753058 756392 759853 763010 766105 769779 774013 778177 782199 786940
62803 786940 793170 800730 809067 818124 828277 839573 851410 862991 873877 884237 894786 906494
62791 906494 920114 935835 953400 972639 993900 1017881 1045060 1075472 1109201 1146967 1189876
62780 1189876 1238506 1292523 1351333 1414818 1483153 1556088 1632655 1711444 1790995 1870014 1947405
62769 1947405 2021871 2091404 2153491 2206179 2248654 2280449 2300546 2307918 2302717 2286182 2259395 2222785
62757 2222785 2176859 2122661 2061357 1994122 1922770 1849753 1776969 1705043 1634184 1565212 1499149
62746 1499149 1436286 1376402 1319717 1267000 1218785 1175010 1135330 1099266 1066124 1035337 1006955
62735 1006955 981418 958873 939104 922015 907607 895469 884860 875429 867300 860326 853853 847604
62723 847604 842257 838650 836681 835470 834459 833887 834256 835748 838236 841593 845886 851444 858818 868478 880414
62708 880414 894062 908756 924355 941461 960985 983461 1008931 1037471 1069560 1105668 1145634
62697 1145634 1188878 1235149 1284530 1336637 1390290 1444298 1498182 1551818 1604677 1655795 1704104
62686 1704104 1748279 1786479 1816869 1838423 1850819 1853660 1846450 1829456 1803973 1771383 1732388 1687519
62674 1687519 1637964 1585348 1530868 1475166 1419051 1363883 1311055 1261352 1214935 1171721 1131553
62663 1131553 1094134 1059068 1026099 995323 967095 941713 919147 899071 881123 865075 850727
62652 850727 837760 825837 814841 804889 796046 788074 780491 772864 765061 757227 749622 742508 736208
62639 736208 731098 727355 724735 722758 721145 719911 718983 717982 716637 715268 714544 714661 714995 714649 713281
62624 713281 711373 709803 709173 709406 709915 710241 710513 711195 712422 713829 715118 716583 718867 722318 726792 731987
62608 731987 737723 743944 750684 758146 766614 776182 786725 798309 811484 826936 844820 864691 886278
62595 886278 910149 937303 968008 1001297 1035808 1070917 1106815 1143562 1180460 1216403 1250457
62584 1250457 1281858 1309755 1333273 1351692 1364313 1370371 1369468 1362049 1349091 1331302 1308926 1282299
62572 1282299 1252173 1219461 1185082 1150184 1115950 1082877 1050661 1019196 989282 961845 936805
62561 936805 913355 891228 870972 852938 836773 822125 809206 798170 788430 779120 770001 761471
62549 761471 753884 747314 741838 737502 734084 731321 729403 728719 729009 729252 728705 727743 727381 728129 729631 731252
62533 731252 732661 733814 734671 735164 735452 736019 737366 739578 742319 745449 749555 755636 764220 774989 787286
62518 787286 800821 815780 832532 851385 872450 895581 920544 947324 976076 1006659 1038394
62507 1038394 1070442 1102120 1132686 1161160 1186786 1209433 1229094 1245089 1256319 1262304 1263469 1260354
62495 1260354 1253027 1241506 1226306 1208254 1188063 1166382 1144021 1121895 1100919 1082104 1066381
62484 1066381 1053969 1044175 1036210 1030058 1026251 1024982 1025836 1028250 1031833 1036258 1041213 1046435 1051459 1055411
62470 1055411 1057463 1057461 1055658 1051870 1045463 1036325 1025227 1012860 999036 983286 965860 947559 928809
62457 928809 909486 889644 869917 851068 833500 817304 802529 789266 777689 768045 760412 754435
62445 754435 749578 745700 743091 741835 741426 741246 741272 742084 744202 747559 751525 755349 758621 761424 764012
62430 764012 766349 768116 769162 769658 769664 768809 766690 763406 759354 754632 749046 742737 736406 730855 726560
62415 726560 723697 722066 720815 718794 715713 712630 710759 710002 709167 707530 705433 703363 701271 699215 697962
62400 697962 698198 699459 700586 701154 701830 703265 705251 707143 708607 709697 710636 711869 713947 716928 720081
62385 720081 722577 724370 726137 728514 731792 736146 741631 747865 754213 760413 766677 773012 778878 783944
62371 783944 788919 795180 803590 813962 825628 838184 851505 865400 879613 894268 910143 928358
62359 928358 949763 974654 1003086 1035268 1071450 1111438 1154517 1199920 1247079 1295205 1342886
62348 1342886 1388512 1430969 1469600 1503638 1532253 1555180 1572695 1584605 1589764 1587108 1576976 1560935
62336 1560935 1540444 1516194 1488603 1458314 1425993 1392100 1357220 1322332 1288473 1256307 1226203
62325 1226203 1198501 1173392 1150637 1129680 1110023 1091366 1073500 1056222 1039294 1022333 1004926
62314 1004926 987039 969244 952242 936198 920791 905875 891794 878965 867395 856761 846854
62303 846854 837802 829937 823438 818016 812940 807536 801745 796164 791551 788297 786314 785226 784638 784378 784532
62288 784532 785224 786391 787836 789465 791298 793333 795550 798003 800776 803880 807322 811121 815071 818675
62274 818675 821720 824770 828635 833313 838017 842355 846950 852567 859165 866313 874186 883663 895603 910498
62260 910498 928661 950261 975274 1003821 1036489 1073764 1115089 1159033 1204568 1251746 1300853
62249 1300853 1351217 1401136 1448762 1492774 1532365 1566895 1595594 1617530 1631883 1638351 1637232 1629090
62237 1629090 1614412 1593530 1566675 1534090 1496345 1454657 1410692 1365882 1321043 1276719 1233643
62226 1233643 1192565 1153799 1117253 1082959 1051389 1023133 998365 976602 956933 938554 921239
62215 921239 905365 891433 879533 869298 860251 852068 844533 837481 830970 825426 821345 818723 816836
62202 816836 814808 812353 809831 807596 805617 803913 803031 803689 806034 809596 813955 819059 824781 830636 836272
62187 836272 841978 848324 855419 862841 870289 877953 886135 894752 903379 911699 919686 927340 934377 940388
62173 940388 945385 950122 955722 962986 972149 983283 996682 1012779 1031903 1054312 1080276 1109803
62161 1109803 1142245 1176415 1211179 1245877 1280104 1313238 1344270 1372066 1395702 1414604 1428507
62150 1428507 1437377 1441341 1440505 1434800 1424092 1408638 1389316 1367247 1343184 1317503 1290780 1264065
62138 1264065 1238426 1214430 1192243 1172042 1154094 1138548 1125470 1115026 1107439 1102696 1100520 1100634
62126 1100634 1102925 1107337 1113751 1122051 1132196 1144171 1157838 1172722 1187899 1202278 1215268 1227186
62114 1227186 1238738 1250027 1260304 1268786 1275534 1281296 1286576 1291116 1294423 1296570 1298285 1300189 1302171
62101 1302171 1303651 1304374 1304808 1305813 1308054 1311635 1316022 1320314 1323900 1326968 1330139 1333527 1336526 1338641
62087 1338641 1340129 1341465 1342538 1342857 1342385 1341661 1341219 1341363 1342500 1345170 1349579 1355496 1362705 1371233 1381081
62072 1381081 1392071 1403987 1416505 1429049 1441271 1453833 1468079 1484626 1502733 1521364 1540348
62061 1540348 1560041 1580325 1600638 1620678 1640468 1659831 1678370 1695791 1711608 1724539 1732979
62050 1732979 1736338 1735401 1731103 1723358 1711325 1694471 1673010 1647566 1618754 1587024 1552666 1515956
62038 1515956 1477347 1437457 1396867 1356128 1315927 1276983 1239692 1204181 1170825 1140324 1113003
62027 1113003 1088339 1065582 1044652 1026002 1009675 995012 981416 969004 958231 949060 940825 932843
62015 932843 924831 916701 908294 899676 891587 885068 880385 876604 872599 868367 864957 863206 863039 864043
62001 864043 866098 869085 872418 875422 877969 880303 882387 883914 884914 885786 886619 886872 885935 883667 880246
61986 880246 875888 870956 866043 861493 856958 851735 845538 838712 831747 824893 818264 812015 806237 800906
61972 800906 796106 792211 789591 788070 786870 785270 783270 781476 780293 779473 778558 777616 777249 777832 778991
61957 778991 779938 780226 780041 779939 780393 781573 783410 785875 789122 793282 798171 803439 809112 815694 823537
61942 823537 832346 841633 851538 862797 875815 890089 904753 919471 934639 950819 968127 986045
61930 986045 1003700 1020320 1035550 1049392 1061909 1073038 1082678 1090810 1097471 1102725 1106631 1109105 1109780
61917 1109780 1108283 1104860 1100636 1097000 1094690 1093557 1093191 1093641 1095478 1099277 1105134 1112711 1121645 1131713
61903 1131713 1142517 1153192 1162812 1171125 1178619 1185650 1191672 1195496 1196187 1193515 1187734 1179321 1168988
61890 1168988 1157584 1145692 1133303 1120051 1105813 1091020 1076331 1062005 1047765 1033382 1019250
61879 1019250 1006075 994052 982723 971803 961692 952832 944887 937115 929409 922411 916588 911699 907330
61866 907330 903466 900329 898012 896643 896641 898410 901844 906391 911626 917636 924947 934143 945483 958757
61852 958757 973568 989803 1007722 1027613 1049538 1073414 1098971 1125531 1152146 1178202 1203643
61841 1203643 1228360 1251608 1272288 1289640 1303372 1313346 1319555 1322371 1322533 1320794 1317732 1313793 1309396
61828 1309396 1305114 1301868 1300687 1302051 1305702 1311302 1318895 1328312 1338494 1348071 1356464 1363830 1369942 1373775
61814 1373775 1374205 1370547 1362373 1349562 1332758 1313113 1291204 1266750 1239802 1211659 1184014 1157588
61802 1157588 1132171 1107761 1085016 1064599 1046558 1030414 1015624 1001974 989694 979142 970236
61791 970236 962383 955058 948157 941670 935501 929962 925894 923646 922245 920302 917609 915184 913797 913191
61777 913191 912810 912577 912637 912848 912851 912334 911090 909219 907403 906468 906345 905912 904178 901307 898176 895335 892821
61760 892821 890688 889116 888105 887493 887308 887731 888661 889568 889871 889357 888287 887216 886611 886470 886420 886282 886383
61743 886383 887033 887862 888040 887174 885728 884512 884031 884395 885588 887482 889648 891440 892519 893312 894693 897042
61727 897042 899785 902181 904365 907140 910673 914059 916546 918668 921550 925363 929193 932353 935099 937904
61713 937904 940657 942978 944875 946666 948461 950093 951386 952218 952454 952146 951691 951454 951245 950461 948808 946596
61697 946596 944277 941978 939716 937886 937216 938133 940314 942902 945109 946574 947316 947553 947612 947786 948102 948262
61681 948262 947967 947329 946832 946861 947339 947863 948109 947985 947508 946673 945491 944069 942521 940784 938617 935859 932685
61664 932685 929495 926568 923907 921444 919316 917863 917401 917984 919246 920445 920869 920362 919373 918372 917382 916286
61648 916286 915360 915105 915567 916218 916702 917376 918841 921141 923706 926021 927995 929596 930416 929917 928165 926038
61632 926038 924517 923825 923389 922565 921135 919135 916632 913931 911636 910088 908871 907341 905566 904341 904227
61617 904227 905017 906186 907414 908509 909300 909808 910180 910293 909850 909017 908381 907916 906646 903988 900888 898755
61601 898755 897580 896050 893443 890329 887255 883798 879515 875032 871418 868945 867084 865332 863383 860814
61587 860814 857407 853736 850774 848862 847533 846318 845140 843892 842276 840293 838405 836900 835512 833908
61573 833908 832185 830565 828989 827366 825966 825177 824992 825013 824775 823832 821852 819053 816351 814557 813508 812415
61557 812415 811010 809830 809361 809431 809658 810023 810717 811697 812692 813506 814142 814760 815580 816612 817458 817711 817631 817998
61539 817998 819098 820271 820785 820811 821093 821974 823172 824337 825339 826154 826883 827754 828631 828689 827244 824889 823171
61522 823171 822928 823506 823799 823496 822945 822373 821750 821097 820387 819362 817915 816495 815629 815147 814408 813303 812508
61505 812508 812554 813112 813465 813377 813140 812987 812860 812727 812730 812943 813234 813575 814217 815291 816365 816744 816278 815550 815155
61486 815155 815110 815174 815395 815919 816501 816749 816779 817163 818139 819410 820826 822693 825096 827378 828808 829488 830142 831171
61468 831171 832368 833403 834155 834596 834787 835080 835957 837507 839264 840616 841221 841040 840249 839275 838750 839184 840555
61451 840555 842217 843364 843765 843987 844654 845544 845880 845626 845886 847544 850033 852044 853174 854120 855419 856811
61435 856811 857988 859230 860947 863108 865471 867948 870483 872893 875099 877230 879293 881073 882557 884079
61421 884079 885826 887540 888993 890381 891955 893678 895600 898126 901355 904491 906525 907371 907750 908075 908060
61406 908060 907503 906801 906402 906203 905829 905262 904821 904543 903790 901640 897820 893299 889720 887995 887535 887101 886222
61389 886222 885421 885203 885344 885331 885011 884578 884212 884019 884165 884808 885995 887673 889623 891343 892352 892801 893486
61372 893486 894942 896849 898660 900514 902921 905661 907766 908832 909752 911597 914169 916313 917537 918650
61358 918650 920606 923299 925887 927963 929870 932043 934628 937799 941962 947340 953654 960497 967804 975641
61344 975641 983651 991071 997379 1002787 1008070 1013977 1020677 1027577 1033721 1038562 1042404 1045952 1049497 1052711
61330 1052711 1055214 1057023 1058283 1058811 1058209 1056456 1054210 1052394 1051472 1051151 1050737 1049785 1048431 1047209 1046653 1047018
61314 1047018 1048287 1050372 1053361 1057490 1062718 1068379 1073561 1077995 1082423 1087988 1095402 1104721 1115543 1127125
61300 1127125 1138541 1149131 1158713 1167188 1174131 1179179 1182587 1184938 1186383 1186710 1186066 1184939 1183313 1180510
61286 1180510 1176199 1170990 1165597 1159934 1153578 1146768 1140285 1134578 1129565 1125256 1121895 1119442 1117393 1115386
61272 1115386 1113706 1113058 1113982 1116462 1119845 1123202 1126068 1128819 1132043 1135722 1139498 1143588 1148746 1155138
61258 1155138 1161959 1168508 1175051 1182103 1189341 1195935 1201713 1207323 1213283 1219485 1225599 1231386 1236484 1240449
61244 1240449 1243270 1245436 1247254 1248491 1248940 1248992 1249218 1249603 1249547 1248536 1246517 1243756 1240686 1237878 1235811 1234546
61228 1234546 1233787 1233286 1233147 1233727 1235413 1238427 1242671 1247773 1253381 1259385 1265790 1272548 1279696 1287485 1296024
61213 1296024 1304864 1313257 1320792 1327486 1333343 1338333 1342856 1347679 1353076 1358447 1363185 1367615 1372590 1378391
61199 1378391 1384540 1390706 1397308 1405047 1414142 1424164 1434517 1444944 1455715 1467319 1479913 1493084
61187 1493084 1506299 1519429 1532552 1545341 1557042 1567208 1576155 1584504 1592438 1599553 1605287 1609343
61175 1609343 1611876 1613477 1614865 1616303 1617291 1616955 1614819 1611152 1606602 1601605 1596135 1589903 1582658 1574339
61161 1574339 1565008 1554761 1543735 1532131 1520149 1507880 1495282 1482331 1469240 1456574 1445032
61150 1445032 1434956 1426068 1417898 1410510 1404507 1400154 1396772 1393296 1389320 1385260 1381602 1378347 1375225 1372079
61136 1372079 1368917 1365815 1362889 1360261 1358088 1356776 1356978 1358993 1362236 1365763 1369412 1373996 1380278 1388290
61122 1388290 1397845 1409121 1422280 1436992 1452970 1470711 1491128 1514445 1539916 1566581 1593914
61111 1593914 1621862 1650681 1680718 1711909 1743439 1774242 1803822 1832319 1859843 1886189 1911084
61100 1911084 1934186 1954759 1971900 1985284 1995245 2001964 2005073 2004266 1999846 1992289 1981747 1968273 1952176
61087 1952176 1933732 1912974 1890279 1866802 1843639 1820739 1797337 1773406 1749931 1727623 1706139
61076 1706139 1684953 1664401 1645343 1628128 1612502 1598348 1585928 1575352 1566307 1558522 1552140 1547330
61064 1547330 1543795 1541078 1539243 1538863 1540200 1542811 1546264 1550972 1557799 1566850 1577188 1587933 1599185
61051 1599185 1611561 1625217 1639844 1655402 1672255 1690594 1710326 1731612 1754956 1780513 1807753
61040 1807753 1836124 1865620 1896415 1928462 1962011 1998162 2038112 2081816 2127996 2175512 2224238
61029 2224238 2274541 2326610 2380599 2436836 2495369 2555702 2617519 2681461 2748689 2819823 2894891
61018 2894891 2974291 3059256 3151300 3251852 3362827 3487188 3628643 3791198 3979665 4200818
61008 4200818 4464282 4783211 5175483 5665010 6281576 7057317 8017737 9166147 10466685
60999 10466685 11840527 13189632 14442235 15588127 16670521 17736430 18787384 19772421
60991 19772421 20622394 21285916 21735941 21957491 21947508 21732633 21375433 20943768 20460819 19882953
60981 19882953 19131196 18151464 16953914 15606028 14196405 12802549 11478926 10258984
60973 10258984 9159848 8186226 7334590 6596947 5962680 5419464 4954871 4557870 4218708
60964 4218708 3928076 3677384 3459704 3269693 3102753 2955027 2823991 2708041 2605277
60955 2605277 2513390 2430756 2356703 2290406 2230374 2175409 2125258 2079667 2037428 1997048 1957965
60944 1957965 1920438 1884599 1850274 1817487 1786465 1757181 1729364 1702850 1677502 1652916 1628690
60933 1628690 1604834 1581563 1558891 1536885 1515956 1496240 1476944 1457141 1437208 1418611 1402144
60922 1402144 1387152 1372712 1358748 1345546 1332946 1320703 1309177 1298929 1289903 1281648 1274173 1267967
60910 1267967 1263116 1258925 1254602 1250020 1245739 1242431 1240322 1239028 1237958 1236935 1236283 1236178 1236197 1235835 1235255
60895 1235255 1235097 1235538 1236000 1235871 1235216 1234596 1234454 1234823 1235380 1235580 1234895 1233219 1231018 1228950 1227285 1225790 1224094
60878 1224094 1222056 1219832 1217765 1216204 1215306 1214849 1214346 1213464 1212359 1211500 1211169 1211176 1211071 1210507 1209417 1208043 1206899
60861 1206899 1206501 1206921 1207667 1208179 1208342 1208375 1208394 1208441 1208873 1210228 1212559 1215230 1217586 1219613 1221767 1224375 1227370
60844 1227370 1230375 1232812 1234185 1234521 1234421 1234442 1234607 1234746 1235037 1235760 1236621 1236828 1235966 1234487 1233193 1232497 1232186
60827 1232186 1231722 1230701 1229292 1228319 1228649 1230345 1232583 1234475 1235814 1236960 1238274 1239760 1241047 1241558 1240938
60812 1240938 1239574 1238479 1238350 1238808 1238761 1237493 1235207 1232586 1230119 1227886 1225782 1223748 1221844 1220187 1218889
60797 1218889 1218060 1217769 1217837 1217689 1216616 1214447 1211804 1209545 1207975 1206772 1205590 1204482 1203751 1203629 1204134 1204989
60781 1204989 1205631 1205569 1204930 1204505 1205049 1206619 1208684 1210710 1212478 1213988 1215404 1217135 1219684 1223226 1227347
60766 1227347 1231344 1234859 1238201 1242017 1246575 1251474 1256142 1260510 1264910 1269364 1273388 1276752 1280031 1283942
60752 1283942 1288341 1292383 1295627 1298461 1301440 1304744 1308442 1312649 1317059 1320780 1323155 1324468 1325411 1326125
60738 1326125 1326301 1326021 1325813 1325803 1325379 1323913 1321490 1318747 1316260 1314195 1312295 1310076 1307313 1304428 1302170
60723 1302170 1300774 1299706 1298326 1296565 1294801 1293332 1292192 1291331 1290790 1290801 1291726 1293712 1296357 1298987 1301372
60708 1301372 1303870 1306771 1309858 1312820 1315780 1319157 1323236 1328173 1334124 1340979 1348157 1354995 1361312 1367367
60694 1367367 1373454 1379788 1386576 1393834 1401273 1408679 1416301 1424492 1433061 1441355 1449000 1456235 1463498 1471011
60680 1471011 1478779 1486698 1494659 1502751 1511379 1520912 1531194 1541601 1551578 1561021 1570219 1579721 1590062
60667 1590062 1601270 1612686 1623561 1633793 1643693 1653156 1661544 1668434 1674021 1678677 1682497 1685388 1687192
60654 1687192 1687592 1686314 1683656 1680488 1677541 1674903 1672297 1669427 1665880 1661145 1655109 1648299 1641343 1634360
60640 1634360 1627031 1619019 1610116 1600273 1589804 1579363 1569477 1560211 1551407 1543058 1535313 1528381 1522504
60627 1522504 1517718 1513496 1508993 1503869 1498552 1493547 1488924 1484703 1481197 1478527 1476251 1474003 1472136 1471139
60613 1471139 1470709 1469936 1468227 1465534 1461952 1457765 1453689 1450369 1447620 1444746 1441545 1438317 1435011 1431185
60599 1431185 1427001 1423399 1420891 1418769 1415993 1412423 1408757 1405611 1403078 1400931 1398862 1396643 1394292 1391990
60585 1391990 1389713 1387278 1384908 1383327 1382941 1383187 1383098 1382401 1381722 1381785 1382725 1384144 1385618 1387080 1388839 1391273
60569 1391273 1394570 1398854 1404476 1411774 1420429 1429328 1437307 1443930 1449472 1454446 1459250 1463906 1467846 1470200
60555 1470200 1470622 1469690 1468255 1466621 1464637 1462391 1460381 1459023 1458298 1457911 1457659 1457721 1458729 1461353 1465581 1470619
60539 1470619 1475757 1481144 1487346 1494257 1500921 1506426 1510602 1513800 1516338 1518299 1519591 1520009 1519410 1517949
60525 1517949 1516067 1514273 1512953 1512259 1512002 1511814 1511684 1512175 1513755 1516019 1518036 1519469 1520869 1522793 1525141
60510 1525141 1527587 1530172 1533104 1536353 1539810 1543582 1547770 1552236 1557113 1563375 1572324 1584449 1599202
60497 1599202 1615950 1634778 1656177 1680289 1706609 1734139 1761549 1787374 1810391 1829816 1845036
60486 1845036 1855278 1859768 1858177 1850766 1838088 1820725 1799328 1774804 1748402 1721591 1695677 1671302
60474 1671302 1648326 1626356 1605436 1586062 1568630 1553126 1539393 1527382 1516944 1507683 1499272 1491731
60462 1491731 1485160 1479376 1474145 1469557 1465800 1462653 1459691 1456968 1454969 1453750 1452637 1451045 1449195 1447678
60448 1447678 1446626 1445695 1444628 1443479 1442457 1441849 1441945 1442695 1443604 1444265 1444775 1445280 1445401 1444731 1443785 1443775 1445285
60431 1445285 1447627 1449649 1450715 1450804 1450261 1449736 1449897 1450748 1451541 1451728 1451673 1452006 1452656 1453081 1453283 1453893 1455189 1456625
60413 1456625 1457631 1458461 1459869 1462154 1464886 1467504 1469862 1472078 1474088 1475602 1476527 1477267 1478433 1480251 1482326
60398 1482326 1484010 1484915 1485122 1485073 1485348 1486361 1488062 1489995 1491727 1493241 1494805 1496598 1498563 1500574 1502623
60383 1502623 1504852 1507489 1510646 1514067 1517159 1519467 1521116 1522634 1524349 1526179 1528026 1530130 1532875 1536359
60369 1536359 1540274 1544089 1547248 1549330 1550346 1550902 1551850 1553550 1555576 1557301 1558656 1560102 1561885 1563697
60355 1563697 1565205 1566649 1568598 1571315 1574655 1578486 1582833 1587631 1592690 1598057 1604058 1610849 1618157 1625666
60341 1625666 1633390 1641457 1649704 1657691 1664914 1670805 1674756 1676465 1676153 1674232 1670930 1666550 1661816 1657439
60327 1657439 1653344 1648812 1643539 1638205 1633812 1630769 1628818 1627564 1626760 1626188 1625613 1624961 1624408 1624192 1624252 1624132
60311 1624132 1623436 1622513 1622493 1624390 1628248 1633477 1639884 1647833 1657309 1667389 1677084 1686315 1695570 1704780 1713013
60296 1713013 1719309 1723415 1725622 1726263 1725562 1723778 1721236 1718254 1715123 1712182 1709891 1708822 1709437 1711714 1715027
60281 1715027 1718576 1721957 1725184 1728195 1730569 1731775 1731510 1729693 1726368 1721746 1716232 1710239 1704065 1698013
60267 1698013 1692419 1687420 1682835 1678513 1674640 1671379 1668319 1664754 1660643 1656913 1654592 1653785 1653680 1653344 1652394
60252 1652394 1651117 1650269 1650549 1651941 1653615 1654690 1655022 1655032 1654959 1654708 1654377 1654457 1655387 1657240 1659854 1662915 1665802
60235 1665802 1667850 1669013 1669961 1671347 1673317 1675881 1679222 1683271 1687415 1691094 1694414 1697756 1701141 1704513
60221 1704513 1708236 1712601 1717078 1720837 1723935 1727202 1730973 1734795 1738489 1742581 1747336 1752195 1756689 1761194
60207 1761194 1766156 1771231 1775947 1780684 1786162 1792266 1798234 1803902 1809863 1816303 1822454 1827455 1831250 1834397
60193 1834397 1837430 1840639 1844080 1847478 1850379 1852560 1854172 1855428 1856390 1857060 1857359 1856981 1855657 1853696 1851892
60178 1851892 1850705 1849781 1848433 1846296 1843414 1840032 1836581 1833590 1831345 1829785 1828853 1828677 1829250 1830254 1831438
60163 1831438 1832849 1834419 1835737 1836634 1837670 1839522 1842095 1844763 1847282 1849819 1852185 1853834 1854786 1855851
60149 1855851 1857644 1859918 1862229 1864655 1867330 1869850 1871874 1874037 1877466 1882464 1888369 1894713 1901706 1909400
60135 1909400 1917184 1924569 1931866 1939464 1946928 1953501 1959162 1964399 1969061 1972322 1973927 1974695 1975401 1975828 1975455
60120 1975455 1974572 1974040 1974165 1974492 1974663 1974867 1975348 1976069 1977141 1979105 1982280 1985964 1988723 1989609 1988916 1987699
60104 1987699 1986751 1986140 1985618 1985167 1984980 1985039 1984990 1984569 1983879 1983067 1981908 1980082 1977904 1976398 1976416 1977846 1979884
60087 1979884 1982003 1984424 1987637 1991677 1996045 2000309 2004554 2009142 2014159 2019338 2024451 2029442 2034015 2037433
60073 2037433 2039140 2039514 2039568 2039816 2039757 2038643 2036429 2033704 2030824 2027445 2022975 2017339 2011216 2005550 2000870
60058 2000870 1997096 1993958 1991398 1989391 1987543 1985251 1982354 1979386 1977025 1975457 1974419 1973668 1973256 1973465 1974630
60043 1974630 1976906 1980054 1983631 1987449 1991693 1996442 2001366 2006176 2011141 2016702 2022625 2027976 2032040 2034966
60029 2034966 2037339 2039377 2040790 2041291 2041005 2040326 2039447 2038097 2035804 2032452 2028423 2024032 2019040 2013061 2006416
60014 2006416 2000146 1994981 1990661 1986570 1982759 1979870 1978099 1976699 1974678 1971847 1968980 1967117 1966819 1967988
60000 1967988 1970141 1972751 1975403 1977798 1979806 1981593 1983635 1986359 1989667 1992934 1995694 1998285 2001591 2006041
59986 2006041 2011098 2015893 2020181 2024392 2028815 2033114 2036796 2039816 2042489 2044979 2047145 2048785 2049814 2050261
59972 2050261 2050330 2050397 2050719 2051175 2051497 2051709 2052001 2052261 2052229 2052231 2053328 2056308 2060756 2065451 2069479 2072667 2075180 2077190
59954 2077190 2078962 2080716 2082301 2083386 2084146 2085328 2087275 2089217 2089987 2089343 2088231 2087732 2088120 2088993 2089956 2090881
59938 2090881 2091676 2092086 2091783 2090625 2088897 2087306 2086533 2086663 2087120 2087327 2087319 2087539 2088171 2088934 2089543 2090059 2090740 2091776
59920 2091776 2093287 2095368 2097907 2100544 2103012 2105395 2107923 2110620 2113423 2116473 2119987 2123864 2127768 2131645
59906 2131645 2135858 2140672 2145855 2150886 2155406 2159337 2162798 2166048 2169311 2172467 2175128 2177148 2178903 2180876
59892 2180876 2183184 2185739 2188641 2192060 2195942 2200198 2205089 2210969 2217622 2224362 2230864 2237494 2244639 2252116
59878 2252116 2259588 2267139 2274986 2282735 2289408 2294336 2297835 2300905 2304300 2307808 2310348 2310881 2309341 2306613
59864 2306613 2303570 2300357 2296794 2293182 2290267 2288473 2287558 2287067 2286830 2286915 2287414 2288493 2290508 2293821 2298475
59849 2298475 2304058 2309886 2315413 2320568 2325665 2330857 2335783 2339924 2343235 2346121 2348785 2350931 2352193 2352615
59835 2352615 2352517 2352098 2351293 2349856 2347453 2343893 2339439 2334723 2330242 2326108 2322393 2319436 2317482 2316153 2314606
59820 2314606 2312246 2309154 2305857 2302851 2300327 2298139 2296051 2294011 2292166 2290544 2288967 2287396 2286174 2285611
59806 2285611 2285491 2285278 2284813 2284534 2284937 2286039 2287383 2288414 2288845 2288785 2288508 2288084 2287350 2286366 2285626 2285512 2285695 2285485
59788 2285485 2284802 2284380 2284938 2286490 2288612 2291058 2293844 2296889 2299847 2302347 2304330 2306113 2308083 2310267 2312313
59773 2312313 2313960 2315344 2316706 2318037 2319326 2320959 2323352 2326319 2329299 2332238 2335599 2339451 2343243 2346796
59759 2346796 2350791 2355611 2360272 2363341 2364863 2366546 2369933 2374976 2380647 2386421 2392614 2399484 2406580 2413195
59745 2413195 2419220 2425178 2431375 2437413 2442785 2447719 2452932 2458624 2464173 2469020 2473319 2477432 2481168 2483991
59731 2483991 2485767 2486965 2488164 2489653 2491346 2492863 2493851 2494473 2495349 2496763 2498195 2499000 2499302 2499768 2500697 2501842
59715 2501842 2503041 2504470 2506225 2508061 2509705 2511163 2512664 2514508 2516893 2519640 2522217 2524350 2526443 2529021
59701 2529021 2531955 2534681 2537020 2539208 2541295 2543207 2545344 2548280 2551700 2554425 2555812 2556441 2557106 2557887 2558691
59686 2558691 2559941 2561918 2563904 2564875 2564887 2565062 2566260 2568324 2570588 2572541 2573922 2574678 2575041 2575360 2575731 2575930
59670 2575930 2575714 2575015 2573978 2572988 2572470 2572386 2572103 2571120 2569785 2568994 2569298 2570596 2572475 2574388 2575736 2576413 2577282
59653 2577282 2579448 2582866 2586194 2588365 2589853 2592063 2595724 2600278 2604688 2608474 2611863 2615130 2617971 2619674
59639 2619674 2619946 2619392 2618950 2619006 2619338 2619786 2620537 2621738 2623313 2625320 2628004 2631254 2634393 2636856 2638828 2640824
59623 2640824 2642897 2644720 2646381 2648582 2651817 2655577 2658611 2659977 2659836 2659238 2659205 2660012 2661313 2662747 2664212
59608 2664212 2665684 2667170 2668990 2671747 2675690 2680225 2684364 2687616 2690223 2692595 2694821 2696804 2698658 2700753
59594 2700753 2703386 2706441 2709378 2711650 2713248 2714767 2716822 2719409 2721910 2723688 2724575 2724829 2724795 2724722 2724816 2725314
59578 2725314 2726363 2727823 2729259 2730295 2731006 2731822 2732986 2734166 2734802 2734784 2734711 2735423 2737285 2739876 2742405 2744473
59562 2744473 2746425 2748877 2751953 2755213 2758321 2761484 2765029 2768836 2772496 2775885 2779232 2782623 2785801 2788578
59548 2788578 2791236 2794387 2798541 2803797 2809756 2815804 2821754 2828335 2836754 2847587 2860260 2873673 2887022
59535 2887022 2899820 2911592 2922174 2932186 2942460 2952704 2961165 2966106 2967491 2966999 2966592 2967408 2969785
59522 2969785 2973629 2978465 2983520 2988312 2993135 2998661 3005035 3011561 3017300 3021756 3024935 3026999 3028039 3028029
59508 3028029 3026750 3023817 3019070 3013036 3006803 3001276 2996554 2992161 2987801 2983793 2980692 2978644 2977206 2975825
59494 2975825 2974401 2973350 2973104 2973604 2974358 2975010 2975765 2977107 2979167 2981639 2984434 2988124 2993351 2999838 3006437
59479 3006437 3012391 3018233 3025138 3033618 3043136 3052869 3062366 3071463 3080032 3088086 3095832 3103342 3110376 3116695
59465 3116695 3122365 3127510 3131974 3135602 3138753 3142173 3146339 3151281 3157138 3164526 3174050 3185612 3198539
59452 3198539 3212439 3227694 3244956 3264229 3284584 3304803 3324126 3342170 3358312 3371600 3381535
59441 3381535 3388586 3393504 3396258 3396073 3392478 3385787 3376474 3364691 3350828 3336145 3322224 3309874 3298982
59428 3298982 3289380 3281330 3275043 3270237 3266533 3264096 3263625 3265741 3270572 3277833 3287187 3298587 3312411 3329245
59414 3329245 3349375 3372341 3396872 3421103 3443029 3461271 3475808 3487820 3498287 3506613 3510993 3510453
59402 3510453 3506400 3501813 3498801 3497054 3494605 3489796 3482506 3473935 3465686 3458831 3453093 3446597 3436917 3423032
59388 3423032 3406362 3389609 3374629 3361597 3349909 3339184 3329337 3320334 3312378 3305971 3301407 3298404
59376 3298404 3296601 3296120 3297180 3299304 3301434 3302870 3303680 3304265 3305009 3306469 3309310 3313657 3318768 3323687 3328107
59361 3328107 3332435 3337174 3342483 3348257 3354452 3361280 3369061 3377802 3387140 3397014 3408253 3421913 3437885
59348 3437885 3454739 3471293 3487826 3505305 3523927 3543097 3562506 3582359 3602528 3622213 3640696
59337 3640696 3657851 3673691 3687903 3700101 3710147 3717846 3722671 3724117 3722176 3717303 3710133 3701387 3691729
59324 3691729 3681418 3670383 3658866 3647735 3637775 3628904 3620478 3612192 3604286 3597057 3590706 3585629 3582332
59311 3582332 3580788 3580282 3580167 3580559 3582116 3585297 3590118 3596552 3604845 3615321 3627823 3641395 3654596 3666235
59297 3666235 3675890 3683793 3690307 3695515 3699062 3700229 3698352 3693520 3686864 3679880 3673495 3667944 3663404 3660248
59283 3660248 3658631 3658357 3659413 3662230 3666962 3672819 3678658 3684207 3690286 3697803 3706960 3717556 3729578 3743105
59269 3743105 3757884 3773423 3789517 3806256 3823375 3839831 3854358 3866466 3876724 3885928 3894101 3900344
59257 3900344 3903663 3903856 3901633 3897982 3893471 3888093 3881695 3874452 3866907 3859631 3852995 3847273 3842724 3839431
59243 3839431 3837220 3835924 3835585 3836179 3837330 3838679 3840469 3843286 3847167 3851540 3856223 3861907 3869119 3877152
59229 3877152 3884638 3890955 3896399 3901133 3904734 3906966 3908268 3909085 3909191 3908099 3905741 3902318 3897821 3892230
59215 3892230 3885959 3879654 3873648 3868091 3863437 3860137 3857828 3855481 3852666 3850119 3848723 3848387 3848467 3848924 3850310
59200 3850310 3852663 3855143 3857042 3858663 3860810 3863779 3867297 3871230 3875776 3880930 3886229 3891200 3895786 3900187
59186 3900187 3904588 3909178 3914175 3919564 3925055 3930597 3936756 3944242 3953135 3962884 3972969 3983219 3993575
59173 3993575 4004015 4014765 4026128 4037951 4049681 4061125 4072761 4085045 4097771 4110479 4123123
59162 4123123 4135917 4148720 4161077 4172718 4183584 4193441 4201931 4209046 4215119 4220205 4223840 4225553 4225355
59149 4225355 4223651 4220957 4217780 4214445 4210821 4206435 4201051 4195057 4189201 4184121 4180149 4177244 4174893 4172305
59135 4172305 4169062 4165664 4163242 4162652 4163816 4165895 4168113 4170417 4173323 4177187 4181877 4187257 4193604 4201152
59121 4201152 4209470 4217849 4226262 4235371 4245541 4256425 4267741 4279805 4292862 4306322 4319157 4330879
59109 4330879 4341774 4352437 4363403 4374947 4386810 4398267 4408804 4418547 4427679 4435768 4442203 4447208
59097 4447208 4451813 4456774 4461916 4466561 4470276 4473136 4475620 4478265 4481175 4483874 4485951 4487696 4489693 4491894
59083 4491894 4493650 4494653 4495244 4495609 4495315 4494004 4492064 4490074 4487921 4485010 4481225 4477183 4473507 4470305 4467487
59068 4467487 4465190 4463558 4462345 4461135 4460021 4459694 4460605 4462265 4463738 4464721 4465739 4467252 4469090 4470989 4473144
59053 4473144 4475803 4478754 4481714 4484898 4488579 4492314 4495345 4497722 4500339 4503749 4507575 4511216 4514570 4517870
59039 4517870 4521378 4525472 4530519 4536372 4542450 4548515 4554859 4561533 4568020 4574055 4580217 4587238 4595206 4603880
59025 4603880 4613305 4623578 4634511 4646145 4659196 4674243 4690672 4707097 4722649 4737234 4750779
59014 4750779 4763075 4774382 4785390 4796256 4806176 4814180 4820023 4824219 4827554 4830718 4834033 4837418 4840831
59001 4840831 4844752 4849925 4856629 4864512 4873099 4882123 4891425 4900971 4910993 4921696 4932724 4943246 4952629
58988 4952629 4960772 4967849 4974131 4980002 4985671 4990800 4994810 4997566 4999436 5000791 5002000 5003765 5006710 5010576
58974 5010576 5014584 5018765 5024143 5031382 5040078 5049749 5060656 5072998 5086131 5099418 5113242 5128333
58962 5128333 5144496 5160864 5177047 5193061 5208357 5221917 5233377 5243218 5251770 5258746 5263833 5266978
58950 5266978 5267977 5266483 5262666 5257204 5250507 5242671 5234358 5226859 5220790 5215418 5209845 5204291 5199641 5196262
58936 5196262 5193935 5192519 5191977 5191979 5192237 5193041 5194782 5197080 5199060 5200538 5202243 5204769 5207915 5211277 5214891
58921 5214891 5218981 5223489 5228186 5232953 5237724 5242424 5247209 5252392 5257901 5263092 5267529 5271714 5276741 5283316
58907 5283316 5291429 5300804 5311257 5322644 5334845 5347932 5362146 5377583 5393977 5410800 5427537 5444007
58895 5444007 5460518 5477637 5495635 5514269 5533257 5552769 5573198 5594693 5617240 5641035 5666221
58884 5666221 5692216 5717804 5742111 5765111 5787043 5807742 5826750 5843665 5857953 5868735 5875293
58873 5875293 5877706 5876622 5872516 5865541 5856062 5844860 5832735 5820197 5807646 5795515 5784057 5773210
58861 5773210 5762872 5753202 5744593 5737376 5731631 5727131 5723458 5720266 5717416 5714745 5711862 5708493 5705060 5702510
58847 5702510 5701313 5700872 5700180 5698930 5697726 5697289 5697713 5698517 5699242 5699909 5700945 5702614 5704554 5705989 5706544 5706666
58831 5706666 5707087 5707972 5708846 5709313 5709595 5710353 5712215 5715507 5720211 5725980 5732355 5739143 5746590 5755079 5764734
58816 5764734 5775350 5786563 5797982 5809256 5820209 5830844 5841080 5850611 5859227 5867202 5875079 5883066
58804 5883066 5890965 5898759 5906788 5915056 5922750 5928926 5933554 5937384 5940878 5943897 5946485 5949281 5952708 5956249
58790 5956249 5959150 5961534 5964285 5967920 5972223 5977018 5982651 5989418 5997052 6005162 6013851 6023431 6033688 6043856
58776 6043856 6053315 6061994 6070157 6078127 6086245 6094648 6102886 6110072 6115683 6120081 6124001 6127648 6130672 6133002
58762 6133002 6135316 6138436 6142454 6146774 6151035 6155732 6161771 6169524 6178437 6187558 6196381 6205149 6214393 6224294
58748 6224294 6234551 6244820 6255092 6265526 6276067 6286453 6296589 6306709 6317140 6328110 6339810
58737 6339810 6352393 6365700 6379183 6392289 6404874 6417081 6429002 6440698 6452446 6464650 6477426
58726 6477426 6490498 6503523 6516346 6528890 6541057 6552857 6564436 6575841 6586906 6597618 6608455
58715 6608455 6620104 6632743 6645795 6658506 6670738 6683081 6696167 6709968 6723729 6736468 6747492
58704 6747492 6756567 6763857 6769668 6774084 6776789 6777458 6776343 6774245 6771773 6768851 6765123 6760596 6755674 6750833
58690 6750833 6746562 6743411 6741611 6740689 6739913 6739177 6739064 6739993 6741744 6743985 6746812 6750422 6754570 6758746 6762801
58675 6762801 6767062 6771953 6777747 6784614 6792585 6801436 6810876 6820886 6831725 6843511 6856009 6868958 6882474
58662 6882474 6896906 6912266 6927959 6943171 6957461 6970811 6983157 6994135 7003457 7011389 7018658 7025936
58650 7025936 7033526 7041361 7049022 7055815 7061289 7065824 7070473 7076068 7082582 7089431 7096196 7102941 7110065 7117985
58636 7117985 7126817 7136232 7145777 7155420 7165612 7176671 7188284 7199825 7211035 7222177 7233564 7245142
58624 7245142 7256565 7267549 7278124 7288550 7299016 7309486 7319961 7330813 7342630 7355677 7369665
58613 7369665 7384101 7398691 7413347 7427999 7442535 7456897 7471225 7485943 7501447 7517454 7532761
58602 7532761 7546140 7557462 7567518 7576776 7584949 7592034 7599046 7607131 7616287 7625479 7633825 7641278 7648405
58589 7648405 7655983 7664675 7674641 7685516 7697059 7709581 7723440 7738438 7754237 7771020 7789070 7807833
58577 7807833 7826210 7843819 7861255 7878975 7896587 7913500 7929688 7945472 7961107 7976975 7993745
58566 7993745 8011879 8031243 8051578 8073076 8096125 8120745 8146604 8173360 8200601 8227645 8253798
58555 8253798 8278808 8302775 8325754 8347651 8368273 8387093 8403189 8415927 8425733 8433694 8440336 8445255
58543 8445255 8448153 8449794 8451475 8453730 8455961 8457403 8458026 8458281 8458172 8457054 8454548 8451379 8448923 8447920 8447987
58528 8447987 8448549 8449854 8452682 8457235 8462843 8468891 8475608 8483680 8493353 8504270 8515978 8528257 8540924
58515 8540924 8553784 8566922 8580676 8594984 8608938 8621446 8632400 8642876 8654079 8666331 8679146
58504 8679146 8691976 8704626 8717181 8729839 8742734 8755645 8767999 8779439 8790306 8801233 8812323
58493 8812323 8823080 8833203 8843041 8853112 8863521 8874056 8884631 8895381 8906521 8918299 8930932
58482 8930932 8944467 8958837 8974204 8990955 9009182 9028456 9048435 9069347 9091425 9114011 9135815
58471 9135815 9156030 9174725 9192106 9207985 9222190 9234994 9246781 9257682 9267871 9277854 9288015
58460 9288015 9298168 9308060 9318137 9329290 9341952 9356027 9371598 9388963 9407723 9426539 9444308
58449 9444308 9461169 9477914 9494744 9511122 9526575 9540981 9554206 9566131 9577175 9588157 9599376
58438 9599376 9610300 9620544 9630727 9641869 9654189 9667083 9680250 9694258 9709772 9726726 9744675
58427 9744675 9763734 9784552 9807331 9831322 9855565 9879780 9904157 9928501 9952139 9974657 9996211
58416 9996211 10016926 10036415 10054191 10070270 10085080 10098980 10112140 10124630 10136377 10147327 10157927
58405 10157927 10169080 10181124 10193179 10204168 10214365 10225228 10237700 10251368 10265465 10279973 10295332
58394 10295332 10311600 10328465 10345781 10363664 10382133 10400933 10419665 10437980 10455738 10473062 10490110
58383 10490110 10506822 10523123 10539200 10555245 10571041 10586346 10601646 10617908 10635492 10653947 10672999
58372 10672999 10693032 10714296 10736415 10759082 10782584 10807184 10832637 10858868 10886418 10915485 10945135
58361 10945135 10974321 11003246 11032885 11063493 11094454 11125298 11155914 11185896 11214657 11242245 11269243
58350 11269243 11295806 11321540 11346363 11370681 11394606 11417818 11440495 11463700 11488482 11515021 11542800
58339 11542800 11571128 11599350 11627187 11655193 11684471 11715653 11748463 11782371 11817141 11852589 11888290
58328 11888290 11923925 11959551 11995308 12031044 12066385 12100943 12134459 12167028 12199201 12231471 12263719
58317 12263719 12295545 12327153 12359285 12392225 12425433 12458422 12491519 12525519 12560932 12597762 12635729
58306 12635729 12674519 12714131 12755004 12797482 12841187 12885380 12929955 12975510 13022347 13069960 13117727
58295 13117727 13165529 13213466 13261463 13309504 13357883 13406910 13456634 13507032 13558211 13610297 13663372
58284 13663372 13717600 13773150 13830106 13888711 13949428 14012244 14076231 14140611 14206130 14274455 14346150
58273 14346150 14420204 14495741 14573162 14653182 14735684 14820221 14907020 14996905 15090581 15188384 15290200
58262 15290200 15395364 15503220 15614093 15729061 15848431 15971223 16096554 16224671 16355990
58253 16355990 16489964 16625851 16764141 16906334 17053512 17205820 17363166 17525811 17694290
58244 17694290 17869150 18050734 18239092 18434316 18636952 18847708 19066790 19294154 19530481
58235 19530481 19777307 20036042 20307607 20593065 20893736 21210558 21544317 21896745 22270321
58226 22270321 22666659 23086323 23530747 24003139 24506801 25043808 25616221 26227575 26882345
58217 26882345 27585060 28340971 29156755 30039728 30997392 32038736 33175217 34420050 35788111
58208 35788111 37297689 38971355 40834818 42917659 45257928 47906046 50925019 54391811
58200 54391811 58404593 63092097 68620318 75199971 83098122 92645403 104224066 118225713
58192 118225713 134962787 154513221 176520220 200063907 223766241 246169494 266187834
58185 266187834 283301264 297327743 307972509 314571191 316276374 312531051 303428601
58178 303428601 289705108 272456311 252848459 231975513 210815384 190188144 170704854
58171 170704854 152752131 136524077 122070529 109339287 98214047 88547657 80181760
58164 80181760 72954335 66707457 61298012 56602643 52515090 48944156 45814852 43066334
58156 43066334 40645735 38505243 36604436 34910906 33396415 32034574 30803076 29685139
58148 29685139 28666925 27735515 26880560 26095432 25374650 24711256 24097830 23528497 22998691
58139 22998691 22504322 22042413 21611220 21208363 20829824 20471911 20133145 19813042 19510031
58130 19510031 19221973 18948062 18688908 18445028 18216127 18001442 17799862 17609927 17430433
58121 17430433 17260834 17100605 16948675 16804067 16666691 16536869 16414369 16298447 16188620
58112 16188620 16084900 15987354 15895697 15809238 15727146 15649054 15575387 15506719 15442793 15382710 15326083
58101 15326083 15273364 15224903 15180358 15139182 15101078 15065774 15033012 15002905 14975631 14950627 14926942
58090 14926942 14904640 14884957 14868613 14854829 14842571 14831886 14823221 14816128 14809560 14803124 14797156 14791804
58078 14791804 14786826 14782299 14778912 14777368 14777739 14779370 14781250 14782661 14783686 14785045 14787401 14791014 14795920 14801934
58064 14801934 14808421 14814662 14820681 14827217 14834721 14842924 14851579 14860896 14870892 14881001 14890861 14900919 14911706
58051 14911706 14923038 14934536 14946435 14959144 14972337 14985200 14997492 15009785 15022753 15036694 15051602
58040 15051602 15067216 15083084 15098958 15115034 15131496 15148041 15164176 15179706 15194581 15208580 15221669
58029 15221669 15234448 15247711 15261643 15275872 15290135 15304414 15318610 15332645 15346847 15361694 15377111
58018 15377111 15392468 15407360 15422068 15437197 15453159 15470039 15487631 15505535 15523396 15541111 15558786
58007 15558786 15576652 15595154 15614762 15635412 15656383 15677149 15698127 15720135 15743313 15767116 15791173
57996 15791173 15815513 15839890 15863634 15886433 15908728 15930994 15953037 15974390 15995132 16015925 16037351
57985 16037351 16059512 16082204 16105202 16128339 16151520 16174691 16197695 16220126 16241532 16261904 16281926
57974 16281926 16302534 16324112 16346208 16368101 16389525 16410667 16431701 16452659 16473718 16495150 16516824
57963 16516824 16538194 16559005 16579712 16600902 16622588 16644408 16666250 16688309 16710710 16733424 16756416
57952 16756416 16779474 16802032 16823649 16844693 16866159 16888716 16912256 16936366 16960901 16985944 17011551
57941 17011551 17037731 17064467 17091625 17119003 17146588 17174613 17203266 17232477 17262090 17292099 17322607
57930 17322607 17353626 17385025 17416580 17447997 17478891 17508777 17537156 17563653 17588205 17611043 17632464
57919 17632464 17652739 17672272 17691634 17711204 17730916 17750605 17770497 17791026 17812191 17833497 17854636
57908 17854636 17875957 17898047 17921034 17944465 17967749 17990637 18013385 18036564 18060586 18085257 18109930
57897 18109930 18134182 18158226 18182540 18207324 18232543 18258320 18284934 18312373 18340170 18367846 18395356
57886 18395356 18423023 18451153 18479816 18508873 18538067 18567204 18596371 18625921 18656063 18686484 18716506
57875 18716506 18745599 18773622 18800677 18827044 18853234 18879822 18907013 18934516 18961952 18989267 19016690
57864 19016690 19044524 19073028 19102246 19131767 19160965 19189749 19218772 19248588 19278863 19308933 19338899
57853 19338899 19369557 19401235 19433316 19465063 19496369 19527386 19557930 19587695 19616748 19645391 19673659
57842 19673659 19701344 19728427 19755188 19781858 19808432 19834816 19860998 19887024 19912919 19938671 19964279
57831 19964279 19989874 20015761 20042237 20069341 20096873 20124674 20152708 20180937 20209389 20238387 20268393
57820 20268393 20299537 20331530 20364139 20397369 20430987 20464237 20496446 20527636 20558165 20587916 20616364
57809 20616364 20643399 20669578 20695408 20720785 20745430 20769584 20793867 20818525 20843190 20867524 20891783
57798 20891783 20916510 20941796 20967277 20992890 21019200 21046615 21074544 21101819 21128012 21153970 21180927
57787 21180927 21209316 21238614 21268120 21297618 21327312 21357308 21387411 21417482 21447837 21478943 21510679
57776 21510679 21542356 21573665 21605198 21637591 21670576 21703394 21735858 21768293 21800642 21832408 21863442
57765 21863442 21893969 21923823 21952541 21980410 22008453 22037050 22065428 22093007 22120321 22147923 22175264
57754 22175264 22201634 22227638 22254675 22283189 22312393 22341571 22370799 22400331 22430088 22459887 22489633
57743 22489633 22519156 22548304 22577245 22606381 22636000 22666334 22697665 22729845 22761914 22792813 22822415
57732 22822415 22851364 22880063 22908519 22937139 22966821 22997958 23029832 23061327 23091943 23121996 23152138
57721 23152138 23182772 23213696 23244283 23274254 23304106 23334419 23364940 23394829 23423712 23451950 23479965
57710 23479965 23507888 23535882 23564249 23593069 23622202 23651665 23681511 23711389 23740788 23769659 23798259
57699 23798259 23826485 23854191 23882089 23911350 23942000 23972670 24002407 24031822 24061854 24092222 24121957
57688 24121957 24150900 24179734 24208834 24237944 24266910 24295977 24325318 24354830 24384520 24414682 24445675
57677 24445675 24477861 24511783 24548172 24587798 24631443 24679825 24733256 24791448 24853735 24919015 24985158
57666 24985158 25049006 25107811 25160731 25208403 25251057 25287549 25316219 25336122 25347373 25351030 25349126
57655 25349126 25344378 25339223 25335014 25332331 25331842 25334529 25341024 25351013 25363488 25377545 25392931 25409953 25428966
57642 25428966 25449972 25472549 25496050 25519886 25543772 25567849 25592559 25618266 25644879 25671813 25698445
57631 25698445 25724696 25751105 25778201 25805847 25833405 25860489 25887290 25914040 25940518 25966345 25991515
57620 25991515 26016273 26040678 26064700 26088648 26113045 26138008 26163104 26187888 26212292 26236532 26260992
57609 26260992 26286177 26312320 26338839 26364597 26388914 26412124 26435040 26458216 26481863 26506075 26530814
57598 26530814 26555847 26580882 26605663 26629862 26653207 26675770 26697868 26719546 26740506 26760725 26780782
57587 26780782 26801299 26822301 26843309 26863809 26883490 26902404 26921080 26940140 26959524 26978471 26996542
57576 26996542 27014291 27032571 27051598 27071117 27091014 27111126 27130732 27149037 27166230 27183502 27201820
57565 27201820 27221126 27240762 27260194 27279107 27297205 27314299 27330548 27346467 27362660 27379426 27396458
57554 27396458 27413022 27428673 27443780 27459106 27474925 27490833 27506392 27521632 27536770 27551765 27566381
57543 27566381 27580562 27594468 27608183 27621558 27634451 27647018 27659647 27672606 27685840 27699091 27712017
57532 27712017 27724130 27734929 27744485 27753722 27763689 27774497 27785372 27795732 27805752 27815722 27825518 27835012
57520 27835012 27844502 27854193 27863614 27872159 27879984 27887818 27895960 27904008 27911594 27918858 27926133 27933508 27940850 27947941
57506 27947941 27954509 27960365 27965607 27970520 27975265 27979826 27984204 27988411 27992298 27995617 27998186 27999878 28000556 28000343
57492 28000343 27999882 27999956 28000813 28002008 28002851 28002857 28001908 28000359 27998873 27997817 27996841 27995351 27993285 27991017 27988565 27985408
57476 27985408 27981190 27976171 27970841 27965461 27960160 27955132 27950533 27946376 27942622 27939051 27934977 27929563 27922694 27915251
57462 27915251 27908171 27901454 27894366 27886425 27877859 27869214 27860792 27852477 27843864 27834521 27824319 27813566 27802769
57449 27802769 27792249 27781941 27771379 27759873 27746941 27732788 27718215 27703870 27689702 27675354 27660865
57438 27660865 27646586 27632353 27617198 27600191 27581381 27561627 27541593 27521231 27500221 27478531 27456352
57427 27456352 27433801 27411031 27388420 27366225 27344054 27321058 27296719 27271164 27244643 27217111 27188547
57416 27188547 27159348 27130064 27100873 27071569 27041954 27012005 26981762 26951242 26920399 26889058 26856995
57405 26856995 26824172 26790805 26757143 26723399 26689870 26656711 26623419 26589002 26552990 26515981 26478797
57394 26478797 26441476 26403482 26364581 26324962 26284728 26243802 26202275 26160382 26118223 26075907 26033687
57383 26033687 25991506 25948654 25904529 25859509 25814349 25768903 25722306 25674447 25626276 25578451 25530540
57372 25530540 25481989 25433050 25384208 25335347 25286049 25236294 25186224 25135607 25084088 25031703 24978700
57361 24978700 24925189 24871402 24817897 24764896 24711759 24657728 24602958 24548139 24493256 24437529 24380661
57350 24380661 24323358 24266309 24209265 24151585 24093253 24034802 23976406 23917582 23857888 23797518 23736924
57339 23736924 23676026 23614106 23550541 23485478 23419669 23353764 23287925 23222031 23155964 23089587 23022600
57328 23022600 22954620 22885468 22815380 22744900 22674445 22603903 22532818 22461025 22388888 22316716 22244218
57317 22244218 22170925 22096952 22022829 21948615 21873714 21797751 21721177 21644743 21568617 21492200 21414666
57306 21414666 21335678 21255795 21176151 21097426 21019175 20940515 20861322 20782178 20703216 20623756 20543284
57295 20543284 20462003 20380148 20297548 20214309 20131221 20048761 19966188 19882334 19796898 19710349 19622912
57284 19622912 19534389 19444702 19353892 19261823 19168502 19074508 18980422 18885981 18790536 18694188 18597699
57273 18597699 18501338 18404678 18307546 18210395 18113556 18016903 17920486 17824749 17729826 17635300 17540991
57262 17540991 17447350 17354690 17262679 17171148 17080851 16992784 16907099 16823207 16740655 16659319 16578941
57251 16578941 16499057 16419402 16339974 16260816 16182018 16103818 16026197 15948487 15869775 15789787 15709042
57240 15709042 15628058 15546666 15464187 15380122 15294601 15208266 15121676 15034720 14946650 14856774 14764995
57229 14764995 14671504 14576120 14478235 14377472 14274199 14169447 14064342 13959498 13854738 13749476
57219 13749476 13643481 13537081 13430480 13323221 13214817 13105800 12997542 12890893 12785416
57210 12785416 12680177 12574877 12469940 12365825 12262677 12160567 12059737 11960518 11863195 11767923
57200 11767923 11674671 11583274 11493687 11406142 11320942 11238181 11157750 11079508 11003291 10928906 10856340
57189 10856340 10785870 10717771 10651961 10588197 10526527 10467238 10410361 10355547 10302497 10251256 10202009
57178 10202009 10154928 10110300 10068414 10029087 9991568 9955170 9919764 9885423 9851929 9819014 9786897
57167 9786897 9756208 9727473 9700969 9676815 9654808 9634241 9614322 9594711 9575341 9555972 9536420
57156 9536420 9517171 9499104 9482474 9466487 9449840 9431235 9409490 9383889 9354615 9322319 9287111
57145 9287111 9248506 9206390 9161333 9113785 9063722 9011376 8957521 8902838 8847987 8794554 8744113
57134 8744113 8694776 8639529 8569793 8480658 8371807 8244504 8100286 7943075 7780138 7619035
57124 7619035 7463991 7315863 7174546 7040300 6913484 6794638 6685050 6586439 6499985 6426100
57114 6426100 6364998 6316759 6280657 6254876 6237044 6224961 6217164 6213506 6215480 6225940 6248754 6289187
57102 6289187 6354606 6454483 6599689 6801981 7074007 7429338 7882364 8448136 9141613 9975929
57092 9975929 10960437 12099694 13392875 14832293 16401505 18075122 19820720 21600756
57084 21600756 23374040 25100151 26749674 28315770 29816308 31279197 32715789 34097634
57076 34097634 35351449 36375972 37071090 37363838 37220726 36646146 35673850 34358251 32767302
57067 32767302 30975561 29056858 27078189 25096432 23157641 21297513 19542148 17909072
57059 17909072 16408466 15044356 13815603 12716963 11740310 10876000 10114061 9444847 8858967
57050 8858967 8346855 7898762 7505384 7158431 6850553 6574991 6325708 6097880 5888048
57041 5888048 5693805 5513382 5345363 5188413 5041296 4903428 4775359 4658302 4553124
57032 4553124 4460206 4380308 4314699 4263370 4222846 4186352 4147015 4101603 4051510 3999920 3947428
57021 3947428 3889892 3820318 3733061 3626746 3504173 3370293 3230220 3088048 2946383 2806584
57011 2806584 2669583 2536499 2408480 2286154 2169406 2057597 1949910 1845686 1744734
57002 1744734 1647277 1553503 1463306 1376576 1293485 1214204 1138578 1066476 998422 935446 878210
56991 878210 826572 780114 738768 702654 671485 644451 620749 600041 582283 567203 554090
56980 554090 542067 530448 518813 506936 494789 482482 470000 457148 444023 431402 420281
56969 420281 410978 403017 395932 389808 384975 381656 380139 380818 383671 388055 393315 399226 405465 411087
56955 411087 415157 417627 418944 418920 416679 411688 404223 394797 383782 371770 359691 348290 337828
56942 337828 328487 320679 314754 310847 309198 310275 314357 321276 330614 341708 353361 364199 373626
56929 373626 381950 389215 394406 396225 394207 388614 379685 367645 353155 337097 320097 302749 286091
56916 286091 271162 258081 246151 234884 224450 215133 206941 199832 193791 188547 183648 178976 174828
56903 174828 171435 168763 166868 165995 166222 167347 169184 171591 174255 177022 180538 185947 193803 203736 215278
56888 215278 228211 241799 254557 265465 274861 283476 291119 297006 300932 303225 303858 302546 299663
56875 299663 296194 292708 289113 285538 282748 281510 282226 285400 291795 301837 315409 332519 353492
56862 353492 377992 404329 430335 454700 477135 497529 515333 529521 538762 541904 538765 530411
56850 530411 518364 503741 487427 470789 455632 443466 435170 431365 432725 439847 453136 472933
56838 472933 499593 533216 573105 617218 662090 703828 739829 769642 793888 812344 823298
56827 823298 824706 815680 796921 770179 737602 701472 664157 627930 594555 565059 540111 520605
56815 520605 507603 501757 503241 512280 529046 552485 579694 607126 632331 654259 672449 686628
56803 686628 696678 701916 700439 690206 671094 645211 615064 582307 548474 515747 486022 459745
56791 459745 436488 416347 400086 388209 380702 377559 378859 384234 392782 403504 415342 426865
56779 426865 436565 443707 448433 450763 449805 444241 433442 417924 398880 377459 354476 330726 307443
56766 307443 286148 267721 251697 236845 222535 209315 198080 189012 181525 175029 169375 164593
56754 164593 160490 156680 152902 149118 145326 141492 137856 135117 133862 133652 133074 131097 128252 126017 125050
56739 125050 124463 123040 120739 118603 117427 116998 116694 116383 116398 116869 117441 117700 117635 117622 118145 119509 121531 123444
56721 123444 124464 124741 125390 127206 129613 131378 132213 133000 134466 136386 138284 140201 142225 143845 144476
56706 144476 144397 144570 145585 147179 148615 149170 148470 146873 145379 144684 144412 143800 142933 142623 143127 143805 144237
56689 144237 144868 146066 147210 147314 146206 144477 142592 140667 138997 138108 138130 138604 139094 139637 140390 141119 141410
56672 141410 141320 141480 142397 143776 144764 144927 144765 145072 145962 146857 147389 147887 148745 149706 150155 149950 149568 149511 149920
56653 149920 150773 152065 153642 155174 156480 157734 159189 160795 162241 163245 163688 163597 163225 163101 163766 165340
56637 165340 167427 169458 171057 172087 172557 172615 172604 172980 174066 175833 177861 179619 180907 182042 183493 185305
56621 185305 187071 188475 189689 191060 192584 193916 194817 195349 195667 195788 195573 194877 193829 193063 193381 194815
56605 194815 196283 196717 196419 196707 198150 199864 200752 200768 200480 200053 199313 198439 197858 197643 197622 197930 198821 200030
56587 200030 200953 201446 201877 202412 202864 203279 204030 205140 206115 206662 207018 207396 207619 207554 207408 207316 207201 207266 208066
56568 208066 209718 211603 213347 215589 219205 224216 229999 236114 242262 247820 252329 256310 260788 265978
56554 265978 271094 275487 279236 282592 285527 288123 290719 293310 295232 295873 295384 294503 293967 294207 295121 295864
56538 295864 295343 293330 290787 288718 287062 285174 283007 281177 279941 278785 277199 275378 273872 272874 272108
56523 272108 271260 270289 269343 268599 268138 267897 267678 267281 266670 266022 265589 265479 265550 265559 265404 265180 265060 265179 265646 266492
56503 266492 267558 268557 269318 269910 270467 271015 271558 272233 273250 274664 276270 277678 278527 278742 278642 278662 278941
56486 278941 279298 279577 279825 280044 280084 279967 280058 280707 281891 283391 285048 286540 287287 287121 286895 287762 289787 291898
56468 291898 293353 294621 296398 298371 299620 299952 300147 300859 301861 302559 302849 303194 304046 305396 306850 308079
56452 308079 309205 310700 312801 315152 317230 318984 320759 322588 324003 324710 325106 325840 327006 328129 328882
56437 328882 329541 330636 332341 334305 336026 337346 338581 340133 341938 343314 343622 343120 343013 344335 346800
56422 346800 348995 349845 349679 349711 350678 352315 353983 355308 356127 356361 356261 356471 357481 359208 361356 363899
56406 363899 366814 369670 371980 373779 375328 376421 376663 376421 376772 378243 380213 381846 383104 384492 386245
56391 386245 388158 389907 391220 392052 392923 394694 397665 401191 404465 407301 409808 411843 413368 414895 416840
56376 416840 418720 419701 419840 420035 420851 422100 423577 425470 427858 430439 433011 435709 438624 441604 444598
56361 444598 447650 450456 452473 453707 454881 456565 458604 460618 462577 464611 466731 469078 471982 475445
56347 475445 478979 482283 485568 488868 491605 493387 494779 496617 498937 501249 503529 506143 508952 511381
56333 511381 513439 515900 519226 522967 526491 529749 532966 536059 538841 541501 544469 547898 551608 555434
56319 555434 559413 563616 567975 572179 575720 578171 579665 580992 583016 585994 589565 593291 597024 600772
56305 600772 604499 608207 612062 616228 620648 625190 629996 635420 641561 648083 654699 661534 668701 675709
56291 675709 681834 687070 692216 697903 703988 710196 716821 724235 732013 739203 745501 751658 758567 766401
56277 766401 774895 784128 794568 806329 818758 831035 843112 855860 870143 885897 902294 918800
56265 918800 935821 954248 974601 996807 1020714 1046600 1075197 1107258 1143119 1182643 1225626
56254 1225626 1272208 1322903 1378459 1439931 1508635 1585496 1670356 1762301 1860720 1965585 2076602
56243 2076602 2192585 2311835 2432623 2552984 2670526 2782936 2888296 2984511 3068850 3138636
56233 3138636 3192138 3228480 3247132 3248066 3231972 3199636 3151458 3088404 3013053 2928696 2837507 2740574
56221 2740574 2639641 2537502 2436266 2336409 2238166 2142944 2052475 1967314 1887169 1812262 1743340
56210 1743340 1680467 1622763 1569493 1520740 1476822 1437572 1402387 1370578 1341537 1314950 1291005
56199 1291005 1270017 1251691 1235148 1219884 1206293 1194821 1184950 1175619 1166654 1159091 1153797 1150213
56187 1150213 1146934 1143287 1139864 1137577 1136731 1137039 1137989 1138965 1139480 1139731 1140575 1142589 1145394 1148272 1151100 1154252
56171 1154252 1157866 1161838 1166365 1171832 1178159 1184798 1191381 1197858 1204034 1209731 1215541 1222676 1231671 1241804
56157 1241804 1252185 1262935 1274758 1287805 1301569 1315728 1330567 1346571 1364029 1383113 1404080
56146 1404080 1427330 1453353 1482611 1515503 1552624 1594942 1643241 1697205 1755389 1816333 1879340
56135 1879340 1943963 2009280 2074192 2138168 2201156 2262831 2322372 2378832 2431254 2478515 2519698
56124 2519698 2554880 2585263 2612243 2636374 2657104 2673147 2683004 2685469 2680017 2666843 2646576 2620031
56112 2620031 2588135 2551768 2511465 2467386 2419826 2369870 2319422 2270438 2224142 2181083 2141832
56101 2141832 2107260 2078003 2053965 2034652 2019720 2008851 2001375 1996603 1994488 1995356 1998884 2003939 2009668
56088 2009668 2016301 2024556 2034673 2046314 2058992 2072266 2085814 2099763 2114740 2131278 2149305 2168348
56076 2168348 2187957 2207752 2227489 2247474 2268533 2291090 2314470 2337527 2359823 2381887 2404557
56065 2404557 2428450 2453825 2480496 2507977 2536073 2565148 2595472 2626572 2657722 2688897 2720711
56054 2720711 2753516 2787042 2820958 2855251 2890017 2925264 2961020 2997321 3034063 3071166 3108886
56043 3108886 3147680 3187845 3229557 3273138 3318761 3365927 3413750 3461956 3511281 3562745 3616827
56032 3616827 3673450 3732431 3793666 3857066 3922495 3989779 4058782 4129558 4202439 4277852 4356135
56021 4356135 4437556 4522341 4610492 4701713 4795763 4892846 4993515 5098222 5207074 5319881
56011 5319881 5436444 5556987 5682373 5813498 5950426 6092582 6239987 6393674 6554508
56002 6554508 6722273 6896502 7077654 7266615 7463468 7667670 7879465 8100334 8332041
55993 8332041 8575832 8832460 9102368 9385844 9683672 9997689 10330281 10683418 11058692
55984 11058692 11458076 11883957 12338591 12824306 13344178 13901823 14500662 15144266 15837438
55975 15837438 16586139 17396420 18274496 19228181 20267611 21404727 22653442 24031106 25559430
55966 25559430 27264242 29175947 31331578 33777028 36569159 39779666 43501232 47853781
55958 47853781 52990556 59106791 66450808 75330652 86106669 99159303 114812441 133188658
55950 133188658 154010094 176443997 199151243 220619382 239643060 255628852 268472687
55943 268472687 278096220 284044099 285510435 281784271 272744367 259031409 241835379 222519420
55935 222519420 202324239 182236100 162968449 144990188 128568988 113817460 100734085
55928 100734085 89238079 79201477 70476106 62910058 56355078 50671564 45733509 41430905
55920 41430905 37669287 34369102 31465147 28904132 26640843 24635720 22854339 21266820
55912 21266820 19846663 18570379 17417937 16372682 15420539 14549567 13749898 13013228 12332117
55903 12332117 11699968 11111339 10561761 10047419 9565279 9113038 8688291 8288100 7910001
55894 7910001 7553113 7217449 6902254 6605727 6326223 6062916 5815106 5581574 5360889
55885 5360889 5151913 4953699 4765161 4585132 4412637 4247051 4087960 3934823 3786721
55876 3786721 3642659 3502220 3365727 3233758 3106822 2985599 2870844 2762605 2659939
55867 2659939 2561898 2468478 2380140 2296751 2217671 2142641 2071884 2005368 1942624 1883382 1827772
55856 1827772 1775728 1726603 1679549 1633960 1589548 1546389 1504987 1465896 1429094 1393915 1359648
55845 1359648 1325966 1292870 1260575 1229459 1199746 1171196 1143384 1116305 1090338 1065658 1042109
55834 1042109 1019714 998776 979266 960656 942688 925893 910891 897412 884503 871645 859225
55823 859225 847805 837199 826459 814688 801805 788455 775265 762286 749275 736340 724016
55812 724016 712674 702181 692280 683002 674463 666495 658875 651827 645953 641613 638622 636620 635410 634795
55798 634795 634391 633904 633452 633288 633249 632808 631723 630355 629231 628573 628393 628682 629114 628722 626329 621361 614144
55781 614144 605535 596526 587866 579468 570174 558844 545876 533170 522265 513056 504635 496781 489895
55768 489895 483953 478484 473598 470164 468588 467963 466856 464653 461777 458853 456056 453297 450621 448121
55754 448121 445537 442152 437309 430977 423662 415795 407503 399004 390790 383058 375354 367241 359155 352076
55740 352076 346379 341473 336610 331627 326854 322762 319805 318097 316981 315284 312397 308877 305731 303316
55726 303316 301220 298953 296348 293440 290341 287266 284379 281512 278281 274595 270915 267878 265721 264207
55712 264207 263086 262502 262817 264078 265891 267913 270190 272722 274878 275732 275086 273752 272565 271409 269487
55697 269487 266344 262304 258013 253846 249759 245459 240771 235999 231962 229413 228357 228050 227702 227115 226622
55682 226622 226557 226860 227150 227159 227035 227193 227868 228919 230042 231008 231630 231680 231038 229826 228314 226761 225405 224422
55664 224422 223736 223039 222232 221625 221464 221438 221091 220618 220777 221926 223571 225002 225992 226629 226934 227051 227509 228734
55646 228734 230370 231564 231986 232113 232427 232709 232399 231410 230221 229241 228271 226624 223691 219454 214537 209668
55630 209668 205064 200484 195915 191975 189385 188165 187607 186917 185675 183768 181314 178817 177006 176208 175935
55615 175935 175310 173916 172103 170510 169374 168334 166900 165097 163512 162570 161891 160686 158768 156802 155439
55600 155439 154545 153539 152152 150519 148822 147318 146485 146576 147023 146860 145872 144846 144437 144283 143557 142024 140103
55583 140103 138192 136442 135156 134808 135501 136745 137967 139042 140159 141398 142677 144027 145673 147756 150132
55568 150132 152544 154978 157711 160927 164281 166969 168368 168558 168109 167368 166118 164035 161285 158430 155766
55553 155766 153022 149828 146359 143311 141258 140134 139330 138206 136521 134499 132595 131129 130143 129595 129571
55538 129571 130134 131032 131806 132239 132477 132605 132432 131883 131312 131093 131038 130687 130100 129964 130786 132284 133693 134367
55520 134367 133952 132329 129764 127021 124999 124141 124216 124581 124590 123924 122786 121722 121145 121024 121108 121333 121782 122275
55502 122275 122275 121334 119545 117412 115368 113563 112058 110973 110273 109594 108547 107249 106307 106186 106739 107401 107687
55485 107687 107421 106794 106317 106424 106816 106553 105231 103795 103543 104419 105002 104341 103080 102428 102640 103080 103313 103430
55467 103430 103444 103075 102266 101515 101501 102553 104458 106558 108064 108587 108403 108107 108049 108274 108800 109596 110313 110381 109528
55448 109528 107996 106239 104602 103281 102337 101653 101030 100384 99743 99116 98555 98266 98409 98816 99149 99343 99579
55431 99579 99837 99844 99543 99249 99162 99072 98814 98730 99319 100567 101988 103276 104569 105937 106886 106670 105155 103229
55413 103229 102178 102585 103913 105201 105964 106295 106342 106096 105685 105412 105314 104980 104051 102685 101291 100011 98784
55396 98784 97798 97491 98004 98867 99365 99103 98204 97092 96195 95744 95689 95779 95807 95824 96059 96568 96996 96860 96120 95329
55376 95329 95109 95548 96228 96710 96795 96467 95926 95728 96496 98273 100315 101689 102000 101483 100649 100007 99911 100381 101066
55357 101066 101546 101691 101670 101673 101711 101617 101191 100433 99602 98920 98253 97361 96530 96473 97393 98498 98859 98475 98043 97921
55337 97921 97891 97924 98447 99596 100688 100890 100160 99220 98775 99036 99823 100767 101438 101558 101191 100575 99871 99185 98737
55318 98737 98690 98796 98509 97603 96472 95689 95420 95476 95742 96251 96836 97024 96455 95320 94219 93692 93955 94968
55300 94968 96499 98110 99270 99675 99432 98899 98365 97856 97201 96233 94990 93770 92973 92874 93499 94668 96061
55283 96061 97277 98024 98311 98433 98670 99026 99270 99212 98896 98496 98037 97306 96194 95089 94670 95109 95717 95668 94960
55264 94960 94349 94347 94709 94941 94952 95007 95312 95867 96538 97150 97730 98645 100171 101858 102794 102725 102471 102862 103718 104331
55244 104331 104490 104414 104001 102942 101476 100304 99737 99555 99681 100234 100862 100914 100586 101038 102787 104661 105101 104052
55226 104052 102844 102493 102879 103395 103677 103600 103215 102829 102716 102641 102141 101314 100841 101005 101189 100660 99470 98233
55208 98233 97309 96654 96347 96755 98064 99850 101302 101801 101298 100258 99312 98847 98808 98844 98689 98452 98514 99106 99955
55189 99955 100495 100467 100242 100431 101220 102210 102885 103069 102860 102341 101551 100779 100639 101561 103187 104510 104877 104714 104918
55170 104918 105588 105834 105051 103904 103595 104419 105581 106310 106609 106837 107144 107558 108143 108715 108767 108106 107319 107135
55152 107135 107432 107376 106571 105584 105130 105135 105017 104708 104931 106291 108384 110042 110401 109567 108283 107148 106258 105436
55134 105436 104618 104003 103890 104360 105084 105526 105397 104865 104306 103969 103951 104296 104893 105388 105407 104882 104102 103547 103777
55115 103777 105174 107448 109550 110516 110414 110125 110245 110646 111055 111454 111704 111382 110456 109737 110159 111777 113804
55098 113804 115464 116463 116830 116668 116072 115112 114010 113369 113762 114861 115505 115123 114642 115305 116941 118212 118382
55081 118382 117982 117745 117849 118376 119589 121279 122546 122751 122130 121082 119513 117449 115696 115048 115182 115099 114521
55064 114521 114137 114525 115482 116441 116973 116787 115801 114390 113167 112303 111409 110250 109286 109261 110386 112023 113156
55047 113156 113273 112935 113318 114868 116588 117019 115820 113927 112281 111017 110008 109471 109571 109919 109939 109582 109278
55030 109278 109379 109932 110841 111959 113141 114412 115928 117499 118441 118243 117226 116161 115354 114533 113589 112918
55014 112918 112857 113148 113235 112894 112406 112191 112405 112811 113005 112869 112803 113284 114149 114586 114036 112860 111899 111524 111472 111490
54994 111490 111736 112379 113153 113596 113632 113666 114129 115102 116367 117657 118823 119884 120959 122050 122951 123521 123987
54977 123987 124692 125503 125763 125070 123869 123042 123081 123894 125226 126831 128230 128748 128084 126696 125480 125028 125165
54960 125165 125134 124349 123150 122665 123679 125715 127567 128612 129170 129607 129731 129317 128679 128241 127864 127097 125891
54943 125891 124650 123678 123048 122924 123569 124919 126467 127660 128176 127892 126902 125657 124764 124523 124836 125627 127066
54926 127066 129238 131814 134258 136247 137784 139084 140525 142582 145516 149089 152755 156197 159626 163429
54912 163429 167574 171466 174477 176534 178007 179054 179279 178172 175714 172385 168691 164907 161136 157370
54898 157370 153495 149507 145731 142584 140111 137998 136149 134943 134694 135059 135264 134883 134176 133659 133563 133832
54882 133832 134467 135644 137432 139592 141821 144139 146857 150164 153900 157767 161522 164914 167684 169894
54868 169894 172027 174454 176878 178552 179049 178535 177354 175611 173257 170273 166729 162842 159076 155943 153524
54853 153524 151343 148848 145922 142867 140037 137549 135264 132941 130508 128205 126365 125025 123947 123034
54839 123034 122565 122878 123933 125241 126183 126401 126055 125699 125733 125961 125854 125277 124704 124634 125058 125600 125959 126000 125636
54820 125636 124905 124118 123718 123969 124807 125922 126926 127583 127987 128404 128885 129188 129202 129258 129858 131129 132637 133628
54802 133628 133435 131901 129551 127195 125233 123566 122265 121860 122613 123811 124346 123958 123460 123711 124716 125842
54786 125842 126490 126475 126072 125928 126653 128208 129837 130783 131015 131151 131808 133168 135051 137161 139275 141329 143361
54769 143361 145271 146767 147722 148597 150236 153135 157009 161240 165574 170189 175105 179808 183664 186541 188834
54754 188834 190882 192461 192890 191617 188777 185223 181931 179233 176680 173617 169786 165405 160959 157067
54740 157067 154182 152021 149575 146216 142673 140336 139591 139460 139017 138438 138310 138553 138716 138986 140171 142687
54724 142687 146068 149504 152514 155049 157295 159523 161961 164725 167834 171202 174509 177333 179567 181488
54710 181488 183226 184358 184333 183061 180832 177865 174297 170429 166559 162734 159045 156004 154113 153131 152210
54695 152210 150741 148686 146201 143488 141030 139388 138561 137994 137307 136641 136169 135801 135540 135679 136347 137216 137866
54678 137866 138108 137822 136896 135591 134527 133981 133474 132341 130443 128164 126107 125014 125470 127274 129455 131305
54662 131305 133006 134814 136180 136355 135555 134751 134451 134431 134556 134960 135330 134965 133947 133459 134276 135483 135442 133800
54644 133800 131834 130899 131162 131910 132512 132771 132763 132722 132909 133290 133447 133065 132437 132197 132580 133191 133548 133574 133488 133494 133736
54623 133736 134334 135201 136002 136498 136821 137132 137231 136782 135836 134775 133827 133055 132711 133059 133763 134065 133864 134028 135233
54604 135233 136912 137880 137731 137082 136639 136620 137057 138029 139343 140385 140629 140197 139799 140131 141227 142270 142193 140693
54586 140693 138576 136849 135690 134680 133816 133601 134070 134422 133986 133072 132417 132218 132182 132230 132546 133017 133229 133073
54568 133073 132918 133047 133322 133528 133643 133561 132975 131888 130933 130762 131293 131930 132417 133018 133906 134842 135539 135895 135756
54549 135756 134901 133527 132355 131873 131775 131502 131077 130964 131302 131806 132368 133239 134514 135887 137026 137854 138381
54532 138381 138580 138501 138211 137650 136883 136506 137245 139041 141026 142533 143604 144362 144641 144659 145270 146831 148336
54515 148336 148458 147177 145579 144386 143528 142961 142864 142904 142270 140830 139467 138869 138662 138208 137619 137370 137390 137223
54497 137223 136827 136581 136647 136878 137277 138007 138950 139784 140511 141421 142409 142824 142292 141330 140753 140675 140524 139965 139372
54478 139372 139213 139350 139338 139273 139824 141309 143122 144428 145129 145753 146545 147184 147410 147441 147601 147982 148652 149748
54460 149748 151043 151812 151604 150881 150500 150755 151333 152000 152694 153069 152645 151603 150906 151257 152323 153216 153439 153068
54442 153068 152333 151416 150523 149803 149241 148811 148576 148416 147874 146643 145124 144169 144251 145093 146062 146668 146814 146942
54424 146942 147838 149832 152148 153489 153416 152756 152475 152655 152831 152841 152794 152481 151439 149601 147551 146133 146046 147608
54406 147608 150423 153324 155134 155605 155335 154843 154133 153201 152409 152175 152619 153708 155373 157248 158644 159117
54390 159117 158925 158741 159050 159909 161016 161934 162517 163225 164636 166473 167605 167298 166058 164858 164014 163349 163005
54373 163005 163307 163960 164164 163626 162838 162205 161500 160449 159350 158692 158493 158405 158319 158479 159012 159591 159690 159144 158435
54354 158435 158375 159384 161131 162933 164395 165477 166103 166123 165726 165542 166038 166952 167510 167187 166197 165260 164893 164867
54336 164867 164426 163131 161434 160237 159942 160140 160212 159976 159634 159324 158907 158140 157023 155993 155747 156690 158511
54319 158511 160360 161511 161876 161943 162259 162895 163386 163295 162795 162460 162460 162367 161954 161749 162375 163651 164853 165623 166107
54300 166107 166420 166683 167525 169784 173448 177476 180969 184059 187396 191152 194898 198132 200625 202407 203670
54285 203670 204559 204996 204883 204453 204063 203569 202343 200083 197258 194578 192350 190482 188739 186799 184431 181813
54269 181813 179357 177143 174983 173159 172444 172967 173646 173310 172009 170692 169906 169513 169455 169993 171058 171930 171922
54252 171922 171165 170499 170624 171423 172134 172214 171933 171917 172264 172506 172358 171940 171172 169678 167597 165840 165089 165091 165413
54233 165413 166195 167441 168228 167637 166156 165112 164846 164456 163397 162293 161846 161812 161534 160830 159913 158968 158241
54216 158241 158167 158913 160063 161097 161933 162756 163521 163978 164000 163685 163227 162819 162568 162364 162012 161573 161362 161542 161944
54197 161944 162383 162879 163428 163817 163864 163625 163187 162428 161239 159856 158731 158063 157607 157001 156247 155841 156397 158098
54179 158098 160562 163210 165563 167139 167397 166192 164216 162639 162285 163244 165121 167305 169061 169807 169499
54164 169499 168609 167668 166919 166349 165815 165195 164573 164256 164401 164780 165060 165169 165207 165258 165530 166386 167785 169021 169532
54145 169532 169750 170528 171858 172819 172799 172182 171754 171938 172621 173245 173092 172023 170881 170553 170776 170609 169993 169826
54127 169826 170396 170785 170281 169397 169018 169343 170240 171784 173762 175348 176061 176409 176879 177008 176342 175687 176271 177935
54109 177935 179251 179378 178878 178683 179081 179763 180170 179720 178347 176839 176025 175666 174857 173460 172326 171927 171664
54092 171664 170922 170070 169894 170475 171221 171718 172117 172774 173831 175132 176378 177394 178277 179159 179890 180132 179767
54075 179767 179028 178308 178040 178657 180348 182809 185429 187615 188818 188632 187334 186049 185774 186260 186453 185952
54059 185952 185338 185129 185229 185587 186527 188007 189258 189685 189597 189523 189420 189226 189722 191906 195634 199630 202943
54042 202943 205746 208589 211445 213845 215607 217130 219099 222030 225971 230502 235157 239899 244976 250287
54028 250287 255146 258899 261644 264050 266529 268945 271157 273447 275993 278161 278827 277561 275103 272494
54014 272494 270144 267974 266099 264758 263789 262687 261170 259236 256677 253126 248765 244489 241108 238665
54000 238665 236685 234744 232590 230146 227694 225741 224415 223258 221874 220407 219070 217611 215792 214112
53986 214112 213379 213578 213718 212952 211427 209889 208846 208294 208029 207961 208229 209020 210173 211021 210918 209958 208879
53969 208879 208160 207589 206872 206322 206527 207484 208483 208909 208839 208746 208874 209141 209526 210277 211692 213835 216534 219456
53951 219456 222132 224113 225378 226467 227977 229883 231680 233247 235244 238435 242868 248029 253624 259839
53937 259839 266816 274284 281854 289472 297457 306261 316277 327663 340150 353098 365887 378249 390125
53924 390125 401252 411014 418626 423430 425167 424177 421273 417193 412129 405923 398732 391336 384765 379773
53910 379773 376689 375428 375407 375614 375178 373965 372525 371400 370607 369718 368273 366099 363448 360834 358533 356161
53894 356161 352947 348573 343542 338609 334041 329578 324959 320210 315484 310853 306282 301684 297040 292580
53880 292580 288664 285368 282311 279178 276218 273889 272026 269842 266821 263272 259755 256326 252698 248958
53866 248958 245735 243582 242431 241754 241116 240421 239658 238593 236941 234820 232843 231573 231019 230815 230660 230350
53850 230350 229612 228394 227282 227073 227731 228257 227894 227026 226453 226183 225584 224557 223820 223868 224242 224181 223623 223164
53832 223164 223249 223747 224264 224513 224452 224371 224866 226378 228585 230458 231104 230431 228927 227078 225273 224035 223834
53815 223834 224620 225932 227521 229487 231592 232988 233169 233024 234299 237855 242771 247308 250510 252699 254720
53800 254720 257055 259638 262266 264954 267845 270880 273716 276093 278140 280204 282432 284646 286592 288177
53786 288177 289513 290832 292246 293471 293953 293502 292625 291943 291431 290530 288952 286944 284836 282699 280529 278336
53770 278336 276000 273434 270973 269147 267962 266844 265488 264311 263789 263872 264390 265528 267361 269291 270621
53755 270621 271574 273230 276469 281510 288487 297892 310093 324586 339889 354168 366075 375244 382128
53742 382128 387270 390727 392095 390869 386681 379502 369872 358803 347215 335575 324229 313760 304735
53729 304735 297301 291376 286956 283878 281533 279351 277513 276662 276927 277677 278237 278361 278037 277363 276775 276887
53713 276887 277830 279089 280178 281116 282074 282969 283703 284519 285817 287762 290262 293095 295842 297948 299157 299824
53697 299824 300663 302289 305022 308775 312935 316623 319391 321543 323592 325597 327245 328376 329062 329284 328900
53682 328900 327946 326698 325439 324369 323713 323618 323847 323779 322913 321344 319632 318244 317180 316152 315070 314194
53666 314194 313773 313666 313534 313343 313390 313757 314052 313903 313475 313211 313209 313216 313153 313221 313444 313508 313341 313523 314662 316484 318044
53645 318044 318950 319909 321759 324326 326721 328595 330527 333186 336711 341184 347039 354441 362511 369788 375520
53630 375520 380172 384673 389500 394421 398766 401891 403660 404518 404928 404868 404172 403132 402259 401521 400406 398851
53614 398851 397570 397260 397922 399199 400953 403200 405784 408421 410855 412878 414474 416062 418184 420805 423329
53599 423329 425465 427555 429839 431964 433624 435020 436163 436338 435080 433305 432573 433327 434585 435247 434967
53584 434967 433849 432172 430551 429586 429049 427998 425940 423358 420803 418116 414896 411304 407953 405330 403663
53569 403663 403056 403340 403987 404403 404218 403279 401760 400446 400340 401591 403154 403905 403789 403511 403479 403619 403937 404578
53551 404578 405370 405914 406259 407010 408624 410977 413765 416912 420406 424043 427665 431471 435834 440862 446304
53536 446304 451882 457611 463743 470426 477443 484456 491583 499545 509032 519968 531625 543392 555155
53523 555155 567022 579071 591519 604798 619237 634819 651400 668935 687280 706037 724920
53512 724920 744178 764325 785430 807006 828695 850862 874302 899380 925539 951671 976962
53501 976962 1001470 1025879 1050692 1075724 1100420 1124529 1148267 1171827 1194970 1217240 1238441
53490 1238441 1258746 1278312 1296911 1314030 1329359 1343179 1356222 1369119 1382038 1394893 1407691
53479 1407691 1420411 1432629 1443646 1453202 1461750 1469715 1476605 1481249 1482922 1482037 1479629 1476375 1472159
53466 1472159 1466363 1458480 1448605 1437436 1425711 1413601 1400729 1386790 1371924 1356493 1340725 1324717
53454 1324717 1308471 1291706 1273918 1255019 1235805 1217370 1200072 1183353 1166689 1150366 1135212
53443 1135212 1121787 1109973 1099160 1088670 1078217 1068241 1059753 1053635 1049993 1048132 1047131 1046430 1046087
53430 1046087 1046600 1048413 1051487 1055434 1060122 1065991 1073617 1083068 1093935 1105944 1119296 1134327 1151040
53417 1151040 1169082 1188013 1207449 1227104 1247000 1267678 1289969 1314367 1340718 1368653 1398227
53406 1398227 1429908 1463944 1499977 1537430 1576129 1616384 1658556 1702685 1748491 1795591 1843721
53395 1843721 1892824 1942884 1993551 2044120 2094127 2143849 2193882 2244223 2294145 2343024 2390816
53384 2390816 2437438 2482118 2523872 2562457 2598368 2631870 2662461 2689373 2712269 2731254 2746474
53373 2746474 2757895 2765281 2768229 2766297 2759274 2747236 2730271 2708349 2681642 2650796 2616586 2579294
53361 2579294 2538682 2494674 2447900 2399410 2350010 2300078 2249971 2200324 2151780 2104522 2058296
53350 2058296 2012884 1968401 1925061 1882790 1841285 1800415 1760435 1721688 1684190 1647658 1612067
53339 1612067 1578082 1546711 1518325 1492174 1467115 1442842 1420100 1399625 1381257 1364325 1348543
53328 1348543 1334010 1320445 1306940 1292642 1277421 1261849 1246825 1233191 1221237 1210367 1199662
53317 1199662 1189047 1179550 1172062 1166212 1160892 1155634 1150910 1147209 1144490 1142687 1142173 1143410 1146477 1151238
53303 1151238 1157729 1166051 1176036 1187283 1199539 1212937 1227900 1244827 1263692 1283882 1304664 1325874
53291 1325874 1347898 1370835 1394065 1416932 1439490 1462054 1484192 1504748 1522944 1538918 1552999
53280 1552999 1564995 1574578 1581970 1587699 1591758 1593449 1592094 1587506 1579818 1569332 1556729 1542945 1528307
53267 1528307 1512029 1493107 1471723 1449235 1426639 1403532 1378932 1352720 1325769 1298844 1271991
53256 1271991 1245024 1218043 1191275 1164813 1138798 1113478 1088802 1064234 1039395 1014662 990729
53245 990729 967707 945050 922314 899567 877076 855100 834102 814678 796914 780119 763547
53234 763547 747318 732281 718929 706738 694692 682462 670849 660949 652874 645480 637438 628334
53222 628334 618486 607980 596413 583681 570530 558016 546613 536044 525754 515343 504772 494440
53210 494440 484968 476611 468932 461192 453047 444687 436467 428569 420983 413586 406274 399191 392748 387192
53196 387192 382180 376965 371100 364839 358808 353392 348460 343606 338622 333714 329171 324882 320408 315617
53182 315617 311013 307248 304468 302344 300535 298856 297169 295501 294180 293491 293180 292683 291895 291323 291289 291382
53166 291382 290996 290195 289678 289902 290511 290731 290241 289511 289270 289654 290032 289702 288651 287510 286981 287432 288827 290637
53148 290637 291903 291931 291017 290195 290165 290819 291866 293312 294995 296152 296088 295101 294180 293880 293990 294268 294878 295823
53130 295823 296461 296032 294524 292670 291144 290066 289291 288836 288825 289110 289174 288488 286956 284974 283071 281534 280398
53113 280398 279685 279475 279629 279610 278864 277480 276219 275695 275604 275045 273565 271632 270072 269351 269455 270022 270342 269642
53095 269642 267872 266028 265188 265272 265218 264331 262935 261606 260342 258843 257147 255562 254213 253077 252317 252179
53079 252179 252573 253053 253249 253134 252862 252474 251818 250724 249339 248287 248263 249279 250470 250831 250084 248737 247514
53062 247514 246889 246959 247456 247885 247872 247462 247061 247152 248021 249515 251059 252181 253085 254365 256038 257314 257606 257291
53044 257291 257082 257086 257094 257388 258456 259999 261047 261178 260970 261051 261321 261401 261284 261148 260906 260356 259541 258666 257808 257007
53024 257007 256409 256134 256123 256258 256467 256641 256731 256976 257655 258456 258524 257429 255785 254616 254422 255153 256696 258831
53006 258831 260925 262259 262721 262745 262588 262076 261166 260305 260014 260294 260670 260719 260445 260183 260229 260548 260851 260881 260581
52987 260581 259990 259230 258657 258744 259584 260684 261482 261959 262472 263137 263682 263900 263901 263891 263931 264012 264150 264354 264655 265187
52967 265187 266103 267387 268842 270335 271905 273657 275600 277566 279250 280450 281352 282372 283519 284153 283698
52952 283698 282442 281235 280469 279817 279013 278307 277891 277385 276345 275014 274051 273572 272954 271741 270362 269612 269592
52935 269592 269547 268846 267809 267263 267393 267416 266501 264769 263151 262438 262686 263353 263747 263458 262675 262114 262380 263357
52917 263357 264379 264926 264969 264738 264491 264485 264746 264847 264271 263085 261870 260867 259657 257947 256204 255148 254852
52900 254852 254817 254751 254848 255330 256030 256488 256295 255461 254614 254610 255650 256960 257611 257559 257473 257770 258322 259068 260223 261652
52880 261652 262553 262200 260774 259137 257958 257336 257081 256989 256841 256500 256057 255736 255664 255900 256649 258135 260133 261886
52862 261886 262771 263020 263531 264869 266640 267961 268457 268537 268713 268910 268631 267621 266081 264311 262466 260711
52846 260711 259286 258189 256991 255251 253062 250974 249426 248427 247780 247308 246760 245788 244301 242784 242001 242313
52830 242313 243343 244306 244583 244009 242813 241388 240100 239204 238857 239052 239458 239471 238715 237499 236547 236138 235771
52813 235771 234875 233638 232837 232939 233750 234943 236525 238605 240976 243202 245048 246585 247965 249229 250249
52798 250249 250714 250301 249037 247408 245874 244370 242570 240589 239021 238154 237516 236504 235229 234333 234063 233976
52782 233976 233676 233413 233675 234387 234947 235018 234943 235244 235962 236672 237007 236967 236801 236808 237255 238270 239641 240781 241037
52763 241037 240191 238728 237545 237234 237632 238184 238690 239445 240545 241419 241381 240468 239385 238710 238502 238610 238943 239354
52745 239354 239630 239747 239902 240183 240486 240780 241109 241266 240886 240037 239337 239268 239854 241249 243996 248085 252212 254835
52727 254835 255893 256731 258292 260062 260979 260756 259899 258922 257898 256598 254707 252092 249129 246609 245113
52712 245113 244541 244388 244345 244458 244849 245481 246132 246538 246641 246758 247319 248402 249670 250767 251564 251915 251529 250305
52694 250305 248586 246851 245338 244192 243776 244427 245901 247404 248310 248719 249186 249945 250568 250459 249678 249140 249843
52677 249843 251937 254625 256867 257993 257869 256953 256295 256978 259250 262366 265460 268276 270821 272763 273638
52662 273638 273487 272806 271917 270812 269628 268851 268885 269635 270653 271558 272238 272773 273248 273602 273701 273543 273300 273038
52644 273038 272617 271981 271364 270956 270582 269962 269170 268540 268259 268371 269004 270126 271201 271669 271851 272823 275130 278068
52626 278068 280513 282143 283492 285076 286841 288342 289154 289120 288377 287147 285448 283134 280312 277583 275695
52611 275695 274974 275118 275443 275330 274632 273713 272914 272051 270733 269171 268207 268350 269219 270227 271284 272421 273208
52594 273208 273290 273219 273971 275609 277198 278135 278817 279671 280357 280537 280868 282348 284827 286964 287782 287679 287680 288205
52576 288205 288933 289491 289821 289966 289924 289752 289623 289685 289987 290470 290895 290864 290117 288850 287592 286707 286174 285836 285638
52557 285638 285502 285164 284292 282746 280716 278803 277897 278602 280505 282325 283098 283096 283307 284244 285660 287250 289023
52540 289023 290899 292431 293190 293119 292374 291182 290002 289409 289509 289736 289563 289146 289009 289367 290086 291061 292156
52523 292156 292971 293144 292841 292518 292251 291739 290916 290079 289296 288294 287141 286619 287541 289937 293104 296188 298457
52506 298457 299452 299407 299366 300361 302348 304280 305204 304997 304048 302716 301278 300037 299082 298128 296840 295286 293871
52489 293871 292929 292602 292940 293750 294408 294274 293436 292689 292616 293049 293678 294678 296222 297693 298169 297667 297175 297216
52471 297216 297130 296237 295149 295209 296901 299450 301896 303977 305883 307704 309370 310829 312118 313397 314886
52456 314886 316473 317474 317227 315969 314692 314018 313680 313201 312536 311726 310485 308690 306923 305903 305467 304653
52440 304653 302833 300342 297993 296326 295454 295284 295685 296515 297569 298493 298948 299014 299196 299752 300219 300072 299635
52423 299635 299788 300741 301692 301906 301565 301263 301253 301594 302609 304558 307107 309750 312656 316528 321592 327303
52407 327303 333234 339714 347235 355599 364003 371744 378426 383645 386964 388352 388317 387424 385779 383129 379338
52392 379338 374587 369199 363506 357963 353214 349816 347820 346713 345845 344938 344196 343940 344190 344597 344805 344869
52376 344869 345316 346783 349587 353557 358137 362587 366308 369208 371733 374327 376965 379398 381840 384893
52362 384893 388637 392191 394583 395875 397013 398706 400832 402853 404322 404949 404734 404291 404606 406119 408356
52347 408356 410725 413337 416601 420327 423808 426797 429839 433513 437752 442158 446659 451572 457206 463706
52333 463706 471217 479916 489817 500633 511875 523139 534439 546310 559453 574127 589905 606098
52321 606098 622376 638895 655954 673665 691940 710610 729476 748281 766686 784305 800817
52310 800817 816132 830516 844530 858743 873369 888091 902310 915697 928499 941200 953861
52299 953861 965937 976747 985930 993368 998918 1002518 1004449 1005193 1004979 1003656 1001050 997151 991953 985419
52285 985419 977911 970360 963624 957748 952205 946836 942157 938716 936621 935916 936922 939751 943816 948447
52271 948447 953851 960896 969907 980278 991371 1003160 1015731 1028755 1041914 1055379 1069274 1083023
52259 1083023 1095840 1107659 1118999 1130081 1140780 1151276 1161933 1172371 1181485 1188713 1194641 1199907
52247 1199907 1204088 1206213 1205912 1203478 1199116 1192828 1184951 1176180 1166965 1157328 1147260 1136927 1126398
52234 1126398 1115568 1104484 1093482 1082902 1072898 1063620 1055309 1048073 1041720 1035979 1030772 1026175 1022206
52221 1022206 1018730 1015517 1012336 1009095 1005975 1003449 1002115 1002346 1003936 1006164 1008461 1011034 1014522 1018991
52207 1018991 1023671 1027943 1032129 1036873 1042013 1046653 1050263 1053189 1056033 1059020 1062061 1065026 1067757 1070132
52193 1070132 1072310 1074673 1077459 1080614 1083975 1087243 1089833 1091225 1091636 1091900 1092481 1092935 1092532 1090956 1088210
52178 1088210 1084320 1079607 1074918 1070943 1067407 1063381 1058397 1052916 1047711 1043139 1039130 1035580 1032610 1030528
52164 1030528 1029590 1029733 1030612 1031975 1033897 1036482 1039471 1042396 1045087 1047813 1050876 1054228 1057518 1060416 1062861
52149 1062861 1065081 1067279 1069265 1070494 1070622 1069979 1069273 1068956 1069034 1069371 1069912 1070622 1071493 1072656 1074289 1076345
52133 1076345 1078618 1081169 1084518 1089244 1095515 1103161 1112109 1122584 1134920 1149356 1166051 1185099 1206316
52120 1206316 1229137 1252955 1277663 1303612 1330852 1358611 1385816 1412043 1437543 1462336 1485691
52109 1485691 1506755 1525368 1541924 1556594 1569011 1578733 1585793 1590795 1594551 1597545 1599638 1600366 1599598
52096 1599598 1597784 1595516 1593039 1590242 1586811 1582161 1575575 1566814 1556465 1545414 1534162 1522900 1511916
52083 1511916 1501375 1490949 1480317 1470052 1461376 1454874 1450028 1446240 1443801 1443490 1445648 1450007 1456155
52070 1456155 1463803 1472798 1483211 1495196 1508445 1522025 1535107 1547721 1560410 1573247 1585607 1596859
52058 1596859 1606878 1615783 1623577 1630212 1635734 1640149 1643212 1644570 1644038 1641696 1637755 1632407 1625715 1617556
52044 1617556 1607670 1595809 1581916 1566283 1549576 1532568 1515669 1498743 1481497 1463990 1446616
52033 1446616 1429687 1413327 1397784 1383482 1370505 1358268 1345930 1333131 1320114 1307255 1294754
52022 1294754 1282707 1271090 1259548 1247505 1234807 1222062 1210110 1199171 1188724 1178205 1167524
52011 1167524 1156886 1146332 1135645 1124604 1113245 1101929 1091114 1080838 1070354 1058525 1044824
52000 1044824 1029878 1014803 1000023 984920 968730 951651 934901 919651 905957 892868 879611
51989 879611 866519 854623 844487 835761 827759 820045 812337 804307 795849 787287 778908 770411 761160
51976 761160 750889 739901 728660 717518 706761 696506 686577 676850 667773 660193 654566 650636 647955
51963 647955 646385 645963 646647 648426 651409 655480 660032 664317 667989 671138 673794 675533 675546 673142 668386
51948 668386 662289 656179 650718 645667 640616 635724 631594 628638 626848 626094 626466 628287 631839 636970 642972
51933 642972 648999 654631 659810 664207 667025 667614 666004 662572 657456 650630 642318 632950 622813 612152
51919 612152 601425 590938 580216 568378 555451 542886 532302 523893 516481 509099 502097 496526
51907 496526 492789 490258 488155 486517 486161 487816 491491 496664 502957 510511 519611 529827 539636 547169
51893 547169 551628 553797 554918 555199 553822 550323 545321 539633 533204 525506 516828 508541 501966 497402
51879 497402 494462 493035 493491 496026 500183 505251 510976 517631 525379 533765 542034 549692 556558 562333
51865 562333 566469 568590 568821 567599 565279 561998 557789 552730 547087 541301 535787 530835 526878 524652
51851 524652 524674 526568 529351 532416 535830 539611 543362 546902 550688 555110 559692 563457 565822 566799 566725
51836 566725 566292 566386 567164 567414 565555 561273 555674 549975 544699 540053 536197 532855 529335 525286 520948
51821 520948 516463 511529 506078 500699 495871 491255 486318 481342 477289 474781 473690 473517 473752 473974 474080
51806 474080 474360 474981 475453 475080 473903 472695 471931 471275 470203 468621 466577 463867 460476 457143 454799 453413
51790 453413 451952 449654 446848 444256 441985 439722 437646 436372 435992 435826 435385 435037 435315 435992 436366 436244
51774 436244 436117 436420 437088 437858 438655 439681 441436 444580 449367 455183 461037 466564 472188 478262 484511
51759 484511 490447 495904 500821 504854 507452 508182 506829 503475 498673 493242 487620 481636 475094 468362
51745 468362 462094 456674 452192 448733 446326 444809 444148 444809 447402 451883 457422 463112 468619 474061 479495
51730 479495 484679 489302 493317 496958 500307 502910 503975 503018 500225 496290 492142 488716 486440 484681
51716 484681 482115 478100 473526 469943 467972 466850 465437 463323 461048 459546 459419 460550 462432 464884
51702 464884 468207 472441 476853 480590 483653 486739 490173 493480 496024 497668 498744 499756 501185 503204
51688 503204 505472 507442 508894 509836 509890 508268 504557 499202 493100 487067 481824 477963 475461 473511 471319
51673 471319 469045 467686 468043 470057 473053 476364 479682 483010 486379 489618 492458 494810 496771 498271
51659 498271 499007 498917 498481 498178 497828 496921 495693 495449 497480 501851 507384 512718 517169 520744 523688 526084
51643 526084 527667 527852 526047 522053 516113 508583 499783 490249 480832 472210 464402 457005 449885 443273
51629 443273 437265 431672 426519 422284 419343 417457 416102 415059 414329 413667 412620 411001 409035 407119 405680
51614 405680 405128 405537 406397 407026 407274 407504 407831 407795 406974 405721 405054 405844 408135 411156 414033 416578 419330
51597 419330 422793 426862 431249 436107 441739 447829 453541 458436 462810 467112 471471 475817 479863 482861
51583 482861 484053 483727 483353 484341 487090 491498 497694 505723 515066 525259 536823 550929 568230 588422
51569 588422 610648 633723 656263 677509 698206 720123 744525 771497 800659 831899 865292
51558 865292 900957 939271 980589 1024284 1068404 1110757 1150139 1186200 1218325 1244983 1264061
51547 1264061 1273593 1272428 1260659 1239481 1210460 1174893 1133939 1089072 1042065 994531 947723 902695
51535 902695 860271 820716 783751 749183 717478 689507 665634 645208 627072 610505 595567
51524 595567 582587 571572 562207 554172 547173 540711 534130 527011 519434 511840 504758 498595 493421 488830
51510 488830 484225 479405 474782 470891 467712 464617 460947 456632 452269 448625 445977 443852 441460 438418
51496 438418 435058 432106 430106 429100 428660 428219 427571 427104 427412 428589 430069 431260 432173 433239 434640 436019
51480 436019 436833 436754 435721 433800 431196 428316 425601 423185 420826 418240 415428 412566 409701 406836 404289
51465 404289 402538 401568 400768 399780 399078 399161 399436 398701 396830 395261 395505 397756 401277 405551 410408 415470
51449 415470 420297 425076 430591 437443 445787 455763 467553 480763 494221 506732 517850 527793 536951
51436 536951 545627 553925 561472 567413 570927 571710 569910 565943 560595 554985 549853 544858 538899 531265
51422 531265 522336 513203 504842 497660 491541 486175 481425 477450 474408 472157 470415 469178 468671 468877 469456
51407 469456 470268 471662 473952 476835 479655 482120 484437 486828 489330 492066 495277 498936 502668 506304
51393 506304 510227 514915 520407 526543 533527 541795 551421 562191 574363 588925 606817 628233 653064
51380 653064 681833 715750 755772 801823 852964 908051 966024 1025645 1085235 1142863 1196771
51369 1196771 1245415 1287045 1319543 1341132 1351294 1350645 1339801 1318770 1287722 1247959 1201611 1150546
51357 1150546 1096035 1039441 982583 927184 874299 824554 778590 736979 699891 667147 638528
51346 638528 613812 592628 574498 558985 545594 533612 522334 511535 501550 492781 485156 478085
51334 478085 470967 463769 457092 451570 447191 443362 439639 436111 432935 429826 426349 422578 419104 416409
51320 416409 414539 413370 412846 412928 413570 414822 416710 418934 420945 422427 423483 424310 424985 425639 426539 427783
51304 427783 429124 430254 431025 431297 430927 430124 429460 429213 428969 428267 427374 426935 426958 426652 425312 423021 420505
51287 420505 418630 418002 418593 419688 420547 421157 422001 423144 424092 424624 425148 425904 426377 426001 425104 424610 424944 425675
51269 425675 426130 426009 425437 424810 424579 424891 425446 425964 426733 428352 430878 433569 435584 436782 437716 438961 440521
51252 440521 441847 442470 442595 442938 443829 444713 444765 443842 442510 441231 439846 437890 435116 431655 427900 424291
51236 424291 421059 418186 415738 414022 413093 412234 410434 407459 404081 401159 398862 396935 395354 394494 394847
51221 394847 396673 399606 402551 404446 405349 406415 408516 411246 413569 415039 415991 416909 418161 420087 422685
51206 422685 425231 426830 427514 428342 430208 432912 435614 437848 439772 441627 443333 444684 445693 446597 447591
51191 447591 448695 449869 451112 452290 453068 453251 453207 453585 454577 455753 456727 457623 458631 459446 459531 458720 457227
51174 457227 455280 453155 451327 450077 448973 447281 445022 443205 442843 443979 445731 447020 447258 446701 446284
51159 446284 446824 448287 449991 451519 452978 454381 455279 455346 454905 454511 454222 453705 452881 452079 451497 450854 449631
51142 449631 447537 444642 441225 437633 434339 431930 430731 430348 429880 428902 428035 428145 429118 429933 429906 429357 428971
51125 428971 429106 430038 432191 435588 439412 442721 445495 448479 452061 455821 459241 462453 465998 470057 474097
51110 474097 477304 479304 480385 481019 481320 481251 481238 482103 484171 486828 489132 490636 491385 491615 491824 492779 494897
51093 494897 497714 500354 502423 504083 505464 506439 506863 506568 505306 503213 501225 500421 500852 501540 501667 501218
51077 501218 500362 498951 497023 495303 494614 495002 495843 496696 497675 499042 500804 502833 505244 508484 512907 518210
51061 518210 523514 528294 533031 538554 544763 550564 555164 558947 562712 566587 570188 573590 577489 582366
51047 582366 587918 593492 598837 604311 610428 617367 624907 632810 641132 650022 659272 668267 676444 683609
51033 683609 689719 694559 697759 698978 697946 694501 688753 681112 672087 662129 651722 641411 631616 622534
51019 622534 614289 607013 600811 595894 592708 591570 592062 593239 594662 596827 600268 604698 609474 614621
51005 614621 620765 628136 636151 644067 651648 659101 666642 674245 681700 688866 695918 703237 710989 718982
50991 718982 727058 735354 743997 752974 762653 774003 787743 803507 820453 838467 858097 879428
50979 879428 901794 924679 948125 972039 995842 1019186 1042484 1066350 1090947 1116214 1142245
50968 1142245 1169095 1196717 1225523 1256537 1290546 1327457 1367000 1409526 1455400 1503923 1553693
50957 1553693 1603939 1654695 1705706 1756031 1804945 1852406 1898053 1940319 1977230 2007984 2033349
50946 2033349 2054645 2072703 2087695 2099509 2108012 2113056 2114387 2111740 2105253 2095792 2084610 2072350
50934 2072350 2058461 2041777 2021700 1998726 1973909 1948059 1921405 1893718 1864488 1833057 1798902
50923 1798902 1762027 1723054 1682787 1641678 1599779 1557142 1514024 1470630 1426944 1383150 1340126
50912 1340126 1299200 1261325 1226635 1194750 1165251 1137829 1112319 1088822 1067672 1049112 1033075
50901 1033075 1019318 1007561 997302 987779 978457 969559 961867 955891 951371 947568 943908 940358 937363
50888 937363 935472 934822 934910 935015 934910 935073 936118 938130 940666 943321 946156 949557 953827 958998 965029 972080
50872 972080 980470 990337 1001357 1012923 1024656 1036798 1050119 1065396 1082862 1102098 1122544 1144192
50860 1144192 1167728 1194003 1223521 1256517 1293326 1334413 1380155 1430911 1487254 1549868 1619256
50849 1619256 1695825 1780162 1872722 1973132 2080335 2193730 2313697 2440508 2572941 2708424
50839 2708424 2844366 2978853 3110168 3236204 3354487 3462428 3557546 3637904 3702540 3751267
50829 3751267 3784005 3800752 3802377 3791089 3769795 3741148 3707314 3670310 3632169 3594767 3559605
50818 3559605 3527593 3498823 3472611 3447887 3423486 3398045 3369831 3336833 3296996 3248551 3190577
50807 3190577 3123486 3048585 2966882 2878559 2783926 2684552 2582941 2481206 2380555 2282063 2187358
50796 2187358 2098242 2015852 1940453 1871968 1810549 1756613 1710364 1671295 1638331 1610513 1587452
50785 1587452 1568972 1554539 1543254 1534306 1527130 1521215 1516044 1511240 1506512 1501401 1495340 1488040 1479670
50772 1479670 1470631 1461285 1451741 1441599 1429951 1416034 1399994 1382776 1365151 1347137 1328460 1309231
50760 1309231 1289886 1270664 1251521 1232542 1214238 1197393 1182719 1170595 1160972 1153424 1147433 1142749
50748 1142749 1139648 1138825 1140946 1146249 1154581 1165756 1179694 1196188 1214970 1236310 1261306 1291133
50736 1291133 1326014 1365226 1408083 1454506 1504678 1558667 1616555 1678493 1744207 1812642 1882452
50725 1882452 1952906 2024166 2096644 2170083 2243138 2313781 2380121 2440825 2494765 2540545 2576672
50714 2576672 2602144 2616632 2620267 2613628 2597929 2574795 2545721 2512040 2475462 2438271 2402771 2370695
50702 2370695 2342989 2319750 2300244 2283434 2268701 2255718 2243547 2230310 2213993 2193307 2167643
50691 2167643 2136651 2100271 2058908 2013337 1964579 1913898 1862529 1811277 1760811 1712365 1667557
50680 1667557 1627339 1591782 1561161 1536473 1518455 1506872 1501471 1502811 1511178 1525277 1543122 1563883
50668 1563883 1587776 1614297 1641814 1669055 1695944 1722626 1748584 1773073 1795730 1816322 1834517
50657 1834517 1850336 1864420 1877515 1890078 1902469 1915005 1927601 1939866 1951776 1963794 1976263
50646 1976263 1989331 2003664 2020452 2040344 2063082 2088616 2117791 2151229 2188138 2227060 2267473
50635 2267473 2309912 2354818 2402117 2451841 2504337 2559543 2616293 2672219 2724046 2768363 2803002
50624 2803002 2827893 2844147 2852113 2850536 2837568 2812306 2775637 2730363 2680601 2630394 2582296 2537381
50612 2537381 2496588 2461545 2433685 2412902 2397562 2385776 2376308 2368258 2360281 2350428 2336735 2317826
50600 2317826 2293058 2262346 2225993 2184468 2138048 2086675 2030458 1970423 1908523 1846689 1785986
50589 1785986 1726806 1669656 1615453 1565077 1518861 1476555 1437662 1401837 1369177 1340191 1315396
50578 1315396 1294849 1278036 1264265 1253222 1245197 1240685 1239705 1241618 1245731 1251913 1260291 1270529 1281818
50565 1281818 1293578 1305698 1318029 1330305 1342788 1356394 1371695 1388244 1405429 1423558 1443501
50554 1443501 1465485 1488997 1513780 1540213 1568559 1598361 1628814 1659359 1689725 1719708 1749075
50543 1749075 1777562 1804975 1831527 1858003 1885350 1914247 1945353 1979686 2018144 2060784 2107302
50532 2107302 2158288 2215244 2279107 2349461 2425618 2507756 2596361 2691017 2790604 2894464 3002519
50521 3002519 3114086 3227156 3339106 3447704 3551163 3647597 3734865 3810929 3874107 3922990
50511 3922990 3956335 3973197 3973115 3956136 3922767 3874104 3812017 3739084 3658241 3572515 3485058 3399104
50499 3399104 3317647 3243199 3177961 3124014 3083022 3055734 3041939 3040720 3050453 3068612 3091915 3116731
50487 3116731 3139251 3155653 3162733 3158478 3141679 3111113 3065692 3005475 2931962 2847209 2753210 2652319
50475 2652319 2547479 2441432 2336092 2233114 2134505 2041929 1955710 1875206 1800094 1730710
50465 1730710 1667335 1609797 1557815 1511117 1469192 1431426 1397568 1367587 1341124 1317624 1297097
50454 1297097 1280075 1266593 1255759 1246683 1239364 1234284 1231521 1230698 1231486 1233697 1237002 1240963 1245320 1250028
50440 1250028 1255110 1260610 1266508 1272489 1278032 1282982 1287773 1292749 1297524 1301485 1304777 1308242 1312396 1317050
50426 1317050 1322047 1327811 1334838 1343112 1352522 1363520 1376798 1392424 1409904 1429223 1451305 1477194
50414 1477194 1507222 1541343 1579886 1623335 1671431 1723075 1777270 1833693 1892154 1952003 2012459
50403 2012459 2073097 2133449 2192332 2248147 2299759 2346504 2387313 2420519 2444786 2459688 2465042
50392 2465042 2460220 2444703 2419062 2384876 2343807 2297192 2246352 2192741 2137769 2082880 2029887
50381 2029887 1980736 1936797 1898686 1866868 1842036 1824633 1814229 1809563 1809014 1810905 1813627 1815734
50369 1815734 1815829 1812296 1803461 1788279 1766758 1739428 1706535 1668040 1624346 1576734 1526929 1476370
50357 1476370 1425897 1375980 1327128 1279999 1235130 1192699 1152730 1115498 1081509 1050929 1023337
50346 1023337 998245 975720 956194 939783 926060 914491 904893 897381 892022 888549 886328 884703
50334 884703 883503 883113 883886 885588 887593 889571 891716 894397 897748 901555 905345 908681 911578 914475 917561
50319 917561 920330 922202 923379 924553 925864 926811 927252 927792 928880 930126 930948 931335 931544 931482 930984 930352 930036
50302 930036 930006 930001 930197 930959 932089 932997 933652 934741 936750 939431 942375 945571 949162 953020 956858 960426
50286 960426 963449 965749 967663 969959 973094 976914 981320 986744 993491 1000930 1007879 1013737 1018858 1024003
50272 1024003 1029792 1036416 1043326 1049248 1053087 1054939 1055793 1056294 1056344 1055955 1055649 1055545 1054660 1051872 1047295 1041937
50256 1041937 1036107 1028996 1019998 1009704 999138 988624 978045 967802 958743 951173 944675 939049 934777
50243 934777 932319 931583 932475 935392 940422 946373 951419 954784 957166 959393 961282 962104 961596 959975 957232
50228 957232 953009 947202 940339 933182 926076 918667 910191 900113 888654 876702 865177 854506 844708
50215 844708 835696 827293 819114 810732 802092 793646 786115 780114 775887 773220 771625 770692 770243 770122 770075
50200 770075 770024 770293 771272 772886 774699 776541 778745 781674 785278 789262 793499 798092 803236 809255 816699
50185 816699 826049 837223 849601 862696 876754 892532 910528 930526 951863 973980 996640 1019752
50173 1019752 1043144 1066519 1089607 1112374 1135078 1158009 1181046 1203539 1224696 1244014 1261235
50162 1261235 1275970 1287493 1294861 1297137 1293740 1284911 1271821 1255892 1237892 1217932 1196311 1174046
50150 1174046 1152405 1132219 1113838 1097487 1083342 1071311 1060891 1051206 1041163 1029878 1017127
50139 1017127 1003270 988653 973298 957212 940562 923360 905405 886994 869358 853896 841028
50128 841028 830235 821013 813289 807010 801973 798163 795727 794411 793434 792160 790598 789120 788007 787433
50114 787433 787519 788093 788630 788648 788113 787411 787143 787940 790046 792874 795361 796995 798197 799518 800915 802209 803808
50097 803808 806360 809856 813687 817509 821493 825744 830141 834931 840943 848805 858274 868660 879724 891805
50083 891805 905264 920115 936118 952943 970211 987583 1004857 1021851 1038277 1053967 1069258
50072 1069258 1084915 1101498 1118899 1136625 1154502 1173049 1193278 1216237 1242601 1272355 1304761
50061 1304761 1338825 1374040 1410673 1449187 1489431 1530605 1572045 1613875 1656739 1701030 1746472
50050 1746472 1792270 1837425 1880893 1921734 1959224 1992700 2021201 2043425 2058197 2064859 2063062 2052422
50038 2052422 2032806 2004996 1970601 1931082 1887250 1839985 1791033 1742407 1695103 1649096 1604691
50027 1604691 1563087 1525169 1490384 1457504 1426145 1396826 1369740 1344364 1320309 1297683 1276243
50016 1276243 1254967 1233034 1210769 1188967 1167675 1146310 1124758 1103544 1082901 1062456 1042089
50005 1042089 1022475 1004305 987484 971636 957106 944787 935076 927663 922432 919886 920307 923014 927000
49992 927000 932038 938517 946316 954489 962222 969500 976479 982668 987224 989829 990714 989916 987049 981882 974757
49977 974757 966212 956511 945743 934199 922473 911210 900756 891015 881708 872990 865684 860575 857484
49964 857484 855359 853333 851360 849831 849106 849648 852059 856491 862301 868770 876056 885116 896807 911416
49950 911416 928872 949017 971676 996801 1024530 1054811 1087086 1120687 1155461 1191457 1227962
49939 1227962 1263381 1296311 1326382 1353803 1378496 1400113 1418705 1434899 1449335 1462139 1472906
49928 1472906 1480976 1485698 1486698 1484016 1477881 1468220 1454463 1435961 1412608 1384933 1353552 1318719
49916 1318719 1280602 1239982 1198456 1157775 1119024 1082479 1048182 1016557 988468 964566 944553
49905 944553 927220 911593 898052 887938 881982 879564 879660 881950 886501 892845 900148 908070 916662 925379
49891 925379 932992 938696 942632 945025 945396 943121 938272 931353 922503 911479 898220 882964 865963
49878 865963 847571 828498 809496 790743 771975 753204 734943 717729 701891 687864 676220
49867 676220 667086 659822 653666 648492 644695 642473 641666 642228 644479 648616 654221 660549 667324 675039 684362
49852 684362 695367 707475 720075 732940 746017 759051 771680 783823 795672 807160 817563
49841 817563 825802 831143 833475 832955 829690 824044 817058 809975 803058 795217 785255 773363 760966 749228
49827 749228 738340 728330 719877 713771 709994 707878 707061 707813 710515 715265 722000 730576 740608 751560
49813 751560 763106 775204 787789 800665 813771 827214 840844 853991 865807 875731 883517 889028
49801 889028 892217 893205 892149 889077 884008 877122 868658 858668 847116 834256 820755 807313 794171
49788 794171 781110 767907 754773 742339 731240 721714 713482 705932 698518 691196 684563 679367 675763
49775 675763 673142 670799 668598 666845 665759 665491 666563 669751 675259 682319 689879 697520 705491 714044
49761 714044 723118 732592 742335 751843 760134 766375 770535 773126 774318 773615 770541 765356 758829 751385
49747 751385 742788 732641 720935 708115 694910 682209 670791 660939 652463 645200 639232 634488 630508
49734 630508 626916 623801 621293 619110 617048 615614 615477 616422 617609 618869 620938 624257 628381 633018 638810
49719 638810 646399 655267 664351 673459 683281 694152 705538 716718 727255 736670 744302 749792 753244
49706 753244 754742 754155 751619 747807 743418 738634 733256 727066 719907 711768 703088 694691 687162 680408
49692 680408 674073 668134 662824 658187 654069 650502 647838 646493 646705 648387 651071 654191 657716 662346
49678 662346 668774 676816 685624 694704 704250 714480 725117 735783 746458 757110 767129 775624 782321
49665 782321 787823 792930 798026 803152 808306 813321 817623 820392 821007 819253 815191 808970 800751 790638
49651 790638 778685 765110 750434 735317 720284 705746 692205 680153 669754 660794 652972 646020
49639 646020 639609 633588 628411 624884 623115 622015 620260 617574 614654 611991 609320 606285 603131 600422
49625 600422 598306 596250 593417 589284 584144 579086 575185 572514 570085 566859 562700 558283 554345 551205
49611 551205 548860 547234 546288 545946 546049 546469 547313 548786 550596 551786 551647 550794 550720 552066 553832 554632 554262
49594 554262 553584 553257 553214 553227 553326 553557 553763 553844 554010 554662 556110 558265 560479 561862 562115 561946 562352 563597
49576 563597 565238 567001 569118 571825 575090 578930 583541 589007 595361 603019 612489 623376 634285 644185
49562 644185 653292 662136 670388 677399 683427 689235 694457 697465 697222 694528 691014 687572 684253 681058
49548 681058 678082 675128 671958 668891 666631 665485 665198 665455 666057 666619 666760 666771 667498 669234 671234 672770
49532 672770 674197 676402 679544 682990 686432 690396 695627 702510 711171 721435 732502 743237 753278
49519 753278 763397 774294 785429 795584 804299 812072 819311 825866 831741 837584 844066 851112 858053
49506 858053 864234 869195 872617 874499 875219 874964 873164 868846 861609 851919 840466 827629 813840 800135
49492 800135 787872 777790 769570 762410 755877 750087 745202 741056 737331 733944 731103 729012 727601 726513
49478 726513 725296 723706 721935 720509 719868 720030 720683 721522 722437 723495 724933 727075 730018 733436 736907
49463 736907 740482 744678 749777 755324 760531 765057 769172 773141 776639 778895 779409 778427 776649 774477 771643
49448 771643 767643 762369 756146 749315 742167 735326 729749 725945 723318 720662 717405 714163 712011 711356
49434 711356 711668 712220 712902 714175 716380 719428 723425 729339 738581 751753 768170 786900 807907 831533
49420 831533 856810 880966 901210 916937 929775 941386 951455 957844 958435 952754 942334 929999
49408 929999 918588 909668 903084 897886 893811 891647 892197 895429 900900 908511 918241 929341 940502 950946
49394 950946 960972 971279 982085 992907 1002806 1010731 1016040 1018920 1020052 1019766 1017759 1013720 1007798
49381 1007798 1000336 991570 981916 972135 962794 953862 945289 937804 932579 930057 929488 929681 929997 930592 931929
49366 931929 934152 936820 939211 940890 941851 942151 941706 940554 938890 936559 932959 927976 922732 918724 916265
49351 916265 914370 912184 909882 907947 906190 904029 901381 898816 896867 895554 894543 893485 892090 890119
49337 890119 887513 884530 881595 878892 876170 873131 869934 867025 864422 861643 858582 855990 854570 853948
49323 853948 853226 852411 852495 854004 856236 858347 860526 863511 867282 870906 873642 875728 877992 880949 884365
49308 884365 887595 890205 892244 893873 894971 895411 895658 896565 898413 900505 901976 902727 903349 904508 906678
49293 906678 910089 914430 918824 922590 925944 929571 933622 937597 941085 944072 946486 948084 949011 949971 951479
49278 951479 953298 954954 956499 958307 960294 961889 962942 964229 966828 971139 976674 982630 988438 993861
49264 993861 998882 1003585 1008016 1012087 1015776 1019469 1023931 1029832 1037455 1046932 1058519 1072374 1088235
49251 1088235 1105653 1124516 1144954 1166641 1188467 1208992 1227010 1241676 1252473 1259328 1262569 1262549
49239 1262549 1259410 1253327 1244842 1234785 1223983 1213104 1202652 1193024 1184692 1178271 1174167 1172200 1171957
49226 1171957 1173581 1177708 1184476 1193063 1202467 1212116 1221363 1229097 1234707 1239008 1243266 1247439 1250256 1251011
49212 1251011 1250337 1249086 1247525 1246091 1245999 1248274 1252721 1258617 1266025 1275641 1287609 1301320 1316322 1332619
49198 1332619 1349909 1367302 1384123 1400439 1416403 1431533 1445155 1457220 1468084 1477626 1485171 1490489
49186 1490489 1494366 1497897 1501507 1505003 1508390 1512236 1517264 1523935 1532510 1543221 1556242 1571798 1590530
$$ [...]
##END NTUPLES=NMR SPECTRUM
##END=
