##TITLE=AC1526_ROEFFECT0006_8213789_DTOzV0TmO8
##JCAMPDX= 6.0         $$ Bruker NMR JCAMP-DX V2.0
##DATA TYPE= NMR SPECTRUM
##DATA CLASS= NTUPLES
##ORIGIN= BRUKER
##OWNER= Administrator
$$ 1.72 TOPSPIN		Version 2.1
$$ 2014-07-31 18:23:17.322 -0700  Administrator@X
$$ Compression mode = diff/dup
##.OBSERVE FREQUENCY= 400.02188249412
##.OBSERVE NUCLEUS= ^1H
##.ACQUISITION MODE= SIMULTANEOUS (DQD)
##.ACQUISITION SCHEME= undefined
##.AVERAGES= 8
##.DIGITISER RES= 22
##SPECTROMETER/DATA SYSTEM= spect
##.PULSE SEQUENCE= zg30
##.SOLVENT NAME= COFFEE_meoh
##.SHIFT REFERENCE= INTERNAL, COFFEE_meoh, 1, 14.98509
##AUDIT TRAIL= $$ (NUMBER, WHEN, WHO, WHERE, PROCESS, VERSION, WHAT)
$$ ##TITLE= Audit trail, TOPSPIN		Version 2.1
$$ ##JCAMPDX= 5.01
$$ ##ORIGIN= Bruker BioSpin GmbH
$$ ##OWNER= Administrator
$$ $$ E:\/data/COFFEE/nmr/AC1526_ROEFFECT0006_8213789_DTOzV0TmO8/20/pdata/1/auditp.txt
$$ ##AUDIT TRAIL=  $$ (NUMBER, WHEN, WHO, WHERE, PROCESS, VERSION, WHAT)
(   1,<2014-07-31 18:23:06.405 -0700>,<Administrator>,<X>,<go>,<TOPSPIN 2.1>,
      <created by zg
	started at 2014-07-31 18:21:47.561 -0700,
	POWCHK enabled, PULCHK disabled,
       configuration hash MD5:
       16 EA D6 F4 BB 67 03 14 9B FF E7 A0 43 5B 48 2E
       data hash MD5: 64K
       22 C0 30 07 2D 09 1E B3 4F CC ED 37 11 8A D5 8C>)
(   2,<2014-07-31 18:23:11.491 -0700>,<Administrator>,<X>,<proc1d>,<TOPSPIN 2.1>,
      <Start of raw data processing
       efp LB = 0 FT_mod = 6 PKNL = 1 PHC0 = 0 PHC1 = 0 SI = 32K 
       data hash MD5: 32K
       7A 89 09 C6 54 B8 5D 8D 8A A8 68 70 EF 24 56 88>)
(   3,<2014-07-31 18:23:11.936 -0700>,<Administrator>,<X>,<proc1d>,<TOPSPIN 2.1>,
      <pk PHC0 = 94.76807 PHC1 = 0 
       data hash MD5: 32K
       47 6F 1A 4D 68 8D CF 76 9A E4 33 FF 97 20 35 1C>)
(   4,<2014-07-31 18:23:12.124 -0700>,<Administrator>,<X>,<proc1d>,<TOPSPIN 2.1>,
      <abs ABSG = 1 
       data hash MD5: 32K
       B4 CA B4 EB 65 06 D3 A6 84 7F 6A 85 96 20 24 85>)
(   5,<2014-07-31 18:23:12.217 -0700>,<Administrator>,<X>,<proc1d>,<TOPSPIN 2.1>,
      <abs ABSG = 2 
       data hash MD5: 32K
       2B 88 14 9E D4 95 7D 52 D0 5F 20 58 11 6C 13 35>)
(   6,<2014-07-31 18:23:12.334 -0700>,<Administrator>,<X>,<proc1d>,<TOPSPIN 2.1>,
      <abs ABSG = 3 
       data hash MD5: 32K
       F4 23 4A 8C 3E BF 52 A2 D9 5C F1 C1 B3 F7 FB C6>)
(   7,<2014-07-31 18:23:12.452 -0700>,<Administrator>,<X>,<proc1d>,<TOPSPIN 2.1>,
      <abs ABSG = 4 
       data hash MD5: 32K
       3E 18 E9 B6 E9 93 80 0C 98 AC C5 E2 55 0F 59 30>)
(   8,<2014-07-31 18:23:12.569 -0700>,<Administrator>,<X>,<proc1d>,<TOPSPIN 2.1>,
      <abs ABSG = 5 
       data hash MD5: 32K
       36 2C 62 91 A3 2C C8 97 06 A5 ED 7D 6A 4F C9 95>)
$$ ##END=
$$ 
$$ $$ hash MD5
$$ $$ 8B 80 E7 EE 83 01 C7 A4 DC D1 38 81 AE C1 77 C9
##$RELAX= 
##$RELAX= 
##$RELAX= 
##$RELAX= 
##$RELAX= 
##$RELAX= 
##$RELAX= 
$$ Bruker specific parameters
$$ --------------------------
##$DU= <E:\>
##$EXPNO= 20
$$ [...]
##$TP= (0..7)
150 150 150 150 150 150 150 150
##$TP07= 0
##$TPNAME0= <>
##$TPNAME1= <>
##$TPNAME2= <>
##$TPNAME3= <>
##$TPNAME4= <>
##$TPNAME5= <>
##$TPNAME6= <>
##$TPNAME7= <>
##$TPOAL= (0..7)
0.5 0.5 0.5 0.5 0.5 0.5 0.5 0.5
##$TPOFFS= (0..7)
0 0 0 0 0 0 0 0
##$TUNHIN= 0
##$TUNHOUT= 0
##$TUNXOUT= 0
##$USERA1= <user>
##$USERA2= <user>
##$USERA3= <user>
##$USERA4= <user>
##$USERA5= <user>
##$V9= 5
##$VALIST= <valist>
##$VCLIST= <CCCCCCCCCCCCCCC>
##$VD= 0
##$VDLIST= <DDDDDDDDDDDDDDD>
##$VPLIST= <PPPPPPPPPPPPPPP>
##$VTLIST= <TTTTTTTTTTTTTTT>
##$WBST= 1024
##$WBSW= 4
##$XGAIN= (0..3)
0 0 0 0
##$XL= 0
##$YL= 0
##$YMAX_a= 592953
##$YMIN_a= -504439
##$ZGOPTNS= <>
##$ZL1= 120
##$ZL2= 120
##$ZL3= 120
##$ZL4= 120
##$ABSF1= 14.98509
##$ABSF2= -5.573092
##$ABSG= 5
##$ABSL= 3
##$ALPHA= 0
##$AQORDER= 0
##$ASSFAC= 0
##$ASSFACI= 0
##$ASSFACX= 0
##$ASSWID= 0
##$AUNMP= <proc_prof1d_extract_pilot.lims>
##$AXLEFT= 0
##$AXNAME= <>
##$AXNUC= <1H>
##$AXRIGHT= 0
##$AXTYPE= 0
##$AXUNIT= <>
##$AZFE= 0.1
##$AZFW= 0.1
##$BCFW= 0
##$BC_mod= 0
##$BYTORDP= 0
##$COROFFS= 0
##$CY= 15
##$DATMOD= 1
##$DC= 0
##$DFILT= <>
##$DTYPP= 0
##$F1P= 0
##$F2P= 0
##$FCOR= 0.5
##$FTSIZE= 32768
##$FT_mod= 6
##$GAMMA= 0
##$GB= 0
##$INTBC= 1
##$INTSCL= 1
##$ISEN= 128
##$LB= 0
##$LEV0= 0
##$LPBIN= 0
##$MAXI= 10000
##$MC2= 0
##$MEAN= 0
##$ME_mod= 0
##$MI= 0
##$NCOEF= 0
##$NC_proc= -8
##$NLEV= 6
##$NOISF1= 0
##$NOISF2= 0
##$NSP= 0
##$NTH_PI= 0
##$NZP= 0
##$OFFSET= 14.98509
##$PC= 1
##$PHC0= 94.76807
##$PHC1= 0
##$PH_mod= 1
##$PKNL= yes
##$PPARMOD= 0
##$PPDIAG= 0
##$PPIPTYP= 0
##$PPMPNUM= 2147483647
##$PPRESOL= 1
##$PSCAL= 4
##$PSIGN= 0
##$PYNMP= <proc.py>
##$REVERSE= no
##$SF= 400.02
##$SI= 32768
##$SIGF1= 0
##$SIGF2= 0
##$SINO= 400
##$SIOLD= 32768
##$SPECTYP= <>
##$SREGLST= <1H.CDCl3>
##$SSB= 0
##$STSI= 32768
##$STSR= 0
##$SW_p= 8223.68421052631
##$SYMM= 0
##$S_DEV= 0
##$TDeff= 65536
##$TDoff= 0
##$TI= <>
##$TILT= no
##$TM1= 0
##$TM2= 0
##$TOPLEV= 0
##$USERP1= <user>
##$USERP2= <user>
##$USERP3= <user>
##$USERP4= <user>
##$USERP5= <user>
##$WDW= 1
##$XDIM= 32768
##$YMAX_p= 457186169
##$YMIN_p= -716330
##$CURPLOT= <Network HP LaserJet P1505>
##$CURPRIN= <$Network HP LaserJet P1505>
##$DFORMAT= <normdp>
##$LAYOUT= <+/1D_H.xwp>
##$LFORMAT= <normlp>
##$PFORMAT= <normpl>
##$SURQMSG= 1
$$ End of Bruker specific parameters
$$ ---------------------------------
##NTUPLES= NMR SPECTRUM
##VAR_NAME=  FREQUENCY,     SPECTRUM/REAL,   SPECTRUM/IMAG
##SYMBOL=    X,             R,               I
##VAR_TYPE=  INDEPENDENT,   DEPENDENT,       DEPENDENT
##VAR_FORM=  AFFN,          ASDF,            ASDF
##VAR_DIM=   32768,         32768,           32768
##UNITS=     HZ,            ARBITRARY UNITS, ARBITRARY UNITS
##FACTOR=    0.250966925370066, 1,           1
##FIRST=     8223.43324360094, -92401,       -15090
##LAST=      0,             145914,          -19770
##MIN=       0,             -716330,         0
##MAX=       8223.43324360094, 457186169,    0
$$ Real data points
##PAGE= N=1
##DATA TABLE= (X++(R..R)), XYDATA
$$ [...]
$$ plain form
19541 -114675 113576 -338331 -262110 -188603 -159706 150745 -234768 115282 -156221 -216821
19531 -216821 -123641 -37649 238171 175008 250920 42029 -194261 -44511 816 -221867 52641
19519 -133463 181181 327964 -216905 362630 -215943 22559 179417 364021 -217853 74643
19508 39212 173893 324369 -192388 178905 315900 -121534 -256561 -195804 -68315 -236749
19498 -236749 -48730 -263270 205149 -158535 26684 17644 -187002 -81136 328021 84881 -71911
19486 68487 -69413 -162434 -92532 -104030 -136506 -151255 -137776 -122093 -196729 -267211 -282323 99887
19473 -115266 -398971 29682 212844 -203435 141968 -202989 240934 -131440 -290374 26473
19462 79484 -232559 -319574 136711 -285027 -27402 -7236 -48593 93842 -1722 -356629 -248639
$$ packed form
19541a14675A13576c38331P6221P3507K8897A50745b34768A15282a56221o0600
19531b16821R3180c7649B38171o3163P5912D2029a94261d4511H16b21867E2641
19519a33463A81181J46783b16905C62630b15943B2559J56858J84604b17853G4643
19508C9212J34681J50476a92388A78905J36995a21534j35027O0757f8315j68434
19498b36749d8730k14540B05149a58535B6684r040a87002h1136C28021H4881g1911
19486F8487f9413r3021O9902j1498l2476j4749J3479J5683p4636p0482j5112I9887
19473a15266k83705B9682J83162b03435A41968b02989B40934a31440j58934B6473
19462G9484b32559q7015A36711b85027b7402g236m1357I3842a722l54907J07990
$$ plain form
19451 -248639 -323302 -92376 -57106 -56703 -221063 21069 89330 108876 -86733 -52202 -54848 -180137
19439 -180137 -76821 6896 -235868 114866 29956 -97743 78970 39370 -211345 128354 -41004
19427 14382 -287437 -1082 -225649 225552 -36778 -12087 192086 -77071 -49787 254792 39861
19415 -103559 -72017 272311 -94086 -188236 -41385 -67120 414998 -88150 -133881 -91572 -225751
19404 -225751 -371975 -58884 -168743 -126545 -26332 130961 -33506 -86901 -109742 46879 -8662
19392 27729 106596 24074 -289731 234331 66560 -373211 34030 88214 29700 -34453 54515
19380 -295086 -111981 -20217 -321255 53689 -178302 -763 -278878 -51213 -114224 -173942 113453
19368 -61596 -81439 -122808 -106986 -113904 -101427 107780 -12420 -140591 -167863 348449 38533
$$ packed form
19451b48639p4663i2376L5270M03j64360B1069O8261J9546h6733L4531k646j25289
19439a80137g6821F896b35868A14866B9956i7743G8970C9370b11345A28354d1004
19427A4382b87437a082k24567B25552c6778a2087A92086g7071K7284B54792C9861
19415a03559L1542B72311i4086r4150d1385k5735D14998h8150m5731M2309j34179
19404b25751j46224e8884j09859M2198b6332A30961c3506n3395k2841D6879h662
19392B7729P8867B4074b89731B34331F6560c73211C4030N4184B9700c4453E4515
19380b95086a11981b0217l01038E3689a78302g63k78115e1213o3011n9718A13453
19368f1596j9843m1369J5822o918J2477A07780a2420j28171k7272C48449C8533
$$ plain form
19356 -66808 86349 167707 -141403 72068 157012 -378458 -43384 38727 -17496 -122953 62792
19344 -21185 73955 170511 -70704 145833 -128081 287445 -89606 -470949 -37944 12948 -147955
19332 -92908 -1656 -25764 -87522 -45658 55339 -225294 146383 -389784 -299640 336685 75886
19320 -7148 47658 -259727 59138 -46955 78973 -303950 85979 52638 116788 -320144 -144979
19308 -388953 -19625 -267055 -138901 -56049 -57027 109954 350677 -81727 -64605 -94890 -223567
19297 -223567 -136428 70108 -43628 -44420 -130656 114292 76338 163939 -92566 -100446 37921 -79420
19284 65633 95590 18040 335085 45655 191461 42110 134289 -216846 533484 -80977 -171628
19273 -171628 218367 87150 205138 -137268 -273733 -15289 -19442 169935 94399 -150205
$$ packed form
19356f6808H6349Q1358a41403G2068Q4944c78458d3384C8727a7496j05457F2792
19344b1185G3955R6556g0704A45833a28081B87445h9606l81343c7944A2948a47955
19332i2908a656k4108o1758M1864E5339b25294A46383c89784R0144C36685G5886
19320g148D7658b59727E9138d6955G8973c03950H5979l3341O4150c20144a44979
19308c88953a9625k47430J28154e6049r78A09954K40723h1727J7122l0285j28677
19297b23567Q7139G0108d3628p92q6236A14292l7954Q7601i2566p880C7921g9420
19284F5633K9957A8040L17045D5655J45806D2110R2179b16846E33484h0977r0651
19273a71628B18367H7150J17988a37268j36465a5289m153A69935p5536a50205
$$ plain form
19262 -376624 35582 -167764 -44837 -351091 8448 5842 -323941 -238981 5261 357549 -13251
19250 -206470 -120604 158939 -73923 -139861 -82503 -116914 -124991 -236957 -245927 -145796 -298419
19239 -298419 82513 -50359 -40731 -20563 -85946 -101441 -217198 167899 103266 -98035 6320
19227 -249533 -355768 -273440 -155650 141519 -15273 -90083 -113407 81060 -81654 19208 -261483
19215 420158 -149613 -36741 132565 -95151 -126471 347154 55792 -186965 372618 -50314
19204 -312571 -205406 -163250 -285859 -10875 156868 -354029 75284 -206342 35531 -40351
19193 -448218 19105 73104 28045 -69444 -78030 -214826 77931 3157 163614 -50191 100296
19181 -541373 -139534 -377688 -292025 -27499 -41578 -116863 -105462 -198945 -203522 211107 49285
$$ packed form
19262c76624C5582a67764d4837l06254H448k606c23941Q4960E261L52288a3251
19250b06470Q5866A58939g3923o5938N7358l4411q077j11966q970J00131j52623
19239b98419H2513e0359R628K0168o5383j5495j15757A67899o4633i8035F320
19227b49533j06235Q2328J17790A41519a5273p4810k3324H1060h1654A9208b61483
19215D20158a49613c6741A32565i5151l1320C47154E5792a86965C72618e0314
19204c12571J07165M2156j22609a0875A56868c54029G5284b06342C5531d0351
19193d48218A9105N3999B8045f9444q586j36796G7931C157J60457e0191A00296
19181e41373a39534k38154Q5663b7499j4079p5285J1401r3483m577B11107D9285
$$ plain form
19169 -103290 22205 -139196 -149319 -89843 -36884 -31244 -130798 -156021 -460150 -107611 93844
19157 -257728 22888 -216128 -119910 -111294 -155834 94985 -12990 -115242 -28395 -259783 87039
19145 -220714 -160514 -255695 -44917 -185517 121996 83802 40549 -188277 -47967 -114684 -158916
19134 -158916 -61143 58531 222053 -273693 -63188 -209893 77993 -38837 -152816 -249824 -175341
19123 -175341 167127 144509 -125912 -194769 -48943 14237 49902 291980 -113569 -91930 326279
19111 -181517 -102570 -159110 -111949 -171268 63715 46531 -217713 -219517 -234058 -33404 -90889
19100 -90889 -27069 -21985 57289 72978 83552 -435784 -63083 50774 -287689 196818 -126951
19088 23222 -42115 -418282 -39979 -95018 47273 344415 164554 -165245 43945 -432105 -64834
$$ packed form
19169a03290B2205a39196j0123N9476c6884N640r9554k5223l04129a07611I3844
19157b57728B2888b16128R6218Q616m4540I4985a2990j02252b8395k31388H7039
19145b20714O0200r5181d4917j40600A21996l8194D0549a88277d7967o6717m4232
19134a58916f1143E8531J63522b73693f3188j46705G7993c8837j13979r7008P4483
19123a75341A67127k2618a25912o8857d8943A4237L5665K42078a13569K1639C26279
19111a81517P8947n6540M7161n9319F3715j7184b17713j804j4541c3404n7485
19100i0889b7069N084E7289J5689J0574d35784f3083E0774b87689A96818a26951
19088B3222d2115l76167c9979n5039D7273K97142A64554a65245D3945d32105f4834
$$ plain form
19076 110137 -46361 -112528 -151848 -87950 -169452 112302 -51447 -77258 227204 170163 91010
19065 91010 -88907 60994 39685 -93465 -138847 6296 -350782 81094 -95643 1288 182606 51495
19052 210942 -138061 40423 23161 155854 -12860 -66450 129089 -28659 -443289 1182 -37611
19040 -37829 -24036 -298114 -129989 -42639 -127580 -126387 -28683 6502 -191721 -176487 117222
19028 -96557 46896 -113453 271315 420796 -238892 -495785 391829 19488 315743 -141784
19017 -213970 40843 -339449 -183055 -48930 -311335 151050 84495 43162 -131290 -73491
19007 -73491 -155293 210807 -142028 99542 -172249 -291222 49309 -269696 12642 145063
18997 145063 -9216 -243463 -94298 -154954 167835 44191 -131367 -113946 -13316 -299687 103323
$$ packed form
19076A10137d6361o6167l9320O3898q1502A12302e1447k5811B27204n7041p9153
19065I1010h8907F0994k1309i3465m5382F296c50782H1094i5643A288J81318E1495
19052B10942a38061D0423j7262J32693a2860n3590A29089b8659m14630A182c7611
19040c7829J3793k74078a29989d2639q4941J193b8683F502a91721J5234A17222
19028i6557D6896a13453B71315J49481b38892k56893C91829A9488K96255a41784
19017b13970D0843c39449J56394d8930k62405A51050o6555m1333a31290N7799
19007g3491q1802B10807a42028I9542a72249j18973D9309b69696A2642J32421
18997A45063i216k34247i4298o0656A67835D4191a31367J7421a3316k86371A03323
$$ plain form
18985 -214279 -46908 -179057 65460 -215956 -37054 -104189 -23769 -168589 -22921 49715 6899
18973 118124 74406 35314 -33253 253737 -122468 256107 -130630 -167059 -204391 -72618 50371
18961 194225 140861 45978 321677 -96923 -139022 -105975 -36648 -245699 -23073 -111516 75598
18949 -55709 -212659 -273057 -45917 -23993 100984 -226876 174488 34371 -136907 252908
18938 -66635 -18138 -118066 -247385 8121 -63263 -243938 -19833 -45247 33598 -163112 174810
18926 -373503 -32967 166561 -98713 -244913 198709 -51414 -134263 -80839 -32119 98993 -94110
18914 -115561 339582 -19960 489120 415808 -20193 104384 -35019 91601 -36278 29211 -124739
18902 18495 -196315 132476 -217562 -8764 -2122 -56449 -12990 -287770 -107627 -41471 -302319
$$ packed form
18985b14279d6908j32149F5460b15956c7054o7135b3769j44820b2921D9715F899
18973A18124m3718C5314c3253B53737a22468B56107a30630l6429l7332g2618E0371
18961A94225n3364D5978K75699i6923m2099L3047c6648k09051b3073q8443G5598
18949e5709j56950o0398d5917K1924A00984b26876A74488C4371a36907B52908
18938f6635a8138r9928j29319H121f3263j80675a9833k5414C3598a63112A74810
18926c73503c2967A66561i8713j46200A98709e1414q2849N3424c2119I8993i4110
18914a15561C39582a9960D89120p3312b0193A04384c5019I1601c6278B9211a24739
18902A8495a96315A32476b17562h764b122n4327a2990k74780a07627d1471k60848
$$ plain form
18891 -302319 -65567 64506 -76441 -148944 163796 -368959 130089 -127395 -265362 -360651
18881 -360651 -14165 329740 -70565 -484500 -39749 -27019 -223031 -161270 -127114 -173827 -192831
18870 -192831 68877 73109 -87781 62282 81632 -202763 -260003 330252 274610 -51981 -60417
18859 -60417 -372628 -329839 -126077 -192893 46875 212232 -12519 16559 220126 218725 -138753
18847 -204621 -12130 -81375 -86402 73279 -62461 -33677 100970 -98968 28587 -103721 5485
18835 19991 219531 171669 -214815 -79075 64668 -152447 64235 -173653 -108987 -141917 -422387
18824 -422387 148161 -175043 -42159 124868 -78191 106072 -75510 -107702 -221830 -391257
18814 -391257 507110 -214765 -58064 100895 -85427 -151351 97761 -68723 -383835 -73251 -40523
$$ packed form
18891c02319f5567F4506g6441p2503A63796c68959A30089a27395j37967r5289
18881c60651a4165C29740g0565m13935c9749J2730j96012O1761L4156m6713j9004
18870a92831F8877M232h7781F2282J9350b02763n7240C30252n5642e1981q436
18859f0417l12211M2789a26077o6816D6875J65357a2519A6559K03567j401a38753
18847b04621a2130o9245n027G3279f2461K8784A00970i8968B8587a03721E485
18835A9991J99540m7862b14815g9075F4668a52447F4235a73653O4666l2930k80470
18824d22387A48161a75043d2159A24868g8191A06072g5510l2192j14128j69427
18814c91257E07110b14765e8064A00895h5427o5924I7761f8723l15112g3251L2728
$$ plain form
18803 -40523 -155225 -77722 -93210 158046 -114088 -223819 70614 20906 -41636 137551 140594
18792 140594 -69131 -45077 62803 73152 306218 190546 263660 85629 298268 355029 62207
18780 114560 -186485 -18672 35466 23464 7947 -185136 -151231 -76305 146243 -278341 143035
18768 -188248 -131780 21159 -59160 28204 -55189 117068 262778 -48002 83519 -241821 -319964
18757 -319964 -207119 32379 148960 -80727 57228 -167004 -181250 -134143 -80029 -389263 -255839
18746 -255839 -116390 100206 -314853 172564 97314 104340 -19515 -139582 42583 91582 -13034
18734 -22512 -72749 -226245 -291105 44153 4160 -39330 -304039 -66599 -34766 90733 32555
18722 132948 -313334 48886 -211621 76508 42473 10364 -107689 100407 92855 -173219 -7858
$$ packed form
18803d0523j14702P7503j5488A58046a14088j09731G0614B0906d1636A37551L043
18792A40594f9131K4054F2803J0349K33066j15672P3114H5629K12639N6761F2207
18780A14560a86485a8672C5466j2002G947a85136L3905P4926A46243b78341A43035
18768a88248N6468B1159e9160B8204e5189A17068J45710d8002H3519b41821p8143
18757c19964J12845C2379J16581h0727E7228a67004j4246M7107N4114l09234J33424
18746b55839a16390A00206c14853A72564p5250P026a9515j20067D2583M8999a3034
18734b2512n0237j53496o4860D4153D160c9330k64709f6599L1833I0733C2555
18722A32948c13334D8886b11621G6508l4035A0364a07689A00407p552a73219g858
$$ plain form
18710 -71030 69474 -174250 -89104 -13673 -155336 279437 -112724 227138 -130030 46604
18699 -98155 -40559 171864 -7482 -169320 -155263 -110099 147882 -195147 -16950 152276 -131016
18687 78611 -33656 -138310 50732 -201819 -290179 78394 14640 -122703 381448 312054 -33530
18675 -144186 81234 -1977 -127548 -25451 -243449 83082 -236472 -107034 -86626 -2368 -63089
18664 -63089 -256614 -265520 -10872 234601 -113888 -102722 -290134 -83893 46266 -312337 25082
18652 136410 272369 -57007 -225785 75814 -396307 54282 282312 -217299 -148949 -86831
18642 -86831 22182 -124768 23449 399527 155954 -30469 -6772 57689 116797 -39955 155695
18630 -59717 -215175 150915 -48125 159927 300836 -143371 83612 42331 -272250 163859
$$ packed form
18710g1030F9474a74250Q5146a3673j41663B79437a12724B27138a30030D6604
18699i8155d0559A71864g482j61838J4057M5164A47882a95147a6950A52276a31016
18687G8611c3656j04654E0732b01819q8360G8394A4640a22703C81448o9394c3530
18675a44186H1234a977j25571b5451k17998H3082b36472a07034K0408b368o0721
18664f3089j93525q906a0872B34601a13888J1166j87412h3893D6266c12337B5082
18652A36410J35959e7007j68778G5814c96307E4282K28030b17299O8350O2118
18642h6831B2182a24768B3449L76078A55954c0469f772E7689N9108c9955A55695
18630e9717j55458A50915d8125A59927J40909a43371H3612m1281b72250A63859
$$ plain form
18619 82509 229091 -252843 -242990 -170181 209198 47530 112243 14088 78228 -31711 150533
18607 -428365 241746 -270945 141281 200835 -112341 152671 -273566 -411392 175736 -290562
18596 -196511 -156884 78336 -169620 1111 19069 234139 -59690 -369365 -245433 -156933 128399
18584 -437666 -70684 183452 188080 213141 42653 -280136 -173493 -101532 41844 -1204 58645
18572 -6336 115112 -99786 -20873 -32530 -120981 -42458 -316098 -63160 -237631 -139412 -171620
18561 -171620 -21889 -78725 -106842 68936 398052 138937 -124353 -55926 -170517 306568
18550 -12830 -293157 -68432 -25845 143744 -193654 -7062 201606 156578 -178106 -7108 -117528
18539 -117528 -218928 -285523 -169679 507377 -262739 -567495 11710 -11644 102025 -32727
$$ packed form
18619H2509J46582b52843R853P2809B09198D7530O4713A4088O4140c1711A50533
18607d28365B41746b70945A41281N9554a12341A52671b73566j37826A75736b90562
18596a96511L9627G8336a69620A111J7958K15070e9690l09675J23932Q8500A28399
18584d37666g0684A83452M628K5061D2653b80136J06643P1961D1844a204E8645
18572f336A15112i9786b0873j1657q8451d2458k73640f3160j74471R8219l2208
18561a71620b1889n6836k8117F8936L29116A38937a24353e5926j14591C06568
18550a2830k80327f8432b5845A43744a93654g062B01606m5028a78106g108j10420
18539a17528j01400o6595J15844E07377b62739l04756A1710a1644A02025c2727
$$ plain form
18528 47373 90823 14587 107875 -100961 -84664 165370 330660 -148921 -58117 -25421 -296095
18517 -296095 -172829 -161804 -46639 115493 -41201 237482 -97055 -212413 60889 -36030 -44465
18506 -44465 -67168 -273055 -66827 -65673 -76536 -65229 205083 87894 -208352 -192443 -5859
18494 -158783 -300231 -11511 -288537 -146590 8280 64180 -154462 -206040 -232557 -148618 60475
18482 349771 -11665 -173192 264421 -40118 -88418 -364909 296221 -5234 87252 269443 -43353
18470 65312 174394 -150447 79620 -255641 -135241 -340624 91956 -127477 96264 75425
18460 75425 163654 91437 13171 138135 -481405 -53464 123564 -53044 -20309 -110588 -82973
18449 -82973 93864 -106174 -7324 -276174 83845 63292 328839 24011 -96688 -81367 254795
$$ packed form
18528D7373M3450A4587R3288a00961J6297A65370J65290a48921e8117b5421k70674
18517b96095J23266J1025d6639A15493d1201B37482i7055j15358F0889c6030q435
18506d4465k2703k05887f6827J154j0863J1307B05083H7894b08352J5909e859
18494a58783j41448a1511k77026J41947H280N5900a54462n1578k6517Q3939F0475
18482C49771a1665j61527B64421d0118m8300k76491B96221e234H7252J82191d3353
18470F5312J09082a50447G9620b55641J20400k05383I1956a27477I6264k0839
18460G5425Q8229p2217A3171J24964d81405e3464A23564e3044b0309r0279K7615
18449h2973I3864a06174g324k68850H3845k0553K65547B4011i6688J5321B54795
$$ plain form
18437 -191984 -16764 -197226 50621 407340 -46595 171779 183194 -92530 -22081 -1591 259781
18425 -66632 134505 -225841 73707 -216432 61693 -104605 -163736 -44925 155668 -79236 116855
18413 -7377 15376 -223117 69509 -247725 -189715 26230 -5737 -120017 -257733 255945 -268233
18401 -79658 -136837 304495 -253230 104524 109690 -98674 36367 -56623 130317 -199865 -247964
18390 -247964 -33138 -85151 210350 74816 -97682 -31606 -139288 -25099 2748 94579 -135041
18378 -144504 -132974 7143 218531 95510 332754 -285141 41079 91594 -185608 -211947 98048
18366 -206473 22291 -106216 120317 -119076 -315905 -90021 39191 310790 8077 89748 -10547
18354 -93839 218202 -50105 54265 86682 -376495 -216781 -121474 237003 -85340 67032 -22631
$$ packed form
18437a91984a6764j80462E0621L56719d6595A71779J1415i2530b2081a591B59781
18425f6632A34505b25841G3707b16432F1693a04605n9131d4925A55668g9236A16855
18413g377A5376b23117F9509b47725N8010B6230e737j14280j37716B55945b68233
18401g9658n7179C04495b53230A04524N166i8674C6367e6623A30317a99865m8099
18390b47964c3138n2013B10350G4816i7682c1606j07682b5099B748R1831a35041
18378a44504J1530G143K11388I5510K37244b85141D1079N0515a85608k6339I8048
18366b06473B2291a06216A20317a19076j96829i0021C9191K71599H077Q1671a0547
18354i3839B18202e0105E4265L2417c76495J59714R5307B37003h5340F7032b2631
$$ plain form
18342 20926 -254949 -7137 -62670 -274574 -207273 -11492 181233 -324789 74865 -335469 -179304
18331 -179304 -232616 -555385 -119803 -117475 -5 9655 406526 137210 -346920 -162278 -46988
18319 -360457 -140879 -115677 118355 98097 -176231 -164052 -231251 12684 105834 35864 51268
18308 51268 -20738 -102996 -118188 -405832 1533 -184897 -309247 -136022 -90023 -237116 72173
18296 -149532 -262741 39931 459 -233731 387646 -82878 106212 41294 -58365 -74209 24270
18284 57287 194381 -253864 -140157 -60967 -169530 -295045 50163 -12270 -155592 -23855
18273 112894 41360 137777 -25013 -5673 198712 5133 -308239 -129202 105577 73456 -106956
18261 -134020 61947 -35477 98179 -30317 109973 -55872 -32587 28446 324719 -182645 -103319
$$ packed form
18342B0926b54949g137n5533k11904O7301a1492A81233c24789G4865c35469J56165
18331a79304n3312l22769a19803K328eI655L96871A37210c46920a62278d6988
18319c60457a40879K5202A18355k0258a76231J2179o7199A2684R3150C5864J5404
18308E1268b0738q2258j5192k87644A533a84897j24350a36022M5999j47093G2173
18296a49532j13209C9931D59b33731C87646h2878A06212D1294e8365j5844B4270
18284E7287J37094b53864J13707f0967j08563j25515E0163a2270j43322b3855
18273A12894D1360R6417b5013e673A98712E133c08239a29202A05577l2121a06956
18261a34020F1947c5477I8179c0317A09973e5872K3285B8446K96273a82645P9326
$$ plain form
18250 -103319 -331201 53807 271255 -106822 -356162 -160995 407347 -232243 93460 -127981
18239 -335987 207716 -110678 4386 65193 200483 -8556 48953 81909 -244147 -351374 -234619
18228 -234619 -128716 103782 277468 -279995 -272637 45520 44236 37724 -189042 -352525 -377359
18217 -377359 -96079 -33449 -153721 298690 -4879 443096 -335144 -256251 -1556 -74563 -49328
18206 -49328 38390 70711 90804 1564 -244712 143631 36926 12512 -30111 -80233 -22229
18194 -134550 -208616 36218 -229081 146132 -328193 5773 -83357 -287740 132604 -150612
18183 131116 -259278 138046 -59131 -30777 -346079 135936 111170 -199568 -325200 -18653
18172 -42113 -75044 20222 194435 94501 9056 303879 177718 -222026 50434 -11942 75953
$$ packed form
18250a03319k27882E3807K17448a06822k49340a60995D07347b32243I3460a27981
18239c35987B07716a10678D386O0807J35290h556D8953L2956b44147j07227J16755
18228b34619J05903A03782J73686b79995P358D5520j284o512a89042j63483k4834
18217c77359i6079c3449j20272B98690d879D43096c35144P8893a556p3007K5235
18206d9328C8390L2321K0093A564b44712A43631C6926A2512c0111n0122b2229
18194a34550p4066C6218b29081A46132c28193E773h3357k04383A32604a50612
18183A31116b59278A38046e9131K8354l15302A35936k4766a99568j25632a8653
18172d2113l2931B0222J74213I4501I056K94823j26161b22026E0434a1942G5953
$$ plain form
18160 73833 -94146 -77846 -89847 -42893 -104233 228563 -85722 -106358 69689 114431 -121249
18148 -88256 207235 22351 -251548 -80755 -221839 -244662 -175238 91984 -329693 -227863 -40689
18136 -9432 5880 -171533 132004 -69196 -298346 -272121 -73309 -69147 -354618 -374618 -146079
18124 124979 -102296 -135658 7847 66560 -68001 -26974 8294 -706 119468 -292054 25902 -69623
18111 225269 319188 45526 -52626 268535 -140159 -71413 -395828 86310 205915 147132 25301
18099 56255 -89151 5677 -20040 -183986 12584 -203284 -101988 -162507 -85500 278377 103171
18087 128222 144268 -82966 -14975 -72049 81747 -238817 -46946 -361704 -344049 373 -2654 -163810
18075 -163810 -109523 -144435 -13496 -138840 321141 -186919 24132 -69406 -224753 -147059 -40354
$$ packed form
18160G3833i4146J6300j2001d2893o1340B28563h5722k0636F9689M4742a21249
18148h8256B07235B2351b51548h0755j41084k2823O9424I1984c29693J01830d0689
18136i432E880a71533A32004f9196k29150K6225g3309M162k85471k0000a46079
18124A24979a02296l3362G847N8713f8001b6974H294g06A19468b92054B5902f9623
18111B25269R3919D5526e2626B68535a40159O8746l24415H6310J19605n8783B5301
18099E6255h9151E677b0040j63946A2584b03284J01296o0519P7007B78377A03171
18087A28222J6046h2966a4975n7074H1747b38817d6946l14758J7655C73b654j61156
18075a63810N4287l4912a3496j25344C21141a86919B4132f9406j55347P7694d0354
$$ plain form
18063 -84003 -196768 -276804 -81697 181470 -267890 -24004 66554 -596435 -166399 -249391 79380
18051 -104838 -238218 173784 -21645 -261591 -222516 -28501 256833 -81086 54321 -311038
18040 151770 -118733 -40330 -39187 -200939 -144463 1670 -115703 -118677 -113933 -179217 25007 84587
18028 84587 87235 -108015 -58482 246653 22918 -166448 14322 -37031 -215684 -388770 -72002
18016 119101 83812 -245417 -115403 -544786 -147180 -39123 292424 -263820 -84168 138788
18005 6771 -104068 183627 -122513 -212964 -22920 108085 -24971 -110474 99171 10706 69578
17994 69578 9583 -64142 311790 -6177 164579 -127562 184050 -242227 48367 223213 72226
17982 -395025 5796 -304062 -73277 38368 -70589 22716 -250508 -26936 109075 -229746 -95374
$$ packed form
18063h4003j12765q0036h1697A81470b67890b4004F6554e96435a66399q2992G9380
18051a04838j33380A73784b1645k39946L9075b8501B56833h1086E4321c11038
18040A51770a18733d0330J143j61752N6476A670a15703k974M744o5284B5007N9580
18028H4587K648a08015M9533B46653B2918a66448A4322c7031j78653j73086g2002
18016A19101l5289b45417a15403m29383a47180c9123B92424b63820h4168A38788
18005F771a04068A83627a22513r0451b2920A08085b4971q5503I9171A0706N8872
17994F9578I583f4142C11790f177A64579a27562A84050b42227D8367J74846G2226
17982c95025E796c04062g3277C8368g0589B2716b50508b6936A09075b29746i5374
$$ plain form
17970 57802 158478 -77449 -108411 143848 -192922 127015 -50345 -198754 422496 51452
17959 182398 214694 87309 95789 32194 109534 -138323 206847 92923 -58148 56880 -96626
17947 -160864 -138608 16719 -267570 -394351 146372 -61055 37172 270040 91190 -196337
17936 -59863 -197734 -70483 -104277 229351 -271589 -16538 46307 257463 -117680 -358082
17926 -358082 143563 268672 -9161 188489 -180567 206446 -62428 -138478 -103280 251907
17915 214745 5496 -179736 -3409 -44555 80471 274590 -16543 37416 299711 149269 -112596
17903 -97188 237424 -127354 -174412 113521 -342261 130546 -177977 -158092 -172861 -16615
17892 -183000 -150545 -192040 -83872 378106 -350788 -187224 38906 157594 229169 102190
$$ packed form
17970E7802J00676g7449l0962A43848a92922A27015e0345j48409D22496E1452
17959A82398L2296H7309Q480C2194P7340a38323B06847I2923e8148E6880i6626
17947a60864K2256A6719b67570j26781A46372f1055C7172K32868I1190a96337
17936e9863j37871g0483l3794B29351b71589a6538D6307K11156a17680k40402
17926c58082A43563J25109i161A88489a80567B06446f2428p6050L5198B51907
17915B14745E496a79736c409m1146H0471J94119a6543C7416K62295A49269a12596
17903i7188B37424a27354m7058A13521c42261A30546a77977J9885j4769a6615
17892a83000L2455m1495h3872C78106c50788J63564C8906J18688P1575A02190
$$ plain form
17881 -14961 -68579 -71346 38246 169591 220234 -84349 -86814 -449208 32064 26525 174947 -168139
17868 -20847 79611 -119772 211210 -45253 151508 -103230 6327 -56219 110537 -68035 93200
17856 -28289 -155053 147285 135990 -66298 -120450 -124308 -160615 143250 -33289 -68206 28504
17844 66356 -316000 -82444 55572 -127524 313256 -374535 70016 153347 -28420 173969 -134443
17832 -523135 -1213 -132422 339964 -86361 14019 -226164 -120266 230277 -112232 45949
17821 -18995 137295 -27901 244505 11452 242207 -179295 -62901 -20213 30223 -18288 -58816
17810 -58816 -38245 97789 94293 -189765 -118150 71743 -10662 222652 -40070 41658 81566
17799 81566 -114652 -130760 223437 -120032 326890 267072 -177941 37972 -14091 196432
$$ packed form
17881a4961n3618k767C8246J31345N0643h4349k465l62394C2064n539J48422a68139
17868b0847G9611a19772B11210d5253A51508a03230F327e6219A10537f8035I3200
17856b8289j26764A47285j1295f6298n4152l858l6307A43250c3289l4917B8504
17844F6356c16000h2444E5572a27524C13256c74535G0016Q3331b8420A73969a34443
17832e23135a213j31209C39964h6361A4019b26164J05898B30277a12232D5949
17821a8995A37295b7901B44505A1452K30755a79295f2901b0213C0223a8288m0528
17810e8816K0571I7789l496a89765P1615G1743a0662B22652d0070D1658L9908
17799H1566a14652j6108B23437a20032C26890n9818a77941C7972a4091A96432
$$ plain form
17788 -923 -179959 -17193 -29218 -194416 -117598 273172 359111 252480 -100325 -100997 16907
17776 92256 157361 -78639 -188258 144384 221384 72369 43534 -293626 -36013 -77719 -221576
17765 -221576 22719 237547 -174640 52119 222653 -71806 -77361 92655 60729 195319 -307
17753 -149102 -227609 143236 177453 146900 383664 -209304 -193987 7400 -171774 76738 131854
17742 131854 -49859 -253303 -40125 196971 -13912 97823 -477485 87638 -330866 2639 91636
17731 91636 161370 327883 21106 354199 -66707 -139515 52024 220697 -169034 240928 151909
17720 151909 376264 -90232 -16656 57641 439773 339165 57071 -7925 -31333 -315798 -13370
17708 26168 -117010 -159116 51813 36728 34126 357471 -183744 -48417 -29643 -84492 -1468
$$ packed form
17788i23j79036a7193j2025j65198P6818B73172Q5939j06631a00325o72A6907
17776I2256O5105g8639j09619A44384P7000G2369k8835b93626c6013m1706j43857
17765b21576B2719K14828a74640E2119J70534g1806n555I2655l1926J34590c07
17753a49102p8507A43236L4217l0553K36764b09304J5317G400a71774G6738N5116
17742A31854d9859k03444d0125A96971a3912I7823d77485H7638c30866B639Q8997
17731I1636O9734J66513B1106L33093f6707p2808E2024J68673a69034B40928q9019
17720A51909K24355i0232a6656E7641L82132j00608E7071g925k3408k84465a3370
17708B6168a17010m2106E1813j5085k602L23345a83744d8417J8774n4849a468
$$ plain form
17696 121885 -147357 50660 -67226 -174886 -216450 190584 -24410 -284971 -140943 -44648
17685 533340 73610 28319 -239618 183967 -264670 65621 174846 -93695 -265101 -184041
17675 -184041 -148481 -234329 497450 -78161 -26616 -13977 179990 -19532 72102 26863 292988
17664 292988 149797 62155 -128809 234165 11495 183320 -277957 -309038 -181155 -40610
17653 225060 -104051 127262 42510 212227 479073 -133601 -131669 -35570 -37088 88935 250751
17642 250751 106093 -140073 -42143 -86139 -213836 -149015 -84073 35830 -182907 -102885 111304
17630 143083 -191523 -126597 -55717 -79728 -281864 270832 -37616 158411 116954 196618 114151
17619 114151 -308220 109335 -91844 -176457 116322 117999 -179993 -65415 10788 -70095 -36927
$$ packed form
17696A21885a47357E0660f7226j07660m1564A90584b4410k60561a40943d4648
17685E33340G3610B8319b39618A83967b64670F5621J09225i3695j71406Q1060
17675a84041L5560q5848D97450g8161b6616J2639A79990a9532G2102B6863K66125
17664B92988j43191F2155a28809B34165A1495J71825b77957l1081J27883d0610
17653B25060a04051A27262D2510J69717K66846a33601J932c5570j518H8935J61816
17642B50751A06093a40073d2143m3996j27697O4821O4942C5830a82907Q0022A11304
17630A43083a91523O4926e5717k4011k02136B70832c7616A58411m1457P9664q2467
17619A14151c08220A09335i1844q4613A16322J677a79993f5415A0788g0095L3168
$$ plain form
17608 -36927 -57632 -209494 186957 -35937 205087 -170217 -5064 94798 -3250 -113878 61628
17596 102211 -25735 -170312 -40687 -19985 110643 -168587 -63242 -23530 136529 156255 304778
17585 304778 -98129 -180118 -223007 -22088 154720 104269 -69863 85473 -28516 -196872 190259
17573 -161629 153915 50974 68230 100820 121960 115585 -130219 78999 21098 184501 188176
17562 188176 -77808 -10803 -44323 100571 -102746 132029 -275315 103160 11875 -9990 -122211
17551 -122211 -218365 126426 19029 124533 182451 28587 152199 163550 -121089 376637
17540 -186474 45810 258369 38941 34481 251842 -260629 61584 246320 256844 101767 183906
17529 183906 68922 123702 -55982 -91704 -160559 28156 -133289 199183 -117339 269610 8912
$$ packed form
17608c6927k0705j51862A86957c5937B05087a70217e064I4798c250j10628F1628
17596A02211b5735j44577d0687a9985A10643a68587f3242b3530A36529J9726J48523
17585C04778i8129q1989m2889b2088A54720n0451f9863H5473b8516j68356A90259
17573a61629A53915E0974J7256L2590K1140o375a30219G8999B1098J63403L675
17562A88176g7808a0803l3520A00571a02746A32029b75315A03160A1875i990j12221
17551a22211r6154A26426A9029J05504N7918B8587J23612J1351a21089C76637
17540a86474D5810K12559C8941m460K17361b60629F1584J84736J0524A01767Q2139
17529A83906F8922N4780e5982l5722o8855B8156a33289A99183a17339B69610H912
$$ plain form
17517 255348 169735 -369716 276478 -116658 30798 201610 -110510 198403 65276 -21590
17506 43713 89110 208304 -22276 211362 -148034 143237 52012 216792 -258546 75456
17495 -160961 -16783 -88686 125461 -79104 452880 182434 -105059 -103410 75975 121904 -10879
17483 55047 -139050 -72897 263959 45503 59580 -199939 -155199 40568 -53638 2149 17484
17472 17484 384558 -157899 169111 -37955 231959 -195179 -111679 292160 -155925 125446
17461 214946 -51110 -65214 254731 332484 226998 410687 378157 99867 -75059 -45857 371283
17449 68585 171313 143014 258728 207581 92256 200272 -17807 262269 165605 174603 140469
17438 140469 23971 170949 79791 -10350 630807 -174478 485230 162182 -42036 43355
$$ packed form
17517B55348q5613c69716B76478a16658C0798J70812a10510A98403F5276b1590
17506D3713M5397J19194b2276B11362a48034A43237E2012J64780b58546G5456
17495a60961a6783p1903A25461g9104D52880A82434a05059J649G5975M5929a0879
17483E5047a39050O6153B63959D5503J4077a99939M4740D0568e3638B149J5335
17472A7484L67074a57899A69111c7955B31959a95179Q3500B92160a55925A25446
17461B14946e1110j4104B54731P7753j05486J83689l2530I9867g5059K9202C71283
17449F8585J02728k8299J15714n1147I2256J08016a7807B62269r6664Q998l4134
17438A40469B3971J46978G9791a0350F30807a74478D85230A62182d2036D3355
$$ plain form
17427 92958 154702 441008 -132718 -42125 138447 479608 294228 338914 289376 328388 208755
17416 208755 7013 325726 335405 5823 393255 755745 34585 43034 395723 101494 327961
17405 327961 175063 133996 137539 349509 543675 421896 91364 60359 -66619 369633 326987
17394 326987 251973 189103 460171 397532 -197051 297838 6675 223151 -76394 56053 170568
17383 170568 216474 361667 404460 245671 74855 182987 17919 -109607 504126 1477 121511
17372 121511 80512 -56247 8922 100562 342734 392230 246071 -122751 116872 -10966 -17959
17361 -17959 35105 139387 -3376 31934 227312 31501 -4927 397423 62053 7655 99132 204508
17349 204508 161056 422079 76441 -101970 276791 160137 415292 -262628 204447 106302
$$ packed form
17427I2958O1744K86306a32718d2125A38447L41161j85380M4686m9538L9012j19633
17416B08755G013L18713R679E823L87432L62490C4585Q449L52689A01494K26467
17405C27961j52898m1067L543K11970J94166j21779I1364l1005f6619C69633m2646
17394C26987p5014o2870K71068o2639a97051B97838F675K16476g6394E6053J14515
17383A70568M5906J45193M2793j58789G4855J08132A7919a09607E04126A477J20034
17372A21511m0999e6247H922R1640K42172M9496j46159a22751A16872a0966o993
17361a7959C5105J04282c376C1934J95378C1501d927C97423F2053G655R1477J05376
17349B04508m3452K61023G6441a01970B76791j16654K55155b62628B04447r8145
$$ plain form
17339 106302 127846 99291 -32613 304950 95910 -25543 -82389 -132056 -70628 148904 16519
17327 -102443 214539 258159 243499 17506 128970 223790 326128 231405 167830 141081 313754
17316 313754 -13953 16343 -167565 175100 221707 218480 46387 25554 29387 229521 70916
17304 136661 446652 242357 -116401 -12134 281181 96976 352104 109373 52877 77941
17294 77941 -13408 -57850 225214 226773 289251 456428 343986 83169 106839 314377 423644
17283 423644 247838 86986 317413 80808 95268 89080 140872 173081 357048 112932 38558
17271 89914 376835 75795 147482 243140 22839 -95280 -88922 523742 130366 -158837 206259
17259 28254 425548 139254 -205250 297816 -64588 -242403 -29656 257459 167023 358176
$$ packed form
17339A06302K1544k8555c2613C04950I5910b5543n6846m9667O1428A48904A6519
17327a02443B14539M3620j4660A7506J11464R4820J02338r4723o3575k6749J72673
17316C13754a3953A6343a67565A75100M6607l227D6387k0833L833K00134G0916
17304A36661L09991k04295a16401a2134B81181I6976K55128A09373E2877K5064
17294G7941a3408m4442B25214J559O2478J67177j12442H3169K3670K07538J09267
17283D23644j75806H6986K30427H0808J4460o188N1792L2209J83967A12932C8558
17271H9914K86921G5795P1687R5658B2839i5280O358E23742A30366a58837B06259
17259B8254L97294A39254b05250B97816f4588j77815b9656B57459r0436J91153
$$ plain form
17249 358176 -124618 -77551 309525 299303 186621 82244 144754 199079 376481 133372
17238 360938 -87413 113009 -56575 114112 192398 -85253 464925 163104 213896 149430 111960
17227 111960 118776 190671 101160 -50855 3293 11494 -131584 126135 183058 103730 308334
17216 308334 580240 114761 218481 208482 49837 29728 51864 267175 29097 169909 514644
17205 514644 423716 186402 5082 360871 177036 -32744 361350 -202 -1928 234898 7460
17193 246660 -1914 -1024 -100411 84714 548326 -15874 351847 -155650 243980 461269 634897
17182 634897 -2291 497183 293717 186886 130929 -63872 273625 155878 -66218 3019 448611
17171 448611 124602 364130 -125738 638777 198747 326841 658125 335985 258973 34831
$$ packed form
17249C58176a24618M7067C09525j0222j12682H2244O2510N4325J77402A33372
17238C60938h7413A13009e6575A14112P8286h5253D64925A63104N0792o4466l7470
17227A11960O816P1895q9511e0855C293Q201a31584A26135N6923p9328K04604
17216C08334K71906A14761J03720r999D9837k0109K2136K15311B9097J40812L44735
17205E14644r0928A86402E082L55789A77036c2744C61350b02j726B34898G460
17193B46660a914Q90r9387H4714M63612a5874C51847a55650B43980K17289J73628
17182F34897b291D97183k03466j06831n5957f3872B73625j17747f6218C019M45592
17171D48611A24602K39528a25738F38777A98747J28094L31284l22140p7012C4831
$$ plain form
17160 359046 427636 297330 213619 305984 479907 514490 418991 200400 699550 321031
17149 278451 188985 429726 526865 -90626 390035 349875 295172 196428 267020 185039 339777
17138 339777 597874 4221 289013 31726 283242 912 196503 367934 87482 436179 39832
17126 586847 401181 367875 454648 184028 427324 428218 342114 449488 208326 446184 380670
17115 380670 -33090 416176 61921 423789 130818 521769 487241 203822 380662 301876
17105 301876 214984 586083 276454 372145 539822 359771 315123 367026 286568 126012
17094 545107 192976 603732 298414 534263 506521 608317 122870 421587 148302 346019
17084 346019 325078 755702 543442 190551 369185 710905 337844 223635 614161 123980
$$ packed form
17160C59046O8590j30306q3711R2365J73923L4583r5499B00400M99150C21031
17149B78451q9466K40741R7139i0626C90035m0160n4703r8744P0592q1981J54738
17138C39777K58097D221K84792C1726K51516I12J95591J71431H7482L48697C9832
17126E86847j85666l3306Q6773A84028K43296Q94q6104J07374B08326K37858o5514
17115C80670c3090D16176F1921L61868A30818L90951l4528B03822J76840p8786
17105C01876q6892L71099B76454R5691J67677j80051m4648N1903q0458A26012
17094E45107A92976M10756B98414K35849k7742J01796A22870K98717A48302J97717
17084C46019k0941M30624k12260A90551J78634L41720C37844j14209L90526A23980
$$ plain form
17073 624293 415976 306442 69028 455799 393000 270229 514931 419603 444930 250447
17063 250447 476841 454390 244041 420672 616869 381407 416365 822761 643792 346218
17053 346218 647305 730743 742112 369063 288046 508518 722702 589545 686780 371000
17043 371000 610617 618331 650582 726305 679481 714543 477371 418661 585998 850161 595188
17032 595188 822572 659663 854548 673145 472573 303522 303821 609409 549755 300947
17022 300947 333352 543327 510192 351959 428953 614819 530787 865261 612424 349613
17012 349613 953375 444900 539863 362223 677743 450080 529422 343334 733522 520801
17002 520801 538380 479462 727763 746323 898403 777735 884201 608671 457324 983320
$$ packed form
17073F24293k08317j09534F9028L86771o2799j22771K44702r5328K5327j94483
17063B50447K26394k2451k10349J76631J96197k35462L4958M06396j78969k97574
17053C46218L01087Q3438J1369C69063q1017K20472K14184j33157R7235l15780
17043C71000K39617P714L2251P5723m6824L5062k37172n8710J67337K64163k54973
17032E95188K27384j62909J94885j81403k00572j69051K99L05588n9654k48808
17022C00947L2405K09975l3135j58233P6994J85866q4032L34474k52837k62811
17012C49613O03762D44900R4963j77640L15520k27663P9342j86088L90188k12721
17002E20801J7579n8918K48301J8560J52080j20668J06466k75530j51347N25996
$$ plain form
16992 983320 642999 589124 660094 718542 663241 886192 657392 1080691 815956 627905
16982 627905 600371 665063 640419 769292 856063 860420 853085 740780 1089871 913387 757550
16971 757550 821759 1133864 721388 664723 863548 733981 613587 1113515 761885 660412
16961 660412 613599 816265 936728 803591 1207134 719795 845776 873661 1063648 1037355
16951 1037355 913869 1070192 848998 956792 1189836 1109510 817398 1206887 716710 968678
16941 968678 946695 689212 1024571 878500 999913 909308 1076291 1287822 875068 1154275
16931 1154275 1203398 1204835 1069650 1148169 1056633 1131272 1470513 1208054 1299878 1283254 1451413
16920 1451413 1544603 1239314 1201182 1346380 1471713 1275782 1039760 1452527 1628241 1209163
$$ packed form
16992I83320l40321n3875P0970N8448n5301K22951k28800M23299k64735j88051
16982F27905k7534O4692k4644J28873Q6771M357p335j12305L49091j76484j55837
16971G57550O4209L12105m12476n6665J98825j29567j20394M99928l51630j01473
16961F60412m6813K02666J20463j33137M03543m87339J25981K7885J89987k6293
16951A037355j23486J56323k21194J07794K33044q0326k92112L89489m90177K51968
16941I68678k1983k57483L35359j46071J21413r0605J66983K11531m12754K79207
16931A154275M9123J437j35185P8519r1536P4639L39241k62459R1824j6624J68159
16920A451413R3190l05289l8132J45198J25333j95931k36022M12767J75714m19078
$$ plain form
16910 1209163 1560223 1565320 1543875 1285390 1406049 1428401 1552560 1480040 1547954 1490109 1455290
16899 1455290 1637547 1730792 1787390 1833348 1375835 1572935 1492198 1514326 1609611 1571691 1616003
16888 1616003 1534812 1530506 1778417 1881329 1671848 2009944 1678087 2036272 1752663 2066666
16878 2066666 2383826 1928953 1907316 2261260 1813210 2360682 2074152 2040681 2081959 2242374
16868 2242374 2003288 2425289 2145372 2485654 2094770 2131381 2208928 2204350 2461012 2566016
16858 2566016 2509246 2397915 2483592 2359036 2729958 2495420 2613551 2615184 2836894 2702133
16848 2702133 2898195 2858546 2808796 3011369 2589872 3006574 2926743 2960980 2947809 3146601
16838 3146601 3299358 3006190 3239723 3505944 3003324 3599722 3601959 3773613 3790537 3555038
$$ packed form
16910A209163L51060N097k1445k58485J20659K2352J24159p2520O7914n7845l4819
16899A455290J82257R3245N6598M5958m57513J97100q0737K2128R5285l7920M4312
16888A616003q1191m306K47911J02912k09481L38096l31857L58185k83609L14003
16878B066666L17160m54873k1637L53944m48050N47472k86530l3471M1278J60415
16868B242374k39086M22001k79917L40282l90884L6611P7547m578K56662J05004
16858B566016n6770j11331Q5677j24556L70922k34538J18131J633K21710j34761
16848B702133J96062l9649m9750K02573m21497M16702p9831L4237j3171J98792
16838C146601J52757k93168K33533K66221n02620N96398K237J71654J6924k35499
$$ plain form
16828 3555038 3924363 3694860 3899548 3528185 3936806 4068758 3995858 4078388 4072105 4121886
16818 4121886 4161737 4375033 4473141 4445208 4168799 4764176 4697977 5124557 4745349 5121039
16808 5121039 4848189 5024699 5355441 5492607 5181678 5501820 5628798 5543463 5895651 5758068
16798 5758068 5906954 6038711 6438551 6276811 6482958 6049734 6600162 6918232 6847975 7145970
16788 7145970 7123254 7070498 7446037 7991115 7558337 8005727 8301534 8256343 8703887 8924219
16778 8924219 8880434 8913293 9314563 9496837 9606130 9744064 10025466 10002139 10951663 10829702
16768 10829702 11344893 11511554 11579368 12173093 12421126 12430446 13226178 13043605 13803948 14079897
16758 14079897 14329879 14746018 15134991 15655590 15871003 16626964 16596652 17370042 18357483
$$ packed form
16828C555038L69325k29503K04688l71363M08621J31952p2900Q2530o283M9781
16818D121886L9851K13296R8108k7933k76409N95377o6199M26580l79208L75690
16808E121039k72850J76510L30742J37166l10929L20142J26978q5335L52188j37583
16798E758068J48886J31757L99840j61740K06147m33224N50428L18070p0257K97995
16788G145970k2716n2756L75539N45078m32778M47390K95807m5191M47544K20332
16778H924219m3785L2859M01270J82274J09293J37934K81402k3327R49524j21961
16768A0829702N15191J66661O7814N93725K48033R320P95732j82573P60343K75949
16758A4079897K49982M16139L88973N20599K15413P55961l0312P73390R87441
$$ plain form
16749 18357483 18874994 19136679 19677291 20317011 21294210 21766589 22361554 23377668 24231889
16740 24231889 25056690 25845752 26660698 27488415 28340851 29749153 30714643 32273942 33401109
16731 33401109 34327854 35558553 36837413 38532013 39980760 41925504 43543624 44991998
16723 44991998 47016301 48986437 50974407 53079841 55530084 58068673 60459490 62924894
16715 62924894 65875509 68912542 71845034 75118352 78434433 81815544 84904436 88492670
16707 88492670 92219528 96014698 99680584 103170654 107318707 110587796 114091455 117380078
16699 117380078 120733304 123659589 126205349 128341700 130620536 131821140 132687788 133261233
16691 133261233 133521313 133006070 132440760 130707051 129311928 126734615 124418976 121616983
$$ packed form
16749A8357483N17511K61685N40612O39720R77199M72379N94965J016114Q54221
16740B4231889Q24801P89062Q14946Q27717Q52436J408302R65490J559299J127167
16731C3401109R26745J230699J278860J694600J448747J944744J618120J448374
16723D4991998K024303J970136J987970K105434K450243K538589K390817K465404
16715F2924894K950615L037033K932492L273318L316081L381111L088892L588234
16707H8492670L726858L795170L665886L490070M148053L269089L503659L288623
16699A17380078L353226K926285K545760K136351K278836J200604Q66648N73445
16691A33261233K60080n15243n65310j733709j395123k577313k315639k801993
$$ plain form
16683 121616983 118604905 115330385 112168836 108758692 104673036 100909995 97355935 93608536
16675 93608536 89754154 85987692 82848166 79062334 75976998 73149932 69957313 66823336
16667 66823336 63767839 61354927 58593287 56317637 54048309 51873486 49201307 47488144
16659 47488144 45675746 43576216 42214230 40353769 38801847 37207509 36081490 34802873
16651 34802873 33412332 32014224 30669743 29902412 28934078 27689729 26854750 25968620 25027513
16642 25027513 24160161 23441514 22737621 21887120 21186040 20570065 20222148 19398351 18542265
16633 18542265 18321735 17903320 16991913 16934763 16206214 15729051 15281236 14850710 14296639
16624 14296639 14040001 13612663 13473326 13246091 12776505 12335222 12305745 12006590 11658514
$$ packed form
16683A21616983l012078l274520l161549l410144m085656l763041l554060l747399
16675I3608536l854382l766462l139526l785832l085336k827066l192619l133977
16667F6823336l055497k412912k761640k275650k269328k174823k672179j713163
16659D7488144j812398k099530j361986j860461j551922j594338j126019j278617
16651C4802873j390541j398108j344481p67331r68334j244349q34979q86130r41107
16642B5027513q67352p18647p03893q50501p01080o15975l47917q23797q56086
16633A8542265k20530m18415r11407n7150p28549m77163m47815m30526n54071
16624A4296639k56638m27338j39337k27235m69586m41283k9477k99155l48076
$$ plain form
16615 11658514 11263315 10870112 11065174 10572681 9947171 10111480 9747703 9374479 9372453 9276763
16605 9276763 8901281 8844648 8816419 8509083 8118813 8205259 7939099 7658031 7783708 7473738
16595 7473738 7518730 7124703 7196445 6622173 6677118 6483682 6255245 6505179 5924800 6195752
16585 6195752 6074854 5931687 5860180 5798807 5516102 5447095 5450503 5320109 5083512 4778569
16575 4778569 4809704 5148959 4775544 5158351 4817342 4680778 4726329 4733071 4419351 4545268
16565 4545268 4123274 4286035 4094963 4043426 3880460 4041891 4017408 3800638 3944615 3412090
16555 3412090 3567706 3635298 3871391 3529648 3861564 3538621 3512512 3351048 3540482 3360817
16545 3360817 3280716 3139372 3418373 3165586 2981805 3069275 2893748 2703200 2754582 3051056
$$ packed form
16615A1658514l95199l93203J95062m92493o25510J64309l63777l73224k026r5690
16605I276763l75482n6633k8229l07336l90270Q6446k66160k81068J25677l09970
16595G473738M4992l94027P1742n74272N4945j93436k28437K49934n80379K70952
16585F195752j20898j43167p1507o1373k82705o9007L408j30394k36597l04943
16575D778569L1135L39255l73415L82807l41009j36564M5551O742l13720J25917
16565D545268m21994J62761j91072n1537j62966J61431k4483k16770J43977n32525
16555C412090J55616O7592K36093l41743L31916l22943k6109j61464J89434j79665
16545C360817q0101j41344K79001k52787j83781Q7470j75527j90548N1382K96474
$$ plain form
16535 3051056 2981548 2710136 2405238 2736284 2777973 2654998 2610629 2494053 2625365 2592344
16525 2592344 2141457 2660637 2716360 2567320 2177170 2378246 2262250 2048973 2438994 2254709
16515 2254709 2157934 2515100 2088010 1975371 2262457 2242256 2076996 1977564 2190864 2150730
16505 2150730 2183723 1959813 1762311 1585767 1980745 1881458 1910759 2087703 1872011 1904252
16495 1904252 1962860 1876745 1869457 1537661 1476634 1782694 1774397 1336439 1594080 1649875 1447820
16484 1447820 1701603 1609466 1661662 1783449 1548000 1735798 1638408 1949830 1327529 1442817
16474 1442817 1528092 1603372 1435791 1365363 1761755 1215757 1327377 1412342 1431701 1472924
16464 1472924 1400388 1314353 1483670 1215675 1281811 1412108 1308471 1214170 1481382 886656
$$ packed form
16535C051056o9508k71412l04898L31046M1689j22975m4369j16576J31312l3021
16525B592344m50887N19180N5723j49040l90150K01076j15996k13277L90021j84285
16515B254709r6775L57166m27090j12639K87086k0201j65260r9432K13300m0134
16505B150730L2993k23910j97502j76544L94978r9287K9301J76944k15692L2241
16495A904252N8608q6115p288l31796o1027L06060q297m37958K57641N5795k02055
16484A447820K53783r2137N2196J21787k35449J87798r7390L11422o22301J15288
16474A442817Q5275P5280j67581p0428L96392n45998J11620Q4965J9359M1223
16464A472924p2536q6035J69317k67995O6136J30297j03637r4301K67212n94726
$$ plain form
16454 886656 1066490 1377888 1428003 1290388 750426 1193141 939734 1098828 1033348 1232558
16444 1232558 1229184 1059918 1555658 1062322 1079674 977111 1350908 968453 1220015 1372946
16434 1372946 946733 847600 1000515 1129861 826775 1108767 784021 727411 1006212 1141445
16424 1141445 1073327 794157 838405 1061547 1103712 1173860 643288 1369794 587357 788643
16414 788643 853604 1286901 1004951 682411 800085 831256 729411 1085251 853005 880640
16404 880640 712005 690385 432708 461941 693100 1066110 577134 675169 530663 943276
16394 943276 900068 1071312 870079 686699 546644 686937 712587 527809 840686 748939
16384 748939 588894 543012 734547 736045 496948 462907 512914 809368 588008 760546
$$ packed form
16454H86656J79834L11398N0115j37615n39962M42715k53407J59094o5480J99210
16444A232558l374j69266M95740m93336J7352j02563L73797l82455K51562J52931
16434A372946m26213r9133J52915J29346l03086K81992l24746n6610K78801J35233
16424A141445o8118k79170M4248K23142M2165P0148n30572P26506E87357K01286
16414G88643O4961M33297k81950l22540J17674L1171j01845L55840k32246K7635
16404H80640j68635k1620k57677K9233K31159L73010m88976R8035j44506M12613
16394I43276m3208J71244k01233j83380j40055J40293K5650j84778L12877r1747
16384G48939j60045m5882J91535J498k39097l4041N0007K96454k21360J72538
$$ plain form
16374 760546 886096 723706 640509 1003110 509341 866289 547022 562881 419381 653336
16364 653336 410731 632083 668174 646921 671031 235891 803073 306655 531870 557736
16354 557736 732445 568793 586373 330275 311092 715191 384575 663155 655036 394969
16344 394969 655904 439369 533169 738567 301097 474240 556060 566712 207953 511344
16334 511344 428703 478124 451551 359645 429674 604732 410190 426282 704245 412899 375027
16323 375027 340829 407511 432738 155094 559409 303239 245914 406610 302002 309209 445751
16312 445751 365422 589518 110953 652214 398796 751202 336659 367777 103342 214766
16302 214766 276894 504828 401762 572765 132438 216233 557886 370894 71904 232065
$$ packed form
16374G60546J25550j62390q3197L62601m93769L56948l19267J5859j43500K33955
16364F53336k42605K21352L6091k1253K4110B35891N67182C06655K25215K5866
16354E57736J74709j63652J7580k56098j9183M04099l30616K78580q119k60067
16344C94969K60935k16535R3800K05398C01097J73143Q1820J0652B07953L03391
16334E11344q2641M9421k6573r1906P0029J75058j94542J6092K77963k91346l7872
16323C75027l4198O6682K5227A55094M04315k56170n7325J60696j04608P207J36542
16312D45751q0329K24096A10953N41261k53418L52406C36659L1118A03342J11424
16302B14766O2128K27934j03066J71003A32438Q3795L41653j86992G1904J60161
$$ plain form
16292 232065 359454 413897 199488 -27541 336360 228773 314947 428640 269262 462480
16282 462480 257145 231894 67455 350852 516095 439424 190905 353122 227600 132872
16272 132872 237171 459602 572312 570555 488783 487082 333922 399629 348852 209601 281007
16261 281007 524671 265137 333014 390561 536318 683308 499368 487025 491692 627896
16251 627896 913025 398822 171359 511285 296316 -25086 384470 165564 531591 342883
16241 342883 424644 499619 580611 534186 349418 495409 62119 213511 280648 493773 85087
16229 257102 349804 539565 395619 344181 414154 300834 210439 65976 351822 454915
16219 454915 208896 75836 117134 369710 183453 261332 350366 258163 447591 484064 294899
$$ packed form
16292B32065J27389N4443A99488b7541C36360j07587Q6174J13693j59378J93218
16282D62480k05335k5251F7455K83397J65243p6671A90905J62217j25522r4728
16272A32872J04299K22431J12710j757q1772j701j53160O5707n0777j39251P1406
16261B81007K43664k59534O7877N7547J45757J46990j83940j2343M667J36204
16251F27896K85129C98822A71359L39926k14969b5086C84470A65564L66027j88708
16241C42883Q1761P4975Q0992m6425j84768J45991F2119J51392O7137K13125H5087
16229B57102R2702J89761j43946n1438O9973j13320r0395F5976K85846J03093
16219D54915B08896G5836M1298K52576A83453P7879Q9034r2203J89428L6473j89165
$$ plain form
16208 294899 -21121 257625 184078 199393 23265 233376 136675 198038 353146 589079 199205
16196 421995 96066 335423 479424 460283 301531 576390 499079 122416 136380 17493
16185 124472 -54454 134677 95273 374919 182838 16738 126457 194833 157864 -71122 231024
16173 160499 226018 237981 216445 407064 85090 158770 -137225 95458 -2933 -163432 -75546
16161 188362 -122953 76668 57861 308628 -39 -62292 13280 125927 -14494 266845 -77451
16149 -187092 70248 223493 -140000 308733 126114 220428 355645 39699 210448 420175
16139 420175 144754 290728 -123112 -257909 -290537 75181 127655 -78113 141766 331226
16129 331226 248911 270770 9746 7562 379481 277372 120178 21176 -43486 215415 83552
$$ packed form
16208B94899b1121B57625p3547J5315B3265K10111r6701O1363J55108K35933A99205
16196D21995I6066K39357J44001j9141j58752K74859p7311A22416J3964A7493
16185A24472e4454A34677l9404K79646A82838A6738J09719O8376l6969g1122B31024
16173A60499O5519J1963k1536J90619H5090P3680a37225I5458b933j60499g5546
16161A88362a22953G6668j8807K50767c9o2253A3280J12647a4494B66845g7451
16149a87092G0248J53245a40000C08733A26114R4314J35217C9699J70749K09727
16139D20175A44754J45974a23112j34797l2628G5181N2474g8113A41766J89460
16129C31226q2315K1859I746k184L71919j02109A20178B1176d3486B15415H3552
$$ plain form
16117 38443 211238 260613 -25295 -160539 -35772 29198 318681 239058 686590 123290 567881
16106 567881 199219 284767 58325 164724 310758 43965 -69951 -151194 167751 416141
16096 416141 36501 -69364 231130 299408 -36736 -36404 204243 364095 188984 -123343 181972
16084 88663 264513 90372 359276 11589 32651 391023 162361 -226046 -43974 -103365 236326
16072 91529 -42500 -157466 -78645 59888 194474 50330 138165 -109625 -137594 -143918 -331607
16061 -331607 -29869 332727 184899 153446 120615 169906 342691 -1880 -6472 -50881 -56557
16050 -56557 289247 96430 334214 138988 157323 127849 77861 97836 -80925 58217 -273924
16038 215051 17816 -16250 75761 222330 292377 217815 -234828 260217 54651 -31621 -225951
$$ packed form
16117C8443J72795M9375b5295j35244c5772B9198K89483p9623M47532A23290M44591
16106E67881A99219Q5548E8325J06399J46034D3965f9951q1243A67751K48390
16096D16141C6501f9364B31130O8278c6736L32B04243J59852j75111a23343A81972
16084H8663J75850I0372K68904A1589K1062L58372A62361b26046d3974n9391B36326
16072I1529d2500j14966g8645E9888J34586E0330Q7835a09625k7969o324j87689
16061c31607b9869C32727j47828l1453l2831M9291J72785a880m592m4409n676
16050e6557B89247I6430K37784A38988J8335k9474m9988J9975h0925E8217b73924
16038B15051A7816a6250G5761J46569P0047p4562b34828B60217E4651c1621j94330
$$ plain form
16027 -225951 281942 220091 99870 -44110 -85244 114968 -171426 40438 179022 330674
16017 330674 -122125 44184 -47447 274624 -136919 314122 -153624 118878 72613 49464
16007 49464 -2750 -185176 -26919 66674 111788 -222601 100323 138285 127640 -81988 156433
15995 165722 -296035 151042 -180640 229928 288 131795 -28692 -39776 -62013 -121834 -11858
15983 -27719 -19150 -270660 -355296 371940 6343 36961 137889 269448 -51606 -79183 -12277
15971 -77393 -9230 -135732 -184320 -139979 74000 150087 -155369 8726 398475 -59027 133513
15959 68676 58348 160215 195755 305338 65221 77413 -109336 255742 159008 166290 62986
15947 15623 43667 -248193 -25682 12629 -376953 331311 19252 105511 195159 143648 25313
$$ packed form
16027b25951B81942o1851I9870d4110m1134A14968a71426D0438J38584J51652
16017C30674a22125D4184d7447B74624a36919C14122a53624A18878m6265k3149
16007D9464b750j82426b6919F6674M5114b22601A00323L7962j0645h1988A56433
15995A65722b96035A51042a80640B29928B88J31507b8692j1084k2237n9821a1858
15983b7719Q569k51510q4636C71940F343L0618J00928J31559e1606k7577a2277
15971g7393i230j26502m8588M4341G4000P6087a55369H726L89749e9027A33513
15959F8676j0328J01867L5540J09583F5221J2192a09336B55742r6734P282F2986
15947A5623K8044b48193b5682A2629c76953C31311A9252Q6259Q9648n1511B5313
$$ plain form
15935 -10044 48016 -225107 176411 109500 -48349 -194846 40433 -15707 -108144 150297 82526
15924 82526 62508 -135664 98974 204979 -67069 212458 -40757 -75018 -62723 -4225 150324
15912 151822 156610 89724 -103645 -102984 24645 -30172 86683 131204 149774 62719 -208612 10932
15899 -295535 -349073 79858 180629 -35442 -73490 129086 166455 272703 -303322 -26686 163242
15887 -213093 -94909 -34155 173664 -170746 317531 29748 -18042 -314204 -63336 60792 155226
15876 155226 -99541 -203983 -127674 -66781 64627 246790 125339 -79931 108417 -122944
15865 -268358 211588 -37452 -3604 48239 -106866 -161792 -126236 130083 -196460 216812 18060
15853 -38204 -41314 128105 -67857 340024 -46233 344959 -54527 9807 -979 190316 170540 -129365
$$ packed form
15935a0044D8016b25107A76411o6911d8349j46497D0433a5707r2437A50297o7771
15924H2526k0018a35664I8974J06005f7069B12458d0757l4261J2295d225A50324
15912A51822M788o6886a03645O61B4645c0172H6683M4521J8570F2719b08612A0932
15899b95535n3538G9858J00771c5442l8048A29086L7369J06248c03322b6686A63242
15887b13093i4909c4155A73664a70746C17531B9748a8042k96162f3336F0792R4434
15876A55226i9541j04442P6309O0893F4627J82163j21451g9931A08417a22944
15865b68358B11588c7452c604D8239a06866n4926L5556A30083a96460B16812A8060
15853c8204l110A28105f7857C40024d6233C44959e4527I807i79A90316j9776a29365
$$ plain form
15840 -292378 14460 -116907 -257554 -100349 205184 -228812 6289 62394 631 153752 215906
15829 215906 227798 12021 -84833 -86360 97223 5785 189749 -128147 143525 -246740 -35142
15817 154006 -451711 -255455 -20615 -64499 -163819 337112 -135349 -125025 -75920 -85299 -67870
15806 -67870 278784 -90480 -153660 -75246 -18944 41372 290229 -132641 146182 110829 59262
15795 59262 336032 -118113 -210418 -402063 317602 -70071 -63020 -15891 142639 -28256 100944
15783 -141218 -214095 91952 51546 -106046 -76637 79711 147051 -37785 -68049 15353 163628
15772 163628 140765 -135338 76223 36237 14182 86505 -244718 333689 -148389 55839 -78162
15760 116908 -108364 -157072 166607 18641 -268056 -108300 185559 108545 108620 -229152 296643
$$ packed form
15840b92378A4460a16907j40647a00349B05184b28812F289N6105F31J53121O2154
15829B15906J1892A2021h4833j527I7223E785J83964a28147A43525b46740c5142
15817A54006d51711J96256b0615m3884r9320C37112a35349J0324M9105r379J7429
15806f7870B78784i0480o3180g5246a8944D1372K48857a32641A46182l5353n1567
15795E9262K76770a18113r2305j91645C17602g0071P051a5891A42639b8256A00944
15783a41218p2877I1952m0406a06046K9409G9711O7340c7785l0264A5353J48275
15772A63628k2863a35338G6223C6237A4182P2323b44718C33689a48389E5839g8162
15760A16908a08364m8708A66607A8641b68056a08300A85559p7014P5b29152B96643
$$ plain form
15748 -47445 -26704 -135221 -137832 -155188 345768 48019 77238 -35161 -21444 -140503 -30440
15736 -9680 72873 45930 208638 -90473 -60238 147016 180788 318563 -135923 87382 -2114
15724 112957 86436 128158 214430 -96666 83080 -207539 -171545 241006 -21864 -951 -28727
15713 -28727 -17775 -513829 85176 -282929 67878 -20376 -22008 247059 330514 141306 -24922
15701 -88853 -71943 -136478 -94350 -21515 -111098 -18861 -392509 -198710 110933 96015 -45128
15689 130018 -342783 116075 14329 138069 148673 -173498 -120006 65773 -7228 -42812 -168625
15678 -168625 140249 76576 -205005 -402494 -279897 -7192 -128267 -57188 -129584 45973 -503765
15666 -98466 -28179 212859 218974 46883 -30749 161795 -112123 -26676 -198525 130981 182257
$$ packed form
15748d7445K0741j08517k611j7356C45768D8019K9219c5161J3717j19059c0440
15736i680G2873k6943J62708i0473L0235A47016L3772J37775a35923H7382b114
15724A12957k6521M1722Q6272i6666H3080b07539L5994B41006b1864i51k7776
15713b8727J0952m96054H5176b82929F7878b0376j632B47059Q3455A41306b4922
15701h8853J6910o4535M2128b1515q9583a8861l73648J93799A10933j4918d5128
15689A30018c42783A16075A4329J23740J0604a73498N3492F5773g228l5584j25813
15678a68625A40249o3673b05005j97489J22597g192j21075e7188p2396D5973e03765
15666i8466b8179B12859O115D6883c0749A61795a12123b6676j71849A30981N1276
$$ plain form
15655 182257 2484 -159592 6523 272297 -237402 -51965 -12453 -196284 198990 -174524 27084
15643 243280 -305724 -148634 135221 -218885 -89362 -108506 55566 -158165 -128674 113908
15632 -21240 30343 -208371 -12785 59164 56834 -76097 142900 272892 29486 140260 -107658
15620 -29658 -164530 148593 125170 -273570 268731 91096 12716 -243713 -95615 -92304 63211
15608 -122714 105572 -114192 -100627 51711 12425 -336150 132731 -237840 403602 190415
15597 -8957 -346590 -43662 173414 -45404 102522 37168 -163439 -39533 -245089 -182909 -65365
15585 217196 51878 -183289 -1769 -32778 58891 -166694 129690 88246 7977 -243563 -151096
15574 -151096 92724 55457 80926 -139926 53750 -119299 -101580 -101301 -99355 -121545 -21093 -112370
$$ packed form
15655A82257B484a59592F523K65774b37402e1965a2453j83831A98990a74524B7084
15643B43280c05724a48634A35221b18885h9362j9144E5566a58165K9491A13908
15632b1240C0343b08371a2785E9164k330g6097A42900J29992B9486J10774a07658
15620b9658j34872A48593k3423b73570B68731I1096A2716b43713i5615L311F3211
15608a22714A05572a14192J3565E1711A2425c36150A32731b37840D03602A90415
15597h957l37633d3662A73414d5404A02522C7168a63439c9533k05556O2180f5365
15585B17196E1878a83289a769l1009E8891a66694A29690m1444G977b43563R2467
15574a51096I2724l7267K5469a39926E3750a19299J7719K79J946k2190b1093r1277
$$ plain form
15562 -112370 271867 202068 402920 -248929 -99149 65985 19219 -178579 107624 309944
15552 309944 -279223 -28535 195921 -209758 -310777 55921 109970 9379 -233059 -56862 -212087
15541 -212087 -226429 373701 113718 -30058 26127 308199 -7248 230200 -251742 -29737 -13699
15529 -143184 104305 -28691 61621 28431 -299551 -192570 -276417 -201513 -292908 160093 -191806
15517 117673 -433934 217195 -230038 -105910 -166812 132827 43058 -55430 135907 -116435
15506 122306 -81162 88752 254461 284868 -137803 83271 207358 -32043 63999 49748 77494
15495 77494 -44483 171316 -26771 172028 362119 -201547 -423816 -124349 -221819 -76640
15484 -154608 209320 109344 -232580 -155323 36382 -170544 220861 -348404 -8568 -48676 -196869
$$ packed form
15562a12370B71867o9799K00852b48929i9149F5985A9219a78579A07624K02320
15552C09944b79223b8535A95921b09758j01019E5921N4049I379b33059e6862j55225
15541b12087j4342C73701A13718c0058B6127K82072g248B30200b51742b9737a3699
15529a43184A04305b8691F1621B8431b99551J06981q3847P4904r1395A60093a91806
15517A17673d33934B17195b30038a05910o0902A32827D3058e5430A35907a16435
15506A22306h1162H8752J65709L0407a37803H3271J24087c2043F3999j4251K7746
15495G7494d4483A71316b6771A72028J90091b01547k22269a24349r7470g6640
15484a54608B09320r9976b32580P7257C6382a70544B20861c48404h568m0108j48193
$$ plain form
15473 -196869 1813 -124376 -306509 -313 24733 151125 26356 -31735 16604 23403 242008
15462 242008 -14795 163701 19929 158549 -48595 -81804 21110 108443 156597 288115 -139279
15450 97658 -150949 96691 269768 49881 72787 -175653 -57364 315627 15234 238116 261683
15439 261683 -670 -25904 321273 -229778 35584 -21735 224454 -121620 -72990 -10212 132874
15427 169930 32209 29509 -147829 -175507 -200417 -106748 -118319 -172870 17048 507120 110779
15415 -354095 -12629 -31693 96224 -106063 40218 202177 205732 114936 -112820 278147 -83641
15403 154378 318039 -124533 -29985 44579 -420010 210343 -90473 -88581 -120974 70783 60716
15392 60716 46196 191583 -102601 93978 -459191 227535 -219511 -148854 106513 -114417
$$ packed form
15473a96869A813a24376j82133c13B4733J26392B6356c1735A6604O799K18605
15462B42008a4795A63701A9929J38620d8595l3209B1110Q7333M8154J31518a39279
15450I7658a50949I6691J73077D9881K2906a75653e7364C15627A5234K22882K3567
15439B61683f70k5234C21273b29778C5584b1735B24454a21620M8630a0212A32874
15427A69930C2209k700a47829k7678k4910R3669j1571n4551A7048M90072A10779
15415c54095a2629j9064I6224a06063D0218J61959L555r0796a12820B78147h3641
15403A54378J63661a24533b9985D4579d20010B10343i0473J892l2393G0783j0067
15392F0716j4520J45387a02601I3978d59191B27535b19511P0657A06513a14417
$$ plain form
15381 -191775 -13354 -3914 3464 188349 -153795 -68702 -180526 96986 -46865 207789 192858
15370 192858 25343 89233 -20257 141830 97215 -137737 -203438 317065 -207629 -237045 -23937
15358 -128473 447011 -12499 23346 48617 -30372 9346 94471 -1163 85743 219585 42465
15346 -75222 -113934 -127466 29578 -112829 59401 -224371 -258707 -308743 267198 -356326 -128679
15334 -203469 74670 -78402 33108 29650 -118496 -177921 -69373 64603 85978 304715 -72467
15322 -59397 -232896 212906 -164570 -102328 -63077 229860 185515 -138337 12141 -302471
15311 86462 -17567 355801 295963 -66127 208684 -190390 617434 -32376 52434 -9544 -42206
15300 -42206 239833 51595 177009 -64179 -200273 -75572 -99595 223802 -84753 134333 -49163
$$ packed form
15381a91775a3354c914C464J84885a53795f8702j11824I6986d6865B07789j4931
15370A92858B5343O3890b0257A41830m4615a37737o5701C17065b07629k9416b3937
15358a28473D47011a2499B3346K5271c0372I346Q5125a163H5743J33842D2465
15346g5222l8712j3532B9578a12829E9401b24371l4336n0036B67198c56326a28679
15334b03469G4670g8402C3108l458a18496n9425f9373F4603K1375K18737g2467
15322e9397j73499B12906a64570O2242L9251B29860m4345a38337A2141c02471
15311H6462a7567C55801n9838f6127B08684a90390F17434c2376E2434i544l2662
15300d2206B39833E1595J25414f4179j36094g5572k4023B23802h4753A34333d9163
$$ plain form
15288 86423 -326900 -183087 80316 -423856 -102971 -79568 360814 119473 68459 67652 -165688
15276 -113479 -181561 -2372 -254903 78241 142556 -88514 -38983 113543 -55516 -149588 20523
15264 -23535 -325936 215030 98168 378317 -277832 144753 101633 -178683 -84941 59752
15253 -190458 -615510 14493 -17675 75672 228733 43977 62659 23647 58085 -128379 -348611
15242 -348611 -136869 -92551 6684 17810 -217611 -99896 -54762 2934 -131876 -19756 168959
15230 292632 314211 -95915 29337 71837 192894 728059 602985 1498759 1207237 1291684
15220 1291684 914537 561773 41985 216837 -5440 -49608 287585 -43168 374052 -12400
15209 443850 101218 -275544 -236925 -116382 -64175 192340 -1955 156409 148163 -78413 149179
$$ packed form
15288H6423c26900J43813H0316d23856a02971K3403C60814A19473n1014q07a65688
15276a13479o8082b372k52531G8241O4315h8514c8983A13543e5516r4072B0523
15264b3535l02401B15030I8168K80149b77832A44753m3120a78683h4941E9752
15253a90458m25052A4493a7675G5672J53061D3977J8682B3647L4438a28379k20232
15242c48611a36869M4318F684J1126b17611i9896M5134B934a31876a9756A68959
15230B92632K1579i5915B9337M2500J21057N35165j25074Q95774k91522Q4447
15220A291684l77147l52764D1985J74852e440m4168B87585d3168C74052a2400
15209D43850A01218b75544L8619a16382N2207A92340a955A56409q246g8413A49179
$$ plain form
15197 232148 337023 108090 194273 80721 -45664 -209067 219594 21756 332767 29378
15186 360884 36 153121 54203 147174 -72595 221651 301905 -190215 -51919 65174 514832
15175 514832 390068 -43978 75632 -114388 -61115 24779 57832 -101580 113294 164162 69426
15163 8111 117784 115663 246286 109086 -51957 33598 -250849 191326 -58687 298672 237555
15152 237555 -3419 275129 -156129 223852 121905 -103233 48660 -24479 -119650 14781 9587
15141 9587 52062 4063 507535 316310 206072 64437 -197294 145775 51065 247672 31641
15129 -148319 117487 103166 -799 474896 146919 228190 94504 34654 -103491 -129795 -219588
15118 -219588 129697 -150835 6534 82661 83231 153159 143917 -148254 222839 -136726 -502 -225157
$$ packed form
15197B32148J04875A08090Q6183H0721d5664j63403B19594B1756L11011B9378
15186C60884C6J53085E4203R2971g2595B21651Q0254a90215e1919F5174M49658
15175E14832j24764d3978G5632a14388N3273B4779L3053a01580A13294N0868F9426
15163H111J09673k121J30623A09086e1957C3598b50849A91326e8687B98672o1117
15152B37555c419B75129a56129B23852j01947a03233D8660b4479r5171A4781n194
15141I587M2475D063N03472j91225j10238F4437a97294A45775E1065J96607C1641
15129a48319A17487j4321g99D74896A46919Q1271I4504C4654a03491k6304q9793
15118b19588A29697a50835F534P6127N70O9928r242a48254B22839a36726e02k24655
$$ plain form
15106 -225157 84866 -269184 60411 -54940 -113830 -209700 -64658 126519 153343 85136 350529
15095 350529 363044 -93972 -182 79960 370583 -6182 265081 -145336 -69591 272457 67233
15083 88197 89970 38121 29203 -109006 156820 12447 -224058 167701 89715 -1009 -11701
15072 -11701 102855 423460 263026 69256 41724 287130 367995 315488 298076 151554 130675
15061 130675 -76391 72071 284753 153522 42466 180665 -103097 351439 139453 -99994
15050 -25488 382602 129791 163534 166114 226522 124796 -51425 -186653 -71364 92473 97688
15039 97688 88693 169444 -128249 161849 291139 249246 -71081 21594 113027 -92945 473231
15027 -78729 181823 306486 242363 54488 227760 54408 61865 170985 -111151 205185 494910
$$ packed form
15106b25157H4866b69184F0411e4940n8890r5870f4658A26519K6824o8207K65393
15095C50529J2515i3972a82G9960K90623f182B65081a45336f9591B72457F7233
15083H8197J773C8121q918a09006A56820A2447b24058A67701p7986a009j0692
15072a1701A02855L20605j60434F9256k7532K45406Q0865n2507j7412j46522k0879
15061A30675g6391G2071K12682j31231D2466J38199a03097C51439A39453i9994
15050b5488C82602A29791L3743K580O0408j01726e1425j35228g1364I2473N215
15039I7688q995Q0751a28249A61849J29290m1893g1081B1594R1433i2945D73231
15027g8729A81823J24663o4123E4488J73272E4408P457J09120a11151B05185K89725
$$ plain form
15016 494910 -89153 175763 276634 451552 225842 253347 222005 -44182 -125282 383260
15005 -114434 -84916 13865 32887 117212 27499 282124 319594 225865 45264 61044 -76793
14993 278294 -31028 -44550 -195863 48377 -100597 42370 -29229 -220760 -29063 171021 -91454
14981 350601 10655 -154943 143875 -53084 -73744 227925 239478 40487 187586 4694 17563
14970 17563 31880 -138416 119104 385556 -34097 197264 126323 158924 276598 299071 372459
14959 372459 293674 50270 -59769 170700 103725 5929 67800 -101875 5465 168117 2832
14947 11711 232316 254566 414034 346373 153162 268779 -44773 104480 116580 142465 171250
14936 171250 95361 251851 -49486 302594 -1175 106762 85661 -51904 206771 121776 182266
$$ packed form
15016D94910h9153A75763J00871J74918k25710K7505l1342d4182q1100C83260
15005a14434K9518A3865J9022Q4325B7499K54625L7470r3729D5264J5780g6793
14993B78294c1028j3522j51313D8377a00597D2370b9229j91531b9063A71021i1454
14981C50601A0655a54943A43875e3084k0660B27925J1553D0487J47099D694J2869
14970A7563J4317a38416A19104K66452c4097A97264p0941L2601J17674K2473P3388
14959C72459p8785E0270e9769A70700o6975E929O1871a01875E465J62652B832
14947A1711K20605K2250J59468o7661A53162J15617d4773A04480J2100K5885K8785
14936A71250p5889J56490d9486C02594a175A06762k1101e1904B06771q4995O0490
$$ plain form
14925 182266 234797 173263 -179793 117831 305350 85054 168010 201341 54828 131412 333370
14914 333370 -53157 197502 148155 138185 101807 -20074 379240 79309 186640 72568 378763
14903 378763 66859 228736 275772 9672 325198 193735 499936 276184 80714 332678
14893 332678 251197 321268 245222 -18853 140403 256223 227626 278902 143194 154885 412269
14882 412269 -54765 224565 143960 387003 331914 233286 167672 567077 358329 127397
14871 342665 560347 391880 303016 376303 324547 492308 222445 358737 204826 482095
14861 482095 136154 186428 310878 -107813 166531 81511 66930 454394 529025 332958
14851 332958 132827 -154529 224409 392721 417739 434935 284714 380144 -86783 207680
$$ packed form
14925A82266N2531o1534a79793A17831J87519H5054Q2956L3331E4828P6584K01958
14914C33370e3157A97502m9347r970l6378b0074C79240G9309J07331G2568L06195
14903C78763F6859J61877M7036I672L15526j31463L06201k23752H0714K51964
14893C32678q1481P0071p6046a8853A40403J15820k8597N1276j35708J1691K57384
14882D12269e4765B24565q0605K43043n5089r8628o5614L99405k08748A27397
14871C42665K17682j68467q8864P3287n1756J67761B22445J36292j53911K77269
14861D82095A36154N0274J24450a07813A66531H1511j4581L87464P4631j96067
14851C32958A32827a54529B24409J68312K5018J7196j50221R5430h6783B07680
$$ plain form
14840 23746 216157 276566 276307 257642 264542 525545 763295 487797 451372 363947 511075
14829 511075 407524 499250 420641 282335 483035 501623 408787 728263 329956 -109516
14818 -37648 227858 -88731 319764 314090 357616 273510 251673 388263 372968 314851 516609
14807 516609 451757 502748 459125 281502 120491 468106 166978 18823 208464 316222
14797 316222 399669 526337 317875 298115 320950 401680 543249 297359 623065 259670
14786 262610 558987 371856 51747 245158 332107 545522 233765 327120 528896 345819
14776 345819 280655 484958 300639 552629 440931 401730 567908 459054 355274 212375
14766 212375 477496 548742 541795 527068 654944 555058 515714 256869 500761 392980 484846
$$ packed form
14840B3746J92411O0409k59j8665O900K61003K37750k75498l6425q7425J47128
14829E11075j03551R1726p8609j38306K00700J8588r2836L19476C29956a09516
14818c7648B27858h8731C19764n674M3526q4106k1837J36590j5295n8117K01758
14807E16609o4852N0991m3623j77623A20491L47615A66978A8823J89641J07758
14797C16222Q3447J26668k08462j9760K2835Q0730J41569k45890L25706B59670
14786B62610K96377j87131E1747J93411Q6949K13415B33765R3355K01776j83077
14776C45819o5164K04303j84319K51990j11698l9201J66178j08854j03780j42899
14766B12375K65121P1246o947j4727J27876r9886l9344B56869K43892j07781R1866
$$ plain form
14755 484846 393614 590406 790956 363046 610511 502021 569063 365280 583593 726915
14745 726915 343434 254462 325706 409386 336609 584768 230145 369544 393606 594918
14735 594918 504453 284214 328180 426543 570675 308535 566499 428102 452434 694159
14725 694159 355219 311395 365138 664369 616292 212085 503469 282837 527014 654133
14715 654133 481471 519463 354243 218508 927560 664964 753980 519163 672695 612542
14705 612542 573389 420397 505369 815531 817797 587813 597821 595700 564122 895401 474565
14694 474565 647088 571181 735403 624030 549071 657003 568691 863120 439742 672405
14684 672405 662758 643751 731306 640729 571250 687609 633719 504975 614427 683044 726547
$$ packed form
14755D84846r1232J96792K00550C63046K47465j08490O7042k03783K18313J43322
14745G26915C43434q8972P1244Q3680p2777K48159B30145J39399K4062K01312
14735E94918r0465k20239M3966R8363J44132k62140K57964j38397K4332K41725
14725F94159l38940m3824N3743K99231m8077B12085K91384k20632K44177J27119
14715F54133j72662L7992j65220j35735P09052k62596Q9016k34817J53532o0153
14705F12542l9153j52992Q4972L10162K266k29984J0008k121l1578L31279m20836
14694D74565J72523p5907J64222j11373p4959J07932q8312K94429m23378K32663
14684F72405r647j9007Q7555r0577o9479J16359n3890j28744J09452O8617M3503
$$ plain form
14673 726547 685727 546193 631924 633010 809827 762798 687369 636922 462351 556606 513924
14662 513924 800982 1053730 830714 529498 567807 620537 1038895 1131895 736610 575331
14652 575331 744238 895746 927802 703877 617117 725248 665422 943124 816351 839344
14642 839344 842838 869407 754507 814149 962602 1183556 566712 835451 673366 979931
14632 979931 789516 708043 921197 981987 661436 665269 1160768 900439 1130908 1140875 1156881
14621 1156881 1228055 1000740 1005825 850023 1287346 1256567 760343 786832 898911 1080643
14611 1080643 1091818 915835 1131536 999619 1219585 1234948 781352 1179099 986302 1255087
14601 1255087 1003569 1103032 995234 1205805 1381469 987623 1283737 1310555 1404085 1041516
$$ packed form
14673G26547m0820j39534Q5731J086J76817m7029p5429n0447j74571R4255m2682
14662E13924K87058K52748k23016l01216L8309N2730M18358R3000l95285j61279
14652E75331J68907J51508L2056k23925q6760J08131n9826K77702j26773K2993
14642H39344L494K6569j14900N9642J48453K20954E66712K68739j62085L06565
14632I79931j90415q1473K13154O0790l20551L833M95499k60329K30469R967J6006
14621A156881P1174k27315N085j55802M37323l0779m96224K6489J12079J81732
14611A080643J1175j75983K15701j31917K19966J5363m53596L97747j92797K68785
14601A255087k51518R9463j07798K10571J75664l93846K96114K6818R3530l62569
$$ plain form
14591 1041516 1050132 748883 1259455 1468942 1144890 1119813 1093523 1468694 1542353 683976
14580 1259029 1346124 910269 1305560 1288012 1397461 1340275 1215692 1615921 1839853 1643480
14570 1643480 1242111 1354258 1211348 1273056 1451879 1711880 1597612 1688935 1413049 1293400
14560 1293400 1530608 1654031 1598471 1319142 1957859 1563066 1749817 1536037 1576552 1499719
14550 1499719 1788703 1781931 1590742 1665356 1588211 1587181 1881717 1966279 1909307 1983910 1902529
14539 1902529 1657774 1609626 1858757 2099511 2053281 2110799 2590542 2267870 2381520 2464954
14529 2464954 2406764 2851225 3284425 3348227 4005606 4954530 7547760 12714836 24689320
14520 24689320 47626898 34504531 12322523 5634431 3118552 1967079 1898210 2034411
$$ packed form
14591A041516Q616l01249N10572K09487l24052k5077k6290L75171P3659F83976
14580A259029Q7095m35855L95291j7548J09449n7186j24583M00229K23932j96373
14570A643480m01369J12147j42910O1708J78823K60001j14268R1323k75886j19649
14560A293400K37208J23423n5560k79329O38717l94793J86751k13780M0515p6833
14550A499719K88984o772j91189P4614p7145j030K94536Q4562n6972P4603q1381
14539A902529k44755m8148K49131K40754m6230N7518M79743l22672J13650Q3434
14529B464954n8190M44461M33200O3802O57379R48924K593230N167076J1974484
14520B4689320K2937578j3122367A2322523E634431k515879j151473o8869J36201
$$ plain form
14512 2034411 1893670 1565055 1794546 1602375 1552180 1551909 1469080 1937383 1829793 1772822
14502 1772822 1706404 1924384 2035640 1681864 1485749 1863912 1712826 2138160 2248317 1895492
14492 1895492 1953947 2027649 2122340 2161398 2204631 2025790 2209493 2317076 2114876 2135996
14482 2135996 2149965 2386165 2647117 2502279 2663617 2530812 2365196 2417832 2642588 2673517
14472 2673517 2629625 2471490 2706432 3007556 2647281 2729617 2830493 2908348 2867451 2875153
14462 2875153 3116901 3104165 2942585 3299561 3283645 3235213 3040855 3144347 3167612 2740458
14452 2740458 3388221 3460668 3845674 3557592 3484775 3452668 3685670 3720421 3331656 3599304
14442 3599304 3632802 3565451 3449911 3720498 4073221 3763366 3797411 4009076 3956675 3991876
$$ packed form
14512B034411j40741l28615K29491j92171n0195k71q2829M68303j07590n6971
14502A772822o6418K17980J11256l53776j96115L78163j51086M25334J10157l52825
14492A895492N8455P3702R4691L9058M3233j78841J83703J07583k02200K1120
14482B135996J3969K36200K60952j44838J61338j32805j65616N2636K24756L0929
14472B673517m3892j58135K34942L01124l60275Q2336J00876P7855m0897P702
14462B875153K41748j2736j61580L56976j5916m8432j94358J03492K3265m27154
14452B740458O47763P2447L85006k88082p2817l2107K33002L4751l88765K67648
14442C599304L3498o7351j15540K70587L52723l09855L4045K11665n2401L5201
$$ plain form
14432 3991876 3985511 4103573 4155725 4203467 4424471 4290967 4569712 4500418 4593624 4334732
14422 4334732 4313527 4945897 4309839 4561495 5112423 5110491 5128920 5204332 5064681 5335480
14412 5335480 5222690 5089299 5628741 5674576 5672947 5601536 5601876 5430207 5867070 5789632 5670394
14401 5670394 5915301 6434121 6203240 6267919 6430954 6520013 6082982 6598886 6765221 6504811
14391 6504811 6954589 6580544 7179528 7026856 7580181 7423953 7340266 7554525 7402078 7813593
14381 7813593 7774602 7854695 7659644 8244495 8048379 8308352 8662137 8879538 8553610 9330603
14371 9330603 9538535 9293599 9674562 9935701 9863046 10049091 10448107 10292903 10532964 10635920
14361 10635920 11177320 11293684 11495803 11478871 11832494 12056508 12365935 12483323 12771235
$$ packed form
14432C991876o365J18062N2152M7742K21004j33504K78745o9294R3206k58892
14422D334732k1205O32370o36058K51656N50928j932J8429P5412j39651K70799
14412E335480j12790j33391N39442M5835j629p1411L40j71669M36863p7438j19238
14401E670394K44907N18820k30881O4679J63035Q9059m37031N15904J66335k60410
14391F504811M49778l74045N98984j52672N53325j56228q3687K14259j52447M11515
14381G813593l8991Q0093j95051N84851j96116K59973L53785K17401l25928P76993
14371I330603K07932k44936L80963K61139p2655J86045L99016j55204K40061J02956
14361A0635920N41400J16364K02119j6932L53623K24014L09427J17388K87912
$$ plain form
14352 12771235 12961601 13239390 13392676 13439092 14035369 14253196 14313423 15045216 15172166 15080694
14342 15080694 15680440 15954723 16340184 16649572 16891322 17320881 17543470 17809418 18489643
14333 18489643 19058516 19464340 19870702 20150064 20879653 21210317 21660826 22126559 22861814
14324 22861814 23421402 23804727 24359157 25621682 25891756 26380221 27159998 27973162 28848623
14315 28848623 29609804 30073122 31235743 31868214 33166899 34039501 34973670 35964705 37236397
14306 37236397 38195007 39513795 40695089 41832281 42994059 44649531 46151631 47830667
14298 47830667 49336584 51171053 52844367 54869668 56538180 58752391 61125822 63247813
14290 63247813 65553795 68094945 70869145 73796916 77082228 79915215 83725124 87383819
$$ packed form
14352A2771235J90366K77789J53286M6416N96277K17827O0227P31793J26950r1472
14342A5080694N99746K74283L85461L09388K41750M29559K22589K65948O80225
14333A8489643N68873M05824M06362K79362P29589L30664M50509M65733P35255
14324B2861814N59588L83325N54430J262525K70074M88465P79777Q13164Q75461
14315B8848623P61181M63318J162621O32471J298685Q72602R34169R91035J271692
14306C7236397R58610J318788J181294J137192J161778J655472J502100J679036
14298D7830667J505917J834469J673314K025301J668512K214211K373431K121991
14290F3247813K305982K541150K774200K927771L285312K832987L809909L658695
$$ plain form
14282 87383819 90890086 95066727 99556518 104192363 108781525 114023194 119453146 125513296
14274 125513296 131886627 138248602 145484332 152881088 160972443 169979996 178990609 188656956
14266 188656956 199386940 210128811 221619549 234026092 246647521 260140372 274519736
14259 274519736 289070951 304070875 320388765 336385399 352691859 368880419 384938745
14252 384938745 400381450 414967738 428455337 440056286 449806733 454951094 455505947
14245 455505947 455147775 457186169 455204163 450147070 444603883 437677816 426225388 412844271
14237 412844271 398957532 384394078 368737328 352407972 335698576 319589420 303227923
14230 303227923 287880550 273546252 259289991 245486948 232809022 219872866 208368173
$$ packed form
14282H7383819L506267M176641M489791M635845M589162N241669N429952O060150
14274A25513296O373331O361975P235730P396756Q091355R007553R010613R666347
14266A88656956J0729984J0741871J1490738J2406543J2621429J3492851J4379364
14259B74519736J4551215J4999924J6317890J5996634J6306460J6188560J6058326
14252C84938745J5442705J4586288J3487599J1600949R750447N144361N54853
14245D55505947l58172K038394j982006n057093n543187o926067j1452428j3381117
14237D12844271j3886739j4563454j5656750j6329356j6709396j6109156j6361497
14230C03227923j5347373j4334298j4256261j3803043j2677926j2936156j1504693
$$ plain form
14223 208368173 197287574 186763083 177272540 167879994 159266639 151795393 143982562 136734866
14215 136734866 130176973 123971605 117724184 113147563 107765475 102753621 97859192 93237804
14207 93237804 89465265 86083813 82699150 79261035 76071192 72590056 70009300 67482985
14199 67482985 64738231 62394628 60044136 57839463 56137113 54036638 52127590 50541631
14191 50541631 48879061 46888241 45757379 44305376 42826953 41438343 40147857 38610957
14183 38610957 37867788 36695355 36253597 34903949 33628282 32696375 31990057 31050796 30595942
14174 30595942 29818727 28591892 28324738 27071733 26351948 25662533 25432869 24775978 24118424
14165 24118424 23416682 22673269 22345099 22081501 21207352 21068341 20500674 20072603 19427270
$$ packed form
14223B08368173j1080599j0524491r490543r392546q613355p471246p812831p247696
14215A36734866o557893o205368o247421m576621n382088n011854m894429m621388
14207I3237804l772539l381452l384663l438115l189843l481136k580756k526315
14199F7482985k744754k343603k350492k204673j702350k100475j909048j585959
14191E0541631j662570j990820j130862j452003j478423j388610j290486j536900
14183C8610957p43169j172433m41758j349648j275667r31907p06318r39261m54854
14174C0595942p77215j226835k67154j253005p19785o89415k29664o56891o57554
14165B4118424p01742p43413l28170k63598q74149j39011n67667m28071o45333
$$ plain form
14156 19427270 18962559 18492152 18169440 18019007 17196489 16877512 16779186 16398054 16143368
14147 16143368 15779085 15450857 15304685 14770689 14730556 14518208 14227030 13637091 13333847
14138 13333847 13210622 13151127 13047091 12957271 12490219 12008267 11829484 11756309 11602707 11491323
14128 11491323 11001940 10995333 10783842 10580424 10339988 10257264 10121179 10009519 9587054 9566524
14118 9566524 9603484 9141608 9332612 9131969 8838669 8438657 8688739 8456707 8446253 8357259
14108 8357259 8086201 8218480 8097554 7651596 7933350 7513212 7388462 7780268 7492868
14099 7492868 7570008 7113208 6891951 6793746 6990444 6583959 6430660 6667800 6429796 6606039
14089 6606039 6131692 6127746 5943815 6091315 5858168 5608325 5933761 5665982 5720982 5696960
$$ packed form
14156A9427270m64711m70407l22712j50433q22518l18977r8326l81132k54686
14147A6143368l64283l28228j46172n33996m0133k12348k91178n89939l03244
14138A3333847j23225n9495j04036q9820m67052m81952j78783p3175j53602j11384
14128A1491323m89383o607k11491k03418k40436q2724j36085j11660m22465k0530
14118I566524L6960m61876J91004k00643k93300m00012K50082k32032j0454q8994
14108H357259k71058J32279j20926m45958K81754m20138j24750L91806k87400
14099G492868P7140m56800k21257r8205J96698m06485j53299K37140k38004J76243
14089F606039m74347l946j83931J47500k33147k49843L25436k67779N5000k4022
$$ plain form
14079 5696960 5617092 5532890 5547634 5237293 5056346 5390552 5370586 4855970 5145141 4969262
14069 4969262 4786168 4916573 4807214 4542087 4809480 4936928 4783408 4629280 4884884
14060 4884884 4595576 4891883 4285140 4370286 4573294 4440298 3950483 4267481 4025669 4139301
14050 4139301 4469010 4214524 3567716 3889268 4061161 3682472 3551530 3726419 3829080
14041 3829080 3800365 3582701 4033100 3628224 3451490 3893501 3796688 3731170 3831069 3517686
14031 3517686 3466997 3425003 3430144 3621791 3129685 3381088 3115609 2929441 3185712 3166338
14021 3166338 3063264 3185108 2739888 3205935 3118530 2768510 3121102 3325062 3074146 2966048
14011 2966048 2640801 2651600 3006758 2974420 2663285 2954871 2569327 2791443 2534204 2855275
$$ packed form
14079E696960p9868q4202J4744l10341j80947L34206j9966n14616K89171j75879
14069D969262j83094J30405j09359k65127K67393J27448j53520j54128K55604
14060D884884k89308K96307o06743Q5146K03008j32996m89815L16998k41812J13632
14050D139301L29709k54486o46808L21552J71893l78689j30942J74889J02661
14041C829080k8715k17664M50399m04876j76734M42011r6813o5518R9899l13383
14031C517686n0689m1994N141J91647m92106K51403k65479j86168K56271j9374
14021C166338j03074J21844m45220M66047q7405l50020L52592K03960k50916j08098
14011B966048l25247J0799L55158l2338l11135K91586l85544K22116k57239L21071
$$ plain form
14001 2855275 2507218 2478033 2482496 2570528 2575163 2673005 2408526 2363159 2402418 2360584 2110351
13990 2110351 2478817 2267407 2107615 2386737 1939173 2201992 2633025 2144401 1913853
13981 1913853 2169033 1856124 2081445 2123167 1996416 2018409 1777394 1594241 1788546 1843512
13971 1843512 1817395 2060751 1724860 1656607 1743484 1688934 1801214 2554675 3565508 6679077
13961 6679077 16406670 40150020 39700813 18011247 9636989 6320239 5004139 4031542
13953 4031542 3625815 3347005 2962083 2946394 2708367 2614443 2398811 2041306 1863765 2340788
13943 2340788 2199845 1952724 1867681 1937192 1729157 2179087 1927058 2008205 1799833 1624456
13933 1624456 1689719 1775793 1823218 1798921 1686681 1660418 1779809 1724427 1416632 1715477
$$ packed form
14001B855275l48057k9185M463Q8032M635R7842k64479m5367L9259m1834k50233
13990B110351L68466k11410j59792K79122m47564K62819M31033m88624k30548
13981A913853K55180l12909K25321M1722j26751K1993k41015j83153J94305N4966
13971A843512k6117K43356l35891o8253Q6877n4550J12280P53461J010833L113569
13961F679077R727593K3743350m49207A8011247q374258l316750j316100r72597
13953D031542m05727k78810l84922j5689k38027r3924k15632l57505j77541M77023
13943B340788j40943k47121q5043O9511k08035M49930k52029Q1147k08372j75377
13933A624456O5263Q6074M7425k4297j12240k6263J19391n5382l07795K98845
$$ plain form
13923 1715477 1918582 1668948 1739432 1791457 1767949 1703130 1650514 1647200 1613908 1661189 1367746
13912 1367746 1533309 1215596 1567856 1594915 1521390 1672034 1699930 1249115 1325598 1210293
13902 1210293 1362660 1329747 1611827 1436592 915401 1621462 1230161 1302455 1499802 1528842
13892 1528842 1362541 1586771 1266380 1196809 1456307 1385721 1132926 1467416 1248738 1092416
13882 1092416 1283506 1289770 1193312 1106073 1485568 1350658 1010606 1144029 1264897 1036977
13872 1036977 1248071 1289211 1225249 1308201 1023968 1249332 1104788 1008416 1021709 1267419
13862 1267419 906437 945616 1114580 1027825 1254542 909847 904890 1027200 862470 1049396
13852 1049396 1502255 807561 1373325 1227877 908964 886036 1331268 1157957 971223 1077797
$$ packed form
13923A715477K03105k49634P0484N2025k3508o4819n2616l314l3292M7281k93443
13912A367746J65563l17713L52260K7059p3525J50644K7896m50815P6483j15305
13902A210293J52367l2913K82080j75235n21191P06061l91301P2294J97347K9040
13892A528842j66301K24230l20391o9571K59498p0586k52795L34490k18678j56322
13882A092416J91090O264r6458q7239L79495j34910l40052J33423J20868k27920
13872A036977K11094M1140o3962Q2952k84233K25364j44544r6372J3293K45710
13862A267419l60982L9179J68964q6755K26717l44695m957J22310j64730J86926
13852A049396M52859o94694N65764j45448l18913k2928M45232j73311j86734J06574
$$ plain form
13842 1077797 911715 1143782 810110 1305744 864413 896105 1170065 965895 888978 690428
13832 690428 995769 1165908 1006766 955701 743174 1078432 820255 829956 810378 949914
13822 949914 914107 1125556 992625 934187 895019 840753 825908 863432 980414 606229 1113044
13811 1113044 557628 850754 379454 792747 1072941 600059 909795 634375 730496 527512
13801 527512 608347 778373 1050143 746124 903067 773054 810043 674005 923122 634023
13791 634023 895908 793472 805814 537069 1041836 1268982 489061 820771 787868 688774
13781 688774 701750 666449 646056 754970 914306 477213 623461 866627 1040263 587634
13771 587634 856268 583463 714944 594871 983109 854033 622300 862044 478652 1022378
$$ packed form
13842A077797j66082K32067l33672M95634m41331L1692K73960k04170p6917j98550
13832F90428L05341J70139j59142n1065k12527L35258k58177R701j9578J39536
13822I49914l5807K11449j32931n8438l9168n4266j4845L7524J16982l74185N06815
13811A113044n55416K93126C79454M13293K80194m72882L09736k75420R6121k02984
13801E27512Q0835J70026K71770l04019J56943j30013L6989j36038K49117k89099
13791F34023K61885j02436J2342k68745N04767K27146D89061L31710l2903r9094
13781F88774J2976l5301k0393J08914J59336m37093J46248K43166J73636m52629
13771E87634K68634k72805J31481j20073L88238j29076k31733K39744l83392N43726
$$ plain form
13761 1022378 746880 752520 993711 562393 489709 778889 833554 647226 732232 883123
13751 883123 889053 538185 539929 617868 707144 480391 498322 313751 808790 631929 417728
13740 417728 913716 568519 672546 454411 535379 620382 498616 475295 343971 891730
13730 891730 511791 777830 652793 519194 597775 704347 640262 840500 349062 502442
13720 502442 742668 516599 479165 282280 604959 705612 533398 501813 692566 447518
13710 447518 710082 466498 583623 413059 633730 587132 359675 549508 535889 445149
13700 445149 492886 465454 722404 560616 600242 312653 259894 281497 717686 465536
13690 465536 830696 423323 199945 332639 652091 341754 534651 405939 441172 478800
$$ packed form
13761A022378k75498N640K41191m31318p2684K89180N4665j86328Q5006J50891
13751H83123N930l50868J744P7939Q9276k26753J7931j84571M95039j76861k14201
13740D17728M95988l45197J04027k18135Q0968Q5003j21766k3321j31324N47759
13730H91730l79939K66039j25037j33599P8581J06572o4085K00238C49062J53380
13720E02442K40226k26069l7434j96885L22679J00653j72214l1585J90753k45048
13710D47518K62564k43584J17125j70564K20671m6598k27457J89833j3619r0740
13700D45149M7737k7432K56950j61788L9626k87589n2759K1603M36189k52150
13690D65536L65160m07373A99945J32694L19452l10337J92897j28712L5233L7628
$$ plain form
13680 478800 363940 479813 531892 337344 588426 673217 466827 285905 616554 505609
13670 505609 946000 470472 630855 393105 626435 229005 683889 589455 423146 581151
13660 581151 663863 456155 543955 576104 839079 443619 650802 502770 227424 366699
13650 366699 589056 574527 822376 467250 549873 477259 715150 331256 694441 429801
13640 429801 581784 468911 360569 427727 557099 356190 227158 615163 527471 197657
13629 375439 702372 195207 25127 284478 246788 473513 576644 364115 480897 -13309
13618 332860 191666 578846 294446 295980 396178 422391 323224 339724 547952 477409 537363
13607 537363 191473 257177 470509 125898 373521 150375 425126 329355 218834 356052
$$ packed form
13680D78800j14860J15873N2079j94548K51082Q4791k06390j80922L30649j10945
13670E05609M40391D70472J60383k37750K33330B29005M54884r4434j66309J58005
13660E81151Q2712k07708Q7800L2149K62975l95460K07183j48032B27424J39275
13650C66699K22357j4529K47849l55126Q2623p2614K37891C31256L63185k64640
13640D29801J51983j12873j08342O7158J29372k00909j29032L88005q7692A97657
13629C75439L26933A95207B5127K59351l7690K26725J03131k12529J16782a3309
13618C32860j41194L87180k84400J534J00198K6213r9167J6500K08228p0543N9954
13607E37363A91473O5704K13332A25898K47623A50375K74751r5771j10521J37218
$$ plain form
13597 356052 165808 385269 435670 498490 548248 402355 -63869 246235 253195 513036 275852
13586 275852 339565 170295 388896 434261 281111 699612 279976 213940 -1859 500212
13575 543735 272149 155681 409050 189663 482380 183379 176395 555805 263178 214694
13565 214694 181753 358261 551477 339000 145575 297291 538951 73425 309523 442264
13555 442264 213448 301003 108783 135881 8988 218912 355449 372177 438046 269452 354613
13544 354613 575746 107344 403072 198222 307511 384128 328177 338931 465858 -29254
13533 300163 296638 -40403 210764 119695 477673 278007 -79133 252354 506586 245782
13522 126618 -34772 332264 247064 491369 142187 315540 176175 639131 -7789 252053
$$ packed form
13597C56052A65808K19461N0401O2820M9758j45893f3869B46235O960K59841k37184
13586B75852O3713j69270K18601M5365j53150M18501B79976o6036a859E00212
13575E43735k71586j16468K53369A89663K92717A83379o984L79410B63178m8484
13565B14694l2941J76508J93216k12477A45575J51716K41660G3425K36098J32741
13555D42264B13448Q7555A08783K7098H988K09924J36537J6728O5869j68594Q5161
13544C54613K21133A07344K95728A98222J09289P6617n5951J0754J26927b9254
13533C00163l525d0403B10764r1069L57978j99666g9133B52354K54232B45782
13522A26618c4772C32264q5200K44305A42187J73353j39365M62956g789B52053
$$ plain form
13511 197992 185558 -55462 328684 216669 197612 155872 275199 568452 118912 258907
13501 258907 229480 41217 21390 131920 327149 210377 119840 96865 320132 257950 430725
13490 430725 515979 213352 100711 165294 433922 505586 131905 -35799 403189 92346
13479 426293 362841 429082 316626 453749 295317 75778 369594 387969 197986 227252
13469 227252 232851 438441 -161840 303103 252650 78064 -113200 114225 362725 317578
13459 317578 285236 452197 58875 85780 12644 239 73688 265711 104589 238840 154545
13448 154545 232807 260877 527937 383521 54046 290212 500633 214336 375077 441257
13438 441257 -62856 375619 126405 91953 18440 61488 359940 349374 136959 105816 93282
$$ packed form
13511A97992j2434e5462C28684j12015j9057m1740J19327K93253A18912J39995
13501B58907k9427D1217j9827J10530J95229j16772r0537k2975K23267o2182J72775
13490D30725Q5254B13352A00711O4583K68628P1664A31905c5799D03189I2346
13479D26293o3452O6241j12456J37123j58432G5778K93816J8375j89983K9266
13469B27252N599K05590a61840C03103n0453G8064a13200A14225K48500m5147
13459C17578l2342J66961E8875K6905A2644B39P3449J92023A04589J34251q4295
13448A54545P8262K8070K67060j44416E4046K36166K10421B14336J60741O6180
13438D41257f2856C75619A26405l4452A8440M3048K98452j0566A36959l1143j2534
$$ plain form
13427 93282 160103 58664 233639 251337 173100 426566 287921 239236 78208 174431 45437
13415 110283 394613 9432 196660 5433 -58369 -29199 423 113133 356290 411870 241405
13404 241405 -182318 116811 337548 149844 -231523 103956 472699 489932 353977 192115
13394 192115 215023 -15186 565582 217561 142781 27321 -34098 219085 227889 498371 181732
13382 361305 207814 372648 377307 -1098 63730 36525 273406 145311 44991 351497 47200
13370 467100 40398 -87768 326142 380067 14625 319153 -114343 289958 102577 195571
13360 195571 8733 43285 300459 147184 163776 242301 156172 316305 -84196 -185281 317384
13348 152594 128902 283605 476785 295045 193282 174826 145749 748410 418563 636757
$$ packed form
13427I3282O6821E8664J74975J7698p8237K53466j38645m8685G8208R6223D5437
13415A10283K84330I432J87228E433e8369K9170D23J12710K43157N5580j70465
13404B41405a82318A16811K20737A49844b31523A03956L68743J7233j35955j61862
13394A92115K2908a5186E65582B17561p4780B7321c4098B19085Q804K70482A81732
13382C61305j53491J64834M659a098F3730k7205K36881j28095D4991L06506D7200
13370D67100D0398h7768C26142N3925A4625L04528a14343B89958A02577R2994
13360A95571H733L4552K57174A47184J6592P8525q6129J60133h4196j01085C17384
13348A52594k3692J54703J93180j81740j01763j8456k9077O02661l29847K18194
$$ plain form
13338 636757 -132648 236802 174690 331400 -213765 -58738 362494 224669 61830 299545
13328 299545 -7791 326000 367293 47859 184502 121163 222827 40436 169513 438144 -10148
13316 374888 305934 233715 238806 -37754 -30376 432110 162045 293586 166746 249259 411104
13305 411104 -137706 297152 510886 322124 341238 509612 117270 297876 312773 212838
13295 212838 368093 102064 204552 320929 -18611 516855 81873 96807 485399 284497
13285 284497 -111520 648771 357651 127850 116507 -176677 62649 50722 -269404 251230
13274 -88097 22357 211323 319996 2630 -17797 85407 363018 68303 3219 28981 112475
13263 112475 -134250 -127345 35746 161163 299451 178932 34649 -18955 140360 107030 167322
$$ packed form
13338F36757a32648B36802o2112J56710b13765e8738C62494j37825F1830K37715
13328B99545g791C26000M1293D7859J36643o3339J01664D0436J29077K68631a0148
13316C74888o8954p2219N091c7754P378D32110A62045J31541j26840Q2513J61845
13305D11104a37706B97152K13734j88762J9114J68374A17270J80606J4897r9935
13295B12838J55255A02064J02488J16377a8611E16855H1873J4934L88592k00902
13285B84497a11520F48771k91120A27850j1343a76677F2649j1927b69404B51230
13274h8097B2357J88966J08673B630a7797H5407K77611F8303C219K5762Q3494
13263A12475a34250O905C5746J25417J38288j20519C4649a8955A40360l3330O0292
$$ plain form
13252 167322 -26129 754161 -7709 158987 -210196 136565 66093 162781 227211 134276 135343
13241 135343 -8936 138474 209662 -124391 329264 -13201 341773 179880 164978 117349 244524
13230 244524 114166 84387 146425 -71212 100270 101371 -91613 -31542 -24633 221911 231264
13219 231264 49000 153154 -105130 -19334 -105547 209810 -219522 -34861 -223307 343731
13208 -120321 117050 -138750 -50283 200447 38953 -99700 154992 386154 -118684 -92553
13198 -92553 -176450 -34165 156202 239719 246659 -11305 204472 -16481 -60862 154876 156001
13187 156001 419135 89037 236744 141843 174140 -127651 203966 414496 122614 -23197
13176 406913 169745 147589 -306164 31054 39225 26712 -180810 -135203 28688 -138755 188147
$$ packed form
13252A67322b6129G54161g709A58987b10196A36565F6093R6688O4430r2935J067
13241A35343h936A38474P1188a24391C29264a3201C41773j61893j4902m7629J27175
13230B44524A14166k9779O2038g1212A00270J101i1613c1542O909B21911R353
13219B31264D9000J04154a05130a9334q6213B09810b19522c4861j88446C43731
13208a20321A17050a38750e0283B00447C8953i9700A54992K31162a18684K6131
13198i2553q3897c4165A56202Q3517O940a1305B04472a6481m4381A54876J125
13187A56001K63134H9037J47707r4901L2297a27651B03966K10530A22614b3197
13176D06913A69745k2156c06164C1054Q171j2513a80810M5607B8688a38755A88147
$$ plain form
13164 132227 145850 30021 141521 -131922 170586 144040 102347 -79470 133843 -144423
13153 -76687 20896 247085 310195 -56587 123724 145478 468629 209329 252801 159839 228399
13142 228399 103014 -85225 63313 -47576 -94409 103606 183717 -248246 -20564 71562 204371
13131 204371 84285 442118 -54050 490370 96557 159632 -145087 212491 321108 28345
13120 -161562 237315 129309 158073 86490 -12176 -108182 275844 165261 -243798 300493
13109 199815 -24265 70950 117381 122026 193935 15013 305893 150634 -108916 32458 -142875
13097 325553 -53868 331190 191590 -221510 -3044 501048 -41621 129383 89781 157364 142136
13086 142136 70576 61907 -150487 -246969 275402 -167835 149987 225844 -3710 -13049 200922
$$ packed form
13164A32227J3623C0021J11500a31922A70586k6546m1693g9470A33843a44423
13153g6687B0896K26189O3110e6587A23724K1754L23151B09329M3472r2962O8560
13142B28399A03014h5225F3313d7576m6833A03606Q0111b48246b0564G1562J32809
13131B04371H4285L57833e4050D90370I6557O3075a45087B12491J08617B8345
13120a61562B37315j08006K8764p1583a2176r6006B75844j10583b43798C00493
13109A99815b4265G0950M6431M645P1909A5013K90880A50634a08916C2458a42875
13097C25553e3868C31190j39600b21510c044E01048d1621A29383l9602O7583j5228
13086A42136G0576q669a50487r6482B75402a67835A49987P5857c710r339B00922
$$ plain form
13074 -101263 -69874 31496 219025 181733 76282 186310 -229441 68172 73774 108451 -134085
13062 215954 134514 -101196 335591 166113 -427261 81671 44923 44334 129775 151362 -65182
13050 319729 130798 282231 299670 -273282 198037 392021 214666 219097 210132 132174 189616
13039 189616 54977 -7133 18343 -221932 161710 237780 36033 -90620 243188 -37067 -20762
13028 -20762 124918 229 -76533 355395 117384 77099 276273 51410 465414 405463 32956
13016 27352 133245 9245 426734 -1205 75595 -86514 -15528 -39177 100052 248258 67261
13004 -281625 261127 106291 111522 155317 288064 -59333 211938 67264 82498 -29976 -111523
12993 -111523 -23378 250825 22289 314347 154218 94205 19038 -55394 132231 319316
$$ packed form
13074a01263L1389C1496J87529l7292G6282J10028b29441F8172N602L4677a34085
13062B15954q1440a01196C35591A66113d27261H1671l6748n89Q5441K1587f5182
13050C19729A30798J51433J7439b73282A98037J93984j77355M431q965p7958N7442
13039A89616E4977g133A8343b21932A61710P6070C6033i0620B43188c7067J6305
13028b0762A24918B29g6533C55395A17384m0285J99174E1410M14004n9951C2956
13016B7352J05893I245M17489a205G5595h6514a5528k3649A00052J48206F7261
13004b81625B61127A06291N231M3795J32747e9333B11938F7264J5234b9976q1547
12993a11523b3378B50825B2289K92058A54218o0013A9038e5394A32231J87085
$$ plain form
12983 319316 40426 79976 -19467 151915 -91896 139479 -68213 56023 158415 71473 125915
12972 125915 -55576 78072 -154349 -166178 -26528 42158 -160349 42112 -180600 -7760 22601
12960 51344 287475 164153 67240 251617 52914 -116006 30927 85869 169373 145022 -122789
12948 -3709 144963 -169021 9526 271510 430749 -124050 94148 119385 323563 29871 -81498
12936 329387 24015 -109444 214829 -31890 138992 80706 -94139 101694 70103 79177 311244
12925 311244 81781 35833 -95116 -13869 169541 -66686 136549 77602 175308 63219 391761
12914 391761 39665 23892 -234965 -25531 134048 -15452 332128 -193971 121809 -75627
12903 -93817 286683 190292 -24515 -60881 -50359 -88362 313176 -100463 -84842 194172 -214298
$$ packed form
12983C19316D0426L9550a9467A51915i1896A39479f8213E6023J02392G1473N4442
12972A25915e5576G8072a54349j1829b6528D2158a60349D2112a80600g760B2601
12960E1344K36131j23322F7240J84377E2914a16006C0927N4942Q3504k4351a22789
12948c709A44963a69021I526K61984J59239a24050I4148K5237K04178B9871h1498
12936C29387B4015a09444B14829c1890A38992n8286i4139A01694l1591R074K32067
12925C11244H1781C5833i5116a3869A69541f6686A36549n8947R7706F3219L28542
12914C91761C9665j5773b34965b5531A34048a5452C32128a93971A21809g5627
12903i3817B86683r6391b4515l6366J0522l8003C13176a00463J5621A94172b14298
$$ plain form
12891 -324391 170678 237830 -105046 -23683 -21310 22882 175070 -119382 -87991 62959 311707
12880 311707 -154540 144880 -69924 -89145 269664 22055 39771 216809 -62614 28134 9231
12868 204521 39803 168272 221172 -34704 5656 179541 -248779 4179 -54294 439994 -120680
12856 135455 209887 -22978 148569 104694 -227495 -315771 -111210 78429 277806 -12313 -29337
12845 -29337 23413 -2402 -44126 -151748 -317953 -71016 -250389 18835 -89690 133848 54156
12833 -125326 68449 31866 -46598 180247 195974 89172 255364 -198046 132920 371679
12823 371679 -1416 -41737 -99882 255450 444891 -82667 18222 310329 -46006 10841 120970
12812 120970 194270 65041 100991 -278311 173180 82218 41879 -140017 179438 -62557 77859
$$ packed form
12891c24391A70678O7152a05046b3683K373B2882J52188a19382L1391F2959K48748
12880C11707a54540A44880f9924j9221B69664B2055J7716J77038f2614B8134I231
12868B04521C9803J28469N2900c4704E656J73885b48779D179e4294D39994a20680
12856A35455P4432b2978A48569m3875b27495q8276a11210G8429J99377a2313j7024
12845b9337B3413b402m1724j07622j66205g1016j79373A8835h9690A33848E4156
12833a25326F8449C1866d6598A80247J5727H9172J66192a98046A32920K38759
12823C71679a416m0321n8145B55450J89441h2667A8222K92107d6006A0841J10129
12812A20970P3300F5041L5950b78311A73180H2218m0339a40017A79438f2557G7859
$$ plain form
12800 169825 72957 46077 -90197 123959 84746 122506 -81544 -113815 99327 272406 -39349
12788 -36818 -213391 258549 -106828 171914 148621 -43274 -104232 -4004 148596 242682 -103782
12776 -257119 256201 43592 -178764 38803 -249736 -223226 225515 -178183 -278369 -164258
12766 -164258 -75146 249659 17858 38712 -7736 -109715 14252 118313 -45869 59655 -130465
12754 93332 -349620 -125127 102337 -344704 258979 -71695 -294467 108592 460822 -249880
12743 134368 -58399 39734 13367 -113392 -279499 -135298 62567 120444 -105221 20514 178817
12732 178817 -77137 -371444 148735 139160 92219 2523 53392 238408 99578 70115 213271
12721 213271 312225 328999 183178 222588 92335 96123 56138 58415 118999 247003 -103140
$$ packed form
12800A69825G2957k6880i0197A23959l9213L7760h1544l2271I9327J73079c9349
12788c6818j76573B58549a06828A71914k3293d3274o0958d004A48596R4086a03782
12776b57119B56201D3592a78764C8803b49736K6510B25515a78183j00186J14111
12766a64258g5146B49659A7858K0854g736j01979A4252J04061d5869E9655a30465
12754I3332c49620a25127A02337c44704B58979g1695k22772A08592L52230b49880
12743A34368e8399C9734A3367a13392j66107a35298F2567N7877a05221B0514J58303
12732A78817g7137k94307A48735r575m6941B523N0869J85016I9578k9463J43156
12721B13271R8954J6774j45821L9410I2335L788l9985K277O0584J28004a03140
$$ plain form
12709 -146855 18782 119591 298026 66773 -57514 -127462 209297 81324 -180340 -369003
12699 -369003 -54540 178917 105943 83158 211750 43483 2275 219471 -41247 152941 26023
12687 -69239 76416 -16589 357472 536761 243541 279696 380264 48776 123989 181359 6426
12675 141578 426690 57769 104037 267275 205533 -49071 284120 -149913 -246571 340494
12664 337853 126648 478287 -233273 140058 -74653 564804 273065 170228 184402 289021
12654 289021 151606 250681 -193299 -96739 155089 94166 95267 280310 -3188 -193157 170738
12642 38202 120240 164668 77792 189416 98598 -266410 192123 -74142 181260 122377 -104682
12630 -41803 14456 102579 -74381 -216791 -29768 101246 5668 1649 222656 -230683 -122668
$$ packed form
12709a46855A8782J00809J78435F6773e7514o9948B09297H1324a80340j88663
12699c69003e4540A78917p2974k2785J28592D3483B275K17196d1247A52941B6023
12687f9239G6416a6589C57472J79289B43541L6155J00568D8776P5213N7370F426
12675A41578K85112E7769M6268J63238o1742d9071B84120a49913r6658C40494
12664C37853A26648L51639b33273A40058g4653E64804B73065j02837J4174J04619
12654B89021j37415R9075a93299R6560A55089o0923J101J85043c188j89969A70738
12642C8202Q2038M4428G7792J11624r0818b66410A92123g4142A81260n8883a04682
12630d1803A4456Q8123g4381j42410b9768A01246E668A649K21007b30683J08015
$$ plain form
12619 -122668 119854 -62361 46769 202611 335925 188850 102415 281109 40007 -87822
12608 -260111 242910 -87718 189249 242482 177402 177626 96899 -201337 -126567 111686 130781
12597 130781 -74624 252227 276152 180534 -219009 -62905 323096 115056 -62187 100073
12586 -223040 109490 -317695 100067 169579 -39076 49724 -12428 251638 -124822 -257992
12576 -257992 62617 -123348 1873 -44809 -146702 -172361 185949 -88774 -107243 165654 -197565
12564 -120791 369944 137416 -29267 14587 43991 -287142 44198 -78021 -179114 -23942 302866
12552 12975 -181572 -269616 -104004 59679 19543 -349624 197501 314363 -38205 -41516 28089
12540 214947 176256 83399 274405 16134 171659 83195 32521 -105255 72385 -67052 -206347
$$ packed form
12619a22668A19854f2361D6769J55842J33314j47075q6435J78694D0007h7822
12608b60111B42910h7718A89249N3233o5080K24q0727b01337P4770A11686J9095
12597A30781g4624B52227K3925r5618b19009f2905C23096A15056f2187A00073
12586b23040A09490c17695A00067O9512c9076D9724a2428B51638a24822j33170
12576b57992F2617a23348A873d4809j01893k5659A85949h8774j8469A65654a97565
12564a20791C69944A37416b9267A4587K9404b87142D4198g8021j01093b3942C02866
12552A2975a81572q8044a04004E9679A9543c49624A97501J16862c8205l311B8089
12540B14947l8691H3399J91006A6134J55525H3195C2521a05255G2385f7052j39295
$$ plain form
12529 -206347 8083 193248 137382 -58270 101536 308799 171058 -117101 -242045 -23484
12518 175778 -64337 109469 10449 75724 -31923 184880 -13194 214989 -269467 -168640
12508 -168640 -36754 -104233 -61164 25526 -75479 242563 31001 -71777 -53373 -180056 -97046
12497 -97046 119287 24440 -347465 -470399 -127854 -378505 -283243 -133453 -139990 -143704 -55879
12485 22529 62465 -139682 109144 -24961 -77951 -64223 -197925 76565 -72186 25237 124566
12474 124566 153153 553608 106922 -154886 17711 134914 -101784 -59275 -83202 131688
12463 -148523 -17484 322718 -71516 41148 368771 -50805 -167658 -8349 -223648 10123 -94913
12451 241544 -221979 67263 403045 104462 -84428 -436031 243367 235870 19344 -72314 -146802
$$ packed form
12529b06347H083J85165n5866e8270A01536K07263j37741a17101j24944b3484
12518A75778f4337A09469A0449O5275c1923A84880a3194B14989b69467J00827
12508a68640c6754o7479M3069B5526g5479B42563C1001g1777J8404j26683Q3010
12497i7046A19287B4440c47465j22934a27854k50651R5262a33453o537l714e5879
12485B2529L9936a39682A09144b4961n2990J3728j33702G6565g2186B5237R9329
12474A24566K8587M00455A06922a54886A7711J17203a01784M2509k3927A31688
12463a48523a7484C22718g1516D1148L27623e0805j16853h349k15299A0123i4913
12451B41544b21979F7263L35782A04462h4428l51603B43367p497A9344g2314p4488
$$ plain form
12440 -146802 -27715 -261252 -73401 301822 -270144 288106 225692 -202647 -72802 21571
12429 274361 331579 82057 -91690 -151172 -197704 76223 279493 -34325 44909 192908 195152
12418 195152 -59049 43818 -379935 30111 60161 21178 -221780 -88008 -145958 -298744 -20395
12406 73632 -27177 66960 -62984 -140033 -218957 -249353 -84686 132076 171965 -94535 143441
12394 50087 127052 -128474 -11919 -134736 326203 -12032 -141560 145579 -190979 32578
12383 60414 -38709 -160552 212167 163277 -2589 160691 -243646 -29741 98239 -149559 193175
12371 -291597 221420 70079 -152625 181353 -44204 -393672 178592 -134611 13612 372917
12361 372917 111316 -84598 -503303 -43101 -247696 -167211 82742 -83805 173453 147927 110818
$$ packed form
12440a46802b7715k33537g3401C01822b70144B88106o2414b02647g2802B1571
12429B74361N7218H2057i1690n9482m6532G6223K03270c4325D4909J47999K244
12418A95152e9049D3818c79935C0111L0050B1178b21780h8008n7950j52786b0395
12406G3632b7177F6960f2984p7049p8924l0396h4686A32076L9889i4535A43441
12394E0087P6965a28474a1919j22817C26203a2032j29528A45579a90979C2578
12383F0414c8709j21843B12167m8890b589A60691b43646b9741I8239a49559A93175
12371b91597B21420G0079a52625A81353d4204l49468A78592a34611A3612L59305
12361C72917A11316h4598m18705d3101k04595Q0485H2742h3805A73453k5526l7109
$$ plain form
12350 110818 127161 -204038 161511 126104 44508 -29305 337194 123473 -32327 -109800 65600
12338 -75162 -137801 42345 -78742 -102432 -147671 201619 -45104 -333282 -115876 76270 -9139
12326 169219 -290685 -118007 -141545 2469 -292532 114451 155759 65047 93312 139289 -54914
12314 158246 2501 -91910 -198719 -18048 -12254 -71594 175244 261672 -64393 17796 587 -79730
12301 40027 -263274 32799 -220430 237622 -194255 -155178 348573 211699 80835 32356
12290 6501 99604 -2478 103155 126787 139098 -108488 -15180 -81120 94730 -15115 98291 -125704
12277 -72490 -213015 37793 -157370 -60032 166718 60311 77684 212111 200048 20613 4326
12265 -81297 205456 22925 -137805 282543 120693 94736 -179433 70818 -35774 -38379 -150327
$$ packed form
12350A10818J6343b04038A61511l5407D4508b9305C37194A23473c2327p7473F5600
12338g5162o2639D2345g8742k3690m5239B01619d5104k88178a15876G6270i139
12326A69219b90685a18007k3538B469b92532A14451M1308F5047K8265M5977e4914
12314A58246B501i1910j06809a8048N794n9340A75244Q6428f4393A7796E87g9730
12301D0027b63274C2799b20430B37622a94255L9077C48573j36874H0835C2356
12290F501R3103b478A03155K3632J2311a08488a5180o5940I4730a5115I8291a25704
12277g2490j40525C7793a57370f0032A66718F0311J7373J34427j2063B0613D326
12265h1297B05456B2925a37805B82543A20693k5957a79433G0818c5774k605j11948
$$ plain form
12254 -150327 -41743 -266104 9828 -23132 73822 409722 72107 -87818 155821 -195589 62879
12242 280279 256554 62914 -112208 180373 89221 -62500 266200 -11603 61315 -68205 -174687
12231 -174687 123655 -22129 211055 -186738 -249073 58691 299603 74165 -105067 76902
12220 113621 24356 -56452 97158 90387 -59455 -268779 -59835 368950 -35375 -41799 148311
12208 -141860 352757 37128 -10510 233590 -211866 169350 258299 229259 166503 316024
12198 316024 -70018 624114 180484 248893 103570 -54888 196686 152017 122849 133804 9143
12186 62456 182314 347996 -73460 62250 286921 297817 8795 -79662 -113897 176528 50705
12174 -88997 53747 404741 13922 229682 161163 15753 293976 363993 1832 39559 -7313
$$ packed form
12254a50327d1743k24361I828b3132G3822L35900G2107h7818A55821a95589F2879
12242B80279k3725F2914a12208A80373H9221f2500B66200a1603F1315f8205j06482
12231a74687A23655b2129B11055a86738o2335E8691K40912G4165a05067G6902
12220A13621B4356e6452I7158o771e9455k09324e9835C68950c5375o424A48311
12208a41860C52757C7128a0510B33590b11866A69350Q8949k9040o2756J49521
12198C16024g0018F24114A80484O8409A03570e4888A96686m4669k9168J0955I143
12186F2456J19858J65682g3460F2250K24671J0896H795g9662l4235A76528E0705
12174h8997E3747L50994A3922K15760o8519A5753K78223P0017A832L7727g313
$$ plain form
12162 50620 221701 100034 -43858 109780 155299 -121707 121470 142469 103757 177569 25520
12150 193362 -59340 -173740 57319 -981 304301 59992 163054 432568 316778 -100004 173657
12138 115080 -53716 -322752 290028 -45947 198084 38774 -17363 140141 32266 170989
12128 170989 338240 93061 185693 276852 -45040 -381942 324093 -333158 32670 -65242 -23080
12116 -99684 230192 -232575 92330 149320 3273 -151191 58772 229335 86441 233560 195888
12105 195888 407384 117802 260692 -107501 -161935 75180 -121368 19474 102883 156457
12095 156457 57945 237145 -18350 -159149 28946 -69080 -132950 70788 -77946 -185671 76440
12083 -66984 -71193 350830 -120677 -265014 102858 97497 114877 -219089 52602 244017 -136806
$$ packed form
12162E0620J71081A00034d3858A09780M5519a21707A21470K0999l8712P3812B5520
12150A93362e9340j14400E7319i81C04301E9992J03062K69514j15790a00004A73657
12138A15080e3716k69036B90028d5947A98084C8774a7363A40141C2266J38723
12128A70989J67251I3061R2632R1159d5040l36902C24093c33158C2670f5242b3080
12116i9684B30192b32575I2330N6990C273a51191E8772J70563H6441J47119l7672
12105A95888K11496A17802J42890a07501n4434G5180a21368A9474Q3409N3574
12095A56457E7945J79200a8350j40799B8946f9080o3870G0788g7946j07725G6440
12083f6984m209C50830a20677j44337A02858n361J7380b19089E2602J91415a36806
$$ plain form
12071 -119815 19636 -185830 241576 102975 -40168 228788 -499561 -446490 59342 -103145
12060 -261233 -103058 91832 -18298 -234122 -94874 108559 -219589 -141347 -119603 118211
12049 -105955 183011 -112424 110407 666658 1308187 1052900 550191 181828 75659 84539
12039 84539 25357 186455 -125385 -155329 142689 -61832 -60975 -92073 -3517 148794 5213 116756
12027 116756 -227035 -133591 159502 -3908 -103393 -389900 -346207 -193579 -277709 -342909 247318
12015 50757 -118870 -60677 115451 133674 -107071 42101 -322543 -189317 -281615 119088
12004 -172948 -129455 395101 43118 100778 45294 -219765 -1960 -9798 49402 -16950 -178201
11993 -178201 -54937 -55197 115052 -144390 73571 23457 -28634 110852 106969 -53607 115790
$$ packed form
12071a19815A9636a85830B41576A02975d0168B28788d99561N3071E9342a03145
12060b61233a03058I1832a8298k15824i4874A08559b19589P8242K1744A18211
12049a05955A83011a12424A10407N56251O41529k55287n02709A81828G5659Q880
12039H4539B5357J61098a25385k9944A42689f1832Q57l1098c517A48794E213J11543
12027A16756b27035R3444A59502c908r9485k86507M3693J52628q4130o5200B47318
12015E0757a18870N8193A15451J8223a07071D2101c22543J33226r2298A19088
12004a72948M3493C95101D3118N7660D5294b19765a960p838D9402a6950j61251
11993a78201e4937k60A15052a44390G3571B3457b8634A10852l883e3607A15790
$$ plain form
11981 -195518 -153296 99305 -219128 22401 -368688 109499 3702 110234 -214806 110604
11970 -329099 -44715 -88008 43393 56769 -14521 103329 61455 -7063 156031 -42563 -288609
11959 -288609 -169831 -98250 320260 -62367 -287662 -117044 -152400 262883 -171468 -152545
11949 -152545 -150058 125312 -65064 -152995 -127868 -264816 246604 -225542 -14331 723 -135141
11937 -148012 387755 91662 172660 -44707 282895 188271 80456 151887 272796 -8114 -138295
11926 -138295 101134 -96800 -60260 62114 29899 -109532 -29679 1539 -231121 -50736 -43716
11915 -43716 -25361 -355740 31379 116601 -230105 22888 -67973 -352423 -94116 -1383 206389
11903 255196 183721 94160 163163 -50795 -58729 62511 -6221 -47281 -173748 19858 33465 41150
$$ packed form
11981a95518M2222I9305b19128B2401c68688A09499C702J06532b14806A10604
11970c29099d4715m3293D3393J3376a4521A03329m1874g063A56031d2563k46046
11959b88609J18778P1581C20260f2367k25295a17044l5356B62883a71468J8923
11949a52545K487A25312f5064q7931K5127j36948B46604b25542a4331G23a35141
11937a48012C87755I1662Q0998d4707B82895r4624H0456P1431J20909h114j30181
11926a38295A01134i6800L6540F2114B9899a09532b9679A539b31121e0736P020
11915d3716J8355l30379C1379Q5222b30105B2888f7973k84450i4116a383B06389
11903B55196p1475q9561O9003e0795p934F2511f221m1060j26467A9858J3607P685
$$ plain form
11891 41150 284224 -187647 -73009 -4455 -69792 416850 -254859 94221 46959 208857 -16073
11879 226606 -123975 -185040 -219431 -168119 -39763 -20076 -239957 -91957 141202 -20085 -117489
11868 -117489 -117044 22570 -34255 -187889 -210479 13450 152749 -424401 60396 -82273 -31162
11856 21435 -153652 251795 188359 -129194 191786 -59608 217364 -208689 80835 -128314
11845 -255561 -261713 -214578 417633 31431 1088 157889 195888 -113646 107303 1653 17879
11834 17879 -87679 -203183 -50391 -132784 -316407 -38353 -65078 48457 -175092 204392 -364898
11822 397216 -13949 176594 30821 -69581 277329 166497 -127603 -33400 266138 -178382
11811 -109630 223461 267624 -164477 142132 -193633 -61361 -24114 79634 37556 -145485
$$ packed form
11891D1150K43074a87647g3009d455o5337D16850b54859I4221D6959J61898a6073
11879B26606a23975o1065l4391N1312c9763J9687k19881i1957A41202b0085r7404
11868a17489M45B2570c4255j53634k2590A3450J39299d24401F0396h2273c1162
11856B1435a53652B51795o3436a29194A91786e9608B17364b08689H0835a28314
11845b55561o152M7135D17633C1431A088J56801L7999a13646A07303A653J6226
11834A7879h7679j15504e0391q2393j83623c8353k6725D8457a75092B04392c64898
11822C97216a3949A76594C0821f9581B77329j10832a27603c3400B66138a78382
11811a09630B23461M4163a64477A42132a93633f1361b4114G9634C7556a45485
$$ plain form
11800 -137352 24835 -23479 92969 154494 -201565 57270 104177 -139312 -64168 7975 -195388
11788 -109166 -110888 -83346 -78861 -54311 190655 -314843 40512 19212 403711 51111 -222925
11776 55189 104382 23975 159180 20540 -245454 -47449 -128599 -103501 -140814 188391 -72392
11764 78596 351471 139880 15439 -219332 -270088 48596 32866 -229692 134075 -272840
11753 111785 24671 99297 -121185 -18312 122304 -116626 -36858 -202224 -363404 -48036
11742 -181679 68601 261201 113270 -28220 157695 131572 -12636 -91400 269090 -99453 -121386
11731 -121386 286027 -147591 40700 32653 -78657 -41990 66878 -84799 -170025 -276925 -36383
11719 238356 58301 -55154 -31301 -140882 271868 146759 -205796 -187123 225328 24764
$$ packed form
11800a37352B4835b3479I2969O1525b01565E7270M6907a39312f4168G975a95388
11788a09166j722K7542M485K4550A90655c14843D0512A9212L84499E1111b22925
11776E5189M9193B3975J35205B0540b45454d7449q1150K5098l7313A88391g2392
11764G8596K72875A39880A5439b19332n0756D8596j5730b29692A34075b72840
11753A11785B4671P4626a21185a8312A22304a16626c6858j65366j61180d8036
11742a81679F8601J92600A13270b8220A57695k6123a2636p8764B69090i9453k1933
11731a21386B86027a47591D0700q047g8657L6667F6878h4799q5226j06900c6383
11719B38356E8301e5154K3853j09581B71868j25109b05796J8673B25328B4764
$$ plain form
11708 -10724 117351 67539 117241 -174468 222605 225884 79700 -48505 286710 242 -43051
11696 69156 -83000 -58014 141373 -448684 33953 19637 14294 -107090 173853 213688 -177634
11684 -104363 -928 119625 -23254 40088 46703 -87342 -111299 79202 -49584 -216606 233994
11672 421683 -4347 -67094 -185664 182862 118361 67563 -31716 46415 180281 229306 47651
11660 371044 151960 -124523 154511 148330 7833 330267 237639 -121394 190567 12607 -29734
11648 29087 19904 176470 13531 221718 -208115 144799 380365 -37073 40454 18837 112895
11637 112895 -66371 153464 113642 385939 174275 60156 111656 -114710 -49956 45292 -50391
11625 -22435 32439 -14091 -77706 111118 146060 335946 161458 -430000 27347 20587 -191258
$$ packed form
11708a0724A17351m9812M9702a74468B22605L279G9700d8505B86710B42d3051
11696F9156h3000K4986A41373d48684C3953j4316n343a07090A73853L9835a77634
11684a04363i28A19625b3254D0088O615h7342k3957G9202d9584j67022B33994
11672D21683d347o2747j18570A82862o4501n0798c1716D6415J33866M9025D7651
11660C71044A51960a24523A54511o181G833L22434r2628a21394A90567A2607b9734
11648B9087r183J56566A3531K08187b08115A44799K35566c7073D0454A8837R4058
11637A12895f6371A53464l9822K72297A74275F0156N1500a14710d9956D5292e0391
11625b2435C2439a4091o3615A11118L4942J89886A61458d30000B7347o760a91258
$$ plain form
11613 -48402 -102545 -105222 265335 -160747 188403 92553 -60623 165520 105854 -98996 69489
11601 -14509 340509 -81128 -62279 146545 -22263 173654 179999 284550 115116 308783 -6297
11589 193821 213660 -110394 -3473 253069 -284261 36107 247915 572082 -178654 330413
11578 -50936 129353 -160164 184612 -154557 39442 19607 -215269 212685 187237 75745
11567 90070 39199 -110394 11171 222866 22101 -185877 251090 -224370 -38804 -43263 260725
11555 -36359 -367576 -169484 -27491 224861 -73056 40024 218299 -20944 -74972 -140758 37252
11543 -140464 423875 111943 -29396 -356247 66083 -17117 -252617 62764 -234018 88894
11532 293665 -54183 -29837 -3637 -146736 93101 34188 65051 337978 -103799 -269593 170971
$$ packed form
11613d8402n4143k677B65335a60747A88403I2553f0623A65520n9666i8996F9489
11601a4509C40509h1128J8849A46545b2263A73654O345J04551A15116J93667f297
11589A93821J9839a10394c473B53069b84261C6107K11808L24167a78654C30413
11578e0936A29353a60164A84612a54557C9442A9607b15269B12685k5448G5745
11567I0070C9199a10394A1171K11695B2101a85877B51090b24370c8804m459B60725
11555c6359l31217a69484b7491B24861g3056D0024J78275b0944n4028o5786C7252
11543a40464D23875A11943b9396l26851F6083a7117k35500F2764b34018H8894
11532B93665e4183K4346c637j43099I3101C4188L0863K72927a03799j65794A70971
$$ plain form
11520 -38577 44315 172835 37072 154980 302067 -15290 -14454 52432 278173 -5537 136460
11508 -88314 -51754 212719 -8490 39565 188012 399203 -87309 -258663 231962 165129 -78982
11496 316358 -68857 -70499 -165274 324735 -17210 23578 -176000 158242 238826 181888 221962
11485 221962 31448 302150 -62513 27754 -295465 -248 -49247 -9575 286636 29022 236309
11474 236309 109707 -432103 -349362 142724 225777 114293 -40840 62018 -36707 344104
11463 -13476 175512 11721 -45725 481599 151480 138716 16553 173214 207366 62298 28010
11451 269469 170930 -114855 32776 127002 45168 113867 64074 443862 220262 102931 152756
11440 152756 50031 285838 162936 40766 -43903 135788 301307 166072 -28645 -130653
$$ packed form
11520c8577D4315J28520C7072J17908J47087a5290Q36E2432K25741e537A36460
11508h8314L6560B12719h490C9565J48447K11191h7309j71354B31962o6833g8982
11496C16358f8857j642r4775C24735a7210B3578a76000A58242Q0584n6938M0074
11485B21962C1448K70702f2513B7754b95465b48m8999i575B86636B9022K07287
11474B36309A09707d32103Q2741A42724Q3053j11484d0840F2018c6707C44104
11463a3476A75512A1721d5725D81599A51480j2764A6553J56661L4152F2298B8010
11451B69469r8539a14855C2776R4226D5168O8699m9793L79788B20262A02931M9825
11440A52756E0031K35807j22902D0766d3903A35788J65519j35235b8645j02008
$$ plain form
11430 -130653 3264 246320 234159 230123 301873 276785 103693 120165 -9432 168303 118102
11419 118102 125573 66604 201047 256022 204293 288796 195696 351588 -93181 -89989 -223706
11408 -223706 162645 181739 185475 -36934 118072 130403 -114489 -114401 119369 -98737 78063
11396 -60615 -17312 -3982 211543 -220569 7465 -147871 135005 -33722 -270339 -160310 -518
11384 21936 132017 -237451 178377 85185 155332 -49609 291433 238672 1197 291179 -31932
11372 -1864 316852 -96359 35669 -20054 -207741 -19436 -216871 -217661 -16925 -67061 -344911
11361 -344911 146945 74794 253935 -83897 145091 -277098 44484 -14355 146462 -79158
11350 269927 -53256 546590 111598 -201491 68094 30774 -72016 -386917 2712 12348 -116954
$$ packed form
11430a30653C264K43056j2161m036P1750k5088A03693J6472i432A68303n0201
11419A18102P471n8969J34443N4975n1729Q4503r3100J55892i3181L192j33717
11408b23706A62645J9094L736c6934A18072J2331a14489Q8A19369i8737G8063
11396f0615a7312c982B11543b20569G465a47871A35005c3722k36617J10029e18
11384B1936J10081b37451A78377H5185P0147d9609B91433n2761A197K89982c1932
11372a864C16852i6359C5669b0054j87687a9436j97435p90a6925n0136k77850
11361c44911A46945p2151J79141h3897A45091b77098D4484a4355A46462g9158
11350B69927e3256E46590A11598b01491F8094C0774g2016l14901B712R636a16954
$$ plain form
11338 -140819 -82845 -19013 -164477 -47601 39750 297058 61691 134363 88544 36043 84824
11327 84824 156023 -144545 64692 77624 -255345 7744 -19643 -52136 -5740 -7221 174112 167006
11315 167006 90546 -136651 4484 122972 -207031 154679 -241065 -44413 -111395 -126856 -48096
11303 -5852 -448453 216961 -104370 -112360 -72379 -45173 -115444 -145640 243668 190428 195153
11292 195153 -159236 275724 -133414 69774 186029 -372910 -18835 -37064 -129642 -120566 89740
11280 -252081 -304622 -175502 -111397 55847 113235 -100738 -302801 -188049 -84384 -71596 -135901
11269 -135901 -174827 985 33834 -35711 -132126 204986 -319936 24166 -145089 -10914 -95108
11258 -95108 161630 -78477 -9562 31640 28128 54491 -41614 18974 71402 -75895 -271029 7866
$$ packed form
11338a40819N7974a9013j45464d7601C9750K57308F1691P2672m5819C6043M8781
11327H4824P1199a44545F4692J2932b55345G744a9643l2493e740j481A74112p106
11315A67006p6460a36651D484J18488b07031A54679b41065d4413o6982j5461d8096
11303e852m42601B16961a04370p990L9981K7206p0271l0196B43668n3240M725
11292A95153a59236B75724a33414F9774J16255c72910a8835j8229r2578R076H9740
11280b52081n2541J29120O4105E5847N7388a00738k02063J14752h4384J2788o4305
11269a35901l8926I85L2849c5711r6415B04986c19936B4166a45089a0914q4194
11258i5108A61630g8477i562C1640l512K6363d1614A8974N2428g5895j95134G866
$$ plain form
11245 -67113 65111 -63697 -229913 -124837 134949 50481 -1617 120982 -285671 44165 -118344
11233 -113392 46547 90741 -146501 -10490 248251 266018 -384828 28495 -54177 -23508 -301311
11222 -301311 15165 -206760 -40772 -78437 291317 -283763 -42607 -16268 60062 -72242 -131689
11211 -131689 -143370 -18526 -44695 -140908 -118114 87711 71961 219767 268010 154838 -72665
11199 202931 15089 -265891 156704 -156909 -191554 76124 123500 -260071 -62054 -203773
11189 -203773 -35788 220574 -297441 205454 -193908 42578 -212562 137503 -95920 -227151
11179 -227151 -68479 193932 263997 413357 -255454 7812 157536 171264 -55021 2140 -162131
11167 -342237 -97347 -128429 -54034 -153070 -101274 217868 182157 -410735 32719 284152 5499
$$ packed form
11245f7113F5111f3697j66216J05076A34949E0481a617A20982b85671D4165a18344
11233a13392D6547M4194a46501a0490B48251J7767c84828B8495e4177b3508k77803
11222c01311A5165b06760d0772l7665B91317b83763d2607a6268F0062g2242n9447
11211a31689j1681a8526k6169r6213K2794H7711j5750J47806M8243j13172g2665
11199B02931A5089b65891A56704a56909l4645G6124M7376b60071f2054j41719
11189b03773c5788B20574b97441B05454a93908D2578b12562A37503i5920j31231
11179b27151f8479A93932P0065J49360b55454G812J49724J3728e5021B140a62131
11167c42237i7347l1082e4034r9036N1796B17868l5711d10735C2719K51433E499
$$ plain form
11155 127924 -154370 158945 -21881 180259 -116497 -68116 -404701 -203353 -100455 -139483
11145 -139483 19639 -78334 287860 -152792 -239118 -22567 -71659 111062 87722 -202942 -150650
11134 -150650 -233488 9101 113609 24134 -178676 -140242 126606 -60809 -275739 -343342 -34125
11122 -67257 -128659 -121499 -152241 -122389 -161857 36446 138888 207769 -71451 -47745 -24909 109096
11109 -144361 -61560 301353 34965 176392 20710 -292276 -148208 199355 -290941 187408
11098 -107961 -152911 179915 -101022 -32026 203004 -168469 -258614 23542 -42740 142 42124
11087 42124 60610 -454169 -95042 74064 111447 140229 -221549 216420 275659 69736 23979
11075 185765 201027 164413 -374396 196058 -21600 310992 -3036 271875 177533 190475 61771
$$ packed form
11155A27924a54370A58945b1881A80259a16497M8381l36585K01348a00455l9028
11145a39483A9639g8334B87860a52792q6326b2567m9092A11062k3340b02942N2292
11134a50650q2838I101J04508B4134a78676L8434A26606f0809k14930o7603c4125
11122f7257o1402P160l0742K9852l9468C6446J02442O8881g1451K3706K2836A09096
11109a44361f1560C01353C4965J41427B0710b92276J44068A99355b90941A87408
11098a07961m4950A79915a01022c2026B03004a68469r0145B3542d2740A42M1982
11087D2124J8486d54169i5042G4064L7383K8782b21549B16420N9239F9736B3979
11075A85765J5262l6614c74396A96058b1600C10992c036B71875r4342J2942F1771
$$ plain form
11063 552386 335176 227306 -251463 210825 -2750 -77932 181930 192397 273666 205553 163431
11052 163431 -57132 229990 380105 356010 112293 251190 329129 332924 20744 297574 453980
11041 453980 363325 221533 530848 462413 77625 516835 475725 392382 400513 317071 312549
11030 312549 291093 537217 258052 580168 400855 663157 554489 598102 696009 719520
11020 719520 445614 812368 535965 778351 526888 689315 483906 614737 681050 387378
11010 387378 777791 413791 379068 683498 759134 556928 814595 749942 405802 676476
11000 676476 538714 573690 493599 392812 275923 319419 543131 267013 287459 591589
10990 591589 362031 663310 443795 518053 746499 722573 459566 497523 256889 459784
$$ packed form
11063E52386k17210j07870b51463B10825b750p5182A81930J0467Q1269o8113m2122
11052A63431e7132B29990J50115k4095A12293J38897P7939L795B0744K76830J56406
11041D53980r0655j41792L09315o8435G7625M39210m1110q3343Q131q3442m522
11030C12549k1456K46124B58052L22116j79313K62302j08668M3613R7907K3511
11020G19520k73906L66754k76403K42386k51463J62427k05409J30831O6313k93672
11010C87378L90413l64000l4723L04430P5636k02206K57667o4653l44140K70674
11000F76476j37762L4976q0091j00787j16889M3496K23712B67013K0446L04130
10990E91589k29558L01279k19515P4258K28446k3926k63007L7957k40634K02895
$$ plain form
10980 459784 395971 358562 523406 332113 676797 670180 620165 735299 601531 832129
10970 832129 853816 685476 751286 519146 675529 488217 696719 588743 648824 591863
10960 591863 402189 703636 585810 648944 777338 842697 956228 829349 1177203 807405
10950 807405 1297688 1480101 1588626 1831327 2018490 1896632 2049163 1913531 2442692 2286483
10940 2286483 2253642 1805841 1595665 1913324 1545594 1639977 1323877 1226724 1488776 1422248
10930 1422248 1145288 1294013 1207265 1291269 1038455 1059828 808056 704932 697536 757178
10920 757178 592542 373025 402104 505359 -175101 155422 -79118 -64600 425151 267231
10910 267231 -80656 242821 -269632 92883 241971 83518 477747 -64218 -75360 115840
$$ packed form
10980D59784o3813l7409J64844j91293L44684o617n0015J15134j33768K30598
10970H32129K1687j68340O5810k32140J56383j87312K08502j07976O0081n6961
10960E91863j89674L01447j17826O3134J28394O5359J13531j26879L47854l69798
10950H07405M90283J82413J08525K42701J87163j21858J52531j35632N29161j56209
10940B286483l2841m47801k10176L17659l67730R4383l16100r7153K62052o6528
10930A422248k76960J48725q6748Q4004k52814K1373k51772j03124p396N9642
10920G57178j64636k19517K9079J03255a75101A55422g9118J4518D25151j57920
10910B67231h0656B42821b69632I2883J49088H3518L94229f4218j1142A15840
$$ plain form
10899 26294 -187724 86559 -108865 -140708 36964 -64980 -78160 67330 4483 -179712 -324473
10888 -324473 -137035 2800 96384 135492 272512 276946 -313301 136481 176614 -70314 271183
10876 -82493 55056 10927 219035 -109932 359000 53118 121122 108975 114492 31951 113554
10865 113554 246751 -86240 8680 -77804 26686 178557 22804 68839 -190970 -66164 266131
10853 48981 -103755 137081 -237781 173306 -95247 -78824 78845 23480 -119519 90773 -63390
10841 -64371 -49135 133902 35335 -24482 -266175 187095 -44234 -75909 -354353 -4511 -194670
10830 -194670 -9909 -297135 39124 -3700 54358 -268306 -304849 254892 -170246 -143813 41802
10818 -6322 84892 -87259 -11173 -142865 -58139 -443114 91423 -327485 69283 -186902 -44403
$$ packed form
10899B6294a87724H6559a08865l1843C6964f4980j3180F7330D483a79712j44761
10888c24473a37035B800R3584L9108J37020M434c13301A36481M0133g0314B71183
10876h2493E5056A0927K08108a09932C59000E3118O8004j2147N517C1951Q1603
10865A13554J33197h6240H680g7804B6686J51871B2804M6035a90970f6164B66131
10853D8981a03755A37081b37781A73306i5247J6423G8845B3480a19519I0773f3390
10841f4371J5236A33902C5335b4482k41693A87095d4234l1675k78444d511j90159
10830a94670i909k87226C9124c700E4358b68306l6543B54892a70246K6433D1802
10818f322H4892h7259a1173j31692e8139l84975I1423c27485F9283a86902d4403
$$ plain form
10806 -84698 66540 -7400 146352 -103221 279951 -122948 -38270 51602 68820 -133814 -241675
10795 -241675 180096 -21125 112819 67921 11225 -70976 -204211 -173034 228160 -331254
10784 -186494 181274 -153555 -28083 114843 36514 91030 300978 -178579 -29516 -272358
10774 -272358 461976 138829 28220 117276 -44621 -107653 -114441 -306532 -296368 -358508 -639619
10763 -639619 64289 116905 256184 269320 -147907 -62448 -97572 -180722 202083 -232771 11440
10751 -49195 -184848 56669 -47542 262001 -62801 40374 83359 44602 -43097 -254665 180632
10739 172446 113692 -52133 -144149 132828 36168 -222815 -286543 -59897 10459 39007 312669
10728 312669 -365283 299795 199205 129357 7438 -233391 -277808 -97440 58182 -16099 -184354
$$ packed form
10806h4698F6540g400A46352a03221B79951a22948c8270E1602J7218a33814j07861
10795b41675A80096b1125A12819m4898A1225g0976j33235L1177B28160c31254
10784a86494A81274a53555b8083A14843C6514N4516K09948a78579b9516k42842
10774b72358D61976A38829B8220Q9056d4621o3032o788j92091J0164o2140k81111
10763f39619F4289N2616J39279J3136a47907f2448l5124q3150B02083b32771A1440
10751d9195j35653E6669d7542B62001f2801D0374M2985l8757d3097k11568A80632
10739A72446n8754e2133r2016A32828C6168b22815o3728e9897A0459K8548K73662
10728C12669c65283B99795j00590o9848G438b33391m4417i7440E8182a6099j68255
$$ plain form
10717 -184354 -117311 -126133 146655 65229 -80992 -135737 -37884 13757 -203591 307678 24738
10705 -39445 35744 -184680 94427 -8911 332427 22838 7401 -93189 -78264 14128 -51834 -258
10692 203016 573437 214958 26470 -116902 -134000 152114 5395 56931 -78132 88038 -234481
10680 -83998 117141 32792 -54671 205690 -67323 -4516 -90349 -77705 260590 12398 -87593
10668 -126542 164155 -108436 -143668 166850 -146324 225939 -85331 -324971 -21779 24124
10657 -98050 -132125 -182812 -108571 -20577 -116477 -61498 34938 213299 -150440 -404331 34805
10645 -17447 -257240 -64837 143700 -174358 81402 -46682 -6394 -290547 -131354 -96980 -185304
10634 -185304 -58105 189797 -42298 -68603 92691 133774 -101718 48975 145715 205151 -260545
$$ packed form
10717a84354O7043q822A46655F5229h0992n4745c7884A3757b03591C07678B4738
10705c9445C5744a84680I4427h911C32427B2838G401i3189J4925A4128e1834b58
10692B03016L70421B14958B6470a16902j7098A52114E395N1536g8132H8038b34481
10680h3998A17141C2792e4671B05690f7323d516q5833J2644B60590A2398h7593
10668a26542A64155a08436l5232A66850a46324B25939h5331k39640b1779B4124
10657i8050l4075n0687P4241b0577r5900N4979C4938J78361a50440k53891C4805
10645a7447k39793f4837A43700a74358H1402d6682f394k84153a31354L4374q8324
10634a85304e8105A89797d2298k6305I2691M1083a01718D8975R6740N9436b60545
$$ plain form
10622 111677 29896 -223525 -77986 134096 -48308 124850 -66190 144858 -159518 -165053 -67693
10610 -198970 -91217 -31963 -115321 155526 -262731 48503 -69749 -42699 -36971 -270759 -65810
10598 -110269 -203076 67786 115088 -338372 -83898 218501 322397 -171347 166046 -1067 -222069
10587 -222069 -192489 -94975 -140412 -8356 -127099 -157824 104693 107637 26546 -124000 307606
10575 -199294 187591 -48807 -58927 -189682 49757 -284116 -250257 -264779 159104 -54881 74518
10563 218929 -96229 -262452 -134283 64774 -36346 6651 11522 -120502 -231935 30574 55337
10552 55337 -159931 301862 -77764 -47748 84512 -270230 -241654 -70960 167250 -67537 -105054
10541 -105054 -199395 -61474 -177642 -109071 82076 -258422 -252931 116500 216758 180325 86782
$$ packed form
10622A11677B9896b23525g7986A34096d8308A24850f6190A44858a59518n535f7693
10610a98970i1217c1963q3358A55526b62731D8503f9749K7050N728k33788f5810
10598a10269r2807F7786M7302c38372h3898B18501J03896a71347A66046a067k21002
10587b22069K9580i4975m5437h356j18743l0725A04693K944B6546a24000C07606
10575a99294A87591d8807j0120j30755D9757b84116L3859j4522A59104e4881G4518
10563B18929i6229j66223J28169F4774c6346F651M871a20502j11433C0574K4763
10552E5337a59931C01862g7764L0016H4512b70230K8576g0960A67250f7537l7517
10541a05054r4341f1474j16168O8571H2076b58422N491A16500J00258l6433H6782
$$ plain form
10529 40309 -285066 4502 -386201 -5225 -2137 185771 135844 177880 -36991 -138000 86440
10517 -80758 -224668 -305924 8594 -287646 41314 36348 -370536 -196736 63780 22462 -394647
10505 73644 74561 -1987 91345 31941 -95537 169037 -131588 188581 237648 199222 -50505 11368
10492 -119100 -12440 -118704 -50144 144457 152887 12258 -80159 -268490 -46740 -21867 184057
10480 -183448 2520 -105879 -159064 -31310 -16143 -328729 184998 -183517 111939 281 -100655
10468 460130 207349 177093 -186985 112403 124779 -170896 19250 -47882 -340304 302319
10457 -109904 77104 43965 481014 20682 303781 389543 499847 269049 131577 370679
10447 370679 -11078 -60174 -218914 265316 55964 220305 -33803 252576 116587 40856
$$ packed form
10529D0309b85066D502c86201e225b137A85771m9927M2036c6991j01009H6440
10517h0758j43910q1256H594b87646D1314m966c70536J73800F3780B2462c94647
10505G3644R17a987I1345C1941i5537A69037a31588A88581M9067l8426e0505A1368
10492a19100a2440j06264e0144A44457Q430A2258h0159j88331d6740b1867A84057
10480a83448B520a05879n3185c1310J5167l12586A84998a83517A11939B81a00655
10468D60130B07349l0256a86985A12403J2376a70896A9250d7882k92422C02319
10457a09904G7104l3139M37049B0682K83099Q5762J10304k30798A31577K39102
10447C70679a1078m9096j58740B65316E5964J64341c3803B52576A16587D0856
$$ plain form
10436 -139605 -77985 -205022 -159753 28273 -104706 39273 134439 109677 -36441 -491330 -47490
10424 -208291 -153461 -202664 106391 -129701 -4319 -15119 -117871 -3558 -98454 222406 -73396
10412 -205452 -186150 38982 -264885 201833 -227433 12671 -94981 -30282 178046 221330 -116190
10400 -23919 -155157 -278642 -240551 396792 -65790 -81330 -22850 308329 136152 67583 132143
10389 132143 105994 -33803 217366 242423 376931 283899 -38332 -69202 -23518 -128563 -395184
10378 -395184 -243835 -142519 -3926 113545 -72908 237258 -72487 -24526 387313 22416 67489
10367 67489 -73225 340403 192330 207336 2148 250705 158831 -168821 243278 158498 -177228
10355 25382 221967 -53349 -162906 163443 326114 649559 103090 59945 54998 275693
$$ packed form
10436a39605O1620j27037M5269B8273a04706C9273R5166k4762c6441m54889d7490
10424b08291N4830m9203A06391a29701d319j0800j02752c558r4896B22406g3396
10412b05452J9302C8982b64885B01833b27433A2671i4981c0282A78046M3284a16190
10400b3919j31238j23485L8091C96792f5790j5540b2850C08329A36152F7583O4560
10389A32143k6149c3803B17366K5057J34508r3032c8332l0870b3518j05045k66621
10378c95184J51349J01316c926A13545g2908B37258g2487b4526C87313B2416M5073
10367F7489g3225C40403j48073J5006B148K48557r1874a68821B43278q4780a77228
10355B5382J96585e3349j09557A63443J62671L23445A03090m3145m947K20695
$$ plain form
10345 275693 311671 398809 106903 186707 281610 160051 397720 399504 79402 289963 172840
10334 172840 551307 272139 95089 -105315 -24606 108779 323264 131373 158836 207073
10324 207073 107559 493198 603504 337429 246133 245285 239211 284829 348647 179359 366792
10313 366792 93446 193024 295598 169008 41328 642389 276774 234290 321084 -157900
10302 137801 -6263 249200 -44948 -4383 80250 -149948 202009 -163510 207176 101295 33633
10290 175450 -63850 244401 -53838 128494 196691 97304 -161922 117011 154737 -7452 223073
10278 -27708 56222 -233130 -194745 -112176 -16584 53266 385042 -129707 80888 160098 -169002
10266 177017 86572 56224 -37976 -398154 30946 20849 -633 -15751 -471616 230455 -246328
$$ packed form
10345B75693L5978Q7138A06903P9804R4903j21559K37669J784G9402K10561j17123
10334A72840L78467B72139I5089a05315b4606A08779K14485A31373K7463M8237
10324B07073r9514L85639J10306k66075r1296q48o074M5618O3818j69288J87433
10313C66792I3446R9578J02574j26590D1328O01061B76774m2484Q6794a57900
10302A37801f263B49200d4948d383H0250a49948B02009a63510B07176A01295C3633
10290A75450f3850B44401e3838A28494O8197I7304a61922A17011L7726g452B23073
10278b7708E6222b33130L8385Q2569a6584E3266L31776a29707H0888P9210a69002
10266A77017H6572l0348c7976l60178C0946j0097f33j5118m55865B30455b46328
$$ plain form
10254 54591 -351384 -287928 204268 -22756 305173 60693 178446 56347 -113924 -96973 -12072
10242 121271 -142313 -108909 219457 40350 1396 -99276 -173570 192462 123532 489087 83178
10230 295407 87693 154346 -53369 213320 -122441 -47719 -296476 -274325 -472567 291920
10219 85483 30735 -98646 79115 26849 183115 -82832 -10788 -51791 -13018 184245 -298131
10207 -197334 73309 -58458 -335256 -97153 -157987 -47122 198745 -25217 -177109 -504809 176022
10195 340799 -151474 159469 -239665 -94239 -275400 143435 -145936 35005 21979 -91826
10184 55988 -95403 -129652 -5809 206482 289395 58672 -12835 -154527 -179985 -389241 119195
10172 -179014 -53317 -241844 153825 114523 -132243 61790 -124656 -28913 58740 -5861 -124642
$$ packed form
10254E4591c51384O3456B04268b2756C05173F0693J17753E6347a13924J6951a2072
10242A21271a42313L3404B19457D0350A396i9276p4294A92462o8930L65555H3178
10230B95407H7693O6653e3369B13320a22441d7719k48757K2151j98242B91920
10219H5483C0735i8646G9115B6849J56266h2832a0788m1003a3018A84245b98131
10207a97334G3309e8458k76798i7153o0834d7122A98745b5217j51892l27700A76022
10195C40799a51474A59469b39665i4239j81161A43435a45936C5005j3026i1826
10184E5988i5403l4249e809B06482Q2913E8672a2835j41692k5458k09256A19195
10172a79014e3317j88527A53825l9302a32243F1790a24656b8913E8740e861j18781
$$ plain form
10161 -124642 65155 23675 -498013 -311743 -180277 56631 -323974 112615 74003 -35943
10150 -48672 -181430 -95304 -179102 -223834 -6457 -475157 194087 36120 -132854 127541 53535
10138 237348 75012 -74406 8012 -67887 106140 -199248 141952 -61131 -270576 12596 -219896
10126 110054 -71369 -67178 245293 10210 -156919 -63288 180975 -177519 -381764 -4912 -85214
10115 -85214 111134 -203746 -10022 242 10264 87257 -54547 -86529 21287 -173800 120996
10103 -128380 -183751 14589 -152274 -244386 -6684 -180480 41233 19162 341735 -498759 -163867
10091 -40311 52984 -183168 -79166 -254333 188561 -39592 183866 83477 -251774 12221 175850
10080 175850 -45121 -79607 -35494 -253293 -174639 44456 166214 -21788 -99992 107370 -139726
$$ packed form
10161a24642F5155B3675d98013J86270J31466E6631c23974A12615l8612c5943
10150d8672j32758Q6126q3798m4732f457m68700A94087C6120a32854A27541E3535
10138B37348G5012g4406H012f7887A06140a99248A41952f1131k09445A2596b19896
10126A10054g1369M191B45293A0210a56919f3288A80975a77519k04245d912q0302
10115h5214A11134b03746a0022B42J0022P6993e4547l1982B1287a73800A20996
10103a28380n5371A4589a52274r2112f684j73796D1233A9162L22573d98759a63867
10091d0311E2984a83168g9166j75167A88561c9592A83866H3477b51774A2221J63629
10080A75850d5121l4486c5494k17799P8654D4456J21758b1788p8204A07370a39726
$$ plain form
10068 -184570 -79450 69540 -166386 -69427 -301500 -253642 -121933 -13889 -143866 -184762 74181
10056 318 -36336 -48790 176568 -101092 -155754 109160 -11370 -234650 -151663 -93365 -111312
10045 -111312 -151443 82918 -1029 234626 -207174 -73628 23490 84862 59015 -31986 -58438
10034 -58438 -17402 -133550 -278210 -8825 153926 153186 60075 -424137 151447 -59441 -58511 -15175
10021 17709 56531 -71399 -8762 -62079 -128251 -26559 -134186 -201037 -66060 -311323 -106076
10009 -148088 8856 -18799 -110046 -10788 -68362 -94763 46807 178079 174047 -270997 -8079 -100820
9997 -100820 -192018 56437 54361 -9210 -256687 -67337 -141878 -356673 -56026 156036 -238076
9985 -180284 97127 -198326 -264107 -219688 -14379 70418 163602 143029 -356113 -256627 215613
$$ packed form
10068a84570g9450F9540a66386f9427k32073M7858a21933a3889j29977m0896G4181
10056C18c6336j2454A76568a01092n4662A09160a1370k23280Q2987N8298j7947
10045a11312m0131H2918a029B34626b07174g3628B3490O1372k5847c1986k6452
10034e8438a7402j16148j44660h825A53926p40F0075d24137A51447e9441R30a5175
10021A7709L8822g1399h762n3317o6172b6559j07627o6851f6060k45263a06076
10009a48088H856a8799r1247a0788n7574k6401D6807J31272m032b70997h079r2741
9997a00820r1198E6437k076i210k47477f7337p4541k14795e6026A56036b38076
9985a80284I7127a98326o5781M4419a4379G0418R3184k0573c56113R9486B15613
$$ plain form
9973 -253489 -96196 149609 -166056 -102095 -449577 -251697 131112 21835 -8749 -306379 34273
9961 6900 230903 -389132 -14227 -101216 -55201 121891 199359 91626 -337332 192081 -220111
9949 -52247 -125585 -149400 -113645 -359132 -461449 -87930 -169695 72909 -215459 57200 64079
9938 64079 97432 -261626 -285332 139918 -21952 88122 -96340 29208 -56412 -287108 25803
9926 -39630 35648 -217777 -42005 -210071 -316859 -105480 77358 -63358 97671 147214 18977
9914 -101168 75278 96766 -398530 -284550 -22842 -203214 49759 124229 121408 -8857 411446
9902 -172124 -176681 48659 -224021 -134374 -154732 -41325 -18626 146329 31289 57390 -16303
9890 228991 171515 119344 -11059 -163182 129260 -28161 -24886 71674 179616 -100151 -84702
$$ packed form
9973b53489i6196A49609a66056O3961l47482J97880A31112B1835h749k97630C4273
9961F900K24003c89132a4227q6989M6015A21891P7468I1626c37332A92081b20111
9949e2247p3338k3815L5755k45487j02317h7930q1765G2909b15459E7200O879
9938F4079L3353b61626k3706A39918b1952H8122i6340B9208e6412k30696B5803
9926c9630C5648b17777d2005j68066j06788a05480G7358f3358I7671M9543A8977
9914a01168G5278K1488c98530J13980b2842j80372D9759P4470k821h857D11446
9902a72124m557D8659b24021Q9647k0358d1325a8626A46329C1289K6101a6303
9890B28991n7476n2171a1059j52123A29260b8161L275G1674J07942a00151J5449
$$ plain form
9879 -84702 -70059 -556765 -21139 30208 96091 -267651 -363943 -119661 -2160 26904 24295 95008
9867 95008 97325 -202236 88172 277958 -11924 105081 -172196 -208096 -94213 -233855 18490
9855 -378832 -38155 -71815 55138 75118 27967 -30196 -10468 29923 193718 121755 -324122
9843 -230730 -125085 -134293 -136127 40434 133263 -79255 -69428 87858 132437 -63906 -298072 -35946
9830 -174583 -105435 167969 99420 -321252 -12806 -212310 103439 -126857 105709 -222182
9819 -304082 -314220 -307248 -86469 -196047 -11865 315663 4285 -107179 218256 -16873 168888
9807 -132494 41650 -474 -232736 44070 75628 -128638 -54794 63967 88091 -331917 289844
9795 -30673 -215807 17137 242581 60693 217838 -146249 -202386 24305 83150 -255870 -475442
$$ packed form
9879h4702J4643m86706b1139C0208O5883b67651r6292a19661b160B6904k609P0713
9867I5008K317b02236H8172J89786a1924A05081a72196l5900i4213j39642A8490
9855c78832c8155l3660E5138J9980B7967c0196a0468B9923J63795p1963c24122
9843b30730J05645r208j834D0434R2829g9255R827H7858M4579f3906k34166c5946
9830a74583O9148A67969o8549c21252a2806j99504A03439a26857A05709b22182
9819c04082j0138O972h6469j09578a1865C15663D285a07179B18256a6873A68888
9807a32494D1650d74k32262D4070L1558a28638e4794F3967K4124c31917B89844
9795c0673j85134A7137K25444F0693J57145a46249n6137B4305N8845b55870k19572
$$ plain form
9784 -475442 -280252 -406001 -36215 -131436 -23675 -118498 129004 127956 -249018 119042 -182371
9772 82201 40029 3403 -518500 113681 -262949 11537 153211 99851 99538 475861 242046
9761 242046 -270564 174323 -4340 -487394 -248041 -78212 92330 -44099 -197944 -76321 119093
9749 167561 -354674 73727 -39857 -40556 -79595 53704 75747 -178634 -70310 -308685 -81441
9737 157355 -129966 -378137 -239278 28325 76943 -333971 -111803 224581 -17473 55187
9726 -152309 187701 -339440 19565 -316728 -74502 -68847 112014 49752 -280326 -5554 10193
9714 -172339 59789 -331003 -123105 -447368 -236672 -34561 103068 -239517 -155511 -190740
9704 -190740 -216059 -297718 -23338 -141762 149037 -164495 54738 104961 -53102 152324 -163146
$$ packed form
9784d75442J95190j25749c6215r5221b3675r4823A29004j048b49018A19042a82371
9772H2201D0029C403e18500A13681b62949A1537J41674n3360l13L76323k33815
9761B42046b70564A74323d340m83054K39353g8212I2330d4099j53845g6321A19093
9749A67561c54674G3727c9857o99l9039E3704K2043a78634g0310k38375h1441
9737A57355a29966k48171J38859B8325M8618c33971a11803B24581a7473E5187
9726a52309A87701c39440A9565c16728g4502N655A12014D9752b80326e554A0193
9714a72339E9789c31003a23105l24263K10696c4561A03068b39517Q4006l5229
9704a90740k5319q1659b3338j18424A49037a64495E4738N0223e3102A52324a63146
$$ plain form
9692 -139941 -298334 -136378 47632 -125089 -225531 154034 -212049 42210 266768 -241561
9681 -116785 174527 -283708 -521980 -208855 3743 -191782 112949 -76334 86919 106008 -110951
9669 80127 197672 -237219 -7351 16076 -259291 -360536 -423746 106544 -334167 71730 -251801
9657 -24614 -131045 -87056 -193193 96224 8526 -115681 -152683 40825 -109388 -219407 191573
9645 -201496 -140562 -26067 -84860 194392 114145 99964 -264164 4038 -279432 -199062 62242
9633 277718 84364 -165470 -18495 83947 4346 29192 -173622 84740 87538 102533 -4370 24829
9620 48540 -79261 352755 40334 -31082 -34063 -128646 34753 -353756 113664 -217020 122750
9608 -80071 -38073 -38342 -389114 103579 -555179 -295721 -337814 -329253 -31494 -170982 -56630
$$ packed form
9692a39941j58393a36378D7632a25089j00442A54034b12049D2210K24558b41561
9681a16785A74527b83708k38272b08855C743a91782A12949g6334H6919J9089a10951
9669H0127J17545b37219g351A6076b59291j01245o3210A06544c34167G1730b51801
9657b4614j06431M3989j06137I6224H526a15681l7002D0825a09388j10019A91573
9645b01496O0934b6067n8793A94392q0247j4181b64164D038b79432Q0370F2242
9633B77718H4364a65470a8495H3947D346K4846a73622H4740K798J4995d370B4829
9620D8540g9261C52755D0334c1082k981r4583C4753c53756A13664b17020A22750
9608h0071c8073k69l50772A03579e55179K59458m2093Q561c1494j39488e6630
$$ plain form
9596 57081 -222300 -34846 -268454 57249 -6503 8058 29101 -148664 -82821 246216 297023
9585 297023 7924 -255610 -137602 -321825 -4061 -5288 -24326 149672 -220631 143027 -103525
9573 -255121 -312870 35893 118988 23404 -300001 -75363 102492 10857 -108259 380781 -26349
9561 -363788 -214437 -143003 244781 8353 -273463 -195017 -193500 -329910 272714 -130490 171976
9549 111486 26232 289 125266 167581 -184828 87314 -197520 226583 38012 53733 -125402
9537 53636 228382 68764 -14739 -253666 52955 -76848 -125660 -115729 -223881 63923 -251026
9525 49987 -129127 -14137 -57703 -275894 262509 -49141 112617 -69882 192578 440275 98717
9513 -49999 -17636 -207706 -40376 111417 -580660 -185391 -27229 -48071 -144831 -51741 -4626
$$ packed form
9596E7081b22300c4846k33608E7249f503H058K1043a48664O5843B46216N0807
9585B97023G924b55610J18008j84223d061j227j9038A49672b20631A43027a03525
9573b55121n7749C5893Q3095B3404c00001g5363A02492A0857a08259C80781b6349
9561c63788J49351P1434B44781H353b73463P8446J517j36410B72714a30490A71976
9549A11486B6232B89J24977M2315a84828H7314a97520B26583C8012J5721a25402
9537E3636J74746F8764a4739k38927E2955g6848m8812R931j08152F3923b51026
9525D9987a29127a4137m3566k18191B62509d9141A12617f9882A92578K47697I8717
9513d9999a7636j90070d0376A11417e80660a85391b7229k0842r6760e1741d626
$$ plain form
9501 105496 103151 -491438 -58443 -96377 -76423 -7542 117072 -214297 -79898 -14058 -210175
9490 -210175 217478 -64120 -133187 -155996 -40429 42862 31994 -128974 -184115 149303 -44992
9478 56356 153251 -61246 414705 18065 -123034 29929 9736 -197724 -83415 -12564 143986
9466 -380803 135453 -213175 86329 112209 4573 -125860 -222255 -246947 -119426 152490 125729
9455 125729 -130842 290302 -180827 -89448 -139364 107056 -33463 128691 -297545 -245300
9445 -245300 -135309 -17968 140771 -112690 -72499 -152277 -127888 215653 -359296 -185192
9435 -185192 106703 -65714 -179957 167688 -83776 38212 151493 -106187 112009 -157083
9424 10384 -80866 5636 -58205 -157612 152795 -11490 219070 -168312 206867 203933 -2521 -122148
$$ packed form
9501A05496k345d91438e8443l7934J9954g542A17072b14297g9898a4058j96117
9490b10175B17478f4120o9067k2809d0429D2862j0868a28974n5141A49303d4992
9478E6356R6895f1246D14705A8065a23034B9929I736a97724h3415a2564A43986
9466c80803A35453b13175H6329K5880D573a25860r6395k4692a19426A52490k6761
9455A25729a30842B90302a80827h9448m9916A07056c3463A28691b97545N2245
9445b45300J09991a7968A40771a12690M0191p9778K4389B15653c59296J74104
9435a85192A06703f5714j14243A67688h3776C8212J13281a06187A12009a57083
9424A0384h0866E636e8205r9407A52795a1490B19070a68312B06867k934b521j19627
$$ plain form
9412 -122148 -262704 -117629 -199948 229604 93317 -5877 -148819 -188964 25512 10182 368620
9401 368620 230558 -46884 -215636 -111018 169617 176034 -93623 207176 183866 -62095 -168979
9390 -168979 -139364 -116654 -85857 -197613 -229287 -158049 -246967 -240070 -54003 141496 -160261
9378 -328724 100433 -213972 38562 -285504 -62182 122309 -280565 406304 -227994 -342849
9368 -342849 21591 22976 89459 -27204 -81557 -102307 240744 -111300 45327 210564 -190829
9356 -394115 -197718 -384672 26371 -2228 -401549 -98774 171362 -179694 -137226 25447 5258
9344 24032 -35857 -247573 -116731 -377562 -244483 183279 126736 148480 -10480 -238865 -46754
9332 -282006 -32435 -147834 -65448 26446 -53731 82753 58361 158105 -55533 35911 -11426
$$ packed form
9412a22148j40556a17629q2319B29604I3317e877j42942m0145B5512A0182L58438
9401C68620j38062d6884j68752J04618A69617O417i3623B07176k3310f2095j06884
9390a68979K9615K2710L0797j11756l1674P1238q8918O897e4003A41496a60261
9378c28724A00433b13972C8562b85504f2182A22309b80565D06304b27994j14855
9368c42849B1591J385O6483b7204n4353k0750B40744a11300D5327J65237a90829
9356c94115J96397j86954B6371b228l99321i8774A71362a79694M2468B5447E258
9344B4032c5857k11716a16731k60831J33079A83279n6543K1744a0480k28385d6754
9332b82006c2435j15399f5448B6446e3731H2753k4392R9744e5533C5911a1426
$$ plain form
9320 -394471 146327 -263550 -70239 70793 7427 -71269 -61186 -124496 -233127 4248 199943
9309 199943 -6075 32585 -187958 -206259 -223691 -269726 -337438 93042 -319934 -35597 -22402
9298 -22402 -240242 -304634 4111 -65783 -5569 -171735 43081 124298 -20239 -79765 -43488 -129659
9286 -129659 51026 -199348 -61294 -267525 -20707 17292 -262650 -381439 58707 -55061 270713
9274 52606 -66675 97355 -69269 -307434 -402472 69402 110578 302749 -273263 -392480 -209621
9263 -209621 -41187 -462141 -27166 171388 248514 14200 -33805 -97341 -42464 68903 -60243
9251 -43065 -18378 -127370 160974 136584 -73280 -231580 143580 198757 79625 -330381 -13756
9239 77977 -95056 -78964 -284992 254982 63505 64632 -115943 -101927 -181163 25066 120925
$$ packed form
9320c94471A46327b63550g0239G0793G427g1269J0083o3310j08631D248J95695
9309A99943f075C2585a87958j8301j7432m6035o7712I3042c19934c5597J3195
9298b2402k17840o4392D111f5783e569j66166D3081Q1217b0239n9526L6277q6171
9286a29659E1026a99348f1294k06231b0707A7292b62650j18789E8707e5061B70713
9274E2606f6675I7355f9269k38165r5038F9402M1176J92171b73263j19217J82859
9263b09621d1187m20954b7166A71388P7126A4200c3805o3536d2464F8903f0243
9251d3065a8378j08992A60974k4390g3280j58300A43580N5177G9625c30381a3756
9239G7977i5056J6092k06028B54982F3505J127a15943J4016p9236B5066R5859
$$ plain form
9228 120925 -41068 66312 -11300 10427 -103406 -92717 -149300 182581 318198 8166 -63277
9216 -107597 -7871 76004 -71893 -241783 11021 36817 -85086 81672 -41807 -73091 -65415 55979
9203 -176503 54185 109379 -155440 231985 33342 193538 -211887 -219313 -242067 119003 195706
9192 195706 -135706 -26149 -190202 -94472 -40017 -224734 -49870 -335158 14588 -233807 -36191
9180 102169 9464 -212452 22294 -283737 53631 97647 -115031 23636 -105329 -144866 -251202
9169 -251202 55300 -12262 -107295 132859 -403605 -63931 -5932 -471999 -214780 -246295 -442854
9158 -442854 -86073 132135 82849 -289763 -311776 51177 111900 -155132 166318 155494 -227651
9146 -129479 -180671 124435 66297 -320321 -26557 -68635 -124400 37641 -232056 72208 209428
$$ packed form
9228A20925d1068F6312a1300A0427a03406J0689n6583A82581J35617H166f3277
9216a07597g871G6004g1893j69890A1021K5796h5086H1672d1807l1284P676E5979
9203a76503E4185N5194a55440B31985C3342J60196b11887p426k2754A19003P6703
9192A95706a35706b6149j64053i4472d0017j84717d9870k85288A4588b33807c6191
9180A02169I464b12452B2294b83737E3631M4016a15031B3636a05329l9537j06336
9169b51202E5300a2262r5033A32859d03605f3931e932m66067b14780l1515j96559
9158d42854h6073A32135m9286b89763k2013E1177O0723a55132A66318j0824b27651
9146a29479n1192A24435n8138c20321b6557m2078n5765C7641b32056G2208J37220
$$ plain form
9135 209428 58112 -44776 56812 -55122 100326 248604 -93817 16047 39728 -63198 -2579
9123 27977 -60848 190851 20497 -178104 57010 -275528 -424669 187563 56510 -1577 -210550
9112 -210550 337030 32630 -46052 199034 -279960 404774 50114 147430 111757 323818 -102970
9100 247611 -291402 37673 53306 105425 -2257 127787 -3901 27481 -331028 -189533 -8208
9088 -206733 77594 285386 -22172 -97515 44692 -129779 -53487 521328 -212412 191109 -255859
9076 -181334 -141732 -302977 -241394 282907 -83951 108518 -325913 -106082 230937 -179889
9065 58256 132425 -138867 257171 -192694 123879 -187366 -150004 131786 -252488 47182
9054 -197796 61041 56990 -101497 -17614 -215702 -397565 86188 111774 -15270 -13119 -286991
$$ packed form
9135B09428E8112d4776E6812e5122A00326J48278i3817A6047K3681f3198b579
9123B7977f0848A90851B0497a78104E7010b75528j49141A87563E6510a577k08973
9112b10550C37030C2630d6052A99034b79960D04774E0114R7316l5673K12061a02970
9100B47611b91402C7673J5633N2119b257A27787c901B7481c31028J41495h208
9088b06733G7594K07792b2172p5343D4692a29779e3487E21328b12412A91109b55859
9076a81334L9602j61245O1583B82907h3951A08518c25913a06082B30937a79889
9065E8256P4169a38867B57171a92694A23879a87366L7362A31786b52488D7182
9054a97796F1041m051a01497a7614j98088j81863H6188K5586a5270K151k73872
$$ plain form
9043 -286991 -533676 -36000 -59695 -271658 -130744 -6962 -151754 32376 110068 134239 -44458
9031 -107051 61030 -203048 -76897 -25541 176605 93738 -253511 -273612 -252088 279936 183451
9020 183451 -105814 242801 10209 57700 -152223 57063 -242747 -310017 -226953 -90596 -93830
9009 -93830 134254 208656 210 37853 82344 101031 17574 44469 -14137 40723 -107056 134398
8996 -181779 -19261 19184 -136776 79972 -140536 -37173 -40496 24347 -216087 -201417 -41358
8984 -312905 205577 -129424 -15456 113209 139528 -293823 -173993 181016 172601 -101172
8973 -262240 -3048 -359016 -121149 111803 -244862 -196752 -38373 -139248 -122364 -288865 -219194
8962 -219194 3227 -158429 22941 52041 141225 -291180 135424 -48455 -34354 92194 124321
$$ packed form
9043b86991k46685c6000k3695k11963a30744f962j44792C2376P7692K4171d4458
9031a07051F1030b03048g6897b5541A76605q2867b53511k0101K1524B79936r6485
9020A83451a05814B42801A0209M7491a52223E7063b42747o7270Q3064i0596l234
9009i3830A34254P4402B10L7643M4491J8687A7574K6895a4137D0723a07056A34398
8996a81779a9261A9184a36776G9972a40536c7173l323B4347b16087J4670d1358
8984c12905B05577a29424a5456A13209K6319b93823J19830A81016q415a01172
8973b62240c048l55968a21149A11803b44862M8110c8373j00875J6884j66501O9671
8962b19194C227a58429B2941K9100Q9184b91180A35424d8455J4101I2194L2127
$$ plain form
8951 124321 25593 -11856 75004 -222719 -71197 -185099 15459 -106948 -412731 2416 8289
8940 8289 -64060 -27014 -13582 -20834 -169013 -50396 -217523 -55670 -12295 150196 -133804
8928 -143446 108567 -80015 90194 -197355 54714 -8938 -454727 -44169 17066 68312 48032
8917 48032 191142 -70480 23577 109469 127413 10262 -284117 -41168 -125022 19437 -117922
8905 -910 -94156 -225339 123291 -263272 92538 -16360 -29222 -92731 45571 398191 530074
8894 530074 488600 -20798 -126768 1407 359345 -67213 60109 -73413 84932 61785 253840
8883 253840 -409522 -121693 -144758 -343165 155115 111806 -527558 -170834 -13495 364600
8872 -84010 19821 -91561 241570 -55683 -43642 198161 -84185 -263929 -110252 -163407 125048
$$ packed form
8951A24321B5593a1856G5004b22719g1197j13902A5459a06948l05783B416N873
8940H289f4060b7014J3432p252j48179e0396j67127e5670a2295A50196a33804
8928a43446A08567h0015I0194a97355E4714h938m45789d4169A7066N1246k0280
8917D8032J43110g0480B3577Q5892J7944A0262b84117d1168q3854A9437a17922
8905i10r3246j31183A23291b63272I2538a6360j2862o3509D5571L52620J31883
8894E30074m1474b0798j05970A407L57938f7213F0109g3413H4932k3147J92055
8883B53840d09522a21693k3065j98407A55115m3309e27558a70834a3495C64600
8872h4010A9821i1561B41570e5683J2041A98161h4185j79744a10252n3155A25048
$$ plain form
8860 369405 -139549 -399999 -177180 -259216 -225974 -174419 -18649 -29744 96589 213854 -123650
8848 -169367 -82344 17372 -139250 -35250 78134 45888 191116 -340387 -103205 -88814 34503
8836 62240 -79550 -26126 -44027 -85491 40304 -116656 92770 -58124 1334 -155847 -99017 5628
8823 -204297 -249153 -31160 106254 -89206 3070 18322 293887 10067 -181814 -208741 9722
$$ packed form
8860C69405a39549k60450a77180q2036L3242N1555a8649j1095I6589J17265a23650
8848a69367h2344A7372a39250c5250G8134l2246J45228c40387a03205J4391C4503
8836F2240g9550b6126j7901m1464D0304a16656I2770e8124A334a55847N6830E628
8823b04297m4856c1160A06254h9206C070J5252K75565A0067a81814k6927I722
$$ [...]
##END NTUPLES=NMR SPECTRUM
##END=
