##TITLE=AC1526_ROEFFECT0006_8213789_DTOzV0TmO8
##JCAMPDX= 6.0         $$ Bruker NMR JCAMP-DX V2.0
##DATA TYPE= NMR SPECTRUM
##DATA CLASS= NTUPLES
##ORIGIN= BRUKER
##OWNER= Administrator
$$ 1.72 TOPSPIN		Version 2.1
$$ 2014-07-31 18:36:20.079 -0700  Administrator@X
$$ Compression mode = diff/dup
##.OBSERVE FREQUENCY= 400.02188249412
##.OBSERVE NUCLEUS= ^1H
##.ACQUISITION MODE= SIMULTANEOUS (DQD)
##.ACQUISITION SCHEME= undefined
##.AVERAGES= 64
##.DIGITISER RES= 22
##SPECTROMETER/DATA SYSTEM= spect
##.PULSE SEQUENCE= noesygpps1d.comp
##.SOLVENT NAME= COFFEE_meoh
##.SHIFT REFERENCE= INTERNAL, COFFEE_meoh, 1, 14.97763
##AUDIT TRAIL= $$ (NUMBER, WHEN, WHO, WHERE, PROCESS, VERSION, WHAT)
$$ ##TITLE= Audit trail, TOPSPIN		Version 2.1
$$ ##JCAMPDX= 5.01
$$ ##ORIGIN= Bruker BioSpin GmbH
$$ ##OWNER= Administrator
$$ $$ E:\/data/COFFEE/nmr/AC1526_ROEFFECT0006_8213789_DTOzV0TmO8/22/pdata/1/auditp.txt
$$ ##AUDIT TRAIL=  $$ (NUMBER, WHEN, WHO, WHERE, PROCESS, VERSION, WHAT)
(   1,<2014-07-31 18:36:12.678 -0700>,<Administrator>,<X>,<go>,<TOPSPIN 2.1>,
      <created by zg
	started at 2014-07-31 18:24:38.319 -0700,
	POWCHK enabled, PULCHK disabled,
       configuration hash MD5:
       16 EA D6 F4 BB 67 03 14 9B FF E7 A0 43 5B 48 2E
       data hash MD5: 64K
       49 56 36 D0 E8 8E 95 CC EE 18 82 25 0A 7A C9 2F>)
(   2,<2014-07-31 18:36:17.023 -0700>,<Administrator>,<X>,<proc1d>,<TOPSPIN 2.1>,
      <Start of raw data processing
       efp LB = 0.3 FT_mod = 6 PKNL = 1 PHC0 = 0 PHC1 = 0 SI = 128K 
       data hash MD5: 128K
       5B E5 26 2B 11 2F B4 51 A6 D2 03 CE 56 24 BF 62>)
(   3,<2014-07-31 18:36:18.624 -0700>,<Administrator>,<X>,<proc1d>,<TOPSPIN 2.1>,
      <pk PHC0 = -82.78748 PHC1 = 0 
       data hash MD5: 128K
       B6 6E 65 E6 73 69 62 3D 1D 60 12 75 84 B4 3E 1F>)
(   4,<2014-07-31 18:36:19.206 -0700>,<Administrator>,<X>,<proc1d>,<TOPSPIN 2.1>,
      <abs ABSG = 1 
       data hash MD5: 128K
       A8 33 31 A1 78 8D CC 32 6B 37 9E 03 85 89 8E 19>)
(   5,<2014-07-31 18:36:19.372 -0700>,<Administrator>,<X>,<proc1d>,<TOPSPIN 2.1>,
      <abs ABSG = 2 
       data hash MD5: 128K
       01 92 C6 CE 34 36 7E F0 19 89 41 EC B9 8E A5 CB>)
(   6,<2014-07-31 18:36:19.518 -0700>,<Administrator>,<X>,<proc1d>,<TOPSPIN 2.1>,
      <abs ABSG = 3 
       data hash MD5: 128K
       D2 F5 68 FE A6 D1 31 EF A7 F7 5B 51 99 EB 57 E5>)
(   7,<2014-07-31 18:36:19.642 -0700>,<Administrator>,<X>,<proc1d>,<TOPSPIN 2.1>,
      <abs ABSG = 4 
       data hash MD5: 128K
       31 3A 4A A6 7A A3 BA B7 46 C7 80 79 D0 A3 E9 E3>)
(   8,<2014-07-31 18:36:19.788 -0700>,<Administrator>,<X>,<proc1d>,<TOPSPIN 2.1>,
      <abs ABSG = 5 
       data hash MD5: 128K
       D3 DF 99 A0 9A E2 4E E1 22 74 2F 89 19 0A 80 2D>)
$$ ##END=
$$ 
$$ $$ hash MD5
$$ $$ 8F B0 AF 5D F0 74 8A 38 23 54 E7 FA CE 4A F6 4B
##$RELAX= 
##$RELAX= 
##$RELAX= 
##$RELAX= 
##$RELAX= 
##$RELAX= 
##$RELAX= 
##$RELAX= 
$$ Bruker specific parameters
$$ --------------------------
##$DU= <E:\>
##$EXPNO= 22
$$ [...]
##$TP07= 0
##$TPNAME0= <>
##$TPNAME1= <>
##$TPNAME2= <>
##$TPNAME3= <>
##$TPNAME4= <>
##$TPNAME5= <>
##$TPNAME6= <>
##$TPNAME7= <>
##$TPOAL= (0..7)
0.5 0.5 0.5 0.5 0.5 0.5 0.5 0.5
##$TPOFFS= (0..7)
0 0 0 0 0 0 0 0
##$TUNHIN= 0
##$TUNHOUT= 0
##$TUNXOUT= 0
##$USERA1= <user>
##$USERA2= <user>
##$USERA3= <user>
##$USERA4= <user>
##$USERA5= <user>
##$V9= 5
##$VALIST= <valist>
##$VCLIST= <CCCCCCCCCCCCCCC>
##$VD= 0
##$VDLIST= <DDDDDDDDDDDDDDD>
##$VPLIST= <PPPPPPPPPPPPPPP>
##$VTLIST= <TTTTTTTTTTTTTTT>
##$WBST= 1024
##$WBSW= 4
##$XGAIN= (0..3)
0 0 0 0
##$XL= 0
##$YL= 0
##$YMAX_a= 10041735
##$YMIN_a= -11001898
##$ZGOPTNS= <>
##$ZL1= 120
##$ZL2= 120
##$ZL3= 120
##$ZL4= 120
##$ABSF1= 14.97763
##$ABSF2= -5.580552
##$ABSG= 5
##$ABSL= 3
##$ALPHA= 0
##$AQORDER= 0
##$ASSFAC= 0
##$ASSFACI= 0
##$ASSFACX= 0
##$ASSWID= 0
##$AUNMP= <proc_prof1d_extract.lims>
##$AXLEFT= 0
##$AXNAME= <>
##$AXNUC= <1H>
##$AXRIGHT= 0
##$AXTYPE= 0
##$AXUNIT= <>
##$AZFE= 0.1
##$AZFW= 0.1
##$BCFW= 0
##$BC_mod= 0
##$BYTORDP= 0
##$COROFFS= 0
##$CY= 15
##$DATMOD= 1
##$DC= 0
##$DFILT= <>
##$DTYPP= 0
##$F1P= 0
##$F2P= 0
##$FCOR= 0.5
##$FTSIZE= 131072
##$FT_mod= 6
##$GAMMA= 0
##$GB= 0
##$INTBC= 1
##$INTSCL= 1
##$ISEN= 128
##$LB= 0.3
##$LEV0= 0
##$LPBIN= 0
##$MAXI= 10000
##$MC2= 0
##$MEAN= 0
##$ME_mod= 0
##$MI= 0
##$NCOEF= 0
##$NC_proc= -1
##$NLEV= 6
##$NOISF1= 0
##$NOISF2= 0
##$NSP= 0
##$NTH_PI= 0
##$NZP= 0
##$OFFSET= 14.97763
##$PC= 1
##$PHC0= -82.78748
##$PHC1= 0
##$PH_mod= 1
##$PKNL= yes
##$PPARMOD= 0
##$PPDIAG= 0
##$PPIPTYP= 0
##$PPMPNUM= 2147483647
##$PPRESOL= 1
##$PSCAL= 4
##$PSIGN= 0
##$PYNMP= <proc.py>
##$REVERSE= no
##$SF= 400.02000298611
##$SI= 131072
##$SIGF1= 0
##$SIGF2= 0
##$SINO= 400
##$SIOLD= 131072
##$SPECTYP= <>
##$SREGLST= <1H.CDCl3>
##$SSB= 0
##$STSI= 131072
##$STSR= 0
##$SW_p= 8223.68421052631
##$SYMM= 0
##$S_DEV= 0
##$TDeff= 65536
##$TDoff= 0
##$TI= <>
##$TILT= no
##$TM1= 0
##$TM2= 0
##$TOPLEV= 0
##$USERP1= <user>
##$USERP2= <user>
##$USERP3= <user>
##$USERP4= <user>
##$USERP5= <user>
##$WDW= 1
##$XDIM= 131072
##$YMAX_p= 161874090
##$YMIN_p= -450018868
##$CURPLOT= <Network HP LaserJet P1505>
##$CURPRIN= <$Network HP LaserJet P1505>
##$DFORMAT= <normdp>
##$LAYOUT= <+/1D_H.xwp>
##$LFORMAT= <normlp>
##$PFORMAT= <normpl>
##$SURQMSG= 1
$$ End of Bruker specific parameters
$$ ---------------------------------
##NTUPLES= NMR SPECTRUM
##VAR_NAME=  FREQUENCY,     SPECTRUM/REAL,   SPECTRUM/IMAG
##SYMBOL=    X,             R,               I
##VAR_TYPE=  INDEPENDENT,   DEPENDENT,       DEPENDENT
##VAR_FORM=  AFFN,          ASDF,            ASDF
##VAR_DIM=   131072,        131072,          131072
##UNITS=     HZ,            ARBITRARY UNITS, ARBITRARY UNITS
##FACTOR=    0.0627417313425164, 1,          1
##FIRST=     8223.62146879497, 1193,         -14348
##LAST=      0,             1578,            -14250
##MIN=       0,             -450018868,      0
##MAX=       8223.62146879497, 161874090,    0
$$ Real data points
##PAGE= N=1
##DATA TABLE= (X++(R..R)), XYDATA
$$ [...]
62977B26029J866J997K147K369K805L280L359K941K460K385K681L049L422L972
$$ 226029 227895 229892 232039 234408 237213 240493 243852 246793 249253 251638 254319 257368 260790 264762
62963B64762M721N474O081O606P207P969Q833R651J0394J1278J2569J4242J5936
$$ 264762 269483 274957 281038 287644 294851 302820 311653 321304 331698 342976 355545 369787 385723
62950C85723J7380J8670K0017K1360K2441K3200K3845K4547K5180K5512K5519
$$ 385723 403103 421773 441790 463150 485591 508791 532636 557183 582363 607875 633394
62939F33394K5379K5196K4867K4360K3998K4258K5129K5948K6061K5516K4809
$$ 633394 658773 683969 708836 733196 757194 781452 806581 832529 858590 884106 908915
62928I08915K4009K2572K0017J6442J2177P300J810l984r620j4953k0100k4964
$$ 908915 932924 955496 975513 991955 1004132 1011432 1013242 1009258 999638 984685 964585 939621
62916I39621k9091l2122l4059l5047l5085l4134l2356l0089k7592k4909k1959
$$ 939621 910530 878408 844349 809302 774217 740083 707727 677638 650046 625137 603178
62905F03178j8717j5318j1984q842n840k912j69K219M254O121P904R496J0818
$$ 603178 584461 569143 557159 548317 542477 539565 539396 541615 545869 551990 559894 569390 580208
62892E80208J1967J3073J4044J4690J4981J5098J5179J5139J4780J4042J3090
$$ 580208 592175 605248 619292 633982 648963 664061 679240 694379 709159 723201 736291
62881G36291J2135J1163R931Q189N916L236J83l319p238j1289j5099j8407k1121
$$ 736291 748426 759589 769520 777709 783625 786861 787044 783725 776487 765198 750099 731692 710571
62868G10571k3271k4949k6227k6984k6961k6082k4649k3091k1623k0283j9113
$$ 710571 687300 662351 636124 609140 582179 556097 531448 508357 486734 466451 447338
62857D47338j8100j6976j5485j3839j2609j1989j1539j0789r845r126q716q343
$$ 447338 429238 412262 396777 382938 370329 358340 346801 336012 326167 317041 308325 299982
62845B99982p837p235o526n660m815m304m116l903l510l163k964k612j888j132
$$ 299982 292145 284910 278384 272724 267909 263605 259489 255586 252076 248913 245949 243337 241449 240317
62831B40317q00p69m94J78P94R65Q71Q87J000Q67L47k93p25r58j277j823k327
$$ 240317 239517 238748 238254 238432 239226 240191 241062 241949 242949 243816 244163 243870 243145 242187 240910 239087 236760
62814B36760k410k073j753j793k039k066j735j287r61p71o34n52n57o54q32j077
$$ 236760 234350 232277 230524 228731 226692 224626 222891 221604 220643 219872 219238 218686 218129 217475 216643 215566
62798B15566j321j463j441j227q15l46r2j12j01J91M89L72%l1L53N11L9n69o39
$$ 215566 214245 212782 211341 210114 209299 208953 208861 208749 208648 208839 209328 209700 209700 209669 210022 210533 210572 210003 209364
62779B09364k59k3r3j44l8J2p9j36j17j97l53k98K8K93K62R1%m6q8J5L06N50N62
$$ 209364 209105 209082 208989 208845 208807 208819 208740 208604 208487 208290 207937 207639 207667 207960 208222 208313 208313 208267 208179 208194 208500 209050 209612
62756B09612M80M75M14J48j40j48O7K32L04M81P49Q47O22K30j11k99l15j92j11
$$ 209612 210092 210567 210981 211129 210989 210841 210908 211140 211444 211925 212674 213521 214143 214373 214262 213963 213648 213456 213345
62737B13345k68o11q85r44q53p08n61n10o25p41n90k21J7mQK95O61P94P68Q78
$$ 213345 213077 212466 211581 210637 209784 209076 208515 208005 207380 206639 206049 205828 205845 205841 205849 206144 206805 207599 208367 209245
62717B09245J170J425J575J775K058K218K142K007J991K006J865J613J467J530
$$ 209245 210415 211840 213415 215190 217248 219466 221608 223615 225606 227612 229477 231090 232557 234087
62703B34087J682J814J951K179K507K850L137L389L742M367N329O471P528Q398
$$ 234087 235769 237583 239534 241713 244220 247070 250207 253596 257338 261705 267034 273505 281033 289431
62689B89431R236J0247J1457J2757J4114J5608J7289J9090K0937K2848K4933K7322
$$ 289431 298667 308914 320371 333128 347242 362850 380139 399229 420166 443014 467947 495269
62677D95269L0060L2988L5708L7864L9488M0906M2177M2744M1809L9059L4843
$$ 495269 525329 558317 594025 631889 671377 712283 754460 797204 839013 878072 912915
62666I12915K9806K4352J8482J1933M494l648j1824j9199k5233k9880l3412l6188
$$ 912915 942721 967073 985555 997488 1001982 998334 986510 967311 942078 912198 878786 842598
62654H42598l8383l9865m0326l9696l8340l6682l4778l2497l0022k7789k5921
$$ 842598 804215 764350 724024 684328 645988 609306 574528 542031 512009 484220 458299
62643D58299k4030k1781j9358j7225j5579j4239j2942j1575j0189q890p755o793
$$ 458299 434269 412488 393130 375905 360326 346087 333145 321570 311381 302491 294736 287943
62631B87943o048n651n551n330m555l361k359j844j503j006n29l24j73L30J141
$$ 287943 281895 276244 270693 265363 260808 257447 255088 253244 251741 250735 250206 249882 249709 250039 251180
62616B51180J851K305K703L157L545L873M392N228O204P078P800Q458R199J0281
$$ 251180 253031 255336 258039 261196 264741 268614 273006 278234 284438 291516 299316 307774 316973 327254
62602C27254J1915J3976J6034J7808J9443K1245K3348K5645K7857K9667L0843
$$ 327254 339169 353145 369179 386987 406430 427675 451023 476668 504525 534192 565035
62591E65035L1389L1391L0757K9284K6954K3928K0258J5825J0661N024q84o987
$$ 565035 596424 627815 658572 687856 714810 738738 758996 774821 785482 790506 789622 782635
62579G82635j2976j8187k2117k4876k6917k8476k9518l0008k9958k9301k8013
$$ 782635 769659 751472 729355 704479 677562 649086 619568 589560 559602 530301 502288
62568E02288k6306k4511k2758k0973j9146j7373j5715j4177j2831j1757j0864
$$ 502288 475982 451471 428713 407740 388594 371221 355506 341329 328498 316741 305877
62557C05877r940q919p955p182o567o035n573n165m697m099l425k823k350j937
$$ 305877 295937 287018 279063 271881 265314 259279 253706 248541 243844 239745 236320 233497 231147 229210
62543B29210j491j036p77r08j389j907k134k024j755j509j306j078p66l87r4n3
$$ 229210 227719 226683 225906 224998 223609 221702 219568 217544 215789 214280 212974 211896 211130 210743 210649 210596
62527B10596k27l05m8L66N82N73O43Q94R59N32q2k52J66O52P19N27N95J122J807
$$ 210596 210369 210064 210016 210382 210964 211537 212180 213074 214033 214565 214483 214231 214397 215049 215768 216295 216890 218012 219819
62508B19819K330K711L127L584L925M127M381M872N588O371P133Q015R262J0971
$$ 219819 222149 224860 227987 231571 235496 239623 244004 248876 254464 260835 267968 275983 285245 296216
62494B96216J2904J4684J6147J7457J8783K0003K0838K1156K0943K0078J8396
$$ 296216 309120 323804 339951 357408 376191 396194 417032 438188 459131 479209 497605
62483D97605J5991J3166J0061O520K474j752n663q984j1676j3752j5269j6373
$$ 497605 513596 526762 536823 543343 545817 544065 538402 529418 517742 503990 488721 472348
62471D72348j7227j7859j8220j8285j7999j7246j6046j4709j3600j2757j1925
$$ 472348 455121 437262 419042 400757 382758 365512 349466 334757 321157 308400 296475
62460B96475j0922r801q681p598o582n694m936m247l586k991k505k155j956j864
$$ 296475 285553 275752 267071 259473 252891 247197 242261 238014 234428 231437 228932 226777 224821 222957
62446B22957j730j476j274j396j843k278k369k123j790j589j539j484j241p72
$$ 222957 221227 219751 218477 217081 215238 212960 210591 208468 206678 205089 203550 202066 200825 200053
62432B00053k36J94N69J048J607K030K265K517K927L343L594L791M177M791N531
$$ 200053 199817 200011 200580 201628 203235 205265 207530 210047 212974 216317 219911 223702 227879 232670 238201
62417B38201O428P577Q847R968J0927J2004J3373J4865J6244J7428J8281J8461
$$ 238201 244629 252206 261053 271021 281948 293952 307325 322190 338434 355862 374143 392604
62405C92604J7729J6286J4501J2422R853O849L788Q69k100n237q231j0643j2361
$$ 392604 410333 426619 441120 453542 463395 470244 474032 474901 472801 467564 459333 448690 436329
62392D36329j3500j4070j4071j3779j3563j3383j2865j1902j0896j0235r817r309
$$ 436329 422829 408759 394688 380909 367346 353963 341098 329196 318300 308065 298248 288939
62380B88939q634p954p324o684o052n546n177m877m677m664m701m445l763l003
$$ 288939 280305 272351 265027 258343 252291 246745 241568 236691 232014 227350 222649 218204 214441 211438
62366B11438k606k600k605k334j928j669j571j408j117r06q69p30k36L89P23P93
$$ 211438 208832 206232 203627 201293 199365 197696 196125 194717 193600 192694 191825 191095 190859 191248 191971 192764
62350A92764J064J666K096J956J602J672K175K550K569K631L027L406L251K586
$$ 192764 193828 195494 197590 199546 201148 202820 204995 207545 210114 212745 215772 219178 222429 225015
62336B25015J831J151L37p29j784k498k874l159l520l872m038l944l698l449l246
$$ 225015 226846 227997 228334 227605 225821 223323 220449 217290 213770 209898 205860 201916 198218 194769 191523
62321A91523l010k666k273j963j785j681j579j446j245r33n71l44l04k34J19O24
$$ 191523 188513 185847 183574 181611 179826 178145 176566 175120 173875 172942 172371 172027 171723 171489 171608 172232
62305A72232Q44N77J01j82k09j29L8L60P13R21J088J482K017K272K071J747J620
$$ 172232 173076 173653 173754 173572 173363 173234 173272 173632 174345 175266 176354 177836 179853 182125 184196 185943 187563
62288A87563J648J746K046K534K805K591K293K445K876K946K524K122K038J944
$$ 187563 189211 190957 193003 195537 198342 200933 203226 205671 208547 211493 214017 216139 218177 220121
62274B20121J589J352J725K570L299L627L825M345N403O860Q341R525J0496J1638
$$ 220121 221710 223062 224787 227357 230656 234283 238108 242453 247856 254716 263057 272582 283078 294716
62260B94716J3141J4792J6387J7988J9516K0392K0069J8751J7147J5511J3403
$$ 294716 307857 322649 339036 357024 376540 396932 417001 435752 452899 468410 481813
62249D81813J0541P398M712K711J065n70k295m121o052q005r797j1272j2308j2822
$$ 481813 492354 499752 504464 507175 508240 507670 505375 501254 495202 487197 477400 466128 453820 440998
62235D40998j2917j2954j3192j3349j2816j1445r849q771q298q007p679p532p719
$$ 440998 428081 415127 401935 388586 375770 364325 354476 345705 337407 329400 321721 314189 306470
62222C06470q024q194q298q486q604q324p620o817o193n681n037m157l208k476
$$ 306470 298446 290252 281954 273468 264864 256540 248920 242103 235910 230229 225192 221035 217827 215351
62208B15351k104j933j640j129o68n14n37l77L6M13N34N23O03P98R79J073J079
$$ 215351 213247 211314 209674 208545 207877 207363 206826 206449 206485 206898 207432 207955 208558 209356 210335 211408 212487
62191B12487J011R04Q36Q30P97O30L56J10M1J98M62N87M33J96K24O17J090J308
$$ 212487 213498 214402 215238 216068 216865 217495 217851 217961 218002 218200 218662 219249 219682 219878 220102 220719 221809 223117
62173B23117J210J019J062J594K645L918N036N937O862P966R134J0326J1783J3706
$$ 223117 224327 225346 226408 228002 230647 234565 239601 245538 252400 260366 269500 279826 291609 305315
62159C05315J5862J7814J9356K0546K1398K1777K1555K0605J8750J5974J2649
$$ 305315 321177 338991 358347 378893 400291 422068 443623 464228 482978 498952 511601
62148E11601R317O223L280M56k140m546p066r852j2638j4986j6721j7956j8771
$$ 511601 520918 527141 530421 530877 528737 524191 517125 507273 494635 479649 462928 444972 426201
62135D26201j9084j8777j7868j6582j5242j4050j2884j1433r579p556n718m194
$$ 426201 407117 388340 370472 353890 338648 324598 311714 300281 290702 283146 277428 273234
62123B73234k869j610m18O62J582K313K859L304L766M292M798N158N320N336N253
$$ 273234 270365 268755 268337 268999 270581 272894 275753 279057 282823 287115 291913 297071 302391 307727 312980
62108C12980M988M374L355K172J171M83p2p10j443k190k939l656m122m091l630
$$ 312980 317968 322342 325697 327869 329040 329523 329451 328741 327298 325108 322169 318513 314391 310300 306670
62093C06670l113k804k637k469k281k001j344j62J157J926J901J506J254J166
$$ 306670 303557 300753 298116 295647 293366 291365 290021 289859 291016 292942 294843 296349 297603 298769
62079B98769R37M22k31q05j126r60r5J413L180M832O318P899R789J1842J3582
$$ 298769 299706 300128 299897 299092 297966 297006 296911 298324 301504 306336 312654 320553 330342 342184 355766
62064C55766J4577J4749J4289J3285J1630R344O778M369K284M72j081k360l478
$$ 355766 370343 385092 399381 412666 424296 433640 440418 444787 447071 447543 446462 444102 440624
62051D40624m568n647o747q080r740j1306j2095j1891j1123j0281r443q450p242
$$ 440624 436056 430409 423662 415582 405842 394536 382441 370550 359427 349146 339703 331253 324011
62038C24011n890m552l508k944k623k118j494j309j710j973j416l17N94J289K378
$$ 324011 318121 313569 310061 307117 304494 302376 300882 299573 297863 295890 294474 294157 294751 296040 298418
62023B98418M013N590O702P716R106J0687J1897J2472J2402J1512R601O952M266
$$ 298418 302431 308021 314723 322439 331545 342232 354129 366601 379003 390515 400116 407068 411334
62010D11334K039L15r13j489j494j601k593m536o619p908q087p445o389n135l743
$$ 411334 413373 413688 412775 411286 409792 408191 405598 401062 394443 386535 378448 371003 364614 359479 355736
61995C55736k196m51J422L119M350N193N964O679O938O527N860N512N527N487
$$ 355736 353540 353089 354511 357630 361980 367173 373137 379816 386754 393281 399141 404653 410180 415667
61981D15667N212M976N032N249N422N667O292P399Q756R976J0772J1045J0894
$$ 415667 420879 425855 430887 436136 441558 447225 453517 460916 469672 479648 490420 501465 512359
61968E12359J0525J0143R898R831R757R253P951N895L480J084j171l220m879n922
$$ 512359 522884 533027 542925 552756 562513 571766 579717 585612 589092 590176 589005 585785 580906 574984
61954E74984o277o080n654n423n673o320o994p451p750q018q250q445q745r230
$$ 574984 568707 562627 556973 551550 545877 539557 532563 525112 517362 509344 501094 492649 483904 474674
61940D74674r769j0226j0704j1355j2007j2317j2234j2050j1957j1822j1497j1083
$$ 474674 464905 454679 443975 432620 420613 408296 396062 384012 372055 360233 348736 337653
61928C37653j0685j0129r184q014p098o696o581o361n954n579n413n375n256m965
$$ 337653 326968 316839 307655 299641 292543 285847 279266 272905 266951 261372 255959 250584 245328 240363
61914B40363m565m101l530k842k228j930j875j593p25M77J399J784J990K412K915
$$ 240363 235798 231697 228167 225325 223097 221167 219292 217699 216974 217451 218850 220634 222624 225036 227951
61899B27951L071K772K264J698R29j25j220j965k239k269k438k950l638m082m050
$$ 227951 231022 233794 236058 237756 238685 238560 237340 235375 233136 230867 228429 225479 221841 217759 213709
61884B13709l787l706l831l731l104k181j442j127j095j073q50l91J51N89R29
$$ 213709 209922 206216 202385 198654 195550 193369 191927 190800 189705 188632 187782 187391 187542 188131 189060
61869A89060J309J724J987K036K073K257K506K695K839K926K800K435K136K156
$$ 189060 190369 192093 194080 196116 198189 200446 202952 205647 208486 211412 214212 216647 218783 220939
61855B20939K346K414K388K495K716K876L050L471M020M253M069L989M565N720
$$ 220939 223285 225699 228087 230582 233298 236174 239224 242695 246715 250968 255037 259026 263591 269311
61841B69311O947P925Q742R564J0276J0577J0356R903R638R604R381Q640P598
$$ 269311 276258 284183 292925 302489 312765 323342 333698 343601 353239 362843 372224 380864 388462
61828C88462O708O035N184L858K167M39j034k052k578k826l017l050k610j621
$$ 388462 395170 401205 406389 410247 412414 412853 411819 409767 407189 404363 401346 398296 395686 394065
61814C94065l20J112K673M251N531O399P083P738Q099P825O889N497L748J658
$$ 394065 393745 394857 397530 401781 407312 413711 420794 428532 436631 444456 451345 456842 460590 462248
61800D62248o47l007n364p610r438j0550j1007j1164j1299j1476j1627j1598j1184
$$ 462248 461601 458594 453230 445620 436182 425632 414625 403461 392162 380686 369059 357461 346277
61787C46277j0332r256q232p336o532n919n636n594n487n142m681m294m036l813
$$ 346277 335945 326689 318457 311121 304589 298670 293034 287440 281953 276811 272130 267836 263800 259987
61773B59987l479k923k179j474r97o23n0P61J458J761J899K363L345M628O006
$$ 259987 256508 253585 251406 249932 248935 248312 248262 249023 250481 252242 254141 256504 259849 264477 270483
61758B70483P520R134J0492J1290J1801J2644J4042J5585J6836J7799J8634J9206
$$ 270483 278003 287137 297629 308919 320720 333364 347406 362991 379827 397626 416260 435466
61746D35466J9255J8799J8019J6858J5112J2791J0099P099L822O59j821l464m531
$$ 435466 454721 473520 491539 508397 523509 536300 546399 553498 557320 557979 556158 552694 548163
61733E48163n067m746l485j703K89K638N365P822R238R487Q925P736N875L474
$$ 548163 543096 538350 534865 533162 533451 536089 541454 549276 558514 568001 576926 584662 590537 594011
61719E94011P38k402o050r778j2824j4895j6338j7482j8268j8636j8752j8632
$$ 594011 594749 592347 586297 576519 563695 548800 532462 514980 496712 478076 459324 440692
61707D40692j7986j6697j5169j3855j2739j1520j0194r034q139p293o309n263
$$ 440692 422706 406009 390840 376985 364246 352726 342532 333498 325359 318066 311757 306494
61695C06494m335l631l175k921k727k450k128j952k038k265k416k410k329k251
$$ 306494 302159 298528 295353 292432 289705 287255 285127 283175 281137 278872 276456 274046 271717 269466
61681B69466k152j981j726j383r40m59j18n5k02l62m65n73o62n56j79K56M65L92
$$ 269466 267314 265333 263607 262224 261284 260825 260707 260652 260450 260088 259623 259050 258388 257832 257653 257909 258374 258766
61663B58766J98nk00l82n27o48p56p83o81n04l28j03J83L36J31l29o66o98o03
$$ 258766 258964 258959 258759 258377 257850 257202 256446 255663 254982 254478 254150 254047 254230 254566 254697 254368 253702 253004 252401
61644B52401n72n10k33J86M59M27K05O8K04N67Q63Q36O28O75J120J497J292O57
$$ 252401 251829 251319 251086 251272 251731 252158 252363 252431 252635 253202 254065 254901 255529 256204 257324 258821 260113 260770
61626B60770K77N29J107J544J731J755J584J212R36J035J331J372J082Q11P86
$$ 260770 261047 261576 262683 264227 265958 267713 269297 270509 271445 272480 273811 275183 276265 277076 277862
61611B77862Q12O51K85k88j146k099k597k370j853j662j815j901j770j678j754
$$ 277862 278674 279325 279610 279322 278176 276077 273480 271110 269257 267595 265780 263879 262109 260431 258677
61596B58677j812j709j531j380j292j394j760k139k146j803j494j344j116q00
$$ 258677 256865 255156 253625 252245 250953 249559 247799 245660 243514 241711 240217 238873 237757 236957
61582B36957p84j197j578j518j249j188j303j315j277j423j685j791j728j662
$$ 236957 236173 234976 233398 231880 230631 229443 228140 226825 225548 224125 222440 220649 218921 217259
61568B17259j549j229q69q20j092j370j508j622j641j332q35p01j099j459j152
$$ 217259 215710 214481 213612 212792 211700 210330 208822 207200 205559 204227 203392 202691 201592 200133 198981
61553A98981l39K83L70K24K86O21J000J266J469J692J857J788J485J205J166J201
$$ 198981 198642 198925 199295 199519 199805 200426 201426 202692 204161 205853 207710 209498 210983 212188 213354 214555
61537B14555Q50j09j357k294k609k497k371k401k402k176j815j568j482j366j125
$$ 214555 215405 215296 213939 211645 209036 206539 204168 201767 199365 197189 195374 193806 192324 190958 189833
61522A89833q88p62o69n59n17n85o38n86n31n51n64n74q41j524k374k992l250
$$ 189833 188945 188183 187514 186955 186438 185853 185215 184629 184098 183547 182983 182409 181568 180044 177670 174678 171428
61505A71428l230l008k726k687k978l198k963k509k339k419k239j648j066q38
$$ 171428 168198 165190 162464 159777 156799 153601 150638 148129 145790 143371 141132 139484 138418 137580
61491A37580q53r57j223j591j693j318p69n04n97q05q89p73n20l41m05n66n00
$$ 137580 136727 135770 134547 132956 131263 129945 129176 128672 128075 127270 126381 125608 125088 124747 124342 123776 123276
61474A23276k20j11l45n66l89N9L48K88Pl06m62k83J47L91J10m36o52l41R3K10
$$ 123276 123056 122945 122600 122034 121645 121704 122052 122340 122347 122041 121579 121296 121443 121834 121944 121508 120856 120515 120608 120818
61454A20818M3o3M7J88J66O1Q3J89J48m9n4K98O34N30J83J56N39Q56Q63R36J407
$$ 120818 120861 120798 120845 121033 121199 121260 121343 121532 121680 121631 121577 121875 122509 123039 123222 123378 123917 124773 125636 126572 127979
61433A27979J976K114J750J278J026R89R39N88j83j089j621j603j381j263j096
$$ 127979 129955 132069 133819 135097 136123 137112 138051 138639 138456 137367 135746 134143 132762 131499 130403
61418A30403o72k43k41o01p92m73J33N61N51K22r6j69j28l03p27j025r49p31o89
$$ 130403 129731 129488 129247 128646 127854 127381 127514 128075 128626 128848 128752 128583 128455 128152 127425 126400 125451 124720 124031
61399A24031p14n06j32P3J4r3j20j14nL32P33Q52O89O45Q65R85P16L31K49L97
$$ 124031 123317 122811 122679 122752 122766 122673 122553 122439 122434 122766 123499 124351 125040 125685 126550 127535 128251 128582 128831 129228
61379A29228M06K71L56P35R82P82M10L08M37M20J96R4K23J98k38o82n56P3N98
$$ 129228 129634 129905 130261 130996 131978 132760 133170 133478 133915 134335 134531 134625 134848 135046 134808 134126 133570 133643 134241
61360A34241P02O19N97N31L32K12L39N05M41K13R9J82L62N76Q04R75J077J214
$$ 134241 134943 135562 136159 136690 137022 137234 137573 138078 138519 138732 138831 139013 139375 139951 140755 141730 142807 144021
61342A44021J410J492J378J312J576K093K551K750K657K281J751J382J378J544
$$ 144021 145431 146923 148301 149613 151189 153282 155833 158583 161240 163521 165272 166654 168032 169576
61328A69576J548J368J197J111J041J004J019Q74L72l06p30p50n54k89L2K70J67
$$ 169576 171124 172492 173689 174800 175841 176845 177864 178738 179110 178804 178074 177324 176770 176481 176513 176783 176950
61311A76950l13r07j418j819k021j866j433j027p39l73J21L97J74l64p62p71m53
$$ 176950 176637 175730 174312 172493 170472 168606 167173 166146 165407 165034 165155 165552 165726 165362 164600 163829 163376
61294A63376l3K18J28j46k25RK27J14k11m23m60m87n04l19J17N76Q21Q06O65N74
$$ 163376 163343 163561 163689 163543 163318 163327 163554 163668 163457 163034 162574 162087 161583 161264 161381 161957 162778 163584 164249 164823
61274A64823O75R69J240J242R70O80O24Q15J096J297J332J224J118J205J564K063
$$ 164823 165498 166467 167707 168949 169919 170599 171223 172038 173134 174431 175763 176987 178105 179310 180874 182937
61258A82937K506K830L116L447L836M312M902N521N919N910N499M775L809K819
$$ 182937 185443 188273 191389 194836 198672 202984 207886 213407 219326 225236 230735 235510 239319 242138
61244B42138K195K090K088J648Q86M43N17M88j94j191j759j801j878k295k685
$$ 242138 244333 246423 248511 250159 251045 251488 252005 252493 252299 251108 249349 247548 245670 243375 240690
61229B40690k615k171j771j630j618j477j085n60j84r7j27j3K43M45N65Q00J266
$$ 240690 238075 235904 234133 232503 230885 229408 228323 227763 227579 227482 227355 227342 227585 228030 228595 229395 230661
61212B30661J804K262K722L403M378N451O249O480O180N647N051M238L106J991
$$ 230661 232465 234727 237449 240852 245230 250681 256930 263410 269590 275237 280288 284526 287632 289623
61198B89623J385J304J276R97O48M67L11j16q41j623k241k648k873k971k965k825
$$ 289623 291008 292312 293588 294585 295233 295700 296011 295895 295054 293431 291190 288542 285669 282698 279733 276908
61182B76908k550k279k162k133j922j413p89k77R9L94N67N60M81N45Q37J246J632
$$ 276908 274358 272079 269917 267784 265862 264449 263660 263383 263482 263876 264443 265003 265484 266029 266866 268112 269744
61165B69744K070K858M208N818O915O957O201N391M857M231L085J502j26j571
$$ 269744 271814 274672 278880 284698 291613 298570 304771 310162 315019 319250 322335 323837 323711 322140
61151C22140k816l822m517m939n160n145m851m426m081l793l307k509j643j084
$$ 322140 319324 315502 310985 306046 300886 295741 290890 286464 282383 278590 275283 272774 271131 270047
61137B70047r59j085j194j135p94p8R07J746K028J865J797K131K595K799K807
$$ 270047 269088 268003 266809 265674 264880 264802 265709 267455 269483 271348 273145 275276 277871 280670 283477
61122B83477K903L058K980K692K578K867L358L787M092M248M121L689L194K936
$$ 283477 286380 289438 292418 295110 297688 300555 303913 307700 311792 316040 320161 323850 327044 329980
61108C29980L022L426M063M748N280N712O311P128P815Q098Q205Q622R462J0305
$$ 329980 333002 336428 340491 345239 350519 356231 362542 369670 377485 385583 393788 402410 411872 422177
61094D22177J0576R999Q723P121N543M138K901J801Q16q3r14j632k311l207m492
$$ 422177 432753 442752 451475 458596 464139 468277 471178 472979 473795 473712 472798 471166 468855 465648 461156
61079D61156n966p256q267r157r940j0396j0412j0123r705r304r178r511r992
$$ 461156 455190 447934 439667 430510 420570 410174 399762 389639 379934 370630 361452 351941 341949
61066C41949j0031r492q810q271p581o455n164m146l373k552j697j063o68k59
$$ 341949 331918 322426 313616 305345 297764 291309 286145 281999 278626 276074 274377 273314 272646 272387
61052B72387K87Q92J505K042K169J536K78j025j928k451k782k878k523j635m10
$$ 272387 272674 273566 275071 277113 279282 280818 281096 280071 278143 275692 272910 270032 267509 265874 265464
61037B65464Q20J880K865L917M919N605N989O458P323Q450R464J0152J0537J0718
$$ 265464 266284 268164 271029 274946 279865 285470 291459 297917 305240 313690 323154 333306 343843 354561
61023C54561J0891J1257J1785J2117J1952J1386J0708J0038R369Q771Q286P753
$$ 354561 365452 376709 388494 400611 412563 423949 434657 444695 454064 462835 471121 478874
61011D78874O962N926M799L643K477J420N03n35k027l996o141q138r750j0847
$$ 478874 485836 491762 496561 500204 502681 504101 504604 504069 502042 498046 491905 483767 474017 463170
60997D63170j1529j2138j2821j3270j3093j2375j1572j0933j0381r832r331q847
$$ 463170 451641 439503 426682 413412 400319 387944 376372 365439 355058 345226 335895 327048
60985C27048q280p689p202o711n942m936m107l691l428k953k322j862j670j414
$$ 327048 318768 311079 303877 297166 291224 286288 282181 278490 275062 272109 269787 267925 266255 264841
60971B64841p83Q2O97Q19P64R93J553K121K547L003L544L978M281M787N649O478
$$ 264841 264058 264140 264837 265656 266420 267413 268966 271087 273634 276637 280181 284159 288440 293227 298876 305354
60955C05354O872P044P501Q322R140R719J0117J0372J0480J0622J1003J1458J1574
$$ 305354 312226 319270 326771 335093 344233 353952 364069 374441 384921 395543 406546 418004 429578
60942D29578J1253J0851J0693J0718J0709J0584J0438J0362J0381J0456J0628
$$ 429578 440831 451682 462375 473093 483802 494386 504824 515186 525567 536023 546651
60931E46651J1140J2210J3619J4779J5439J5931J6566J7158J7513J8005J9262
$$ 546651 557791 570001 583620 598399 613838 629769 646335 663493 681006 699011 718273
60920G18273K1563K4934K9444L4852M0405M5571N0637N6142O2236O9426P9404
$$ 718273 739836 764770 794214 829066 869471 915042 965679 1021821 1084057 1153483 1232887
60909A232887R4043J14010J39396J71199K10759K58235L13470L78387M57026N53909
$$ 1232887 1326930 1440940 1580336 1751535 1962294 2220529 2533999 2912386 3369412 3923321
60899C923321O74462Q23461R92415J141284J200030J106147Q54264N11033J78151
$$ 3923321 4597783 5421244 6413659 7554943 8754973 9861120 10715384 11226417 11404568
60890A1404568o1816j71087j48546j9405J59138K97202L03531J37128j65092n11348
$$ 11404568 11342752 11171665 11023119 11003714 11162852 11460054 11763585 11900713 11735621 11224273
60880A1224273q08034r99896j076515j057192r74055q60243p41375o31305n34402
$$ 11224273 10416239 9416343 8339828 7282636 6308581 5448338 4706963 4075658 3541256
60871C541256m51064l80619l21084k69561k24358j85782j54424j29606j09877
$$ 3541256 3090192 2709573 2388489 2118928 1894570 1708788 1554364 1424758 1314881
60862A314881r4150q1715p1742o3382n6181m9969m4540l9611l4900l0247k5851
$$ 1314881 1220731 1139016 1067274 1003892 947711 897742 853202 813591 778691 748444 722593
60851G22593k2401k0516k0024k0067k0001j9802j9632j9434j9083j8467j7371
$$ 722593 700192 679676 659652 639585 619584 599782 580150 560716 541633 523166 505795
60840E05795j5646j3657j2083j1130j0329r324q361p737p269o626n882n286m796
$$ 505795 490149 476492 464409 453279 442950 433626 425265 417528 410259 403633 397751 392465 387669
60827C87669m207l555l022k589k133j733j523j381j097p06l68L2P36J651K409
$$ 387669 383462 379907 376885 374296 372163 370430 368907 367526 366429 365723 365355 365387 366123 367774 370183
60812C70183K898L374L957M397M539M629M953N355N470N301N239N535N977O218
$$ 370183 373081 376455 380412 384809 389348 393977 398930 404285 409755 415056 420295 425830 431807 438025
60798D38025O202O141O199O342O483O668P006P543Q150Q621Q796Q678Q444Q237
$$ 438025 444227 450368 456567 462909 469392 476060 483066 490609 498759 507380 516176 524854 533298 541535
60784E41535P968P398O457N411M584L957L193K091Q23l44j418k594l890n078n963
$$ 541535 549503 556901 563358 568769 573353 577310 580503 582594 583417 583073 581655 579061 575171 570093 564130
60769E64130o577p019p311p513p827q352q849q955q638q214p928p792p845q291
$$ 564130 557553 550534 543223 535710 527883 519531 510682 501727 493089 484875 476947 469155 461310 453019
60755D53019r114r842r959r488q877q409p994p517p081o845o815o923p083p192
$$ 453019 443905 434063 424104 414616 405739 397330 389336 381819 374738 367893 361078 354155 347072 339880
60741C39880p185p133p136p108o923o675o572o538o256n659n057m642m189l482
$$ 339880 332695 325562 318426 311318 304395 297720 291148 284610 278354 272695 267638 262996 258807 255325
60727B55325k713k256k176k235k193j934j437q52m07j20K87R06J352J217O50K19
$$ 255325 252612 250356 248180 245945 243752 241818 240381 239529 239122 239002 239289 240195 241547 242764 243414 243633
60711B43633K62O16R15R07N93K46K08M54N06O1n28o56k38K25L37J47j28l98o60
$$ 243633 243895 244511 245426 246333 246926 247172 247380 247834 248340 248401 247873 247217 246979 247204 247541 247688 247560 247162 246502
60692B46502r07j150j358j448j480j732k301k823k853k495k225k224k291k345
$$ 246502 245595 244445 243087 241639 240159 238427 236126 233303 230450 227955 225730 223506 221215 218870
60678B18870k515k710k649k372k314k636k928k794k381k060j909j775j542j154
$$ 218870 216355 213645 210996 208624 206310 203674 200746 197952 195571 193511 191602 189827 188285 187131
60664A87131o04j12l1l46n43k42K75M99M09M29P64J186J401J412J422J595J940
$$ 187131 186527 186415 186384 186038 185495 185253 185528 186027 186436 186865 187629 188815 190216 191628 193050 194645 196585
60647A96585K373K835L331L737L666K825J491L33l38p92j240j434j195r20j106
$$ 196585 198958 201793 205124 208861 212527 215352 216843 217176 216838 216046 214806 213372 212177 211257 210151
60632B10151j626j958j976j985k114k155k056k070k281k421k309k129k079k059
$$ 210151 208525 206567 204591 202606 200492 198337 196281 194211 191930 189509 187200 185071 182992 180933
60618A80933j956j919k106k296k120j577j052q60r67j173j368j511j536j418j238
$$ 180933 178977 177058 174952 172656 170536 168959 167907 167047 166080 164907 163539 162028 160492 159074 157836
60603A57836j089q97n14lL48L61K41L13N90P56N93K45oj0K32O38J035J199J083
$$ 157836 156747 155850 155336 155333 155681 156042 156283 156596 157186 157942 158535 158780 158774 158764 158996 159634 160669 161868 162951
60584A62951R13R79J366J940K466K726K660K468K406K469K409K160J976K016K077
$$ 162951 163864 164843 166209 168149 170615 173341 176001 178469 180875 183344 185753 187913 189889 191905 193982
60569A93982J925J672J560J528J314Q99N52M43M65L96J35k16l88j99J55K06j82
$$ 193982 195907 197579 199139 200667 201981 202880 203432 203875 204340 204736 204871 204655 204267 204068 204223 204429 204247
60552B04247n69n43k72j85k91k84j64k58o34j047j431k000k738l209l146k807
$$ 204247 203678 203135 202863 202678 202387 202103 201939 201681 201047 200000 198569 196569 193831 190622 187476 184669
60536A84669k533k308j988j638j367j081o50k04K2m0k62m97o04m91k71j76k57
$$ 184669 182136 179828 177840 176202 174835 173754 173104 172900 172922 172882 172620 172123 171519 171028 170757 170581 170324
60519A70324l34l43m52o99q22o77n13n84p59p99p57p81p81o38n16n78n80k51J07
$$ 170324 169990 169647 169195 168496 167674 166997 166484 165900 165141 164342 163585 162804 162023 161385 160869 160291 159711 159460 159567
60500A59567o0o66r73n82N9L44L02L60O85J020J071Q12M61L30N55R30J085Q84
$$ 159567 159507 158841 157868 157286 157345 157689 157991 158351 159036 160056 161127 161939 162400 162730 163285 164215 165300 166184
60482A66184M94P5l51o74o25j54L69N80N72P17J103J452J522J404J391J672K225
$$ 166184 166678 166753 166402 165728 165103 164949 165318 165898 166470 167187 168290 169742 171264 172668 174059 175731 177956
60465A77956K860L387L736L931L961L807L572L427L313K900J988Q01k57j015j522
$$ 177956 180816 184203 187939 191870 195831 199638 203210 206637 209950 212850 214838 215639 215382 214367 212845
60450B12845j719j462q55l18j96m32o78o23j54O58J623K533L330M108M946N751
$$ 212845 211126 209664 208809 208491 208295 207863 207185 206562 206408 207066 208689 211222 214552 218660 223606 229357
60434B29357O299O458O292N929N340M338K866J223j52j150k017k869l412l348
$$ 229357 235656 242114 248406 254335 259675 264013 266879 268102 267950 266800 264783 261914 258502 255154
60420B55154k845k366k106j907j634j312r14l30K97O03M73K64L36O72J137J819
$$ 255154 252309 249943 247837 245930 244296 242984 242070 241740 242037 242640 243113 243377 243713 244385 245522 247341
60404B47341K755L547L723L447L482M367N931P745R618J1530J3386J5121J6832
$$ 247341 250096 253643 257366 260813 264295 268662 274593 282338 291956 303486 316872 331993 348825
60391C48825J8487J9654J9839J9011J7403J4908J1087N885On652j0665j4941j8207
$$ 348825 367312 386966 406805 425816 443219 458127 469214 475099 475105 469453 458788 443847 425640
60378D25640k0080k0545k0029j8916j7343j5498j3799j2518j1503j0439r309q344
$$ 425640 405560 385015 364986 346070 328727 313229 299430 286912 275409 264970 255661 247317
60366B47317p651p136o692o254n672m841l944l409l406l624l555k990k126j383
$$ 247317 239666 232530 225838 219584 213912 209071 205127 201718 198312 194688 191133 188143 186017 184634
60352A84634j126j412j884k001j578r98p79r63j137r80o06l10j76p7M1O9p5k78
$$ 184634 183508 182096 180212 178211 176633 175635 174856 173893 172756 171776 171170 170860 170684 170607 170648 170717 170642 170364
60334A70364l45k59k08l05l76j73K57N45M44J36l3M8K18L35L64K50n4m12n71m39
$$ 170364 170019 169760 169552 169247 168871 168698 168955 169500 169944 170080 170047 170095 170313 170648 171012 171262 171208 170796 170225 169786
60314A69786k04j8K05N85R43R44M95j40o46r27j021r16n52L1O36J044J151R91
$$ 169786 169582 169564 169769 170354 171297 172241 172736 172596 171950 171023 170002 169086 168534 168565 169201 170245 171396 172387
60296A72387O74L32Q9N5K79O88J092J321J334J229J079Q94P13O78Q88J224J407
$$ 172387 173061 173393 173482 173537 173816 174504 175596 176917 178251 179480 180559 181453 182166 182844 183732 184956 186363
60279A86363J304J112J129J374J557J436J098Q15P05P04P60Q81R62P95L62l8j06
$$ 186363 187667 188779 189908 191282 192839 194275 195373 196188 196893 197597 198357 199238 200200 200995 201357 201319 201213
60262B01213J02L12M38O05Q62J099J320J721K327K845L025L060L356M021M763
$$ 201213 201315 201627 202065 202670 203532 204631 205951 207672 209999 212844 215869 218929 222285 226306 231069
60247B31069N305N608N681N413M648L342J568m27k206l374l928m220m476m557
$$ 231069 236374 241982 247663 253076 257724 261066 262634 262207 260001 256627 252699 248479 244003 239446
60233B39446m255l651l016k506k127j901j859j943k026k010j806j382r23p96j108
$$ 239446 235191 231540 228524 226018 223891 221990 220131 218188 216162 214152 212346 210964 210041 209245 208137
60218B08137j456j358q36l52j58p4J75O11J144J702K211K585K882L296L914M604
$$ 208137 206681 205323 204487 204135 203977 203903 204078 204689 205833 207535 209746 212331 215213 218509 222423 227027
60202B27027N188N563N600N151M241L046J679J45j413k678l501m054m547m978
$$ 227027 232215 237778 243378 248529 252770 255816 257495 257640 256227 253549 250048 245994 241447 236469
60188B36469n239n298n095m559l838l324l171l064k647k005j453j042o31k99k76
$$ 236469 231230 225932 220837 216278 212440 209116 205945 202881 200234 198229 196776 195734 195103 194804 194528
60173A94528n12o49n22l79m67o61o45l30K2Q2j67l88k16L10P85R27Q14O09L03
$$ 194528 194016 193367 192845 192466 191999 191338 190693 190363 190385 190467 190300 189912 189696 190006 190791 191718 192532 193141 193444
60154A93444l7j10K10M96K65k97n04j18M06N97M99L68K69J69J27J64J72J56K70
$$ 193444 193407 193297 193507 194003 194268 193971 193467 193349 193755 194352 194851 195219 195488 195657 195784 195948 196120 196276 196546
60135A96546M73M73J90K2L28Q88J234J295J343J481J517J370J228J246J382J533
$$ 196546 197019 197492 197682 197704 198032 198920 200154 201449 202792 204273 205790 207160 208388 209634 211016 212549
60119B12549J652J686J588J477J548J795J930J724J278R08Q19R63J119J113R72
$$ 212549 214201 215887 217475 218952 220500 222295 224225 225949 227227 228135 228954 229917 231036 232149 233121
60104B33121Q86R89J153J085O36n5p10j154j380j439j390j334j396j547j560j240
$$ 233121 234007 234996 236149 237234 237870 237815 237105 235951 234571 233132 231742 230408 229012 227465 225905 224665
60088B24665p67n38o03m91J79J054J394R82L48K1k9q6k06l01l92m43k10L99R80
$$ 224665 223898 223360 222757 222266 222445 223499 224893 225875 226223 226244 226215 226129 225923 225622 225230 224787 224577 224976 225956
60069B25956J049P29N93Q58J154J165J047J023R33N37Qk23r5Rj77m03k62K43O82
$$ 225956 227005 227734 228327 229185 230339 231504 232551 233574 234507 235044 235052 234829 234734 234743 234566 234163 233901 234144 234826
60050B34826P60O79Q14J202J534J634J683J897K186K326K268K069J666J042N25
$$ 234826 235586 236265 237079 238281 239815 241449 243132 245029 247215 249541 251809 253878 255544 256586 257111
60035B57111N70J155J710J783J504J240J068Q06L82p5m85q49j156j413j701j994
$$ 257111 257681 258836 260546 262329 263833 265073 266141 266947 267329 267254 266769 265920 264764 263351 261650 259656
60019B59656j997j480p86n70r90j473j536j462j795k401k546j919j058n96m91
$$ 259656 257659 256179 255393 254823 253833 252360 250824 249362 247567 245166 242620 240701 239643 239047 238556
60004B38556l35j27k12n88p00j47P59J334J276Q96O84Q79J372J898K241K373K456
$$ 238556 238221 238094 237882 237294 236594 236447 237206 238540 239816 240712 241396 242275 243647 245545 247786 250159 252615
59987B52615K646K914L078L025K804K516K189J800J387J052Q13N15p3j047k263
$$ 252615 255261 258175 261253 264278 267082 269598 271787 273587 274974 276026 276839 277354 277281 276234 273971
59972B73971l450m386n015n378n489n260m627l757l053k771k694k355j654r95
$$ 273971 270521 266135 261120 255742 250253 244993 240366 236609 233556 230785 228091 225736 224082 223087
59958B23087p40p41o35m14l71n45n99k90K03N42O07N27M84N99Q37R83Q38M89J76
$$ 223087 222347 221606 220971 220557 220186 219641 219042 218752 218955 219497 220104 220631 221115 221714 222551 223534 224372 224861 225037
59939B25037j06o09j360j992k226k220k223k213k129k192k528k740k384j746j624
$$ 225037 224931 224322 222962 220970 218744 216524 214301 212088 209959 207767 205239 202499 200115 198369 196745
59924A96745k239k909k975k591k271k051j594r01m01l43m63l83n4L37O22P37O57
$$ 196745 194506 191597 188622 186031 183760 181709 180115 179214 178813 178470 178007 177624 177570 177907 178529 179266 179923
59907A79923M71L58L59K63n2l16j45L83P68P12M76M38O03P55Q60R88J013P68M35
$$ 179923 180394 180752 181111 181374 181322 181006 180861 181244 182012 182724 183200 183638 184241 184996 185856 186844 187857 188625 189060
59888A89060L88O54Q42P20M88L57K02j66o57j055j333j516j504j226q24m93k21
$$ 189060 189448 190102 190944 191664 192152 192509 192711 192545 191888 190833 189500 187984 186480 185254 184430 183937 183716
59871A83716Q0L23M04M49O50R74J253J479J741K020K271K586K933K886K070Q37
$$ 183716 183796 184119 184523 184972 185622 186596 187849 189328 191069 193089 195360 197946 200879 203765 205835 206672
59855B06672L4qJ63o6o08r95j150j389j832k151j989j408q08n37n80o29m50j63
$$ 206672 206706 206698 206861 206795 206187 205192 204042 202653 200821 198670 196681 195273 194465 193928 193348 192719 192269 192106
59837A92106j03l85p40p92m29J58P14J118J371J493J477J352J191J040Q53O20
$$ 192106 192003 191618 190878 190086 189657 189815 190529 191647 193018 194511 195988 197340 198531 199571 200424 201044
59821B01044N17P38J129J236Q98N55P52J454K181K680L120L589L875L784L403
$$ 201044 201561 202299 203428 204664 205562 206117 206869 208323 210504 213184 216304 219893 223768 227552 230955
59806B30955K862K106J122K06k82l24k62m28q19j150j145q78p46r93j307j091
$$ 230955 233817 235923 237045 237251 236969 236645 236383 235955 235136 233986 232841 231963 231217 230224 228917 227826
59790B27826k24P38J212J243J349J827K458K830K797K597K578K809K952K610J774
$$ 227826 227602 228340 229552 230795 232144 233971 236429 239259 242056 244653 247231 250040 252992 255602 257376
59775B57376Q48J69l34r43j744k515k924k803k274j674j306j195j180j151j168
$$ 257376 258224 258393 258059 257116 255372 252857 249933 247130 244856 243182 241876 240681 239501 238350 237182
59760B37182j259j349j332j146p46j82K91L91K27L10J050K356L811N040N784N809
$$ 237182 235923 234574 233242 232096 231350 231168 231459 231850 232077 232387 233437 235793 239604 244644 250428 256237
59744B56237N032L669K125P29l04p47m17O00J864K816L074K568J438r2j737l117
$$ 256237 261269 264938 267063 267792 267488 266741 266324 266924 268788 271604 274678 277246 278684 278592 276855 273738
59728B73738l889m028l907l982m371m814m995m779m275l770l507l405l153k688
$$ 273738 269849 265821 261914 257932 253561 248747 243752 238973 234698 230928 227421 224016 220863 218175
59714B18175k338k270k069j324l75N8q5j84O5K51P7j42j02p5l87p92q76p52q19
$$ 218175 215837 213567 211498 210174 209799 209857 209772 209588 209653 209904 209981 209839 209737 209662 209275 208483 207607 206855 206036
59695B06036j092j259j220j097r01n91l44l15k73J12O79R56Q54O92O41N22K54
$$ 206036 204944 203685 202465 201368 200467 199876 199532 199217 198944 199056 199735 200691 201545 202237 202878 203400 203654
59678B03654Pj16k01k92l32l74n13n90l29K01O18P73Q51R42Q90P27P66J094J320
$$ 203654 203661 203545 203344 203052 202720 202346 201833 201243 200914 201115 201733 202506 203357 204299 205189 205916 206682 207776 209096
59659B09096J149Q34Q16J135J442J495J386J389J714K301K823L028L085L339L730
$$ 209096 210245 211079 211895 213030 214472 215967 217353 218742 220456 222757 225580 228608 231693 235032 238762
59644B38762L796L382K905K720K585K086J283N87J64j09l23m68o39r18j142j116
$$ 238762 242558 245940 248845 251565 254150 256236 257519 258106 258270 258161 257838 257370 256731 255813 254671 253555
59628B53555r94j121j445j485r74k87j5k95p50r76r34q96j093j429j585j357r14
$$ 253555 252561 251440 249995 248510 247536 247249 247234 246939 246189 245213 244279 243383 242290 240861 239276 237919 237005
59611B37005o09n92o86o49m37j48J56N27R61J297J318R75M86J37K0Jn5j56k46
$$ 237005 236396 235804 235118 234469 234032 233884 234040 234567 235528 236825 238143 239118 239604 239741 239761 239762 239707 239551 239305
59592B39305l39m78o63p72o28j19O01J093J004M34j55m70o47r10j188j297j303
$$ 239305 238966 238488 237825 237053 236425 236306 236907 238000 239004 239438 239283 238813 238166 237256 236068 234771 233468
59575B33468j464j841k198k314k250k208k247k255k108j811j459j157r40q07p39
$$ 233468 232004 230163 227965 225651 223401 221193 218946 216691 214583 212772 211313 210156 209216 208409 207670
59560B07670o76n09j67K59N65O25N07L34J77Q6J30K77L55K34m4l34n84p73q03
$$ 207670 206994 206485 206318 206577 207142 207767 208274 208608 208785 208871 209001 209278 209633 209867 209823 209489 208905 208132 207329
59541B07329n70j14M18R15J326J564J546J319J046Q48P24N70K23l91j079j464
$$ 207329 206759 206645 207063 207978 209304 210868 212414 213733 214779 215627 216351 216921 217144 216753 215674 214210
59525B14210j404j226j283j409j171o09l31p40j501k031k187k165j980j477p69
$$ 214210 212806 211580 210297 208888 207717 207108 206777 206037 204536 202505 200318 198153 196173 194696 193927
59510A93927k67j51r0L79J333K375K963K807K102J385J034Q97N48j32p71r59p10
$$ 193927 193660 193509 193419 193798 195131 197506 200469 203276 205378 206763 207797 208694 209242 209110 208339 207380 206670
59493B06670l72k89n42r60j238j199r26o15l16j4J36p0m94p08n50l13k20j05J71
$$ 206670 206298 206009 205467 204507 203269 202070 201144 200529 200213 200199 200335 200265 199771 199063 198513 198200 197980 197875 198046
59474A98046L07j3n35p24m93k24j54j72j93l17n52p43q20q28o53j68L53M35J28
$$ 198046 198353 198340 197805 197081 196588 196364 196210 196038 195845 195528 194976 194233 193413 192585 191932 191764 192117 192552 192680
59455A92680M3M83J017J172J106J224J531J826K193K797L385L552L419L589M485
$$ 192680 192723 193206 194223 195395 196501 197725 199256 201082 203275 206072 209457 213009 216428 220017 224502
59440B24502O117Q381J0904J2567J1869Q327L271j148l680m508m392l764k735
$$ 224502 230619 239000 249904 262471 274340 282667 285938 284790 281110 276602 272210 268446 265711
59427B65711j546n46J75P85J248J175L63p56j554j962k428l140l807m171m351
$$ 265711 264165 263619 263794 264579 265827 267002 267365 266609 265055 263093 260665 257525 253718 249547 245196
59412B45196m493m536m526m666m785m297l104k042j857k140j950j208o75p10q82
$$ 245196 240703 236167 231641 226975 222190 217893 214789 212747 210890 208750 206800 205592 204917 204207 203325
59397B03325q21o81n58k37K36L28k00q47j098j091j153j123o75NL81L16J22O5
$$ 203325 202504 201823 201265 201028 201264 201592 201392 200545 199447 198356 197203 196080 195405 195410 195791 196107 196229 196294
59379A96294J79N38J265K179K794K799K363J916J742J824J950J931J780J685J790
$$ 196294 196473 197011 198276 200455 203249 206048 208411 210327 212069 213893 215843 217774 219554 221239 223029
59364B23029K082K477K943L460L969M420M784M976M923M684M383M004L467K870
$$ 223029 225111 227588 230531 233991 237960 242380 247164 252140 257063 261747 266130 270134 273601 276471
59350B76471K424K027J261o6j588k777l469l875m232m645n020n060m478l383k240
$$ 276471 278895 280922 282183 282117 280529 277752 274283 270408 266176 261531 256511 251451 246973 243590 241350
59335B41350j391p85l03k3M3J77O59J476K545L902N450O762P480P745P936Q178
$$ 241350 239959 239174 238871 238848 238891 239068 239727 241203 243748 247650 253100 259862 267342 275087 283023 291201
59319B91201Q343Q322Q065P659P540Q144Q928Q237M885l12n229q432r905j0040
$$ 291201 299544 307866 315931 323590 331130 339274 348202 356439 361324 361012 355783 347351 337446 327406
59305C27406q976p008m700k169R03M064N614M148K59l976p033q868r955j0260
$$ 327406 318430 311422 306722 304553 305456 309520 315134 319282 319541 315565 308532 299664 289709 279449
59291B79449r492p875o166m942m134l394k641k130j925j653r37M1P13P69M63K25
$$ 279449 269957 262082 255916 250974 246840 243446 240805 238675 236750 235097 234160 234201 234914 235683 236146 236371
59275B36371K83O26J074J363J403J496J957K564K766K527K465K942L519L670L614
$$ 236371 236654 237280 238354 239717 241120 242616 244573 247137 249903 252430 254895 257837 261356 265026 268640
59260B68640L937M648N167N155M891M845N248O063P040P737P848P574P379P407
$$ 268640 272577 277225 282392 287547 292438 297283 302531 308594 315634 323371 331219 338793 346172 353579
59246C53579P392P108O582N771M455K544K67k031m070n599o525p189q102r290
$$ 353579 360971 368079 374661 380432 384887 387431 387698 385667 381597 375998 369473 362284 354182 344892
59232C44892j0157j0218r620q746p709o554n608n131m822m144l077k099j497j153
$$ 344892 334735 324517 314897 306151 298442 291888 286280 281149 276327 272183 269106 267007 265510 264357
59218B64357j005j216j698j923j507p10r3J20J36K20M89R55J509J962K224K436
$$ 264357 263352 262136 260438 258515 257008 256298 256205 256325 256461 256681 257170 258125 259634 261596 263820 266256
59202B66256K818L504M578O003P362P865O882M424J038k586n691p534p853p247
$$ 266256 269074 272578 277156 283159 290521 298386 305268 309692 310730 308144 302453 294919 287066 279819
59188B79819o621o252n695m622l316k247j494q39j48O17J529K607L669M482M955
$$ 279819 273198 266946 261251 256629 253313 251066 249572 248733 248585 249202 250731 253338 257007 261489 266444
59173B66444N097M924M561M245M045L670K804J575M68k25o55j103j603j941j982
$$ 266444 271541 276465 281026 285271 289316 292986 295790 297365 297833 297608 296953 295850 294247 292306 290324
59158B90324j865j880k135k440k540k465k498k753k971k816k259j569r78m75R5
$$ 290324 288459 286579 284444 282004 279464 276999 274501 271748 268777 265961 263702 262133 261155 260680 260775
59143B60775Q51J743K590L245L697L899L619K698J422L73k66q58j641k261k361
$$ 260775 261626 263369 265959 269204 272901 276800 280419 283117 284539 284912 284646 283788 282147 279886 277525
59128B77525k327k896m058m929m833m087l453l192l003k677k344k170k051j797
$$ 277525 275198 272302 268244 263315 258482 254395 250942 247750 244747 242070 239726 237556 235505 233708
59114B33708j375q97m80k02r4j17j85k43l03l34k45p2m2l37p86j023r30p49o65
$$ 233708 232333 231436 230956 230754 230660 230543 230358 230115 229812 229478 229233 229161 229119 228782 227996 226973 226043 225294 224629
59095B24629n55l04j08j60k43kM67P19O67P36J171J657J813J757J812J987K091
$$ 224629 224074 223770 223662 223502 223259 223257 223724 224443 225110 225846 227017 228674 230487 232244 234056 236043 238134
59078B38134K176K466K929L271L396L527L860M306M659M829M834M693M381L863
$$ 238134 240310 242776 245705 248976 252372 255899 259759 264065 268724 273553 278387 283080 287461 291324
59064B91324L160K368J589P68k42j416k477l230l746m161m445m561m624m718m702
$$ 291324 294484 296852 298441 299209 298967 297551 295074 291844 288098 283937 279492 274931 270307 265589 260887
59049B60887m470m231m234m339m173l667l145k855k740k663k647k725k777k591
$$ 260887 256417 252186 247952 243613 239440 235773 232628 229773 227033 224370 221723 218998 216221 213630
59035B13630k054j285o35l70l36j11L81P14O50N93R74J491J521J169J167J790
$$ 213630 211576 210291 209656 209286 208950 208839 209220 209934 210584 211177 212151 213642 215163 216332 217499 219289
59019B19289K525K938L252L768M335M743N222O059P024P654P847P868P833P599
$$ 219289 221814 224752 228004 231772 236107 240850 246072 252131 259155 266809 274656 282524 290357 297956
59005B97956P104O462N737M844L691K293P52p62k048k976l487l545l213k774k535
$$ 297956 305060 311522 317259 322103 325794 328087 328839 328077 326029 323053 319566 316021 312808 310034 307499
58990C07499k414k042j383r28j057j550k022k494l156l785l953l724l647l954
$$ 307499 305085 303043 301660 300732 299675 298125 296103 293609 290453 286668 282715 278991 275344 271390
58976B71390m235m066l538k993k477j856j228r09j021j326j563j716j900k114
$$ 271390 267155 263089 259551 256558 254081 252225 250997 250088 249067 247741 246178 244462 242562 240448
58962B40448k248k266k234k174k015j751j472j198p96k19K74L68J18p9L5L35N90
$$ 240448 238200 235934 233700 231526 229511 227760 226288 225090 224294 224075 224349 224717 224835 224756 224791 225126 225716
58945B25716P67R01R02O74L10Kk01l69m87m21r2M53J109J763K301K706L146L836
$$ 225716 226483 227384 228286 228960 229270 229272 229071 228702 228215 227794 227702 228155 229264 231027 233328 236034 239180 243016
58927B43016M789N753O487O937P104O878O136M995L788K668J435j03j718k916
$$ 243016 247805 253558 260045 266982 274086 280964 287100 292095 295883 298551 299986 299883 298165 295249
58913B95249l471l562l381k909k177j452r30m63J57Q96J644K479L437M152M204
$$ 295249 291778 288216 284835 281926 279749 278297 277367 276904 277061 277957 279601 282080 285517 289669 293873
58898B93873L700L172K882K661K364K095J859J425O84j43q48j508k219k836l100
$$ 293873 297573 300745 303627 306288 308652 310747 312606 314031 314715 314572 313724 312216 309997 307161 304061
58883C04061k868k140j057L7P96J254J745K432L130L730M397N182N759N813N444
$$ 304061 301193 299053 297996 298033 298829 300083 301828 304260 307390 311120 315517 320699 326458 332271 337715
58868C37715M965M551M288M340M722N155N326N188M840M296L522K535J262m05
$$ 337715 342680 347231 351519 355859 360581 365736 371062 376250 381090 385386 388908 391443 392705 392300
58854C92300k300l961n166o193p319q328q839q837q556q049p259o299n341m344
$$ 392300 390000 386039 380873 374680 367361 359033 350194 341357 332801 324752 317493 311194 305853 301509
58840C01509l249k297j786j686j801k116k612k917k631j907j293j048j034j172
$$ 301509 298260 295963 294177 292491 290690 288574 285962 283045 280414 278507 277214 276166 275132 273960
58826B73960j503j809j742j402j313j635j894j664j111o02k03J64L69K97J97M49
$$ 273960 272457 270648 268906 267504 266191 264556 262662 260998 259887 259285 259082 259246 259615 259912 260109 260558
58810B60558J037J602J969K353K990L819M583N145N578O020O525P068P603Q076
$$ 260558 261595 263197 265166 267519 270509 274328 278911 284056 289634 295654 302179 309247 316850 324926
58796C24926Q414Q600Q752R018R407R814J0250J0833J1499J1869J1576J0573Q973
$$ 324926 333340 341940 350692 359710 369117 378931 389181 400014 411513 423382 434958 445531 454504
58783D54504O830M244J578p37k622m350o162q029r744j1061j1779j1822j1281
$$ 454504 461334 465578 467156 466419 463797 459447 453285 445256 435512 424451 412672 400850 389569
58770C89569j0296r024p724o685n900n021l875k809k280k271k433k583k753k883
$$ 389569 379273 370249 362525 355840 349940 344919 341044 338235 335955 333684 331251 328668 325915 323032
58756C23032k866k797k823k850k732k673k962l433l669l713m048m737n244n239
$$ 323032 320166 317369 314546 311696 308964 306291 303329 299896 296227 292514 288466 283729 278485 273246
58742B73246n085n195n354n107m456l790l323k973k643k278j750r80r5O69J189
$$ 273246 268161 262966 257612 252505 248049 244259 240936 237963 235320 233042 231292 230312 230217 230886 232075
58727B32075J441J437J361J517J955K323K310K053J866J733J431R74O34N26M83
$$ 232075 233516 234953 236314 237831 239786 242109 244419 246472 248338 250071 251502 252476 253110 253636 254119
58712B54119L69K19P0j20k98l28k39k60m74o55n98m58o21j239k091k847l298l389
$$ 254119 254488 254707 254777 254657 254359 254031 253792 253532 253058 252403 251805 251347 250726 249487 247396 244549 241251 237862
58694B37862l178k882k770k845k748k104j015k1M75N62O06P78R73J015Q02L42
$$ 237862 234684 231802 229032 226187 223439 221335 220320 220299 220774 221336 221942 222720 223693 224708 225510 225852
58678B25852j95m97l40K03Q91J546K063K204J689N76n94j211j125p40n41o14o40
$$ 225852 225657 225160 224820 225023 225914 227460 229523 231727 233416 233992 233398 232187 231062 230322 229781 229167 228527
58661B28527m24k00l00o31p53n08k00j02j17j23k66n91p54n02j97l73q48q35K2
$$ 228527 228103 227903 227603 226972 226219 225711 225511 225409 225292 225169 224903 224312 223558 223056 222859 222486 221638 220803 220825
58642B20825J216K053K424K686L132L746M375M920N413N880O120N832N098M496
$$ 220825 222041 224094 226518 229204 232336 236082 240457 245377 250790 256670 262790 268622 273720 278216
58628B78216M406M449L990L067K254J741J144K99l66m60j39K85P58J277J665J820
$$ 278216 282622 287071 291061 294128 296382 298123 299267 299566 299200 298740 298601 298886 299644 300921 302586 304406
58612C04406J902J974J779J128K00p04j521k305l095m089n590p480r047r696r532
$$ 304406 306308 308282 310061 311189 311389 310685 309164 306859 303764 299675 294085 286605 277558 267862 258330
58597B58330r025q367p522o586n697m800l891l282l187l257k968k348j856j667
$$ 258330 249305 240938 233416 226830 221133 216333 212442 209160 205973 202716 199748 197400 195544 193877
58583A93877j523j274j048q61m82J64Q06J199J395J571J820K237K965L980N029
$$ 193877 192354 191080 190032 189171 188689 188853 189659 190858 192253 193824 195644 197881 200846 204826 209855
58568B09855N879O536P104P532P615P128N978M304K466Q13n91j940l367m724n668
$$ 209855 215734 222270 229374 236906 244521 251649 257627 261931 264397 265210 264619 262679 259312 254588 248920
58553B48920n881n295m207l174k595k423k313k069j766j501j232q89n28k17O2
$$ 248920 243039 237744 233537 230363 227768 225345 223032 220963 219197 217696 216464 215575 215047 214830 214892
58538B14892L30M95M63K72L9k13n66r85j249j134o57k0O70J441K256K920L322
$$ 214892 215222 215717 216180 216452 216491 216278 215712 214727 213478 212344 211687 211667 212337 213778 216034 218954 222276
58521B22276L643M106M635M925M857M601M320L926L267K381J487P53J54m94j332
$$ 222276 225919 230025 234660 239585 244442 249043 253363 257289 260556 262937 264424 265177 265331 264837 263505
58506B63505k218k774k804k539k367k368k388k389k458k511k309j873j473j163
$$ 263505 261287 258513 255709 253170 250803 248435 246047 243658 241200 238689 236380 234507 233034 231871
58492B31871o70J23R10J412J785K348L099L815M416M962N345N303M708L711K639
$$ 231871 231201 231324 232234 233646 235431 237779 240878 244693 249109 254071 259416 264719 269427 273138 275777
58477B75777J823J426J344J331J283J340J687K387L463M889O438P750Q636R220
$$ 275777 277600 279026 280370 281701 282984 284324 286011 288398 291861 296750 303188 310938 319574 328794
58463C28794R679R997J0065R795R068P758N928L875J917K74q55j375j505j601
$$ 328794 338473 348470 358535 368330 377398 385156 391084 394959 396876 397150 396295 394920 393415 391814
58449C91814j716j638j440j600k394l500m418n001n388n687n973o294o464o162
$$ 391814 390098 388460 387020 385420 383026 379526 375108 370107 364719 359032 353059 346765 340301 334139
58435C34139n428m747m388m037l357k576k064j696j073j81O42J298J977K694L228
$$ 334139 328711 323964 319576 315539 312182 309606 307542 305846 304773 304592 305234 306532 308509 311203 314431
58420C14431L516L733L961M064L922L532K876J917P75l05j139j725k216k851l766
$$ 314431 317947 321680 325641 329705 333627 337159 340035 341952 342727 342422 341283 339558 337342 334491 330725
58405C30725m742n352n459n376n377n358n172m978m947m872m428l647k826k119
$$ 330725 325983 320631 315172 309796 304419 299061 293889 288911 283964 279092 274664 271017 268191 266072
58391B66072j516j040o68k27L52Q75J249J805K886M296N508O245O502O215N288
$$ 266072 264556 263516 262848 262621 262973 263848 265097 266902 269788 274084 279592 285837 292339 298554 303842
58376C03842L849K165L74j404k916m031m907n590n753n193m366l822l374k426
$$ 303842 307691 309856 310230 308826 305910 301879 296972 291382 285629 280436 276070 272248 268874 266448
58362B66448r79K85R63J401K047K880L598M010M072L775L137K189R36m75j688
$$ 266448 265469 265754 266717 268118 270165 273045 276643 280653 284725 288500 291637 293826 294762 294287 292599
58347B92599k424k758k852k666k174j642j309r96m22K53O74Q91J210J605J762
$$ 292599 290175 287417 284565 281899 279725 278083 276774 275778 275356 275609 276283 277174 278384 279989 281751
58332B81751J665J622J765J996K388L088L847M171M005L764L639L334K614J658
$$ 281751 283416 285038 286803 288799 291187 294275 298122 302293 306298 310062 313701 317035 319649 321307
58318C21307P52o7r04j824k835l784m374m493m451m562m635m299l675l187k867
$$ 321307 322059 321992 321088 319264 316429 312645 308271 303778 299327 294765 290130 285831 282156 278969 276102
58303B76102k338j507p34k41J42O00J115J677K276K666K494J793R59K95j86n42
$$ 276102 273764 272257 271523 271282 271424 272024 273139 274816 277092 279758 282252 284045 285004 285299 285113 284571
58287B84571q19j115j371j256o46J6K78L25N83R34R98R25J211J842K380K740L163
$$ 284571 283752 282637 281266 280010 279364 279380 279658 279983 280566 281500 282498 283423 284634 286476 288856 291596 294759
58270B94759L473L220K549K134K190K338K460K853L371L348K616J798J346R96
$$ 294759 298232 301452 304001 306135 308325 310663 313123 315976 319347 322695 325311 327109 328455 329451
58256C29451M56j45p14j361j823j497l69P81J456K010K852L768M450N025N638
$$ 329451 329907 329762 329048 327687 325864 324367 323998 324779 326235 328245 331097 334865 339315 344340 349978
58241C49978O144O515O966P334P025N964M914M416M070L332K336J459O64j61p82
$$ 349978 356122 362637 369603 376937 383962 389926 394840 399256 403326 406658 408994 410453 411117 410956 410174
58226D10174j062j326j767k000j677j093o80k98L51J078J492J617J801K202K741
$$ 410174 409112 407786 406019 404019 402342 401249 400569 400271 400622 401700 403192 404809 406610 408812 411553
58211D11553L328L824M101M307M747N354N655N506N337N469N652N556N224M818
$$ 411553 414881 418705 422806 427113 431860 437214 442869 448375 453712 459181 464833 470389 475613 480431
58197D80431M358L906L643L548L465L513L954M639N186N656O368P099P319P171
$$ 480431 484789 488695 492338 495886 499351 502864 506818 511457 516643 522299 528667 535766 543085 550256
58183E50256P339P871Q195Q303Q826R750J0250J0153J0313J1119J1849J2045J2322
$$ 550256 557595 565466 573661 581964 590790 600540 610790 620943 631256 642375 654224 666269 678591
58170F78591J3148J4005J4435J4828J5441J5702J5285J4835J4885J5033J4912
$$ 678591 691739 705744 720179 735007 750448 766150 781435 796270 811155 826188 841100
58159H41100J4944J5347J5482J5041J4792J5255J5740J5686J5873J7217J9287
$$ 841100 856044 871391 886873 901914 916706 931961 947701 963387 979260 996477 1015764
58148A015764K1111K2607K4186K5809K7381K9325L1752L3974L5669L7649M0542
$$ 1015764 1036875 1059482 1083668 1109477 1136858 1166183 1197935 1231909 1267578 1305227 1345769
58137A345769M3716M6431M9028N2008N4987N7595O0343O3598O6778O9567P2821
$$ 1345769 1389485 1435916 1484944 1536952 1591939 1649534 1709877 1773475 1840253 1909820 1982641
58126A982641P7220Q2205Q7290R3130J00151J07540J14788J22867J32624J43416
$$ 1982641 2059861 2142066 2229356 2322486 2422637 2530177 2644965 2767832 2900456 3043872
58116C043872J54705J67472J82662J99727K18165K38958K63059K90089L20037
$$ 3043872 3198577 3366049 3548711 3748438 3966603 4205561 4468620 4758709 5078746
58107E078746L54630L95401M42296M95629N57552O30235P15297Q17275R45365
$$ 5078746 5433376 5828777 6271073 6766702 7324254 7954489 8669786 9487061 10432426
58098A0432426J109382J316256J573157J892623K293079K796292L425417M202373
$$ 10432426 11541808 12858064 14431221 16323844 18616923 21413215 24838632 29041005
58090B9041005N145242O271915P611847R217249J1152562J3421234J5796676J7631301
$$ 29041005 34186247 40458162 48070009 57287258 68439820 81861054 97657730 115289031
58082A15289031J7875636J5511154J0247633K950636m651344j0833033j4654116
$$ 115289031 133164667 148675821 158923454 161874090 157222746 146389713 131735597
58075A31735597j6131216j5865157j4570088j2817944j0987103r284343p786460
$$ 131735597 115604381 99739224 85169136 72351192 61364089 52079746 44293286
58068D4293286o499707n410104m498726l739816l107937k586537k162548j818160
$$ 44293286 37793579 32383475 27884749 24144933 21036996 18450459 16287911 14469751
58060A4469751j535390j304017j118105r68534q45042p42390o58751n90273n31820
$$ 14469751 12934361 11630344 10512239 9543705 8698663 7956273 7297522 6707249 6175429
58051F175429m80895m36574l96429l58100l22199k90389k62126k35993k12429
$$ 6175429 5694534 5257960 4861531 4503431 4181232 3890843 3628717 3392724 3180295
58042C180295j92330j74558j57493j41648j28492j18016j09432j02767r7851r3164
$$ 3180295 2987965 2813407 2655914 2514266 2385774 2267758 2158326 2055559 1957708 1864544
58032A864544q7588q1851p6708p1323o5081n9177n4634n0541m6069m2459m0942
$$ 1864544 1776956 1695105 1618397 1547074 1481993 1422816 1368182 1317641 1271572 1229113 1188171
58021A188171m0356l8963l7125l6034l5168l3297l0875k9209k8145k6670k5047
$$ 1188171 1147815 1108852 1071727 1035693 1000525 967228 936353 907144 878999 852329 827282
58010H27282k4284k4151k3567k2466k1561k0756j9478j8037j7127j6499j5514
$$ 827282 802998 778847 755280 732814 711253 690497 671019 652982 635855 619356 603842
57999F03842j4502j4132j4056j3517j2790j2541j2393j1535j0299r640r521r138
$$ 603842 589340 575208 561152 547635 534845 522304 509911 498376 488077 478437 468916 459778
57987D59778q406p837p384o656n974n951o301o314o206o721p716q306q227p932
$$ 459778 451372 443535 436151 429495 423521 417570 411269 404955 398749 392028 384312 376006 367779 359847
57973C59847p568o935o274o045o075n866n527n445n401m915m233l923l796l219
$$ 359847 352279 345344 339070 333025 326950 321084 315557 310112 304711 299796 295563 291640 287844 284625
57959B84625k238j461j016o09l67p02j481k214k854l563m044l942l628l685l911
$$ 284625 282387 280926 279910 279301 278934 278232 276751 274537 271683 268120 264076 260134 256506 252821 248910
57944B48910l750l349l235l316l196l158l691m349m254l520l059l056k843k231
$$ 248910 245160 241811 238576 235260 232064 228906 225215 220866 216612 213092 210033 206977 204134 201903
57930B01903j809j829j911j976k415l118l374k984k608k682k823k591k105j593
$$ 201903 200094 198265 196354 194378 191963 188845 185471 182487 179879 177197 174374 171783 169678 168085
57916A68085j025m25J5L16O86J017R96P73Q88J412J768J580J135Q72Q75J001J060
$$ 168085 167060 166635 166650 166966 167652 168669 169665 170438 171326 172738 174506 176086 177221 178093 178968 179969 181029
57899A81029Q58M10Q1J20K07n7m16l20J80N32N90O62P62N25j07p50j156j380j384
$$ 181029 181887 182297 182378 182498 182705 182648 182232 181912 182092 182624 183214 183876 184638 185163 185056 184306 183150 181770 180386
57880A80386j089q52j169j937k554k758k785k756k560k297k194k057j492p07l66
$$ 180386 179297 178445 177276 175339 172785 170027 167242 164486 161926 159629 157435 155378 153886 153179 152813
57865A52813o10q62p03l15L6L18M45K60o3j29Q0K34K46L17M33M71O63J283J906
$$ 152813 152203 151341 150638 150323 150359 150677 151122 151382 151319 151190 151270 151504 151750 152067 152500 152971 153634 154917 156823
57846A56823J836J266J162J843K562K748K793L210L764M015M043M158M291M203
$$ 156823 158659 159925 161087 162930 165492 168240 171033 174243 178007 182022 186065 190223 194514 198717
57832A98717L925L629L297K856K339J751R84K1j004k036l031l767m060m165m498
$$ 198717 202642 206271 209568 212424 214763 216514 217498 217519 216515 214479 211448 207681 203621 199456 194958
57817A94958n036n435n630n734n468m476l165k460k509k492j876j164r47j038
$$ 194958 189922 184487 178857 173123 167655 163179 160014 157554 155045 152553 150677 149513 148566 147528
57803A47528r22n18l6M15P20O77M05L70P26J081J159J230J529J804J763J526J242
$$ 147528 146606 146088 146052 146467 147187 147864 148269 148639 149365 150446 151605 152835 154364 156168 157931 159457 160699
57786A60699P75J15l61m26m09o58j012j150j135j198j348j510j781k179k516k761
$$ 160699 161474 161589 161228 160802 160393 159735 158723 157573 156438 155240 153892 152382 150601 148422 145906 143145
57770A43145l135l555l476k630j592j086j158j335j376j327j186r41p79q52r89
$$ 143145 140010 136455 132979 130349 128757 127671 126513 125178 123802 122475 121289 120348 119569 118717 117728
57755A17728r42p44n24k42J01K26j13p25j189j313j155p96m05k80n58r83j215
$$ 117728 116786 116042 115518 115276 115377 115603 115490 114765 113576 112263 111108 110312 109907 109627 109069 108086 106871
57738A06871j207j091r10o51l78j01K86P49J039J026R10R21J039J184J431J826
$$ 106871 105664 104573 103663 103012 102634 102533 102819 103568 104607 105633 106543 107464 108503 109687 111118 112944
57722A12944K177K226J891J263N83K23L97Q41J082J055J037J024O31k18j052j454
$$ 112944 115121 117347 119238 120501 121084 121307 121704 122545 123627 124682 125719 126743 127374 127156 126104 124650
57706A24650j486j295q99n06n18q66r51n78l60p60j274j168n71k17l68o79q77
$$ 124650 123164 121869 120970 120464 119946 119080 118129 117551 117191 116431 115157 113989 113418 113201 112833 112154 111277
57689A11277j025j178j254j254j237j168j019q51o33j86M42Q40P62M79L61M15
$$ 111277 110252 109074 107820 106566 105329 104161 103142 102291 101658 101472 101914 102754 103516 103995 104356 104771
57673A04771M97O43P79N81n4o38p07m61l83m89m75l70m55o89p17m20m9J49J50
$$ 104771 105268 105911 106690 107271 107217 106579 105872 105411 105028 104539 104064 103694 103239 102550 101833 101413 101364 101513 101663
57654A01663L0j02j76k84n80r11q96n54l91p01j152j394j578j858j953j642j255
$$ 101663 101693 101591 101415 101131 100551 99640 98744 98190 97799 97098 95946 94552 92974 91116 89163 87521 86266
57637H6266j106r54n96m72r40j442j273p58p46j196j297q83o26q54j075r64q31
$$ 86266 85160 84206 83610 83138 82198 80756 79483 78725 77979 76783 75486 74603 73977 73123 72048 71084 70253
57620G0253q80p97m67l52p61j315j526j399j130p22k88k43p41j299j388j136j045
$$ 70253 69373 68576 68109 67757 66996 65681 64155 62756 61626 60904 60616 60373 59632 58333 56945 55809 54764
57603E4764j281j553j589j333r08n54n04o89p20l89j9j45q51j668k030j748j098
$$ 54764 53483 51930 50341 49008 48100 47546 47042 46353 45633 45244 45225 45080 44229 42561 40531 38783 37685
57586C7685n14k14n2K21O10Q92R25Q41Q99J259J851K455K963L630M870O781R082
$$ 37685 37171 36957 36905 37126 37736 38628 39553 40394 41293 42552 44403 46858 49821 53451 58321 65102 74184
57569G4184J1583J4450J7787K1342K4774K7733K9215K7331K0678J0004j948j2357
$$ 74184 85767 100217 118004 139346 164120 191853 221068 248399 269077 279081 277133 264776
57557B64776j9787k4045k5481k4722k2544j9620j6457j3552j1256r485p932o592
$$ 264776 244989 220944 195463 170741 148197 128577 112120 98568 87312 77827 69895 63303
57545F3303n738n292m780l973l213k796k511j973j168l82J63L60J94j91m96n44
$$ 63303 57565 52273 47493 43520 40307 37511 35000 33027 31859 31477 31640 32000 32194 32003 31507 30963
57529C0963m40l35k44j76k46m83p38q56q61q54q14o72m26j87j01k28m81o93q57
$$ 30963 30523 30188 29944 29768 29522 29039 28301 27445 26584 25730 24916 24244 23818 23631 23530 23302 22821 22128 21271
57510B1271j143j596j949j905j486r23l99q9j85o11r22q31o04o05o60m47j88l89
$$ 21271 20128 18532 16583 14678 13192 12269 11870 11781 11596 10985 10063 9232 8628 8023 7363 6916 6728 6339
57492F339r04j037o06k33l85p87j054A5a768k164k052j570j231j233j350j324
$$ 6339 5435 4398 3792 3559 3174 2387 1333 15 -1768 -3932 -5984 -7554 -8785 -10018 -11368 -12692
57476a2692j094p43m34l83o32r49j068r71q02o69o16o76q27r57r78r13q19p12
$$ -12692 -13786 -14529 -14963 -15346 -15978 -16927 -17995 -18966 -19768 -20437 -21053 -21729 -22556 -23513 -24491 -25404 -26223 -26935
57458b6935n97m97m01l09k52k37j68K9K23K29O8o1o4j5K1P3J30J31O5j8r0j20
$$ -26935 -27532 -28029 -28430 -28739 -28991 -29228 -29396 -29367 -29144 -28915 -28847 -28908 -28972 -28987 -28966 -28893 -28763 -28632 -28567 -28585 -28675 -28795
57436b8795j18k28n94j054j195r09n67m18k78o2j70p97j338j173o84o81j059r36
$$ -28795 -28913 -29141 -29735 -30789 -31984 -32893 -33460 -33878 -34156 -34218 -34388 -35185 -36523 -37696 -38380 -39061 -40120 -41056
57418d1056j11O47Q29P94Q59P26K09j63P2N87Q22P90Q04Q13N86K27l8l25q71j523
$$ -41056 -41167 -40520 -39691 -38897 -38038 -37312 -37103 -37266 -37194 -36607 -35785 -34995 -34191 -33378 -32792 -32565 -32603 -32928 -33799 -35322
57398c5322j889j913j843j808j722j549j343j125r58r79j180j291j155j026j217
$$ -35322 -37211 -39124 -40967 -42775 -44497 -46046 -47389 -48514 -49472 -50451 -51631 -52922 -54077 -55103 -56320
57383e6320j572j566r96k70M0k06o00p07n85o37r59j097p04j73j75p20j168j153
$$ -56320 -57892 -59458 -60454 -60724 -60684 -60890 -61490 -62197 -62782 -63419 -64378 -65475 -66179 -66352 -66527 -67247 -68415 -69568
57365f9568r70j000j201j415j638j809j704j281p91m54k74l01o41j062j089o90
$$ -69568 -70538 -71538 -72739 -74154 -75792 -77601 -79305 -80586 -81377 -81831 -82105 -82406 -83047 -84109 -85198 -85888
57349h5888m03n71q68r31r55j240j570j480r61m43k32k88m28m71l11n9Qj98m62
$$ -85888 -86291 -86862 -87730 -88661 -89616 -90856 -92426 -93906 -94867 -95310 -95542 -95830 -96258 -96729 -97040 -97099 -97091 -97289 -97751
57330i7751o23p67r50r99q18o26o67q99j155j352j410j192p89n46o64r52j158
$$ -97751 -98374 -99141 -100091 -101090 -101908 -102534 -103201 -104100 -105255 -106607 -108017 -109209 -109998 -110544 -111208 -112160 -113318
57313a13318j291j441j583j668j710j622j245o98l87m77o97p39o25n28n46p44
$$ -113318 -114609 -116050 -117633 -119301 -121011 -122633 -123878 -124576 -124963 -125440 -126137 -126876 -127501 -128029 -128575 -129319
57297a29319j111j362j212q56p82j035j151r63q35r76j087r77r31j110j201r99
$$ -129319 -130430 -131792 -133004 -133860 -134642 -135677 -136828 -137791 -138626 -139602 -140689 -141666 -142597 -143707 -144908 -145907
57281a45907q34r71j124j011q69r53j008p66n56p61j131j156q95p84r45j188j517
$$ -145907 -146741 -147712 -148836 -149847 -150716 -151669 -152677 -153443 -153999 -154760 -155891 -157047 -157942 -158726 -159671 -160859 -162376
57264a62376k015k417k369j992j756j805j880j811j709j718j835j963j957j757
$$ -162376 -164391 -166808 -169177 -171169 -172925 -174730 -176610 -178421 -180130 -181848 -183683 -185646 -187603 -189360
57250a89360j583j746k160k341k124j906j987k120k033j940k109k343k323k114
$$ -189360 -190943 -192689 -194849 -197190 -199314 -201220 -203207 -205327 -207360 -209300 -211409 -213752 -216075 -218189
57236b18189j917j698j420j296j423j525j466j550j918k156j967j763k009k430
$$ -218189 -220106 -221804 -223224 -224520 -225943 -227468 -228934 -230484 -232402 -234558 -236525 -238288 -240297 -242727
57222b42727k497k291k248k358k306k172k262k498k556k497k610k826k802k534
$$ -242727 -245224 -247515 -249763 -252121 -254427 -256599 -258861 -261359 -263915 -266412 -269022 -271848 -274650 -277184
57208b77184k343k337k392k515k776k975k838k452k139k033k092k328k718l101
$$ -277184 -279527 -281864 -284256 -286771 -289547 -292522 -295360 -297812 -299951 -301984 -304076 -306404 -309122 -312223
57194c12223l458l974m575m802m465l970l712l560l351l333l634l814l482k855
$$ -312223 -315681 -319655 -324230 -329032 -333497 -337467 -341179 -344739 -348090 -351423 -355057 -358871 -362353 -365208
57180c65208k174j163L51J815K659L116L622L941L610K777J795M87j328l042l913
$$ -365208 -367382 -368545 -368194 -366379 -363720 -360604 -356982 -353041 -349431 -346654 -344859 -344372 -345700 -348742 -352655
57165c52655m170m583n256n758o079o550p037p186p198p484p810p676p292p237
$$ -352655 -356825 -361408 -366664 -372422 -378501 -385051 -392088 -399274 -406472 -413956 -421766 -429442 -436734 -443971
57151d43971p379p134o648o655p233p694p695p588p599p610p748q354r251r861
$$ -443971 -451350 -458484 -465132 -471787 -479020 -486714 -494409 -501997 -509596 -517206 -524954 -533308 -542559 -552420
57137e52420j0028j0076j0034r621q948q536q543q674q781q963r154r197r250
$$ -552420 -562448 -572524 -582558 -592179 -601127 -609663 -618206 -626880 -635661 -644624 -653778 -662975 -672225
57124f72225r452r488r086q650q702r060r283r495r948j0232r902r488r814j0646
$$ -672225 -681677 -691165 -700251 -708901 -717603 -726663 -735946 -745441 -755389 -765621 -775523 -785011 -794825 -805471
57110h05471j1087j1037j1131j1514j1732j1734j1892j2176j2305j2481j2984
$$ -805471 -816558 -827595 -838726 -850240 -861972 -873706 -885598 -897774 -910079 -922560 -935544
57099i35544j3381j3153j2792j3099j3755j3858j3514j3586j4105j4361j4342
$$ -935544 -948925 -962078 -974870 -987969 -1001724 -1015582 -1029096 -1042682 -1056787 -1071148 -1085490
57088a085490j4704j5447j6016j6541j7594j8837j9399j9503k0157k1328k1924
$$ -1085490 -1100194 -1115641 -1131657 -1148198 -1165792 -1184629 -1204028 -1223531 -1243688 -1265016 -1286940
57077a286940k1658k1367k1424k1322k0979k0891k0956k0561j9954k0041k0788
$$ -1286940 -1308598 -1329965 -1351389 -1372711 -1393690 -1414581 -1435537 -1456098 -1476052 -1496093 -1516881
57066a516881k1393k2085k4068k7491l1040l3792l5985l7853l9280m0713m2907
$$ -1516881 -1538274 -1560359 -1584427 -1611918 -1642958 -1676750 -1712735 -1750588 -1789868 -1830581 -1873488
57055a873488m5579m7866m9991n2877n6240n8873o0842o3439o6965p0514p3974
$$ -1873488 -1919067 -1966933 -2016924 -2069801 -2126041 -2184914 -2245756 -2309195 -2376160 -2446674 -2520648
57044b520648p8192q3102q7761r2349r8037j04740j11224j17468j24629j32595
$$ -2520648 -2598840 -2681942 -2769703 -2862052 -2960089 -3064829 -3176053 -3293521 -3418150 -3550745
57034c550745j40055j47147j55429j64993j74323j83287j93563k05624k18199
$$ -3550745 -3690800 -3837947 -3993376 -4158369 -4332692 -4515979 -4709542 -4915166 -5133365
57025e133365k31131k45857k62518k79573k96950l16527l38943l63082l89281
$$ -5133365 -5364496 -5610353 -5872871 -6152444 -6449394 -6765921 -7104864 -7467946 -7857227
57016g857227m19711m54891m93198n34620n81439o34613o93319p58887q35216
$$ -7857227 -8276938 -8731829 -9225027 -9759647 -10341086 -10975699 -11669018 -12427905 -13263121
57007a3263121r24451j026554j144109j283116j448394j643367j876091k160764
$$ -13263121 -14187572 -15214126 -16358235 -17641351 -19089745 -20733112 -22609203 -24769967
56999b4769967k512765k948570l492760m179856n047730o134267p478974r116709
$$ -24769967 -27282732 -30231302 -33724062 -37903918 -42951648 -49085915 -56564889 -65681598
56991f5681598j1064005j3314230j5839661j8579848k1420930k4199380k6734174
$$ -65681598 -76745603 -90059833 -105899494 -124479342 -145900272 -170099652 -196833826
56984a96833826k8848506l0367662l1130217l1021701k9975355k7922087k4778400
$$ -196833826 -225682332 -256049994 -287180211 -318201912 -348177267 -376099354 -400877754
56977d00877754k0540529j5387410r636522l576653K621961Q815862J4750979
$$ -400877754 -421418283 -436805693 -446442215 -450018868 -447396907 -438581045 -423830066
56970d23830066K0062364K4405030K7569052K9499266L0262942L0016447K8967287
$$ -423830066 -403767702 -379362672 -351793620 -322294354 -292031412 -262014965 -233047678
56963b33047678K7326810K5279666K2982844K0572356J8160769J5835328J3663492
$$ -233047678 -205720868 -180441202 -157458358 -136886002 -118725233 -102889905 -89226413
56956h9226413J1694534R953667Q442140P148026O054453N139122M375272L738538
$$ -89226413 -77531879 -67578212 -59136072 -51988046 -45933593 -40794471 -36419199 -32680661
56948c2680661L210023K772059K406456K098891J840407J622747J436567J275624
$$ -32680661 -29470638 -26698579 -24292123 -22193232 -20352825 -18730078 -17293511 -16017887
56940a6017887J138035J021306R19975Q29866P50648O82164O21727N66949N17953
$$ -16017887 -14879852 -13858546 -12938571 -12108705 -11358057 -10675893 -10054166 -9487217 -8969264
56931h969264M74722M35173L97685L62840L30933L00287K69998K42402K21337
$$ -8969264 -8494542 -8059369 -7661684 -7298844 -6967911 -6667624 -6397626 -6155224 -5933887
56922e933887K09352K06944K12018K19170K22106K18280K09694J98919J86596
$$ -5933887 -5724535 -5517591 -5305573 -5086403 -4864297 -4646017 -4436323 -4237404 -4050808
56913d050808J73266J60587J49432J38948J28738J19857J12699J06000R9042R2738
$$ -4050808 -3877542 -3716955 -3567523 -3428575 -3299837 -3179980 -3067281 -2961281 -2862239 -2769501
56903b769501Q7568Q2500P7124P2687O9843O7297O3964O0625N8181N6024N3453
$$ -2769501 -2681933 -2599433 -2522309 -2449622 -2379779 -2312482 -2248518 -2187893 -2129712 -2073688 -2020235
56892b020235N1111M9636M8352M6558M4782M3590M2483M1032L9848L9354L8830
$$ -2020235 -1969124 -1919488 -1871136 -1824578 -1779796 -1736206 -1693723 -1652691 -1612843 -1573489 -1534659
56881a534659L7748L6734L6273L5615L4054L2095L0462K8973K7411K6294K5887
$$ -1534659 -1496911 -1460177 -1423904 -1388289 -1354235 -1322140 -1291678 -1262705 -1235294 -1209000 -1183113
56870a183113K5405K4205K2760K1668K0680J9506J8554J8082J7637J7035J6897
$$ -1183113 -1157708 -1133503 -1110743 -1089075 -1068395 -1048889 -1030335 -1012253 -994616 -977581 -960684
56859i60684J7416J7774J7543J7602J8694K0112K0715K0358J9415J7818J5550
$$ -960684 -943268 -925494 -907951 -890349 -871655 -851543 -830828 -810470 -791055 -773237 -757687
56848g57687J3313J1784J0811J0018R507R328R076Q643Q598R166R721R886J0234
$$ -757687 -744374 -732590 -721779 -711761 -702254 -692926 -683850 -675207 -666609 -657443 -647722 -637836 -627602
56835f27602J1211J2286J2932J3546J4656J6023J7232J8376J9332J9221J7349
$$ -627602 -616391 -604105 -591173 -577627 -562971 -546948 -529716 -511340 -492008 -472787 -455438
56824d55438J4110J0311O389K903Q00M10P96J012J195J795K492K731K625K493
$$ -455438 -441328 -431017 -424628 -421725 -420925 -420515 -419719 -418707 -417512 -415717 -413225 -410494 -407869 -405376
56810d05376K155J473R96J243J894K360K606K830K914K895L262M155M897M981
$$ -405376 -403221 -401748 -400752 -399509 -397615 -395255 -392649 -389819 -386905 -384010 -380748 -376593 -371696 -366715
56796c66715M859N056N270N068M789M954N319N343N056M704M161L421L124L781
$$ -366715 -361856 -356800 -351530 -346462 -341673 -336719 -331400 -326057 -321001 -316297 -312136 -308715 -305591 -301810
56782c01810M914N647N669N040L717J969O69L53M87L84K10M24Q46J140J623K671
$$ -301810 -296896 -291249 -285580 -280540 -276823 -274854 -274185 -273832 -273345 -272961 -272751 -272327 -271481 -270341 -268718 -266047
56766b66047L879M669N298O376P780Q949R871J0938J2178J3385J4571J5435J4838
$$ -266047 -262168 -257499 -252201 -245825 -238045 -229096 -219225 -208287 -196109 -182724 -168153 -152718 -137880
56753a37880J1807O893J703k606n662p200p120o062m948l949k625r09P77K276
$$ -137880 -126073 -119180 -117477 -120083 -125745 -132945 -140065 -146127 -151075 -155024 -157649 -158558 -157781 -155505
56739a55505L792N293O553P726R257J1273J3621J6375J9618K2706a5032G940J8240
$$ -155505 -151713 -146420 -139867 -132141 -122884 -111611 -97990 -81615 -61997 -39291 -15032 7940 26180
56726B6180J0389R43p710j3656c92j7157j6313j4487j2172r776p376n024l025
$$ 26180 36569 37512 29802 16146 -392 -17549 -33862 -48349 -60521 -70297 -77673 -82697 -85722
56713h5722j487M5J968M057O030Q175J0780J3437J5618i651I284J8920J5838R639
$$ -85722 -87209 -87164 -85196 -81139 -75109 -66934 -56154 -42717 -27099 -9651 9284 28204 44042 53681
56699E3681K012n128j0648j4032A0658d176j3668j1985r749p370n485m100k742
$$ 53681 55693 50565 39917 25885 10658 -4176 -17844 -29829 -39578 -46948 -52433 -56533 -59275
56686e9275j374l62M18J554L120M562N671O885Q343R395R320c793A562J665G01
$$ -59275 -60649 -61011 -60593 -59039 -55919 -51357 -45686 -38801 -30458 -21063 -11743 -3793 1562 3227 701
56670e330p999q547q387p981p322o242m717l093j972j626j605j246n41o1p6k55
$$ -5330 -13329 -21876 -30263 -38244 -45566 -51808 -56525 -59618 -61590 -63216 -64821 -66067 -66608 -66669 -66745 -67000
56654f7000k87k78l67m05k24O4K50K50R8r0j07J84O12Q79R01Q41Q00P44O63N94
$$ -67000 -67287 -67565 -67932 -68337 -68561 -68497 -68247 -67997 -67899 -67989 -68096 -67912 -67300 -66421 -65520 -64679 -63879 -63135 -62472 -61878
56634f1878N09L84K84K58K68L45N86Q73R30Q35J040J602J842J237K57j90J11O67
$$ -61878 -61369 -60985 -60701 -60443 -60175 -59830 -59244 -58371 -57441 -56606 -55566 -53964 -52122 -50885 -50628 -50818 -50707 -50040
56616e0040J090J367J511J468J309J072O46J48R2O64J209R97K54k37k41j01O0
$$ -50040 -48950 -47583 -46072 -44604 -43295 -42223 -41577 -41429 -41337 -40673 -39464 -38467 -38213 -38450 -38691 -38792 -38732
56599c8732M19Q18Q68O45N93P33O77L84K00J97R9n8Q6M94O90N26L52L52L01J68
$$ -38732 -38313 -37495 -36627 -35982 -35389 -34656 -33979 -33595 -33395 -33198 -33099 -33157 -33071 -32577 -31887 -31361 -31009 -30657 -30356 -30188
56579c0188K35N18O47N40M96N54L69k5p6L60O49L46q2M8O27J024J003Q71R18J076
$$ -30188 -29953 -29435 -28788 -28248 -27752 -27198 -26829 -26854 -26930 -26570 -25921 -25575 -25657 -25609 -24982 -23958 -22955 -22084 -21166 -20090
56559b0090J110Q98N66M50P55J257J564J580J514J438J277J168J364J711a683
$$ -20090 -18980 -18082 -17516 -17066 -16311 -15054 -13490 -11910 -10396 -8958 -7681 -6513 -5149 -3438 -1683
56543b48I73J345J436J182Q33P47Q34P55M60J33j17k76k89j82j32k61m56n84p00
$$ -248 973 2318 3754 4936 5769 6516 7350 8105 8565 8698 8581 8305 8016 7834 7702 7441 6985 6401 5701
56524E701q99j132j287A070a19r21n98l61k38j49p8q1j00NK33L99L72J95l5k27
$$ 5701 4802 3670 2383 1070 -119 -1040 -1638 -1999 -2237 -2386 -2464 -2545 -2645 -2640 -2407 -2008 -1636 -1441 -1476 -1703
56504a703l31l67l98l68j52J43K00K7R7O58i77B22P87N99P81R33Q41O66M71J69
$$ -1703 -2034 -2401 -2799 -3167 -3319 -3176 -2976 -2949 -2852 -2194 -977 222 1009 1608 2389 3322 4163 4829 5300 5469
56484E469q0M2M46P11P27P75R34R78Q67Q22Q24N65P1k09q4J10J06R8K72M51M62
$$ 5469 5389 5431 5877 6588 7315 8090 9024 10002 10869 11691 12515 13080 13151 12942 12858 12968 13074 13172 13444 13895 14357
56463A4357M80P06J016J161J117J048J106J349J673J767J441R64P92J012J324
$$ 14357 14837 15543 16559 17720 18837 19885 20991 22340 24013 25780 27221 28185 28977 29989 31313
56448C1313J510J576J475J135P49N69M63J63j61j19J34k6p39j395j533j355j191
$$ 31313 32823 34399 35874 37009 37758 38327 38790 38953 38792 38673 38807 38781 38042 36647 35114 33759 32568
56431C2568j016p57n88n92n79m88m96n92m77j39j8l19o22n27k11l2J0P4M7k38
$$ 32568 31552 30795 30207 29615 29036 28548 28052 27460 26983 26844 26826 26507 25885 25358 25147 25115 25125 25199 25246 25008
56411B5008o47q84q22n29j47R8L5j89k33o6M4M7J99N34O94N03K29R4m9l19n33
$$ 25008 24361 23477 22655 22126 21979 22077 22112 21923 21690 21624 21668 21715 21914 22448 23142 23645 23874 23968 23919 23600 23067
56390B3067n76o12p09o35l05MJ30K74N40O46M28J93K65N04O23N90M99L59L37P18
$$ 23067 22491 21879 21170 20535 20230 20234 20364 20638 21178 21824 22252 22445 22710 23214 23837 24427 24926 25285 25622 26340
56370B6340J355J561R96K36%J91J78j94m53j87M86J124J304R05K33j62p7J60J77
$$ 26340 27695 29256 30252 30488 30488 30679 30857 30663 30210 30023 30509 31633 32937 33842 34075 33913 33836 33996 34173
56351C4173N9J10M02P97J172J429J434J174Q05M69J73n0j43k08m03o18o14m65
$$ 34173 34232 34342 34744 35541 36713 38142 39576 40750 41555 42024 42197 42147 42004 41796 41393 40775 40161 39696
56333C9696m71n49l05K19M64J96j25j36q3k26k53J43O48P53M95K74K17J94J94
$$ 39696 39225 38676 38371 38590 39054 39250 39125 38989 38906 38680 38427 38570 39218 39971 40466 40740 40957 41151 41345
56314D1345K63K81J72J08K09K95K02N6l9j75l09j21L84O55L61l9J0L29M14L32
$$ 41345 41608 41889 42061 42169 42378 42673 42875 42931 42892 42717 42408 42287 42671 43326 43687 43648 43658 43987 44401 44733
56294D4733M99Q23P83K98o2J72Q87J620J956J712J040M10K25M22O52O46L52j30
$$ 44733 45232 46055 46838 47136 47074 47246 48133 49753 51709 53421 54461 54871 55096 55518 56170 56816 57168 57038
56276E7038m98m19N6M22L18o1l27l68k13J91P28R89P96N54O58Q76P18K43p0n0
$$ 57038 56540 56121 56177 56599 56917 56856 56529 56161 55948 56139 56867 57856 58652 59206 59864 60740 61458 61701 61631 61581
56256F1581K8j6n9L0J77K90L39L20K97L58M69M63L23K45L14L71L54M54P02P66
$$ 61581 61609 61593 61534 61564 61741 62031 62370 62690 62987 63345 63814 64277 64600 64845 65159 65530 65884 66338 67040 67806
56236F7806M23m8k16KL93P35Q41O19L09K85N18O07M72N24Q97J117Q64M96M24N14
$$ 67806 68229 68181 67965 67967 68360 69095 69936 70555 70864 71149 71667 72274 72746 73270 74167 75284 76148 76644 77068 77582
56216G7582N48P29J153J363R99N07M70P19P36N60N97Q23Q99Q84J105J464J570
$$ 77582 78130 78859 80012 81375 82374 82881 83351 84070 84806 85366 85963 86786 87685 88569 89674 91138 92708
56199I2708J419J386J551J637J525J344J195J200J654K575L342L357K930K901
$$ 92708 94127 95513 97064 98701 100226 101570 102765 103965 105619 108194 111536 114893 117823 120724
56185A20724L483M089M225L973L594L226L048L240L715M175M460M543M380M054
$$ 120724 124207 128296 132521 136494 140088 143314 146362 149602 153317 157492 161952 166495 170875 174929
56171A74929L913M236M875N579O383P374Q380R286J0322J1589J2736J3592J4762
$$ 174929 178842 183078 187953 193532 199915 207289 215669 224955 235277 246866 259602 273194 287956
56158B87956J6890J9704K2503K5287K8632L2626L6740M0682M4624M8601N2355
$$ 287956 304846 324550 347053 372340 400972 433598 470338 511020 555644 604245 656600
56147F56600N5827N9118O1997O3940O4747O4475O2818N9201N3490M6081L7285
$$ 656600 712427 771545 833542 897482 962229 1026704 1089522 1148723 1202213 1248294 1285579
56136A285579K7193J6207N084n627j5760k5083l3249m0189m6072n0807n4070n5877
$$ 1285579 1312772 1328979 1334063 1328436 1312676 1287593 1254344 1214155 1168083 1117276 1063206 1007329
56124A007329n6638n6570n5554n3626n1175m8543m5762m2754l9511l6114l2792
$$ 1007329 950691 894121 838567 784941 733766 685223 639461 596707 557196 521082 488290
56113D88290k9894k7509k5318k3059k0889j8984j7164j5355j3938j3105j2337
$$ 488290 458396 430887 405569 382510 361621 342637 325473 310118 296180 283075 270738
56102B70738j1147r954r348q964p984o517n436m943m383l527k981l066l235k977
$$ 270738 259591 249637 240289 231325 223341 216824 211388 206445 202062 198535 195554 192488 189253 186276
56088A86276k520k296k273k185j949j566j078p33p43q58o12o3K86K94K93L82K53
$$ 186276 183756 181460 179187 177002 175053 173487 172409 171676 170933 170075 169463 169400 169686 169980 170273 170655 170908
56071A70908j17k98q8K40N04Q53J275J412J181J043J384J999K426K474K284K169
$$ 170908 170791 170493 170405 170645 171149 172002 173277 174689 175870 176913 178297 180296 182722 185196 187480 189649
56055A89649K438L131L886M369M681N090N563O029O827Q287J0073J1595J2905
$$ 189649 192087 195218 199104 203473 208154 213244 218807 224836 231663 239950 250023 261618 274523
56042B74523J4611J7017K0006K3604K7898L2473L6568L9708M1501M1096L7808
$$ 274523 289134 306151 326157 349761 377659 410132 446700 486408 527909 569005 606813
56031F06813L2360K6614K2016J8881J7044J6219J5616J4174J1528Q068M093k98
$$ 606813 639173 665787 687803 706684 723728 739947 755563 769737 781265 789333 793426 793128
56019G93128m394p049q047q579r958j2584j6348k1186k6706l1819l5346l6729
$$ 793128 788734 781685 773638 765059 755101 742517 726169 704983 678277 646458 611112 574383
56007E74383l6073l3897l0935k7751k4399k0821j7432j4745j2560j0243p738n642
$$ 574383 538310 504413 473478 445727 421328 400507 383075 368330 355770 345527 337789 332147
55995C32147m297l466k898k479j917j043l51m38r87j132p54m47l08J79J029J586
$$ 332147 327850 324384 321486 319007 317090 316047 315696 315258 314271 313139 312385 311938 311630 311809 312838 314424
55979C14424J664J817K276K632K743L066L767M382M625M693M657M337L924L813
$$ 314424 316088 317905 320181 322813 325556 328622 332389 336771 341396 346089 350746 355083 359007 362820
55965C62820L778L239K390K060K357K554K429K565L117L445L259L049L103L146
$$ 362820 366598 369837 372227 374287 376644 379198 381627 384192 387309 390754 394013 397062 400165 403311
55951D03311L246L907N027N802O000O240O725O871O568O546P084P500P355P135
$$ 403311 406557 410464 415491 421293 427293 433533 440258 447129 453697 460243 467327 474827 482182 489317
55937D89317P280P603Q014Q784R718J0145J0083J0302J0975J1419J1415J1580
$$ 489317 496597 504200 512214 520998 530716 540861 550944 561246 572221 583640 595055 606635
55925F06635J2099J2411J2438J2873J3859J4685J5100J5646J6382J6707J6669
$$ 606635 618734 631145 643583 656456 670315 685000 700100 715746 732128 748835 765504
55914G65504J7088J8014J8667J9031J9946K1368K2276K2683K3800K5806K7419
$$ 765504 782592 800606 819273 838304 858250 879618 901894 924577 948377 974183 1001602
55903A001602K8211K9354L1406L3436L5037L7202M0305M3300M5723M8452N1638
$$ 1001602 1029813 1059167 1090573 1124009 1159046 1196248 1236553 1279853 1325576 1374028 1425666
55892A425666N4038N5377N7176O0234O3475O6314O9845P4610P9514Q4172Q9860
$$ 1425666 1479704 1535081 1592257 1652491 1715966 1782280 1852125 1926735 2006249 2090421 2180281
55881B180281R6962J03990J10500J18328J28472J39485J50503J63087J78250J94599
$$ 2180281 2277243 2381233 2491733 2610061 2738533 2878018 3028521 3191608 3369858 3564457
55871C564457K11402K30653K53987K80422L09349L42861L82868M29056M82175
$$ 3564457 3775859 4006512 4260499 4540921 4850270 5193131 5575999 6005055 6487230
55862F487230N46259O25027P19577Q32914R73655J151847J374386J648702J988963
$$ 6487230 7033489 7658516 8378093 9211007 10184662 11336509 12710895 14359597 16348560
55853A6348560K415308K949020L611244M423427N405661O578403P972453R632115
$$ 16348560 18763868 21712888 25324132 29747559 35153220 41731623 49704076 59336191
55845E9336191J1574990J3676049J5504601J6256676J4978897J1108855N008590
$$ 59336191 70911181 84587230 100091831 116348507 131327404 142436259 147444849
55838A47444849j993931q212994j2444773j4409354j4564695j3612204j2136134
$$ 147444849 145450918 137237924 124793151 110383797 95819102 82206898 70070764
55831G0070764j0513683q957535p562022o344844n296008m406111l662663l044651
$$ 70070764 59557081 50599546 43037524 36692680 31396672 26990561 23327898 20283247
55823B0283247k532497k114308j777634j504634j280234j097244r49738q28509
$$ 20283247 17750750 15636442 13858808 12354174 11073940 9976696 9026958 8198449
55815H198449p26455o41868n72833n13871m60991m14704l75157l39089l04327
$$ 8198449 7471994 6830126 6257293 5743422 5282431 4867727 4492570 4153481 3849154
55806C849154k72781k46219k22953k01177j81865j65950j51884j38306j26143
$$ 3849154 3576373 3330154 3107201 2906024 2724159 2558209 2406325 2268019 2141876
55797B141876j16108j06903r7737q9843q3805p8006p1392o5248o0597n6276n1227
$$ 2141876 2025768 1918865 1821128 1731285 1647480 1569474 1498082 1432834 1372237 1315961 1264734
55786A264734m6339m2468l8777l4577l0849k8532k7175k6477k7130k8977l0337
$$ 1264734 1218395 1175927 1137150 1102573 1071724 1043192 1016017 989540 962410 933433 903096
55775I03096l0403l0410l1211l1623l0535k8734k7278k5805k3859k2227k1493
$$ 903096 872693 842283 811072 779449 748914 720180 692902 667097 643238 621011 599518
55764E99518k0719j9025j7117j5977j5274j4330j3484j3218j3047j2355j1452
$$ 599518 578799 559774 542657 526680 511406 497076 483592 470374 457327 444972 433520
55753D33520j0771j0067r179q636q604q341p460o720o780p232p579q024q567q501
$$ 433520 422749 412682 403503 394867 386263 377922 370462 363742 356962 349730 342151 334127 325560 317059
55739C17059p633o907o964p146o731o084n772n538n076m772m892m916m442l847
$$ 317059 309426 302519 295555 288409 281678 275594 269822 264284 259208 254436 249544 244628 240186 236339
55725B36339l400k649j445n19l62m99n05p48j395j759j476j227j496j597q95N3
$$ 236339 232939 230290 228845 228326 227964 227465 226960 226212 224817 223058 221582 220355 218859 217262 216367 216420
55709B16420N20Q02J413J958J861J442J237R32l7j381k420l079l619l902l822
$$ 216420 216940 217742 219155 221113 222974 224416 225653 226585 226548 225167 222747 219668 216049 212147 208325
55694B08325l825m268m770m874m782m697m124k713j134l39m06r32j904l330m526
$$ 208325 204500 200232 195462 190588 185806 181109 176985 174272 173138 172799 172393 171461 169557 166227 161701
55679A61701m756m200l559k970k132j109k81K03L23r4r83j744j950j951k251k736
$$ 161701 156945 152745 149186 146216 144084 142975 142694 142897 143220 143126 142143 140399 138449 136498 134247 131511
55663A31511k995l011k941k696k267j973j877j501p04j73m50j019j129r04r39
$$ 131511 128516 125505 122564 119868 117601 115628 113751 112250 111546 111373 110923 109904 108775 107871 106932
55648A06932j229j384j456j740k053j964j544j201r98p57n64o26q17q77q19p21
$$ 106932 105703 104319 102863 101123 99070 97106 95562 94361 93363 92606 92042 91416 90599 89722 88903 88182
55632H8182m89k00j95m50m06J11M19K3n46o30n14p69j133j018o20n82q56q88o91
$$ 88182 87693 87493 87298 86848 86442 86553 86972 86995 86449 85819 85305 84536 83403 82385 81765 81183 80327 79439 78748
55613G8748p50j042j041o96m94o01o79n41l32o4L93Q71J040R30P95O02J44m25
$$ 78748 77998 76956 75915 75219 74725 74124 73445 72904 72572 72508 72901 73772 74812 75742 76537 77139 77283 76858
55595G6858p28p41p11o69n40m96o44o45k23K01P1l49k91L78J071J374J391J259
$$ 76858 76130 75389 74678 74009 73469 72973 72329 71684 71461 71662 71733 71384 71093 71471 72542 73916 75307 76566
55577G6566J023R42J229J511J235N71K29L78M74J71k10l11j68J42O64J239J555
$$ 76566 77589 78531 79760 81271 82506 83077 83306 83684 84158 84329 84119 83808 83640 83782 84446 85685 87240
55560H7240J625J749J872J563P68K9k92m84r39j531j932k129k368k698k903k838
$$ 87240 88865 90614 92486 94049 94817 94846 94554 94070 93131 91600 89668 87539 85171 82473 79570 76732
55544G6732k649k629k824k863k372j568j078j071r98m80K6o7n13o33l76k70m71
$$ 76732 74083 71454 68630 65767 63395 61827 60749 59678 58680 58200 58226 58159 57646 57013 56637 56367 55896
55527E5896o06n23m81n51m60j76n0k38m57m97n09o07o43n56n51p34q77p25l12
$$ 55896 55290 54767 54286 53735 53275 53099 53049 52811 52354 51857 51348 50741 50098 49542 48991 48257 47380 46655 46343
55508D6343J71N07M54k8n68o98m63l66n98p86n92k30j05k46l23j04K89N29M19
$$ 46343 46514 47021 47475 47447 46879 46181 45718 45352 44754 43968 43376 43146 43041 42795 42472 42368 42657 43186 43605
55489D3605R1j10k5J72L08M50O55P33N03J52mL8M9p5k64m58n13k12L84Q35R35
$$ 43605 43696 43586 43561 43733 44041 44491 45146 45879 46382 46534 46530 46568 46617 46542 46278 45820 45307 45095 45479 46314 47249
55468D7249J118J753K370K220J395O95M68L27k5l71n44p24j013j203j172j050
$$ 47249 48367 50120 52490 54710 56105 56800 57268 57595 57570 57199 56655 55931 54918 53715 52543 51493
55452E1493q54m60m7pk60k56J67M85L16J0K5K09J60j02k56j94l5J59L31K54k05
$$ 51493 50639 50179 50132 50125 49865 49609 49776 50261 50577 50587 50612 50821 50981 50879 50623 50429 50394 50553 50884 51138 50933
55431E0933p93j158j262j307j319j177q97o61n60n37n61p02r52j113r62n11o0
$$ 50933 50140 48982 47720 46413 45094 43917 43020 42359 41799 41262 40701 39999 39047 37934 36972 36461 36401
55414C6401P4j13l42m09m10m74n47n11l84j87J40N07N84K56q0n2R5o4l60k73J20
$$ 36401 36475 36362 36020 35611 35201 34727 34180 33669 33285 33098 33238 33745 34329 34585 34505 34453 34548 34484 34124 33851 33971
55393C3971J73k99o94n08NL47M38M51L75J72J6L1M6j40m08n15m39l08j67jJ63
$$ 33971 34144 33845 33151 32643 32648 32995 33433 33884 34259 34431 34447 34478 34524 34384 33976 33461 33022 32714 32547 32546 32709
55372C2709L31N20N95L20k38o71o87m43k42j57j16r8m4J65M61N66L88K14K84M32
$$ 32709 33040 33560 34155 34475 34237 33566 32879 32436 32194 32037 31921 31823 31779 31944 32405 32971 33359 33573 33857 34289
55352C4289L77J77O4P3P3P7J69K29J5m36p63o88k91J09K95K69J79J14M5r2k64
$$ 34289 34666 34843 34907 34980 35053 35130 35299 35528 35543 35107 34344 33656 33365 33474 33769 34038 34217 34331 34376 34284 34020
55331C4020l79m07l70k64j11k0l6K3L62Q50J091Q87M36L4j47m4L05O62P38N07
$$ 34020 33641 33234 32864 32600 32489 32469 32433 32456 32818 33668 34759 35646 36082 36116 35969 35925 36230 36892 37630 38137
55311C8137K62K06K55K28R2r4k20j26K07M72K71l58r46j206j304j427j410j029
$$ 38137 38399 38605 38860 39088 39180 39086 38866 38740 38947 39419 39690 39332 38386 37180 35876 34449 33039 32010
55293C2010m44oJ63K01K06J68J09Q3P9L6l2l8Q0K77L79K09j84m83m26j09J75L20
$$ 32010 31566 31560 31723 31924 32130 32298 32407 32490 32569 32605 32573 32535 32615 32892 33271 33480 33296 32813 32387 32278 32453 32773
55271C2773M07L97J81j30k57j76j29j90j24J63L87L12J15J07K80L95L01K6k86
$$ 32773 33180 33577 33758 33628 33371 33195 33066 32876 32752 32915 33302 33614 33729 33836 34116 34511 34812 34838 34552
55252C4552m55l50p4J02O5j8k5n0j89l43l67k55q6Q9J89J63P1J7l9j74k92k62
$$ 34552 34097 33747 33673 33775 33840 33822 33797 33747 33558 33215 32848 32593 32507 32596 32785 32948 33019 33036 32997 32823 32531 32269
55230C2269k29m06n69k50N18J086J042O74M05K66J46J32J94Rm86p70m28J29K03
$$ 32269 32040 31634 31065 30815 31333 32419 33461 34135 34540 34806 34952 35084 35278 35287 34801 34031 33603 33732 33935
55211C3935j78l94j86R0J23M0M0J00J78L57N99O98N49L08J23m6k74m62m51k21
$$ 33935 33757 33363 33177 33267 33390 33430 33470 33570 33748 34105 34704 35402 35951 36259 36382 36336 36062 35600 35149 34928
55191C4928N6J90J27l4j57k26k72k54j11O5J09O2J17K61K42j5k19j39N5R9K2j0
$$ 34928 34984 35174 35301 35267 35110 34884 34612 34358 34247 34312 34421 34483 34600 34861 35103 35088 34869 34730 34785 34884 34906 34896
55169C4896on3p0L6J24Kk66m44m46l18q1K08L74L05J25j9j69l46l72j72l6k02
$$ 34896 34890 34837 34767 34803 34927 34929 34663 34219 33773 33455 33374 33582 33956 34261 34386 34367 34198 33852 33480 33308 33272 33070
55147C3070l82j39L80N60K04j84j13K60M28K21o3q7J69M65O10O24N70L53j09n70
$$ 33070 32688 32549 32929 33489 33693 33509 33396 33656 34084 34305 34242 34155 34324 34789 35399 36023 36593 36946 36837 36267
55127C6267n86r3M19M80K10po9j39k28k02j39l06p35j103j064n75J05N59M99O9
$$ 36267 35681 35588 36007 36487 36697 36690 36621 36482 36254 36052 35913 35607 34872 33769 32705 32130 32235 32794 33293 33362
55107C3362k45j65P3J50J79M08P11P37M78K55J66J2k39l43k08q4j56l04l44k81
$$ 33362 33117 32952 33025 33175 33354 33762 34473 35210 35688 35943 36109 36121 35882 35539 35331 35247 35091 34787 34443 34162
55087C4162k57l56n63p03n21lM73N55M11M49O84P31M32M4j82k06%M06O48L16l74
$$ 34162 33905 33549 32986 32283 31762 31759 32232 32787 33198 33647 34331 35062 35494 35538 35356 35150 35150 35556 36204 36520 36146
55066C6146o72k73K79M28L29M18O67P60O60O03O80Q03R29R59O59jo16q04p34p97
$$ 36146 35474 35201 35480 35908 36237 36655 37322 38082 38742 39345 40025 40828 41757 42716 43375 43374 42758 41954 41220 40423
55046D0423r40q20m73l12m29m29j01K59L62L79N49O77M52k3l31l00j36m1m3j42
$$ 40423 39483 38663 38190 37878 37449 37020 36919 37178 37540 37919 38468 39145 39597 39574 39243 38943 38807 38766 38723 38581
55026C8581l46n03m03q7J96L56N65Q39Q43L56l20o85n92k28K93R10J308J073K74
$$ 38581 38235 37732 37329 37242 37438 37794 38359 39198 40041 40397 40077 39392 38800 38572 38865 39775 41083 42156 42430
55007D2430m85p40o02m03k23j7J32J58K17M48O76O59M45L09L42M14M15L18J00
$$ 42430 41945 41205 40603 40200 39977 39960 40092 40250 40467 40915 41591 42250 42695 43004 43346 43760 44175 44493 44593
54988D4593j80l01j38Q0J3l01m87l17N9L65M68L99L10L76N52N19P0n09p77p01
$$ 44593 44413 44112 43974 44054 44067 43766 43279 42962 43021 43386 43854 44253 44563 44939 45491 46010 46080 45571 44794 44093
54968D4093n89n39l19J02M00L73K39K63L87L93K31m2m01p69r61q88o72m43j95
$$ 44093 43504 42965 42646 42748 43148 43521 43760 44023 44410 44803 45034 44992 44591 43822 42861 41973 41301 40858 40663
54949D0663M6J25Kj25q7J7Lq5o3R9L10N10O31N32J56k61m23l54l64o27r25r17
$$ 40663 40709 40834 40836 40711 40624 40641 40644 40559 40496 40595 40905 41415 42046 42578 42734 42473 42050 41696 41332 40705 39780 38863
54927C8863n20K1M23O10O72O70N33K42m6j57j16m7M2K29M44M92L59K36J92M7k88
$$ 38863 38343 38364 38787 39397 40069 40739 41272 41514 41468 41311 41195 41148 41190 41419 41863 42355 42714 42950 43142 43189 42901
54906D2901n75n57l21j35m1J68N81J010J217J120P73K78k08m77m24j82l7j11k24
$$ 42901 42326 41769 41448 41313 41272 41440 42021 43031 44248 45368 46141 46419 46211 45734 45310 45128 45091 44980 44756
54887D4756j37J11K05Rk58l00j36L9J38K12K22J10j5L8K36M08N08O30P20N91K59
$$ 44756 44619 44730 44935 44944 44686 44386 44250 44289 44427 44639 44861 44971 44956 44994 45230 45638 46146 46776 47496 48087 48346
54866D8346o3k62l75l19L2M85O14L45R8J78L99M84M57L84J46j97k24K86Q62R03
$$ 48346 48283 48021 47646 47327 47359 47844 48458 48803 48901 49079 49478 49962 50419 50803 50949 50752 50528 50814 51676 52579
54846E2579M73J13K1m5j64j12J90N19P52R86J211J256J180J317J801K397K926
$$ 52579 53052 53165 53186 53141 52977 52865 53055 53574 54326 55312 56523 57779 58959 60276 62077 64474 67400
54829F7400L500M118M401M019L099J973P86l92j326j877k322k971l567l526k810
$$ 67400 70900 75018 79419 83438 86537 88510 89296 88904 87578 85701 83379 80408 76841 73315 70505
54814G0505k110k000k247k247j820j283r28p86q31j024j144r15m32j42k50m01
$$ 70505 68395 66395 64148 61901 60081 58798 57870 57084 56253 55229 54085 53170 52738 52596 52346 51945
54798E1945k00K22M61N06P42J314J882K104K058K056K301K823L490L975L904L272
$$ 51945 51745 51967 52428 52934 53676 54990 56872 58976 61034 63090 65391 68214 71704 75679 79583 82855
54782H2855K482J844J232L89o22j527k222k799l235l360l099k568k000j659j736
$$ 82855 85337 87181 88413 88802 88180 86653 84431 81632 78397 75037 71938 69370 67370 65711 63975
54767F3975k145k524k564k285j838j292p11k67L4M51J028J235N71o22j429j442
$$ 63975 61830 59306 56742 54457 52619 51327 50616 50349 50383 50834 51862 53097 53668 53046 51617 50175
54751E0175j034n95r4M24N74K05k43l65l65n73p80n72j01J37R7J88M73M65k7n04
$$ 50175 49141 48546 48452 48876 49450 49655 49412 49047 48682 48109 47329 46757 46656 46793 46890 47078 47551 48016 47989 47485
54731D7485m55r4Pk68n13m57k46j12n4K9R6K3j84l64l70k00K6J99K79K77K13J62
$$ 47485 47030 46936 46943 46675 46162 45705 45459 45347 45293 45322 45418 45441 45257 44893 44523 44323 44349 44548 44827 45104 45317 45479
54709D5479K48N23Q41R39O88K29j58l04k39j21r3j17NM01Q77J060Q02L72J26J30
$$ 45479 45727 46250 47091 48030 48718 48947 48789 48485 48246 48125 48032 47915 47920 48321 49198 50258 51060 51432 51558 51688
54689E1688K28L61O14R74J276J393J419J502J669J869K092K367K691L071L570
$$ 51688 51916 52277 52891 53865 55141 56534 57953 59455 61124 62993 65085 67452 70143 73214 76784
54674G6784M212M830N153N102M916M901N044M925M064K372K47j725l087l615l313
$$ 76784 80996 85826 90979 96081 100997 105898 110942 115867 119931 122303 122550 120825 117738 114123 110810
54659A10810k470j686j533k151l162m049m534m615m419m084l694l215k565j795
$$ 110810 108340 106654 105121 102970 99808 95759 91225 86610 82191 78107 74413 71198 68633 66838
54645F6838j138p42n37l96l21l24k44J23P22J325J872K465L032L232K926K479
$$ 66838 65700 64958 64421 64025 63704 63380 63136 63259 63981 65306 67178 69643 72675 75907 78833 81312
54629H1312K356K493K367J691P53n2p66j665k656l277l317l137l131l141k774
$$ 81312 83668 86161 88528 90219 90972 90920 90154 88489 85833 82556 79239 76102 72971 69830 67056
54614F7056k126j741j820j908j549q95m07k50k93n16r46j329j273p99l47j77j06
$$ 67056 64930 63189 61369 59461 57912 57017 56610 56360 56067 55551 54605 53276 52003 51204 50857 50680 50574
54597E0574M9J13p6k55n6M10O04K42l70p00n77k56p3j34l23m80n23m49l04j55
$$ 50574 50623 50736 50660 50405 50349 50759 51363 51605 51235 50535 49958 49702 49629 49495 49172 48692 48169 47720 47416 47261
54577D7261m6K0P3R5L3q0j17j7Q1L2j03j39l7P8J24J34J24O4j1%N1n7l77o75o47
$$ 47261 47215 47235 47308 47403 47436 47356 47239 47222 47303 47335 47232 47093 47056 47134 47258 47392 47516 47580 47569 47569 47620 47563 47186 46511 45864
54552D5864k60K37N54N54L10M4n4J8J11J16M3p2j97k51j50K6J34J76L16N63O76
$$ 45864 45604 45841 46395 46949 47259 47303 47249 47267 47378 47494 47537 47465 47268 47017 46867 46893 47027 47203 47519 48082 48758
54531D8758M85J66L0J58L71M68L77J35j24k16p5J43K21P6j98m27m32j08M35Q80
$$ 48758 49243 49409 49439 49597 49968 50436 50813 50948 50824 50608 50533 50676 50897 50973 50775 50348 49916 49808 50243 51123
54511E1123R55O79L19J40K13L52K62j59n92n99j80J47l8n43q44p07l37qJ97K89
$$ 51123 52078 52757 53076 53216 53429 53781 54043 53884 53292 52693 52513 52660 52622 52079 51235 50528 50191 50183 50380 50669
54491E0669K61J37mp1l1J6j21m97q08o51o6L92K91j46l62j70J82M65O55P11N41
$$ 50669 50930 51067 51063 50992 50961 50977 50856 50359 49551 48900 48834 49226 49517 49371 49009 48839 49021 49486 50141 50852 51393
54470E1393K00r5k50l51m07l07q5L0o0j44l5J42J22j22l53l31m1L37N86O60O96
$$ 51393 51593 51498 51248 50897 50490 50183 50098 50128 50068 49924 49889 50031 50153 50031 49678 49347 49306 49643 50229 50889 51585
54449E1585P95Q02N41J80J53N77J026J037O65L21J79N4j99m36m79l94l19j93J44
$$ 51585 52380 53182 53723 53903 54056 54633 55659 56696 57361 57682 57861 57915 57716 57280 56801 56407 56088 55895 56039
54430E6039N91P79N04Ol25m31n44p26p29m12m1M2j02j19J02L12L09J58k5k48m88
$$ 56039 56630 57409 57913 57919 57594 57163 56619 55893 55164 54752 54711 54753 54651 54532 54634 54946 55255 55413 55388 55140 54652
54409E4652n59m10l04m51o49n23j13J43J3k16j61J79N17O52N30J45m02p75o82
$$ 54652 54093 53683 53379 52928 52279 51756 51643 51786 51799 51583 51422 51601 52118 52770 53300 53445 53043 52268 51586
54390E1586k28J89L79N12P38R14Q40N42J73j70l99l64p1J85J65K4Q9L48M75L37
$$ 51586 51358 51547 51926 52438 53176 54090 54930 55472 55645 55475 55076 54712 54641 54826 54991 55015 55104 55452 55927 56264
54370E6264J80K20L32K00l09j013j492j369o63J18M82M51M17N25N74M67L64L13
$$ 56264 56444 56664 56996 57196 56887 55874 54382 53013 52350 52468 52950 53401 53818 54343 54917 55384 55748 56061
54352E6061J33j74k90p6J57J22m4r8q1q7J3K73L86J10k90l80j89j6R6K85M15K54
$$ 56061 56194 56020 55730 55654 55811 55933 55889 55791 55710 55623 55636 55909 56295 56405 56115 55735 55546 55530 55626 55911 56326 56580
54330E6580j7m8K3k37p25q02k50L53M92L54L48M50M50M16N10N92M61K69K84M07
$$ 56580 56563 56515 56538 56301 55576 54774 54524 54877 55369 55723 56071 56521 56971 57387 57897 58489 58950 59219 59503 59910
54310E9910K98r3m58n78n24m15k77j15N2K68N35O82N32J57j66k57j70KJ96L37
$$ 59910 60208 60115 59657 59079 58555 58140 57863 57748 57800 58068 58603 59285 59817 59974 59808 59551 59381 59383 59579 59916
54290E9916L49K67J94J58J17Q3J06J35M7j31j96k8K38L51K00j21l65k69K61R55
$$ 59916 60265 60532 60726 60884 61001 61084 61190 61325 61372 61241 61045 61017 61255 61606 61806 61685 61320 61051 61312 62267
54270F2267J304J024L78q8j11Q4J33m6k51k88j24J82N13P09O66M59L11L72O23
$$ 62267 63571 64595 64973 64885 64774 64858 64991 64945 64694 64406 64282 64464 64977 65686 66352 66811 67122 67494 68117
54251F8117J004J433J729J697J416J262J486J924K260K417K507K464K027J085
$$ 68117 69121 70554 72283 73980 75396 76658 78144 80068 82328 84745 87252 89716 91743 92828
54237I2828j22j185j796j906j791j842k149k362k181j779j502j253o82N2K96j93
$$ 92828 92706 91521 89725 87819 86028 84186 82037 79675 77494 75715 74213 72960 72278 72330 72626 72433
54221G2433q10r27o87o13p32o39k71n3k18m76m84l05j98j96j61o3k2j11k49k85
$$ 72433 71623 70696 70009 69396 68664 68025 67754 67701 67483 67007 66523 66218 66020 65824 65663 65600 65578 65467 65218 64933
54201F4933j04K66N68N19J32k44l37k80l30m22l01kJ32j3j47m5Q6Pq8J17M92O26
$$ 64933 64829 65095 65663 66182 66314 66070 65733 65453 65123 64701 64400 64398 64530 64517 64370 64325 64411 64418 64330 64447 64939 65565
54179F5565M74L96N13M93J40k73m41m11l17n7L77O18L86ln8J73K53J07M7J23p
$$ 65565 66039 66435 66948 67441 67581 67308 66867 66456 66139 66082 66459 67077 67463 67460 67402 67575 67828 67935 67982 68105 68098
54158F8098m04o15l35J18K70J31J3J2m3k07l16k34j1J95K64J71rj91l55m61m08
$$ 68098 67694 67079 66744 66862 67132 67263 67276 67288 67245 67038 66722 66488 66477 66672 66936 67107 67098 66907 66552 66091 65683
54137F5683j90m3j64l60k49J43L36P4l21m40l27k71k98j66K39P49J104J143R00
$$ 65683 65493 65450 65286 64926 64677 64820 65156 65230 64909 64469 64142 63871 63573 63407 63646 64395 65499 66642 67542
54118F7542N63L27J61j22n08p15n90l63l35m46m30k00P8K69L45L08J74P2J40L51
$$ 67542 68105 68432 68593 68471 67963 67248 66658 66295 65960 65514 65084 64884 64962 65231 65576 65884 66058 66130 66270 66621
54098F6621N61O84P39P56P09N40J97k68o35o85m66k86l55n89p67p77o00k94m5
$$ 66621 67182 67866 68605 69361 70070 70610 70807 70539 69904 69219 68753 68467 68112 67523 66756 65979 65379 65085 65040
54079F5040l1j86k50j72j40j51P0N18P08L36j40r7L76O10K92k23n36o58p59q21
$$ 65040 65009 64823 64573 64401 64261 64110 64180 64698 65406 65742 65602 65505 65881 66491 66783 66560 66024 65366 64607 63786
54059F3786p25m62j44O9N5j13j70O5M08N82N93O21O17L86K9p9J35L15K22Q2J60
$$ 63786 63061 62599 62455 62524 62579 62466 62296 62361 62769 63351 63944 64565 65182 65568 65597 65518 65653 65968 66190 66272 66432
54038F6432L16K52K9OL06O42O92M71K67K83M61N64M57K28P8J20K34K12l3l45m51
$$ 66432 66748 67000 67029 67035 67341 67983 68675 69146 69413 69696 70157 70721 71178 71406 71484 71604 71838 72050 72017 71672 71221
54017G1221k68k3K2r8j57j32k33m42m03M6M76L68j65n17m03q4J46L33N59O45M31
$$ 71221 70953 70930 70952 70854 70697 70565 70332 69890 69487 69533 70009 70377 70212 69695 69292 69208 69354 69687 70246 70891 71322
53996G1322R1k8J23K70J90l0j21L8L12M85M93M63M80M92M20L47M48P73J178J441
$$ 71322 71413 71385 71508 71778 71968 71938 71817 71855 72167 72652 73145 73608 74088 74580 75000 75347 75795 76568 77746 79187
53976G9187J437J248J136J305J688K064K397K856L486M176N011O312P948Q984
$$ 79187 80624 81872 83008 84313 86001 88065 90462 93318 96804 100980 105991 112303 120251 129235
53962A29235Q412O178L107j0k835n091o403o662o248n625m989m427m023l693l168
$$ 129235 137647 143825 146932 146922 144087 138996 132593 125931 119683 114058 109069 104642 100619 96926 93758
53947I3758k393j707j396j256q27J8R51J559J703J513J249J114J182J397J646
$$ 93758 91365 89658 88262 87006 86179 86197 87148 88707 90410 91923 93172 94286 95468 96865 98511
53932I8511J802J768J573J395J346J321J158R12P54P28P48Q20R83J044P28J02
$$ 98511 100313 102081 103654 105049 106395 107716 108874 109786 110540 111268 112016 112836 113819 114863 115591 115693
53916A15693l59l53q7K3j98o42j118j446j529j467j457j496j403j129q84p60n72
$$ 115693 115334 114981 114894 114917 114719 114077 112959 111513 109984 108517 107060 105564 104161 103032 102148 101388 100816
53899A00816j88J96L35L38N29J036J673K165K334K153J795J475J203P24p1r34
$$ 100816 100628 100824 101159 101497 102026 103062 104735 106900 109234 111387 113182 114657 115860 116584 116513 115579
53883A15579j563j962k318k656k851k897k860k659k157j440q41n56m98m75l90
$$ 115579 114016 112054 109736 107080 104229 101332 98472 95813 93656 92216 91375 90819 90321 89846 89456
53868H9456k43j18k09o78j349j735j462o24L29R86J184R89N68J34j76l42l93k93
$$ 89456 89213 89095 88886 88208 86859 85124 83662 83038 83367 84353 85537 86526 87094 87228 87052 86710 86317 86024
53850H6024qL26M75M00L72O35J067J359J466J650K029K389K527K561K661K776
$$ 86024 86016 86342 86817 87217 87589 88224 89291 90650 92116 93766 95795 98184 100711 103272 105933 108709
53834A08709K788K826L091L505L795L891L966M121M307M501M736M910M859M560
$$ 108709 111497 114323 117414 120919 124714 128605 132571 136692 140999 145500 150236 155146 160005 164565
53820A64565M080L434K755K519L157M539O228Q200J0692J3248J4502J3324R850
$$ 164565 168645 172079 174834 177353 180510 185049 191277 199477 210169 223417 237919 251243 261093
53807B61093N084k3m773q464j0572j1198j0906j0189r287q339p362o244n034m147
$$ 261093 266177 266154 261381 252917 242345 231147 220241 210052 200765 192426 185064 178820 173786 169639
53793A69639l882l928l707l192k895l083l410l484l381l392l548l611l424l025
$$ 169639 165757 161829 158122 154930 152035 148952 145542 142058 138677 135285 131737 128126 124702 121677
53779A21677k575k249k146k156j964j355n37o9l36j108j743j858j705j723j911
$$ 121677 119102 116853 114707 112551 110587 109232 108695 108626 108290 107182 105439 103581 101876 100153 98242
53764I8242j888j536j194j146j239j234j169j149j061q10o04o40o77l70J17K79
$$ 98242 96354 94818 93624 92478 91239 90005 88836 87687 86626 85816 85212 84572 83895 83525 83642 83921
53748H3921Mk93l04j71p0J07M65P46O35K08j20m1L62P24P11K99j60k64O3M95O80
$$ 83921 83925 83632 83328 83157 83087 83194 83659 84405 85040 85248 85128 85087 85449 86173 86884 87183 87023 86759 86822 87317 87997
53727H7997N45K76R1Q4J36jm14q31q72n19j63j35l87o43p21n80k29K68P75J181
$$ 87997 88542 88818 88909 88993 89129 89128 88714 87883 87011 86492 86329 86194 85807 85164 84443 83863 83634 83902 84677 85858
53707H5858J457J595J570J437J341J370J484J617J783J980K130K230K366K558
$$ 85858 87315 88910 90480 91917 93258 94628 96112 97729 99512 101492 103622 105852 108218 110776
53693A10776K649K496K174J815J375P62J27j95j29Mr9l18l65k49k97o33r82j120
$$ 110776 113425 115921 118095 119910 121285 122047 122174 121979 121850 121854 121755 121437 121072 120823 120526 119893 118911 117791
53675A17791j258j707k293k495k183j803j759j890j844j627j517j517j355r65
$$ 117791 116533 114826 112533 110038 107855 106052 104293 102403 100559 98932 97415 95898 94543 93578
53661I3578o37n67n88m70k79k21l38n01o29p10o67m13o9Q2p8l21l52j72l9j13
$$ 93578 92941 92374 91786 91316 91037 90816 90478 89977 89348 88638 87971 87558 87489 87571 87493 87172 86820 86648 86609 86496
53641H6496k57k73j48J5J85L56M25L02J10N5Q7n3m15p14p03m51j49J18K87K57
$$ 86496 86239 85966 85818 85833 86018 86374 86799 87101 87211 87266 87353 87300 86885 86171 85468 85017 84868 84986 85273 85530
53621H5530J37K62P40J175J137P43M58M88O81R03J148J308J241J063J018J046
$$ 85530 85667 85929 86669 87844 88981 89724 90182 90670 91351 92254 93402 94710 95951 97014 98032 99078
53605I9078Q45M42K72N82J063J273J123P76L60K6K2M18R10J127J045Q92P73O37
$$ 99078 99923 100365 100637 101219 102282 103555 104678 105454 105814 105840 105862 106280 107190 108317 109362 110254 111027 111664
53587A11664N11M91N57N57M23K30M7p3mL90R94J392J228N64j50m82l64n0J94L19
$$ 111664 112175 112666 113223 113780 114203 114433 114480 114407 114403 114793 115787 117179 118407 118971 118821 118339 117975 117925 118119 118438
53567A18438L89L80K09q5l33m50n27o21n98l17J05L68L46K27K15K45J09j38j67
$$ 118438 118827 119207 119416 119331 118998 118548 118021 117400 116802 116485 116590 116958 117304 117531 117746 117991 118100 117962 117795
53548A17795J59M72L12k11m88k13J93J52l00o04m31l3J41m2l61m80k22L23Q54
$$ 117795 117954 118426 118738 118527 118039 117826 118019 118171 117871 117267 116836 116803 116944 116902 116541 116061 115839 116162 117016
53529A17016J120J074Q04M14R8J19N12R20R95Q29P56Q29Q55Q15Q70R76R14P48
$$ 117016 118136 119210 120014 120428 120526 120645 121157 122077 123072 123901 124657 125486 126341 127156 128026 129002 129916 130664
53511A30664Q11J144J396J405J439J688J910J896J823J875J900J807J871K245
$$ 130664 131475 132619 134015 135420 136859 138547 140457 142353 144176 146051 147951 149758 151629 153874
53497A53874K527K323K006K221K868L234L111L050L417L800L736L455L445L631
$$ 153874 156401 158724 160730 162951 165819 169053 172164 175214 178631 182431 186167 189622 193067 196698
53483A96698L446K615J427K35r30k143l230l856l911l654l414l244k978k572k223
$$ 196698 200144 202759 204186 204421 203491 201348 198118 194262 190351 186697 183283 180039 177061 174489 172266
53468A72266k058j896j523j052q07q54r37q74p90q51j003j083j047r46p86n70
$$ 172266 170208 168312 166789 165737 164930 164076 163139 162265 161475 160624 159621 158538 157491 156545 155759 155189
53452A55189l85l05k55p0K93O77Q97Q76O94M72L02K19K81N17P95Q36N11O5j08
$$ 155189 154804 154499 154244 154174 154467 155144 156041 156917 157611 158083 158385 158604 158885 159402 160197 161033 161544 161609 161501
53433A61501R1L96N55O30Q25J213J712K180K450K410K207K249K795L564L977L783
$$ 161501 161592 161988 162543 163173 163998 165211 166923 169103 171553 173963 176170 178419 181214 184778 188755 192538
53417A92538L360L272L680M264M630M725M838N236N838O296O402O326O383O651
$$ 192538 195898 199170 202850 207114 211744 216469 221307 226543 232381 238677 245079 251405 257788 264439
53403B64439O986P301P681Q105Q366Q386Q470Q966R740J0234J0117R632R265R188
$$ 264439 271425 278726 286407 294512 302878 311264 319734 328700 338440 348674 358791 368423 377688 386876
53389C86876R237R227R098Q827Q459Q220Q367Q807R078Q839Q272P840P752P800
$$ 386876 396113 405340 414438 423265 431724 439944 448311 457118 466196 475035 483307 491147 498899 506699
53375E06699P685P322O819O371O202O434O922P279P245O908O490N998N220M072
$$ 506699 514384 521706 528525 534896 541098 547532 554454 561733 568978 575886 582376 588374 593594 597666
53361E97666K755J560O00j90r73j907l028m119m846n118n207n396n639n789n964
$$ 597666 600421 601981 602581 602391 601418 599511 596483 592364 587518 582400 577193 571797 566158 560369 554405
53346E54405o415p062p544p759q011q468q802q661q232q006q109q220q075p726
$$ 554405 547990 540928 533384 525625 517614 509146 500344 491683 483451 475445 467336 459116 451041 443315
53332D43315p277o689n933n091m212l281k383j746j438j248r08l87J66O32R95
$$ 443315 436038 429349 423416 418325 414113 410832 408449 406703 405265 404017 403109 402722 402888 403520 404515
53317D04515J338J825K577L447M060M171L960L859M165M817N498N959O291O858
$$ 404515 405853 407678 410255 413702 417762 421933 425893 429752 433917 438734 444232 450191 456482 463340
53303D63340P858Q994R782J0152J0486J1028J1566J1854J2082J2641J3633J4868
$$ 463340 471198 480192 489974 500126 510612 521640 533206 545060 557142 569783 583416 598284
53291E98284J6171J7427J8442J9077J9518K0120K0952K1719K2183K2425K2624
$$ 598284 614455 631882 650324 669401 688919 709039 729991 751710 773893 796318 818942
53280H18942K2780K2821K2786K2736K2574K2118K1356K0511J9756J8956J7822
$$ 818942 841722 864543 887329 910065 932639 954757 976113 996624 1016380 1035336 1053158
53269A053158J6342J4931J3965J3255J2173J0373Q240O416N051L655J622j192
$$ 1053158 1069500 1084431 1098396 1111651 1123824 1134197 1142437 1148853 1153904 1157559 1159181 1157989
53257A157989m437p579j0342j2834j5271j7501j9073j9819k0198k0801k1610k2089
$$ 1157989 1153552 1145973 1135631 1122797 1107526 1090025 1070952 1051133 1030935 1010134 988524 966435
53245I66435k1954k1483k1021k0536j9832j8950j8086j7351j6806j6609j6841
$$ 966435 944481 922998 901977 881441 861609 842659 824573 807222 790416 773807 756966
53234G56966j7229j7334j7018j6524j6036j5401j4441j3333j2413j1660j0662
$$ 756966 739737 722403 705385 688861 672825 657424 642983 629650 617237 605577 594915
53223E94915r205p647o499n834n348m957m885n172n396n260n100n430o094o310
$$ 594915 585710 578063 571564 565730 560382 555425 550540 545368 539972 534712 529612 524182 518088 511778
53209E11778n667m698m229m421m693m477l768k952k316j803j168l09N51J076J233
$$ 511778 506111 501413 497184 492763 488070 483593 479825 476873 474557 472754 471586 471277 471828 472904 474137
53194D74137J384J894K712L478L996M413M982N763O631P465Q248R001R710J0276
$$ 474137 475521 477415 480127 483605 487601 492014 496996 502759 509390 516855 525103 534104 543814 554090
53180E54090J0579J0614J0560J0576J0540J0183R500Q845Q471Q130P405O302N239
$$ 554090 564669 575283 585843 596419 606959 617142 626642 635487 643958 652088 659493 665795 671034
53167F71034M418L514K179N68q06j673k194k722l539m773o320p840r002r771j0367
$$ 671034 675452 678966 681145 681713 680907 679234 677040 674318 670779 666006 659686 651846 642844 633073 622706
53152F22706j0964j1552j2056j2364j2317j1889j1424j1378j1741j1933j1471
$$ 622706 611742 600190 588134 575770 563453 551564 540140 528762 517021 505088 493617
53141D93617j0537r763r541r714r884r818r595r475r625r909j0029r885r667r546
$$ 493617 483080 473317 463776 454062 444178 434360 424765 415290 405665 395756 385727 375842 366175 356629
53127C56629r383q952q247p468o715n950n168m445l772l080k423k037k114k608
$$ 356629 347246 338294 330047 322579 315864 309914 304746 300301 296529 293449 291026 288989 286875 284267
53113B84267l298l942m390m613m702m778m913n118n392n696n900n825n393m716
$$ 284267 280969 277027 272637 268024 263322 258544 253631 248513 243121 237425 231525 225700 220307 215591
53099B15591m042l541l194k869k538k313k231k117j884j802k186k854l243l128
$$ 215591 211549 208008 204814 201945 199407 197094 194863 192746 190862 189060 186874 184020 180777 177649
53085A77649k907k964l142l103k897k799k807k718k581k643k866k927k695k355
$$ 177649 174742 171778 168636 165533 162636 159837 157030 154312 151731 149088 146222 143295 140600 138245
53071A38245k011j576j150j107j537j948j817j231p12n76o93q04p94o99o16o44
$$ 138245 136234 134658 133508 132401 130864 128916 127099 125868 125156 124580 123887 123083 122289 121590 120974 120330
53055A20330p48p66o25n03o13q67r61p35l62j13j14l11n26n33k57O2K9m28q96
$$ 120330 119582 118816 118191 117688 117075 116208 115247 114512 114150 114037 113923 113612 113086 112553 112296 112358 112387 111959 111063
53036A11063r28n49j57K6Q7J16J0k35l20k4M54P71R32J176J449J398R36M58L39
$$ 111063 110135 109586 109429 109455 109542 109658 109668 109433 109113 109089 109543 110314 111246 112422 113871 115269 116205 116663 117002
53017A17002M82N87N67N04M18L17L17M24M03Q4l51o51r11j372j891k014j591r91
$$ 117002 117484 118071 118638 119142 119560 119877 120194 120618 121021 121105 120754 120103 119192 117820 115929 113915 112324 111333
52999A11333o29n34m91l65j97r7j46k96l24l0N20J013J212J118Q53N31K32J7j27
$$ 111333 110704 110170 109679 109314 109117 109020 108874 108578 108254 108224 108744 109757 110969 112087 112940 113471 113703 113720 113593
52980A13593k06j67LK29M05M90L91K2m53o31l71r2k27n84o78m94m80p79j031r97
$$ 113593 113387 113220 113223 113452 113857 114347 114738 114760 114307 113676 113305 113213 112986 112402 111724 111230 110750 109971 108940 107943
52960A07943q83q85q29n50j98L7J91K77J38k08l76j12K75L32N5k43m55o65p70
$$ 107943 107060 106175 105346 104796 104598 104635 104826 105103 105241 105033 104657 104545 104820 105152 105207 104964 104509 103844 103074
52941A03074n57r4K81M02M04M28M64N11O28P43O23J75l89p51p49m48p4J04pk26
$$ 103074 102517 102423 102704 103106 103510 103938 104402 104913 105541 106284 106907 107082 106693 105942 105193 104745 104671 104775 104768 104542
52921A04542k85j26N8J08J02J87L66N12N52N39M95L31k7m32o04m26j04P3L4q5
$$ 104542 104257 104131 104189 104297 104399 104586 104952 105464 106016 106555 107050 107381 107354 106922 106318 105892 105788 105861 105895 105810
52901A05810j57j33K5L21O00O49M00k3l99n09k26K93O59O99P21J031J332J019
$$ 105810 105653 105520 105545 105866 106466 107115 107515 107492 107093 106584 106358 106651 107310 108009 108730 109761 111093 112112
52883A12112P8p64q81l60L35R21J294J338J049O31K27k05o05o84l11K11N21O02
$$ 112112 112190 111426 110545 110185 110520 111441 112735 114073 115122 115753 115980 115775 115170 114486 114175 114386 114907 115509
52865A15509O24O05M90L86L84L63K10O0M4j2l23p43q91o39k49n2j87n27p44n88
$$ 115509 116133 116738 117228 117614 117998 118361 118571 118631 118675 118663 118340 117597 116706 116067 115818 115766 115579 115052 114308 113720
52845A13720k25o9j81j95Lm3o04j173j109n55j80j74j39J43L78K99L7j25p7Q6
$$ 113720 113495 113426 113245 113050 113053 113010 112406 111233 110124 109569 109389 109215 109076 109219 109597 109896 109933 109808 109731 109817
52825A09817J12j83n85n71q8K11j22n50l58J83K74l8jM26M01l16q36n33m2j54
$$ 109817 109929 109746 109161 108590 108502 108713 108591 108041 107683 107866 108140 108102 108101 108527 108928 108612 107776 107243 107201 107047
52805A07047n72n23n3J77K6m5J75L82L57K44K33L69O10Q47R08Q54J006J409J519
$$ 107047 106475 105952 105899 106076 106102 106057 106232 106614 106971 107215 107448 107817 108427 109274 110182 111036 112042 113451 114970
52786A14970Q78j62q54j001j013j096j004o06j84k9j26l27n64p44p59o20m31k08
$$ 114970 115848 115686 114832 113831 112818 111722 110718 110112 109928 109899 109773 109446 108882 108138 107379 106759 106328 106120
52768A06120P3K67K17O2J17M20P22Q64Q90P89M84J43J24M69P58N97J7o73j171
$$ 106120 106193 106460 106677 106739 106856 107276 107998 108862 109752 110541 111025 111168 111292 111761 112519 113116 113133 112460 111289
52749A11289j293j090q92j009j260j141n61%J31NrJ26K19K12Q8k57p44r40n42
$$ 111289 109996 108906 108014 107005 105745 104604 104043 104043 104174 104179 104170 104296 104515 104727 104815 104558 103814 102874 102332
52730A02332Q9L26J16j3K45O02O80N31M47N65Q73J381K014K458K339J594N19m96
$$ 102332 102421 102747 102863 102850 103095 103697 104377 104908 105355 105920 106793 108174 110188 112646 114985 116579 117098 116602
52712A16602j232j668j879j910j764j499j289j266j331j280j127j104j268j352
$$ 116602 115370 113702 111823 109913 108149 106650 105361 104095 102764 101484 100357 99253 97985 96633
52698I6633j128p44m66l01j15K3o9k40r3M36Q87Q74O04N22O89Q12P25N42L58J55
$$ 96633 95505 94761 94295 93994 93879 93902 93833 93593 93500 93936 94823 95697 96301 96823 97512 98324 99049 99591 99949 100104
52678A00104L5K20O69R55P35J72k64l53k81l28n35p11o58l57k0J01n4k83l54k10
$$ 100104 100139 100359 101028 101983 102718 102890 102626 102273 101992 101664 101129 100418 99760 99403 99383 99484 99430 99147 98793 98583
52658I8583O4L42M95M21J83L8J39L28L31J38n2j66l04m25l04Q1L92L72K53M30
$$ 98583 98647 98989 99484 99905 100088 100126 100265 100593 100924 101062 101010 100844 100540 100115 99811 99892 100284 100656 100909 101339
52638A01339Q66J146J093R66R75R75P91N76N51N73L26j21l32j27J16k6m71p96
$$ 101339 102205 103351 104444 105410 106385 107360 108151 108727 109278 109851 110177 110056 109724 109597 109713 109687 109216 108420
52620A08420q32p88q06p38m20k8R3j29l75l16K2L14L37J48m4j32j19K7L46P91
$$ 108420 107588 106800 105994 105256 104836 104808 104901 104772 104397 104081 104103 104417 104754 104902 104858 104726 104607 104634 104980 105771
52600A05771J176J308J132P52L65J34J15K20L46M35M22K24j32m00l18M9L20K26
$$ 105771 106947 108255 109387 110139 110504 110638 110753 110973 111319 111754 112176 112400 112268 111868 111550 111599 111919 112145
52582A12145o5j36J97O22O11Jp27q90l87J64K16j6j0K24K24m3q3K34L13k17q00
$$ 112145 112080 111944 112141 112763 113374 113375 112648 111758 111371 111535 111751 111735 111725 111949 112173 112130 112047 112281 112594 112377 111577
52561A11577o76K7N74O94P23Q19P25L53k9k85n77q96r24n86k48j34k5K16K71p1
$$ 111577 110901 110928 111502 112196 112919 113738 114463 114816 114787 114502 113925 113029 112105 111519 111271 111137 111112 111328 111599 111528
52541A11528l68o3O84J209J239J121J186J374J512J618J702J571J019J14q11j431
$$ 111528 111160 111097 111781 112990 114229 115350 116536 117910 119422 121040 122742 124313 125332 125446 124635 123204
52525A23204j601j406j088r08r87j233j400j294r68o96o43o13k93K71O78O86M94
$$ 123204 121603 120197 119109 118201 117214 115981 114581 113287 112319 111623 110980 110367 110074 110345 111023 111709 112203
52508A12203L83L45K46J28Q6K4j85l69k42J59M93N65N11M88M57L28J57N2K4M9
$$ 112203 112586 112931 113177 113305 113391 113415 113230 112861 112619 112778 113271 113836 114347 114835 115292 115620 115777 115829 115853 115902
52488A15902J50L14M37M49M08M39N45N74L92O6j89k31j49j58l09m32l85k19r7
$$ 115902 116052 116366 116803 117252 117660 118099 118644 119218 119610 119676 119487 119256 119107 118949 118640 118208 117823 117604 117507
52469A17507j19k48l57k85lK56K15r5l28k91j27QK00M74N09M0o18q55n09K3L82
$$ 117507 117388 117140 116783 116498 116495 116751 116966 116871 116543 116252 116125 116133 116333 116807 117316 117356 116738 115883 115374 115397 115779
52448A15779N64O13L93r5n12n61l73k89l55k84Q6N29O95N05J91lj8R2L20O01O59
$$ 115779 116343 116956 117349 117254 116742 116181 115808 115519 115164 114880 114966 115495 116190 116695 116886 116883 116865 116957 117277 117878 118537
52427A18537K42m44p77m60O4J72j31k80P0O71J113J233J071P08L05R4J51L35M89
$$ 118537 118779 118335 117558 117098 117162 117334 117203 116923 116993 117664 118777 120010 121081 121789 122094 122188 122339 122674 123163
52408A23163N56M94K99J00L5k7l29p74r46p45o20r10j310j282q12l66k05j16J75
$$ 123163 123719 124213 124512 124612 124647 124620 124291 123517 122571 121826 121206 120296 118986 117704 116892 116526 116321 116205 116380
52389A16380O41J080J351J376J125O70K04j10k22j68k6J01J43J33J31J39J24J04
$$ 116380 117021 118101 119452 120828 121953 122623 122827 122717 122495 122327 122301 122402 122545 122678 122809 122948 123072 123176
52371A23176J03Q8L1N0L33Q86J445J672J452J009O98O72P10M54j59p95j093j041
$$ 123176 123279 123367 123398 123448 123781 124667 126112 127784 129236 130245 130943 131615 132325 132779 132620 131825 130732 129691
52353A29691q80p90p61p11n51k63pj03o74j391j732j532j070o29k28J47L19J25
$$ 129691 128811 128021 127260 126549 125998 125735 125728 125625 124951 123560 121828 120296 119226 118597 118369 118516 118835 118960
52335A18960k87n82n84l89j33J24L04K67l0l90n53m66l65m34n62m59n9L26L58
$$ 118960 118673 118091 117507 117118 116985 117109 117413 117680 117650 117260 116707 116241 115876 115442 114880 114421 114362 114688 115046
52316A15046J05j8K60P60J071J033Q81R72J433K097K722L214L577L706L322K270
$$ 115046 115151 115133 115393 116153 117224 118257 119138 120110 121543 123640 126362 129576 133153 136859 140181 142451
52300A42451P77o31j597k186k618k899k844k464k032j739j427q69k05J98K40K10
$$ 142451 143228 142597 141000 138814 136196 133297 130453 127989 125957 124218 122791 121922 121717 121915 122155 122365
52284A22365L05L43J28j05K4M56P50P54Q07J170J554J521J106P50O94P86Q64J002
$$ 122365 122670 123013 123141 123036 123060 123516 124266 125020 125827 126997 128551 130072 131178 131928 132622 133408 134272 135274
52266A35274J261J411J155N29n7k24J9L35M52M20M44N35M94K66J01K06M17M11
$$ 135274 136535 137946 139101 139630 139573 139349 139368 139703 140155 140575 141019 141554 142048 142314 142415 142621 143038 143449
52248A43449J80J6M4R0O8J91O15J094J266J181J247J630K042K129J923J736J757
$$ 143449 143629 143645 143689 143779 143847 144038 144653 145747 147013 148194 149441 151071 153113 155242 157165 158901 160658
52231A60658J894K005K129K421K942L501L786L676L400L338L587L849L793L498
$$ 160658 162552 164557 166686 169107 172049 175550 179336 183012 186412 189750 193337 197186 200979 204477
52217B04477L325L462L768M106M598N291N835N826N467N454O094O882P160O979
$$ 204477 207802 211264 215032 219138 223736 229027 234862 240688 246155 251609 257703 264585 271745 278724
52203B78724O925P295P872Q387Q861R290R415R007Q184P267O493N991N828N856
$$ 278724 285649 292944 300816 309203 318064 327354 336769 345776 353960 361227 367720 373711 379539 385395
52189C85395N730N291M817M639M618M292L525K668K091J764J462J117Q47P44P45
$$ 385395 391125 396416 401233 405872 410490 414782 418307 420975 423066 424830 426292 427409 428256 429000 429745
52174D29745O69L33k49q08j054j025j087j517k195k778l028k901k443j706p85
$$ 429745 430414 430747 430498 429690 428636 427611 426524 425007 422812 420034 417006 414105 411662 409956 409171
52159D09171J91J108J908K661L492M388N076N328N325N514O030O511O549O125
$$ 409171 409362 410470 412378 415039 418531 422919 427995 433323 438648 444162 450192 456703 463252 469377
52145D69377N474M789M290M246M674N135N145M731M260L841L231K373J603J219
$$ 469377 474851 479640 483930 488176 492850 497985 503130 507861 512121 515962 519193 521566 523169 524388
52131E24388J087Q57L44l70j134j807k303k649k938l216l466l682l855l896l723
$$ 524388 525475 526332 526676 526306 525172 523365 521062 518413 515475 512259 508793 505111 501256 497360 493637
52116D93637l461l343l386l348l084k730k503k441k464k469k308j806r51L0Q96
$$ 493637 490176 486833 483447 480099 477015 474285 471782 469341 466877 464408 462100 460294 459343 459373 460269
52101D60269J561K016K257K346K422K502K450K166J683J040L07k33k58R6K52p5
$$ 460269 461830 463846 466103 468449 470871 473373 475823 477989 479672 480712 481019 480786 480528 480624 480876 480801
52085D80801m87n19l35m11p71j017j010j008j177j385j569j841k171k286k121
$$ 480801 480314 479795 479460 479049 478278 477261 476251 475243 474066 472681 471112 469271 467100 464814 462693
52070D62693j947k001k183k350k489k513k167j474q94p67p77l44N62J374J607
$$ 462693 460746 458745 456562 454212 451723 449210 447043 445569 444675 443908 443131 442787 443349 444723 446330
52055D46330J311Q40M82M01O62J144J529J543J154N42q8n70p91p42n55m25m46
$$ 446330 447641 448481 448963 449364 450026 451170 452699 454242 455396 455938 455850 455280 454489 453747 453192 452767 452321
52038D52321n21m52j42L22P64J057J168J156J146J280J559J799J818J705J727
$$ 452321 451800 451348 451206 451528 452292 453349 454517 455673 456819 458099 459658 461457 463275 464980 466707
52023D66707K004K336K454K323K171K300K866L778M744N518O141O803P522Q061
$$ 466707 468711 471047 473501 475824 477995 480295 483161 486939 491683 497201 503342 510145 517667 525728
52009E25728Q235Q152Q073Q109Q188Q220Q164P976P619P133O690O456O464O552
$$ 525728 533963 542115 550188 558297 566485 574705 582869 590845 598464 605597 612287 618743 625207 631759
51995F31759O489O229N992N962O002N805N334M850M498M090L448K668J871R29
$$ 631759 638248 644477 650469 656431 662433 668238 673572 678422 682920 687010 690458 693126 694997 695926
51981F95926k94j586k605l345m093m902n458n536n329n161n065m799m168l237
$$ 695926 695632 694046 691441 688096 684003 679101 673643 668107 662778 657617 652552 647753 643585 640348
51967F40348k323j774j603j355n06Q67K007K286J908J610J775K119K219K105K156
$$ 640348 638025 636251 634648 633293 632787 633654 635661 637947 639855 641465 643240 645359 647578 649683 651839
51952F51839K634L452M322M985N297N248M949M607M399M358M350M198L869L479
$$ 651839 654473 657925 662247 667232 672529 677777 682726 687333 691732 696090 700440 704638 708507 711986
51938G11986L091K570J746P05k92j174k206l637n315o764p613p773p384o731o197
$$ 711986 715077 717647 719393 720098 719806 718632 716426 712789 707474 700710 693097 685324 677940 671209 665012
51923F65012n995n944n707n301n095n234n393n288n205n669o696p757q379q503
$$ 665012 659017 653073 647366 642065 636970 631736 626343 621055 615850 610181 603485 595728 587349 578846
51909E78846q235p645o899o295n931n557m974m385m169m374m671m765m726m871
$$ 578846 570611 562966 556067 549772 543841 538284 533310 528925 524756 520382 515711 510946 506220 501349
51895E01349n459o445p445q022q124q208q782r861j0984j1769j2244j2578j2661
$$ 501349 495890 489445 482000 473978 465854 457646 448864 439003 428019 416250 404006 391428 378767
51882C78767j2184j1040r552q194p181o348n409m264l047j995j291r78r55j053
$$ 378767 366583 355543 345991 337797 330616 324268 318859 314595 311548 309553 308262 307284 306329 305276
51868C05276j186j437j980k857l855m623m903m684m194l693l264k831k299j697
$$ 305276 304090 302653 300673 297816 293961 289338 284435 279751 275557 271864 268600 265769 263470 261773
51854B61773j089n33r1J80M04Q50J610K375K767K812K832K902K742K197J516J026
$$ 261773 260684 260151 260060 260240 260644 261494 263104 265479 268246 271058 273890 276792 279534 281731 283247 284273
51838B84273P48N83O07R28J347J443R86O6j094k249l114l457l358l184l235l478
$$ 284273 285021 285604 286211 287139 288486 289929 290915 290981 289887 287638 284524 281067 277709 274525 271290 267812
51822B67812l637l476k933k097j138k42M41Q94J241J689K315K914L117K764K123
$$ 267812 264175 260699 257766 255669 254531 254289 254730 255624 256865 258554 260869 263783 266900 269664 271787
51807B71787J650J571J756K009K362L052M244N851P573R038R810R364P290L692
$$ 271787 273437 275008 276764 278773 281135 284187 288431 294282 301855 310893 320703 330067 337357 341049
51793C41049o25m587p500r264j0032r903q963p433n602l732k065q29j54l7m30
$$ 341049 340424 335837 328337 319073 309041 299138 290175 282742 277140 273408 271343 270514 270360 270323 269893
51778B69893j233k200l021l587m029m411m603m508m203l759l096k262j522j048
$$ 269893 268660 266460 263439 259852 255823 251412 246809 242301 238098 234339 231243 228981 227459 226411
51764B26411o49j44K72L32J78J17L0n15j519k407k757k785k945l327l701l842
$$ 226411 225762 225618 225890 226222 226400 226517 226547 226032 224513 222106 219349 216564 213619 210292 206591 202749
51748B02749l621k981k109j426j154j017o57j75L9m6k8L06O46O71N48P02J181
$$ 202749 199128 196147 194038 192612 191458 190441 189784 189609 189648 189602 189574 189880 190526 191197 191745 192447 193628
51731A93628J611J701J560J380J137P36L19J91M17P05O57J25p34j565k085k287
$$ 193628 195239 196940 198500 199880 201017 201753 202072 202263 202680 203385 204042 204167 203433 201868 199783 197496
51715A97496k420k662k903k920k694k342j810r89r2M00L61K38M55Q64J063J023
$$ 197496 195076 192414 189511 186591 183897 181555 179745 178756 178664 179064 179425 179663 180118 180982 182045 183068
51699A83068J049J216J278J083P74N44M16L27J94j05o34j204j499j422j142p57
$$ 183068 184117 185333 186611 187694 188468 189012 189428 189755 189949 189844 189210 188006 186507 185085 183943 183186
51683A83186k06N04J180J681K107K574K994L171L032K643K073J327L96p24j958
$$ 183186 182980 183484 184664 186345 188452 191026 194020 197191 200223 202866 204939 206266 206662 205938 203980
51668B03980l076l790l968l686l120k484j991j723j568j362j126r51p38l31J51
$$ 203980 200904 197114 193146 189460 186340 183856 181865 180142 178574 177212 176086 175135 174397 174066 174217
51653A74217M26N58R32J619K118K024J665J666K107K474K400K001J485Q50J81
$$ 174217 174643 175201 176133 177752 179870 181894 183559 185225 187332 189806 192206 194207 195692 196542 196723
51638A96723j58J03O53Q24K81p02j599k119k266k147j875j575j343j140q74n94
$$ 196723 196565 196668 197321 198145 198426 197724 196125 194006 191740 189593 187718 186143 184800 183660 182786 182192
51622A82192m92o85j030j284j276r50l53L02P24Q73J068J580K181K311J737P73
$$ 182192 181700 181015 179985 178701 177425 176475 176122 176424 177148 178021 179089 180669 182850 185161 186898 187671
51606A87671j06o94j032j195j208j058o47J03J021J685J774J367Q15M24L07M34
$$ 187671 187565 186871 185839 184644 183436 182378 181731 181834 182855 184540 186314 187681 188496 188920 189227 189661
51590A89661O51P50O12K74k11r00j834k811l421l409k954k494k260k045j557r59
$$ 189661 190312 191062 191674 191948 191737 190837 189003 186192 182771 179362 176408 173914 171654 169609 168052 167093
51574A67093p47j048j331j019j99N92J103J509J905K124K098K021K022K006J928
$$ 167093 166346 165298 163967 162948 162749 163341 164444 165953 167858 169982 172080 174101 176123 178129 180057
51559A80057J898J922J866J787J971K444K842L035L494M588N809O114M960K645
$$ 180057 181955 183877 185743 187530 189501 191945 194787 197822 201316 205904 211713 217827 222787 225432
51545B25432j93k946m999n886n659m838l897k952j984j071l19K91Q42J396J905
$$ 225432 225239 222293 217294 211408 205749 200911 197014 194062 192078 191007 190688 190979 191821 193217 195122
51530A95122K176J949J189K04o84j488k362l142l420l064k426j957j792j798j734
$$ 195122 197298 199247 200436 200640 199956 198468 196106 192964 189544 186480 184054 182097 180305 178507 176773
51515A76773j397p95k30J2L1J57M07M64K41J34M90J119J625J991K470L139L845
$$ 176773 175376 174581 174351 174363 174394 174551 174958 175422 175663 175797 176287 177406 179031 181022 183492 186631 190476
51498A90476M616N690O987P772P162M950J872r57k856l869m367m548m329l663
$$ 190476 195092 200782 207769 215541 222703 227653 229525 228568 225712 221843 217476 212928 208599 204936
51484B04936k725j761q85p6O55J231J631J947K284K594K694K458K016J643J470
$$ 204936 202211 200450 199565 199489 200144 201375 203006 204953 207237 209831 212525 214983 216999 218642 220112
51469B20112J432J595K311L895O200Q776J1385J4069J6691J8799K0122K0919K1597
$$ 220112 221544 223139 225450 229345 235545 244321 255706 269775 286466 305265 325387 346306 367903
51456C67903K2087K1865K0528J8093J4834J1031O912K651j703o127j0425j4227
$$ 367903 389990 411855 432383 450476 465310 476341 483253 485904 484201 478074 467649 453422
51444D53422j7234j9373k0673k1103k0676j9554j8004j6195j4177j2050j0021
$$ 453422 436188 416815 396142 375039 354363 334809 316805 300610 286433 274383 264362
51433B64362q312p026o151n627n303m963m480l959l625l549l541l362k957k427
$$ 264362 256050 249024 242873 237246 231943 226980 222500 218541 214916 211367 207826 204464 201507 199080
51419A99080j870j348q98n24k20p9k89q37j334j330q74m63m02m31j38M18P78O89
$$ 199080 197210 195862 194964 194440 194220 194141 193852 193015 191681 190351 189477 189014 188612 188181 188043 188461 189239 189928
51401A89928L67J56J34J41O1n2j09j01j17j90j98K9M36O50L18n09j434k140k622
$$ 189928 190295 190451 190585 190726 190787 190735 190626 190525 190408 190218 190020 190049 190485 191135 191453 190944 189510 187370 184748
51382A84748k946l037k788k275j696j195q36o67o71p33p45p36p57p79p79q57j031
$$ 184748 181802 178765 175977 173702 172006 170811 169975 169308 168637 167904 167159 166423 165666 164887 164108 163251 162220
51365A62220j077q30n65p14j196j409r74k04M08P91J178J634K068K525L092L605
$$ 162220 161143 160313 159748 159034 157838 156429 155455 155251 155659 156450 157628 159262 161330 163855 166947 170552
51349A70552L789L681L582L565L348K765K039J544J464J769K297K706K609J888
$$ 170552 174341 178022 181604 185169 188517 191282 193321 194865 196329 198098 200395 203101 205710 207598
51335B07598P89m05j593k683l406l562l325l105l140l308l332l004k303j439p95
$$ 207598 208387 207982 206389 203706 200300 196738 193413 190308 187168 183860 180528 177524 175221 173782 172987
51320A72987o82j046j465j493j020l40J70L74M03L89L48L53N99J160J754J990
$$ 172987 172305 171259 169794 168301 167281 166941 167111 167485 167888 168277 168625 168978 169577 170737 172491 174481
51304A74481J825J579J569J871K397K928L114K761K162J930K330L022L518L708
$$ 174481 176306 177885 179454 181325 183722 186650 189764 192525 194687 196617 198947 201969 205487 209195
51290B09195L815M105M689N488O277O924P675R020J1193J3942J6838J9578K2021
$$ 209195 213010 217115 221804 227292 233569 240493 248168 257188 268381 282323 299161 318739 340760
51277C40760K4168K6135K7837K8695K8006K5695K2331J8313J3544Q040K315l231
$$ 340760 364928 391063 418900 447595 475601 501296 523627 541940 555484 563524 565839 562608
51265E62608q737j4327j9457k3381k5899k7226k7458k6704k5436k4035k2241j9590
$$ 562608 553871 539544 520087 496706 470807 443581 416123 389419 363983 339948 317707 298117
51253B98117j6313j3196j0686q783p608p312p375o896n734m639m051l475k424
$$ 298117 281804 268608 257922 249139 241531 234219 226844 219948 214214 209575 205524 202049 199625
51240A99625j295p63q13r29q61p13n65m98q00j579k353k460j899j310j184j417
$$ 199625 198330 197567 196754 195825 194964 194251 193686 193188 192388 190809 188456 185996 184097 182787 181603 180186
51224A80186j695j922k095k049j575p32R0N30O31P50J098J441J427J091P62N68
$$ 180186 178491 176569 174474 172425 170850 170118 170208 170738 171369 172119 173217 174658 176085 177176 177938 178506
51208A78506L04q5l05r4M11Q98J247J491J622J618J539J401J118O91K72j15o63
$$ 178506 178810 178725 178420 178326 178737 179635 180882 182373 183995 185613 187152 188553 189671 190362 190634 190519 189856
51191A89856j387j904j857j433j130j123j171j039p23k81K23N99O02K73o4j68
$$ 189856 188469 186565 184708 183275 182145 181022 179851 178812 178089 177808 178031 178630 179232 179505 179441 179273
51175A79273j56k89o58j115j446j493j170n22K03O40O36M47M77P73R45P16L11
$$ 179273 179117 178828 178170 177055 175609 174116 172946 172424 172627 173267 173903 174350 174827 175600 176545 177261 177572
51158A77572J04O4m4j10J39N04L84k97q20o51j82o9k90l90l01l11l67j07M40Q10
$$ 177572 177676 177740 177696 177586 177725 178229 178613 178316 177496 176845 176663 176594 176304 175914 175613 175302 174935 174828 175268 176078
51138A76078Q59R96J495J987K004J632J326J230J022L78n99j444j728j468j132
$$ 176078 176937 177933 179428 181415 183419 185051 186377 187607 188629 189007 188408 186964 185236 183768 182636
51123A82636j131j354j367j034p03o60p06m94o6K27K83M05Q55J456J811J774J574
$$ 182636 181505 180151 178784 177750 177047 176387 175681 175187 175121 175348 175631 176036 176891 178347 180158 181932 183506
51106A83506J469J461J430J392J426J445J255Q51N16M34M21J57l93r43j234j225
$$ 183506 184975 186436 187866 189258 190684 192129 193384 194235 194751 195185 195606 195763 195370 194427 193193 191968
51090A91968j035q20p08p39q18p94n73j50L80Q54J115J188J210J180Q91K52m67
$$ 191968 190933 190113 189405 188666 187848 187054 186481 186331 186711 187565 188680 189868 191078 192258 193149 193401 192934
51073A92934q73q77p36p20q94j115j167q95m00L1K25L00L97M37K85K7j99m29p31
$$ 192934 192061 191184 190448 189728 188834 187719 186552 185657 185257 185288 185513 185813 186210 186647 186932 186959 186760 186331 185600
51054A85600r27q12n37m47n79o42n01l01j07J89N30O80P26J160K180L180L332
$$ 185600 184673 183861 183324 182877 182298 181656 181155 180854 180747 180936 181466 182146 182872 184032 186212 189392 192724
51037A92724K467J152K7o54r71j129j323j553j575j194o11k03q3n4rj00l85n96
$$ 192724 195191 196343 196370 195716 194745 193616 192293 190740 189165 187971 187360 187157 187074 187020 187011 186911 186526 185930
51019A85930m44m8K12J65N1J23K87K88J31J08L79P35Q68P34N38M36M66O86J123
$$ 185930 185486 185438 185650 185815 185866 185989 186276 186564 186695 186803 187182 187917 188785 189519 190057 190493 190959 191645 192768
51000A92768J617J862J715J307Q28L22j90n59o28m57k60j84k11k94m50o77q49
$$ 192768 194385 196247 197962 199269 200097 200419 200229 199670 199042 198585 198325 198141 197930 197636 197186 196509 195660
50983A95660q16o03m64o02q87r28n01J84P01Q50P46O14N66O08O74O81O26O38P88
$$ 195660 194844 194241 193777 193175 192288 191360 190859 191043 191744 192594 193340 193954 194520 195128 195802 196483 197109 197747 198535
50964A98535R01O78R5m66n64r1P25J567K233K670K914L010L026L150L670M716
$$ 198535 199436 200114 200209 199743 199179 199088 199813 201380 203613 206283 209197 212207 215233 218383 222053 226769
50948B26769O060P280Q148Q667Q760Q190O910N275L720K361J063k32j452k600
$$ 226769 232829 240109 248257 256924 265684 273874 280784 286059 289779 292140 293203 292971 291519 288919
50934B88919l766m905n785o182o095n684n122m515l925l376k845k254j491n43
$$ 288919 285153 280248 274463 268281 262186 256502 251380 246865 242940 239564 236719 234465 232974 232431
50920B32431M16J123J433J461J446J599K050K813L694M379M746N066N724O718
$$ 232431 232847 233970 235403 236864 238310 239909 241959 244772 248466 252845 257591 262657 268381 275099
50906B75099P588P910P719P392P189P089P002P007P221P521P574P246O915P103
$$ 275099 282687 290597 298316 305708 312897 319986 326988 333995 341216 348737 356311 363557 370472 377575
50892C77575P824Q428Q273P417O445N732N132M454L897L762L920L836L130J931
$$ 377575 385399 393827 402100 409517 415962 421694 426826 431280 435177 438939 442859 446695 449825 451756
50878D51756O89j65l29L59J876M035O615R472J2419J5172J7532J9598K1671K3902
$$ 451756 452445 452280 451951 452310 454186 458221 464836 474308 486727 501899 519431 539029 560700 584602
50864E84602K6109K7974K9348L0283L0796L0652K9502K7272K4331K1185J8054
$$ 584602 610711 638685 668033 698316 729112 759764 789266 816538 840869 862054 880108
50853H80108J4866J1590Q352N222K189n55k545l554l875l933l794l374k947l022
$$ 880108 894974 906564 914916 920138 922327 921772 919227 915673 911798 907865 904071 900697 897750 894728
50839H94728l737m781n860o901p821q514r144j0074j1366j2768j4221j6028j8233
$$ 894728 890991 886210 880350 873449 865628 857114 847970 837896 826530 813762 799541 783513 765280
50826G65280k0374k2043k3338k4395k4912k4578k3690k2808k2003k0891j9353
$$ 765280 744906 722863 699525 675130 650218 625640 601950 579142 557139 536248 516895
50815E16895j7669j6039j4362j2613j1035r840q982q244p403o323n150m356m259
$$ 516895 499226 483187 468825 456212 445177 435337 426355 418111 410708 404385 399235 394879 390620
50802C90620m497m345l563k632k107k007j946j607j000m32k81n99r17o63J73J053
$$ 390620 386123 381778 378215 375583 373476 371469 369523 367916 366916 366484 366203 365604 364687 364024 364197 365250
50786C65250J563J803K062K404K725K962L135L307L577L980M360M531M556M670
$$ 365250 366813 368616 370678 373082 375807 378769 381904 385211 388788 392768 397128 401659 406215 410885
50772D10885M967N373N966O885P949Q741R225R919J1197J2796J4270J5677J7474
$$ 410885 415852 421225 427191 434076 442025 450766 459991 469910 481107 493903 508173 523850 541324
50759E41324J9891K2763K5908K9350L3121L7097M1125M5210M9496N3990N8400
$$ 541324 561215 583978 609886 639236 672357 709454 750579 795789 845285 899275 957675
50748I57675O2235O5244O7597O9552P0977P1398P0468O8040O3900N7757M9656
$$ 957675 1019910 1085154 1152751 1222303 1293280 1364678 1435146 1503186 1567086 1624843 1674499
50737A674499M0173L0033J9779R823N99p560j4435j9802k3499k5629k6397k5644
$$ 1674499 1714672 1744705 1764484 1774307 1774906 1767346 1752911 1733109 1709610 1683981 1657584 1631940
50725A631940k2979j8601j3594r126n628l118j979k844n814j0207j5208k0493
$$ 1631940 1608961 1590360 1576766 1567640 1562012 1558894 1556915 1554071 1548257 1538050 1522842 1502349
50713A502349k6119l2082l8065m3541m8125n1790n4638n6486n6870n5584n3029
$$ 1502349 1476230 1444148 1406083 1362542 1314417 1262627 1207989 1151503 1094633 1039049 986020
50702I86020m9824m6247m2238l7784l3086k8430k4050k0033j6261j2547q959n798
$$ 986020 936196 889949 847711 809927 776841 748411 724361 704328 688067 675520 666561 660763
50690F60763l200r91R13K274K896K967K753K208J211K2r26j552k132k858l653
$$ 660763 657563 656572 657485 659759 662655 665622 668375 670583 671794 671816 670890 669338 667206 664348 660695
50675F60695m385m965n346n652o193p094q091q914r748j0864j2032j2698j2668
$$ 660695 656310 651345 645999 640347 634154 627060 618969 610055 600307 589443 577411 564713 552045
50662E52045j2192j1384j0128q551p163o259n591m745l571k146n56J053K500L760
$$ 552045 539853 528469 518341 509790 502627 496368 490777 486032 482461 480315 479759 480812 483312 487072
50648D87072M947O070P030P914R012J0434J2049J3880J6208J9086K2100K4881
$$ 487072 492019 498089 505119 513033 522045 532479 544528 558408 574616 593702 615802 640683
50636F40683K7620L0755L4293L7684M0291M1761M2117M1748M1209M0755M0032
$$ 640683 668303 699058 733351 771035 811326 853087 895204 936952 978161 1018916 1058948
50625A058948L8388L5528L1658K7026K1559J5040P544m45q226j5138k0630k4339
$$ 1058948 1097336 1132864 1164522 1191548 1213107 1228147 1235691 1235246 1227020 1211882 1191252 1166913
50613A166913k6186k6358k5104k2586j9034j4962j0988p423m254j590J44O63J54
$$ 1166913 1140727 1114369 1089265 1066679 1047645 1032683 1021695 1014272 1010018 1008428 1008572 1009235 1009389
50600A009389j099l206o453j0697j5383k0070k4536k8367l0958l2094l2173l1624
$$ 1009389 1008290 1005084 998631 987934 972551 952481 927945 899578 868620 836526 804353 772729
50588G72729l0371k8150k5089k1705j8389j5201j2060q901n644k244J176M331
$$ 772729 742358 714208 689119 667414 649025 633824 621764 612863 607219 604975 606151 610482
50576F10482P075R584J2210J5085J7969K0402K2023K2656K2223K0754J8506J5931
$$ 610482 617557 627141 639351 654436 672405 692807 714830 737486 759709 780463 798969 814900
50564H14900J3413J1120R124P492O173M981L822K742J669L39j268k722l688m473
$$ 814900 828313 839433 848557 856049 862222 867203 871025 873767 875436 875775 874507 871785 868097 863624
50550H63624n536o689p172o547n052l106r31J332L573N904Q475J1056J3202J4877
$$ 863624 858088 851399 844227 837680 832628 829522 828591 829923 833496 839400 847875 858931 872133 887010
50536H87010J6399J7663J8044J7367J6389J5904J5890J6051J6706J8311K0198
$$ 887010 903409 921072 939116 956483 972872 988776 1004666 1020717 1037423 1055734 1075932
50525A075932K0435J7132R745o21j1676k0840k6406k8306k7655k5553k2533j8928
$$ 1075932 1096367 1113499 1123244 1122623 1110947 1090107 1063701 1035395 1007740 982187 959654 940726
50513I40726j5268j2027r319o992m894k955j191K31J066J206O68o40k919o139
$$ 940726 925458 913431 904112 897120 892226 889271 888080 888311 889377 890583 891251 890611 887692 881553
50499H81553r904j3781j7570k1132k4044k5744k5995k5140k3833k2544k1310j9860
$$ 881553 871649 857868 840298 819166 795122 769378 743383 718243 694410 671866 650556 630696
50487F30696j7963j5685j3301j1030q959p187n913n254n049m980m898m878m919
$$ 630696 612733 597048 583747 572717 563758 556571 550658 545404 540355 535375 530477 525599 520680
50474E20680m790m286l554k908k344j487j44J390K752M022N513P138Q479R394
$$ 520680 515890 511604 508050 505142 502798 501311 501167 502557 505309 509331 514844 521982 530461 539855
50460E39855J0280J1572J3275J5134J6927J8428J9317J9468J9131J8580J7728
$$ 539855 550135 561707 574982 590116 607043 625471 644788 664256 683387 701967 719695
50449G19695J6305J4334J2182J0176Q444P119O416O450P105Q174R495J0920J2273
$$ 719695 736000 750334 762516 772692 781136 788255 794671 801121 808226 816400 825895 836815 849088
50436H49088J3401J4241J4896J5679J7008J9098K1806K4874K8206L1759L5224
$$ 849088 862489 876730 891626 907305 924313 943411 965217 990091 1018297 1050056 1085280
$$ [...]
##END NTUPLES=NMR SPECTRUM
##END=
