##TITLE=AC1526_ROEFFECT0006_8213789_DTOzV0TmO8
##JCAMPDX= 6.0         $$ Bruker NMR JCAMP-DX V2.0
##DATA TYPE= NMR SPECTRUM
##DATA CLASS= NTUPLES
##ORIGIN= BRUKER
##OWNER= Administrator
$$ 1.72 TOPSPIN		Version 2.1
$$ 2014-08-04 15:38:25.520 -0700  Administrator@X
$$ Compression mode = diff/dup
##.OBSERVE FREQUENCY= 400.02188249412
##.OBSERVE NUCLEUS= ^1H
##.ACQUISITION MODE= SIMULTANEOUS (DQD)
##.ACQUISITION SCHEME= undefined
##.AVERAGES= 8
##.DIGITISER RES= 22
##SPECTROMETER/DATA SYSTEM= spect
##.PULSE SEQUENCE= zg30
##.SOLVENT NAME= COFFEE_meoh
##.SHIFT REFERENCE= INTERNAL, COFFEE_meoh, 1, 14.98509
##AUDIT TRAIL= $$ (NUMBER, WHEN, WHO, WHERE, PROCESS, VERSION, WHAT)
$$ ##TITLE= Audit trail, TOPSPIN		Version 2.1
$$ ##JCAMPDX= 5.01
$$ ##ORIGIN= Bruker BioSpin GmbH
$$ ##OWNER= Administrator
$$ $$ E:\/data/COFFEE/nmr/AC1526_ROEFFECT0006_8213789_DTOzV0TmO8/30/pdata/1/auditp.txt
$$ ##AUDIT TRAIL=  $$ (NUMBER, WHEN, WHO, WHERE, PROCESS, VERSION, WHAT)
(   1,<2014-08-04 15:38:19.150 -0700>,<Administrator>,<X>,<go>,<TOPSPIN 2.1>,
      <created by zg
	started at 2014-08-04 15:37:13.084 -0700,
	POWCHK enabled, PULCHK disabled,
       configuration hash MD5:
       16 EA D6 F4 BB 67 03 14 9B FF E7 A0 43 5B 48 2E
       data hash MD5: 64K
       0D 7F 1B DC F3 E1 AD DC 62 6F 14 9E F6 43 93 C0>)
(   2,<2014-08-04 15:38:21.837 -0700>,<Administrator>,<X>,<proc1d>,<TOPSPIN 2.1>,
      <Start of raw data processing
       efp LB = 0 FT_mod = 6 PKNL = 1 PHC0 = 0 PHC1 = 0 SI = 32K 
       data hash MD5: 32K
       62 2B DD 28 EE 45 E3 02 05 C1 26 0C AF 5C BF E2>)
(   3,<2014-08-04 15:38:22.102 -0700>,<Administrator>,<X>,<proc1d>,<TOPSPIN 2.1>,
      <pk PHC0 = 89.82971 PHC1 = 0 
       data hash MD5: 32K
       2A 4E C0 65 52 15 ED 71 D0 82 5E 11 C0 53 38 78>)
(   4,<2014-08-04 15:38:22.213 -0700>,<Administrator>,<X>,<proc1d>,<TOPSPIN 2.1>,
      <abs ABSG = 1 
       data hash MD5: 32K
       50 E4 C0 B5 1A CC C7 B8 21 CB E7 F7 54 39 92 6B>)
(   5,<2014-08-04 15:38:22.269 -0700>,<Administrator>,<X>,<proc1d>,<TOPSPIN 2.1>,
      <abs ABSG = 2 
       data hash MD5: 32K
       35 BD 9D D7 FA F7 F9 5F AE DA 89 24 45 F4 29 8C>)
(   6,<2014-08-04 15:38:22.353 -0700>,<Administrator>,<X>,<proc1d>,<TOPSPIN 2.1>,
      <abs ABSG = 3 
       data hash MD5: 32K
       49 CD B8 0C F2 A5 43 86 21 E3 4E E8 56 5F EF 21>)
(   7,<2014-08-04 15:38:22.464 -0700>,<Administrator>,<X>,<proc1d>,<TOPSPIN 2.1>,
      <abs ABSG = 4 
       data hash MD5: 32K
       4A 13 F2 8C 78 FC F3 D4 40 7E F9 C9 76 FF 9C 7D>)
(   8,<2014-08-04 15:38:22.533 -0700>,<Administrator>,<X>,<proc1d>,<TOPSPIN 2.1>,
      <abs ABSG = 5 
       data hash MD5: 32K
       E6 55 AA 45 6B 68 BB 6B 77 8E 60 0D FC 83 2C 71>)
$$ ##END=
$$ 
$$ $$ hash MD5
$$ $$ 67 F5 5E 3C E7 5B 29 06 BB 94 1F 08 24 F9 CA F2
##$RELAX= 
##$RELAX= 
##$RELAX= 
##$RELAX= 
##$RELAX= 
##$RELAX= 
##$RELAX= 
$$ Bruker specific parameters
$$ --------------------------
##$DU= <E:\>
##$EXPNO= 30
$$ [...]
150 150 150 150 150 150 150 150
##$TP07= 0
##$TPNAME0= <>
##$TPNAME1= <>
##$TPNAME2= <>
##$TPNAME3= <>
##$TPNAME4= <>
##$TPNAME5= <>
##$TPNAME6= <>
##$TPNAME7= <>
##$TPOAL= (0..7)
0.5 0.5 0.5 0.5 0.5 0.5 0.5 0.5
##$TPOFFS= (0..7)
0 0 0 0 0 0 0 0
##$TUNHIN= 0
##$TUNHOUT= 0
##$TUNXOUT= 0
##$USERA1= <user>
##$USERA2= <user>
##$USERA3= <user>
##$USERA4= <user>
##$USERA5= <user>
##$V9= 5
##$VALIST= <valist>
##$VCLIST= <CCCCCCCCCCCCCCC>
##$VD= 0
##$VDLIST= <DDDDDDDDDDDDDDD>
##$VPLIST= <PPPPPPPPPPPPPPP>
##$VTLIST= <TTTTTTTTTTTTTTT>
##$WBST= 1024
##$WBSW= 4
##$XGAIN= (0..3)
0 0 0 0
##$XL= 0
##$YL= 0
##$YMAX_a= 596471
##$YMIN_a= -516308
##$ZGOPTNS= <>
##$ZL1= 120
##$ZL2= 120
##$ZL3= 120
##$ZL4= 120
##$ABSF1= 14.98509
##$ABSF2= -5.573092
##$ABSG= 5
##$ABSL= 3
##$ALPHA= 0
##$AQORDER= 0
##$ASSFAC= 0
##$ASSFACI= 0
##$ASSFACX= 0
##$ASSWID= 0
##$AUNMP= <proc_prof1d_extract_pilot.lims>
##$AXLEFT= 0
##$AXNAME= <>
##$AXNUC= <1H>
##$AXRIGHT= 0
##$AXTYPE= 0
##$AXUNIT= <>
##$AZFE= 0.1
##$AZFW= 0.1
##$BCFW= 0
##$BC_mod= 0
##$BYTORDP= 0
##$COROFFS= 0
##$CY= 15
##$DATMOD= 1
##$DC= 0
##$DFILT= <>
##$DTYPP= 0
##$F1P= 0
##$F2P= 0
##$FCOR= 0.5
##$FTSIZE= 32768
##$FT_mod= 6
##$GAMMA= 0
##$GB= 0
##$INTBC= 1
##$INTSCL= 1
##$ISEN= 128
##$LB= 0
##$LEV0= 0
##$LPBIN= 0
##$MAXI= 10000
##$MC2= 0
##$MEAN= 0
##$ME_mod= 0
##$MI= 0
##$NCOEF= 0
##$NC_proc= -8
##$NLEV= 6
##$NOISF1= 0
##$NOISF2= 0
##$NSP= 0
##$NTH_PI= 0
##$NZP= 0
##$OFFSET= 14.98509
##$PC= 1
##$PHC0= 89.82971
##$PHC1= 0
##$PH_mod= 1
##$PKNL= yes
##$PPARMOD= 0
##$PPDIAG= 0
##$PPIPTYP= 0
##$PPMPNUM= 2147483647
##$PPRESOL= 1
##$PSCAL= 4
##$PSIGN= 0
##$PYNMP= <proc.py>
##$REVERSE= no
##$SF= 400.02
##$SI= 32768
##$SIGF1= 0
##$SIGF2= 0
##$SINO= 400
##$SIOLD= 32768
##$SPECTYP= <>
##$SREGLST= <1H.CDCl3>
##$SSB= 0
##$STSI= 32768
##$STSR= 0
##$SW_p= 8223.68421052631
##$SYMM= 0
##$S_DEV= 0
##$TDeff= 65536
##$TDoff= 0
##$TI= <>
##$TILT= no
##$TM1= 0
##$TM2= 0
##$TOPLEV= 0
##$USERP1= <user>
##$USERP2= <user>
##$USERP3= <user>
##$USERP4= <user>
##$USERP5= <user>
##$WDW= 1
##$XDIM= 32768
##$YMAX_p= 468044757
##$YMIN_p= -700303
##$CURPLOT= <Network HP LaserJet P1505>
##$CURPRIN= <$Network HP LaserJet P1505>
##$DFORMAT= <normdp>
##$LAYOUT= <+/1D_H.xwp>
##$LFORMAT= <normlp>
##$PFORMAT= <normpl>
##$SURQMSG= 1
$$ End of Bruker specific parameters
$$ ---------------------------------
##NTUPLES= NMR SPECTRUM
##VAR_NAME=  FREQUENCY,     SPECTRUM/REAL,   SPECTRUM/IMAG
##SYMBOL=    X,             R,               I
##VAR_TYPE=  INDEPENDENT,   DEPENDENT,       DEPENDENT
##VAR_FORM=  AFFN,          ASDF,            ASDF
##VAR_DIM=   32768,         32768,           32768
##UNITS=     HZ,            ARBITRARY UNITS, ARBITRARY UNITS
##FACTOR=    0.250966925370066, 1,           1
##FIRST=     8223.43324360094, -98023,       -178077
##LAST=      0,             127811,          -273758
##MIN=       0,             -700303,         0
##MAX=       8223.43324360094, 468044757,    0
$$ Real data points
##PAGE= N=1
##DATA TABLE= (X++(R..R)), XYDATA
$$ [...]
23834 -191495 -88309 27292 -26926 -34966 -141195 180100 4884 126941 123450 182873 -52845
23822 377471 172414 93026 -50761 -378704 -3175 279043 226439 457071 12096 61947 -38069
23810 57390 -307944 -27641 -335713 -40163 -84270 188740 -296903 309323 -128403 -138000 12168
23798 88672 84447 -74312 191487 -33616 116209 27134 390648 153674 -157265 18328 -35744
23786 -98941 174829 26914 143691 -96416 62501 -280736 -57491 -199892 -141161 122284 74757
23775 74757 32858 -228038 -3024 177763 -88762 338246 -46682 101552 228057 -134528 -136223
23764 -136223 -20993 14505 217317 -15094 269776 -479486 -63596 -73424 -93243 169106 298488
23753 298488 -144774 -269482 129110 -105228 86507 21866 -44070 -312388 197538 -43410
23742 258854 -331250 -19651 -97362 75590 -98499 -60460 41869 -73960 328509 134992 -218864
23730 -66852 -161254 -36442 -67624 126525 -172329 -5021 -216618 -76649 191302 97607 240219
23719 240219 381110 174297 -67993 1488 -2426 -185506 138178 -39168 -265034 235071 -45269
23707 -93463 -164592 188116 238466 183648 -294648 68062 189346 -59996 -47859 22158 -186031
23695 -113655 44481 56533 -169875 -290183 -99691 -34839 101665 316850 156389 -191197
23684 -282684 303158 102091 18816 28506 -376899 -35103 -39054 111481 28121 179847 -21646
23672 -44408 -98882 56173 332566 259852 -400960 105071 122380 -33939 77474 422654 122879
23660 -120662 84598 53142 -48955 -52574 72512 106602 94402 -210476 -217314 -69749 10352 41298
23648 41298 -25712 -30357 56452 18391 133205 239387 -203884 173791 26864 193738 212532
23637 212532 50894 188366 -86463 61602 -241296 30128 -213310 -37171 -160808 -230984 -97346
23625 -71386 -292430 178895 -18891 21130 -87022 116421 127077 -60031 -115786 162834 -333419
23613 202418 121886 189798 144923 -114363 204039 147365 -77582 171617 116509 -175598 172460
23601 -52141 -10929 110172 -152861 146780 -103684 147585 -74130 -123136 285917 87603
23590 -109130 -9609 23655 24609 -172313 86492 -174559 -196566 -53690 -197215 394399 -342496
23578 -222182 -102486 -96506 29668 175073 -54656 -265978 -87393 -3854 -124857 -363493 -48060
23566 -56659 -105912 161542 125252 269927 3347 -307539 -65669 248680 -397393 -98817 82114
23554 29471 -54585 -251717 -114855 -62389 -435815 322387 -245850 256351 -6032 -77639 -159470
23543 -159470 97204 54623 -141686 -103539 -316384 91453 -35742 96555 -228455 26179 141138
23532 141138 103117 35910 -233739 48344 85875 66913 51469 -103616 -123567 -2984 -65387
23521 -65387 182477 70225 -9957 86207 -146437 -223816 99947 -26245 -48243 240684 161537
23510 161537 -206450 -223136 -243034 327895 153292 -234922 -70168 86064 68498 39111 198469
23499 198469 113184 98918 -38069 -10765 -81338 164454 -359890 -42863 46900 374744 -267180
23487 -25300 -45958 -101325 -379383 60327 16741 -25416 -100080 -150285 154069 -36783 12773
23475 23628 -245582 -131826 139321 226953 -164306 154485 77222 230284 66333 -232639
23464 -419124 19043 164652 -207273 103206 138668 -162762 248962 -254607 -105223 127419
23453 -24451 -130755 47158 135959 248522 -2012 85004 -295258 -207670 168519 31999 34565
23442 34565 127301 138773 -377518 -194711 215420 -194835 144394 91794 -129424 43140
23431 -91987 -254785 54961 -105751 -92650 -83318 45201 4779 -31491 58590 212582 -27866
23419 -205418 37656 105220 -105929 -69341 74315 194880 97550 -254810 -172241 332833 85835
23407 159238 87788 76709 153025 226784 -263192 63597 108503 131497 -352761 53266 71588
23396 71588 -78629 -139014 37395 -80788 -66573 -355383 67562 432587 -142513 226655 90877
23384 -219375 -168602 -396833 54855 -314837 329880 -53559 234208 -549 -20398 182149 -125719
23372 69005 -252342 152008 31695 -20585 -98851 131508 202662 246658 -114768 -333625 22576
23360 138472 -96985 -245620 144130 93297 -283567 -336216 -127386 -113125 -89212 -203562
23350 -203562 -242183 -26341 -1162 -257823 -114687 -11150 -50995 106200 132340 -26864 -178001
23339 -178001 -132355 12292 42638 -120790 74220 121698 -149156 83253 -73125 9366 -113932
23327 427484 128342 -28154 239828 -20214 236394 -32519 -122096 -118206 -317719 -45517 245543
23315 11907 102067 -114757 -134139 10375 -139992 -155226 173193 52145 -182781 -211060 -241450
23304 -241450 320616 238650 -17671 -344915 -9896 -338945 29127 21370 -274871 -106000 -218503
23293 -218503 -127489 138972 -220633 317062 987 -40050 -424539 -392896 75954 85933 18084
23281 16255 -64836 168617 -124300 176233 50174 -20888 102200 248689 -69968 -79469 51259
23269 1318 -158994 285015 47848 -531969 -207680 130873 7589 -563462 -303429 -418280
23259 -418280 194561 54479 -190990 55710 123927 126092 -145062 -19350 -253660 105348 -73322
23247 -45461 104543 -192548 -28236 -5803 -31597 -194845 -257969 212875 307226 -155266 84128
23235 192658 -32475 312534 74723 81068 -370623 -257196 -204242 -140128 409612 -163666 12241
23223 408868 -100104 -353901 365425 -58976 -352349 433648 -147913 -159277 281285 212913
23213 212913 36294 -90335 -244342 -48466 111958 -269682 -112205 -6367 167049 -291193
23202 -71992 -82392 -448837 -127740 -138856 -145579 23479 -161182 -68907 85154 -56053 -288440
23191 -288440 -65938 -167440 3602 -168846 -131081 -162440 81758 -12275 61273 -152131 -46104
23179 83873 42120 -162335 145609 251567 -130835 2504 205619 -22888 162385 -173770
23168 -49007 -41076 275767 240802 -398470 163875 -302142 -57877 -142687 213999 -136168 -75367
23157 -75367 -59979 69708 89608 -130591 70029 -468089 50218 -169248 -123905 -211773 152371
23145 80637 205547 179725 -88876 -73675 318159 -174354 -8480 133219 -302471 89353 155914
23134 155914 155066 110141 48792 117669 -113513 -77787 -91004 -156078 10940 -133023 141342
23122 151200 -56229 -155070 -118523 109201 154833 152561 175367 -296691 159628 17684 -199485
23110 208575 -61228 -31652 -40200 -7221 -133784 -48593 -160999 62736 -54987 33370 24897 -174595
23097 139862 -175214 48244 43853 73072 -93691 -175356 -292222 174303 -201581 -90978 -29417
23085 -84123 -138281 7361 74340 -61576 -209160 24233 55205 176670 29106 12021 -70980
23073 -147429 -218932 104962 -38870 -139532 38443 140666 52701 -34966 294233 173173
23063 173173 66295 136360 -142600 25454 -37610 -263443 -112024 54440 -157263 -258297
23053 -258297 365229 -240355 -382034 -101043 -112895 89908 -78386 431787 -10878 -68332
23043 -68332 17628 -103655 -63907 -63714 146744 -46550 167438 196802 -272500 79021 -23502
23031 -273096 70328 39733 -188189 -97142 -146694 -303508 -65472 -9909 19575 116256 -188909
23019 27015 114247 153960 98237 234033 -36735 -85233 57315 -78887 -246899 -82167 -211412
23008 -211412 111367 -12074 105845 283759 -309337 68814 -238074 33754 -31932 -71752
22998 -71752 -153330 114748 44936 -68107 114890 -56091 -149468 -17813 -310426 -12771 141049
22986 100346 216092 -168906 -123984 134823 -113677 -374267 55071 13849 -229379 -84636
22975 -8065 111675 -186630 -50942 -269460 373443 -267702 25102 -43364 -192764 -272035 -135365
22963 -114779 -47251 -298309 -123964 51905 -145604 -244536 116680 -131419 136615 43954
22952 -13873 -11826 -262002 8654 41843 -242847 -195443 -329413 -34211 14980 117744 -252086
22940 242218 -179308 84878 207692 -50635 -133546 18995 -193739 -144859 -143225 -230320 77633
22928 130143 -34379 -67267 375456 -25750 74934 -126624 120097 -8164 -22150 -938 -117127
22917 -117127 -152485 -310581 83928 -235063 -301727 -180884 -20167 81382 28558 -32397 41495
22905 -118662 -25024 380820 -211550 -75031 -141658 3281 28692 200642 321865 112732 -24376
22893 26973 -186058 459548 58928 -2687 133988 -22843 19749 -124643 -55345 -192390 -205457
22882 -205457 312131 145441 257282 -206606 97347 54179 190583 234571 173767 126410
22872 126410 -106237 -108242 -57339 -196323 -584114 56369 -39939 153230 -218559 -88772 38439
22860 -246213 -59193 -281874 -308588 -159521 -110601 -126396 350538 339395 -382073 -114507
22849 263030 -175064 -248447 -170402 274338 158613 -67267 94261 -119935 -59502 12985 138380
22838 138380 -173388 25211 -103619 -29859 279585 -204949 211454 2830 108807 -17151
22827 -72059 -236396 153503 -139032 72222 -146070 -30003 -29001 -98885 134403 241309 -15467
22815 -320465 -175745 16652 -346282 -71935 -54419 176911 204890 264947 139524 9554 -70013
22803 13698 -266386 -154731 373674 -60411 95713 114186 153877 31946 112805 -409500 267186
22791 -77740 -20564 219933 -32938 17355 -353086 290420 -29249 -116023 -253648 -240164 175881
22779 -48139 -432326 139729 33353 -379062 -127717 279739 365454 81096 -94055 259516
22768 72940 287935 -90658 -74349 271186 -328233 61097 -21412 -153776 87074 -184602 -174550
22757 -174550 -131495 -125521 -286481 -76511 15138 108217 127495 -118944 122823 -4833 129841
22745 -57101 -237399 241344 -233953 -75783 -80834 -45230 39686 -298182 156983 -26295 -130776
22734 -130776 -52961 -86141 16455 6944 200097 -348009 12173 -144161 15031 -246459 -233198
22723 -233198 136053 89205 273809 131006 39289 247201 -192480 67629 206304 97970
22712 272690 40577 -37439 119174 -193232 -46083 231859 -71291 43462 -138341 -171440 135462
22700 240423 70703 -19765 -84019 -168009 158217 3964 -113464 -39121 -115091 317672 27723
22688 162423 185370 -50036 -496897 -9455 30334 122914 217562 127548 77262 337527 -29154
22676 155934 126507 67123 -290227 -18077 43846 -351052 -22773 -185637 9096 -118603 -49460
22664 -100740 -328025 -72764 -128254 15323 -212995 79278 -8129 90353 128703 -73182 225150
22652 -81241 -138261 143392 -109856 -239675 -330601 -164307 -386162 -221457 -119412 156155
22641 -256871 192317 -62776 11115 -148429 75714 113639 124308 -17823 -378487 117721 -37163
22629 -137179 349911 -188196 50160 -24609 -29934 -129847 169145 113586 213070 80942 -125577
22617 -84985 76219 262226 9174 -106841 156157 -55023 -82123 -146857 346438 13677 -53335
22605 -155703 6105 183903 -291909 12951 -179772 75243 -324829 -11709 -37143 -176459 57778
22593 -326513 19873 239672 109830 -302059 -184099 163736 146354 34109 -195590 -122995
22583 -122995 47021 275851 -248475 241096 -126341 -98653 -70463 84449 144701 260803
22573 260803 -44346 96771 4959 -368241 -43120 -206174 440427 -28217 -122191 -6888 -71696
22562 -71696 -171932 134976 -162541 131886 74177 -57207 -58261 -231638 -65732 -139958 -156959
22551 -156959 18072 -48317 193396 -19417 -29484 -152737 -227460 -199604 -26086 100049 -255842
22539 3378 46587 10117 -39253 54086 -374076 130312 -179065 -41575 -495252 -223563 -105963
22527 -457 193301 149680 -43796 31860 -233745 -91290 -61674 -161960 229848 -265942 -149355
22516 -149355 -172075 -19011 -24445 34338 -7823 48675 160070 -131511 -292907 163909 40726
22504 -43282 23488 5054 934 -209236 32812 301694 41310 -57773 -64171 127674 -164454 -227401
22492 -227401 113563 -76111 61999 -63901 -219767 -147333 37678 -222534 -178756 -201807 -235073
22481 -235073 -259241 -211778 -4272 140844 61079 -239839 77974 -165107 83479 109149 317950
22470 317950 8601 -129772 -235720 -231036 26400 163819 66880 -126014 7697 366858 -97264
22458 -48521 -95546 -238233 -219937 50758 163891 197884 -185860 -108994 109222 2423 -263369
22446 -23773 214491 177243 -141028 -80417 -22985 162889 87855 42380 49411 -128482 25072
22434 203515 83154 -133115 -12214 -155110 -72879 53667 -328794 -441769 96735 236058
22424 236058 -159901 -291688 99231 178307 161685 298927 124491 -28477 -29988 -26721 -280214
22413 -280214 134063 283556 184228 -86754 -127013 -112454 36540 77284 -291441 -53841 -128019
22402 -128019 -37393 -111539 -174713 -171138 -32844 -211320 271677 -149326 -105109 -247376 -187541
22391 -187541 -208141 -2524 27462 211914 -382187 -258563 114547 232701 -384113 -219405
22381 -219405 20480 180456 -200288 205683 -239625 -287961 -22818 -19175 154298 209082 85804
22369 68872 73712 -235201 -98478 220080 -205023 -326190 156738 19686 -67406 -99562 35521
22357 -185634 116584 133893 201739 196366 -343779 114239 -56104 131531 -17002 -57403 -92775
22346 -92775 -258831 -141642 -92572 7083 -46334 69790 -162881 -188397 46797 -11494 -80363
22335 -80363 47197 -100365 -18344 28442 -166766 213829 22013 74788 179496 7043 -263654
22323 -218611 95826 104682 -372131 -77106 -138197 -36576 -441769 306474 -8974 111762 353114
22312 353114 -247972 41470 214153 -121649 -227294 -285619 146726 101890 3808 -20493 -282183
22301 -282183 -321927 -38812 92331 -385259 -255638 73497 110872 -290390 27965 -104200 -282687
22290 -282687 58834 156651 -240006 -458484 -56708 -342275 224412 -112543 -97268 -82256
22280 -82256 -38115 -203054 -125230 -15737 4886 -404855 34092 -30180 94187 -319161 -206375
22269 -206375 -212054 271284 132223 93391 101116 25725 156398 82430 -45573 -47536 -89071
22258 -89071 196989 -94871 221956 135612 -227369 -28634 -247709 144453 -18947 -304467
22248 -304467 39937 94818 -49030 88485 -212380 25487 -70848 438765 58223 13351 93624
22237 93624 32236 -339998 129890 114575 89575 15823 42375 -90901 -181548 -274847 181214
22225 43505 70392 128719 94474 356632 23902 -306913 239498 -145369 64024 58767 28010
22213 333215 157565 195089 -122851 -135194 137469 50774 -40437 -142424 136550 -241764
22202 100132 -232236 -69646 284326 -99773 -93157 160661 22005 21899 282996 -60391 -76866
22191 -76866 -4178 -21255 -56230 39966 215106 -6398 111866 -22736 -201343 108235 -41961
22179 -27874 -44984 -174151 288235 187506 -185401 -238452 -44034 -150594 -144315 15940 22745
22168 22745 -70120 -132548 126578 -172341 130317 57860 -60457 30512 -77730 62688 -5223
22156 65749 -367649 23591 73610 -65138 121292 101695 -269784 -96586 159235 91060 -42514
22144 -42656 -221095 -31516 32245 85129 98992 -237309 144743 51527 -267011 -148141 170667
22132 -312508 -353975 -173433 204025 -427283 67446 59664 -417870 31963 -156244 -69010 -112230
22121 -112230 -183471 -33718 -478835 63478 68031 -23572 -38926 -228176 -32898 -341136 78514
22109 118579 106479 -169754 -67789 -205132 -264298 -220663 196192 -98394 -232641 11226 -169499
22097 70192 -231335 126867 267920 -42414 101981 83322 -118567 -83313 -160527 51332 -197970
22085 83865 130702 79395 102958 95285 330016 323855 -79784 -38818 377941 -46392 -267777
22074 -267777 18977 -88229 124269 -222346 -95649 61444 -276011 54437 94719 -271777 -9505
22062 112529 193305 111750 16633 -88252 -113571 -35914 -24908 -93271 14240 -34503 -396815
22051 -396815 -32590 199092 183955 -91581 -229533 -143351 -373028 -115819 -158137 88349 -175597
22039 -298664 -56805 57829 -22980 -386302 -61363 45963 -14669 -170294 269078 -319291 41066
22027 67253 -323213 -148762 -115712 -142115 20259 -195492 114591 -135535 -232370 -32916 -228228
22016 -228228 -392163 -454503 -78713 -948 -289104 -13464 103756 65841 204257 -120470 81733
22004 33907 -111937 98835 -207237 141111 -43912 25861 -194114 211644 11215 -106197
21993 -52111 -124573 -331430 -321837 5537 -100838 117744 -246391 230392 -185754 139098 -116578
21981 78494 -78500 207588 -45181 -385085 -114849 74041 33007 -9024 -215754 123520 -39219
21969 342228 -226925 -302750 -50574 20312 258759 -94010 245366 167493 19916 -369451 -81154
21957 111514 -178574 -221953 156068 163467 144873 -40969 -260829 -45861 178722 -35720 206155
21945 26271 -179496 54914 5818 -102725 -204182 269885 91090 -235000 52289 -9400 89424
21933 -55795 -184740 309409 -290013 40512 -70020 -81532 -239132 115019 274297 -44163
21922 10268 222779 -51478 -53543 309125 526618 142114 23815 -23290 -67447 51709 107929
21911 107929 -70853 -233219 68404 -34534 -310048 -118409 -98943 42649 139138 85142 -186825
21899 109700 186596 205516 -56491 69149 -31912 118075 85776 -114763 16198 -213490 42909
21887 109109 297683 82394 -47280 -278942 -15236 193581 -133491 36063 47276 21583 95477
21876 95477 -398181 -299205 -84231 -336164 171596 105936 -158095 207531 -38529 -228634
21866 -228634 81127 -33563 181747 -301820 -84353 -43906 -40383 4515 -278974 60810 61696 -441648
21853 183180 -10900 -78288 77915 86450 -49972 -389 37719 28255 192516 -48934 268717 -131709
21840 -51913 126386 290832 -144788 -12282 -186654 -71079 -406620 -91699 132642 -66720
21829 -135352 -275546 -300646 -432952 131017 -104368 5944 -293599 33096 226725 -217841
21818 -15424 30031 177965 -206766 98818 123159 -219845 40910 40999 -176686 -245756 186589
21806 -215959 378897 40192 -59813 -85417 -143006 151668 153664 117632 74254 -224005 -160928
21795 -160928 -149270 -84811 245895 -23170 -181171 192666 58424 15063 -90767 -93930 148342
21783 -350731 162103 -19725 -130848 -158971 -162612 -132797 -75286 -10406 11438 18965 245771
21772 245771 -77174 48796 -580049 -190061 213586 -45769 294899 69632 -141185 119288
21761 249862 174090 -5147 274163 -169458 -321547 -104689 137359 -340882 184882 -173136
21750 63790 170624 -90080 -72916 -186122 148656 -18843 -209128 -118263 -117711 -343173 4026
21738 3813 240773 -118019 176858 9397 11945 15358 23889 13011 -133889 176092 -410561
21726 -112002 75459 351452 -29208 -125578 -77064 -158592 -257901 103851 -31335 -89550 -268763
21715 -268763 -248320 24973 -13233 273747 -218459 -105044 62380 -41268 -43708 -514728 119244
21703 74520 -172507 142825 -430002 -105902 46757 22090 13302 -855 -177649 -238960 -149700
21692 -149700 -125333 -38874 -78169 -229323 -36539 199048 128806 -234179 47606 35431 -346954
21680 -159319 -56833 -190442 46350 129365 238839 121508 -262147 28744 -140575 -240386
21670 -240386 93076 30715 256478 -270448 -144522 -135991 217070 666 210226 66968 6013
21658 4115 -342706 8162 -319979 -104395 61964 -72590 61053 42063 -41376 83118 63482
21647 63482 -48625 57518 99231 -211520 -171584 175741 -81889 259085 99295 43526 227821
21636 227821 -163402 242047 8933 -1831 171591 140472 -13768 -39049 6271 -432639 145112
21624 -279015 340566 -92147 -224493 19440 -184039 -2525 -136165 -96084 -17138 126560 -59600
21612 126980 -223575 -39997 -12369 -45230 167330 42673 396267 -295190 -38378 451637
21601 -210247 56113 -146712 31280 -129125 58055 3951 143664 -2382 -171169 246653 62429
21589 -320784 149405 100509 -179480 -141817 -7443 -164090 99393 -121902 -197140 -45458 140098
21577 -83614 -35423 -355051 -61572 -134530 -149105 -365 -132807 -249253 171837 -11819 107780
21565 28465 -25887 3668 126491 -355787 -80030 -184882 240238 -161588 -163033 310029 202839
21554 202839 49246 76628 23620 -177325 -115678 -88271 12058 -37400 -273182 92686 17914
21542 -199274 -491342 89214 -455515 -43675 -120484 -45937 -225144 -137277 153352 44709 -189953
21530 -26423 27713 -83855 -120775 -88007 81161 180655 164359 39382 81828 -336271 -7461 24323
21517 129392 33201 -218028 28471 -28790 -220988 -110352 -35781 114037 236103 -1375 144355
21505 135793 -166394 43871 226762 91184 -52869 312086 -21241 -9672 -383421 -24650 -90772
21494 -90772 35821 -218759 -164460 99748 -125681 -17301 -237902 -182648 -263534 -177453 -110815
21483 -110815 8463 81782 -57321 -40339 177734 -224252 180155 420283 213108 -65274 -128510
21472 -128510 -262984 41424 194127 203787 -309017 112502 -138617 7843 7153 324 -265864
21460 9917 -142678 -87798 76246 -45133 78201 -72084 -76128 -322764 86837 -423726 -95924
21448 47703 -437101 -191486 265335 -179325 176100 -179458 542347 96498 -61717 41472
21437 -67729 -119740 -108836 -81853 -56925 -99884 -441362 -166867 2601 102286 286250 -401736
21425 -110360 -196741 -52925 -113636 -130698 125398 -139514 289006 234300 209385 -79494 124855
21413 320634 324461 7412 235493 334813 230281 178531 26467 328282 9505 -257063 43779
21401 -85323 -213338 -143983 -178758 23164 136809 -51187 274953 216324 39491 53069 95012
21390 95012 65047 26556 -3976 -225510 47314 -194243 -124628 -71524 -42245 -4515 31282 -151404
21377 -327545 18337 -160200 -156234 24342 -8421 18149 235820 210109 -173125 15557 118522
21366 118522 197776 24334 105202 30949 -198928 62024 -214410 -133821 -293538 -96547 -86398
21355 -86398 112457 114036 -160088 -368379 66024 -294854 -145997 144808 367773 -249764
21344 27884 18600 -119950 -23494 -208041 -332625 -81976 -39576 -356070 315036 73093 -26925
21332 -36416 109799 49678 -18235 54340 51229 -118690 385740 285539 134933 -170442 165069
21320 -185506 7278 33338 -217573 -190654 -46721 366259 96811 139001 -121438 1429 20766
21309 20766 -108938 133112 -228135 -51999 349981 69406 -5483 56300 43677 -35795 101212
21297 89968 -176014 -140058 294932 165343 160224 -186792 -155628 -99996 28820 -52675 -19343
21285 115079 91918 -427695 46778 -337539 -1703 -93382 37929 84991 51201 321377 -86981
21273 -113230 -132583 -269424 -246250 258261 -334666 -189633 158474 49385 -3308 108816
21262 360895 42654 159754 -243224 13727 -314943 -211680 -337068 -43412 -30149 -72340
21252 -72340 -50509 4664 -338297 -126147 -93762 197156 15324 -98466 -78196 -165854 82508
21240 -22411 -37876 -54339 -36027 -303804 -326258 23756 143905 -256698 -461427 -9261 -200172
21229 -200172 429471 -121501 201983 -195173 -47206 -38161 -230746 48612 -311909 -245700
21219 -245700 -96253 -215076 246796 -294546 -216071 -277110 -171523 9208 -190941 -304001
21209 -304001 -89486 -191442 -127911 85411 -119100 -299461 51438 -241346 -155348 -304293
21199 -304293 238292 -425741 88951 9264 -139130 57751 188430 -176648 100666 -118173
21188 -5135 -39959 212265 -103250 -28597 107322 53397 -174168 -93610 171681 42787 66515
21177 66515 -459540 -28004 -265930 -110449 -108593 -337786 121981 -15145 -41714 -287704 -130485
21165 -217120 2192 -186972 -10677 98062 16709 40201 139524 -20124 36471 210907 -136629
21153 339133 37693 -292534 256830 -39678 -10533 86192 130841 -206385 -110791 -127861 -46193
21141 107423 -68122 -130346 -112571 -229933 -125930 109615 -144475 181492 260770 -123122
21130 185252 -101944 -296778 -25392 -393217 -233791 177599 100843 -1779 -5012 -184818 -247398
21119 -247398 -262242 228708 174896 -48997 -287725 227440 -29528 -83962 317146 223225 22530
21107 -172665 -162877 31834 -184160 -154457 159866 -127716 186939 -300981 56257 -117050
21096 -261928 2730 -320818 216016 13303 120792 -46393 100572 -517056 27838 -114528
21085 247584 -76090 -141006 -272110 -11620 -163403 92498 -133801 -37066 26521 119341 -14228
21073 173594 144729 -116249 -181140 111466 134479 216082 90221 -151139 116605 -145856
21062 116212 -136766 -171568 39603 -253822 -32337 -140064 124481 -274692 16200 25642 44836
21051 44836 -189516 -157329 134945 -20863 -44912 -91970 -46914 -191036 -356077 -89934 103098
21039 -137470 102183 -215944 5762 -129294 114831 51690 -111680 -46674 49759 159348
21029 159348 -164691 94781 112526 -85274 -415651 153219 107466 23476 -105030 123276
21018 -13210 31452 49665 -44850 188305 -101056 125048 -118404 -38100 -158357 100421
21007 -127873 -172175 143530 -69524 -311191 72450 -176081 71860 -83667 42942 70403 -136600
20995 100792 91581 62483 182293 -148801 1714 -38451 -244200 56876 -30074 -370800 -234363
20984 -234363 -185122 35389 54554 35653 -68358 -216081 -324175 -177369 -117968 -17452 -227722
20973 -227722 143350 -111078 -298522 -254535 -190082 -107174 64439 192634 -275259 -309724
20963 -309724 -22732 245616 43893 269566 79060 -265546 49857 84426 -269562 -239851 267733
20951 -252826 59136 75447 78231 -27590 9036 -112067 -226124 157748 -120956 42883 104764
20940 104764 120587 -34436 24409 -317198 -250000 25761 -354840 -59513 107317 2904 -171945
20928 -291518 122710 188236 -61708 -71414 -195243 -288433 -23006 41110 -444974 -354974 -86735
20916 160628 -83344 -164500 44141 -125381 -260775 75493 176997 -266039 -13849 103270
20905 173425 -323487 750 178866 435 -161813 153836 211422 211058 132991 81745 236919 80389
20892 -69586 -152397 -381856 -102611 -67398 41148 -116639 -217964 -18140 -211502 -296564 118930
20880 112058 -5106 102768 -12268 104320 -15165 324497 -44762 222563 -199214 -177270 -8462
20868 -86413 -455754 -195951 3779 49582 97907 -263603 -42779 -243883 -59639 96826 -85134
20856 279591 41637 -342521 -317901 -185895 -396971 -12073 -238291 -223251 364972 -158124
20845 -105282 10314 78058 -190732 -72076 8811 -293675 -438370 2811 155627 -16393 -15257
20834 -15257 -152089 -259340 137749 -421927 244741 27288 -40084 88008 -82146 -280895
20824 -280895 73841 378750 130342 150046 122931 -168804 612231 -301077 136780 -227581
20813 -70694 -25118 76205 171305 -190583 -59061 -189270 14745 144149 -60510 10439 -125024
20801 -122175 -116180 -439574 281843 -262002 -63392 -36535 68908 -276992 -9814 -264793 38881
20789 -354244 61662 202728 50198 22885 -304180 -115065 -369992 99164 -66653 -113901 189125
20777 -73355 65568 48561 -115805 -52319 -304819 45814 -256390 228797 151655 76025 -380292
20765 200068 51563 -19244 54231 -522915 -58825 -84949 30401 -61989 -50163 -206518 -214414
20754 -214414 169029 -72585 -59410 135099 238569 51850 -346189 -30113 113067 -259695
20743 -138134 83025 -200875 -91868 -177722 -332214 32299 32828 -172490 -253239 -96511 230203
20731 -95972 -151069 -176796 -112210 -34004 -29470 16769 189413 -235801 50274 -323281 183730
20719 -131586 -12456 48704 405242 54790 -89044 -269123 -10260 68355 149517 -140267 -56136
20707 -118382 -79095 -345632 -151218 262164 29612 215074 -159839 106256 -209247 -127814
20697 -127814 144673 88800 20942 -260799 -309992 38540 -280316 -181831 -181101 -19119 -74911
20686 -74911 -181474 112742 -397774 95730 -94665 135793 237905 -33084 163519 -180150
20675 187817 -265139 -109407 -11624 64917 2867 -62763 -268896 -68644 168986 -252945 -97303
20663 191349 -99313 -25227 -48665 103797 -7298 -58620 112274 -44344 -365306 279898 -42709
20651 146406 -258277 -370446 -361447 -35378 -103868 213104 13248 -49700 -440330 -240562 9033
20639 44266 105289 -184708 49369 -132830 -118024 -129177 -169106 282184 98547 -50587 -80935
20628 -80935 -63241 -307595 223975 3438 248762 195266 8398 211581 -137512 -118058 -35492
20616 122443 6605 121235 -106777 122803 -163337 42771 -143338 -121261 -231326 -20271
20605 -40016 -147996 221536 -33561 -102628 128283 519057 60410 156241 -72745 -10092 106889
20593 -260161 -234849 158903 -242585 -43644 254969 88262 -182121 396425 -209018 -339949
20583 -339949 68924 44960 -59352 -53465 -114690 290818 159761 -160526 101336 73088 -38823
20571 -242467 -87394 -222686 -247602 -17119 221517 -286880 -185651 361070 -6951 -110510
20561 -110510 -98987 164199 -197918 95814 -359372 -262846 -118842 283511 30402 296324
20551 296324 -43418 -1432 -88989 37139 -167658 -194733 -129843 -123558 86993 310314 -46067
20539 -141088 -77683 276864 34163 -244792 147120 -37149 -107888 7354 7705 61905 -312029
20527 162681 -141383 77528 -89823 177510 130545 -166694 92152 -102298 31475 -257439
20516 -311362 -5220 -260458 102991 -302693 -91280 -7528 -89201 -476728 63935 -350708 -226437
20505 -226437 -228082 -298840 82613 -87790 -91882 -33166 -102456 106050 -121470 -100442 223057
20493 -136191 -36572 -126182 73172 -26518 -180095 -138110 -293488 -265705 -41856 26032 121164
20482 121164 -129321 96755 162561 151636 -89469 -281835 -223690 44395 -38781 -88522 -2646
20470 -434052 -154852 222509 -73592 27029 -32289 -67349 69603 -62339 -35075 88292 -277916
20458 -58672 26643 -198316 -51382 172307 23263 33048 -201434 117363 -3196 -272326 -18804
20446 195113 9083 -165135 -58652 -160884 132844 -268460 -107406 -120542 140862 -147682
20435 119157 30967 82148 77917 -26892 336673 70499 124499 133646 50569 -20198 -84310 329337
20422 174148 -38062 63034 -119589 -81051 -287435 19775 -124468 -177481 8885 -14958 -334822
20411 -334822 -27746 109311 49775 -39623 145293 -44113 -227217 -91363 -297667 -185021
20401 -185021 -60163 -142361 -45490 -130928 -28576 60640 174086 -65968 55573 -237427 -282548
20390 -282548 -108176 89409 -186514 -59598 249357 -194328 211896 233942 241216 -47573 31694
20378 170499 -25083 -233393 -215233 325645 -98006 -113192 162671 -85698 160432 -139300
20367 53504 -268641 278153 -116225 -237155 141659 222011 25762 -80243 -24145 -49173 -27986
20356 -27986 175001 353744 -257667 -224941 4177 -71278 -25429 73826 60540 -79071 6091
20344 60023 -108294 -336477 -105197 -169246 -355974 -140050 -137842 319039 96731 35560 -237124
20332 10210 149659 -190059 20620 -245011 -654556 -200733 67358 3080 -117736 -160169 -102275
20321 -102275 -65152 -99219 -131658 -188095 114102 -381336 -238503 163028 -38423 -327850
20311 -327850 163637 76791 12975 -188148 128492 -413434 -72184 -10596 -370693 3947 -257765
20299 -208029 80012 -197150 210854 106936 83267 3272 218209 -93428 -135433 57326 -127193
20287 -191068 -173084 -374294 92527 -217121 -12051 -54242 102026 134442 -130141 99403 -41005
20275 70251 141762 -6877 47071 280820 72191 145171 145738 -170780 -362691 -37831 -137564 138328
20262 -16303 -70913 330394 20801 -98000 -74358 -116157 -254222 22845 23795 74802 45780 202887
20250 202887 -81214 -54536 33125 183836 19727 -137535 80945 139884 -169973 -79887 -168299
20239 -168299 -10341 231920 -125968 1809 -62108 165793 -80962 4524 4071 116036 -11606
20227 -241973 -76489 74604 77590 -375361 -434490 14786 -35395 -33893 -100038 -4458 57807 -163039
20214 95425 -76595 -95264 71132 -238580 54732 130345 -254249 -105609 113031 92884 -137267
20202 -192484 6288 168114 60454 -139013 -108220 -63545 -201263 57929 -74536 116196 25922
20190 -13772 243492 185990 122659 93157 90800 -31124 96607 373533 -195039 17236 151038
20179 151038 97784 -74446 -176998 183655 -285758 -346252 25079 106590 -353993 -187482
20169 -187482 -781 20158 -166958 -1147 137202 -152529 10178 -103249 -222341 -111466 145046
20157 241599 -135411 -221926 -130451 379784 110486 280811 -405203 -211231 102479 -60341
20146 -210644 -24774 -167412 -155401 -259888 273422 -189463 -53272 9639 143512 -68697 -24125
20134 107511 -221921 -119115 -11154 92249 168297 74766 -138235 -226755 -134436 37630 45741
20123 45741 -105575 -96541 -137954 -189472 151890 176599 -381299 -123379 -128741 288490 -156112
20111 207783 -37245 18686 -193886 -79402 66457 3705 -5823 -292123 -89623 40512 -299892
20099 -181339 36504 -161677 -498894 -76192 -90601 -141209 171810 121323 -60278 -241418 -175252
20088 -175252 -220730 -164365 -64189 -244313 -40450 400387 243766 276774 -206331 -254618 29778
20076 109274 -311852 117288 104810 120271 29818 27558 20777 -340488 -126340 -21337 226771
20064 55007 124264 68229 77057 34371 144730 -144586 28181 -135622 192129 -6686 -200202
20053 -200202 -144784 244845 93249 -128488 -172474 -46330 -49592 -53708 -220748 -152288 -41857
20041 -166632 26190 71546 -386102 182118 24241 -295183 -194739 68458 212450 -6678 -74935
20030 -74935 53746 -142267 -139635 -9816 -250891 -263696 50654 61997 -161759 -16742 -269678
20019 -269678 -151016 213036 104854 -61779 70622 -25899 -90661 -36708 -262260 125053
20008 35088 -254895 -168937 -15432 62854 -159677 43203 -408712 56563 119112 234260 769
19996 150456 -87121 -189765 -123560 98995 -87682 -79446 223735 24980 -104456 -24238 64596
19984 101730 -95641 147162 -60008 -367323 15308 26227 -416817 202488 -212958 -193868
19974 -193868 -191945 -307356 -276372 -31005 30569 -80619 -214989 -309248 -263873 141979 -43535
19962 -163893 191624 180683 -38866 -51520 -158926 -161123 -119813 181151 -164081 -39053 -97825
19951 -97825 -206710 -190616 -110796 -18811 -140949 -118998 -68490 51220 -129012 -168694 9660
19939 110501 73017 -52961 -212180 -172418 -460560 -205903 -151977 -112531 -209567 -143425 -81164
19928 -81164 -423018 87548 127133 -70988 -119507 171678 -208923 -13758 69983 -111718 150912
19916 -224541 -37390 -281772 -125399 -103920 44295 -56355 -230946 88998 32784 102825 -94408
19904 133203 158666 123058 5195 -111119 8984 -60230 -240602 -197927 162351 -281600 184704
19892 114749 -72322 160127 -216442 -336626 -12868 -191707 -220398 -33832 200790 158645
19882 158645 97398 173500 -156841 -148796 -282878 -161205 314573 118003 -125322 70713
19871 118099 113127 -137987 142458 -71069 -405050 78486 -46161 -14947 69105 -285923 -207755
19860 -207755 -51109 74282 -180004 -7644 64782 -327096 -161457 13029 -71405 -222941 -88992
19848 108431 -357548 -94258 -131514 -136534 324209 244217 -13081 183430 57236 -434112 -79337
19836 -188482 -202804 -447127 -42110 -227399 -163105 155465 40886 166349 -19661 96308 -121960
19824 -21921 67136 203633 -158574 651 22817 -52528 -64043 28995 228770 70824 34932
19812 233999 67172 -45702 -63405 -120009 188289 -199246 171842 72127 141276 -95356 -46995
19800 167276 -44547 -435681 207172 123156 -142262 49530 -191912 -188386 -152422 -123140 -45435
19788 -148321 -124102 103396 -129083 -152728 -295909 -495452 10845 -39993 -109760 12582 -161032
19776 -134590 398633 -299490 -200943 34693 286084 -133700 -111854 11984 -49510 93308 14613
19764 93206 76735 -191367 -159873 107935 -70265 -103423 198271 176523 -49127 12363 121851
19753 121851 65371 -100266 -203480 -71066 -177269 -305707 264293 -114465 -153468 -64384
19742 -437095 64057 -81106 34666 26083 -237784 -169298 62282 -269772 443611 100592 98297
19731 98297 -84293 -11773 105849 -192370 -290910 345412 116452 -117075 182020 -145664
19720 -143075 -156176 114519 -205208 -188432 -299705 -60434 -126032 34728 -323642 -117013
19709 -150449 -247406 85665 -126635 -33910 -15748 154728 -80608 -112720 168762 4144 -227800
19697 -300597 -76958 -69704 15158 -396026 34708 -49145 112712 -158332 -196142 -37360 -23479
19686 -23479 136737 -96069 69425 183840 -342544 -159346 18496 -257730 100674 -4725 -239245
19675 -239245 -313903 60017 -357227 -124232 164596 -48013 -96837 -39802 -394910 -191765
19664 -236689 72548 199351 -388064 72465 52997 -83204 156424 -9305 251317 -120132 -375
19652 15236 28830 190132 -254571 -9321 6779 94814 151447 -52728 41857 -62358 -192614
19641 -192614 -190283 -144621 -88135 -153590 -351776 90915 -137886 -160149 -156004 -141699 21619
19629 -101280 -21958 -4909 -78367 298842 11902 97042 4133 -139937 -164177 -6867 -315134
19618 -315134 -67403 106615 -343220 -65505 -187634 -108278 304750 149448 -147537 -109154
19608 -109154 26757 -229298 -296112 101821 -288759 -2779 84873 -40489 135929 -313642 -104463
19596 13408 190759 149634 23360 -261420 155952 -61951 61172 137592 -125765 -74179 -32614
19584 -143176 98503 -37326 -75383 -16414 260166 -127682 -173583 -56558 -14980 259247 33078
19572 29197 40570 -134883 22707 -88547 -191111 105897 11140 -174659 297977 27265 -58953
19560 -158593 -208159 -81232 305492 -287981 -309712 17835 -234325 195194 -202181 -30318
19549 -264684 114874 -179736 -211200 -111201 -118885 -267454 -23936 4715 196449 61294 105710
19538 105710 -130798 52853 -175745 -123517 -462153 -80300 -53559 -301334 -34321 -76184 -46214
19527 -46214 -235722 -115866 211620 -205679 235957 -117450 154957 284342 -25138 184838
19516 135599 36928 59838 -45470 -7159 -18849 31044 102941 68143 -91927 -33044 -17054 -392783
19504 -392783 -63255 -128554 63612 -204991 -51504 -59562 174360 -60159 14734 -375525 184250
19492 147609 -155577 -46564 -149053 -265774 -68217 128174 -194666 -253643 23759 10732
19481 -221241 -339679 27507 50231 26231 234 13980 -173626 61217 -72775 -357905 163526
19469 19492 184703 52698 45056 -231591 -153895 -104507 -19272 -189620 112868 -259634 98420
19457 -340591 58112 -73679 2470 -68383 -286097 -97918 13010 62495 -226340 -24778 -13534
19446 -13534 55446 74750 212372 -158997 -285591 46698 -241303 -203887 109487 18934 95944
19435 95944 -1886 -96617 18895 206860 -56897 -160644 -30845 -16810 -96678 148527 48924
19423 -86446 -1184 29184 55014 -307930 -67942 -338378 -91007 -336474 -216356 10403 136877
19412 136877 -176260 98640 -229923 -347498 -311153 -277733 268835 -190020 -270721 -78240
19401 -178841 140858 -113968 -135245 -93512 -287665 105970 96525 -358961 -150163 -331835
19391 -331835 103788 -226790 -235494 -204767 31980 -44206 45665 -135584 -159501 -118355 -134354
19380 -134354 -82046 32545 80033 83615 121920 -181054 -190024 103800 -177673 -18239 208223
19368 162139 146107 16785 -75402 -336002 -179052 305328 10553 -157947 42437 -38103 156951
19356 -377633 114629 89972 -209611 -254297 -128198 -41270 -181685 -370839 -55108 82326
19345 -304612 -48590 88235 -63638 47320 106265 -41992 -291007 -142438 -127690 199423 25706
19333 -248540 -100064 -111037 142876 -182228 -46704 -114490 -226707 -134264 104817 -25068
19322 -6917 128640 131726 -189756 90608 41830 -443869 135612 -336495 273695 -158473 -37647
19310 83447 -213432 80019 98351 -291783 -131867 -2708 151992 146153 -22370 -242975 58015
19298 -133758 176538 -2717 30136 -239926 225072 -169115 145592 183295 11641 -9620 7194
19286 257669 -133705 150555 -438643 72169 -183920 125577 -60819 -177155 -61661 -143042
19276 -143042 -79451 227832 -120267 -132998 286342 -206981 221539 76335 17787 -136305
19265 -191426 -118612 -41913 178708 222889 -68699 -36090 334966 21544 -35059 -263459 257260
19253 -32209 -296825 -121253 96467 -31195 39169 238922 -19089 -60013 -96264 33306 -58090
19241 -356510 -113317 138497 19804 31524 121453 -244543 -45622 -187140 194817 -35881
19230 262597 221255 41466 -70228 -178314 166495 135037 -167220 395013 -56499 -113411 -57820
19219 -57820 6706 -98637 142655 -126682 264958 -175464 101858 -256171 429250 18275
19208 -141451 -190577 -127034 -97194 -137000 -507507 44679 139670 -136414 53155 -138290 -37820
19196 -147033 28538 380352 -11467 -168270 -196200 29344 -119501 -251967 -394213 138997
19185 -10983 -93567 -236697 -342665 -80233 -182371 -188196 80922 -46891 -402104 -237325 3001
19173 -303300 -157407 44111 13122 -55501 136315 52312 -359886 -130487 -138274 -124306 261713
19161 37404 70832 54046 -306907 -111965 -217162 -54937 -325588 -48319 247275 85587 -133343
19149 97366 170384 83682 268573 -136224 -180892 -38437 -206056 35537 -391583 33747 201188
19138 201188 72852 11036 -12675 -114254 -39534 -226333 -378506 214920 -171476 15072
19127 -196132 -64485 -123468 70463 -261990 -33438 -251881 -154615 171741 -455654 33282 173494
19116 173494 -106431 -148925 -383540 30460 -300596 -216969 -9643 -68082 22843 33432 170845
19105 170845 -210993 -377108 311555 -378260 82592 -102937 -69020 -256908 162673 -134673
19094 58260 116963 -44098 -409948 11051 50361 90391 -28895 -67230 -346603 -127586 61886
19082 -11651 -209606 -30626 57674 -146795 -16190 -170370 143959 210266 -267710 208988
19071 138158 -161943 -125013 -338845 51588 154468 -252805 190199 -44667 -120235 -255787
19061 -255787 127960 77226 67534 99302 -38786 478397 -47171 -151243 -9836 462546 -269235
19049 157673 44171 -150942 213371 -244462 -16082 -11325 -140206 9195 198969 -139098 -334164
19038 -334164 5895 -101783 13293 -80279 251489 152359 -75014 -549539 140537 15851 271917
19027 271917 17815 39714 -64026 226322 -75926 -33285 -171802 78588 -207318 -208309 -136471
19016 -136471 106324 -39743 -82601 -93400 -57615 124041 -149835 -314022 -233317 94319 114488
19005 114488 -3852 12670 35596 421903 -97870 315034 72369 72099 119579 43394 -42131 159848
18992 -149257 -333329 229803 -69514 -351829 169837 -4582 -93984 89836 -185774 50082 148360
18981 148360 -123457 -192014 -138790 -46075 -219237 40344 191366 -260541 -296365 -91768 -216854
18970 -216854 134177 -53077 73557 177359 -71827 -141524 218051 -1432 160073 -210265 -312079
18959 -312079 -61928 81279 -2211 -113932 -44402 23415 -123844 -122742 -262009 352187 -332174
18947 -178748 -250936 -83123 -112265 127512 -101071 150647 216721 18369 -35675 -24181 -248729
18936 -248729 -110644 -228486 302282 111534 36728 -245543 16896 168658 -292339 -40703
18925 261656 -106423 195070 -399675 -72575 -101713 -47349 174740 -75072 236421 -411291
18914 -371304 -239477 47125 364900 98749 -37623 -434010 -54132 8232 -206903 -282871 -52135
18902 -284199 -68906 -172158 -257725 -69277 -327228 -13002 -59419 -19175 132315 92970 101296
18891 101296 -278514 -34245 70811 231071 136036 65827 -178254 7548 198835 372339 -115047
18879 -55316 150400 -119721 294213 -163690 -121085 -267929 -262642 -260958 -85149 -213016 -41427
18867 -304241 187538 -159487 12994 279333 -262220 29572 288351 -192621 272856 -46719
18856 -56675 -52912 -62293 148256 59773 40817 -121391 108041 10209 -22859 11372 10746 -47886
18843 -138142 -92505 -13085 -151818 226797 66555 124484 172088 48482 -195234 104921 -125067
18831 41477 89987 30404 -239524 173413 297570 -303630 34727 45774 147254 -128954
18820 6404 -103305 365703 -58432 -196598 17910 12814 -213623 -142692 220046 -134015 252110
18808 161805 -148511 -87023 -179671 -237948 -73205 -198421 64053 101500 51474 -211630 200384
18796 13003 20400 -199034 -87988 -196198 -95929 263949 248325 -7227 199684 -140429 39480
18784 272007 -89325 -41316 -363624 54129 -151538 44704 -223268 88409 -43929 -201425 -286270
18773 -286270 -328583 -167714 26397 -15742 -323639 86228 126858 -64176 -5110 -81528 -109544
18762 -109544 157972 -381080 -304563 163163 30816 113491 -126895 189337 -192262 -27974
18751 19365 60154 -248417 12976 -327168 243831 -4376 -335125 169167 -170698 -411507
18741 -411507 -64362 -352114 102508 122955 -255606 -119199 -390654 -200498 30696 362612
18731 362612 -139627 127443 -78726 167625 -103737 146665 52959 22416 -24612 193939
18720 -87923 3320 -94380 -150961 104762 -22456 -160926 83812 -70586 -254357 -10933 -80014
18709 -80014 -119736 -75922 -123148 -173349 -82349 -63851 -8953 -171338 -195119 12712 -67111 -196870
18697 -196870 74444 -437912 -303603 -152179 -118509 153951 130485 77734 27306 -38749 -106213
18686 -106213 37500 -128671 -35976 -199348 80022 48520 102384 -29678 -245017 86927 -111010
18674 -175822 206740 -238804 -33466 118202 31223 -58367 10468 7128 -51822 -27191 -198400
18663 -198400 127792 254663 -222490 -19350 50515 96786 -94871 -11176 236858 -121540
18652 -79850 -3509 -226357 -111944 -63580 81749 -126201 -110054 2577 -145916 -180408 60610
18640 -274377 -37742 137451 3949 -38495 25978 12086 68031 -205651 12496 -136409 159905
18628 -110566 568 -191722 284904 18108 -240819 -123688 120181 -178968 -72719 88628 46114
18617 46114 398421 -45901 330592 110193 109522 97257 84584 238960 -158921 23713 -39179
18605 -96878 -136062 -140751 -340621 101981 45870 -74289 -117647 -55194 -109739 -165612 -288842
18594 -288842 6860 -32468 21533 -32935 -197324 -330529 -291995 88602 -262466 -43967 -29222
18583 -29222 -35277 -84884 -281109 -190716 68331 -101190 261160 -237560 233059 -152738 111807
18571 50885 -403460 -214527 -233529 -109200 -219987 -226982 207774 -45342 83445 -230347 -82553
18559 272812 -250447 -54195 239990 178171 -251512 -150141 216965 42347 -147991 179831
18548 42216 -355977 -36908 7328 -86228 66816 29415 86390 -451357 -64509 -124984 -115311 132287
18535 75404 -90901 -83291 -156846 268898 -247872 -14341 -193263 -231863 153667 -236990 233771
18523 -182297 -338970 -65863 -60262 110549 -375719 -272103 193789 -82516 65608 17980 291162
18512 291162 112407 -182238 62098 42398 95154 -149664 -57207 204777 98828 117681 -263496
18500 -187366 -54651 -30449 110669 -94622 934 255651 -233833 176650 -151366 -213481 20237
18488 -127628 -23234 10987 213024 -170568 -359023 -45937 -324245 3695 24862 -150685 -235488
18477 -235488 -212246 -40492 25208 -230653 189302 -120984 -2935 97223 -118858 -261154 -158440
18466 -158440 -118388 -109606 4368 168188 -134332 69664 -191203 135440 -171491 -349464 360400
18454 -156061 -81230 -181048 57692 -395337 -98841 259908 -147237 91142 107367 -73854 28689
18442 -86816 -484341 95381 181211 -102294 -205901 -302922 -271676 -70679 124490 11144 132445
18431 132445 358223 -11488 -53352 125203 -143070 250257 -336927 36243 -115287 -310872
18421 -310872 -126961 -306559 78788 -254601 -110430 -53131 159649 -19240 -155330 -288132
18411 -288132 38254 107498 -128265 -80670 -30717 143603 36657 184110 -393042 -38697 -108060
18400 -108060 391659 -202785 322680 -122216 -133456 1026 -84720 -58936 -149779 198516 83259
18388 -47134 -180587 -315603 -207865 -118426 -178567 -141161 -38565 115350 203248 -165543 15485
18376 -16135 331278 -16505 -8587 146837 -160407 284413 -401105 218443 -243494 -228175
18366 -228175 -36573 -316942 -129978 206350 138416 147777 -103791 -402103 -96781 -96783 -181108
18355 -181108 25083 159278 -171925 178733 30828 118303 -111114 -152424 108170 -77120
18344 -219076 48630 -259958 4843 52395 153582 22209 -80139 -49479 116066 -95109 -107755
18333 -107755 148434 -217057 -93503 -77571 -222331 -102430 267514 88934 -59477 -23338
18322 92928 67767 81497 -26017 21241 -61271 -88106 -91622 -156568 1779 -24541 -141289 -178725
18310 -178725 122912 -164579 56944 -113905 375544 32762 8404 -271094 74150 99492 166471
18299 166471 -335012 -25810 -49887 -114871 163122 -44839 -217732 102524 -266876 176877
18288 -54392 -119242 15894 -108972 -135579 -83599 -409330 24152 -443078 138008 160067 45640
18276 194693 479552 14791 -117206 -75509 -167391 158760 -499892 -34990 -133339 -16204 -138758
18265 -138758 71981 -39065 134643 -120147 82568 -52916 -79827 140066 -128674 210290
18254 -186811 93348 -75332 9078 -249211 -302722 112951 18101 -83427 136277 234367 -17773
18242 -700303 -26210 145632 450202 -34530 244269 305142 -78300 -19170 146089 105466 -143516
18230 208748 261238 -41460 -238654 -168150 -158922 -325633 -561529 26413 -413735 86754 136581
18219 136581 -309651 -118087 -121742 411243 -124570 -55897 -342572 -345751 313752 294833 -160355
18207 -166466 76662 45332 40687 -187565 148907 -222634 -50331 -192061 -103148 -67842 129667
18195 379748 499665 -311160 -128852 -258321 -371516 -183260 -21208 70317 36331 -117511
18184 3009 -158969 -197072 -122796 -229954 -265446 -53663 -284139 97132 -410029 -50752 49467
18172 121780 -153532 -251518 183096 -103573 72619 293714 144891 -211189 -189055 -116489
18162 -116489 -52594 137312 -136236 41938 -47270 -140921 36949 -138691 204554 -67865 -67007
18151 -67007 -196666 -294802 -95351 -71934 158238 195462 -106769 84571 -55901 290654 -52417
18139 -69473 100097 -49521 -162102 334944 -95169 -115572 37149 -23144 515585 246694 -85469
18127 -88115 -93482 57778 112086 -129773 -218606 256459 176044 -89780 -113012 -57187 147925
18115 14662 -117478 -92334 15945 -98995 -82950 84709 -402341 156175 185886 -13211 44024
18103 -292764 101169 -168386 -343680 13042 399054 94943 77428 -45682 -87647 232228
18092 316968 195165 -37696 76774 16981 -36029 -91806 -222609 -104970 222218 -133805
18081 5008 -290968 234650 -336889 -1083 -147078 -85926 -70716 174964 -80684 -235345 118104
18069 -42046 169130 -245955 -28288 -275981 203296 -165325 268796 -30758 152605 -163460
18058 -401953 -187312 1320 -140250 221013 81243 137487 6127 285973 31499 218808 -76084
18046 26603 -31389 181465 151689 -103216 47517 55918 36761 129226 16501 39793 -116603
18034 -280542 -18400 -246158 -206896 -474748 -278023 -6861 -52608 -121258 -305391 -6181 34172
18022 -343478 -266391 3712 -125981 133141 -518753 14579 -65741 81839 161607 221629 -274053
18010 62083 -11754 152895 -194865 16501 -211536 -439764 298424 1867 -35180 -99234 -219326
17999 -219326 304215 140985 -342530 -71903 58458 134184 -163502 173915 -4684 -48123 289844
17987 -84412 352695 -102835 141251 301298 -185508 -169495 -43736 53143 -142823 -105375
17977 -105375 52836 -170883 330538 -32361 110508 -65847 283624 -1153 -237485 -124373
17967 -124373 -165701 -18902 -285565 -140971 -227819 314524 67793 52419 -374303 -308994 -95385
17955 203803 -135804 -41316 306384 -302745 172117 144434 190560 -157511 211105 -19382
17944 77821 -215294 21714 70424 -112690 287727 -47645 31964 -196676 -5320 -361705 233256
17932 -89246 -144923 161394 55788 72381 215890 307898 112416 -208337 -223130 -58521 -452809
17921 -452809 15491 -149010 -220362 207275 -30132 -281339 88924 -77795 -25813 59887 44170
17910 44170 -312786 44116 241849 -87133 -197858 -300804 -188114 -83755 212642 -19877
17899 -84267 -193753 238245 -284811 -231657 326108 371 -71728 165232 -83482 -55051 -36468
17888 -36468 -72296 150124 116149 -378220 147054 348910 -104254 52980 107931 -9464 214167
17876 453581 -211641 -168894 -96289 73967 13899 -132424 -323463 -15762 -114187 49901 50321
17865 50321 -100049 38778 -74165 74058 55136 -77681 -50455 151307 28125 -240550 -265787
17854 -265787 -277779 -117820 -174981 71842 21144 112880 135041 27227 -50846 49900 -6918
17842 -163980 -90728 19733 -41511 -82023 -122129 41199 -343316 -79683 -57660 -236123 19292
17830 21745 238657 -65783 -108468 51222 -44269 -68316 49271 197169 184779 -71126 17659
17818 139051 96431 -214011 -51511 -87495 -42760 82406 -131577 -190346 181844 131453 -121373
17806 303740 58070 -126352 -137180 -271097 -163876 -278974 -162433 -49796 -123484 -135472
17796 -135472 51491 -280725 -139935 -31093 -169486 -53550 233371 14264 92071 -49674 237838
17784 345233 281670 200180 298348 5085 -64614 47526 -110716 231842 -127483 207182 97626
17772 531567 -99964 -319634 -136659 276468 -199565 -113800 -156013 -131568 147002 223761
17762 223761 -198888 55842 193905 274923 -188938 -26220 29820 -167014 451419 -78171
17751 110457 -60177 -152410 -170885 -161205 -236732 43492 -34993 9657 -28688 980 -135092 -137205
17739 -137205 42285 -403819 -52492 376724 13533 234117 184389 148797 -74293 470014 -9259
17727 -311266 -71883 22219 92904 122538 311206 128369 -30090 155344 386810 -275672
17716 209741 41806 -115687 -11148 -333715 8469 36159 -194052 297464 144893 -56140 -160273
17705 -160273 251728 -26074 172144 91247 -55717 42021 5155 202460 379670 15682 164378
17694 164378 117171 -349378 39391 -207313 -64988 76967 408283 430530 -240364 206285
17683 -91575 -86185 146627 48928 -48498 -405650 -16893 -156341 160255 15836 92245 37038
17671 29305 -72354 232072 59021 -442634 -36716 140288 -35828 -28729 -60224 70713 -84942
17659 331792 -122799 119679 -355867 90357 178654 57780 -130813 -233521 257727 -58795
17648 65490 170766 -35115 -67163 -199392 115533 -163255 -203326 95775 131866 6037 45156
17637 45156 136908 -201573 -259590 265377 -74790 294409 -188999 -7192 167275 -259490 -18279
17625 -12449 110229 -66783 68357 -31218 -47492 -55967 184351 210528 -40864 55682 440047
17614 440047 199768 162968 -87086 -215 -102782 -374914 242108 -188119 163614 242092 17587
17602 -160022 -6827 -73657 -104596 219481 47153 172313 226455 27754 -44828 226667 -1579
17590 -197113 126703 503404 127520 -193843 368179 283876 22291 425386 11645 -122988
17579 -190398 -214123 -132299 184044 230634 74368 131099 264011 -181056 352045 126714
17568 239237 96831 88673 23479 -21667 77591 -80522 35503 135586 -23147 -288329 150263
17556 73570 73108 -160351 234066 -86495 -159970 216508 27290 -53916 275103 242534 -249698
17544 -171332 72220 135541 -39492 311506 -64532 176901 192175 -120056 41438 -10638 -26932
17533 -26932 314322 -114812 177789 208685 48966 52658 253599 44866 54869 223104 17642
17521 207003 46644 -31363 277051 139753 -149235 -31423 -20476 -65705 -34299 -108023 138825
17509 30730 100449 144509 94488 278454 -265677 213505 -167303 191167 218927 203527 -61035
17497 -256673 43022 69404 108876 137773 259973 173430 108076 46270 44889 48448 35719 83768
17485 83768 -71504 156091 144244 -155613 -43324 -100588 531979 219721 -248440 81586 444529
17474 444529 -190087 391306 241927 248423 172468 156272 -64928 167237 200191 363734 185428
17463 185428 213171 400662 217525 90409 38905 -48802 89189 229900 -123615 261529
17452 156017 251423 191139 202342 27420 107191 81172 117916 281053 -12182 -266790 92121
17440 77204 -22474 -37161 -42910 43294 64732 163525 -345212 255570 -182917 228216 190020
17429 190020 358999 377430 251185 114676 30744 -30658 111502 -120514 140760 68784
17418 252912 292689 -57820 269156 99940 43152 220694 621011 -142846 66746 -32128 517971
17406 598991 280931 360516 156729 188077 78626 98129 -5971 143202 344841 394618 205183
17395 205183 -43745 -68242 -190326 297366 186620 170405 265250 -33244 147017 237265 73527
17383 101496 76393 389674 51828 263657 57409 225402 50276 158623 30474 138233
17373 138233 251144 238696 325740 464884 -85770 70174 -198912 84593 366707 438929 27159
17361 191036 296319 404244 31028 98067 374732 240772 201095 133978 107003 112909 34760
17349 84261 137608 69141 312481 370177 179514 163423 117164 123999 71701 543231 145308
17337 234979 19373 403100 50807 1850 -61848 241038 61741 56955 64474 355709 162638
17325 -99798 79533 163961 75841 250804 333225 363031 172803 192136 230496 231275 -74094 166276
17312 54806 170631 5276 401016 125915 -13705 405583 206575 -186999 44460 417584
17302 417584 -117429 516597 287673 91148 84207 341776 554508 159244 100887 137844
17292 137844 71052 107503 436896 193530 -171658 -33392 453326 -53 196921 -68765 -10741
17280 228226 168803 514051 280057 110815 189287 230145 288138 320028 79719 35251 240731
17269 240731 214538 137119 517767 361101 373533 203640 85450 235782 196716 -120530
17258 235708 153213 -50408 117248 266186 25228 237875 217410 228065 148163 149648 13021
17246 449064 430408 129154 -296545 417520 -27619 258480 152264 -1521 712559 139217
17235 221589 181050 196007 92447 401567 255130 27081 151153 221902 583430 133442
17224 -71436 214901 111009 47144 55357 79571 219778 224660 24619 70932 187397 62424
17212 383124 121191 232508 269088 149066 269611 230036 -40921 -196733 436905 -147270
17201 426324 389163 60056 -64459 208976 151624 236788 308050 312459 -74575 413848 6046
17189 196088 96713 383736 317529 334603 438534 57063 378532 258271 486450 295454
17179 295454 227825 367191 420818 242834 99311 76848 -67884 38940 220199 380302 232674
17168 232674 108522 554859 445314 201812 558593 420313 323931 451855 401368 449862
17158 449862 164907 284756 181683 721228 119760 394654 581576 201132 283663 342246
17148 342246 -18874 62259 337744 269669 388661 590114 408505 419287 70141 488450
17138 488450 676143 378354 84327 215137 446090 458884 -100934 224509 565978 543971
17128 543971 569452 214081 406474 92723 -41715 289787 310149 597493 360537 -9911 376127
17116 256425 309815 235737 302581 418266 441809 214488 237276 130123 549194 263969
17105 408248 495189 616200 355184 518491 105951 361285 104169 633250 439911 503327
17095 503327 327653 633678 230706 595147 147369 553738 326100 702826 412140 576261
17085 576261 511412 403671 366886 504924 604395 311107 408524 161001 83318 709326
17075 709326 865065 391937 429338 434938 163462 392562 456012 421740 491308 669152 466631
17064 466631 492527 485985 457877 676479 717334 580928 639902 532899 369313 821998 498201
17053 498201 276557 571789 583451 538207 499511 802020 738241 131800 344853 594429
17043 594429 518788 556732 603794 693121 791751 365809 760104 658602 630903 588633 470090
17032 470090 899769 474693 180852 176741 542486 402428 266307 557253 827097 548917
17022 548917 819598 471284 743456 742623 673373 682389 849445 480202 667690 583825 475166
17011 475166 569969 798499 550151 489164 758680 843700 809672 840408 561405 652188 875628
17000 875628 697640 610088 743238 599976 789376 743204 607756 780395 713925 534941
16990 534941 682977 831269 659360 789893 557801 826680 1004530 812587 552333 599142
16980 599142 872797 1205466 1261322 955467 961477 868973 1236179 792116 1169863 1044982
16970 1044982 976299 1034446 616255 1191863 717828 1057646 864229 900419 703591 975311
16960 975311 834564 1013917 994987 817085 1073738 949138 1105417 759875 940414 939606
16950 939606 962026 1161398 1048284 969686 951812 983830 946471 1206007 1119408 1027745 1417542
16939 1417542 837856 1244517 1435109 923575 1327340 1105007 1456604 1000102 1433199
16930 1433199 1093997 1236191 1211935 1285703 1505452 954540 930973 1193065 1533349 1413668
16920 1413668 1565795 1329507 1288496 1395980 1086760 1456611 1461375 1619831 1546513 1726240
16910 1726240 1837513 1531641 1102635 1301623 1650006 1821340 1627361 1485708 1609307
16901 1609307 1800067 1551330 1717991 1515026 1918922 1662784 1899964 1557814 1650000 1843535
16891 1843535 1746432 1797410 1999689 1700020 1859133 1870884 1758077 1767992 1878209 1873099 2025721
16880 2025721 1960198 1949095 1974412 2101332 2022864 2345467 1932897 2256329 2255672 2011342 2240198
16869 2240198 2564487 2138412 2138344 2418215 2407188 2498726 2781809 2710780 2697311 2604400 2809329
16858 2809329 2456269 2845701 2760916 2927145 2708538 2581684 2752599 2894447 3047980 2846986
16848 2846986 3128428 2862352 3060427 3072688 3357326 3189849 3259281 2852896 3269056 3030742
16838 3030742 3329363 3542709 3123524 3438967 3704303 3636558 3846874 3806470 3608520 4138185
16828 4138185 3814252 3990839 4192147 3751888 4147166 3990296 4257979 4314559 4608585 4415646
16818 4415646 4304388 4774690 4949262 4654442 4823267 4789259 4828535 5139597 5022731 5195775
16808 5195775 5600559 5456528 5304668 5301930 5871998 5921513 6041484 5966384 6217883 6256199
16798 6256199 6553719 6432786 6641616 6846212 6874856 7027682 7167186 6983931 7490002 7354007
16788 7354007 7842240 7947024 8192915 8092181 8307902 8504906 8808876 8654030 8991413
16779 8991413 9353453 9678067 9648933 9462175 10146651 10331752 10823982 10771390 11087203 11369074
16769 11369074 11410930 12021936 12389710 12315878 13009879 12923072 13564225 13769837 14342474 14838482
16759 14838482 14894087 15603203 16081436 16502228 16839488 18024969 18093571 18172357 19126738 19518061
16749 19518061 20049456 20848740 21390960 22331162 22852217 23875607 24221055 25193217 26156731
16740 26156731 27158161 28212913 29030699 30386812 31270969 32497791 33469552 34982281
16732 34982281 36273869 37809235 39244402 40821972 42386707 43899405 45728908 47864942
16724 47864942 50234764 52533701 54315391 56616767 58961308 61714929 64526508 67085513
16716 67085513 70356439 73285458 76457784 80176347 83469838 86850421 90852746 93997291
16708 93997291 98128597 101854260 105536974 109501083 113358686 116856390 120426340 123785932
16700 123785932 126614443 129261354 131691048 133884306 135236617 136871955 137271819 137289901
16692 137289901 137020729 136052651 134678085 132814212 130892478 128349784 125406201 122278055
16684 122278055 118812239 115100669 111638632 107391350 103805830 100047573 95866253 92587726
16676 92587726 88685715 85124368 81207802 78059706 74738137 71653080 68403859 65700839
16668 65700839 62795888 60203479 57780064 55132011 52864174 50965063 48880667 46664400
16660 46664400 44748292 42824011 41369177 39642876 38300235 36903774 35445276 34396449
16652 34396449 32709807 31708575 30619576 29673706 28444676 27596778 26671392 25558157
16644 25558157 24907193 23854404 23177353 22375945 21956205 20868445 20310819 19808930 19072685
16635 19072685 18589251 18093344 17748851 17004299 16810020 16320880 15619299 15222595 14843964
16626 14843964 14305289 14126997 13569030 13150924 13034692 12883443 12363850 12211973 11756865
16617 11756865 11468246 11083853 10833337 10322153 10174095 10250308 9988390 9674909 9332811
16608 9332811 9296306 9077027 8922534 8771989 8400000 8275528 8406788 8148067 7786598 7668865
16598 7668865 7491910 7116011 7468071 6898011 7222870 6973858 6572942 6338770 6613150
16589 6613150 6474298 6117470 6250990 6010591 6149455 5615248 5833203 5488744 5344488
16580 5344488 5419634 5484418 4789586 4942405 5097546 4534269 5022029 4797495 4580709 4710332
16570 4710332 4714744 4736974 4446543 4433278 4418995 4269439 4152017 3971505 4148371 3850449
16560 3850449 3887962 3982351 4072299 3844086 3762869 3537779 3573333 3870750 3509084 3568206
16550 3568206 3342577 3440412 3101569 3280711 3341320 3155010 3039805 3099545 3381273 3147267
16540 3147267 3009869 3148997 2872360 2992712 2853432 2720370 2787816 2570605 2860215 2628691
16530 2628691 2498946 2478247 2607778 2397839 2264827 2598083 2492063 2616159 2341102 2457946
16520 2457946 2021717 2119496 2308828 2467058 2454296 2536949 2196393 1879415 2324804 2122343
16510 2122343 1952913 2188001 1958267 1894234 2072137 1860048 2101307 1906229 1783729 1780995
16500 1780995 2032821 2031585 1904251 1835189 1782103 1414283 1796210 1787069 1650603 1454700
16490 1454700 1733942 1847280 1521959 1785800 1685249 1425553 1681057 1830369 1552363
16481 1552363 1620623 1609891 1474944 1323930 1469258 1465901 1717166 1516795 1627829 1280836
16471 1280836 1397420 1306436 1510509 994329 1423070 1163069 1248331 1134790 1690309 1387967
16461 1387967 1526991 1237894 1180244 1322815 1189459 1293447 1275182 1382359 1264938 1574259
16451 1574259 1265825 1023491 1246740 977718 1296363 1224776 1052513 1183068 816461 1431570
16441 1431570 1073115 1251434 1212349 741087 795571 1020740 723400 1464760 1094808 827792
16431 827792 1029789 898160 1208590 824330 1319923 842050 1233640 971789 825665 670029
16421 670029 641972 474945 1110073 842942 648290 760628 910189 781705 828333 957796
16411 957796 693414 912159 906425 959235 678805 780266 1048308 881232 596202 733224
16401 733224 850495 793363 936508 437956 1069404 819667 856321 930876 904726 733219
16391 733219 555163 718878 498567 1025219 720712 372830 605765 557425 557817 328890
16381 328890 513813 566978 812982 988648 396840 424401 746808 961944 516636 687956
16371 687956 590560 476531 641390 568721 469465 669042 692829 693681 853686 759063 675198
16360 675198 713736 855437 448206 319374 621742 543952 515457 818760 655194 746242
16350 746242 359509 813699 660832 741603 524458 714969 601213 549140 544287 506865
16340 506865 402322 358999 689434 75301 512713 713033 382209 387902 366388 390547 505983
16329 505983 510323 515239 432088 444577 486623 352899 597364 435243 606379 364336 326851
16318 326851 543250 415804 325771 457334 544848 636411 713562 406393 196442 405856
16308 405856 308215 393954 513655 251133 482493 491835 291182 335181 186780 730161
16298 730161 778369 579532 296903 459912 620931 481653 409603 537239 437203 254026
16288 254026 359289 345954 181426 160987 352853 409693 173590 564628 369766 539981
16278 539981 904746 410552 290854 394662 454525 243014 556351 242617 157983 638124
16268 638124 402507 259131 185551 502259 308726 -47861 201435 533849 306879 480179
16258 480179 305894 500067 539755 302857 314473 518903 243198 262555 51863 230953
16248 230953 357688 419244 93969 105982 107850 256331 332667 273144 154275 381264 106350
16236 373348 237272 275175 376125 429920 393584 86099 15281 34265 204511 116236 171894
16225 171894 175484 101838 198058 390894 413721 152023 239690 7432 472236 231267 295669
16214 295669 472569 94334 83013 272849 214351 272855 193505 12706 421761 436634 305296
16203 305296 22793 25424 323973 182898 192893 31858 552078 268475 135934 405267 247796
16192 247796 157252 270386 -66420 587150 183456 236570 -80813 315039 316169 36242 55222
16181 55222 230643 266238 300604 215245 313083 275331 -3963 372133 602680 73960 161895
16170 161895 257344 -107829 314811 103895 375558 116130 407053 232967 -105070 -186529
16160 -186529 523878 -34486 307107 136527 219756 269834 241109 291852 8331 313520 118790
16148 257409 36110 -22563 200170 69350 135679 15250 11485 210406 99206 -75674 327974
16136 209219 82215 168779 310337 118906 -48591 85225 80918 1827 54688 -27799 -21741 -85102
16124 -85102 -85781 313391 313738 204349 -11008 -35770 -164617 -195390 -10668 109954 -10428 -39145
16112 -39145 -87845 156567 316582 -24101 -253901 162225 368026 403362 72915 147429 103062
16101 103062 514974 39160 158579 -31936 261452 194329 370333 -90560 -2971 242456 339734
16090 339734 79050 230681 -93553 83486 162392 275418 8698 119209 -175122 -394421 113889
16078 199388 156222 282085 -84016 -253193 74377 235601 185751 227863 -39550 200274 5077
16066 268433 -43416 163674 68404 265355 128510 -4532 121556 137213 -201803 154366
16055 -156358 434670 -67835 145242 73150 105276 89823 342326 642 -103258 -488917 300524
16043 8971 -278920 183401 20350 139684 -204066 358915 -49154 107935 284641 -15398
16032 71308 55270 148641 -54370 -137118 146039 107633 46043 101448 -309575 87175 180015
16021 180015 202214 -26312 26889 288099 -33307 121350 -255961 370413 69548 -2572 -94993
16010 -94993 68486 -337802 -6246 231796 15150 -356049 154062 233073 192383 -20682 -139139
15999 -139139 -42828 162431 108312 -183299 26681 -30365 -379635 47087 108772 -81885 -57086
15988 -57086 154511 -148 5723 -175493 100268 -51218 339735 3578 -108247 256037 157582
15977 157582 -36294 -42729 -45936 281889 118863 -258402 -176095 187451 -256567 113590 9050
15965 72524 212428 246042 176060 -177732 -170415 221218 202544 414652 287252 -58559 512368
15953 -11555 4014 131502 -30143 -247207 280972 174107 -69558 -123191 50987 149872 197467
15942 197467 158255 346452 -134749 108428 -194638 71092 137082 106029 289735 300896
15932 300896 -80482 -26478 476290 87548 66467 -158265 80388 32847 142912 49263 220866
15921 220866 115755 28200 -186994 46945 223482 -74496 -64767 -69416 179001 171406 -53356
15909 -232117 149648 190387 219622 61865 -367778 -185810 54727 -43153 28885 7579 -59010
15897 -137645 -251971 6393 299190 84632 20830 -5062 2356 -63013 70383 -68408 -168917
15886 -168917 -237840 -42784 -34293 139701 -141291 236000 -260736 -125300 130349 -228714
15875 40646 233718 47631 75831 5204 196010 115731 329307 -130613 -74918 -219381 85887
15863 182071 137520 86913 -62163 126467 294880 -200865 -100211 -293384 -194673 345774
15852 -394978 186553 -26846 -216451 -177653 36061 -36638 26533 16578 224278 -77167 -32360
15840 -10765 78260 -213284 313860 343893 -232168 89647 -228484 229813 77324 -36722 252935
15828 -25577 11679 152899 -259754 -179611 164770 38845 -56210 160581 -287094 -332860 -245860
15817 -245860 237233 41502 258771 -36598 32429 -344387 -60805 -207928 -83372 251936
15806 -220121 -118605 -240324 112820 -202229 -250261 -26265 -371007 -156504 -171859 83670
15795 132551 -162540 20567 28700 186601 32875 354266 -1650 111567 -113345 -320486 -155835
15783 -101356 137873 179525 -71178 101954 128319 -109290 9149 54131 84053 60723 173850
15772 173850 -205327 -236532 150580 -30237 -13018 -305628 -93977 35350 -289177 20099 87846
15761 87846 -53207 129516 -159853 -316919 -68921 -461404 17259 -186956 -410342 158873
15750 7903 90258 -243787 131555 69120 -177123 -388945 -151732 278323 -24580 221149
15739 117216 -50100 -269772 -227925 56139 -241321 56084 45911 47986 -268465 32410 -80118
15727 -48461 -96735 59955 -75596 -147498 112838 80951 -124607 -118406 -174616 -42691 -141439
15716 -141439 274958 -53827 265833 150995 -269429 314622 -31338 36226 115864 112204 -218780
15704 185486 258275 119429 100717 -60546 -202614 -88340 238781 142764 114393 12761 -108121
15692 -234415 -344032 215069 48501 89046 48666 -15539 -47463 136111 35838 -167443 38354
15680 -64978 81753 30821 132773 25602 237754 -15541 -93261 -166195 226844 -66510 -15504
15668 -82022 -286864 55211 -258402 -78853 149267 320308 9661 -142311 88588 102552 -59580
15656 -143319 -214115 86499 -212851 -20009 -17010 147045 75290 -79634 120450 213540 -78441
15644 71523 -173606 304843 -24931 -121763 103575 -98634 37781 84441 -244255 -60149 63338
15632 -65902 -30262 -83626 225504 -66725 -5367 -371297 -85646 97867 -214950 172228 -44349
15620 21636 158494 -208566 30915 -8903 28359 114610 335122 33321 -332234 -223755 99378
15608 -228248 257106 -141931 155408 -40725 55751 -16414 -29631 69643 170338 -101604
15597 32609 -177180 157550 -52705 99612 43838 120517 20584 66069 -242850 -57304 -182661
15586 -182661 -2422 -42645 -108982 67367 -167584 162614 -304410 12217 -104545 -101302 166359
15574 203249 -45954 -37738 81354 127991 124217 32896 180711 -209716 232975 30642 -115053
15562 242508 226094 -279606 228440 13431 -20321 31154 287858 -3937 1090 325225 -60458
15550 169852 -453495 -43489 264810 -172910 -49166 -303234 -6349 174868 -10593 87474 79156
15539 79156 18824 68191 230132 755 233804 -31161 -20428 -129034 -133007 -145122 10608 -52783
15526 -198709 -100939 -144926 139257 -160313 55592 159979 90654 144170 -91642 -448581 387167
15514 313261 -54133 -77902 -49694 -422459 -378278 351922 76639 -230813 -225703 -50177 346419
15502 -63113 79261 154990 36989 207927 15568 -239300 -70513 43212 -162574 -53295 200498
15490 262309 -23527 -99841 106195 126415 41237 -136996 -260162 -342890 40020 -222279 -101307
15478 80431 169530 -141412 121233 151628 -94032 -402217 -188351 -158889 -34104 68595 -287464
15466 -305773 -234347 4008 351516 -208510 314428 -130799 273498 156734 223447 -6014 -273675
15455 -273675 318393 244689 32561 -173246 -365348 -123184 45017 -379202 -90723 12856
15444 -236276 151039 -73791 -184707 -114725 177410 183148 -153907 -139610 148402 -29314 259275
15432 -191497 155050 -237545 -78472 132028 242468 95568 186297 41533 -195389 271039
15421 -207160 289065 168858 197868 -17741 -328965 37624 -173269 -2681 197680 -20230 187427
15409 -239510 -8941 99286 -245895 -22237 127405 163943 -179689 -288038 -46434 48919 -46926
15397 -37647 -77707 254399 134232 164106 -184018 68650 78491 -292616 138901 132040 -210274
15385 -122376 135084 161601 62061 -216304 -137296 -114592 -215557 179228 -77842 43501 -22914
15373 -148358 -81082 -210801 -46243 7063 38302 -16747 34311 16463 163105 -33958 -107012
15362 -107012 -90338 137145 132069 -172992 120137 44483 30055 204759 94154 293173 -43223
15350 22202 -224608 185672 44844 -300027 299675 -68786 -143210 169106 -25419 57132 -81144
15338 -225279 -147122 -92826 87694 103681 76164 -106140 20939 54507 -7444 -173874 325635
15326 -76147 -222752 320212 -426696 38855 -41046 68553 206502 3325 -91446 357335 -13294
15314 124746 -59919 8931 -30070 5264 -324940 -173834 54472 20031 -202618 73077 30946
15302 13436 129799 260251 352556 -124660 -145231 117481 -163632 -393496 141284 568192
15292 568192 -286983 84076 272309 -69916 337585 212257 224167 168593 -241206 58777
15281 -56285 -254901 56235 -79147 -33807 -342599 -118101 -11154 9956 -952 -152451 337730
15269 219670 62574 144667 -54459 203790 81283 53836 20193 22802 109684 17097 -118734
15257 109448 -84323 205884 -109512 48339 132842 -46174 -118909 42977 406055 -51093 148115
15245 -3341 202413 -156618 -39908 254541 -75906 -73997 -232325 256776 883 156347 -73090
15233 -11737 156532 -283221 -1569 21544 -169027 230105 59171 394509 58031 573271 1344966
15222 1344966 1178099 1176684 1718032 761043 475958 489511 -17696 13299 237278 110163
15211 -15216 164902 -93311 106262 80407 280345 202990 -41818 -265042 41628 -66870 230391
15199 -18959 -27261 50695 -216957 -297447 181335 74032 149241 251841 327316 94125 156499
15188 156499 79360 -65353 235041 -135025 40342 -11963 162398 -5366 280397 310162 407775
15177 407775 -242217 -50797 159649 -309635 173937 206285 281063 233522 115322 154639
15167 154639 -54935 140219 48597 164621 -81380 225853 -16832 99970 62669 160170 62357
15155 129424 86981 139424 357053 146816 254558 57004 47811 54475 140369 51224 270273
15144 270273 192026 87548 -100063 -130900 333974 295448 -46993 199297 266300 -85093 17136
15132 -303568 92903 -6641 219402 50525 79216 365396 368183 247530 193153 117941 296730
15121 296730 75073 -302859 -107773 30536 -123309 -86233 -30442 257684 95011 7798 -85899
15109 -31144 -132222 89876 330027 -10017 -158278 419814 159069 -97144 292383 -288391
15098 39141 181098 40034 311366 222587 261126 265185 182786 260582 163383 285887 -85040
15086 -189233 216588 -89570 313908 -52128 315556 279641 -236873 88237 242505 -71012
15075 133753 83396 279191 54926 226251 57549 97682 169147 -51259 203629 47137 131838
15064 131838 286010 -59917 -15780 121737 57675 -84882 3194 111820 48866 329142 -46927
15052 -1717 -154191 49347 -11321 21801 422408 202251 343293 54649 303712 283140 -5341
15040 208725 100146 2428 -29776 238711 193042 122325 -58778 164701 282433 150673 364000
15029 364000 -96712 211363 -59440 256919 278810 185792 484409 27138 144946 50872 142686
15018 142686 207758 250211 104980 164155 -64876 56994 283613 130548 346736 132361
15007 513696 133056 -29878 -50497 304822 50432 113397 100885 59002 -119269 285041 333180
14996 333180 212349 56280 311403 144989 108250 -18646 -34225 296186 183093 135307
14986 135307 355082 198280 -91043 -101407 122926 222762 214890 364652 -49924 105935 -61165
14974 318718 -228679 233012 165110 78374 41339 213536 194945 -86180 24209 201156 -72270
14962 119793 157751 312416 484428 542013 105006 147747 238806 272221 346007 5914 87537
14951 87537 37264 301337 268440 392234 438768 217755 17560 349583 5562 340928 39198
14939 41890 112758 100519 263804 207945 534172 109732 256379 144466 224657 165344 395204
14928 395204 205871 176830 502978 140601 402964 -2766 521969 255844 58456 294652
14918 294652 332144 183470 384580 428105 188549 435864 236828 444 337174 168581
14907 121851 417406 200157 445165 545226 224294 205896 99869 349217 88348 499951
14897 499951 196045 501860 398707 330278 478754 -32447 -208606 596301 399325 174354
14886 604244 399173 197009 583455 335085 469110 475109 514240 117237 126836 44030 185259
14875 185259 52074 412339 464234 309777 33494 349442 113836 -86987 397260 214656
14865 214656 182360 102910 116495 560893 174751 -20330 469157 326328 173844 275628
14855 275628 337376 499461 -35518 444798 139801 77510 477559 397997 561150 245585
14844 -113881 104235 121436 270501 164513 105146 326987 360745 470101 590579 508347
14834 508347 151114 164175 308920 405730 713401 322696 578268 812794 227651 406219
14824 406219 116551 531835 309777 649877 541621 296868 509264 405949 319854 411539
14814 411539 355378 276691 371888 138304 131889 777351 323780 319862 362501 255257 235494
14803 235494 652935 682094 649658 390949 -8621 311947 313240 206257 754875 747103 450706
14792 450706 91317 737820 576801 538662 536503 223370 345289 604010 531802 324192
14782 324192 385317 673518 558040 531007 520374 355297 618494 651968 384970 724169
14772 724169 377384 472735 469031 318887 262168 427128 272427 336535 428352 475859 648986
14761 648986 409724 592029 339831 350957 368198 852432 692819 567946 -1121 701084
14750 397207 410628 785478 667140 694362 756917 684482 650328 572874 659092 493726 358732
14739 358732 692579 519840 655635 322396 563747 659237 518103 648800 574738 850636
14729 850636 831522 573679 468033 640160 875422 211029 605724 859848 402213 663382
14719 663382 364150 667675 596178 718365 570651 625615 733670 512890 950522 624791
14709 624791 506035 480903 662958 748984 542932 555239 885791 726062 585196 725450
14699 725450 882410 613280 706275 668205 788434 466967 654062 565799 878406 888446
14689 888446 752151 792748 766813 1000311 759793 891263 713967 611320 668783 1066586
14679 1066586 889133 786667 648195 703743 902598 632697 636929 725433 642826 929231
14669 929231 644207 728675 946086 746087 880429 1004952 886782 884509 897574 787433
14659 787433 1173273 1020223 782299 630646 820503 1242315 725780 727843 537066 763636
14649 763636 891106 1063150 1143126 947057 938091 951410 839829 1269305 508020 827277
14639 827277 1179486 983311 931871 794663 1181202 775618 732889 1356872 971399 1228015
14629 1228015 1254764 914168 922800 1038470 1166339 1082284 1032560 931077 1182768 939076
14619 939076 1181612 1062823 1069735 1061771 1225809 861499 1108257 1163377 1354370 1239207
14609 1239207 1139507 1423813 1021887 1241239 1344265 1560655 1454349 1406284 1030245 1284363
14599 1284363 1451217 1327169 1382046 1133140 1397137 1044471 1270960 1225024 1349664 1264209
14589 1264209 1346700 1419182 1450517 1449503 1291201 1330009 1428617 1595997 1585969 1579694 1291153
14578 1291153 1159869 1087425 1510525 1458213 1556466 1574556 1267126 1310248 1403383 1406374 1848058
14567 1848058 1548719 1336906 1099982 1758783 1678606 1717957 1460026 1543142 1875916 1725709
14557 1725709 1552315 1950576 1851925 1795785 1917801 1703098 1806333 2161900 1878889 1898992
14547 1898992 1847149 2064700 1977677 2157875 1913420 2207011 2401596 2001252 1991476 2280269
14537 2280269 2514923 2283389 2532184 2603957 2716107 2459632 2812803 2945106 2833135 2860094
14527 2860094 3537607 3842256 4522295 5406232 7446714 12250220 24163890 51125723
14519 51125723 36597314 13981404 5856109 3028003 2496450 2070620 1968690 1635243
14511 1635243 1455206 1979695 2018940 1963602 1929847 1887008 2206190 2104672 2476503 2142609
14501 2142609 2315363 2054727 2149763 1917478 1977817 2241441 2359099 2270968 2214814 2270055
14491 2270055 2560467 2315142 2283812 2437647 2547263 2461926 2315450 2398496 2724345 2698228
14481 2698228 2770541 2561992 2577559 2444500 2986640 2737888 2830054 2478708 2673032 2648518
14471 2648518 2796289 2877915 3076792 3156846 3018756 3179139 2851265 2910168 3062712 3299393
14461 3299393 3351789 3016981 3610888 3398782 3088106 3420392 3405893 3306964 3542538 3567583
14451 3567583 3436427 3613478 3866326 3875519 3873741 3759478 3946214 4111352 4116084 4137597 3961519
14440 3961519 4435295 3906335 4128174 4230647 4285814 4369534 4215817 4460196 4461474 4364106
14430 4364106 4342225 4694396 4555595 4474170 4929373 4830450 4926565 4530448 4980483 5060380
14420 5060380 5374553 5448039 5425240 5344815 5486071 5180409 5615301 5442072 5777847 5795522
14410 5795522 5723542 6055079 6022296 5742986 6441617 6384152 6141702 6140605 6672353 6643549
14400 6643549 6701253 6581790 6780701 6800173 6960658 7135842 7275696 7435190 7054228 7362692
14390 7362692 7980503 7611906 7599064 8004636 8140350 8019594 8312467 8600071 8624839 8422115
14380 8422115 8760019 8891562 8995002 9285673 9203250 9206076 9604202 9672393 9875137 9833748
14370 9833748 10272249 10565701 10705286 10694434 11130375 11004641 11038431 11473320 11974808 11921146
14360 11921146 12040380 12364293 12498800 12507106 12914041 13449816 13418426 13560043 13832526 14176042
14350 14176042 14400377 14656338 15000925 15532716 15837325 15759355 16225856 16286417 16574719 17096098
14340 17096098 17620730 18056522 18465936 18667744 18996533 19580629 20228201 20508863 20619054
14331 20619054 21162709 21692947 22118154 22658959 23216698 23788204 24726581 24985907 25780310
14322 25780310 26157550 26755205 27262558 28118548 28896021 29883241 30858301 31513330 32158801
14313 32158801 33445516 34329737 35047770 36381005 37379165 38572569 39498081 40853989 42215496
14304 42215496 43433432 44632433 46665236 47668459 49438413 51244865 52700302 55024857
14296 55024857 56755572 58501316 61059609 63309504 65492727 68138034 70600320 73609097
14288 73609097 76670006 79724279 82870357 86466311 90194750 94256092 98392383 102845789
14280 102845789 107741420 112701452 118397354 123711382 129882084 136426041 143268528 150694225
14272 150694225 158723234 166751579 175711693 184794276 194854635 205791282 216886010
14265 216886010 228715128 241109736 254156010 267577573 282166190 296449985 312025401
14258 312025401 327736634 343685999 360134868 376377117 392043739 407422462 421857278
14251 421857278 435303789 447117495 456866883 464355462 468044757 466946415 465360454 462508385
14243 462508385 456419040 448698607 442632999 432872381 419802654 405439497 390763631
14236 390763631 374494772 357857975 341390903 324614269 308556412 292414705 277625171
14229 277625171 263925640 249953301 236807212 224015356 212182627 201209813 190524260
14222 190524260 180561241 171090066 162620196 154783193 147506095 140123570 133271249 126804677
14214 126804677 120793521 115206541 110458254 105539348 100475637 96592687 92037642 88235250
14206 88235250 84877274 82013171 78282368 75073116 72185608 69556980 66975859 64500510
14198 64500510 62104668 59565354 57392210 55495923 53951504 52009014 50391845 48297068
14190 48297068 46712919 45232327 44394014 42955659 41578278 39967582 39046986 37716183
14182 37716183 36905167 36224376 35109028 34007573 32790620 31986930 31404264 30287657 29817508
14173 29817508 28692990 28096987 27344978 26751579 26046601 25846729 25027924 24161215 23659246
14164 23659246 23102920 22281169 21922356 21522708 20671076 20640165 20117069 19717165 19077319
14155 19077319 18641895 18451932 17715750 17825365 17064084 16790044 16187235 16234735 15848686
14146 15848686 15378173 15468463 15216950 14677917 14251638 14100191 13636875 13583605 13222734 12931838
14136 12931838 13030113 12527452 12105232 12407100 11781835 11785400 11473336 11124328 11347074 10851421
14126 10851421 10594544 10615182 10273810 10167901 9804374 9755480 9687775 9752606 9236912 9380670
14116 9380670 9190292 9211031 8981768 8894645 8529209 8633022 8360136 8600338 7857974 7979453
14106 7979453 7899975 7513666 7514359 7571979 7436993 6953077 7016938 7049975 7083111 7068999 6878413
14095 6878413 6710070 6690399 6851818 6576169 6496155 6346290 6332433 5804124 5877233 6049195
14085 6049195 5703285 5843507 5850533 5946081 5633751 5846159 5535416 5151496 5314202 5435160
14075 5435160 5449627 5093946 5180048 5001692 4872138 5149171 4819372 4817247 4915771 4927103
14065 4927103 4842670 4331723 4537694 4392338 4604134 4565023 4248287 4277226 4013468 4270897
14055 4270897 4431995 4076497 4042747 4042037 3794367 4101847 3761319 3736267 3691976 4064175
14045 4064175 3509038 3670146 3835529 3550504 3702691 3455325 3872712 3524317 3599014 3667435
14035 3667435 3511516 3256589 3630754 3769264 3525251 3418570 3451167 3326682 3294771 3118504
14025 3118504 2986027 3209027 3058646 2727560 3407587 3137217 3042741 2772249 2843481 2710672
14015 2710672 2919788 2969677 2554468 2661694 2822821 2601013 2372976 2334789 2489363 2442640
14005 2442640 2610633 2639534 2431055 2425617 2066691 2539460 2236651 2298503 2446391 2376032
13995 2376032 2196351 2521854 2388961 2251300 2204948 2232871 1883155 2161443 2148995 1736353
13985 1736353 2030045 1877757 2110144 2087508 2096633 2271462 1658629 1874783 1670776 2026725
13975 2026725 1785798 1666790 1927182 1704833 1958559 1876068 1957366 1652633 2017481 1600676
13965 1600676 2166094 2267364 3002991 6098424 14365871 40955850 41612593 19101052
13956 10315502 5900578 4595030 3650391 3401722 2932788 2844507 2535566 2411023 2746997
13947 2746997 2443354 2065057 2190419 2036544 2090082 2156947 1917664 1839940 1863735 1861386
13937 1861386 1807031 1867354 1842496 1858580 2098607 1995684 1731406 1914282 1754897 1678880
13927 1678880 1560682 1801809 1641759 1759024 1695078 1652253 1703084 1597877 1479309 1550408
13917 1550408 1458099 1488786 1472811 1581902 1662256 1541070 1186924 1429338 1354802 1461401
13907 1461401 1641000 1649921 1338986 1445322 1291415 1358185 779751 1256567 1366122 1205804
13897 1205804 1088793 1401049 1361196 1159706 1205152 1457732 1224106 1368999 1120875 1412422
13887 1412422 1312110 1021133 1231324 1100120 1223085 1124666 1408861 1323367 886507 1227148
13877 1227148 876617 1284423 1066813 1022791 1422896 1106919 1123492 1013150 967146 1019922
13867 1019922 1009314 913740 1046738 607141 1386496 1232631 1090994 1014237 1075436 1049517
13857 1049517 1226211 867069 1157983 999741 1021801 1228509 1385947 818004 847308 1195025
13847 1195025 916769 963045 867622 671420 1281801 753650 1130101 722160 661916 1167387
13837 1167387 760201 533891 880142 816020 865511 921727 352280 446916 894161 692228
13827 692228 789395 702888 1004147 749238 1191075 1080728 755234 655552 874794 932555
13817 932555 742657 890345 720627 525099 716648 900328 804562 789035 799859 335574
13806 931211 769994 463629 709291 585952 645007 597442 806832 840418 999933 792037
13796 792037 845525 703900 611796 853753 929229 650374 628021 657247 429040 457424 819466
13785 819466 909835 848100 644946 800877 843482 680226 708407 679074 558717 428643
13775 428643 644676 512852 736413 798561 604528 359533 817617 613353 645668 697586
13765 697586 634611 721702 758922 699860 441602 881474 536419 520390 689769 726334 578957
13754 578957 509087 598758 609228 319022 549813 650977 762474 787205 672349 683987
13744 683987 475461 844694 461611 461971 97393 247197 701707 766825 297023 649435
13734 649435 674660 681660 731766 177174 480528 449602 588056 637031 351937 316599 256700
13723 256700 330386 480592 337184 543983 842652 369174 371358 577364 730377 438053
13713 438053 558454 433401 350216 507005 452818 590272 489107 634969 370846 841321
13703 841321 753152 564387 618306 565029 413632 553679 225864 390412 221200 482154
13693 482154 458826 275715 560078 461364 717261 336996 199991 695963 246456 409915
13683 409915 487679 479402 505986 734053 226965 558378 563804 594150 708280 365443 258258
13672 258258 519266 221395 252094 489325 602484 566098 229382 369147 649724 555612
13662 555612 391566 362714 309051 140115 435571 508373 462966 240170 498424 339248
13652 339248 211319 342710 376646 633560 272099 208342 575673 213449 79393 445999
13642 445999 173672 352400 402114 554665 450098 463145 263545 520734 80493 324739
13632 324739 258425 180035 195841 356360 172933 243365 353785 562206 491556 380441
13622 380441 187243 570227 405221 404200 264349 590920 -58677 248181 386963 482851
13612 482851 232999 498099 537916 379862 99343 423911 162293 527556 -276 20861 218560
13601 218560 252835 580523 149422 -305817 350725 252411 175229 455075 306807 486800
13591 486800 414628 295741 202673 385821 371185 206874 59821 202721 410288 36281
13580 217284 348598 539092 93348 405800 237075 435780 516313 288023 417726 550961
13570 550961 218700 -74297 336269 377790 62184 394435 515707 575490 408605 157718
13559 202508 -36339 34402 232850 312620 415553 218563 352303 131032 418386 284918
13549 284918 339483 116317 402188 123158 351467 304650 -178528 401924 565142 415049
13539 415049 165954 208900 204402 65333 103153 188719 110181 2056 371309 104645 63377
13528 63377 298984 446545 341153 182122 59202 402338 141022 151543 239673 629563
13518 629563 282545 49683 315900 89086 213399 294583 215202 335324 538902 515877
13508 515877 156275 298419 389959 123924 376247 113641 298766 -50772 26249 206581
13498 206581 140165 292041 258815 263432 279844 290616 146077 460987 420324 41678 195131
13487 195131 69290 352533 424557 307176 345078 10489 398548 219691 127394 317147
13477 317147 119678 575763 122134 -67599 56863 86538 131277 459119 381262 165756
13466 109773 169656 -146796 14396 105884 133816 412320 36081 102964 35195 -144326 134465
13454 319315 134241 385619 149886 185578 377258 486083 147221 -45569 172807 470623
13444 470623 361322 129869 241929 -48050 193870 382829 324464 264529 252260 180838
13434 180838 140087 159899 244771 98129 312988 -211753 154938 413065 265090 195897
13424 195897 109563 114595 366584 107922 373559 454287 -11968 221614 -102063 302222
13413 199332 78234 319908 234352 -102538 -26233 98400 442122 198743 -301331 285139
13402 253101 69185 150349 296843 366699 171523 237876 -112143 244928 146371 160589 475798
13391 475798 332838 106273 68773 275273 107031 316583 -123263 -40676 -27203 131448
13380 65527 176227 -47899 106701 -34296 -212220 229587 49935 320311 236233 161345 -27366
13368 82509 118688 288636 534339 53109 223424 266522 259628 133431 466007 -18086 272275
13356 240999 301975 200065 127 316961 106270 106880 134750 281029 203913 -62285 -23622
13344 -92520 29933 501645 210194 220884 454902 62186 29739 89206 -30649 159808 488936
13333 488936 12653 125879 36584 57753 52075 56674 51787 414147 -197071 -26729 66043
13321 153511 210743 320524 97489 49985 -193653 32150 92805 208493 426487 -161585
13310 124440 205701 331763 220865 61440 172563 169383 305685 474720 236317 17612
13299 267204 237507 112219 206937 240821 216936 25354 275925 259032 144088 146433 334014
13288 334014 222776 -18671 84782 337156 358369 -71967 -101006 127238 121621 249086 390189
13277 390189 179105 -92948 368477 -49179 341899 173283 244916 286351 243049 514874
13267 514874 -126176 26776 -5962 224270 20763 -200022 -20039 -155396 335948 164854
13256 210167 92948 -142538 133137 195502 -43840 273775 -101944 87765 428482 181160
13245 -238495 -17409 -207196 66661 15432 -127269 -97163 111909 -15928 205719 348505
13235 348505 120627 98671 -70326 -89670 -180336 -84343 92587 94293 -50954 16893 -34562
13223 27171 291066 -434704 412839 239723 274216 168361 8757 43031 -15793 58557 111317
13212 111317 305989 -27690 -87066 7766 357957 203762 -15000 -357582 247713 -142230
13201 -35599 -3528 190689 29934 149067 -84359 281657 74634 127217 115025 107819 22252
13189 -64288 -73781 273523 27634 -205073 267882 225822 132491 -140711 -135497 17357 306458
13178 306458 -1627 -56121 -81600 -20480 -370982 40146 -48495 134531 -152415 149030 290676
13167 290676 50199 -10268 -33468 -83086 145586 32826 324621 131184 147325 -30637 -113366
13156 -113366 86617 343505 -112409 -8385 -21725 -244186 -6283 335729 286197 -51218 -55215
13145 -55215 259105 74657 177676 -67707 -258639 -10758 151856 246500 271561 105108 246981
13134 246981 379831 -171086 239120 -18946 -110171 128492 -109936 -161477 216355 -106662
13123 14746 -118090 322893 364779 95608 -179499 2553 27000 -58457 -179177 319654 10822
13111 147713 9600 254875 139303 219943 24166 20302 212056 -17179 231948 54849 -72499
13099 -92589 57048 74401 199789 -54083 -80346 -58119 57537 -68026 157052 119823 -54638
13087 88895 377117 270365 -73561 128085 43927 128001 374835 390393 183973 143579 22399
13075 88058 -232703 128362 -102440 -268285 -72760 -6903 -56719 -243470 22512 -96271 264039
13063 270479 -9470 356524 -79465 478 202381 50325 -282923 42097 -95756 69117 189475
13052 189475 341533 257016 -121977 338264 245114 -17158 -54062 -13380 50954 -38269 124970
13040 5008 259239 132513 310319 139919 -93374 25454 110405 -121806 224455 -164334
13029 277233 179136 -176131 91396 77186 69337 -42492 214110 312834 399016 -90706 -127482
13018 -127482 -113989 102343 103785 137054 -205453 72167 269787 111218 170056 -139432 67357
13006 461309 -48794 -174463 219666 17785 -155440 169517 74613 -83527 -101639 -33927 121828
12994 104282 -333621 406783 -368392 57600 -13323 -94504 360848 17981 -269587 120341
12983 -18370 228222 237901 255548 182093 298469 -389268 -376980 66787 186302 -44797 -16501
12971 40142 63934 3394 337199 169755 -161316 53972 -167414 232844 -94000 573248 -329896
12959 110508 -79489 -69108 4083 72573 360810 -233616 162718 -227148 39849 27968 -229091
12947 30258 -22299 27642 90805 -20165 -91504 -33909 -75074 -36034 13260 88363 -100828
12935 63139 46564 -6252 198686 158904 -197871 242009 -179981 -251639 -263399 -10940 -231676
12924 -231676 57479 -304779 -187687 -251002 9633 -12097 603935 94157 -16971 -36181 -254775
12913 -254775 147673 -295206 -88019 -176605 124127 -237797 83422 205974 -217085 -255575
12903 -255575 19669 223666 -59693 301643 111450 220025 -108960 175074 34851 18261
12893 18261 -413125 45162 13905 -79685 -101671 82693 -131012 94508 -186013 125998 -190602
12881 86855 52727 181321 135961 246483 -4212 -280767 -167358 102485 143961 239333 -237956
12869 40331 -150262 129445 319586 153852 -114760 93396 13072 -60182 -2627 47030 190682
12858 190682 -59078 -91108 -153808 -76022 100522 28444 -199604 -79259 -19334 55392 94633
12847 94633 -2243 -314312 75217 -127215 86475 -83418 -16870 -186079 -24808 40027 8484
12835 258053 408080 -118076 7268 42854 119828 211206 -227123 142190 124261 -301214 281701
12823 -42562 218908 87696 272718 546496 119412 271334 215380 24142 44007 -55238 207750
12811 81192 -378647 152084 -51512 -119531 125968 -37049 179620 -40236 -174828 428655
12800 -75610 81178 -104360 -76255 -76809 -239601 -18859 70999 197382 -101271 158160 54990
12788 -91740 233007 88769 140965 -133272 -343241 29788 -180048 -89324 -110072 246130 -228500
12776 -208133 128008 -229663 -296611 -75009 358293 -80492 126830 232911 -13284 286865
12765 63527 178335 -142889 -300716 -469920 230558 -149512 342660 -111993 -41640 23206
12754 78733 -372204 107439 -365898 14824 39702 -84780 -93665 -276686 222273 -142059 -158289
12743 -158289 243360 29632 -329706 -321544 -101920 -110643 -139600 2461 -225911 95204 8372
12731 38007 13649 -176214 -35890 -115449 -136806 -59928 164286 143623 -17078 87656 191806
12720 191806 -76255 48103 172597 317247 236394 32891 277860 -81336 159301 202715 75509
12708 107992 66725 -62934 -26374 -23142 84807 3412 386704 -232237 181777 -12567 -97330
12697 -97330 150155 -80881 109784 -230825 -213281 -139853 43162 241968 103670 -102922
12686 100963 198663 49462 -300003 122910 373246 311494 -239300 228951 12930 27313
12676 27313 -43102 21232 120353 -126034 272215 157694 194602 -90821 88690 -90110 -85641
12665 -85641 -132361 -125001 -105496 76013 -87348 101987 -96830 -148993 -38672 273490 -22465
12653 38918 -263111 -206221 196049 107605 -22329 -46054 26563 20514 -187652 295517 -86106
12641 325789 239315 425125 59395 271726 18429 196287 -85917 179116 -290478 199401
12630 36281 -199114 88929 -117938 -146130 317825 305164 -22167 112374 296495 91537 116204
12619 116204 -98327 -171192 -131202 -200944 304439 163554 -168472 307240 -210833 -281758
12609 -281758 -62565 26609 104031 232723 536600 295899 -258628 46278 87328 -162072
12598 9450 -131676 334013 186707 -310733 -62671 31400 141382 -295164 -19348 -22982 182855
12586 116871 180109 37378 -54330 -364070 -136729 115630 346198 183655 58363 -291650
12575 177327 -102563 235610 -25940 471245 -33063 -302173 338483 4980 3713 -291621 94452
12563 203778 -169643 82556 53417 416046 -239626 55389 155955 141192 -273586 98747
12552 91553 -140723 224378 77406 -6453 103665 -8864 71828 24851 -52102 98693 56865
12541 56865 19513 155828 118643 185528 -312921 -180125 173044 406777 150202 -110280
12530 -100161 253510 -177638 -3400 -112752 -31395 15787 139420 10541 -395248 -209746
12520 -209746 422340 -140644 -265867 125801 119015 35756 -131924 26967 -108577 30643
12509 238220 -197218 -135942 -7725 -194 374386 157239 85470 376209 133253 85208 139202
12498 139202 232779 4902 -105423 275175 -144847 -297916 -59225 88649 89486 -125947 -224298
12487 -224298 101189 7767 -130623 60453 294956 -144448 -3386 -301672 276302 155484
12477 155484 -109406 -23799 -85677 -41604 95728 -213353 -135627 -30889 104575 74964 128552
12466 128552 -9907 -28076 -18863 -5420 139636 -363026 -240147 283470 70349 262380 -248836
12454 -171904 -189327 18323 53538 119437 -26732 392083 -48991 17682 -176711 -212440 -113015
12443 -113015 -48793 135055 -135451 -358821 219285 329417 -41365 -339043 107296 236570
12433 236570 75117 -9776 -90496 47989 -219887 103828 220854 338 -227264 -314612 -83968
12421 -35867 101407 101522 -396487 -145818 -330100 -123246 -13423 111590 52709 -42101 -156093
12410 -156093 -229169 -130900 32428 139994 -4118 -314495 -183352 -81293 -271960 -199518 178228
12398 -98868 112525 -66464 233742 -444126 -122099 -79292 -295601 137365 353445 170036
12387 -337550 -27080 153974 -7759 259322 -122816 157849 -154498 -225337 -204341 245091
12376 18430 202732 35958 254495 -65573 -18848 337234 234109 45689 93952 166982 -132834
12364 15568 63889 -90597 -14822 -197179 -440989 -94020 -329388 61466 -214180 187973 -107052
12352 -124004 -185989 257258 -102084 103181 -4260 -269967 129664 -101555 -33815 61151
12341 -85294 417912 -164580 186287 -121035 -162632 -319479 263858 35797 -9955 158561
12330 -31773 -135497 -74343 -255421 43459 -137617 -34759 94134 130450 216991 -250517 -169645
12319 -169645 61429 -93732 190006 189941 -254593 -161860 111328 -460214 -67810 -218499 185507
12307 107160 -266739 -22480 20488 130785 464518 -60451 -256039 -249335 77552 -104488 -112512
12296 -112512 -194711 -177115 -136066 -152223 244030 67960 -80629 -206698 -180948 123134 -127161
12284 247342 -154196 -272446 -55995 -219906 -87796 -79641 -125113 -46502 -84010 109802 178594
12273 178594 73486 351045 146210 -152380 157677 -126161 -22088 41730 -367451 51401
12262 -53206 -28968 185614 192959 34414 79287 197633 63639 268453 65384 95572 -101903
12250 93154 13406 217860 36985 42348 -299898 -68242 -47903 -383314 279975 161097 -27326
12238 96381 227346 50233 -81930 11064 53602 -93990 -177438 261317 260859 163550 -226844
12226 150135 -67724 133966 99495 55387 -276326 257167 20226 210013 -108654 -56063
12216 -56063 -2152 -39049 -78574 190188 -166233 45056 -86962 -14932 -9046 35609 -48232 -110052
12204 -110052 109485 319361 293151 2706 137277 239685 51896 291214 41831 246585
12194 246585 -9820 94281 104645 178429 165027 195721 218585 227237 129847 -40502 -209784 490120
12181 206457 275435 183594 563941 267825 318756 -4863 -76134 240208 167091 59631 252590
12170 252590 15862 262481 361394 140959 63518 -121953 166513 55132 340751 -105741
12159 75203 202097 415382 -308953 -105328 -172387 137338 272149 127409 112903 -97164
12148 189897 20520 -69087 84390 163630 31266 -15539 12428 151295 41546 1826 -382770
12136 178648 -94480 -50894 56226 104459 101130 29792 181292 -127487 368967 470427 73590
12124 362396 -7513 32404 44403 -51293 142393 -67216 177847 122781 -216320 64285 -394720
12112 140276 -47217 350323 -27972 -117838 276254 -142934 52769 -84873 -89502 -307257 -184525
12101 -184525 169417 30793 -197659 68675 -41251 6343 142138 -46725 27275 47650 162796
12090 162796 -119616 325208 -124657 209483 209288 42924 193433 122881 -277472 80308 132194
12079 132194 150330 -95212 -264402 -44211 -131243 8508 -185664 138633 -374639 -24507 -28270
12068 -28270 56568 -82107 45769 231732 -21406 -92068 -322060 -265517 -293519 77053 -46479
12056 -259193 1299 -72336 104067 -248534 -9879 -150764 3548 91945 11847 18908 125051
12045 125051 -55447 1477040 887802 341941 117454 58260 122742 18976 259704 -13127
12034 -61480 -12318 -85073 -40061 -42017 59725 54717 76842 -118534 -63832 212093 30923 -45400
12021 55623 -22353 -55736 162053 31005 230878 -162878 282031 172145 -347075 83297
12010 -304814 243542 46223 -106739 152763 71695 45111 -58146 309927 -129742 -277888
12000 -277888 -185821 -146853 184164 141126 334751 56703 213137 6602 -1321 38345 163459
11989 163459 -14098 -317310 -83586 -84962 82238 -36809 177329 -167399 -346383 -174115 11099
11977 -274671 25856 -279262 -104836 2498 -91684 -261038 29057 -55927 98671 271353 -152845
11965 -912 186237 -160816 73134 51424 -304976 -270693 -144260 -27418 -27896 84234 -71846 -121136
11953 -121136 165924 -71047 102605 -245496 10709 -152430 18619 -38281 193741 -210287
11942 -134323 16613 231437 48542 -115012 -63810 -67079 -83256 69113 282165 51244 92496
11931 92496 -110083 248315 324349 -166931 31137 159803 51735 5047 201307 -62724 16329
11919 -401965 -235493 -175090 2014 164128 344855 145671 -31153 71008 -206445 145578
11908 -32956 76462 118302 179505 -142646 -181539 -278811 -268025 -4943 34263 -160412 -34013
11896 -455973 -20731 -151605 -141485 95887 -314848 139844 271512 240341 59151 -285855
11885 -67379 110996 463904 -87882 -75913 -225627 -89952 -79089 352908 88758 -103291 -89017
11874 -89017 -230967 69435 -223184 73042 -166236 62207 -132616 216021 29008 -254319
11863 110364 -19817 -148494 368980 120316 14238 -109785 292596 55196 -37109 16398
11852 -109491 132416 173661 -358822 -289653 132053 -194297 76718 -116337 84651 9022 61133
11841 61133 -204185 126240 -72550 -370890 -2253 -272107 5387 -5281 185376 -218636 -10613
11829 -65641 90692 -105767 35406 241606 -11019 -109162 260876 -99508 -422921 -112527 32785
11817 -84549 -156124 -28915 8580 -248139 -82072 -112701 -100678 -206210 -355907 -301529 -182939
11806 -182939 -198398 84461 122844 -34848 -167074 -131255 167415 -67457 -77419 -334083 -201277
11795 -201277 40300 171424 39531 37250 79794 67495 -143658 112358 64330 8770 -201829
11783 -292287 428864 -166333 24911 -194290 -193409 -13859 -29562 31877 115577 -54896 125653
11771 267745 -186535 -85410 -346319 114557 120003 37587 -191687 215411 -34224 -220201
11761 -220201 -25098 10968 -324742 -103445 -207675 32739 -487174 -76016 285356 136406
11750 -147934 96953 18477 108599 56817 103974 -202723 -29356 14499 -139965 -14884 243937
11738 -63817 122103 254489 -12110 -118631 -59011 -70071 -29197 -17450 80631 131854 129399
11727 129399 -83784 -119721 -40977 -346846 153150 -182223 77093 -288922 -367328 211795
11716 178897 74084 -41673 -42003 -102799 178258 71507 213123 -256214 -99211 65218 -278941
11704 -182962 -9187 -12549 120916 219588 -268858 136538 -399158 -22439 42819 196808 150430
11693 150430 106738 -23390 -353443 12326 309385 -72276 24577 -22697 -77333 246533 133553
11682 133553 -91000 -49895 -19753 62006 -214349 357153 65505 -194262 -59081 49401 -88310
11670 -169822 15756 -157098 160747 -84000 296692 128207 -109585 134588 -100933 341755
11659 255013 208379 -59815 73885 157277 108890 -83633 -49685 27918 -166356 -75480 -91040
11648 -91040 195902 -69230 -38977 94733 -45031 119843 224337 -208169 -241886 -74634 -154572
11637 -154572 -288511 -35322 59481 80685 45223 79179 -175705 87922 109628 284701 -236416
11625 124229 281160 15835 -92653 81321 96078 114563 245671 10027 -279010 -331462 126045
11613 -29079 -4540 -133184 50796 132882 198618 137552 4119 -142689 -120159 -58867 -130327 70900
11600 115034 -172978 -235445 7688 159626 70911 79761 21682 107293 79972 22554 230272
11589 230272 125716 95305 -85799 135433 69393 207081 -148873 204870 307992 102732
11578 -101238 284703 108531 18729 315073 -42796 182622 314214 49920 324418 -72244
11567 -81258 88966 -41492 17858 114208 334167 -254943 -246469 12699 -149046 -7094 97873
11555 170954 -7547 129271 -133962 -104049 -174023 314262 292960 -33577 38292 -66353 -54706
11544 -54706 7965 -223458 179804 270880 145552 97665 -49190 -91953 -28125 -31355 311266
11532 -89995 -112540 166510 212595 -337259 229307 324958 374268 -74236 150874 202160 660690
11521 660690 214146 272013 277769 6439 -246469 -27796 -102868 200987 169391 81510 -254559
11509 130137 433664 236021 68105 356898 -132697 -154428 -15780 198546 -86413 149675
11498 -209988 -37903 -139472 313516 -138079 -45304 88940 169052 -36432 -238094 -201420 99136
11486 -139619 107500 174495 -194229 309739 161309 -221642 171432 205591 120272 171650
11476 171650 30123 402134 35634 105081 93345 -26548 -15274 -206269 -80572 187012 -126437
11464 48609 352581 215513 29644 304628 117501 194571 143929 -67053 -77763 69610 88801
11453 88801 -105931 -6550 -184457 46690 286014 161537 155322 -104588 220578 288981 401879
11442 401879 28099 57042 41187 281669 156434 -267920 -255613 128677 72256 -171933
11431 -186940 100205 -11264 -24727 270459 224845 220531 -122555 -72960 -106250 5910 124903
11420 124903 82907 85931 -190443 -95967 189438 68276 9213 187798 3562 -256853 58245
11408 52654 -210674 -20877 122667 238195 -194310 12167 -22055 -187092 88703 -412215
11397 351882 -57548 103498 -21416 -186494 -71710 190629 -322470 143352 -72881 -130212
11387 -130212 -20483 -84927 21358 22771 158669 72416 4531 29492 -273041 110207 -215676
11375 -133272 -135583 -87720 90475 118648 29924 -214924 289272 -163987 213 234226 28976
11363 -85879 -96044 141867 -138639 68945 -22821 -72470 203186 316978 258225 138548 -81281
11351 36538 374543 -239381 228779 107146 -3045 -58108 259237 155062 -261819 -196782
11341 -196782 -54448 -70473 124541 77656 -180127 -14099 -139764 161229 -114913 217252
11330 183407 -145981 36175 145441 -310263 216879 311773 -354676 -264166 -79617 213049
11319 -123983 -63041 298045 26291 66105 135548 51813 551008 357861 156155 -67189 -113699
11308 -113699 -294000 57435 -185278 63269 73686 12779 -394991 247715 278598 -321009
11297 -50863 175954 -135437 135551 134140 35883 -427900 176771 178828 33828 354631 121620
11285 49033 93032 -93836 -162556 -34038 255522 -129659 44629 -113573 -139989 -27088 25306
11273 -124642 33051 -238020 -133714 199490 -11154 102995 103089 -161771 -125546 169095 -43890
11261 -40305 -30847 -334809 198831 5606 247986 111280 301417 -249618 61632 -110972 -142430
11250 -142430 -179798 52175 -298778 -1055 -155651 -303671 -106426 20809 -158602 265422
11239 72434 140728 41260 172975 -108694 -51509 -105806 -26332 -127912 81515 -112659 -221113
11228 -221113 52528 176097 -8976 -14302 223191 -142669 -85615 -124764 172243 -58889 -161143
11217 -161143 21782 -3303 152872 102690 -282334 -180923 62512 -162512 -134430 -104723 -207348
11206 -207348 248656 -108672 108283 -164293 -175255 -213161 -223074 43628 243142 102743
11195 -184978 25909 100089 -130457 -414606 -94591 162052 -15297 288349 -15284 -41351 70706
11183 52404 -72661 -59665 71228 31028 41531 -75154 -199439 -46498 -145933 -68801 220283
11171 -73661 -237536 -43728 -51273 316279 -236347 -25186 117012 -107267 202303 153315 466768
11160 466768 -290278 192834 -299055 -238999 -329232 -155606 -109009 -31650 259884 51009
11149 -7910 -527308 161130 -271524 -94753 54166 -2888 -137733 -91047 119283 -94886 -299024
11138 -299024 -54590 -209046 127541 179791 24496 411149 250164 25866 -456707 -84620
11127 -144927 -149139 63268 54902 55403 -314026 213673 -339237 -436120 33748 247296 -111567
11115 -217601 -96727 -96234 55650 90904 -494931 161359 44560 69244 85547 270300 139172
11104 139172 314519 -68880 220808 46125 -226212 26478 360868 156609 -122988 120836
11093 -170229 -226919 78166 88020 87212 163554 162419 88481 226905 202131 181563 111108 59410
11081 59410 -179371 45600 32880 -110038 -176416 -152321 -82137 589971 432454 45285 179882
11070 179882 166290 -30078 42350 -137825 22992 45969 109835 12935 261998 -54860 108276
11058 -73420 74668 313447 400164 82320 202724 13538 -86702 61199 -161320 64486 184445
11047 184445 741094 -83812 33060 667748 555879 328413 343509 295415 278685 216321 372522
11036 372522 337861 485324 484104 287391 481263 19301 400945 532730 240850 512974
11026 512974 331216 587920 634865 482574 708038 229731 421215 562374 242439 758545
11016 758545 647728 483879 408732 285521 732343 682063 234051 679029 529019 623063
11006 623063 882590 536389 494815 597248 866921 894127 737521 455514 722541 551045
10996 551045 810772 358736 432234 683932 452379 299174 395138 591388 380033 744352
10986 744352 451887 349791 788538 682460 533029 371638 466733 409973 572730 476846
10976 476846 438841 286043 753945 522422 523325 789361 524832 598701 572467 587849 391119
10965 391119 448341 818759 879692 420103 674306 680425 857920 991583 761049 730235
10955 730235 833506 770693 931674 1192005 925247 1152959 1313802 1835684 1641670 2218020
10945 2218020 2147966 2406649 2541859 2520202 2225952 2055806 2122390 1803927 1561873 1438106
10935 1438106 1412191 1453452 1403883 1144233 1406321 944248 1141631 1487458 1453818 1281836
10925 1281836 833497 1114152 775965 490151 747812 492086 504611 467649 192539 -204863
10914 45094 -138710 364682 285418 225161 -130396 167625 180483 297608 -196314 3079 143163
10903 143163 -50287 81389 -69143 51707 -100903 219633 -263384 -124897 -269739 32243
10892 68409 195273 -14993 129661 -205187 -109766 85181 -34847 -187210 -237122 289075 -30235
10880 -59687 -7003 165188 327837 -322051 -133985 -149306 -86028 -169078 149154 -65847 -361946
10869 -361946 -108534 224620 53891 -109042 4558 177428 -71563 51679 -128675 -13543 -44413
10858 -44413 62035 -119319 249654 -387346 87581 66477 133643 -162185 -328265 -25241 -343043
10847 -343043 12684 -114311 -62050 -28871 -43656 20913 236344 71240 176964 -94341 -57873
10836 -57873 -78443 78167 -17260 -135469 363211 38928 -77604 -339358 31563 193658 -126130
10824 223354 21363 -67304 122933 -14247 114503 53344 -283550 -157301 331387 446487
10814 446487 -33369 71533 -151335 -43995 -9279 -138073 189660 76107 -18156 225821 126119
10803 126119 -234956 91482 -360746 280668 -292287 -152627 -24264 -59966 107831 -86368
10792 -270210 -70006 -105050 -314219 135173 106686 157402 -374493 99326 -109942 -22599 172294
10780 -266400 -2347 -217360 17325 52190 -97927 35458 -25625 117537 156709 180252 107505
10769 107505 -55583 -38619 -13518 81339 -30260 -274928 167421 -112621 224429 5165 35986
10758 35986 -169316 70151 251194 65301 -6861 -99676 -170011 175620 -289198 204976 -317028
10746 122920 -315336 -151663 -207368 4703 -180724 -63418 -110264 -254644 46939 218032 50081
10734 -7357 -205943 -115634 40204 -134132 27281 35556 76440 -206813 48808 -101386 -378301
10723 -378301 9893 -165076 74879 95380 64494 102022 78831 -400335 117760 -69449 114121
10711 -66947 -91152 -69748 -110278 128949 -25713 -429637 -223820 -85405 -95858 235255 -140809
10699 -151865 -40921 -4826 172490 -70285 94392 145063 -100987 191669 65052 -427454 -267002
10688 -267002 -3094 107306 84704 -40591 31264 -252650 373278 -28832 -12154 -22704 -318976
10677 -318976 -114824 -50342 96676 -346458 141319 64630 -218000 151930 57920 -55939
10666 122538 -268 68909 30311 -251527 35347 -172418 -187285 -86169 -122134 -19491 -17180 128448
10653 61800 -112998 -21388 -14527 -110874 -172722 -134304 152254 -21425 331649 -13890 35843
10641 139250 -110364 77478 5265 -323179 -116331 -131336 -70537 -234276 -118350 -98767 -309993
10630 -309993 -122955 18799 -32088 -11162 -145680 -27037 -14155 -341782 -218577 -317851 -143047
10618 95525 129354 -359068 99322 -869 -66366 -211058 -183551 2296 -15520 -106851 205635 -191540
10605 45182 -135707 -93672 47427 276122 -338898 65267 373002 -110870 178679 191042
10595 191042 -324443 -288829 -494917 -24975 -203903 227133 408749 -304064 -297634 14763
10584 78369 -146600 175440 -69952 -150807 -127410 152512 138361 -25187 -413356 -14438 -224461
10573 -224461 -86780 70468 -99318 -352960 104956 -18328 -236147 -208214 110436 -146449
10562 -435266 -58028 137312 -279314 90515 95572 -374380 303184 87686 -56206 88952 183884
10551 183884 110416 -170347 291302 130265 -275211 8829 -331596 -162996 87888 -98339
10540 71077 344036 -94989 114343 -207601 21148 41034 -26152 -114498 -71347 131518 91330
10529 91330 -51609 -181715 -76979 -266613 65979 -61342 -335526 -358142 46039 -51032 65699
10517 50182 -21653 17873 46380 -54016 -171833 22561 136063 -4605 -184487 222678 -71210
10505 -228795 123382 -164236 -328008 233984 75157 -52074 129042 191445 -179182 -90350
10495 -90350 -29048 -35033 -263137 -210749 -111154 146559 182242 -66879 206800 -168368 -82375
10483 76078 -282442 -22265 173012 241000 37006 -331914 63710 173526 233991 44527 64724
10472 64724 113085 225756 -34786 106288 -185690 -139205 -247238 -2992 -40764 -165680 8968
10460 205750 -302749 94806 195299 305999 254278 181149 361718 547166 212316 440542
10450 440542 82332 420482 23542 -49334 91409 158281 -164097 243829 5054 32808 -67721
10438 -33505 -118463 142724 -192852 -246095 -243974 -65930 -46257 -486417 162841 -21392 71959
10426 -148525 117113 188434 -59506 101725 179784 27571 -161082 -143074 436746 242390
10416 242390 -241573 89974 114507 -120621 -40606 240874 -151469 31118 -204795 36778
10405 -197266 -1505 -286823 94911 -150745 -227388 -277711 -139816 67016 15795 355391 -81681
10393 -38425 -51233 -256355 -226141 292718 -103089 -233787 -426106 199174 29863 158329
10383 158329 -32231 -214535 40278 338780 -348501 91508 -87064 -42319 -183929 -15504 79996
10371 -69196 -107089 347872 161330 51858 -158615 16363 45570 14074 341915 119350 15576
10359 67168 66571 -44570 34043 -133475 -294158 63686 -32303 178032 258811 93286 126910
10348 126910 26259 51326 206813 139658 37998 409454 409073 -147194 219433 106868 398579
10337 398579 286923 317459 409624 156375 679947 70231 377472 -12443 293173 12366
10326 365114 262189 524336 298984 524321 515168 555139 264060 -32682 368372 213341
10316 213341 349781 219320 192569 96422 89936 178904 59320 347778 -156117 117070 377705
10305 377705 184030 -407549 291892 165644 19994 162991 67871 -104959 -63859 -26103
10294 -313118 143664 152623 446126 -6046 206240 79212 100791 155542 -17268 -9148 9724 240041
10282 240041 127969 49021 -67323 -33826 -41131 -39732 -152535 -131006 132456 232193 -62532
10270 260450 49639 -125448 82772 310505 125409 189379 -43153 90205 -18533 171223 -86089
10258 -208892 79045 364541 307368 104858 36 193396 -348489 -177602 -268953 128081 -114400
10246 -233575 -76888 -69976 -316683 66681 231033 -95504 110985 312875 -170187 134158
10235 131796 32800 349117 203311 53681 175236 365613 167816 196723 -182432 412674
10224 27405 101628 -70044 -243024 -60962 337397 -200665 -94189 -52979 185395 180548 44967
10212 -89506 -213659 -191727 -66711 105498 129909 -55349 64740 -49072 -118496 -297694 38062
10200 -122299 75217 -209216 -24545 -141222 14985 -428486 74300 -195031 -114294 -96288 -61533
10189 -61533 -192687 226964 280777 -296506 -273290 41344 29485 259882 237199 -137923 251450
10177 -40264 -308739 90920 166723 -71647 -352808 89039 -326374 61711 35466 -43972 -77920
10166 -77920 142140 153468 82792 -70014 -116796 -144438 -318305 31614 -502433 -518266 -239008
10154 345568 -125648 -6142 -251009 -186768 133699 135694 116603 -171106 73020 184687 -142866
10142 -96342 70774 -247713 -130084 -61302 -435022 -273567 -145269 47397 -191660 2741 -194888
10130 118402 -62329 -273268 66110 88190 132151 64581 -8345 156170 -73359 395279 -41368
10118 -310962 -60242 135165 -150354 -122621 -138254 94042 147394 135163 46715 -305531 134854
10106 -317015 -199376 230287 78251 -127298 -126541 100853 -104765 -132752 -619095 115677
10095 -405299 -199066 -236223 -21337 -172265 -170170 -329615 -341398 -334429 -146050 -133243 -76863
10084 -76863 -39371 -351117 172740 77519 -262563 -255618 102120 -170096 -307284 -173567
10074 -173567 -364457 174360 8565 170237 -116194 -10816 4139 26385 -117193 302302 -44499
10062 16069 427771 336680 103099 -212975 -299696 -244000 101433 -80133 -237648 -84825 -19808
10050 -115884 -14302 331732 409914 -192868 -3974 -99465 -138306 -59659 324593 -226670 149954
10038 -172233 8413 -116311 -45172 -158375 -20993 70673 -38766 190968 85534 -2748 67439
10026 84901 -207343 -308948 -105565 -277141 59494 -110040 197970 -152401 55195 103570
10016 103570 102179 -452306 -1786 -202822 62407 -12900 42487 -55347 -96999 -55337 -18340
10004 -132623 106851 -433287 -17772 -251357 -38024 -63497 62970 -207831 -128110 20159 105313
9993 105313 -129918 -355776 263653 -286909 41720 56053 -272132 83616 -135731 -77837
9983 -77837 -299603 14849 -94468 -97776 -230892 92059 -18482 -145840 32157 -102229 -73200
9972 -73200 64769 -226178 43947 -39861 -107372 -89306 -47494 24293 52992 -93797 -65199 -106137
9960 -106137 91189 191992 38286 106678 198371 98339 -100287 216562 -82797 -301993 -9038
9948 -287813 205948 -112534 2020 -86138 -208652 -99601 36468 -322230 86789 -152236 -9377
9936 -101904 -180600 -12285 -19462 21191 -122840 -158625 -170051 -35999 153671 -80995 -298644
9925 -298644 -72068 -42238 -240893 -219533 -232312 -400012 194792 -133806 -51964 -126166 -412732
9914 -412732 68066 -141971 -296752 -269542 -354938 51818 -54318 -51941 -45888 -22699 -147720
9903 -147720 -12543 -270672 101470 -162641 16543 235124 -219717 24816 309931 -305023
9892 236413 186022 -23456 -392689 1459 -207038 -254238 -58274 -227518 -303760 5926 -135855
9880 78839 -103233 -6869 -297882 -174375 -217737 -158333 -190774 -252122 -232083 -3877 91729 50354
9868 50354 -48078 254695 122732 -213734 -118812 13030 81733 -131063 -60325 110615 -6243
9856 -45338 341061 55147 62470 -119808 110369 -195769 -26648 99389 87947 -315057 -162222
9845 -162222 56949 -20230 101293 124876 -12848 -41082 -252438 146858 109793 -219411 119692
9833 -66176 -382202 -290613 -373099 -114195 -334550 -257851 15699 198664 182508 -236194 -61509
9821 -135584 34424 133560 -291881 24411 -65172 -20636 -224786 39069 -2873 -139098 -263404
9810 -263404 -384360 -101903 14353 70418 -228510 -118322 -182735 216763 85676 210535
9800 210535 -220195 -205095 42284 -165983 -3190 94113 -36328 -122654 -5730 -90322 -20642 -41724
9788 -41724 -94422 -11475 -276015 312855 -301921 -501119 -105132 187704 -311688 -30929
9777 -579085 118837 -342012 31082 121807 -353036 -201548 -105307 -105087 -180979 -114313 74286
9765 29108 108186 -301636 40874 188266 103039 175447 275937 78246 -5665 -134832 -309329
9754 -309329 141380 243975 -49349 -151310 -14611 -349509 -138754 150229 -99675 -167102
9744 -167102 116464 -179057 133295 -341402 84221 -446299 -209470 -300786 -137331 -41734
9733 22355 317251 -329373 -143094 -231397 114633 -106839 -87870 118673 -176261 8192 -300247
9721 -88980 -102881 -127282 -101955 274179 42410 11560 39221 51324 -14017 -59253 -364976
9710 -364976 392214 173509 -428409 55566 -68848 -65356 5406 -131895 -263500 14666 43833
9699 43833 -109145 -213334 -149470 -157097 -281980 -4350 -33456 -321704 -31762 -233166 -97521
9687 -45530 -38337 76310 82424 -162238 162976 -125019 370275 -94287 -99811 -215411 -275913
9676 -275913 57794 1891 -336908 -391585 216289 65823 -88400 -257739 -254784 -166850 -3028 97276
9663 60749 93871 67285 214427 54488 -53338 125956 -360752 -300537 -11890 -115665 67433
9651 -12631 -186750 -318137 -248837 -63820 374964 286871 -9658 -159564 -26898 292860 77928
9639 27943 -65414 -3162 -191812 -196624 346044 121081 295170 -95917 96155 62888 62183 -324050
9626 92501 -11304 -1173 120094 61208 -216369 -2431 74530 -254933 -43083 -257347 -197314
9615 -197314 -390546 -179989 -80550 -53443 69021 -179900 -282803 -266731 -119363 -300245
9605 -300245 110054 -57003 53760 -118337 -38598 -170146 -324022 -79225 -24677 34350 -220165
9593 -56558 -285376 -104671 -168043 11713 126555 -87298 31847 66115 159093 28723 88162
9582 88162 -79150 267058 129521 445710 124852 -332605 -63410 -29979 -2412 -101289 -283063
9571 -283063 196511 100999 27983 230742 140796 -8014 138455 15809 -143069 106383 -360931
9559 -180511 -121576 -332127 145985 152505 400622 25641 -78710 -23546 -52460 -346778 -136483
9547 48141 -124229 -29690 -22690 -168197 19958 -236642 -62511 -15012 92965 153849 195438
9536 195438 -222643 98567 -62871 174021 -200910 -83268 -271519 -84031 -231049 -14232 166347
9524 22483 87616 151425 -58239 -54151 -131110 -59442 -666677 -31717 61125 -147476 -325715
9513 -325715 28347 -267941 -212122 -27435 -166510 -218469 -132154 7875 -160125 -32722 8353
9501 -414441 107749 -321033 -365322 -59444 153706 65872 -329898 -212247 41663 -128633
9490 -57006 11276 -146803 -289084 -135976 -54869 95302 -210616 -93122 9308 145370 308450
9479 308450 -91386 131056 -87713 -25166 -52995 8451 -230712 -150085 -177898 239032 89849
9467 -294168 -86871 -92735 149983 -371962 -67418 -449498 -208453 68066 -116152 -95892 -209069
9456 -209069 235323 -26197 -144498 37186 86120 -254688 -350528 -96737 -237033 55748 327564
9445 327564 -242170 -13879 -77213 199071 -97451 -199962 75793 -225228 -283273 -204354 -134497
9434 -134497 -208068 -203200 -86941 -31927 -90025 -114494 134294 -285432 -217423 -84058 -277850
9423 -277850 169259 53559 204462 239105 6703 -128397 -527742 128711 -87715 -207244 -182841
9412 -182841 190155 290 18004 25539 -20154 -410239 -131373 82074 98829 -121986 -251964
9401 -251964 332214 -193368 2107 -107373 -48420 -180186 146757 -143749 98024 -56295 -253266
9390 -253266 -45978 194964 -345388 38643 -212664 173360 138720 -54219 14850 53483 177641
9379 177641 25092 82375 -85641 -403176 -6069 -149374 -199865 137837 316094 -283588 9933
9367 61938 -199532 61994 -302124 142213 -86298 -66384 -267315 25580 -66274 -152023 24099
9355 431892 157603 99043 -348152 163156 -86101 -68208 155895 -293682 -416685 -375817
9345 -375817 343863 132910 -209393 -197651 -132579 -36433 34519 112695 -132913 -205021 77615
9333 5545 -209099 -195678 -72387 176677 -305934 -66555 97895 96635 -73896 -100709 -17318 173490
9320 13712 -363338 88108 -329625 -390927 -35030 66185 -327112 -65316 -289319 -243612 -77767
9308 67019 -316205 187236 285969 -180130 -273875 -18297 -161921 -136708 32257 168116 -204613
9296 -204027 66292 -24252 -76352 113614 -216287 -69266 -224805 -8677 138953 -71837 -145629
9285 -145629 167178 269129 -14416 -207627 -119378 130978 236538 43106 50272 67341 48216
9274 48216 -226740 -293981 -154751 98732 -35386 128373 -43052 -219402 -80238 -226449 177364
9262 -146250 -177723 144918 -404494 62731 -35666 3818 -289512 -104129 64058 -11265 33437
9250 -290335 -292018 281427 65423 205281 -266055 3949 3190 -129685 -304092 -212405 10185
9238 293529 -26617 -112979 57826 239343 216990 -64922 98494 -54270 363437 96030 -94495
9226 -194350 -193096 252903 163569 9278 -50956 -200528 286652 -115940 -219411 159130 -10044
9214 120141 -230982 -55228 -121753 -89358 -37537 -78202 -323280 82034 467576 -237579 -58699
9202 -42690 -387460 87007 204208 -254383 81637 -5016 300840 156566 157693 -234479 -167916
9191 -167916 176838 -209618 -196441 -199432 -3493 -308322 -111640 139405 107715 61741 -65325
9179 -72498 36468 -81951 154577 102565 10143 -34746 298858 -153869 -206561 -56100 -104832
9168 -104832 58460 -340494 -138374 233561 77242 -199391 -145124 206044 32239 89385 27376
9156 -159993 41976 -167837 -21512 -132258 -67946 -71779 116726 -191211 -284639 193898 -28584
9144 -4547 72439 56581 -31659 -59093 -114161 38370 -116124 -58044 120541 -262748 -41152
9132 -350758 -89806 -118129 62667 -216528 -114785 -45943 -178313 -77081 302703 338294 -90102
9120 -103766 -316929 196060 -231858 -235798 73864 104162 24855 9957 -215697 50151 -162589
9108 19325 -230690 -184639 103668 376062 -470367 -271823 -65934 47789 -45301 1076 218749
9097 218749 -150428 -113447 -180802 81354 67466 -236292 -104338 28869 -201727 31803 44008
9086 44008 41895 -227641 -117634 116540 130443 120493 112594 -168721 -178901 -53998 384318
9074 250234 -31103 78804 -43937 19801 -229227 22322 -265354 -37464 73517 -303040 -49966
9062 -57412 229583 -554683 -173929 -175909 -39453 -182199 308561 -150564 94349 89262 -282224
9050 -279274 171522 -156879 116457 -41003 -107525 -12736 -99317 -168252 -90770 -162597 160530
9038 -450571 -100687 105984 41493 170721 -83296 154473 -199204 156998 -89561 -138173
9028 -138173 -124145 -283796 -261359 -94743 -241822 -38362 -283260 100242 -10869 -31558 -191918
9017 -191918 -120482 31407 233029 -52351 10315 19393 -251149 -127198 -112186 -257531 -218105
9006 -218105 -152631 -188998 -263646 -262681 45033 231018 -253438 85794 -247280 11470 53328
8995 53328 -295529 -23714 -29592 -33793 241383 107347 -24689 -565069 -143716 47071 -22778
8983 41219 77559 47493 99095 -57823 215758 -356711 -267821 -175247 -116208 73611 -444003
8971 327073 -123517 -189848 -86324 -14145 200025 -193804 182733 -257165 159845 63204
8960 262178 -188309 55947 -134800 -310556 154895 -68586 49860 -266875 45731 68231 -87769
8948 20196 222093 297557 70041 -309138 14060 183504 -926 -94765 -111598 -79964 49093 -86208
8935 171443 132274 -364961 -257727 -59577 90663 -136956 -54249 -60279 -180496 116 -204481
8923 -95502 -16899 -298964 -269259 -200266 156146 259004 174621 21709 -69252 141578 140572
8912 140572 93002 170705 -188086 -189964 261972 -268894 -150498 -46304 -118582 209143 188250
8901 188250 -41186 -69440 -291786 -433607 -161289 133848 -59439 313207 98393 42449 -3022
8889 -259536 64023 -144288 40974 45959 -166657 -28527 156508 -140236 76821 111709 208940
8878 208940 -242886 -92926 66997 73635 98459 9744 90337 -189756 106448 2593 -77026 348334
8865 -21585 170415 -140221 -65825 -247350 74670 -484408 -4672 60169 -136522 -4771 174329
8853 -64490 -175150 -45808 -397560 -340842 23802 13481 199894 -30720 88484 133131 -62728
8841 -191075 -16630 -51941 217555 -124189 -96354 21273 -12235 80461 -80713 -288999 -86908
8829 -37548 -57719 50987 -78440 -107777 -79770 78354 -404879 -189853 -20753 264351 68954
8817 45101 -33413 -145335 -156640 146800 129623 -77904 -21564 -235940 236465 9428 11495
8806 11495 5211 -93765 -41953 457688 -87365 -8237 -22537 196531 -243741 -40603 -36462 -12634
8793 392896 176343 38450 9989 -139560 -73969 -213685 -76790 197293 -265228 258774 237256
8782 237256 105613 115932 -315670 -270331 -111419 -52938 -23667 174082 -165169 31918 7659
8770 -114499 -373798 156466 352882 -51986 -185666 -28460 225393 -262372 202345 35455
8759 3893 372544 388451 -195946 -197853 -485848 14214 333427 66231 -141267 183704 -78103
8747 11018 -291154 -217159 -190841 -9008 -48584 307508 -103320 -203321 21819 -41126 57140
8735 -133116 54709 -80592 96744 71486 -92182 -206115 -103554 -11629 44476 26279 27989
8724 27989 -54076 -272679 140046 -102667 -161319 76411 5524 103392 -152321 62577 132484
8713 132484 -391136 -207662 -351 -80753 275117 87090 109494 31035 108660 -102067 207102
8701 -218553 49460 27502 165496 -260842 -142409 -26988 -92919 -198834 121856 -178550
8690 -88546 -119220 -194344 103261 -149580 -28309 39342 67341 36893 -80240 368557 105002
8678 93458 47866 5516 -259169 -217643 -10776 -66014 -278090 172204 2820 -56806 -346426
8667 -346426 -80739 -135110 180926 -31755 -128088 63672 -307904 -33118 236 -137913 -45120
8655 -304708 99232 -83197 -187421 -165913 -336221 -19192 -43546 -31023 -467279 14519 186334
8644 186334 158587 87384 -67907 -24792 15879 12074 -240588 -141254 -227334 180404 -294957
8632 -96440 -154228 80888 -31540 -2402 -311821 -198230 55975 -17814 -172035 233644 -60807
8620 208707 -132559 179879 -120300 -370570 -250019 24660 8104 -52423 -170956 -21162 -86683
8609 -86683 -267477 -48409 -305210 -278730 -245980 88044 312987 35675 -191653 23037 -43947
8597 -151940 13564 -95406 -235385 19700 199993 82535 -70442 -34317 -372613 75542 168831
8586 168831 -5083 -88112 -41106 -52780 -166735 -224763 121984 -110073 -89684 -76575 -52263
8575 -52263 259459 -237641 -61676 -283496 -332975 13730 -1007 31982 145880 -83718 80779
8563 22634 -262796 -69016 43526 68754 -290891 -77924 297011 -103827 111733 -437014 -178815
8551 -223932 136346 -304938 -21260 -283 -1059 -63487 -97176 -20880 796 -353300 -52845 100045
8538 128184 -114001 -126245 27110 -159913 186039 71652 318988 56465 -107524 160981
8527 -436253 39197 -218471 -47983 -212470 67148 -198525 -54270 175080 -212990 166786
8516 171898 -353371 -345104 6543 97652 -434615 -106815 -75174 70865 177851 -215156 -91936
8504 -197066 67063 -149929 135141 -218657 -287234 323817 -85826 13740 315805 16520 35621
8493 35621 37896 -56685 -252356 174673 -136180 -48011 87164 188007 14109 14627 -83346 10106
8480 -135350 408259 -148280 -214613 -347185 187522 -60113 5985 -89413 -354647 -25345 251234
8468 -222664 171696 -38221 29936 -98238 160888 192848 -225492 -184870 94978 -179480 -162443
8457 -162443 -120275 -138430 -138295 7512 -15486 -434507 32970 -306346 -131142 -81836 -181203 -310123
8445 -310123 122964 -57218 -145751 -48069 -3526 -254127 180237 108991 260019 -150078 -283652
8434 -283652 -62843 29016 44602 8661 -447190 -36216 -171996 -166501 -88047 -41553 -234684
8423 -234684 -42868 407678 182096 164132 -155122 -44468 316638 140776 -491429 155285
8412 -175115 -79322 -78847 140673 190484 209555 -213857 -84484 48860 -108780 -56360 5277 461992
8400 461992 53565 91706 -404874 38410 -199101 108412 -93454 -258662 161242 -305432
8389 48520 -128569 -192293 -351363 -53887 78042 75949 383789 -130886 -528 -203823 364740
8377 17315 280 -77648 -156934 90533 44491 13973 -68905 -55244 2775 -150409 31113 48312
8365 48312 257781 135673 -186178 -125627 -136499 120189 -1309 149652 -167260 87760 8812
8353 107195 -136854 233979 62614 34736 -283401 -140320 -439855 -172629 -428821 -278781
8343 -278781 -317152 73390 -20269 -336851 230869 -390530 52853 -54572 -243423 -94683 -91699
8332 -91699 -352751 -324876 101600 -4476 205275 219607 -377839 -342074 271662 -75929 -202095
8321 -202095 -76639 88713 -73427 -101499 -25779 -117488 -155389 73438 -211959 71166 78520 75318
8309 75318 169724 158600 49378 -166144 -319758 73962 236096 68316 -362393 -74985 -72380
8298 -72380 -119424 -153326 -45901 24531 -142029 19418 -351181 166647 -226691 -100346 52108
8286 72767 52434 -231441 50033 -121930 134479 -144807 198527 -60056 -82378 281986 -186918
8274 -293745 -120798 1580 -285350 -99149 -233364 156077 -13518 -173041 -234521 -97582 65366
8262 19523 -214488 48715 -142000 -310279 -215103 63538 75066 34654 -115205 -244609 -97274
8250 -86794 -69879 -117069 -26068 -119683 -125757 -137903 109046 -477491 101962 -279460 164527
8238 65303 -275120 -449954 -312380 303487 92092 -134402 -210847 -82583 -23097 23171 -129444
8226 -88444 -391880 111972 52220 -229114 -242585 -175458 -213727 61516 -327543 276091 -90336
8214 434734 182438 155620 88593 -68423 137047 67245 -440792 -21116 -53229 -6660 -156609
8203 -156609 64067 -84279 -6586 -110061 -285200 152897 -198695 3518 43026 -110426 192436
8191 -248787 -51318 -1800 -98247 9825 -222951 -160638 179497 34270 -131938 -189761 172989
8179 -22746 158142 -65739 129111 329725 1637 -255395 44984 325449 -238580 45183 43155
8168 43155 -171372 250645 133628 -38170 215540 -346304 -173993 175292 -335720 99742
8157 -186453 86516 342834 -260919 -134224 28033 -205452 3131 34446 72291 162129 -255767
8145 51668 -11885 1838 -181827 176139 36274 44024 -52496 30881 -68370 -587363 -74218 -39886
8133 -39886 -226805 41707 167846 -84381 -39512 -79807 -110833 142452 -92804 36373 113189
8122 113189 57698 -210644 -56866 -116548 39514 5697 -5983 -360848 -64160 19660 -48148 71398
8109 104474 -113582 253373 -10597 8723 -240674 221636 -13781 -99175 13928 -25981 -111873
8098 -111873 -44364 -22153 -38799 519821 -195107 -20279 58821 -383223 75653 141906 86903
8087 86903 272077 -72906 -203124 73580 310262 -233890 -5409 -13075 -129242 -10988 264592
8075 -6667 146599 -74104 29480 73587 -376057 286674 -36066 196830 223983 176567 142683
8064 142683 181882 -52277 -270889 -97381 -240753 101806 -200056 -105615 -202663 -202935 19001
8052 243727 -111386 141560 152292 159812 -142297 65430 -190525 -290067 171045 -84176 106809
8040 -103802 -306791 -12079 -5009 -196744 278671 -446048 -200192 -57406 -89327 -457813 -118935
8028 -92026 62590 -299059 -137764 199216 -118992 -153979 -198369 2261 -251290 147808 36345
8016 15101 -365608 63159 186623 -111811 -24825 49247 -66487 -186315 -74786 90363 61850
8005 61850 6861 -27084 -118576 -5778 -371931 151679 -89935 65065 -48694 -95593 -74396 -133508
7993 -133508 -152766 46699 63662 -135994 -101745 -15294 -117331 -18209 191638 -160466 -338494
7982 -338494 370819 -135707 -260151 -206336 -136972 17898 -164294 -166206 -184998 -333557 88981
7970 -337919 -33848 13441 10949 40030 106433 124950 76410 -99731 -186649 192210 -14454 7774
7957 -218027 -212395 63968 168657 -236578 -297756 -202790 -67205 66060 212599 280947 -104568
7945 -229388 224742 229529 172836 -58880 162175 -13838 -89929 -40264 -265940 -121143 11473
7933 247918 -269468 -230220 276022 103081 -333608 20025 106728 99347 -281975 12624 -161927
7921 46085 -89100 -135920 128882 -89395 -66535 484366 -274779 -344884 -159868 -56926 -38996
7910 -38996 -62274 -45285 305691 6559 -327156 -394216 65679 -220286 72384 82867 -209015
7898 -374814 47828 -198732 -56930 -117026 52605 159195 127216 -96726 136652 60932 181251
7887 181251 50498 274691 -267546 -83978 -185859 245716 -1930 -385040 -8463 -144953 -242550
7876 -242550 43638 -87198 52777 -185526 -232204 -58892 -213844 19629 -192496 -250148 235755
7864 -320964 19005 33096 -78718 -125680 354651 -2400 301287 90711 -217629 208726 -55295
7852 -30140 -118928 -32626 200166 -353015 441541 -59790 -226098 -326632 -29034 131740 281115
7841 281115 -329711 -212253 -242943 208642 -92673 -8174 231497 89608 -160761 -87514 -67430
7830 -67430 -50560 -140327 61489 223361 185082 256262 -91286 -49090 -26048 37800 90651 267847
7818 267847 -103313 -24113 113549 88770 -346364 250688 -106305 -4112 99811 265738 -15954
7806 64898 19307 169585 25476 -311051 -99989 189964 -194733 -178636 78958 -254394 -241997
7795 -241997 36030 54317 -91926 -177772 85472 371045 -88812 244866 21690 -11250 -91801
7784 -91801 -353142 -10220 223568 -227913 -365810 131523 115265 22191 -303526 -478534
7774 -478534 381764 -144879 344336 -138733 -315423 -340117 4404 -175842 118325 -165416
7763 -76116 2006 93714 -90437 -100682 -117715 301403 82756 -231822 68574 -133303 -191667
7752 -191667 -103493 -48543 -320638 -67262 101356 -331042 -204867 121100 -140435 -341965
7742 -341965 -9588 146800 -369448 -364007 -13921 -287551 135666 -174533 50542 157103 -127886
7730 -83338 55247 356959 -90417 85989 167140 -54107 -25606 -1506 -128224 102569 -145668
7718 -43907 -214117 -268662 -15608 -136975 33987 60010 -40575 -279360 -111584 -187010 -191401
7707 -191401 -113707 214316 111429 85016 -53129 90408 184161 74453 -30997 -421623 37529
7695 261215 303143 -177342 168480 -306329 -227635 -157483 -107479 -3189 -119328 41624 -54479
7683 -180835 384302 278125 -245548 -163000 84657 -243783 -73357 -209149 31626 -231490
7672 197275 -115979 -46944 4279 80446 -111921 -109321 313756 163913 -212425 35339 -148978
7660 -250566 865 102687 87128 -28423 -135193 -307535 76276 24240 -237662 76150 -269807
7648 -149464 -210868 -170263 -194057 -186193 59867 -155984 87441 -169725 181724 179858 -60503
7636 -190249 -147289 120889 -7056 -44714 -40625 90436 83567 -100077 198297 328121 -157167
7624 -468150 31803 -160333 69864 18333 -89867 -100914 -315135 -198452 -191813 -136496 2865
7612 281709 -333664 -359208 -168740 57162 52375 140932 -66701 42506 -161343 -350751 -26410
7600 -458020 85564 268856 -58160 31400 -4601 -131420 364232 119666 155929 -61200 -144448
7589 -144448 -142362 -14013 8541 -100600 95317 174097 -82198 774 100197 -271684 -55148 38185
7576 16791 209195 256269 -89459 -56590 78634 -80374 -60616 -38753 -65883 7599 -72885 -86892
7564 -86892 -305094 154632 -22391 -293160 64117 258811 -132102 11892 -80829 -271239 207710
7552 332783 78383 -321923 -120641 -24001 -190307 306530 215376 -202504 -35699 -160879
7542 -160879 -180849 205105 22636 -117078 -92234 69423 -278606 73425 80374 57064 -195436
7530 98727 -101968 -2884 -167563 149046 16656 -6992 -149898 -100480 -59783 138306 -245370
7518 198222 -308074 160585 96386 140656 -157164 -31262 307249 156241 -165523 -134821
7508 -134821 -184622 -33010 -234613 -269945 -26295 323105 -195981 33247 51529 -197832 -103976
7497 -103976 7400 55302 -367579 -12421 -105181 -200876 -433177 31880 -71250 -67504 -199187
7486 -199187 -89467 301254 63518 -185576 106999 35915 90003 260320 37703 -155971 -275453
7475 -275453 -80630 -7717 28567 1249 254152 -307250 395892 37407 150190 38254 -79923
7463 13252 -57436 30620 -19766 -95022 13931 -33113 286553 -27910 80876 -86414 87482 -250172
7450 57838 -259942 -341185 18505 98467 -140260 125857 -74409 -158656 -102765 -120420 -129892
7439 -129892 -122181 104930 -81025 -462564 40388 206475 -177035 233601 -397284 -174868
7428 15609 -72906 -22277 -183888 147708 33848 -108296 -93845 88683 -75843 -71532 -173165
7417 -173165 -190443 -48461 209191 159895 179846 -551343 346183 125842 18124 -156610 232131
7405 -111662 -153812 -244034 -66836 -225217 114265 -134990 -478370 -34858 54907 -20557 110136
7393 34557 -170896 -5644 143093 42830 132120 -132727 -6914 133043 72865 -301522 138027
7381 175301 -92139 -188468 -207058 -117403 -29400 94987 -90864 48698 -38794 30801 2706 -96066
7368 5106 -201006 -256853 20115 386226 399396 177581 100261 -462807 -34306 265014 26784
7356 201217 168611 98468 284222 4853 228310 222387 25571 -49333 245301 66548 -220163
7344 207115 -123614 -53170 7851 -58999 -57197 230148 56655 -78973 -76210 -395661 81525 -229793
7331 31665 -265735 47374 -75039 121981 45980 -80712 59621 364808 -63875 14417 158037
7320 158037 -46985 -159029 -53248 60867 265095 -275124 62892 418788 91387 -157878 -156453
7309 -156453 -72254 192953 -29109 9604 191691 10363 -161540 74392 76427 -43257 -119248
7298 -119248 -64198 -175166 -112119 -315299 42226 106645 -398470 179533 158519 -208149 -50991
7286 94946 -742 -184055 -232184 -188057 232430 151537 62752 -63925 92377 -159267 -103129 -23033
7273 197170 -194479 -134921 133433 -286733 125685 -213366 -32615 6090 51710 22060 115538
7262 115538 171964 -290940 186990 112637 158666 173629 29695 -56797 -51438 39821 -170156
7250 -156915 28118 -111788 211033 -95378 -22279 -60358 5909 -181118 193041 242545 -301764
7238 -443156 152446 4191 234511 235422 -15417 -81216 -198568 371234 -161076 -206263 -373202
7227 -373202 -257722 -164986 -208781 158783 -264274 -387311 -359318 200379 106977 -20967 88347
7215 17438 -166610 138605 -67631 -135778 362301 61806 19846 34962 -62293 -326936 32910
7203 -59636 -34431 -162411 274047 -223755 -130378 70715 12617 197470 -174709 -130336 158038
7191 -94428 22176 -60596 73469 -75319 -264364 184664 62480 18976 -221572 -63306 259098
7179 111931 7288 354423 4459 -245363 71950 -277778 -275345 119560 -54035 -67722 50122
7167 -6499 25462 -116836 -250972 -128542 101908 -143829 -148224 14798 -154067 -291946 37760
7155 -236733 -14969 -98679 -11967 -42404 -201892 46795 22590 97561 22822 21055 58178 7858
7142 221045 -35238 91586 89453 17649 -120134 43087 -26832 35960 -75861 -147869 -125313 -203934
7130 -203934 -62242 -146367 -95762 228316 -156714 492237 -191927 12247 -21798 -193306 -20629
7118 32776 213882 80637 228180 -63888 12829 105156 91186 182454 -159282 93053 -89773
7106 -29509 -242275 24255 216844 -229468 41534 24221 -99130 -164395 264041 118776 -147920
7094 -234947 -161438 -112430 8947 -13767 155928 -81283 -174988 71757 -150625 -143449 -69255 177985
7081 165804 330007 52735 -2162 48072 -1788 -180373 209213 62764 123252 70131 -124265
7069 41206 89523 -257424 199657 -22949 -121267 111794 46578 -195638 143754 -287436 140276
7057 -123987 6439 22251 -297461 -225256 -107927 -46421 71927 -143886 209187 158460 -175273
7045 12083 -125168 97507 267371 -314130 -80566 146758 167932 28319 108749 21381 -375787
7033 65979 155651 -235625 -82747 -271609 123571 62033 -209104 8742 -73897 -173425 -271118
7022 -271118 53091 -93738 -189835 19967 -236426 41086 -28616 395023 -33424 -113904 -145040
7011 -145040 -325035 31885 93318 128738 -44593 -337770 82266 -75378 -76033 36206 -50730 -268111
6999 -268111 129877 259802 90739 97578 -198135 -157702 -171863 -101549 -164036 -259880 -10334
6987 -138608 -423043 132760 -277589 -191212 -109899 -48652 -124543 174172 149100 -124270 118635
6975 -148982 -186171 55132 -374542 72466 -342036 253846 72053 105868 79432 -272939 192276
6963 68936 190974 -5243 -348263 -138097 -53439 228261 257354 36913 -100557 171718 -140635
6951 144872 -109459 243280 244171 -191865 -30653 -332492 -11568 -210677 -227151 -131255 -149005
6940 -149005 -100800 320522 -262389 118114 81649 100975 91721 -59294 -6855 -47152 31530
6928 -89215 320101 -150759 188949 -196759 -38961 197324 -192705 -53140 362688 -267875
6917 -108863 -129196 174853 -93689 105367 119791 -158954 -267996 -320124 -171762 17715 73741
6906 73741 23499 -133718 -51717 -13864 -71343 140871 -142219 -38668 150247 109400 65173
6895 65173 227909 57997 -65313 -263807 -174093 26789 128773 488428 -7734 116542 245101
6884 245101 12187 18817 -23610 -154887 -148407 177942 22215 48503 184008 -7127 103613
6872 -74889 436925 -144393 73116 -82887 -279294 52975 47852 39428 -22448 76950 156788 -281156
6859 -202190 25203 18157 -161763 72182 32397 -157199 -278658 -27784 40599 110486 -330215
6847 -90552 -180613 -308243 -171421 -129212 -114224 253084 209626 -39171 5203 -94043 -26112
6835 -236212 181324 125594 -42700 118748 -256888 -42092 54661 -419341 263626 -43955 -307282
6824 -307282 345949 -47181 112636 208127 -80044 152124 30807 276 -103252 -261490 103218
6812 137061 178743 -249783 -92099 -221037 -27175 72537 -189404 145986 -200442 -204652 -47123
6800 484 -145995 65922 71028 -28869 -225249 172769 -207815 -218135 -39432 131958 -21473
6788 -259450 -106146 143042 -37050 -135003 34999 278650 -28343 -125348 -181560 -79575 -101279
6777 -101279 82993 -97166 222108 151260 -188932 -95814 -174041 157612 183506 -354426 303740
6765 249870 170054 121170 -170808 -57906 14415 -29979 267421 -24559 334210 18516 200782
6754 200782 -115723 -155418 -878 353994 117425 -192173 -239073 -402566 -172153 138245 -171776
6742 -357753 149845 20784 -306220 7511 159927 141347 -324217 -227564 55488 -98101 -264455
6731 -264455 -267070 79681 163812 -144239 -264770 -268803 -90246 -147291 -96735 198989 -66519
6719 110857 5387 185693 -95396 221581 129594 1368 143410 14507 -222823 294652 53681
6707 196566 -4391 -73475 -185138 173628 354070 136338 282333 -229760 -27924 -1222 118810
6695 -12484 -337368 -195705 70228 10353 -138871 -152866 -140261 -376410 -45658 -66012 -26220
6683 -212357 197494 127646 -252520 -153787 97714 4765 -76332 207397 -28756 -353778 187
6671 -131578 -99195 -225610 -268568 -244562 -11886 31067 55543 -336609 231200 -144869 135195
6659 61377 -58680 118230 -74671 -202970 151765 -40293 114564 -78227 205377 -150293 25846
6647 -64728 46387 -359009 215520 -89547 -37124 -49323 84645 -22105 -332085 -32701 -70767
6636 -70767 170498 -271666 -279939 210795 29175 -90181 -117045 -98273 233324 -468771 -135537
6624 -329279 -44278 -3604 -48116 75880 227349 -67147 85898 291040 -44526 147263 -318310
6612 323125 142544 -52632 313129 -135135 -19325 229146 -9328 -38390 6931 140965 -13064
6600 6016 86216 55885 -57522 61819 -148629 -123251 -300776 79200 -24347 -463377 110655
6588 167832 -236062 94440 -264742 22962 69374 -74076 -54930 160246 28196 9815 167366
6577 167366 -38768 -144522 -142438 167461 -259066 -47524 65707 -108216 37665 150598 80109
6566 80109 -232054 -45333 178787 111798 4943 -85525 -10048 -136307 -199123 108176 -19 -15471
6554 -15471 134225 -94444 -97962 147624 11629 -29123 104631 -153589 -60517 -304419 108555
6542 -10466 105793 44201 332464 434894 87206 102197 -167426 257244 152859 1127 -27977
6530 3537 87689 -233994 170474 -203833 201181 199769 -13318 7576 -166265 157308 296132
6519 296132 -266355 -240852 9862 -144907 -176801 -22349 64378 224886 215575 146055 337845
6508 337845 -22448 -58717 -225430 88208 -20037 -181924 -274665 42595 -137592 -242000 -30094
6496 102600 -227322 -22194 -182694 57150 204910 -38735 123469 -45910 -124408 46791 -210574
6484 46954 209247 -7132 -128710 171877 66814 -239216 -190877 21857 -226362 -316219 -278977
6473 -278977 257465 188160 -140382 55710 55774 -202898 233670 -287677 -13884 157611 -183421
6461 20654 197521 -56480 109228 -29531 98125 150068 -16438 54660 -24018 234856 28157
6449 208627 -175692 212315 205892 50747 -158885 172822 90886 92694 146124 -4345 21482
6437 95131 -102183 -105302 6573 130269 -71359 206041 135393 63560 92516 -174614 178645
6425 -17677 121884 23441 -261442 -66967 -206187 206418 -161776 -28563 -10979 169750 -156348
6413 -359006 77318 -205888 -223863 59387 -118596 -390357 363044 29353 -145861 -65796 28298
6401 -75257 -45712 135153 -129648 -315771 -9124 54057 -180974 207275 -221050 -54374 -83968
6390 -83968 -60810 91659 -210254 292620 61679 228448 -24953 -222176 -159457 -216272 -180209
6379 -180209 21402 114582 -335575 -25655 -364723 -17488 371709 -53516 -24999 60374 239638
6368 239638 15549 -113354 -162007 149458 169962 67996 71962 -50066 100664 -91658 -159498
6357 -159498 -123771 109686 -339425 -92363 -123394 -243763 -364 -275536 249591 119864 -179053
6345 -109846 -65258 -77050 133549 -6357 42540 -2105 66786 78120 -6804 75659 4275 84745
6333 84745 120193 98629 -112048 73865 -9584 -529760 -282066 206538 145218 85808 -104215
6321 317177 -107480 149 -178486 97606 -21114 -81265 273723 101487 -165460 -332463 118769
6309 23884 146600 111332 214035 316892 35370 201753 19246 117268 -106211 -150228 -244749
6298 -244749 505762 47903 89588 22569 -108062 -19230 -24323 -81113 -289377 -264829 -217619
6287 -217619 -118791 -293647 38161 214223 -292147 85113 -280170 387602 371609 -34138 -229300
6276 -229300 -353519 -49650 32164 169279 -117157 397082 -56562 44454 65753 1011 -75263
6264 18629 -120793 135096 57535 -88562 242045 -79083 2192 -168835 -28619 207315 65750
6252 319778 62997 -164816 -175662 341679 -298810 1224 152406 147984 -227170 -126964 -355762
6241 -355762 72380 395800 115936 -61017 -44096 -154164 201578 -332879 104715 148284
6231 148284 26091 -266573 15935 -96626 84542 -319924 52165 -108752 -365579 5491 -110428
6219 299301 -147389 173159 58635 319719 106408 -48446 -107351 -140380 -153820 6564 190096
6208 190096 39934 -290178 152905 44734 160011 -114800 -231504 -154968 -377146 307379
6197 -203236 -31617 116566 -75636 187953 30326 203472 -78866 -26896 -234591 397665 -11430
6185 -229216 100685 -140855 174385 -64834 -205657 52166 163929 16944 -121713 -278243
6175 -278243 127665 271944 394469 -263782 128500 61930 10694 -172405 352082 -203475
6164 301579 353813 -168838 -21499 -53208 -183618 47510 312429 -236736 -119530 -66605 -322690
6153 -322690 480249 -245273 -238435 -1378 -3595 71941 58866 224533 -149505 252748 -128887
6141 164568 -94924 178646 -231201 -367815 144641 -68593 -33905 114963 58266 -25688 215470
6129 59827 122693 -45347 -21737 -391859 175304 -139001 -157239 196371 76811 136718 -205653
6117 39659 157225 -27994 79043 150038 217691 -186408 -216626 -102661 125024 -145343 5268
6105 -141524 -49410 216438 480329 245021 -82743 -7943 -158337 390176 -191981 30906 180206
6094 180206 79864 -90868 -27961 -322428 61141 -65854 180510 42096 66623 113766 65273
6083 65273 -14302 -9693 -126894 -25328 5241 216548 -113828 -28202 104583 -26480 -159431
6072 -159431 4523 -176240 140317 -129770 100604 63901 152710 -116771 204664 400221
6062 400221 98840 37884 -48955 101385 -2207 -251226 258023 -94372 -33993 279676 99403
6050 23420 30242 56231 -116132 -187145 -83613 -206201 60842 -258228 185731 418294 -76008
6038 11225 88586 -139806 -104257 -57900 -140622 60686 -23173 72056 -164246 -125355 -186239
6027 -186239 95497 -163802 41165 -71188 116700 73609 135095 -24110 118885 -46959 -104370
6016 -104370 -62105 -108617 113029 251468 288758 -266774 -15926 -36379 -96086 51945 34296
6005 34296 -409582 53756 50282 197326 71458 -458135 109779 -71602 -139661 204740 -251901
5993 24575 6434 -108702 237279 41917 -319122 114166 -253644 -64058 56284 79203 173237
5982 173237 127159 398363 127537 -149790 -103010 -59000 -205930 53933 -322621 -33962 -127981
5971 -127981 274696 284963 -182772 23908 127196 40662 -44429 163168 -127342 -110540 -58231
5960 -58231 -17908 -29141 284213 -128517 -67504 -32029 250789 -34154 -92066 -123517 98333
5948 -113118 136847 -110051 79412 370205 65607 205122 -343752 198482 192599 168030 -46736
5936 -116181 84358 100996 226410 -26100 88244 -132454 137164 187663 348454 -172505 29603
5924 114403 -362646 -111764 99761 -274740 -57605 24609 -206415 -158903 328357 -7082 63474
5912 82933 15583 80382 -86032 -30059 37742 32826 53689 16268 -198085 -217189 -328288 -117905
5899 -33139 72869 -64170 43888 239491 -182716 64094 55422 144752 -166995 7311 23109 63926
5887 63926 1835 156033 91388 -98336 -44991 117372 -182652 136982 138757 289217 -34980
5875 74873 213295 -21058 -277786 157271 158971 -83698 -185879 203850 -45687 -265731 213430
5863 -81381 -98335 -156174 -160507 -297206 179869 263371 -38853 213676 23886 -132432 -157126
5852 -157126 -54521 -140031 70740 -95388 -68988 -34393 -57359 -153040 148781 55964 4034 151183
5840 151183 -286508 -188578 250222 58487 -242756 78248 154617 146160 258281 23162 67384
5829 67384 -210604 110888 75425 -213653 95905 -11156 130926 170577 -135268 29081 134594
5818 134594 75318 59936 -317480 271769 -279383 174488 52792 -13930 268018 -10876 -34203
5807 -34203 -8378 -190874 -119017 -40919 -182110 370650 -263018 -145255 389458 46432 161001
5796 161001 -140893 145272 -106053 -179159 75540 -134946 -276557 120219 15605 -296867
5785 -238943 113836 126157 -33295 -160426 70354 -342685 24200 26623 -53366 -111404 280453
5773 145958 160164 155996 -275673 366347 -50120 330817 65902 211474 -121646 25323 330721
5762 330721 -181997 -264447 -408393 6955 21163 -207327 121912 250063 -145232 -167259 331986
5750 72617 -139730 173916 261639 -101776 -85234 -175377 -185722 51120 -176212 -39269 41366
5738 41073 299544 -193869 -43972 46074 -232649 31455 -183674 -132219 128803 -95780 178729
5726 -97294 321702 460934 -221723 77614 133863 -329668 317813 -61426 69592 231987 -217901
5714 47504 -127159 -260410 351486 16607 194730 2719 82600 -82191 -105555 -65958 277551
5702 -150118 -169099 -259996 -281000 -42564 30971 10356 207589 -210415 -142892 56476 27351
5690 104293 123070 81524 48000 -44140 270885 -294501 -122719 -47543 176061 184120 -6992
5678 -6528 65728 58587 241461 4273 -3883 147217 120414 -96145 160834 125619 -307713 -49806
5665 -33505 52971 -150283 39271 -193802 279791 -56937 -210346 -110475 4411 35416 -10279
5653 -186216 7688 169336 -320538 -200096 -131461 104743 376176 33270 -414308 -104081
5642 56373 -250489 268914 275281 69170 -205952 266570 221165 214562 -70980 43603 -33000
5630 -180478 82789 129703 -222579 -56284 -44484 358295 -201803 -211444 -60113 -75240 -178922
5619 -178922 -349869 174738 214109 -10428 87188 161842 -115228 212783 20787 -47646 52611
5607 221001 -14630 41655 -212286 -110779 -186775 -23919 -30523 231800 131364 -157129 -227056
5596 -227056 -25933 255576 25002 -288285 -86075 150889 -101871 -154274 -122385 210869 -2929
5584 -19434 119355 227711 -109533 -159632 160384 259133 -197705 -183856 355313 -160279
5573 -248593 -83899 -36459 198541 -18822 78272 -156465 -291946 172119 -263375 125489
5562 -96987 -45391 -322484 -52926 155296 -166592 157440 56277 -16425 90577 -56710 97719
5550 -81261 108429 -340397 -170555 -147410 167462 -41891 10122 -140139 233970 260988 -113609
5538 145178 139130 -31795 -162992 325032 81483 21348 67926 141668 67492 -67555 -302547
5527 -302547 210264 -36910 219571 99899 -33590 -162296 33660 -18826 19658 337680 321291
5516 321291 250617 97189 177247 -321879 286986 -273103 160000 -73221 -36581 308910 -169046
5504 166983 -9455 -220990 -5583 139025 -263368 21595 70277 127658 198702 -319477 -202487
5493 -202487 64352 -173851 6232 68686 -53809 -129784 79115 157223 -485707 125319 -145403
5481 188170 21295 90285 17987 -234567 -49215 -315291 -16461 -39859 294189 135940 -40552
5469 59878 184556 -282008 53585 277620 -240200 118126 -101587 215688 -3469 26441 38197
5458 38197 14272 66829 -72599 48612 -38544 142860 -123002 337726 -46247 149260 -147249
5446 -302362 -13654 -122072 -57294 283732 124150 14189 292356 118333 64625 288414
5436 288414 149529 -88267 53263 222610 -27741 -148017 15381 -132906 91152 217691 -303853
5424 240952 -14196 86353 36577 -78910 -74856 -38994 50835 120687 -51239 -60844 343618 17998
5411 178480 140853 320109 -40711 -176557 -99837 171281 -42758 -453186 229805 -85871 142073
5399 140052 256885 108482 155320 -127225 153235 104262 -48004 155199 190424 -205799
5388 -453514 -116520 -36905 289470 44118 183355 -156030 225374 -92484 -52598 55256 108773
5377 108773 165232 111110 -8539 117824 -280230 208361 -316448 -70971 -145732 11798 -331141
5365 219826 33056 41243 -159906 355276 -43054 -171727 -1381 -18626 29709 -110458 614 196873
5353 196873 160797 30171 -82768 -61931 -38136 222776 -329795 185579 323987 170551 -236521
5341 229238 -201698 -444307 -35147 175820 27150 15686 201049 139316 -204605 -223018 -50824
5329 -288011 57183 -171481 -193451 -3743 -50004 137837 -107521 23425 -146713 -186901 105922
5317 7032 -62378 -43930 71771 -25194 138685 205191 -190930 -138948 57588 37621 -108529
5305 -6987 326884 -89693 -213844 -70384 548191 -308043 21191 -12243 291899 -148405 170011
5293 -34993 113608 -336682 -2582 303770 -51246 106603 -202183 262152 253650 10565 26146
5282 26146 -53231 -196107 -198805 -43988 141305 65329 -213643 168265 9413 61641 37599
5271 37599 -108673 187178 -257329 129819 -98206 120774 85254 356518 316868 -57851 39677
5259 -73289 -11479 -46165 -17094 -227902 -306242 115962 -285540 307727 203102 118086 115504
5248 115504 -76362 1348 -22672 -92228 74762 -98776 50943 310776 63061 381543 -37221
5236 132465 149055 229984 152961 120975 -125208 156708 62184 120383 63969 -140648 64393
5224 -64499 80909 -239435 317258 291846 -76091 -242700 199029 96922 361914 115569 -11689
5212 -30568 150750 -458805 -6515 -300775 -164691 181457 -289398 -127339 -223135 13649 123897
5201 123897 534116 468595 -224250 48363 205711 214298 26869 282277 48570 -89623 62424
5189 80394 37639 -135669 24572 -110021 -93271 330880 -114015 68695 -190961 439671 -207051
5177 -28 -50651 42724 -70916 -37629 -129843 433393 -181460 503874 -204664 -63688 39134 116608
5165 116608 4319 98646 146672 208044 -149121 -63648 -239385 86252 131473 89682 325038
5154 325038 -190 -235155 -59694 199456 155366 -94966 -193691 -100506 -71954 -69411 -247691 127811
5141 113409 -67168 224612 73959 -345229 269175 58240 -69005 -211970 -278169 -129168 -7324
5129 17413 170508 234027 85096 182206 209065 -119052 295111 111943 -108475 -315938 -115382
5117 45098 -198616 80540 246632 290376 -204022 -50138 -221577 453239 42788 -264683 -48508
5105 33080 -94748 -46010 138694 66838 -244803 -47185 2964 -317818 -220830 153078 -98412
5093 113737 -8515 100976 14229 -256209 283855 130924 252638 123766 131699 -65333 -179969
5082 -179969 -262967 -248262 -127762 388066 191827 166910 90539 93665 111816 246909 -144537
5070 95266 -60393 31341 427120 -192414 95799 110954 -145713 -2274 -164566 285563 -126814
5058 81693 242380 -8544 -55249 -182375 51792 132748 -8419 -123114 -94838 160797 260145
5047 260145 -181798 82500 273753 124576 -122496 -64727 -260900 97545 154241 -57075 92327
5035 143260 -63954 -130921 -383228 -79663 20973 308241 140875 -162735 -83291 29085 296805
5024 296805 64857 33883 -70539 -52161 -103912 246972 97938 61088 -241064 54628 -37970
5012 -25523 21182 -66227 -58158 9714 113710 444515 -344536 -195434 20743 317134 -471575
5000 153728 -286531 12208 130991 -229270 -251203 60923 77599 196124 142125 127357 50230
4988 172684 -69114 -54228 195159 -209071 -235699 -136400 14348 -163681 113150 -132201 -7497
4976 405804 -157716 308343 -185507 21044 -5338 -126220 298764 200277 300856 187692
4966 187692 200546 -76653 -77899 96511 -58907 271144 109325 -148073 -105847 -197574 125312
4954 -17313 -222511 -22671 -109710 215433 121501 -83774 88173 508433 -210655 82800 33307
4942 183531 -195344 -110878 -58441 -70624 -98469 64212 2225 -96709 -48668 225877 352053
4931 352053 -39413 -7911 -125948 254588 80395 57829 -272982 -57877 148983 134968 239205
4920 239205 -110120 -49853 231452 -160629 168644 38026 -46433 231786 161637 -102827
4909 -7248 -279029 -163148 -408561 3505 -245147 34427 54034 -61506 -186000 -74185 174414
4897 -24728 -82255 84187 -169468 253286 110016 -350686 191527 161572 -87362 -92107 -16672
4885 -21952 35386 -166305 100973 302869 139722 130605 52613 252568 408284 243860 -10945
4873 -80940 236118 -355445 174218 -209653 54569 -218506 -182597 51767 -92616 173045 -5590
4861 177886 -55197 -221720 -51557 152757 1374 -154161 251345 116648 30686 -44577 67248
4849 -123963 152160 39586 89823 58871 -100791 -140633 -258333 173481 217537 49921 127785
4838 127785 105992 154945 139350 -191335 -72273 -173467 304245 -147635 195276 -76477 237864
4826 52999 -164763 -19427 -31092 -13076 -168639 -74700 -14334 -151876 -51038 -275322 8221
4814 -67130 -434151 -123210 -59047 105360 44796 105896 -148396 -74162 -269918 61687 57814
4803 57814 -274384 38551 109225 428654 26209 -281853 -69449 58278 116235 85096 202686
4792 202686 143293 -279889 90322 -229691 -224108 41259 -114 -223483 27210 -403852 99578
4780 201084 297044 28756 -18515 154099 105796 216040 -259177 2075 193482 86864 17738
4768 -31938 -70785 -387557 37824 -142367 68622 -85839 48852 -100369 24104 -285522 209335
4756 -11092 -31755 37661 -10484 -100351 2516 92385 54270 36619 -28269 -27436 -95440 -110312
4744 -110312 47520 -98614 17119 -360466 58904 73785 -262539 139237 -190737 222831 121379
4733 121379 214135 -110503 -47103 -198321 -18370 -124085 -21564 89838 232641 45260 20356
4721 31431 77376 -221617 108632 37779 220126 254977 26461 249137 -13353 -95802 349618
4709 185155 325019 -37196 -32982 237425 -73958 110543 134212 -28339 298749 8521 2218
4697 -120701 119351 -201277 256406 -281149 -8955 308206 136103 64333 -13066 -204696
4687 -204696 -44372 -160880 209197 285552 -128071 -64200 -287648 -95210 333551 -50945 -191852
4676 -191852 243896 143169 149422 -27532 -98443 17879 8508 -10700 35604 255222 -20713
4664 182382 297848 67418 157409 63510 161356 -377778 -100791 -80446 156263 -244254 -21443
4652 20848 -215097 14585 -36037 -384625 38733 213102 -129441 -150967 -280949 192508 -328020
4640 -378405 51731 147273 -43536 -34342 7838 -150088 25285 -95575 73968 -381574 162843
4628 -13366 204894 -42805 -165728 -41072 28429 113525 109809 136869 84959 105241 -110138
4616 360682 65196 95863 125328 70876 -60143 33223 -88841 233846 108703 -204162 -14509
4604 -54939 71346 -60577 -49882 44322 344801 191282 -172350 117994 -308864 136311 54811
4592 92352 3190 -65134 -133647 98868 130543 -189946 -34899 -17813 296485 112305 -50924
4580 169971 -99801 183441 230913 102208 41022 -149357 -97168 -35806 -5829 140666 31984
4568 102928 -481899 63072 -101003 -46170 -171044 -55957 -209956 39764 -125723 -79170 -247095
4557 -247095 -268894 340583 147158 297469 142729 -84350 42580 200650 156394 5028 322830
4546 322830 71320 38370 163237 -73703 -68589 127818 -23625 -132591 216993 -48108 -52262
4535 -52262 -25642 145832 1228 132307 -208008 50438 -124454 -14583 102692 156468 385566
4524 385566 -7062 71570 -73479 -132180 157966 152295 182371 -295336 28101 139045 78195
4513 78195 158142 20708 -227037 -100427 67619 40579 -73993 -101480 117251 -87064 -173843
4502 -173843 -166561 -139510 -48699 -18129 311411 -61854 -15248 1897 -32423 21672 -315541 -63353
4489 -257490 155679 1976 53410 280263 -1469 -13634 249253 -109560 17107 -76550 144760
4477 85537 64544 -100328 -175816 -116087 122418 219917 -125166 -516899 181254 108266 -320024
$$ [...]
##END NTUPLES=NMR SPECTRUM
##END=
