##TITLE=AC1526_ROEFFECT0006_8213789_DTOzV0TmO8
##JCAMPDX= 6.0         $$ Bruker NMR JCAMP-DX V2.0
##DATA TYPE= NMR SPECTRUM
##DATA CLASS= NTUPLES
##ORIGIN= BRUKER
##OWNER= Administrator
$$ 1.72 TOPSPIN		Version 2.1
$$ 2014-08-04 15:51:28.723 -0700  Administrator@X
$$ Compression mode = diff/dup
##.OBSERVE FREQUENCY= 400.02188249412
##.OBSERVE NUCLEUS= ^1H
##.ACQUISITION MODE= SIMULTANEOUS (DQD)
##.ACQUISITION SCHEME= undefined
##.AVERAGES= 64
##.DIGITISER RES= 22
##SPECTROMETER/DATA SYSTEM= spect
##.PULSE SEQUENCE= noesygpps1d.comp
##.SOLVENT NAME= COFFEE_meoh
##.SHIFT REFERENCE= INTERNAL, COFFEE_meoh, 1, 14.97781
##AUDIT TRAIL= $$ (NUMBER, WHEN, WHO, WHERE, PROCESS, VERSION, WHAT)
$$ ##TITLE= Audit trail, TOPSPIN		Version 2.1
$$ ##JCAMPDX= 5.01
$$ ##ORIGIN= Bruker BioSpin GmbH
$$ ##OWNER= Administrator
$$ $$ E:\/data/COFFEE/nmr/AC1526_ROEFFECT0006_8213789_DTOzV0TmO8/32/pdata/1/auditp.txt
$$ ##AUDIT TRAIL=  $$ (NUMBER, WHEN, WHO, WHERE, PROCESS, VERSION, WHAT)
(   1,<2014-08-04 15:51:23.285 -0700>,<Administrator>,<X>,<go>,<TOPSPIN 2.1>,
      <created by zg
	started at 2014-08-04 15:39:53.577 -0700,
	POWCHK enabled, PULCHK disabled,
       configuration hash MD5:
       16 EA D6 F4 BB 67 03 14 9B FF E7 A0 43 5B 48 2E
       data hash MD5: 64K
       25 17 C5 CC 96 AE 7A DD C2 43 72 24 80 61 56 74>)
(   2,<2014-08-04 15:51:26.379 -0700>,<Administrator>,<X>,<proc1d>,<TOPSPIN 2.1>,
      <Start of raw data processing
       efp LB = 0.3 FT_mod = 6 PKNL = 1 PHC0 = 0 PHC1 = 0 SI = 128K 
       data hash MD5: 128K
       F2 F3 22 98 01 FB FD D0 2C 07 A1 35 4F 60 74 AD>)
(   3,<2014-08-04 15:51:27.364 -0700>,<Administrator>,<X>,<proc1d>,<TOPSPIN 2.1>,
      <pk PHC0 = -87.63794 PHC1 = 0 
       data hash MD5: 128K
       56 4D 23 7D EE 6B 80 87 84 8E C1 43 AF 23 EE 5C>)
(   4,<2014-08-04 15:51:27.832 -0700>,<Administrator>,<X>,<proc1d>,<TOPSPIN 2.1>,
      <abs ABSG = 1 
       data hash MD5: 128K
       B4 D3 CC FD BA 18 A3 AE 99 62 11 2B 0D 4A 79 EB>)
(   5,<2014-08-04 15:51:27.989 -0700>,<Administrator>,<X>,<proc1d>,<TOPSPIN 2.1>,
      <abs ABSG = 2 
       data hash MD5: 128K
       20 3E 7B 24 69 9A EB 01 7A 51 1D 23 8F 7C 08 1C>)
(   6,<2014-08-04 15:51:28.098 -0700>,<Administrator>,<X>,<proc1d>,<TOPSPIN 2.1>,
      <abs ABSG = 3 
       data hash MD5: 128K
       98 10 A5 BC 4D 9C C6 DC 12 E0 71 A9 76 7A D3 67>)
(   7,<2014-08-04 15:51:28.207 -0700>,<Administrator>,<X>,<proc1d>,<TOPSPIN 2.1>,
      <abs ABSG = 4 
       data hash MD5: 128K
       8D 05 13 2A B5 F4 92 5B 60 F1 7E 27 D4 5B DE A0>)
(   8,<2014-08-04 15:51:28.301 -0700>,<Administrator>,<X>,<proc1d>,<TOPSPIN 2.1>,
      <abs ABSG = 5 
       data hash MD5: 128K
       AE E7 37 01 04 F3 27 A0 CF C7 AE 7C 9D 4A 28 5A>)
$$ ##END=
$$ 
$$ $$ hash MD5
$$ $$ 16 E1 F0 4A E2 C1 D2 76 03 5B 8F 40 90 86 04 8B
##$RELAX= 
##$RELAX= 
##$RELAX= 
##$RELAX= 
##$RELAX= 
##$RELAX= 
##$RELAX= 
##$RELAX= 
$$ Bruker specific parameters
$$ --------------------------
##$DU= <E:\>
##$EXPNO= 32
$$ [...]
##$TP07= 0
##$TPNAME0= <>
##$TPNAME1= <>
##$TPNAME2= <>
##$TPNAME3= <>
##$TPNAME4= <>
##$TPNAME5= <>
##$TPNAME6= <>
##$TPNAME7= <>
##$TPOAL= (0..7)
0.5 0.5 0.5 0.5 0.5 0.5 0.5 0.5
##$TPOFFS= (0..7)
0 0 0 0 0 0 0 0
##$TUNHIN= 0
##$TUNHOUT= 0
##$TUNXOUT= 0
##$USERA1= <user>
##$USERA2= <user>
##$USERA3= <user>
##$USERA4= <user>
##$USERA5= <user>
##$V9= 5
##$VALIST= <valist>
##$VCLIST= <CCCCCCCCCCCCCCC>
##$VD= 0
##$VDLIST= <DDDDDDDDDDDDDDD>
##$VPLIST= <PPPPPPPPPPPPPPP>
##$VTLIST= <TTTTTTTTTTTTTTT>
##$WBST= 1024
##$WBSW= 4
##$XGAIN= (0..3)
0 0 0 0
##$XL= 0
##$YL= 0
##$YMAX_a= 7264610
##$YMIN_a= -8302082
##$ZGOPTNS= <>
##$ZL1= 120
##$ZL2= 120
##$ZL3= 120
##$ZL4= 120
##$ABSF1= 14.97781
##$ABSF2= -5.580372
##$ABSG= 5
##$ABSL= 3
##$ALPHA= 0
##$AQORDER= 0
##$ASSFAC= 0
##$ASSFACI= 0
##$ASSFACX= 0
##$ASSWID= 0
##$AUNMP= <proc_prof1d_extract.lims>
##$AXLEFT= 0
##$AXNAME= <>
##$AXNUC= <1H>
##$AXRIGHT= 0
##$AXTYPE= 0
##$AXUNIT= <>
##$AZFE= 0.1
##$AZFW= 0.1
##$BCFW= 0
##$BC_mod= 0
##$BYTORDP= 0
##$COROFFS= 0
##$CY= 15
##$DATMOD= 1
##$DC= 0
##$DFILT= <>
##$DTYPP= 0
##$F1P= 0
##$F2P= 0
##$FCOR= 0.5
##$FTSIZE= 131072
##$FT_mod= 6
##$GAMMA= 0
##$GB= 0
##$INTBC= 1
##$INTSCL= 1
##$ISEN= 128
##$LB= 0.3
##$LEV0= 0
##$LPBIN= 0
##$MAXI= 10000
##$MC2= 0
##$MEAN= 0
##$ME_mod= 0
##$MI= 0
##$NCOEF= 0
##$NC_proc= -2
##$NLEV= 6
##$NOISF1= 0
##$NOISF2= 0
##$NSP= 0
##$NTH_PI= 0
##$NZP= 0
##$OFFSET= 14.97781
##$PC= 1
##$PHC0= -87.63794
##$PHC1= 0
##$PH_mod= 1
##$PKNL= yes
##$PPARMOD= 0
##$PPDIAG= 0
##$PPIPTYP= 0
##$PPMPNUM= 2147483647
##$PPRESOL= 1
##$PSCAL= 4
##$PSIGN= 0
##$PYNMP= <proc.py>
##$REVERSE= no
##$SF= 400.020002914546
##$SI= 131072
##$SIGF1= 0
##$SIGF2= 0
##$SINO= 400
##$SIOLD= 131072
##$SPECTYP= <>
##$SREGLST= <1H.CDCl3>
##$SSB= 0
##$STSI= 131072
##$STSR= 0
##$SW_p= 8223.68421052631
##$SYMM= 0
##$S_DEV= 0
##$TDeff= 65536
##$TDoff= 0
##$TI= <>
##$TILT= no
##$TM1= 0
##$TM2= 0
##$TOPLEV= 0
##$USERP1= <user>
##$USERP2= <user>
##$USERP3= <user>
##$USERP4= <user>
##$USERP5= <user>
##$WDW= 1
##$XDIM= 131072
##$YMAX_p= 339883437
##$YMIN_p= -439138249
##$CURPLOT= <Network HP LaserJet P1505>
##$CURPRIN= <$Network HP LaserJet P1505>
##$DFORMAT= <normdp>
##$LAYOUT= <+/1D_H.xwp>
##$LFORMAT= <normlp>
##$PFORMAT= <normpl>
##$SURQMSG= 1
$$ End of Bruker specific parameters
$$ ---------------------------------
##NTUPLES= NMR SPECTRUM
##VAR_NAME=  FREQUENCY,     SPECTRUM/REAL,   SPECTRUM/IMAG
##SYMBOL=    X,             R,               I
##VAR_TYPE=  INDEPENDENT,   DEPENDENT,       DEPENDENT
##VAR_FORM=  AFFN,          ASDF,            ASDF
##VAR_DIM=   131072,        131072,          131072
##UNITS=     HZ,            ARBITRARY UNITS, ARBITRARY UNITS
##FACTOR=    0.0627417313425164, 1,          1
##FIRST=     8223.62146879497, 2902,         -34160
##LAST=      0,             3915,            -33664
##MIN=       0,             -439138249,      0
##MAX=       8223.62146879497, 339883437,    0
$$ Real data points
##PAGE= N=1
##DATA TABLE= (X++(R..R)), XYDATA
$$ [...]
$$ plain form
62764 403135 401546 400195 399445 399393 399931 401021 402626 404516 406445 408419 410541 412697 414640 416202 417195
62749 417195 417383 416890 416364 416297 416435 416338 416326 417237 419291 421812 424074 425775 426607 426086 424235 421902 419904
62732 419904 418146 416024 413523 411529 411009 412094 413915 415200 415137 413913 412529 412090 413140 415453 418244
62717 418244 420676 422414 423754 425166 426846 428880 431624 435469 440238 445150 449556 453493 457458 461883
62703 461883 466860 472102 477060 481239 484587 487539 490743 494806 500175 506991 515147 524700 536046 549438
62689 549438 564536 580897 598800 619043 641970 667283 694943 725702 760548 800073 844580
62678 844580 894209 948677 1007430 1070514 1138932 1213589 1294072 1378765 1465864 1553801 1640836
62667 1640836 1724708 1802691 1871821 1929300 1973126 2002321 2016362 2014635 1996865 1963952 1917868
$$ packed form
62764D03135j589j351p50n2N38J090J605J890J929J974K122K156J943J562R93
62749D17195J88m93n26o7J38r7j2R11K054K521K262J701Q32n21j851k333j998
62732D19904j758k122k501j994n20J085J821J285o3j224j384m39J050K313K791
62717D18244K432J738J340J412J680K034K744L845M769M912M406L937L965M425
62703D61883M977N242M958M179L348K952L204M063N369O816Q156R553J1346J3392
62689E49438J5098J6361J7903K0243K2927K5313K7660L0759L4846L9525M4507
62678H44580M9629N4468N8753O3084O8418P4657Q0483Q4693Q7099Q7937Q7035
62667A640836Q3872P7983O9130N7479M3826K9195J4041j727j7770l2913m6084
$$ plain form
62656 1917868 1860700 1794153 1719982 1640403 1557861 1474570 1392379 1312735 1236509 1164040 1095564
62645 1095564 1031554 972530 918672 869757 825375 785075 748421 715122 685121 658387 634644
62634 634644 613467 594679 578389 564506 552410 541352 531071 521739 513433 506041 499711 494942
62622 494942 491993 490551 490194 490811 492246 493911 495334 496968 499886 504596 510564 517005 523768 531352 540411
62607 540411 551428 564606 579816 596734 615142 635121 657130 682050 710932 744334 781954
62596 781954 823287 868554 918531 973432 1032412 1094290 1158340 1224092 1290594 1355963 1417501
62585 1417501 1472284 1518088 1553933 1579521 1594225 1597032 1587475 1566079 1533838 1491849 1441708 1385576
62573 1385576 1325478 1262836 1199022 1135735 1074401 1015654 959966 908386 861930 820394 782419
$$ packed form
62656A917868n7168o6547p4171p9579q2542q3291q2191p9644p6226p2469o8476
62645A095564o4010n9024n3858m8915m4382m0300l6654l3299l0001k6734k3743
62634F34644k1177j8788j6290j3883j2096j1058j0281r332q306p392o330m769
62622D94942k949j442l57O17J435J665J423J634K918M710N968O441O763P584R059
62607E40411J1017J3178J5210J6918J8408J9979K2009K4920K8882L3402L7620
62596G81954M1333M5267M9977N4901N8980O1878O4050O5752O6502O5369O1538
62585A417501N4783M5804L5845K5588J4704K807r557k1396l2241m1989n0141n6132
62573A385576o0098o2642o3814o3287o1334n8747n5688n1580m6456m1536l7975
$$ plain form
62562 782419 746791 713327 682566 655023 630745 609245 589786 571875 555418 540360 526440
62551 526440 513523 501788 491277 481572 472371 464093 457414 452446 448855 446457 445006 443590 441087
62538 441087 437400 433574 430487 427996 425546 422996 420485 418039 415767 414026 412902 411861 410423 408973
62524 408973 408407 409035 410350 411798 413239 414526 415212 415115 414866 415447 417143 419296 421119 422500 423915 425857
62508 425857 428517 431928 436153 441337 447689 455373 464315 474191 484748 496094 508599 522621 538466
62495 538466 556503 577074 600414 626846 656880 690814 728263 768392 810504 853956 897587
62484 897587 939809 979398 1015685 1047704 1073712 1091991 1101825 1103320 1096684 1082201 1060679 1033312
62472 1033312 1001150 965161 926808 887974 850030 813268 777416 742489 708972 677364 647913
$$ packed form
62562G82419l5628l3464l0761k7543k4278k1500j9459j7911j6457j5058j3920
62551E26440j2917j1735j0511r705r201q278o679m968l591k398j451j416k503
62538D41087l687l826l087k491k450k550k511k446k272j741j124j041j438j450
62524D08973n66O28J315J448J441J287O86r7k49N81J696K153J823J381J415J942
62508D25857K660L411M225N184O352P684Q942R876J0557J1346J2505J4022J5845
62495E38466J8037K0571K3340K6432L0034L3934L7449M0129M2112M3452M3631
62484H97587M2222L9589L6287L2019K6008J8279R834J495o636j4483k1522k7367
62472A033312l2162l5989l8353l8834l7944l6762l5852l4927l3517l1608k9451
$$ plain form
62461 647913 620816 596393 574787 555509 537623 520590 504788 490961 479296 469346 460731 453433
62449 453433 447409 442361 438086 434677 432179 430348 428872 427493 425780 423175 419544 415402 411378 407751
62435 407751 404631 402207 400523 399338 398438 397847 397617 397826 398875 401235 404719 408664 413155 419278 427638
62420 427638 437359 447264 457443 468835 481867 496432 512835 531693 553118 576933 603507 633296
62408 633296 665661 699209 733359 768478 804262 839052 871088 899464 923375 941407 952333
62397 952333 956040 953063 943733 928356 907754 882977 854745 823740 791208 758797 727877 699281
62385 699281 673381 650022 628564 608375 589293 571462 554927 539570 525208 511555 498377
62374 498377 485819 474339 464130 454903 446384 438681 431975 426178 421094 416522 412008 407027 401756
$$ packed form
62461F47913k7097k4423k1606j9278j7886j7033j5802j3827j1665r950q615p298
62449D53433o024n048m275l409k498j831j476j379j713k605l631m142m024l627
62435D07751l120k424j684j185r00n91k30K09J049K360L484L945M491O123Q360
62420D27638R721R905J0179J1392J3032J4565J6403J8858K1425K3815K6574K9789
62408F33296L2365L3548L4150L5119L5784L4790L2036K8376K3911J8032J0926
62397I52333L707k977r330j5377k0602k4777k8232l1005l2532l2411l0920k8596
62385F99281k5900k3359k1458k0189j9082j7831j6535j5357j4362j3653j3178
62374D98377j2558j1480j0209r227q519p703o706n797n084m572m514m981n271
$$ plain form
62361 401756 397178 393907 391243 388013 384138 380777 378927 378410 378353 378249 378378 379384 381620 384852 388505
62346 388505 392085 395311 398009 400311 402946 406914 412598 419431 426566 433484 439786 444932 448650 451248
62332 451248 453027 453575 452154 448662 443722 437906 431319 423976 416184 408416 401026 394105 387406 380496
62318 380496 373279 366361 360629 356433 353320 350515 347521 344403 341772 340297 339955 339890 339357 338646 338629 339484
62302 339484 340472 341051 341618 342789 344406 345715 346371 346885 348075 350334 353399 356684 359885 363334 367684
62287 367684 373120 379009 384528 389550 394650 400251 406060 411470 416230 420503 424443 428103 431766 435962
62273 435962 440915 446188 451133 455622 460150 465353 471730 479772 489940 502365 516811 533167 551900
62260 551900 573901 599972 630448 665111 703303 744164 786845 830449 873819 915567 954303
$$ packed form
62361D01756m578l271k664l230l875l361j850n17n7j04J29J006K236L232L653
62346C88505L580L226K698K302K635L968N684O833P135O918O302N146L718K598
62332D51248J779N48j421l492m940n816o587p343p792p768p390o921o699o910
62318C80496p217o918n732m196l113k805k994l118k631j475l42o5n33p11j7Q55
62302C39484R88N79N67J171J617J309O56N14J190K259L065L285L201L449M350
62287C67684N436N889N519N022N100N601N809N410M760M273L940L660L663M196
62273D35962M953N273M945M489M528N203O377Q042J0168J2425J4446J6356J8733
62260E51900K2001K6071L0476L4663L8192M0861M2681M3604M3370M1748L8736
$$ plain form
62249 954303 988629 1017007 1038189 1052145 1060319 1064540 1065642 1063244 1056587 1045286 1029418 1009382
62237 1009382 985826 959425 930635 899886 868126 836919 807757 781288 757276 735190 714700
62226 714700 695690 678049 661529 645697 629982 613879 597255 580412 563693 547094 530408
62215 530408 513769 497787 483042 469672 457683 447382 439174 432959 428055 423757 419816 416431 413975
62202 413975 412637 412044 411378 410245 409350 409800 411676 413842 415366 416544 418154 420217 422093 423545 425029
62187 425029 426913 428914 430440 431162 431106 430509 429765 429400 429847 431173 432999 434755 436113 437285 438826 441096
62171 441096 444026 447417 451296 455892 461484 468496 477574 489327 504010 521592 542107 565758 592738
62158 592738 623136 657040 694611 735987 781013 828892 878021 926241 971347 1011422 1044911
$$ packed form
62249I54303L4326K8378K1182J3956Q174M221J102k398o657j1301j5868k0036
62237A009382k3556k6401k8790l0749l1760l1207k9162k6469k4012k2086k0490
62226G14700j9010j7641j6520j5832j5715j6103j6624j6843j6719j6599j6686
62215E30408j6639j5982j4745j3370j1989j0301q208o215m904m298l941l385k456
62202D13975j338n93o66j133q95M50J876K166J524J178J610K063J876J452J484
62187D25029J884K001J526P22n6n97p44l65M47J326J826J756J358J172J541K270
62171D41096K930L391L879M596N592P012R078J1753J4683J7582K0515K3651K6980
62158E92738L0398L3904L7571M1376M5026M7879M9129M8220M5106M0075L3489
$$ plain form
62147 1044911 1070826 1089007 1099956 1104289 1102520 1095336 1083540 1067356 1046141 1019229 986931 950387
62135 950387 910714 868835 826064 784263 745060 709101 676173 645907 618320 593894 573174
62124 573174 556189 542189 530137 519434 510100 502358 496273 491748 488518 486067 483904 482217 482091
62111 482091 484710 490203 497423 505014 512715 521520 532581 546043 561035 576514 591811 606427 619708
62098 619708 631068 640350 647824 653892 658848 662778 665541 666979 667188 666434 664793 662168 658744 655125
62084 655125 651794 648765 646001 643805 642369 641151 639136 635675 630766 624758 618306 612627 609252 609222 612660
62069 612660 619239 628976 642556 660967 684678 712970 744146 776525 809026 840600 869499 893716
62057 893716 912180 925112 933234 937077 937113 933999 928288 920018 908695 893640 874484 851694 826664
$$ packed form
62147A044911K5915J8181J0949M333j769p184j1796j6184k1215k6912l2298l6544
62135I50387l9673m1879m2771m1801l9203l5959l2928l0266k7587k4426k0720
62124E73174j6985j4000j2052j0703r334p742o085m525l230k451k163j687j26
62111D82091K619N493P220P591P701Q805J1061J3462J4992J5479J5297J4616J3281
62098F19708J1360R282P474O068M956L930K763J438K09p54j641k625l424l619
62084F55125l331l029k764k196j436j218k015l461m909o008o452n679l375l0L438
62069F12660O579R737J3580J8411K3711K8292L1176L2379L2501L1574K8899K4217
62057H93716J8464J2932Q122L843L6l114n711q270j1323j5055j9156k2790k5030
$$ plain form
62044 826664 800983 775576 750798 727204 705702 686795 670158 655253 642038 630854 621921 615166
62032 615166 610242 606480 603115 599953 597631 596907 597791 599647 602070 605419 610573 618415 629554 644263
62018 644263 662528 684073 708103 732975 756388 776322 791877 803160 810557 814446 815594 815327
62006 815327 814821 814056 811616 805698 795423 781243 764386 746265 728537 713208 702055 695714 693581
61993 693581 694700 698590 705246 714584 726048 738654 751413 763884 776322 789064 801772 813519
61981 813519 823638 832200 839737 846992 855035 865027 877454 891898 907895 925624 945330 966459
61969 966459 987978 1009401 1030891 1052409 1073436 1093577 1112859 1131173 1147853 1162053 1173184
61958 1173184 1180717 1183944 1182354 1176141 1166191 1153718 1140076 1126596 1114161 1102861 1092116 1081019
$$ packed form
62044H26664k5681k5407k4778k3594k1502j8907j6637j4905j3215j1184q933o755
62032F15166m924l762l365l162k322p24Q84J856K423L349N154P842J1139J4709
62018F44263J8265K1545K4030K4872K3413J9934J5555J1283P397L889J148k67
62006H15327n06p65k440n918j0275j4180j6857j8121j7728j5329j1153o341k133
61993F93581J119L890O656R338J1464J2606J2759J2471J2438J2742J2708J1747
61981H13519J0119Q562P537P255Q043R992J2427J4444J5997J7729J9706K1129
61969I66459K1519K1423K1490K1518K1027K0141J9282J8314J6680J4200J1131
61958A173184P533L227j590o213r950j2473j3642j3480j2435j1300j0745j1097
$$ plain form
61946 1081019 1068587 1054073 1037446 1019472 1000996 982177 962572 941836 920063 897593 874737
61935 874737 851647 828147 803767 778271 752199 726642 702513 680205 659785 641086 623647
61924 623647 607058 591514 577606 565449 554394 543720 533125 522396 511212 499731 488909
61913 488909 479636 471814 464775 458252 452358 446926 441698 437146 434352 433926 435612 439037 444081 450254
61899 450254 456412 461616 465819 469290 471779 472775 472328 471034 469259 466765 463067 457871 451169 443191 434322
61884 434322 424993 415672 406973 399430 393046 387361 382199 378034 375314 373694 372338 370780 369143 367629
61870 367629 366248 365008 364006 363338 363147 363690 365086 367126 369625 372815 377069 382346 388315 394858 401905
61855 401905 408900 415069 420359 425492 430878 436128 441051 446511 453619 462356 471720 481178 491318 502962
$$ packed form
61946A081019j2432j4514j6627j7974j8476j8819j9605k0736k1773k2470k2856
61935H74737k3090k3500k4380k5496k6072k5557k4129k2308k0420j8699j7439
61924F23647j6589j5544j3908j2157j1055j0674j0595j0729j1184j1481j0822
61913D88909r273p822p039o523n894n432n228m552k794m26J686L425N044O173
61899D50254O158N204M203L471K489R96m47j294j775k494l698n196o702p978q869
61884D34322r329r321q699p543o384n685n162m165k720j620j356j558j637j514
61870C67629j381j240j002o68j91N43J396K040K499L190M254N277N969O543P047
61855D01905O995O169N290N133N386N250M923N460P108Q737R364R458J0140J1644
$$ plain form
61841 502962 516324 531360 548415 567789 588769 609692 629266 647593 665700 684250 703000
61830 703000 721381 739233 756751 773833 789704 803231 813580 820559 824308 824775 821718 815348 806827
61817 806827 797842 789642 782619 776738 772163 769409 769169 772173 779089 790346 805884 824910 845829
61804 845829 866628 885642 901978 915049 923953 927726 926181 919997 909903 896183 879061 859111
61792 859111 837063 813598 789564 765997 743544 722148 701529 681737 663002 645381 628827
61781 628827 613327 598721 584657 570985 557938 545773 534568 524498 515840 508447 501824 496034
61769 496034 491890 489746 488745 487964 487794 489392 493113 498270 504155 510553 517524 525524 535569 548427
61755 548427 563769 580870 599980 622114 647654 676207 707773 742804 780814 820081 859229
$$ packed form
61841E02962J3362J5036J7055J9374K0980K0923J9574J8327J8107J8550J8750
61830G03000J8381J7852J7518J7082J5871J3527J0349O979L749M67l057o370q521
61817H06827q985q200p023n881m575k754k40L004O916J1257J5538J9026K0919
61804H45829K0799J9014J6336J3071Q904L773j545o184j0094j3720j7122j9950
61792H59111k2048k3465k4034k3567k2453k1396k0619j9792j8735j7621j6554
61781F28827j5500j4606j4064j3672j3047j2165j1205j0070q658p393o623n790
61769D96034m144k144j001p81j70J598L721N157N885O398O971Q000J0045J2858
61755E48427J5342J7101J9110K2134K5540K8553L1566L5031L8010L9267L9148
$$ plain form
61744 859229 898192 936954 974183 1007811 1036411 1059325 1076009 1086059 1089687 1087591 1080532 1069506
61732 1069506 1056197 1042758 1031145 1022777 1018625 1019230 1024696 1034816 1049137 1066889 1086979 1108026
61720 1108026 1128164 1145006 1156311 1160833 1158221 1148353 1131366 1108253 1080514 1048996 1013826 975840
61708 975840 937278 900455 866274 834483 804833 777366 751970 728346 706287 685654 666348
61697 666348 648628 633068 619810 608268 597901 588841 581270 574644 568187 561843 556108 551204 546984
61684 546984 543474 540872 539039 537527 536045 534491 532614 530133 527152 524096 521252 518672 516386 514394
61670 514394 512582 510939 509688 508877 508075 506864 505451 504366 503727 503220 502627 501901 500871 499399 497798 496623
61654 496623 496039 495771 495671 495869 496294 496438 495774 494225 492218 490412 489312 488942 488941 489046 489288 489614 489704 489477
$$ packed form
61744H59229L8963L8762L7229L3628K8600K2914J6684J0050L628k096p059j1026
61732A069506j3309j3439j1613q368m152O05N466J0120J4321J7752K0090K1047
61720A108026K0138J6842J1305M522k612r868j6987k3113k7739l1518l5170l7986
61708I75840l8562l6823l4181l1791k9650k7467k5396k3624k2059k0633j9306
61697F66348j7720j5560j3258j1542j0367r060p571o626o457o344n735m904m220
61684E46984l510k602j833j512j482j554j877k481k981l056k844k580k286j992
61670E14394j812j643j251q11q02j211j413j085o39n07n93p26j030j472j601j175
61654D96623n84k68j00J98M25J44o64j549k007j806j100l70jJ05K42L26R0k27
$$ plain form
61636 489477 489414 489899 490515 490539 489965 489520 489754 490673 492203 494491 497580 501158 504738 507862 510194 511800 513292
61619 513292 515351 518047 520882 523457 525805 528153 530704 533623 536913 540263 543238 545555 546986 547172
61605 547172 545791 542780 538208 532249 525585 519429 514547 510513 506445 502293 498788 496308 494480 492848
61591 492848 491261 489593 487731 485907 484390 482805 480412 477202 474020 471423 469039 466318 463258 460075
61577 460075 456743 453327 450305 448095 446614 445595 444927 444311 442993 440407 436874 433264 430062 427101 424040
61562 424040 420772 417422 414212 411347 408935 407047 405782 405068 404467 403555 402510 401919 401939 402131 402261 402726
61546 402726 403904 405646 407823 410823 414896 419356 423164 426089 428638 430866 431962 431192 428717 425221
61532 425221 421161 416674 411965 407305 402705 397900 392780 387753 383490 380289 377804 375517 373405 371972
$$ packed form
61636D89477o3M85O16K4n74m45K34R19J530K288L089L578L580L124K332J606J492
61619E13292K059K696K835K575K348K348K551K919L290L350K975K317J431J86
61605E47172j381l011m572n959o664o156m882m034m068m152l505k480j828j632
61591D92848j587j668j862j824j517j585k393l210l182k597k384k721l060l183
61577D60075l332l416l022k210j481j019o68o16j318k586l533l610l202k961l061
61562D24040l268l350l210k865k412j888j265p14o01r12j045n91K0J92J30M65
61546D02726J178J742K177L000M073M460L808K925K549K228J096p70k475l496
61532D25221m060m487m709m660m600m805n120n027m263l201k485k287k112j433
$$ plain form
61518 371972 371648 372356 373673 375151 376355 376941 376909 376516 375643 373485 369330 363584 357612 352423 347796 342778
61502 342778 336796 330126 323494 317493 312245 307440 302630 297639 292705 288228 284429 281253 278481 275879
61488 275879 273373 271182 269633 268606 267376 265340 262831 260782 259538 258473 257036 255613 254863 254617 254125
61473 254125 253250 252698 252964 253689 254235 254361 254127 253651 253233 253173 253161 252392 250661 248877 247995 247911 247910 247752 247677 247714
61453 247714 247748 247995 248622 249029 248311 246507 244659 243559 243094 242931 243092 243621 244382 245506 247443 250163 252875
61436 252875 254996 256920 259300 261949 264113 265641 267260 269604 272408 274791 276036 275998 274975 273412 271615
61421 271615 269556 266927 263507 259600 256053 253665 252536 252080 251715 251346 251164 251204 251266 251080 250463 249568 248986
61404 248986 249140 249474 248844 247098 245568 245381 245875 245636 244609 244020 244298 244379 243432 242189 241929 242823 243967
$$ packed form
61518C71972l24P08J317J478J204N86l2l93q73k158m155n746n972n189m627n018
61502C42778n982o670o632o001n248m805m810m991m934m477l799l176k772k602
61488B75879k506k191j549j027j230k036k509k049j244j065j437j423p50k46m92
61473B54125q75n52K66P25N46J26k34m76m18o0j2p69j731j784q82q4jj58p5L7
61453B47714L4K47O27M07p18j804j848j100m65j63J61N29P61J124J937K720K712
61436B52875K121J924K380K649K164J528J619K344K804K383J245l8j023j563j797
61421B71615k059k629l420l907l547k388j129m56l65l69j82M0O2j86o17q95n82
61404B48986J54L34o30j746j530j87M94k39j027n89K78Q1r47j243k60Q94J144
$$ plain form
61387 243967 244622 244895 245480 246993 249316 251436 252337 252209 252310 253454 255204 256765 257983 259075 259982 260630
61371 260630 261357 262511 263870 264942 265612 266036 266197 265946 265314 264417 263331 262362 262128 262937 264354 265817 267382
61354 267382 269355 271384 272518 272248 271154 270444 271010 272814 274994 276649 277640 278556 279882 281564 283399
61339 283399 285391 287576 289931 292713 296354 300729 305088 309138 313579 319014 324821 329793 333453 336094
61325 336094 337930 339055 339934 341032 342083 342562 342779 343583 344970 345932 345941 345629 345568 345221 343778 341456 339226
61308 339226 337469 335596 333032 330046 327496 325984 325400 325163 324782 324194 323618 323190 322799 322215 321297 320168
61292 320168 319254 319000 319352 319654 319301 318416 317746 317954 319151 320904 322482 323208 322911 322048 321224 320710 320571 320986
61274 320986 322098 323702 325468 327374 329540 331723 333429 334556 335523 336712 338110 339609 341344 343604
$$ packed form
61387B43967O55K73N85J513K323K120R01j28J01J144J750J561J218J092R07O48
61371B60630P27J154J359J072O70M24J61k51o32q97j086r69k34Q09J417J463J565
61354B67382J973K029J134k70j094p10N66J804K180J655R91R16J326J682J835
61339B83399J992K185K355K782L641M375M359M050M441N435N807M972L660K641
61325C36094J836J125Q79J098J051M79K17Q04J387R62Rl12o1l47j443k322k230
61308C39226j757j873k564k986k550j512n84k37l81n88n76m28l91n84r18j129
61292C20168r14k54L52L02l53q85o70K08J197J753J578P26k97q63q24n14j39M15
61274C20986J112J604J766J906K166K183J706J127R67J189J398J499J735K260
$$ plain form
61260 343604 346610 350432 354957 359880 364976 370416 376663 384047 392540 401870 411712 421779 431868 441663
61246 441663 450468 457503 462747 467213 471960 477017 481654 485437 488466 490779 492185 492642 492224 490614 487306
61231 487306 482513 477344 472839 469225 466251 463759 461642 459682 457778 456099 454747 453509 452149 450720
61217 450720 449441 448522 448250 449008 451028 454312 458793 464314 470483 477018 484260 492874 502896 513510
61203 513510 523896 533669 542316 549007 553582 557174 561060 565151 568282 569831 570365 570729 571133 571334 571199
61188 571199 570788 570051 568629 565956 561696 556243 550620 545630 541244 537071 533188 530112 528055 526677 525522
61173 525522 524345 523015 521570 520395 519929 520128 520649 521667 524050 528492 534888 542781 552014 562556 574070
61158 574070 586089 598311 610209 620481 627582 630943 631250 629396 625570 619603 611859 603287 594723
$$ packed form
61260C43604L006L822M525M923N096N440O247P384Q493R330R842J0067J0089R795
61246D41663Q805P035N244M466M747N057M637L783L029K313J406M57m18j610l308
61231D87306m793n169m505l614k974k492k117j960j904j679j352j238j360j429
61217D50720j279r19k72P58K020L284M481N521O169O535P242Q614J0022J0614
61203E13510J0386R773Q647O691M575L592L886M091L131J549N34L64M04K01j35
61188E71199m11p37j422k673m260n453n623m990m386m173l883l076k057j378j155
61173E25522j177j330j445j175m66J99N21J018K383M442O396P893R233J0542J1514
61158E74070J2019J2222J1898J0272P101L361L07j854l826n967p744q572q564
$$ plain form
61145 594723 586437 578382 570595 563276 556647 550873 545988 541819 537997 534151 530138 526103 522380 519347
61131 519347 517378 516831 517935 520582 524246 528262 532310 536548 541205 546103 550744 554896 558993 563823
61117 563823 569852 576867 584282 591768 599508 607774 616313 624332 631187 636977 642352 647893 653905 660672
61103 660672 668596 677989 688951 701502 715667 731388 748615 767480 788046 809719 831217 851368
61091 851368 869698 885939 899299 908800 914392 917249 918772 919530 919255 917530 914178 909214 902671 894455
61077 894455 884242 871647 856685 839963 822236 803838 784740 765006 744886 724516 703932
61066 703932 683502 663910 645377 627209 608644 590148 573476 560262 550669 543448 537148 531273
61054 531273 526544 524156 524638 527383 531381 536140 541490 546603 549896 550199 547598 542894 536808 530092 523850
$$ packed form
61145E94723q286q055p787p319o629n774m885m169l822l846m013m035l723l033
61131E19347j969n47J104K647L664M016M048M238M657M898M641M152M097M830
61117E63823O029P015P415P486P740Q266Q539Q019O855N790N375N541O012O767
61103F60672P924R393J0962J2551J4165J5721J7227J8865K0566K1673K1498K0151
61091H51368J8330J6241J3360R501N592K857J523P58k75j725l352m964o543q216
61077H94455j0213j2595j4962j6722j7727j8398j9098j9734k0120k0370k0584
61066G03932k0430j9592j8533j8168j8565j8496j6672j3214r593p221o300n875
61054E31273m729k388M82K745L998M759N350N113L293L03k601m704o086o716o242
$$ plain form
61039 523850 519003 515682 513700 513380 515268 519282 524890 532076 541345 552709 565459 579161 594172
61026 594172 610857 628889 647670 666988 686917 707501 728848 751112 774042 796955 819432
61015 819432 841537 863053 883044 900716 916316 930631 943885 955642 965537 973575 979844 984314
61003 984314 986696 986092 981081 970774 955759 937594 917481 895847 872972 849366 825456 801416
60991 801416 777506 754237 732088 711227 691572 672939 655192 638368 622577 607666 593310
60980 593310 579673 567613 557776 549719 542437 535610 529771 525370 522247 520055 518602 517654 516933 516608
60966 516608 517398 519962 524347 530052 536319 542353 547747 552947 558943 566317 574896 584497 595533 608424
60952 608424 622720 637427 652221 667842 685155 704218 724506 745671 767628 790046 812292
$$ packed form
61039E23850m847l321j982l20J888M014N608P186R269J1364J2750J3702J5011
61026E94172J6685J8032J8781J9318J9929K0584K1347K2264K2930K2913K2477
61015H19432K2105K1516J9991J7672J5600J4315J3254J1757R895Q038O269M470
61003I84314K382o04n011j0307j5015j8165k0113k1634k2875k3606k3910k4040
60991H01416k3910k3269k2149k0861j9655j8633j7747j6824j5791j4911j4356
60980E93310j3637j2060r837q057p282o827n839m401l123k192j453r48p21l25
60966E16608P90K564M385N705O267O034N394N200N996P374Q579R601J1036J2891
60952F08424J4296J4707J4794J5621J7313J9063K0288K1165K1957K2418K2246
$$ plain form
60941 812292 834023 855500 877099 898803 920385 941848 963407 985171 1007100 1029095 1051033
60930 1051033 1073087 1096252 1122019 1150997 1182172 1214065 1246146 1278520 1310938 1343434 1377763
60919 1377763 1417012 1463631 1518850 1583772 1659436 1745341 1839429 1940526 2050364 2173240 2315247
60908 2315247 2484533 2691200 2946406 3262458 3653776 4136393 4727580 5450300 6341003
60899 6341003 7452429 8847756 10587819 12703197 15138275 17688972 20004621 21707150
60891 21707150 22576983 22669357 22270823 21746372 21403883 21436336 21897220 22662278 23418473 23756323
60881 23756323 23353955 22131452 20261861 18047671 15773246 13627748 11705239 10034809
60873 10034809 8607306 7396018 6373339 5517584 4809315 4227129 3749601 3358732 3039270
$$ packed form
60941H12292K1731K1477K1599K1704K1582K1463K1559K1764K1929K1995K1938
60930A051033K2054K3165K5767K8978L1175L1893L2081L2374L2418L2496L4329
60919A377763L9249M6619N5219O4922P5664Q5905R4088J01097J09838J22876J42007
60908B315247J69286K06667K55206L16052L91318M82617N91187P22720Q90703
60899F341003J111426J395327J740063K115378K435078K550697K315649J702529
60891B1707150Q69833R2374l98534n24451l42489L2453M60884P65058P56195L37850
60881B3756323m02368j222503j869591k214190k274425k145498j922509j670430
60873A0034809j427503j211288j022679q55755p08269n82186m77528l90869l19462
$$ plain form
60864 3039270 2776460 2556705 2369632 2208026 2066464 1941125 1829920 1731308 1643276 1564235
60854 1564235 1494089 1433345 1381574 1337528 1299983 1267373 1237069 1206197 1173164 1137937 1101325
60843 1101325 1064650 1029509 996851 966479 938052 912116 889355 869265 850476 832248 814890
60832 814890 798849 784092 770373 757477 745210 733542 722706 712901 704113 696385 689869 684332
60820 684332 679147 674192 670215 667787 666396 665148 663893 663074 662972 663761 665865 669470 673923 678296 682415
60805 682415 686772 691686 697106 702955 709088 715139 720934 726813 733080 739425 745431 751351 757844 765259
60791 765259 773616 783005 793493 805005 817748 832244 848425 865255 881964 899143 917791 937748
60779 937748 957989 978103 998451 1019034 1039173 1058268 1076054 1092162 1106224 1118404 1129091
$$ packed form
60864C039270k62810k19755j87073j61606j41562j25339j11205r8612q8032p9041
60854A564235p0146o0744n1771m4046l7545l2610l0304l0872l3033l5227l6612
60843A101325l6675l5141l2658l0372k8427k5936k2761k0090j8789j8228j7358
60832H14890j6041j4757j3719j2896j2267j1668j0836r805q788p728o516n537
60820F84332n185m955l977k428j391j248j255q19j02P89K104L605M453M373M119
60805F82415M357M914N420N849O133O051N795N879O267O345O006N920O493P415
60791G65259Q357R389J0488J1512J2743J4496J6181J6830J6709J7179J8648J9957
60779I37748K0241K0114K0348K0583K0139J9095J7786J6108J4062J2180J0687
$$ plain form
60768 1129091 1138095 1144792 1148932 1150655 1149865 1146425 1140851 1133996 1126084 1116866 1106583 1095760 1083896
60755 1083896 1069330 1050846 1028938 1005303 981705 959360 938684 919258 900402 881896 863802
60744 863802 845816 827457 808820 790374 772015 753101 733507 713884 694731 675989 657752
60733 657752 640577 624742 609888 595770 582786 571372 561384 552395 544179 536629 529674 523478 518272
60720 518272 513786 509362 504867 500905 497880 495442 493261 491782 491653 492781 494390 495768 496556 496598 495978
60705 495978 495141 494654 494866 495905 497758 500140 502438 504014 504511 503898 502443 500775 499667 499466 499738 499537
60689 499537 498076 495320 492110 489556 488038 486871 485109 482419 478918 474596 469486 464178 459352 454832
60675 454832 449773 443871 437726 431840 425989 419879 413794 408179 403078 398447 394560 391581 389036 386255
$$ packed form
60768A129091R004O697M140J723p90l440n574o855p912r218j0283j0823j1864
60755A083896j4566j8484k1908k3635k3598k2345k0676j9426j8856j8506j8094
60744H63802j7986j8359j8637j8446j8359j8914j9594j9623j9153j8742j8237
60733F57752j7175j5835j4854j4118j2984j1414r988q989q216p550o955o196n206
60720E18272m486m424m495l962l025k438k181j479j29J128J609J378P88M2o20
60705D95978q37m87K12J039J853K382K298J576M97o13j455j668j108k01K72k01
60689D99537j461k756l210k554j518j167j762k690l501m322n110n308m826m520
60675D54832n059n902o145n886n851o110o085n615n101m631l887k979k545k781
$$ plain form
60661 386255 383270 380815 379463 379055 379022 378995 378961 379022 379215 379670 380789 383019 386384 390438 394779 399400 404425
60644 404425 409840 415619 421719 427635 432356 435180 436321 436306 435214 433008 430219 427543 424946 421880 418256
60629 418256 414491 410763 406984 403424 400509 397940 394839 390981 387080 383592 379992 375628 370687 365911
60615 365911 361794 358354 355252 351917 347988 343885 340464 337891 335343 332102 328479 325361 323193 321769
60601 321769 320702 319834 319305 319351 319839 320110 319649 318822 318415 318484 318302 317538 316862 317106 318392 320307 322459 324609
60583 324609 326738 329208 332434 336199 339698 342478 344973 348009 352127 357391 363337 369143 374415 379797
60569 379797 386114 392913 398694 402728 405718 408378 410395 411364 411841 412628 413625 414205 414251 414096 413779 413134 412435
60552 412435 412226 412529 412750 412451 411865 411555 411724 411872 411098 408859 405382 401205 396502 391192 385538 380048
$$ packed form
60661C86255k985k455j352m08l3k7l4O1J93M55J119K230L365M054M341M621N025
60644D04425N415N779O100N916M721K824J141j5j092k206k789k676k597l066l624
60629D18256l765l728l779l560k915k569l101l858l901l488l600m364m941m776
60615C65911m117l440l102l335l929m103l421k573k548l241l623l118k168j424
60601C21769j067q68n29M6M88K71m61q27m07O9j82p64o76K44J286J915K152K150
60583C24609K129K470L226L765L499K780K495L036M118N264N946N806N272N382
60569C79797O317O799N781M034K990K660K017R69M77P87R97N80M6j55l17o45o99
60552D12435k09L03K21k99n86l10J69J48p74k239l477m177m703n310n654n490
$$ plain form
60536 380048 374866 369818 365017 360807 357199 354067 351775 350691 350097 348707 346507 344989 345058 345733 345498
60521 345498 344066 342184 340620 340014 340843 342668 344067 344097 343281 342530 341821 340697 339344 338217 337225 336135
60505 336135 335266 334853 334222 332544 330078 327765 326014 324694 323913 323841 324118 324382 325080 326797 329054 330749
60489 330749 331638 332389 333364 334278 335046 335993 337127 338025 338518 338784 338814 338425 337769 337136 336388 335328 334464 334575
60471 334575 335631 337021 338789 341713 346091 351381 357159 363584 370693 378077 385539 393375 401721 410210
60457 410210 418377 425753 431474 434590 435046 433726 431336 427969 423903 420022 416981 414644 412770 411695
60443 411695 411857 413147 415156 417680 420654 424074 428423 434755 443865 455467 468467 481754 494578
60430 494578 506489 517167 526083 532197 534476 532959 528917 523685 517739 511231 504842 499440 495092 491059
$$ packed form
60536C80048n182n048m801m210l608l132k292j084n94j390k200j518O9O75k35
60521C45498j432j882j564o06Q29J825J399L0q16p51p09j124j353j127r92j090
60505C36135q69m13o31j678k466k313j751j320p81p2K77K64O98J717K257J695
60489C30749Q89P51R75R14P68R47J134Q98M93K66L0l89o56o33p48j060q64J11
60471C34575J056J390J768K924M378N290N778O425P109P384P462P836Q346Q489
60457D10210Q167P376N721L116M56j320k390l367m066l881l041k337j874j075
60443D11695J62J290K009K524K974L420M349O332R110J1602J3000J3287J2824
60430D94578J1911J0678Q916O114K279j517m042n232n946o508o389n402m348m033
$$ plain form
60416 491059 486848 482794 479504 477065 475105 473474 472624 473150 475031 477479 479688 481674 484230 488091 493299
60401 493299 499398 506073 513609 522890 535020 550844 570674 594378 621627 652122 685745 722486
60389 722486 761965 802857 842838 879095 908846 929702 940188 940092 929905 909849 880119 842333
60377 842333 800012 756969 715540 676713 641310 610090 582988 559129 537708 518429 501140
60366 501140 485587 471499 458552 446372 434917 424584 415550 407304 399324 391883 385606 380559 376371
60353 376371 372906 370102 367438 364397 361251 358596 356266 353605 350665 348225 346625 345489 344648 344317 344248
60338 344248 343685 342515 341588 341536 341999 342377 342545 342450 341744 340359 338933 338184 338262 339039 340529 342693 345186 347557
60320 347557 349357 350041 349357 347977 347087 347150 347642 348115 348754 349652 350410 350817 351163 351424 350988 349698 348371 347598
$$ packed form
60416D91059m211m054l290k439j960j631q50N26J881K448K209J986K556L861N208
60401D93299O099O675P536R281J2130J5824J9830K3704K7249L0495L3623L6741
60389G22486L9479M0892L9981L6257K9751K0856J0486r6j0187k0056k9730l7786
60377H42333m2321m3043m1429l8827l5403l1220k7102k3859k1421j9279j7289
60366E01140j5553j4088j2947j2180j1455j0333r034q246p980p441o277n047m188
60353C76371l465k804k664l041l146k655k330k661k940k440j600j136q41l31o9
60338C44248n63j170r27n2M63L78J68r5p06j385j426p49P8P77J490K164K493K371
60320C47557J800O84o84j380q90O3M92M73O39Q98P58M07L46K61m36j290j327p73
$$ plain form
60302 347598 346772 345139 343209 342178 342331 342892 343221 343356 343497 343700 344096 344875 346072 347763 350232 353474
60286 353474 356771 359405 361613 364144 366931 368931 369508 369396 369986 371998 375141 378806 382662 386545 390011
60271 390011 392391 393478 393993 394958 396596 398209 399209 399865 400785 402120 403589 404960 406105 406856 407252 407757
60255 407757 408916 410874 413553 417084 421719 427457 434151 441964 451340 462433 474730 487245 498901
60242 498901 508730 515891 519696 519772 516332 510191 502264 493070 482937 472598 463123 455169 448653 443296
60228 443296 439055 435832 433239 430972 429116 427764 426577 424996 422640 419371 415350 411275 408152 406405
60214 406405 405520 404885 404631 405237 406626 408239 409859 411886 414847 419040 424572 431369 439201 448001 458060
60199 458060 469521 481755 493544 503841 512010 517390 519128 516703 510472 501552 491231 480412 469440
$$ packed form
60302C47598q26j633j930j031J53N61L29J35J41K03L96P79J197J691K469L242
60286C53474L297K634K208K531K787K000N77j12N90K012L143L665L856L883L466
60271C90011K380J087N15R65J638J613J000O56R20J335J469J371J145P51L96N05
60255D07757J159J958K679L531M635N738O694P813R376J1093J2297J2515J1656
60242D98901R829P161L805P6l440o141p927r194j0133j0339r475p954o516n357
60228D43296m241l223k593k267j856j352j187j581k356l269m021m075l123j747
60214D06405q85o35k54O06J389J613J620K027K961M193N532O797P832Q800J0059
60199D58060J1461J2234J1789J0297Q169N380J738k425o231q920j0321j0819j0972
$$ plain form
60186 469440 458349 447288 436649 426852 418212 411032 405548 401589 398513 395689 392889 390091 387203
60173 387203 384260 381632 379711 378478 377668 377214 377234 377649 378132 378486 378872 379586 380707 381958 382918 383417 383674
60156 383674 383921 383972 383490 382650 382172 382546 383554 384697 385656 386190 386078 385515 385140 385167 384813 383163 380487 378212
60138 378212 377621 378859 381083 383150 384313 384725 385322 386856 389042 390973 392317 393651 395563 397819 399668
60123 399668 400758 401552 402938 405522 409198 413359 417556 421903 426733 431935 436845 440819 443816 446388
60109 446388 449191 452494 456074 459539 462665 465314 467187 467981 467948 467953 468687 469969 471052 471459 471211 470342 468647
60092 468647 466068 463019 460053 457301 454525 451749 449540 448399 447981 447335 446088 445040 445290 446944 449026
60077 449026 450529 451164 451159 450816 450394 450092 449994 450218 451069 452711 454739 456506 457874 459209 460576 461514 461808
$$ packed form
60186D69440j1091j1061j0639r797q640p180n484l959l076k824k800k798k888
60173C87203k943k628j921j233q10m54K0M15M83L54L86P14J121J251R60M99K57
60156C83674K47N1m82q40m78L74J008J143R59N34j12n63l75K7l54j650k676k275
60138C78212n91J238K224K067J163M12N97J534K186J931J344J334J912K256J849
60123C99668J090P94J386K584L676M161M197M347M830N202M910L974K997K572
60109D46388K803L303L580L465L126K649J873P94l3NP34J282J083M07k48q69j695
60092D68647k579l049k966k752k776k776k209j141m18o46j247j048K50J654K082
60077D49026J503O35nl43m22l02r8K24Q51J642K028J767J368J335J367R38K94
$$ plain form
60060 461808 461962 462559 463526 464365 464783 464754 464285 463542 463026 463248 464256 465685 467218 468868 470892 473505 476546
60043 476546 479470 481908 484176 486908 490195 493525 496564 499470 502338 504942 507335 510125 513752 517873
60029 517873 521799 525124 527591 528781 528443 526893 524762 522527 520434 518466 516189 513129 509612 506670
60015 506670 504713 502851 500067 496511 492993 489655 486017 482120 478777 476554 475092 473573 471575 469428
60001 469428 467941 467682 468342 469046 469396 469828 470749 471893 472993 474509 477040 480421 484072 487954 492413 497358
59985 497358 502349 507352 512666 518148 523287 528056 532952 538021 542458 545324 546145 544731 541051 535537
59971 535537 529049 522226 515167 507931 500940 494629 488925 483360 477593 471691 465924 460363 454761 448998
59957 448998 443588 439418 436797 435070 433467 432010 431272 431510 432427 433609 434823 436079 437699 440110 443206
$$ packed form
60060D61808J54N97R67Q39M18k9m69p43n16K22J008J429J533J650K024K613L041
60043D76546K924K438K268K732L287L330L039K906K868K604K393K790L627M121
60029E17873L926L325K467J190l38j550k131k235k093j968k277l060l517k942
60015E06670j957j862k784l556l518l338l638l897l343k223j462j519j998k147
60001D69428j487k59O60P04L50M32R21J144J100J516K531L381L651L882M459M945
59985D97358M991N003N314N482N139M769M896N069M437K866Q21j414l680n514
59971E35537o488o823p059p236o991o311n704n565n767n902n767n561n602n763
59957D48998n410m170k621j727j603j457p38K38R17J182J214J256J620K411L096
$$ plain form
59942 443206 446138 448070 448857 448725 447672 445677 443103 440286 437001 432919 428366 424010 420018 416171 412568
59927 412568 409464 406533 403069 398936 394683 390675 386733 382666 378525 374260 369763 365329 361569 358729
59913 358729 356590 355062 354386 354645 355583 356977 358729 360597 362300 363907 365574 366888 367036 365815 363991
59898 363991 362594 362224 363013 364766 367028 369476 372226 375456 378848 381878 384477 386809 388583 389300 389121
59883 389121 388679 388061 386813 385046 383669 383211 383183 382879 382129 380986 379394 377537 375928 374853 374270 374432
59867 374432 375810 378044 379847 380550 381063 382667 385497 388929 392893 397805 403428 408705 412804 415716 417755
59852 417755 419010 419435 419066 417906 415827 412796 409159 405541 402378 399575 396817 394203 392246 391083 390082
59837 390082 388696 387341 386813 387016 387095 386739 386547 386923 387464 387767 388090 388772 389651 390532 391672 393288 395042
$$ packed form
59942D43206K932J932P87j32j053j995k574k817l285m082m553m356l992l847l603
59927D12568l104k931l464m133m253m008l942m067m141m265m497m434l760k840
59913C58729k139j528o76K59R38J394J752J868J703J607J667J314J48j221j824
59898C63991j397l70P89J753K262K448K750L230L392L030K599K332J774P17j79
59883C89121m42o18j248j767j377m58k8l04p50j143j592j857j609j075n83J62
59867C74432J378K234J803P03N13J604K830L432L964M912N623N277M099K912K039
59852D17755J255M25l69j160k079l031l637l618l163k803k758k614j957j163j001
59837C90082j386j355n28K03P9l56j92L76N41L03L23O82Q79Q81J140J616J754
$$ plain form
59820 395042 396571 398054 399696 401081 401778 402403 404362 408444 414121 420284 426345 432540 439401 446961 454465
59805 454465 460911 465924 469876 473159 475659 477053 477213 476074 473527 469818 465802 462421 460006 458340
59791 458340 457248 456823 457166 458183 459674 461580 464135 467677 472135 476834 481150 485286 489917 495112 500118
59776 500118 504301 507635 510004 510709 509222 506026 502154 498184 494165 490193 486441 482757 478886 475203
59762 475203 472597 471364 470537 468716 465550 462085 459592 458309 457603 457227 457819 459983 463499 467989 473958
59747 473958 482325 492949 504365 515041 524199 531235 535269 535944 534266 532161 531363 532874 536965 542984
59733 542984 549339 554162 556251 555393 552040 546809 540097 532006 522777 513183 504113 495641 486920 477187
59719 477187 466644 456298 447339 440704 436643 434334 432313 429635 426467 423459 420967 419134 418215 418342
$$ packed form
59820C95042J529J483J642J385O97O25J959M082N677O163O061O195O861P560P504
59805D54465O446N013L952L283K500J394J60j139k547l709m016l381k415j666
59791D58340j092m25L43J017J491J906K555L542M458M699M316M136M631N195N006
59776E00118M183L334K369P05j487l196l872l970m019l972l752l684l871l683
59762D75203k606j233q27j821l166l465k493j283p06l76N92K164L516M490N969
59747D73958Q367J0624J1416J0676R158P036M034O75j678k105p98J511M091O019
59733E42984O355M823K089q58l353n231o712q091r229r594r070q472q721r733
59719D77187j0543j0346q959o635m061k309k021k678l168l008k492j833r19J27
$$ plain form
59705 418342 419157 420023 420479 420390 419899 419435 419459 419977 420463 420374 419530 417939 415649 412887 410057 407453 405245 403716
59687 403716 403084 403004 402743 401983 401118 400707 401080 402341 404066 404987 403918 401328 399219 398952 399923 400820 401391
59670 401391 402238 403484 404580 405174 405432 405573 405704 406073 407036 408732 411006 413581 416153 418533 420828 423231
59654 423231 425596 427616 429559 432270 436263 441207 446502 451851 457109 462178 467344 473129 479533 485956
59640 485956 492061 497988 503482 507698 510347 512189 513777 514507 513633 511517 509080 506638 504081 501603 499435
59625 499435 497301 494962 492859 491465 490427 489141 487725 486603 485575 484151 482462 480989 479698 478299
59611 478299 477006 476172 475497 474504 473542 473375 474026 474875 475641 476351 476619 475979 474772 473764 473048 472318 471979 472775
59593 472775 474361 475435 475441 475049 474854 474764 474906 475961 478073 480364 482042 483169 483937 484036 483215 481710 479589
$$ packed form
59705D18342Q15Q66M56q9m91m64K4N18M86q9q44j591k290k762k830k604k208j529
59687D03716o32q0k61p60q65m11L73J261J725R21j069k590k109k67R71Q97N71
59670D01391Q47J246J096N94K58J41J31L69R63J696K274K575K572K380K295K403
59654D23231K365K020J943K711L993M944N295N349N258N069N166N785O404O423
59640D85956O105N927N494M216K649J842J588P30q74k116k437k442k557k478k168
59625D99435k134k339k103j394j038j286j416j122j028j424j689j473j291j399
59611D78299j293q34o75r93r62j67O51Q49P66P10K68o40j207j008p16p30l39P96
59593D72775J586J074Ol92j95r0J42J055K112K291J678J127P68R9q21j505k121
$$ plain form
59576 479589 476386 471934 466936 462192 457710 453075 448208 443335 438610 434216 430401 427088 423829 420504
59562 420504 417604 415520 414036 412903 412386 412741 413523 414030 414225 414680 415724 417037 418120 418882 419737 421186
59546 421186 423189 424937 425450 424460 422502 420190 417836 415826 414822 415204 416662 418689 421254 424613 428520
59531 428520 431979 433873 433804 432326 430343 428294 426012 423422 421063 419549 418740 417938 416837 415739 414767
59516 414767 413352 410785 406975 402546 398574 396260 396306 398137 400107 400984 401187 402217 404920 408641 412088
59501 412088 414641 416561 418161 419228 419414 418849 418008 417108 416002 414665 413324 412062 410735 409396 408360
59486 408360 407662 406942 406121 405694 405944 406370 406312 405662 404510 402666 400206 398011 396907 396555 395988 395026 394339
59469 394339 394178 393944 393088 391711 390183 388826 388059 388219 389073 390006 390732 391324 391648 391497 391275 391742 392939
$$ packed form
59576D79589l203m452m998m744m482m635m867m873m725m394l815l313l259l325
59562D20504k900k084j484j133n17L55P82N07J95M55J044J313J083P62Q55J449
59546D21186K003J748N13r90j958k312k354k010j004L82J458K027K565L359L907
59531D28520L459J894o9j478j983k049k282k590k359j514q09q02j101j098r72
59516D14767j415k567l810m429l972k314M6J831J970Q77K03J030K703L721L447
59501D12088K553J920J600J067J86n65q41r00j106j337j341j262j327j339j036
59486D08360o98p20q21m27K50M26n8o50j152j844k460k195j104l52n67r62o87
59469C94339j61k34q56j377j528j357p67J60Q54R33P26N92L24j51k22M67J197
$$ plain form
59452 392939 394161 395252 397101 400367 404443 408293 411863 415988 421218 427416 434437 442576 452246 463831
59438 463831 478280 497321 521808 549066 572435 584958 584388 574402 560926 548060 537648 530968
59426 530968 528871 530435 533146 535033 535964 536709 537535 537991 537353 534882 530107 523188 514711 505115 494639
59411 494639 483707 472910 462666 453337 445499 439504 434915 430977 427503 424661 422173 419586 417146
59398 417146 415417 414066 412125 409618 407826 407549 407997 407926 407018 405651 404030 402253 400726 399880 399609 399322
59382 399322 398455 396900 395296 394836 396275 399066 401966 404449 406935 409746 412604 415288 417956 420647 423243
59367 423243 426121 430061 435202 440771 446126 451452 457223 463634 470791 478769 487280 495877 504565 513461
59353 513461 521810 528295 532561 535490 537774 539242 539821 539977 539638 537821 534008 528946 523334 516702 508447
$$ packed form
59452C92939J222J091J849L266M076L850L570M125N230O198P021Q139R670J1585
59438D63831J4449J9041K4487K7258K3369J2523n70r986j3476j2866j0412o680
59426E30968k097J564K711J887R31P45Q26M56o38k471m775o919q477r596j0476
59411D94639j0932j0797j0244r329p838n995m589l938l474k842k488k587k440
59398D17146j729j351j941k507j792k77M48p1r08j367j621j777j527q46k71k87
59382C99322q67j555j604m60J439K791K900K483K486K811K858K684K668K691K596
59367D23243K878L940N141N569N355N326N771O411P157P978Q511Q597Q688Q896
59353E13461Q349O485M266K929K284J468N79J56l39j817l813n062n612o632q255
$$ plain form
59338 508447 499130 489894 481382 474128 469225 467405 467884 469117 470504 472599 476009 480879 487181 494770
59324 494770 503367 513077 524616 538400 553683 569152 584059 598304 611889 625080 638897 654621
59312 654621 672523 690985 706498 714653 712328 699940 681359 661160 642207 625876 613392 605984
59300 605984 604292 608319 617118 627494 633876 631283 618916 600263 579859 560578 543512 528883
59288 528883 516459 505761 496440 488375 481471 475710 471273 468200 466045 464216 462597 461555 461538 462883
59274 462883 465631 469172 472455 475007 477470 480787 485235 490579 496644 503214 509869 516514 523697 531828
59260 531828 540483 549052 557604 566529 575834 585474 595928 607643 620215 632915 645747 659255 673553
59247 673553 688217 702871 717102 729996 740537 748379 753636 756162 755637 752103 745765 736546 724497
$$ packed form
59338E08447r317r236q512p254m903j820M79J233J387K095L410M870O302P589
59324D94770Q597R710J1539J3784J5283J5469J4907J4245J3585J3191J3817J5724
59312F54621J7902J8462J5513Q155k325j2388j8581k0199j8953j6331j2484p408
59300F05984j692M027Q799J0376O382k593j2367j8653k0404j9281j7066j4629
59288E28883j2424j0698r321q065o904n761m437l073k155j829j619j042j7J345
59274D62883K748L541L283K552K463L317M448N344O065O570O655O645P183Q131
59260E31828Q655Q569Q552Q925R305R640J0454J1715J2572J2700J2832J3508J4298
59247F73553J4664J4654J4231J2894J0541P842N257K526n25l534o338r219j2049
$$ plain form
59234 724497 710348 694957 678489 660833 642518 624502 607386 591604 577931 566856 557737 549527
59222 549527 542146 536193 531613 527751 524538 522444 521270 520153 518856 517972 517663 517312 516709 516530 517271 518582
59206 518582 520133 522305 525609 530166 536147 544021 553996 565865 579618 595246 611243 624037 629838
59193 629838 627059 616826 601766 584747 568140 553283 540386 529141 519350 510956 503908 498354
59181 498354 494763 493489 494294 496500 499565 503448 508509 515107 523184 532273 541920 551933 562046 571579
59167 571579 579739 586055 590302 592326 592399 591329 589670 587041 582876 577674 572740 568719 565068 560977 556104
59152 556104 550370 543814 536942 530668 525569 521615 518727 517138 517063 518499 521473 525971 531517 537340 543189
59137 543189 549399 555904 561663 565471 566989 566650 564827 561455 556331 549540 541613 533349 525379 517857
$$ packed form
59234G24497j4149j5391j6468j7656j8315j8016j7116j5782j3673j1075r119q210
59222E49527p381n953m580l862l213k094j174j117j297q84l09l51o03j79P41J311
59206E18582J551K172L304M557N981P874R975J1869J3753J5628J5997J2794N801
59193F29838k779j0233j5060j7019j6607j4857j2897j1245r791q394p048n554
59181D98354l591j274Q05K206L065L883N061O598Q077R089R647J0013J0113R533
59167E71579Q160O316M247K024P3j070j659k629m165n202m934m021l651m091m873
59152E56104n734o556o872o274n099l954k888j589p5J436K974M498N546N823N849
59137E43189O210O505N759L808J518l39j823l372n124o791p927q264p970p522
$$ plain form
59123 517857 510625 503581 496793 490434 484817 480244 476604 473343 470171 467454 465537 464134 462883 462111
59109 462111 462281 462980 463339 463327 463724 464809 465991 466846 467585 468159 467796 465975 463265 460726 458907 457783 457181
59092 457181 456850 456480 456053 455920 456274 456852 457455 458344 459833 461763 463788 465963 468792 472703 477607 482849
59076 482849 487582 491461 495057 499431 505236 512423 520693 529796 539349 548778 557666 565904 573404 579971
59062 579971 585521 590102 593517 595202 594649 591807 586988 580593 573042 564806 556361 548086 540223 532858
59048 532858 526019 519740 513883 507940 501442 494677 488544 483366 478300 472323 465455 458537 452183 446531
59034 446531 441719 437923 434949 432392 430271 429126 429456 431275 434053 436867 438889 440068 441108 442568
59020 442568 444394 446641 449985 454994 461444 468940 477676 487888 499173 511161 524247 538734 553828
$$ packed form
59123E17857p232p044o788o359n617m573l640l261l172k717j917j403j251p72
59109D62111J70O99L59j2L97J085J182Q55P39N74l63j821k710k539j819j124o02
59092D57181l31l70m27j33L54N78O03Q89J489J930K025K175K829L911M904N242
59076D82849M733L879L596M374N805P187Q270R103R553R429Q888Q238P500O567
59062E79971N550M581L415J685n53k842m819o395p551q236q445q275p863p365
59048E32858o839o279n857n943o498o765o133n178n066n977o868o918o354n652
59034D46531m812l796k974k557k121j145L30J819K778K814K022J179J040J460
59020D42568J826K247L344N009O450P496Q736J0212J1285J1988J3086J4487J5094
$$ plain form
59007 553828 568513 582913 597542 611679 623861 633769 642134 648864 652793 653576 652384 650255 647006
58994 647006 642265 636451 630167 623671 617581 613147 610962 609994 608523 605653 601578 596902 592044 586864
58980 586864 580668 573075 564831 557151 550265 543418 536280 529387 523134 517475 512827 509995 508643 506978
58966 506978 503722 499530 495753 492633 489460 485814 481827 477710 473699 470119 466987 463983 461155 459098
58952 459098 458010 457201 456090 455126 455184 456429 458310 460272 462016 463396 464460 465340 465859 465576 464420 462919
58936 462919 461725 461313 462076 464031 466389 468214 469731 472289 476828 483130 490719 499675 510279 522566
58922 522566 536390 551107 565076 576525 585194 592128 597612 600537 600293 597965 594898 591196 586544
58909 586544 581510 577019 573313 570337 568441 567821 568018 568880 571321 576175 582849 589992 596904 603500 609504
$$ packed form
59007E53828J4685J4400J4629J4137J2182R908Q365O730L929P83j192k129l249
58994F47006m741n814o284o496o090m434k185r68j471k870m075m676m858n180
58980E86864o196p593q244p680o886o847p138o893o253n659m648k832j352j665
58966E06978l256m192l777l120l173l646l987m117m011l580l132l004k828k057
58952D59098j088q09j111r64N8J245J881J962J744J380J064Q80N19k83j156j501
58936D62919j194m12P63J955K358J825J517K558M539O302P589Q956J0604J2287
58922E22566J3824J4717J3969J1449Q669O934N484K925k44k328l067l702m652
58909E86544n034m491l706k976j896o20J97Q62K441M854O674P143O912O596O004
$$ plain form
58894 609504 614701 619455 623985 627496 628934 628252 626130 622860 618415 613197 607799 602305 596705 591752
58880 591752 588462 586951 586643 587524 590379 595779 603446 612654 622674 632902 643079 653451 664369
58867 664369 675781 687318 698596 709263 719116 728419 737711 747063 756032 764432 772305 778793 782058
58854 782058 781071 776693 770239 761743 750536 736804 721453 704930 687352 669577 653057 638632
58842 638632 626231 615703 607183 600627 595634 591742 588552 585680 582985 580589 578350 575672 572217 568424
58828 568424 564862 561506 558062 554567 551211 548041 545204 542923 540903 538465 535682 533507 532227 530827
58814 530827 528702 526980 527017 528364 529533 530180 531281 533531 536848 541322 547481 555602 565633 577595
58800 577595 591302 605888 620513 635307 650850 667021 683279 699758 717101 735395 754269
$$ packed form
58894F09504N197M754M530L511J438o82k122l270m445n218n398n494n600m953
58880E91752l290j511l08Q81K855N400P667R208J0020J0228J0177J0372J0918
58867F64369J1412J1537J1278J0667R853R303R292R352Q969Q400P873O488L265
58854G82058r87m378o454q496j1207j3732j5351j6523j7578j7775j6520j4425
58842F38632j2401j0528q520o556m993l892l190k872k695k396k239k678l455l793
58828E68424l562l356l444l495l356l170k837k281k020k438k783k175j280j400
58814E30827k125j722L7J347J169O47J101K250L317M474O159Q121J0031J1962
58800E77595J3707J4586J4625J4794J5543J6171J6258J6479J7343J8294J8874
$$ plain form
58789 754269 773962 795383 819035 844443 870374 894923 915766 931272 941361 946679 947338 943142
58777 943142 934503 922016 905481 884476 859840 833605 807523 782508 759377 739108 722272 708875
58765 708875 698667 691013 684778 679185 674499 671073 668153 664528 659986 655010 649408 642534 634736 627280
58751 627280 620743 614651 608794 603667 599303 594685 588812 581638 573689 565408 556999 548378 539210 529535
58737 529535 520173 511898 504471 497242 490421 484814 480576 477271 475002 474361 475293 477111 479662 483377 488049
58722 488049 492687 496818 500928 505384 509885 514276 518902 523755 528041 531003 532589 533102 532807 532077 531304
58707 531304 530541 529729 529219 529403 529911 529923 529152 527750 525387 521438 516111 510451 505104 499901 494648 489437
58691 489437 484163 478787 474118 471321 470419 470260 470128 470417 471498 473020 474731 477000 480070 483627 487588
$$ packed form
58789G54269J9693K1421K3652K5408K5931K4549K0843J5506J0089N318O59m196
58777I43142q639j2487j6535k1005k4636k6235k6082k5015k3131k0269j6836j3397
58765G08875j0208p654o235n593m686l426k920l625m542m976n602o874p798p456
58751F27280o537o092n857n127m364m618n873p174p949q281q409q621r168r675
58737E29535r362q275p427p229o821n607m238l305k269o41R32J818K551L715M672
58722D88049M638M131M110M456M501M391M626M853M286K962J586N13k95p30p73
58707E31304p63q12n10J84N08J2p71j402k363l949n327n660n347n203n253n211
58691D89437n274n376m669k797r02j59j32K89J081J522J711K269L070L557L961
$$ plain form
58676 487588 492608 499377 508035 518437 530115 541461 549757 552790 550305 543760 535097 525856 516820
58663 516820 508135 499926 492784 487256 483116 479737 477031 475293 474257 473130 471563 469820 468028 466061
58649 466061 464140 462711 461688 460608 459559 459124 459484 460431 462240 465545 470293 475738 481586 488301 496186
58634 496186 505016 514580 524740 535036 545136 555525 566610 577260 585536 590986 594931 598329 600766
58621 600766 601920 602655 603999 606096 608717 611765 614814 617143 618855 621061 624434 628379 631989 634899
58607 634899 636758 636891 635055 631636 626548 618777 607614 593628 577913 561094 543560 525939 508825
58594 508825 492600 477839 465248 454960 446557 439891 434935 430769 425885 420030 414666 411108 409114
58581 409114 407862 407229 407422 408188 409242 410797 413049 415704 418628 422415 427772 434862 443623 454201 466664
$$ packed form
58676D87588N020O769Q658J0402J1678J1346Q296L033k485o545q663r241r036
58663E16820q685q209p142n528m140l379k706j738j036j127j567j743j792j967
58649D66061j921j429j023j080j049m35L60R47J809L305M748N445N848O715P885
58634D96186Q830R564J0160J0296J0100J0389J1085J0650Q276N450L945L398K437
58621F00766J154P35J344K097K621L048L049K329J712K206L373L945L610K910
58607F34899J859J33j836l419n088p771j1163j3986j5715j6819j7534j7621j7114
58594E08825j6225j4761j2591j0288q403o666m956m166m884n855n364l558j994
58581D09114j252o33J93P66J054J555K252K655K924L787N357P090Q761J0578J2463
$$ plain form
58566 466664 480886 497076 515786 536966 559364 581004 599783 613605 620858 621192 615444 604781
58554 604781 590510 574516 558759 544089 530325 517537 506372 497100 489341 482841 477588 473171
58542 473171 469056 465526 463236 461908 460629 459349 458656 458128 456541 453863 451342 449412 447374 445488 445269
58527 445269 446941 448646 449340 450605 454193 459478 464906 470623 477885 486837 496551 506625 517210 527826
58513 527826 537423 545415 551764 556349 558923 559331 557344 552910 546944 540957 535426 529460 522596 515803
58499 515803 510042 504957 499848 494908 490632 486961 483880 481979 481615 482389 484118 487307 492041 497568 503700
58484 503700 511328 520618 530065 538459 546551 555427 564357 571654 576829 580500 582997 584438 585644 587668
58470 587668 590831 595234 601665 610956 622950 636995 652967 670944 690484 711016 732266 753473
$$ packed form
58566D66664J4222J6190J8710K1180K2398K1640J8779J3822P253L34n748j0663
58554F04781j4271j5994j5757j4670j3764j2788j1165r272p759o500n253m417
58542D73171m115l530k290j328j279j280o93n28j587k678k521j930k038j886k19
58527D45269J672J705O94J265L588N285N428N717P262Q952R714J0074J0585J0616
58513E27826R597P992O349M585K574M08j987m434n966n987n531n966o864o793
58499E15803n761n085n109m940m276l671l081j901l64P74J729L189M734N527O132
58484E03700P628R290R447Q394Q092Q876Q930P297N175L671K497J441J206K024
58470E87668L163M403O431R291J1994J4045J5972J7977J9540K0532K1250K1207
$$ plain form
58458 753473 772869 788812 800909 809468 814700 817122 817832 817619 816629 815447 815286 816174 816100 813002 806715
58443 806715 798135 787639 775372 762056 748365 734406 720607 708011 696804 685884 674933 665417
58431 665417 658316 652322 645907 639852 635958 634352 633903 634444 636756 640957 646592 653752 662520 671802 680188
58416 680188 687537 694443 700713 705662 709273 711694 712172 709858 705184 699206 692128 683610 673986 664001
58402 664001 653896 643736 633842 624021 613368 601965 591685 584040 578286 572967 568139 564570 561924
58389 561924 559476 557709 557463 558374 559815 562568 567803 575208 583802 593741 605482 617816 628565 636714
58375 636714 642317 645015 644416 641258 636505 629941 621301 611997 603862 596857 589828 582898 577213 572982
58361 572982 569716 567950 568769 571938 576290 581630 588515 596509 604306 611249 617210 621469 623240 622787 620584
$$ packed form
58458G53473J9396J5943J2097Q559N232K422P10k13r90j182j61Q88p4l098o287
58443H06715q580j0496j2267j3316j3691j3959j3799j2596j1207j0920j0951r516
58431F65417p101n994o415o055l894j606m49N41K312M201N635P160Q768R282Q386
58416F80188P349O906O270M949L611K421M78k314m674n978p078q518r624r985
58402F64001j0105j0160r894r821j0653j1403j0280p645n754n319m828l569k646
58389E61924k448j767k46R11J441K753N235P405Q594R939J1741J2334J0749Q149
58375F36714N603K698n99l158m753o564q640r304q135p005p029o930n685m231
58361E72982l266j766Q19L169M352N340O885P994P797O943N961M259J771m53k203
$$ plain form
58346 620584 616137 609204 601359 594695 589758 586297 584924 586057 588280 589855 591014 592743 594431 595072
58332 595072 595730 598220 602128 605812 609683 615729 624178 633342 642494 652220 662058 670384 676723 681797
58318 681797 685332 686115 684180 680717 675974 669465 661960 654932 648300 641059 633759 627798 622611 616341
58304 616341 609176 603271 599299 595831 592294 589856 589116 589467 590998 594458 599028 602631 604750 606590 608312
58289 608312 608687 607757 607228 607795 608473 608914 609916 611390 612300 613006 615168 618984 622970 626737 631433 637118
58273 637118 642361 646960 652492 659568 666948 673866 680784 687408 692520 696389 700893 706631 712192 716732
58259 716732 720915 724859 727490 728489 728673 728160 726414 724208 723189 723360 723476 723843 726087 730219 734858 740384
58243 740384 748744 759912 771643 783128 795741 809787 823679 836828 850206 863452 874558 883014
$$ packed form
58346F20584m447o933p845o664m937l461j373J133K223J575J159J729J688O41
58332E95072O58K490L908L684L871O046Q449R164R152R726R838Q326O339N074
58318F81797L535P83j935l463m743o509p505p028o632p241p300n961n187o270
58304F16341p165n905l972l468l537k438p40L51J531L460M570L603K119J840J722
58289F08312L75r30n29N67O78M41J002J474R10P06K162L816L986L767M696N685
58273F37118N243M599N532P076P380O918O918O624N112L869M504N738N561M540
58259G16732M183L944K631R99J84n13j746k206j019J71J16L67K244M132M639N526
58243G40384Q360J1168J1731J1485J2613J4046J3892J3149J3378J3246J1106Q456
$$ plain form
58231 883014 890216 896267 899554 900008 899549 898791 896552 893104 890434 888775 886429 883566 882483 883454 884193
58216 884193 884271 886138 890748 896124 901359 908046 916489 924536 931688 940469 952119 964684 976906 990162
58202 990162 1004966 1019288 1032056 1044635 1057271 1067847 1075888 1084042 1093856 1103647 1112151 1120555 1129496
58189 1129496 1137933 1146507 1157868 1172058 1185714 1197518 1210144 1225074 1240026 1253613 1268127 1285430
58177 1285430 1304275 1323772 1345250 1368706 1391802 1414484 1440009 1469336 1499105 1527263 1555827
58166 1555827 1586031 1615902 1645036 1676482 1711226 1746048 1779497 1814589 1852784 1890782 1926322
58155 1926322 1961676 1998418 2034390 2069034 2105913 2146706 2188555 2230638 2277107 2330012 2385713
58144 2385713 2442063 2502484 2568925 2637654 2706516 2779550 2859702 2943804 3029552 3120500 3219139
$$ packed form
58231H83014P202O051L287M54m59p58k239l448k670j659k346k863j083R71P39
58216H84193P8J867M610N376N235O687Q443Q047P152Q781J1650J2565J2222J3256
58202I90162J4804J4322J2768J2579J2636J0576Q041Q154R814R791Q504Q404Q941
58189A129496Q437Q574J1361J4190J3656J1804J2626J4930J4952J3587J4514J7303
58177A285430J8845J9497K1478K3456K3096K2682K5525K9327K9769K8158K8564
58166A555827L0204K9871K9134L1446L4744L4822L3449L5092L8195L7998L5540
58155A926322L5354L6742L5972L4644L6879M0793M1849M2083M6469N2905N5701
58144B385713N6350O0421O6441O8729O8862P3034Q0152Q4102Q5748R0948R8639
$$ plain form
58133 3219139 3322154 3427746 3540408 3663083 3792026 3924936 4066477 4220051 4382264
58124 4382264 4551602 4734175 4934417 5148718 5374942 5619272 5886693 6174201 6480877
58115 6480877 6814745 7181717 7578158 8002818 8465403 8974755 9530456 10135794 10806849
58106 10806849 11558729 12396072 13327972 14377969 15567825 16908070 18419516 20149837
58098 20149837 22157912 24504544 27279613 30623238 34706894 39718860 45888348 53500043
58090 53500043 62874023 74386079 88563913 106150551 128039645 155105045 187846418
58083 187846418 225609719 265525299 302125421 328670989 339883437 334278852 314444429
58076 314444429 285333588 252078138 218622841 187385732 159495231 135222456 114417697
$$ packed form
58133C219139J03015J05592J12662J22675J28943J32910J41541J53574J62213
58124D382264J69338J82573K00242K14301K26224K44330K67421K87508L06676
58115F480877L33868L66972L96441M24660M62585N09352N55701O05338O71055
58106A0806849P51880Q37343R31900J049997J189856J340245J511446J730321
58098B0149837K008075K346632K775069L343625M083656N011966O169488P611695
58090E3500043R373980J1512056J4177834J7586638K1889094K7065400L2741373
58083A87846418L7763301L9915580L6600122K6545568J1212448n604585j9834423
58076C14444429k9110841l3255450l3455297l1237109k7890501k4272775k0804759
$$ plain form
58069 114417697 96801234 82053036 69811625 59702715 51382881 44542326 38893708
58062 38893708 34191739 30253670 26940377 24128702 21715891 19632034 17825866 16246371
58054 16246371 14850726 13615959 12525605 11553858 10675829 9882851 9173566 8538185 7963660
58045 7963660 7445709 6983094 6566915 6186805 5841330 5531895 5252384 4994265 4755708
58036 4755708 4536355 4329121 4126633 3930786 3747277 3575450 3411465 3256581 3114121
58027 3114121 2982303 2857540 2740916 2634647 2536029 2441358 2351863 2269670 2192090 2115972
58017 2115972 2043574 1978045 1917196 1857731 1801512 1751396 1704734 1657266 1609992 1566168 1524791
58006 1524791 1483088 1442451 1405981 1372800 1340330 1309604 1282908 1258625 1233616 1208389 1185038
$$ packed form
58069A14417697j7616463j4748198j2241411j0108910q319834o840555n648618
58062C8893708m701969l938069l313293k811675k412811k083857j806168j579495
58054A6246371j395645j234767j090354r71747q78029p92978p09285o35381n74525
58045G963660n17951m62615m16179l80110l45475l09435k79511k58119k38557
58036D755708k19353k07234k02488j95847j83509j71827j63985j54884j42460
58027C114121j31818j24763j16624j06269r8618r4671q9495q2193p7580p6118
58017B115972p2398o5529o0849n9465n6219n0116m6662m7468m7274m3824m1377
58006A524791m1703m0637l6470l3181l2470l0726k6696k4283k5009k5227k3351
$$ plain form
57995 1185038 1162393 1138044 1112876 1088951 1065257 1040044 1015026 992767 972318 951836 932997
57984 932997 918145 905445 891473 876414 862111 847258 829292 809163 789598 770422 750088
57973 750088 730043 712967 698233 683502 669343 657879 648365 638480 628681 620966 614552 607089 599112
57960 599112 593008 588608 583957 579511 577249 576284 573599 568844 564489 561362 557702 552570 546859 540951
57946 540951 534394 527723 521880 516160 509296 501891 495246 488809 481487 474296 468740 463694 457155 450082
57932 450082 445189 442675 440457 437902 435923 433919 430032 424263 418320 412652 406546 400704 396671 393983
57918 393983 390851 387356 385086 383958 382435 380648 380256 381271 381950 381953 382750 384736 386607 387798 389071 390590
57902 390590 391742 392845 394705 396597 397096 396763 397602 399928 402201 403838 405716 407954 409604 410580 411544
$$ packed form
57995A185038k2645k4349k5168k3925k3694k5213k5018k2259k0449k0482j8839
57984I32997j4852j2700j3972j5059j4303j4853j7966k0129j9565j9176k0334
57973G50088k0045j7076j4734j4731j4159j1464r514r885r799p715o414p463p977
57960E99112o104m400m651m446k262r65k685m755m355l127l660n132n711n908
57946E40951o557o671n843n720o864p405o645o437p322p191n556n046o539p073
57932D50082m893k514k218k555j979k004l887n769n943n668o106n842m033k688
57918C93983l132l495k270j128j523j787l92J015O79LP97J986J871J191J273J519
57902C90590J152J103J860J892M99l33Q39K326K273J637J878K238J650R76R64
$$ plain form
57887 411544 411905 410267 406791 402833 398430 392655 386258 381235 377722 373955 369538 366050 364039 362014
57873 362014 359015 355795 352822 349384 345350 341764 339028 336331 333393 330935 329067 327077 325126 324243
57859 324243 324321 324094 323419 323618 325177 327039 328639 330685 333437 336061 338235 340672 343616 346510 349465
57844 349465 353294 357763 361646 364897 369011 374804 381579 388760 396507 404353 411269 417580 424884 433390
57830 433390 441225 447060 451573 455526 458181 458632 457168 454361 450082 444247 437299 429396 420371 410980
57816 410980 402704 395686 388355 379828 371277 364104 358100 352315 346663 341768 338062 335631 334183 332830
57802 332830 330799 328633 327629 327923 328305 328157 328311 329656 332125 335387 339342 343578 347508 351289 355437
57787 355437 359383 361785 362511 362860 363497 363631 362669 361245 360016 358690 356782 354233 350946 346813 342408
$$ packed form
57887D11544L61j638l476l958m403n775o397n023l513l767m417l488k011k025
57873C62014k999l220k973l438m034l586k736k697k938k458j868j990j951q83
57859C24243P8k27o75J99J559J862J600K046K752K624K174K437K944K894K955
57844C49465L829M469L883L251M114N793O775P181P747P846O916O311P304Q506
57830D33390P835N835M513L953K655M51j464k807m279n835o948p903r025r391
57816D10980q276p018p331q527q551p173o004n785n652m895l706k431j448j353
57802C32830k031k166j004K94L82j48J54J345K469L262L955M236L930L781M148
57787C55437L946K402P26L49O37J34r62j424j229j326j908k549l287m133m405
$$ plain form
57772 342408 338379 334067 328209 321107 314445 308670 302414 295048 287957 282467 278179 274242 270735 267833
57758 267833 265013 262112 259960 259085 258978 259352 260829 263506 266191 268021 269583 271477 272977 273168 272332
57743 272332 271138 269449 266989 264335 262296 261027 260460 260752 261639 262294 262531 263161 264510 265754 266464 267597
57727 267597 269948 272725 274769 276240 278005 280149 282247 284449 287246 290607 294134 297614 300888 303837
57713 303837 306970 311103 315795 319101 319612 317878 315109 311558 307117 302450 298343 294664 291021 287851
57699 287851 285786 284487 283018 280944 278314 275104 271479 268070 265237 262559 259699 257143 255468 254523
57685 254523 253973 253965 254574 255358 256124 257362 259236 260989 262140 263418 265556 267968 269618 270510 271351 272336 273238
57668 273238 274122 275064 275671 275722 275653 275654 275050 273477 271864 271153 270723 269371 267268 265682 265118 264954 264654 264113
$$ packed form
57772C42408m029m312n858p102o662n775o256p366p091n490m288l937l507k902
57758B67833k820k901k152q75j07L74J477K677K685J830J562J894J500J91q36
57743B72332j194j689k460k654k039j269n67K92Q87O55K37O30J349J244P10J133
57727B67597K351K777K044J471J765K144K098K202K797L361L527L480L274K949
57713C03837L133M133M692L306N11j734k769l551m441m667m107l679l643l170
57699B87851k065j299j469k074k630l210l625l409k833k678k860k556j675r45
57685B54523n50qO09P84P66J238J874J753J151J278K138K412J650Q92Q41R85R02
57668B73238Q84R42O07N1o9Jo04j573j613p11m30j352k103j586n64j64l00n41
$$ plain form
57650 264113 262915 260468 256976 253413 250443 248033 246063 244593 243545 242664 241689 240196 237685 234321 231124
57635 231124 228798 226894 224689 222296 220105 217800 214922 211989 209944 208756 207541 205936 204444 203509
57621 203509 203058 202903 202836 202421 201387 200183 199555 199622 199815 199543 198448 196331 193387 190297 187632 185433 183664
57604 183664 182529 181861 180887 179225 177520 176425 175664 174796 174098 173795 173186 171719 170242 169829 169840 168630 165963
57587 165963 163277 161558 160339 158993 157716 156834 156189 155778 156182 157919 160875 164645 168972 173753 179151
57572 179151 185816 194560 205857 220124 238327 261691 291054 327093 370815 422494 479462 535276
57560 535276 581284 609323 614345 596354 560519 514663 465844 418732 375999 338853 307184 280269
57548 280269 257731 239387 224423 211639 200567 191501 184334 178212 172540 167516 163398 159876 156543
$$ packed form
57650B64113j198k447l492l563k970k410j970j470j048q81r75j493k511l364l197
57635B31124k326j904k205k393k191k305k878k933k045j188j215j605j492r35
57621B03509m51j55o7m15j034j204o28O7J93k72j095k117k944l090k665k199j769
57604A83664j135o68r74j662j705j095p61q68o98l03o09j467j477m13J1j210k667
57587A65963k686j719j219j346j277q82o45m11M04J737K956L770M327M781N398
57572A79151O665Q744J1297J4267J8203K3364K9363L6039M3722N1679N6968N5814
57560E35276M6008K8039N022j7991l5835m5856m8819m7112m2733l7146l1669k6915
57548B80269k2538j8344j4964j2784j1072r066p167o122n672n024m118l522l333
$$ plain form
57535 156543 153470 151040 149536 148948 148865 148644 148097 147809 148251 148839 148597 147488 146216 144904 143003 140554
57519 140554 138425 137003 135678 134035 132674 132278 132581 132826 132717 132447 132196 132077 132208 132505 132752 133082 133972
57502 133972 135504 137015 137718 137283 135755 133438 131122 129822 129870 130615 131238 131407 130939 129449 126911 124077
57486 124077 121712 119659 117236 114433 112090 110796 110131 109290 108175 107389 107132 106595 104903 102445 100605
57471 100605 99996 99626 98281 96125 94287 93186 92180 90749 89199 88034 87312 86876 86650 86438 85857 84742
57455 84742 83395 82248 81543 81326 81465 81637 81592 81450 81478 81694 82026 82647 83681 84696 85081 84918 84857 85131 85355
57436 85355 85418 85901 87242 88988 90214 90395 89668 88527 87477 86721 86013 85025 83885 83085 82892 83132 83506
57419 83506 83774 83728 83443 83501 84443 85993 87296 87935 88207 88428 88557 88592 88724 88943 89059 89199 89698 90327 90298 89377
$$ packed form
57535A56543l073k430j504n88q3k21n47k88M42N88k42j109j272j312j901k449
57519A40554k129j422j325j643j361l96L03K45j09k70k51j19J31K97K47L30Q90
57502A33972J532J511P03m35j528k317k316j300M8P45O23J69m68j490k538k834
57486A24077k365k053k423k803k343j294o65q41j115p86k57n37j692k458j840
57471A00605o09l70j345k156j838j101j006j431j550j165p22m36k26k12n81j115
57455H4742j347j147p05k17J39J72m5j42K8K16L32O21J034J015L85j63o1K74K24
57436H5355O3M83J341J746J226J81p27j141j050p56p08r88j140q00j93K40L74
57419H3506K68m6k85N8R42J550J303O39K72K21J29L5J32K19J16J40M99O29k9r21
$$ plain form
57399 89377 88336 87883 87614 86508 84193 81349 79078 78064 78070 78076 77185 75504 73874 72748 71809 70702 69500
57382 69500 68243 66689 64869 63282 62095 60740 58865 57184 56676 57155 57317 56208 54109 51956 50307
57367 50307 49007 47574 45739 43678 41784 40237 38865 37428 35915 34544 33671 33617 34345 35259 35633 35331
57351 35331 34880 34795 35126 35680 36366 37154 37959 38690 39252 39468 39238 38724 38114 37296 36120 34891 34150 33924 33729
57332 33729 33331 32967 32684 32089 31015 29933 29307 28948 28343 27276 25788 23876 21622 19413 17675 16520
57316 16520 15814 15337 14714 13471 11504 9347 7746 7034 6932 6743 5736 3709 1271 -715 -2076 -3342
57300 -3342 -4822 -6113 -6704 -6612 -6186 -5743 -5632 -6179 -7172 -7805 -7598 -7043 -6957 -7411 -7763 -7637 -7448 -7927 -9386
57281 -9386 -11435 -13276 -14294 -14436 -14084 -13742 -13919 -14984 -16654 -17835 -17555 -16104 -14710 -14161 -14338 -15058 -16456
$$ packed form
57399H9377j041m53k69j106k315k844k271j014OOq91j681j630j126r39j107j202
57382F9500j257j554j820j587j187j355j875j681n08M79J62j109k099k153j649
57367E0307j300j433j835k061j894j547j372j437j513j371q73n4P28R14L74l02
57351C5331m51q5L31N54O86P88Q05P31N62K16k30n14o10q18j176j229p41k26j95
57332C3729l98l64k83n95j074j082o26l59o05j067j488j912k254k209j738j155
57316A6520p06m77o23j243j967k157j601p12j02j89j007k027A271g15j361j266
57300c342j480j291n91R2M26M43J11n47r93o33K07N55Q6m54l52J26J89m79j459
57281i386k049j841j018j42L52L42j77j065j670j181K80J451J394N49j77p20j398
$$ plain form
57264 -16456 -18268 -19619 -20126 -20513 -21567 -23010 -24043 -24494 -24798 -25182 -25552 -25901 -26252 -26413 -26310 -26330 -26816 -27484
57246 -27484 -27929 -28451 -29739 -31830 -34066 -36010 -37831 -39701 -41416 -42804 -44122 -45769 -47812 -49919 -51689
57231 -51689 -53049 -54388 -56167 -58279 -60030 -60913 -61152 -61288 -61604 -62253 -63534 -65524 -67706 -69515 -71120 -73093
57215 -73093 -75391 -77293 -78448 -79477 -81334 -84386 -88280 -92347 -95985 -98849 -100891 -102247 -103119 -103869 -105058
57200 -105058 -107137 -110106 -113617 -117300 -120843 -123910 -126331 -128339 -130343 -132469 -134516 -136371 -138185 -140161
57186 -140161 -142351 -144739 -147323 -150012 -152496 -154328 -155222 -155324 -155119 -154952 -154665 -153865 -152457 -150743 -149095 -147862
57170 -147862 -147492 -148287 -150029 -152355 -155614 -160723 -167928 -176200 -184163 -191172 -197210 -202365 -206956 -211649 -216774
57155 -216774 -221854 -226430 -231002 -236418 -242579 -248567 -253991 -259407 -265282 -271269 -276848 -282118 -287577 -293467
$$ packed form
57264a6456j812j351n07l87j054j443j033m51l04l84l70l49l51j61J03k0m86o68
57246b7484m45n22j288k091k236j944j821j870j715j388j318j647k043k107j770
57231e1689j360j339j779k112j751q83k39j36l16o49j281j990k182j809j605j973
57215g3093k298j902j155j029j857l052l894m067l638k864k042j356q72p50j189
57200a05058k079k969l511l683l543l067k421k008k004k126k047j855j814j976
57186a40161k190k388k584k689k484j832q94j02K05J67K87Q00J408J714J648J233
57170a47862L70p95j742k326l259n109p205q272p963p009o038n155m591m693n125
57155b16774n080m576m572n416o161n988n424n416n875n987n579n270n459n890
$$ plain form
57141 -293467 -299680 -306063 -312489 -318693 -324382 -329605 -334880 -340738 -347068 -353098 -358255 -362956 -368162 -374191
57127 -374191 -380461 -386450 -392272 -397997 -403119 -407345 -411446 -416583 -422997 -429997 -437026 -444002 -450722 -456748
57113 -456748 -462042 -467099 -472236 -477292 -482172 -487173 -492543 -498119 -503692 -509401 -515498 -522003 -528796 -535874
57099 -535874 -543296 -551069 -559156 -567452 -575676 -583551 -591216 -599261 -608136 -617660 -627264 -636658 -646130 -656226
57085 -656226 -667217 -678907 -690867 -702724 -714182 -724926 -734807 -744111 -753333 -762614 -771680 -780420 -789179
57072 -789179 -798272 -807596 -816989 -826649 -836917 -848058 -860668 -875826 -894127 -914684 -935736 -956256
57060 -956256 -976530 -997277 -1019002 -1042447 -1069040 -1100390 -1137489 -1180564 -1229264 -1282579 -1338774
57049 -1338774 -1396042 -1453495 -1511494 -1571011 -1632862 -1697699 -1766558 -1840985 -1922370 -2011214 -2107195
$$ packed form
57141b93467o213o383o426o204n689n223n275n858o330o030n157m701n206o029
57127c74191o270n989n822n725n122m226m101n137o414p000p029o976o720o026
57113d56748n294n057n137n056m880n001n370n576n573n709o097o505o793p078
57099e35874p422p773q087q296q224p875p665q045q875r524r604r394r472j0096
57085f56226j0991j1690j1960j1857j1458j0744r881r304r222r281r066q740q759
57072g89179r093r324r393r660j0268j1141j2610j5158j8301k0557k1052k0520
57060i56256k0274k0747k1725k3445k6593l1350l7099m3075m8700n3315n6195
57049a338774n7268n7453n7999n9517o1851o4837o8859p4427q1385q8844r5981
$$ plain form
57038 -2107195 -2209853 -2318988 -2434543 -2556573 -2685507 -2822165 -2967275 -3121140 -3283933
57029 -3283933 -3456181 -3638765 -3832466 -4037696 -4254770 -4484488 -4728357 -4988094 -5264949
57020 -5264949 -5559802 -5873939 -6209354 -6568261 -6952967 -7366504 -7812663 -8294870 -8815777
57011 -8815777 -9378807 -9989732 -10656095 -11385961 -12188516 -13075547 -14061397 -15162342 -16398156
57002 -16398156 -17795176 -19388014 -21220283 -23347308 -25841013 -28795269 -32332562 -36613222
56994 -36613222 -41843769 -48279829 -56223749 -66015302 -78003968 -92494010 -109677608 -129588767
56986 -129588767 -152095352 -176916839 -203646489 -231768856 -260673368 -289670647 -318026529
56979 -318026529 -345018274 -369975657 -392250880 -411126798 -425769543 -435326499 -439138249
$$ packed form
57038b107195j02658j09135j15555j22030j28934j36658j45110j53865j62793
57029c283933j72248j82584j93701k05230k17074k29718k43869k59737k76855
57020e264949k94853l14137l35415l58907l84706m13537m46159m82207n20907
57011h815777n63030o10925o66363p29866q02555q87031r85850j100945j235814
57002a6398156j397020j592838j832269k127025k493705k954256l537293m280660
56994c6613222n230547o436060p943920r791553j1988666j4490042j7183598j9911159
56986a29588767k2506585k4821487k6729650k8122367k8904512k8997279k8355882
56979c18026529k6991745k4957383k2275223j8875918j4642745r556956l811750
$$ plain form
56972 -439138249 -436920738 -428811452 -415299404 -397118469 -375144222 -350294818 -323452085
56965 -323452085 -295433353 -267009002 -238919089 -211852997 -186400186 -163002586 -141929162
56958 -141929162 -123278125 -107004278 -92961010 -80941594 -70711067 -62029868 -54671066
56951 -54671066 -48429491 -43123866 -38597420 -34719041 -31381637 -28496967 -25991307 -23804009
56943 -23804009 -21885843 -20195557 -18697744 -17363498 -16170658 -15101491 -14140129 -13271920
56935 -13271920 -12483626 -11763448 -11101740 -10491976 -9929855 -9411004 -8930492 -8484507 -8070953
56926 -8070953 -7688004 -7333555 -7006470 -6706385 -6430744 -6172946 -5924748 -5680344 -5437965
56917 -5437965 -5198833 -4965707 -4741667 -4528771 -4327425 -4137133 -3957426 -3787840 -3627695
$$ packed form
56972d39138249K217511Q109286J3512048J8180935K1974247K4849404K6842733
56965c23452085K8018732K8424351K8089913K7066092K5452811K3397600K1073424
56958a41929162J8651037J6273847J4043268J2019416J0230527Q681199P358802
56951e4671066O241575N305625M526446L878379L337404K884670K505660K187298
56943b3804009J918166J690286J497813J334246J192840J069167R61362Q68209
56935a3271920P88294P20178O61708O09764N62121N18851M80512M45985M13554
56926h070953L82949L54449L27085L00085K75641K57798K48198K44404K42379
56917e437965K39132K33126K24040K12896K01346J90292J79707J69586J60145
$$ plain form
56908 -3627695 -3476500 -3334318 -3201354 -3077512 -2962504 -2855885 -2756788 -2664190 -2577743 -2497781
56898 -2497781 -2424246 -2356131 -2292223 -2231840 -2174449 -2119217 -2065428 -2012980 -1962079 -1912648 -1864358
56887 -1864358 -1816992 -1770562 -1725230 -1681118 -1637977 -1595142 -1552271 -1510002 -1469459 -1431298 -1395925
56876 -1395925 -1364339 -1337711 -1315885 -1297133 -1279583 -1262205 -1244343 -1225363 -1205236 -1184535 -1163276
56865 -1163276 -1140509 -1115691 -1089809 -1064489 -1040425 -1017251 -994424 -971549 -948211 -924098 -899182
56854 -899182 -873496 -847229 -821584 -799049 -782069 -771422 -766142 -764595 -765089 -765876 -765545 -763630 -760450
56841 -760450 -756325 -751262 -745310 -738659 -731280 -722805 -712965 -701880 -689750 -676342 -660867 -642318 -619967
56828 -619967 -593819 -564947 -535656 -509268 -489284 -478067 -475866 -480867 -490126 -500721 -510621 -519056
$$ packed form
56908c627695J51195J42182J32964J23842J15008J06619R9097R2598Q6447P9962
56898b497781P3535O8115O3908O0383N7391N5232N3789N2448N0901M9431M8290
56887a864358M7366M6430M5332M4112M3141M2835M2871M2269M0543L8161L5373
56876a395925L1586K6628K1826J8752J7550J7378J7862J8980K0127K0701K1259
56865a163276K2767K4818K5882K5320K4064K3174K2827K2875K3338K4113K4916
56854h99182K5686K6267K5645K2535J6980J0647N280J547m94p87L31J915L180
56841g60450M125N063N952O651P379Q475R840J1085J2130J3408J5475J8549K2351
56828f19967K6148K8872K9291K6388J9984J1217K201n001r259j0595r900q435
$$ plain form
56816 -519056 -526167 -532184 -536988 -540402 -542517 -543452 -543176 -541885 -540238 -538699 -536928 -534334 -531022 -527588 -524149
56801 -524149 -520277 -515830 -511163 -506432 -501316 -495540 -489190 -482441 -475506 -468800 -462551 -456147 -448477 -439041
56787 -439041 -428174 -416171 -402894 -388416 -373368 -358328 -343535 -329557 -317754 -309604 -305778 -305935
56775 -305935 -308979 -313439 -318104 -322533 -326624 -329749 -330947 -329996 -327590 -324337 -320257 -315347 -309729 -302901
56761 -302901 -293635 -281091 -265365 -246541 -224085 -197923 -169731 -142719 -120573 -106727 -103398 -110138
56749 -110138 -123599 -139596 -155442 -170116 -183011 -193458 -201216 -206488 -209354 -209673 -207431 -202680 -195197
56736 -195197 -184551 -170338 -151990 -128544 -99001 -62912 -20738 25422 70843 108450 131485
56725 131485 136588 124708 99776 67025 31760 -1858 -31721 -57448 -79216 -97066 -111029 -121291
$$ packed form
56816e19056p111o017m804l414k115r35K76J291J647J539J771K594L312L434L439
56801e24149L872M447M667M731N116N776O350O749O935O706O249O404P670R436
56787d39041J0867J2003J3277J4478J5048J5040J4793J3978J1803Q150L826j57
56775c05935l044m460m665m429m091l125j198R51K406L253M080M910N618O828
56761c02901R266J2544J5726J8824K2456K6162K8192K7012K2146J3846L329o740
56749a10138j3461j5997j5846j4674j2895j0447p758n272k866l19K242M751P483
56736a95197J0646J4213J8348K3446K9543L6089b0738B5422M5421L7607K3035
56725A31485N103j1880k4932l2751C1760a858k9863k5727k1768j7850j3963j0262
$$ plain form
56713 -121291 -128100 -131733 -132516 -130539 -125368 -116249 -102499 -83530 -58783 -28232 6651 42325 73452
56700 73452 94326 101138 93868 76064 52550 27145 2137 -21074 -41591 -58930 -72892 -83521
56688 -83521 -91347 -97288 -101888 -104869 -105595 -103633 -98729 -90772 -80078 -67193 -52119 -34572 -15696
56674 1083 11838 14554 9514 -1912 -17770 -35287 -51711 -65862 -78203 -89352 -99212 -107606 -114817
56661 -114817 -121066 -126051 -129448 -131476 -132671 -133404 -133868 -134237 -134573 -134750 -134622 -134166 -133393 -132377 -131412 -130906 -130933
56644 -130933 -131040 -130648 -129643 -128501 -127847 -127872 -128250 -128664 -129212 -130079 -130905 -130949 -129948 -128461 -127230 -126551 -126334 -126330
56626 -126330 -126117 -125315 -124079 -122975 -122157 -121148 -119660 -118093 -116864 -115763 -114360 -112578 -110468 -107964 -105317
56611 -105317 -103230 -102005 -101047 -99730 -98251 -97055 -96012 -94881 -94006 -93708 -93441 -92508 -91236 -90464 -90167 -89670
$$ packed form
56713a21291o809l633p83J977N171R119J3750J8969K4747b8232F651L5674L1127
56700G3452K0874O812p270j7804k3514k5405B137b1074k0517j7339j3962j0629
56688h3521p826n941m600k981p26J962M904P957J0694J2885J5074J7547a5696
56674A083J0755K716n040a912j5858j7517j6424j4151j2341j1149r860q394p211
56661a14817o249m985l397k028j195p33m64l69l36j77J28M56P73J016R65N06k7
56644a30933j07L92J005J142O54k5l78m14n48q67q26m4J001J487J231O79K17M
56626a26330K13Q02J236J104Q18J009J488J567J229J101J403J782K110K504K647
56611a05317K087J225R58J317J479J196J043J131Q75K98K67R33J272P72K97M97
$$ plain form
56595 -89670 -89100 -89432 -90913 -92473 -93055 -92760 -92344 -92219 -92272 -92127 -91229 -89094 -85784 -81963 -78409 -75640 -73830
56578 -73830 -72688 -71581 -70218 -69124 -68927 -69288 -69107 -67746 -65467 -62760 -59862 -57088 -55042 -54165 -54282 -54688
56562 -54688 -54576 -53574 -52122 -51109 -50880 -50919 -50797 -50832 -51256 -51260 -49772 -46838 -43401 -40006 -36669 -33792 -31975
56545 -31975 -30809 -28923 -25589 -21505 -17662 -14182 -10676 -7145 -4147 -2383 -2224 -3282 -4504 -5176 -5738
56530 -5738 -6982 -8661 -9718 -9862 -9969 -10805 -12276 -14216 -16873 -20120 -22979 -24615 -25278 -25730 -26230 -26573
56514 -26573 -26743 -26916 -27047 -26899 -26445 -26006 -26037 -26837 -28267 -29705 -30494 -30437 -29741 -28678 -27608 -27065 -27274 -27708
56496 -27708 -27631 -26975 -26196 -25448 -24482 -23238 -21889 -20441 -18932 -17831 -17493 -17385 -16697 -15593 -14883 -14540 -13675
56479 -13675 -12120 -10893 -10646 -10651 -9870 -8245 -6409 -4821 -3708 -3269 -3434 -3836 -4272 -4760 -4986 -4332 -2688
$$ packed form
56595h9670N70l32j481j560n82K95M16J25n3J45Q98K135L310L821L554K769J810
56578g3830J142J107J363J094J97l61J81J361K279K707K898K774K046Q77j17m06
56562e4688J12J002J452J013K29l9J22l5m24mJ488K934L437L395L337K877J817
56545c1975J166J886L334M084L843L480L506L531K998J764J59j058j222o72n62
56530e738j244j679j057j44j07q36j471j940k657l247k859j636o63m52n00l43
56514b6573j70j73j31J48M54M39l1q00j430j438p89N7O96J063J070N43k09m34
56496b7708P7O56P79P48R66J244J349J448J509J101L38J08O88J104P10L43Q65
56479a3675J555J227K47nP81J625J836J588J113M39j65m02m36m88k26O54J644
$$ plain form
56462 -2688 -606 1552 3940 6537 8909 10889 12840 15007 17385 20381 24624 29712 34107 36894 38825
56447 38825 41035 43461 45270 46213 46791 47484 48483 49821 51244 52192 52333 51860 51035 49865 48402 46886
56431 46886 45335 43549 41760 40655 40439 40476 40136 39441 38624 37721 36885 36387 36029 35288 34366 34271 35422 36946
56413 36946 37797 37827 37314 36342 35191 34495 34341 33913 32644 31042 29780 28796 27923 27554 27825 27874 26960 25733
56395 25733 25448 26287 27328 27899 28130 28362 28727 29243 29847 30447 31172 32186 33129 33335 32867 32553 32627 32291 31170
56376 31170 30233 30407 31111 31217 30817 31004 32287 34189 36117 37800 39074 39914 40520 40912 40831 40451 40549 41462
56358 41462 42437 42665 42295 41855 41407 41021 41288 42409 43462 43504 42850 42384 42214 42002 41978 42543 43343 43884 44565
56339 44565 45983 47594 48307 48152 48197 48968 50058 51163 52388 53517 54044 54016 54014 54209 54216 53854 53341 52796 52267
$$ packed form
56462b688f06A552K388K597K372J980J951K167K378K996M243N088M395K787J931
56447C8825K210K426J809R43N78O93R99J338J423R48J41m73q25j170j463j516
56431D6886j551j786j789j105k16L7l40o95q17r03q36m98l58p41r22r5J151J524
56413C6946Q51L0n13r72j151o96j54m28j269j602j262r84q73l69K71M9r14j227
56395B5733k85Q39J041N71K31K32L65N16O04O00P25J014R43K06m68l14P4l36j121
56376C1170r37J74P04J06m00J87J283J902J928J683J274Q40O06L92q1l80R8R13
56358D1462R75K28l70m40m48l86K67J121J053M2o54m66j70k12k4N65Q00N41O81
56339D4565J418J611P13j55M5P71J090J105J225J129N27k8kJ95Pl62n13n45n29
$$ plain form
56320 52267 52154 52897 54293 55712 56841 57644 57923 57616 57285 57592 58494 59571 60782 62202 63435 64068 64325
56303 64325 64519 64323 63468 62729 63157 64646 66253 67602 68907 69918 70085 69753 70059 71471 73290 74640
56287 74640 75212 75126 74923 75601 77784 80775 83146 84256 84551 84613 84696 85054 85952 87329 88995 90896 92672
56270 92672 93453 92953 92325 93000 94961 96992 98227 98593 98166 97231 96620 96972 97791 98201 98308 98867 100001 101313
56252 101313 102841 104729 106277 106580 105905 105266 104899 104330 103652 103384 103329 102918 102539 103099 104411 105443 106090
56235 106090 107186 108763 109922 110605 111891 114089 116012 116690 116578 116562 116877 117486 118489 119706 120738 121793
56219 121793 123498 125678 127297 127909 128178 128751 129601 130762 132653 135293 138060 140548 142889 145099 146969
56204 146969 148748 151024 153780 156400 158671 160969 163451 166014 168930 172477 175989 178470 180126 182170
$$ packed form
56320E2267j13P43J396J419J129Q03K79l07l31L07R02J077J211J420J233O33K57
56303F4325J94j96q55p39M28J489J607J349J305J011J67l32L06J412J819J350
56287G4640N72q6k03O78K183K991K371J110K95O2Q3L58Q98J377J666J901J776
56270I2672P81n00o28O75J961K031J235L66m27r35o11L52Q19M10J07N59J134J312
56252A01313J528J888J548L03o75o39l67n69o78k68n5m11l79N60J312J032O47
56235A06090J096J577J159O83J286K198J923O78j12j6L15O09J003J217J032J055
56219A21793J705K180J619O12K69N73Q50J161J891K640K767K488K341K210J870
56204A46969J779K276K756K620K271K298K482K563K916L547L512K481J656K044
$$ plain form
56190 182170 185058 188164 191289 195235 200633 207215 214437 221785 228500 234100 239226 244886 250975 256753
56176 256753 262602 269827 278655 287931 296903 305823 314672 322964 331170 340831 352777 366572 381978
56163 381978 399452 418821 439084 460176 483582 510606 541293 575618 614424 658583 708368
56152 708368 764253 827326 898403 977607 1064995 1160594 1263799 1373884 1490992 1615189 1744547
56141 1744547 1875673 2006030 2133894 2255987 2367255 2463571 2542843 2603019 2641058 2654832
56131 2654832 2644606 2612064 2559413 2489846 2406998 2313159 2209525 2098576 1984272 1869353
56121 1869353 1754528 1641021 1531707 1428579 1331178 1238766 1152218 1072529 999279 931951
56111 931951 871130 816969 768007 722881 681788 645043 611655 580661 552464 527551 505232
$$ packed form
56190A82170K888L106L125L946N398O582P222P348O715N600N126N660O089N778
56176B56753N849P225Q828R276Q972Q920Q849Q292Q206R661J1946J3795J5406
56163C81978J7474J9369K0263K1092K3406K7024L0687L4325L8806M4159M9785
56152G08368N5885O3073P1077P9204Q7388R5599J03205J10085J17108J24197J29358
56141A744547J31126J30357J27864J22093J11268R6316P9272O0176L8039J3774
56131B654832j0226l2542n2651o9567q2848r3839j03634j10949j14304j14919
56121A869353j14825j13507j09314j03128r7401r2412q6548p9689p3250o7328
56111I31951o0821n4161m8962m5126m1093l6745l3388l0994k8197k4913k2319
$$ plain form
56100 505232 484869 466961 451752 438104 424991 412815 402080 392175 382620 374056 366711 359447
56088 359447 351726 345047 340867 338362 335807 332962 330583 328665 326695 324773 323135 321424 319591 318551
56074 318551 318814 319425 319320 318808 318781 319489 320924 323277 326213 328885 331343 334554 338495 341909 344588 347984
56058 347984 352702 357521 361893 367173 374045 380960 386814 393069 401416 411206 421022 431072 442286 454770
56044 454770 468919 486372 508026 532865 560534 593358 633947 682570 738705 803184 876368
56033 876368 955588 1036391 1114854 1187076 1248711 1297852 1337253 1371525 1403319 1433722 1463913
56022 1463913 1493437 1518287 1533727 1538469 1534330 1523352 1507573 1489923 1472248 1452815 1427754 1394174
56010 1394174 1350461 1295464 1230003 1158196 1085118 1013983 946989 886877 835302 791209 753124
$$ packed form
56100E05232k0363j7908j5209j3648j3113j2176j0735r905r555q564p345p264
56088C59447p721o679m180k505k555k845k379j918j970j922j638j711j833j040
56074C18551K63O11j05n12k7P08J435K353K936K672K458L211L941L414K679L396
56058C47984M718M819M372N280O872O915N854O255Q347R790R816J0050J1214J2484
56044D54770J4149J7453K1654K4839K7669L2824M0589M8623N6135O4479P3184
56033H76368P9220Q0803P8463P2222O1635M9141L9401L4272L1794L0403L0191
56022A463913K9524K4850J5440M742m139j0978j5779j7650j7675j9433k5061l3580
56010A394174m3713n4997o5461p1807p3078p1135o6994o0112n1575m4093l8085
$$ plain form
55999 753124 721600 697289 678412 662581 649581 640042 633044 627387 623453 621413 619454 616277 613373
55986 613373 612285 611763 610425 609859 611920 615180 617515 620026 624705 630204 633971 636969 642174 649729 657547
55971 657547 665588 675531 687066 698359 709401 721364 733412 743650 752298 760634 767884 772580 775808
55958 775808 779665 783782 786856 790187 795929 803274 810197 817570 827503 839007 849395 858760 868949
55945 868949 879479 888733 897890 909299 922154 934079 945677 959127 973701 987276 1000854 1016827
55933 1016827 1034153 1050167 1065781 1083826 1103668 1122759 1142148 1164970 1190689 1216453 1242937
55922 1242937 1273056 1305968 1338294 1370377 1405300 1442581 1478943 1514574 1552498 1592511 1631960
55911 1631960 1671743 1715217 1761930 1808772 1856470 1908363 1963820 2019643 2076815 2138726 2203977
$$ packed form
55999G53124l1524k4311j8877j5831j3000r539o998n657l934k040j959l177k904
55986F13373j088n22j338n66K061L260K335K511M679N499L767K998N205P555P818
55971F57547Q041R943J1535J1293J1042J1963J2048J0238Q648Q336P250M696L228
55958G75808L857M117L074L331N742P345O923P373R933J1504J0388R365J0189
55945H68949J0530R254R157J1409J2855J1925J1598J3450J4574J3575J3578J5973
55933A016827J7326J6014J5614J8045J9842J9091J9389K2822K5719K5764K6484
55922A242937L0119L2912L2326L2083L4923L7281L6362L5631L7924M0013L9449
55911A631960L9783M3474M6713M6842M7698N1893N5457N5823N7172O1911O5251
$$ plain form
55900 2203977 2268620 2334373 2406578 2484966 2564788 2646262 2734128 2828446 2924914 3024042 3130893
55889 3130893 3245948 3365457 3490559 3626439 3772760 3924939 4084639 4258617 4447572
55880 4447572 4647106 4859416 5092275 5346471 5616549 5904226 6218352 6561319 6929024
55871 6929024 7324928 7760129 8238984 8759627 9329662 9965802 10677291 11466737 12348687
55862 12348687 13349878 14490625 15786288 17269821 18993823 21011728 23384435 26212918
55854 26212918 29644274 33846776 39008227 45363826 53203273 62866276 74791837 89599075
55846 89599075 108085703 131087077 159172249 192048147 227671781 261680329 288127970
55839 288127970 301721670 300239279 285333538 261245370 232662165 203247866 175288618
$$ packed form
55900B203977O4643O5753P2205P8388P9822Q1474Q7866R4318R6468R9128J06851
55889C130893J15055J19509J25102J35880J46321J52179J59700J73978J88955
55880D447572J99534K12310K32859K54196K70078K87677L14126L42967L67705
55871F929024L95904M35201M78855N20643N70035O36140P11489P89446Q81950
55862A2348687J001191J140747J295663J483533J724002K017905K372707K828483
55854B6212918L431356M202502N161451O355599P839447R663003J1925561J4807238
55846H9599075J8486628K3001374K8085172L2875898L5623634L4008548K6447641
55839B88127970J3593700j482391j4905741k4088168k8583205k9414299k7959248
$$ plain form
55832 175288618 149948685 127629764 108303842 91784845 77850169 66230193 56603915
55825 56603915 48653325 42100237 36691706 32194650 28422969 25244058 22548642 20235774
55817 20235774 18230308 16487528 14969621 13634833 12453114 11410959 10493106 9675619
55809 9675619 8941577 8286872 7705085 7181356 6705640 6277562 5893511 5542191 5217173
55800 5217173 4921134 4653446 4405540 4172562 3957994 3762585 3579577 3405099 3243038
55791 3243038 3095446 2957593 2826370 2704618 2593409 2488670 2389051 2299017 2220721 2150401
55781 2150401 2085613 2028083 1976321 1923206 1864522 1803165 1742074 1679879 1616360 1555249 1498299
55770 1498299 1442698 1387131 1334511 1286259 1239913 1194866 1154408 1119597 1086964 1054826 1025995
$$ packed form
55832A75288618k5339933k2318921j9325922j6518997j3934676j1619976r626278
55825E6603915p950590o553088n408531m497056l771681l178911k695416k312868
55817B0235774k005466j742780j517907j334788j181719j042155r17853q17487
55809I675619p34042o54705n81787n23729m75716m28078l84051l51320l25018
55800E217173k96039k67688k47906k32978k14568j95409j83008j74478j62061
55791C243038j47592j37853j31223j21752j11209j04739r9619r0034p8296p0320
55781B150401o4788n7530n1762n3115n8684o1357o1091o2195o3519o1111n6950
55770A498299n5601n5567n2620m8252m6346m5047m0458l4811l2633l2138k8831
$$ plain form
55759 1025995 1001702 978575 954353 931089 909987 888427 864945 842081 821537 801303 780268
55748 780268 760946 744917 729926 714028 698354 683519 667622 650113 633433 618554 603049
55737 603049 585733 569070 554815 541372 527571 515047 504657 494507 483635 473858 466008 458286
55725 458286 450285 444536 441956 439782 436132 432601 430102 426309 419850 413155 408415 404282 399273 395023
55711 395023 393321 393019 392615 393072 395592 399309 403398 408685 415038 420017 422248 423358 424584 424386 421381
55696 421381 416655 411097 403506 393499 383320 374461 365368 354794 344609 337039 331867 328550 328105
55683 328105 330304 331696 329092 322869 314756 305049 294320 285118 279248 275474 272198 270024 269442 268614
55669 268614 266070 263224 261579 259758 255949 251032 246484 241340 234237 226637 221002 217251 213722 210222
$$ packed form
55759A025995k4293k3127k4222k3264k1102k1560k3482k2864k0544k0234k1035
55748G80268j9322j6029j4991j5898j5674j4835j5897j7509j6680j4879j5505
55737F03049j7316j6663j4255j3443j3801j2524j0390j0150j0872r777p850p722
55725D58286q001n749k580k174l650l531k499l793o459o695m740m133n009m250
55711C95023j702l02m04M57K520L717M089N287O353M979K231J110J226j98l005
55696D21381m726n558p591j0007j0179q859r093j0574j0185p570n172l317m45
55683C28105K199J392k604o223q113r707j0729r202n870l774l276k174n82q28
55669B68614k544k846j645j821l809m917m548n144p103p600n635l751l529l500
$$ plain form
55655 210222 207546 205332 202965 201312 201138 201001 199007 195519 192045 188700 184888 181090 177859 174329 169813
55640 169813 165570 162894 160791 157653 153930 151035 148895 146747 145114 144747 144714 143770 142669 143014 144616
55625 144616 145923 146189 145485 143664 141107 139399 139363 139454 137932 135515 133970 133226 131892 129710 127480 125404
55609 125404 123354 121981 121782 121909 121561 121556 122822 124420 125014 125260 126669 128928 130358 130326 129325 127368 124330
55592 124330 121333 119833 119596 119176 118056 116927 116308 116260 116904 117982 118611 118670 119600 122592 126895 131120 135098
55575 135098 139105 142489 144641 146176 147548 147697 145829 143379 142261 142216 141810 141083 141186 142258 143728 145939
55559 145939 149440 153327 156270 158558 161154 163464 164095 163249 162194 160837 157962 153561 148814 143992 138393
55544 138393 132241 126688 121992 117520 113430 110478 108212 105253 101530 98512 97027 96391 95875 95504 95286
$$ packed form
55655B10222k676k214k367j653j74j37j994l488l474l345l812l798l231l530m516
55640A69813m243k676k103l138l723k895k140k148j633l67l3r44j101L45J602
55625A44616J307K66p04j821k557j708l6R1j522k417j545p44j334k182k230k076
55609A25404k050j373j99J27l48nJ266J598N94K46J409K259J430l2j001j957l038
55592A24330k997j500k37m20j120j129o19m8O44J078O29N9R30K992M303M225L978
55575A35098M007L384K152J535J372J49j868k450j118m5m06p27J03J072J470K211
55559A45939L501L887K943K288K596K310O31q46j055j357k875m401m747m822n599
55544A38393o152n553m696m472m090k952k266k959l723l018j485o36n16l71k18
$$ plain form
55529 95286 94990 94876 95401 96137 96121 95243 94187 93143 91738 89962 88083 85940 83489 81644 81271 81686 81407
55512 81407 80019 78076 75775 73193 71332 71253 72331 72922 72583 72239 72438 72915 73631 74730 75573 75240 73879
55495 73879 72300 70569 68415 66622 66366 67393 68424 69182 70366 71770 72245 71658 71214 71578 72150 72447
55479 72447 72788 73304 73611 73728 74217 75153 76014 76683 77611 78960 80562 82574 85188 87961 90501 93374 97051
55462 97051 100436 101930 101621 100891 100098 98383 95639 92893 90604 88187 85447 82955 80842 78713 76884
55447 76884 76161 76239 75920 75181 75418 77196 79301 80576 81242 81875 82360 82563 82874 83435 83766 83596 83196 82565
55429 82565 81291 79454 77686 76114 74252 72110 70291 68795 66898 64536 62672 61916 61761 61512 60930
55414 60930 59778 57830 55666 54407 54252 54182 53387 52101 50904 50159 50300 51652 53734 55602 56940 57855
$$ packed form
55529I5286k96j14N25P36j6q78j056j044j405j776j879k143k451j845l73M15k79
55512H1407j388j943k301k582j861p9J078N91l39l44J99M77P16J099Q43l33j361
55495G3879j579j731k154j793k56J027J031P58J184J404M75n87m44L64N72K97
55479G2447L41N16L07J17M89R36Q61O69R28J349J602K012K614K773K540K873L677
55462I7051L385J494l09p30p93j715k744k746k289k417k740k492k113k129j829
55447G6884p23P8l19p39K37J778K105J275O66O33M85K03L11N61L31j70m00o31
55429H2565j274j837j768j572j862k142j819j496j897k362j864p56j55k49n82
55414F0930j152j948k164j259j55p0p95j286j197p45J41J352K082J868J338R15
$$ plain form
55398 57855 57834 56201 53667 51969 51761 52167 52628 53652 55323 56557 56605 56034 55535 54932 54071 53613 54045 54779
55380 54779 54989 54665 54234 53826 53462 53318 53298 52930 52135 51516 51610 52322 53263 54003 53961 52802 51051 49617 48675
55361 48675 47791 46985 46666 46619 46259 45901 46513 48060 49407 50118 51008 52532 53996 54875 55676 56790 57660 57798
55343 57798 57660 57749 57715 57087 56163 55572 55492 55801 56377 56887 56928 56644 56579 56798 56894 56960 57568 58678 59543 59856 59946
55322 59946 59682 58399 56257 54517 54001 54262 54611 54901 54952 54438 53796 54102 55505 56863 57388 57509 57665 57474
55304 57474 56778 56270 56337 56294 55531 54407 53353 52161 50874 50347 51076 52383 53495 54480 55448 55833 55366 54825
55286 54825 54946 55386 55517 55413 55265 54689 53472 52241 51592 51264 50945 51064 51995 53214 54054 54585 55039 55115
55268 55115 54616 54006 53612 53000 51887 50884 50586 50766 51159 52164 53900 55478 56117 56213 56383 56349 55724 55073
$$ packed form
55398E7855k1j633k534j698k08M06M61J024J671J234M8n71m99o03q61m58M32P34
55380E4779K10l24m31m08l64j44k0l68p95o19R4P12R41P40m2j159j751j434r42
55361D8675q84q06l19m7l60l58O12J547J347P11Q90J524J464Q79Q01J114Q70J38
55343E7798j38Q9l4o28r24n91q0L09N76N10M1k84o5K19R6O6O08J110Q65L13R0
55322E9946k64j283k142j740n16K61L49K90N1n14o42L06J403J358N25J21J56j91
55304E7474o96n08O7m3p63j124j054j192j287n27P29J307J112R85R68L85m67n41
55286E4825J21M40J31j04j48n76j217j231o49l28l19J19R31J219Q40N31M54P6
55268E5115m99o10l94o12j113j003k98J80L93J005J736J578O39R6J70l4o25o51
$$ plain form
55250 55073 55096 55516 55850 56521 58000 59479 59752 58970 58330 58354 58620 58867 59243 59577 59462 58965 58444 57890 57256
55231 57256 57183 58436 60716 62836 64007 64339 64208 63813 63208 62219 60515 58203 56084 54904 54643 54948 55674
55214 55674 56528 56772 55966 54600 53422 52592 51947 51498 51116 50402 49519 49426 50543 51894 52394 52304 52504 53010
55196 53010 53230 53169 53300 53600 53683 53586 53538 53312 52695 52273 52854 54363 56065 57538 58672 59166 58917 58572 58778
55177 58778 59241 59314 59081 58982 58831 58226 57551 57472 57747 57610 57095 56873 56960 56734 56224 56233 57015 57830 58044 57916 58057
55156 58057 58713 59647 60247 59842 58475 57189 56912 57286 57252 56528 55703 55130 54623 54194 54168 54537 54938 55291 55812
55137 55812 56371 56514 56103 55402 54561 53580 52633 51916 51364 51054 51530 53048 54815 55743 55757 55607 55633 55568 55316
55118 55316 55091 54855 54429 54034 54004 54113 53917 53558 53453 53458 53216 53086 53700 54727 55165 54811 54457 54576 54890 55363
$$ packed form
55250E5073K3M20L34O71J479J479K73p82o40K4K66K47L76L34j15m97n21n54o34
55231E7256p3J253K280K120J171L32j31l95o05r89j704k312k119j180k61L05P26
55214E5674Q54K44q06j366j178q30o45m49l82p14q83r3J117J351N00r0K00N06
55196E3010K20o1J31L00Q3r7m8k26o17m22N81J509J702J473J134M94k49l45K06
55177E8778M63P3k33r9j51o05o75p9K75j37n15k22Q7k26n10RP82Q15K14j28J41
55156E8057O56R34O00m05j367j286k77L74l4p24q25n73n07m29k6L69M01L53N21
55137E5812N59J43m11p01q41r81r47p17n52l10M76J518J767R28J4j50K6o5k52
55118E5316k25k36m26l95l0J09j96l59j05Nk42j30O14J027M38l54l54J19L14M73
$$ plain form
55098 55363 56522 58482 60501 61915 62794 63454 64003 64581 65319 65852 65565 64535 63571 63060 62420 61018 59053
55081 59053 57248 56144 55931 56537 57605 58670 59495 60035 60236 60225 60479 61258 62104 62429 62373 62415 62424 61961 61352
55062 61352 61462 62330 62974 62757 62140 61802 61767 61722 61572 61327 60968 60654 60626 60793 60816 60671 60614 60672 60734 61079 62103
55041 62103 63498 64451 64731 64848 65036 64932 64498 64357 64706 64681 63461 61555 60371 60700 62087 63552 64600
55024 64600 65490 66693 68145 69139 69011 67737 65713 63331 61116 59839 59867 60631 61265 61530 61579 61208 60206
55007 60206 59158 58943 59450 59737 59539 59648 60574 61705 62264 62382 62727 63531 64435 65004 65111 64999 65097 65588 66223
54988 66223 66785 67532 68720 69887 70251 69787 69373 69807 71064 72484 73326 73282 72829 72874 73675 74458 74571 74479 74953
54969 74953 75812 76346 76489 76600 76489 75794 75037 75041 75456 75160 74082 73316 73314 73325 72851 72392 72384 72552 72710 73100 73559
$$ packed form
55098E5363J159J960K019J414Q79O60N49N78P38N33k87j030r64n11o40j402j965
55081E9053j805j104k13O06J068J065Q25N40K01j1K54P79Q46L25n6M2Rm63o09
55062F1352J10Q68O44k17o17l38l5m5j50k45l59l14k8J67K3j45n7N8O2L45J024
55041F2103J395R53K80J17J88j04m34j41L49k5j220j906j184L29J387J465J048
55024F4600Q90J203J452R94j28j274k024k382k215j277K8P64O34K65M9l71j002
55007F0206j048k15N07K87j98J09R26J131N59J18L45Q04R04N69J07j12R8M91O35
54988F6223N62P47J188J167L64m64m14M34J257J420Q42m4m53M5Q01P83J13r2M74
54969G4953Q59N34J43J11j11o95p57MM15k96j078p66kJ1m74m59qJ68J58L90M59
$$ plain form
54948 73559 73469 72877 72557 72537 71828 70147 68656 68294 68493 68329 67870 67515 67026 66208 65718 66143 66929 67184 67011
54929 67011 67111 67577 68020 68476 69281 70308 71100 71630 72231 72940 73438 73545 73428 73428 73897 74859 75744 75921 75586
54910 75586 75476 75613 75198 74030 73022 72804 72798 72389 72074 72532 73360 73708 73603 73652 73936 74118 74220 74403 74356 73827
54890 73827 73371 73640 74230 74210 73595 73324 73865 74753 75516 76216 76996 77836 78874 80319 81938 83200 83949 84452
54872 84452 84784 84774 84556 84565 84876 85029 84681 83970 83138 82198 81149 80188 79591 79557 80192 81419 82888 84236 85421
54853 85421 86631 87932 89142 89986 90239 89886 89339 89306 90174 91612 92948 93751 93935 93581 92949 92456 92383 92740
54835 92740 93571 95128 97490 100268 103023 105837 109271 113877 119877 127105 135014 142837 149837 155335 158725
54820 158725 159865 159395 158073 155817 151967 146567 140597 134705 128575 122040 115996 111483 108336 105538
$$ packed form
54948G3559r0n92l20k0p09j681j491l62J99j64m59l55m89q18m90M25P86K55j73
54929F7011J00M66M43M56Q05J027P92N30O01P09M98J07j17%M69R62Q85J77l35
54910G5586j10J37m15j168j008k18om09l15M58Q28L48j05M9K84J82J02J83m7n29
54890G3827m56K69N90k0o15k71N41Q88P63P00P80Q40J038J445J619J262P49N03
54872H4452L32j0k18RL11J53l48p11q32r40j049r61n97l4O35J227J469J348J185
54853H5421J210J301J210Q44K53l53n47l3Q68J438J336Q03J84l54o32m93p3L57
54835I2740Q31J557K362K778K755K814L434M606O000P228P909P823P000N498L390
54820A58725J140m70j322k256l850n400n970n892o130o535o044m513l147k798
$$ plain form
54806 105538 102528 99551 97065 95443 94974 95458 95997 95832 95267 95192 95829 96503 96612 96288 96125 96692 98306
54789 98306 100873 103907 106973 110125 113785 118379 124217 131316 138973 145826 150843 154139 156462 157981
54775 157981 157987 155703 151150 145259 139342 134273 129994 125917 121807 117948 114439 110871 107012 103308 100364
54760 100364 98263 96675 95270 93720 91710 89341 87171 85594 84488 83642 82988 82248 81043 79710 79295
54745 79295 80275 81918 83421 84894 86596 88015 88592 88641 88629 88121 86529 84433 83006 82409 81890 81310 81338
54728 81338 82070 82605 82269 81384 80558 80013 79870 80295 80994 81159 80339 78950 77776 77382 78128 80161 83081 85981
54710 85981 88128 89418 90072 90207 89825 89009 88056 87443 87590 88413 89313 89773 89793 89540 88977 88242 87989 88820 90562
54691 90562 92521 94191 95285 95488 94873 94284 94634 95954 97672 99554 101694 103853 105667 107434 109900
$$ packed form
54806A05538l010k977k486j622m69M84N39j65n65p5O37O74J09l24j63N67J614
54789I8306K567L034L066L152L660M594N838P099P657O853N017L296K323J519
54775A57981Ok284m553n891n917n069m279m077m110l859l509l568l859l704k944
54760A00364k101j588j405j550k010k369k170j577j106q46o54p40j205j333m15
54745G9295R80J643J503J473J702J419N77M9j2n08j592k096j427n97n19n80K8
54728H1338P32N35l36q85q26n45j43M25O99J65q20j389j174l94P46K033K920K900
54710H5981K147J290O54J35l82q16r53o13J47Q23R00M60K0k53n63p35k53Q31J742
54691I0562J959J670J094K03o15n89L50J320J718J882K140K159J814J767K466
$$ plain form
54676 109900 113307 117421 122467 129206 137922 148040 158981 170742 183362 196229 208131 217718 224009
54663 224009 226824 226640 223737 217988 210082 202369 197177 194295 191215 186004 178959 171225 163099 154377
54649 154377 145516 137481 130827 125419 120774 116308 111698 107372 104266 102776 102339 102306 102784 104213 106592
54634 106592 109575 113024 117020 121543 126510 132029 138320 145436 153077 160480 166480 170067 171028 169758
54620 169758 166519 161349 154785 148023 141928 136312 130541 124564 118976 114348 110853 108371 106573 105016
54606 105016 103414 101810 100365 99038 97626 96043 94458 93172 92336 91776 91178 90478 89944 89732 89631 89424
54590 89424 89239 89223 89206 89020 88907 89097 89266 88982 88481 88353 88612 88746 88631 88695 89141 89733 90397 91324 92287 92594
54570 92594 91996 91113 90695 90956 91818 93208 94824 96077 96559 96255 95270 93783 92306 91325 90631 89689 88733
$$ packed form
54676A09900L407M114N046O739Q716J0118J0941J1761J2620J2867J1902R587O291
54663B24009K815j84k903n749p906p713n192k882l080n211p045p734q126q722
54649A54377q861q035o654n408m645m466m610m326l106j490m37l3M78J429K379
54634A06592K983L449L996M523M967N519O291P116P641P403O000L587R61j270
54620A69758l239n170o564o762o095n616n771n977n588m628l495k482j798j557
54606A05016j602j604j445j327j412j583j585j286q36n60n98p00n34k12j01k07
54590H9424j85j6j7j86j13J90J69k84n01j28K59J34j15O4M46N92O64R27R63L07
54570I2594n98q83m18K61Q62J390J616J253M82l04r85j487j477r81o94r42r56
$$ plain form
54553 88733 88641 89460 90073 89824 89597 90506 92229 93509 93857 93878 94126 94498 94713 94733 94607 94310 93813 93132 92390
54534 92390 91989 92384 93423 94246 94187 93448 92544 91522 90301 89417 89660 91037 92726 94128 95411 96817 97940
54517 97940 98045 96938 95207 93602 92323 91038 89600 88575 88792 90369 92473 94082 94742 94507 93588 92347
54501 92347 91357 91091 91553 92358 93066 93386 93209 92590 91582 90111 88274 86699 86179 86766 87640 88066 88097 88134
54483 88134 88275 88507 89069 90054 90895 90852 89963 89012 88552 88411 88224 87981 87821 87618 87122 86474 86233 86775 87748
54464 87748 88335 88151 87701 87807 88717 90050 91446 92847 94106 94811 94811 94578 94754 95474 96403 97310 98303 99526
54446 99526 100896 102188 103248 104021 104381 104034 102792 101017 99652 99541 100723 102493 104076 105098 105605 105939
54430 105939 106506 107340 107942 107846 107241 106707 106402 105989 105312 104611 103965 103074 101824 100684 100246 100585 101238 101612
$$ packed form
54553H8733r2Q19O13k49k27R09J723J280L48K1K48L72K15K0j26k97m97o81p42
54534I2390m01L95J039Q23n9p39r04j022j221q84K43J377J689J402J283J406J123
54517I7940J05j107j731j605j279j285j438j025K17J577K104J609O60k35r19j241
54501I2347r90k66M62Q05P08L20j77o19j008j471j837j575n20N87Q74M26L1L7
54483H8134J41K32N62R85Q41m3q89r51m60j41j87k43j60k03m96o48k41N42R73
54464H7748N87j84m50J06R10J333J396J401J259P05%k33J76P20R29R07R93J223
54446I9526J370J292J060P73L60l47j242j775j365j11J182J770J583J022N07L34
54430A05939N67Q34O02r6o05n34l05m13o77p01o46q91j250j140m38L39O53L74
$$ plain form
54412 101612 101370 100685 100201 100452 101286 102111 102639 102983 103088 102615 101527 100257 99157 98198 97347 96766 96437 96085
54394 96085 95663 95518 95875 96612 97651 99024 100379 101069 101098 101357 102469 103895 104626 104269 103038 101193 99161
54377 99161 97832 97978 99449 101425 103324 105047 106551 107719 108569 109109 109047 108076 106454 104945 104148 104162 104832
54360 104832 106012 107515 109009 110087 110452 110091 109298 108397 107438 106343 105238 104327 103492 102499 101677 101813 103113
54343 103113 104696 105488 105284 104666 104231 104236 104683 105406 106263 107374 108907 110549 111651 112030 112048 111676 110229 107518
54325 107518 104653 103039 102945 103668 104678 105941 107385 108765 109916 110637 110524 109502 108322 107929 108435 109176
54309 109176 109634 109766 109634 109393 109594 110804 112755 114401 115003 114774 114368 114108 113838 113267 112275 111033 109836
54292 109836 108820 107960 107426 107593 108439 109305 109671 109870 110544 111629 112436 112652 112665 112866 113131 113125 112765 112237 111783
$$ packed form
54412A01612k42o85m84K51Q34Q25N28L44J05m73j088j270j100r59q51n81l29l52
54394I6085m22j45L57P37J039J373J355O90K9K59J112J426P31l57j231j845k032
54377I9161j329J46J471J976J899J723J504J168Q50N40o2r71j622j509p97J4O70
54360A04832J180J503J494J078L65l61p93r01r59j095j105r11q35r93q22J36J300
54343A03113J583P92k04o18m35NM47P23Q57J111J533J642J102L79J8l72j447k711
54325A07518k865j614r4P23J010J263J444J380J151P21j13j022j180l93N06P41
54309A09176M58J32j32k41K01J210J951J646O02k29m06k60k70n71r92j242j197
54292A09836j016q60n34J67Q46Q66L66J99O74J085Q07K16J3K01K65ol60n28m54
$$ plain form
54273 111783 111573 111621 111867 112425 113563 115252 117003 118499 120055 121987 123744 124281 123330 121786 120767 120712
54257 120712 121469 122756 124265 125630 126665 127590 128783 130290 131646 132305 132295 132390 133504 135887 139092 142637
54241 142637 146432 150597 155198 160210 165331 169766 172620 173644 173196 171399 167990 163202 158134 153743
54227 153743 150039 146698 143907 141948 140418 138595 136405 134426 133093 132346 131901 131422 130645 129601 128445
54212 128445 126892 124458 121669 120224 121160 123421 125063 125396 125021 124280 122936 121217 119960 119514 119400 119221
54196 119221 119086 119013 118694 118069 117482 117132 116937 116952 117255 117464 117155 116737 117063 118102 118925 119195 119645 120726 121797
54177 121797 122250 122587 123561 124835 125363 124841 124032 123674 123635 123263 122250 120994 120169 120021 120257 120653 121475 122906
54159 122906 124431 125369 125903 126853 128347 129402 129092 127589 125808 124468 123845 123951 124598 125473 126417 127478
$$ packed form
54273A11783k10M8K46N58J138J689J751J496J556J932J757N37r51j544j019n5
54257A20712P57J287J509J365J035R25J193J507J356O59j0R5J114K383L205L545
54241A42637L795M165M601N012N121M435K854J024m48j797l409m788n068m391
54227A53743l704l341k791j959j530j823k190j979j333p47m45m79p77j044j156
54212A28445j553k434k789j445R36K261J642L33l75p41j344j719j257m46j14j79
54196A19221j35p3l19o25n87l50j95J5L03K09l09m18L26J039Q23K70M50J081J071
54177A21797M53L37R74J274N28n22q09l58l9l72j013j256q25j48K36L96Q22J431
54159A22906J525R38N34R50J494J055l10j503j781j340o23J06O47Q75R44J061
$$ plain form
54143 127478 128632 129660 130272 130124 128887 126792 124947 124480 125286 126156 126239 125820 125584 125765 126243 126871 127363
54126 127363 127368 126937 126498 126137 125405 124146 122992 122658 123108 123831 124591 125498 126531 127360 127634 127312 126796 126700 127180
54107 127180 127524 126742 124705 122369 120833 120430 120784 121353 121809 122204 122852 123891 125056 126111 127224 128479
54091 128479 129383 129488 129158 128942 128454 126898 124616 122986 122563 122447 121823 121053 120742 120762 120827 121156 121803 122088
54073 122088 121482 120452 119746 119371 118966 118637 118643 118688 118283 117517 116882 116654 116930 117825 119060 119855 119845 119623 119718 119623
54053 119623 118639 117215 116450 116601 117051 117545 118436 119695 120655 120938 120878 120837 120734 120473 120310 120576 121419 122864
54035 122864 124672 126159 126685 126467 126474 127408 129170 131264 133261 134763 135412 135211 134542 133795 133175 132821 132751 132694
54017 132694 132366 131987 132141 133049 134278 135260 135780 135888 135637 135052 134176 133077 131964 131244 131140 131292 131056 130248
$$ packed form
54143A27478J154J028O12j48j237k095j845m67Q06Q70Q3m19k36J81M78O28M92
54126A27363Nm31m39l61p32j259j154l34M50P23P60R07J033Q29K74l22n16r6M80
54107A27180L44p82k037k336j536m03L54N69M56L95O48J039J165J055J113J255
54091A28479R04J05l30k16m88j556k282j630m23j16o24p70l11K0O5L29O47K85
54073A22088o06j030p06l75m05l29OM5m05p66o35k28K76Q95J235P95j0k22R5r5
54053A19623r84j424p65J51M50M94Q91J259R60K83o0m1j03k61j63K66Q43J445
54035A22864J808J487N26k18PR34J762K094J997J502O49k01o69p47o20l54p0n7
54017A32694l28l79J54R08J229R82N20J08k51n85q76j099j113p20j04J52k36q08
$$ plain form
53999 130248 129325 128751 128524 128448 128520 128810 129147 129202 128875 128446 128343 128821 129855 131244 132774 134282 135637 136742
53981 136742 137559 138155 138738 139648 141090 142754 143967 144509 145041 146341 148279 150122 151743 153764 156396 158922
53965 158922 160782 162590 165569 170464 177567 187357 200401 216677 235334 254796 272610 285594 291163
53952 291163 288852 280373 268283 254837 241672 229711 219120 209786 201944 195999 191747 188255 184765
53939 184765 181415 178891 177622 177499 178205 179613 181812 184800 188275 191828 195323 198860 202355 205466 208059
53924 208059 210388 212624 214500 215694 216294 216625 216896 217266 217939 218811 219302 218942 217946 216875 215969 215127 214295
53907 214295 213406 212102 209981 207039 203555 199699 195607 191637 188181 185357 183130 181521 180422 179473 178496
53892 178496 177698 177092 176208 174838 173593 173029 172700 171932 171182 171602 173411 175738 178139 181165 185224 189884
$$ packed form
53999A30248r23n74k27p6P2K90L37N5l27m29j03M78J034J389J530J508J355J105
53981A36742Q17N96N83R10J442J664J213N42N32J300J938J843J621K021K632K526
53965A58922J860J808K979M895P103R790J3044J6276J8657J9462J7814J2984N569
53952B91163k311q479j2090j3446j3165j1961j0591r334p842n945m252l492l490
53939A84765l350k524j269j23P06J408K199K988L475L553L495L537L495L111K593
53924B08059K329K236J876J194O00L31K71L70O73Q72M91l60r96j071r06q42q32
53907B14295q89j304k121k942l484l856m092l970l456k824k227j609j099r49r77
53892A78496p98o06q84j370j245n64l29p68p50M20J809K327K401L026M059M660
$$ plain form
53876 189884 194731 200022 205852 211312 215119 216712 216240 213955 210160 205446 200429 195318 190095 184951
53862 184951 180223 176030 172268 168940 166255 164396 163298 162599 161897 161129 160582 160364 160111 159562 159210 159781
53846 159781 161181 162638 163986 166016 169256 173083 176573 179722 183287 187771 193100 198940 204745 209749
53832 209749 213729 217821 223934 232893 243501 253665 262310 270062 278313 287897 298449 308580 316526
53819 316526 321032 322145 321203 319904 319411 320512 324343 332129 343890 357971 372377 386359 400371
53806 400371 415084 431113 449107 468723 487080 499243 501122 492010 474441 452200 428652 406113
53794 406113 385753 367877 352484 339504 328487 318527 308864 299392 290350 281739 273327 265048 257112
53781 257112 249832 243514 238315 233922 229520 224446 218919 213919 210336 208256 206986 205636 203811 201813
$$ packed form
53876A89884M847N291N830N460L807J593m72k285l795m714n017n111n223n144
53862A84951m728m193l762l328k685j859j098o99p02p68n47k18k53n49l52N71
53846A59781J400J457J348K030L240L827L490L149L565M484N329N840N805N004
53832B09749L980M092O113Q959J0608J0164Q645P752Q251R584J0552J0131P946
53819C16526M506J113r42j299m93J101L831P786J1761J4081J4406J3982J4012
53806D00371J4713J6029J7994J9616J8357J2163J879r112j7569k2241k3548k2539
53794D06113k0360j7876j5393j2980j1017r960r663r472r042q611q412q279p936
53781B57112p280o318n199m393m402n074n527n000l583k080j270j350j825j998
$$ plain form
53767 201813 200111 198596 196566 193594 190149 187159 185066 183526 181919 179916 177587 175244 173261 171871
53753 171871 170979 170164 168999 167438 165844 164559 163504 162399 161352 160852 161045 161380 161317 161087 161234 161650 161684
53736 161684 161194 160810 160945 161152 160863 160298 160194 160834 161736 162199 161915 161145 160499 160427 160804 161149 161289 161533 162054
53717 162054 162495 162413 161848 161093 160241 159322 158695 158869 159983 161807 164161 166915 169662 171844 173405 174965
53701 174965 177175 180140 183613 187490 191874 196777 201979 207121 211762 215436 217892 219368 220448 221574
53687 221574 222734 223687 224370 225017 225968 227462 229459 231477 232687 232507 231169 229466 227827 225885 223093
53672 223093 219489 215631 211958 208507 205134 201717 198224 194833 192013 190198 189327 188759 187666 185502 182381
53657 182381 179157 176904 175915 175343 174130 172220 170473 169489 168978 168377 167625 167065 166869 166859 166743 166360 165776
$$ packed form
53767B01813j702j515k030k972l445k990k093j540j607k003k329k343j983j390
53753A71871q92q15j165j561j594j285j055j105j047n00J93L35o3k30J47M16L4
53736A61684m90l84J35K07k89n65j04O40R02M63k84p70o46p2L77L45J40K44N21
53717A62054M41q2n65p55q52r19o27J74J114J824K354K754K747K182J561J560
53701A74965K210K965L473L877M384M903N202N142M641L674K456J476J080J126
53687B21574J160R53O83O47R51J494J997K018J210j80j338j703j639j942k792
53672B23093l604l858l673l451l373l417l493l391k820j815q71n68j093k164l121
53657A82381l224k253r89n72j213j910j747r84n11o01p52n60j96j0j16l83n84
$$ plain form
53640 165776 165255 165088 165363 165885 166302 166312 165873 165314 165117 165416 165854 166122 166491 167507 169205 170902 171807 171674
53622 171674 170910 170155 169778 169757 170135 171422 174068 177508 180365 181980 183138 184769 186535 187483 187609 187792
53606 187792 188451 189299 190373 192253 195037 198059 200832 203425 205662 206903 207155 207557 209121 211575 214041
53591 214041 216314 218824 221732 224672 227120 228600 228825 228135 227537 227825 228837 229853 230443 230673 230833 231389
53575 231389 232798 234943 236988 238132 238285 237787 236818 235487 234083 232827 231636 230475 229611 229139 228701 228061
53559 228061 227590 227687 228148 228572 229011 229655 230232 230339 230125 230066 230349 230950 231973 233210 233769 232931 231199 229695
53541 229695 228687 227585 226295 225592 225977 227045 228277 229667 231185 232320 232666 232522 232447 232547 232590 232549 232649
53524 232649 233109 234076 235629 237615 239710 241768 243926 246164 248050 249193 249805 250577 252064 254368 257294
$$ packed form
53640A65776n21j67K75N22M17J0m39n59j97K99M38K68L69J016J698J697R05j33
53622A71674p64p55l77k1L78J287K646L440K857J615J158J631J766R48J26J83
53606A87792O59Q48J074J880K784L022K773K593K237J241K52M02J564K454K466
53591B14041K273K510K908K940K448J480K25o90n98K88J012J016N90K30J60N56
53575B31389J409K145K045J144J53m98r69j331j404j256j191j161q64m72m38o40
53559B28061m71R7M61M24M39O44N77J07k14n9K83O01J023J237N59q38j732j504
53541B29695j008j102j290p03L85J068J232J390J518J135L46j44p5J00M3m1J00
53524B32649M60R67J553J986K095K058K158K238J886J143O12P72J487K304K926
$$ plain form
53509 257294 260612 264099 267458 270348 272650 274731 277290 280775 285012 289481 293774 297686 301162 304399
53495 304399 307793 311495 315195 318631 322070 325926 330165 334529 339114 344235 349892 355968 362736 370434
53481 370434 378378 385295 390646 394817 397788 398500 396083 390984 384295 376579 368076 359545 351949 345449
53467 345449 339454 333666 328400 323849 319765 316075 313222 311540 310717 310209 309845 309630 309215 308114 306371
53452 306371 304588 303165 301879 300438 299148 298672 299221 300347 301608 303080 304979 306985 308363 308771 308722
53437 308722 309094 310352 312358 314776 317417 320155 322744 324944 326826 328811 331265 334092 336857 339372
53423 339372 342097 345901 351383 358407 366223 374163 382274 391179 401167 411589 421421 430467 439629 449916
53409 449916 461468 473722 486157 498599 511082 523796 537119 551374 566610 582780 599992
$$ packed form
53509B57294L318L487L359K890K302K081K559L485M237M469M293L912L476L237
53495C04399L394L702L700L436L439L856M239M364M585N121N657O076O768P698
53481C70434P944O917N351M171K971P12k417n099o689p716q503q531p596o500
53467C45449n995n788n266m551m084l690k853j682q23n08l64k15m15j101j743
53452C06371j783j423j286j441j290m76N49J126J261J472J899K006J378M08m9
53437C08722L72J258K006K418K641K738K589K200J882J985K454K827K765K515
53423C39372K725L804N482P024P816P940Q111Q905R988J0422R832R046R162J0287
53409D49916J1552J2254J2435J2442J2483J2714J3323J4255J5236J6170J7212
$$ plain form
53398 599992 618294 637276 656252 674848 693216 711677 730376 749340 768601 788178 807983
53387 807983 827750 847021 865353 882726 899651 916701 933950 951019 967487 983155 998074
53376 998074 1012611 1027274 1042176 1056808 1070726 1084331 1098550 1113770 1129501 1145047 1160007
53365 1160007 1173980 1186342 1196668 1205132 1212157 1217805 1221687 1223340 1222505 1219157 1213414 1205395 1195183
53352 1195183 1183084 1169942 1156878 1144538 1132722 1120857 1108584 1095718 1081902 1066729 1050229
53341 1050229 1032984 1015646 998457 981325 964239 947423 931088 915177 899521 884158 869373
53330 869373 855459 842664 831406 822218 815336 810496 807265 805327 804358 804009 804350 805960 809090 812963
53316 812963 816521 819788 823832 829329 835832 842702 850169 858925 869092 880170 891917 904734 919094
$$ packed form
53398E99992J8302J8982J8976J8596J8368J8461J8699J8964J9261J9577J9805
53387H07983J9767J9271J8332J7373J6925J7050J7249J7069J6468J5668J4919
53376I98074J4537J4663J4902J4632J3918J3605J4219J5220J5731J5546J4960
53365A160007J3973J2362J0326Q464P025N648L882J653q35l348n743q019j0212
53352A195183j2099j3142j3064j2340j1816j1865j2273j2866j3816j5173j6500
53341A050229j7245j7338j7189j7132j7086j6816j6335j5911j5656j5363j4785
53330H69373j3914j2795j1258r188o882m840l231j938r69l49L41J610L130L873
53316H12963L558L267M044N497O503O870P467Q756J0167J1078J1747J2817J4360
$$ plain form
53303 919094 934939 951802 969412 988032 1008181 1030058 1053341 1077603 1102839 1129389 1157467
53292 1157467 1187016 1218073 1250980 1286143 1323771 1363888 1406234 1450002 1494035 1537699 1581443
53281 1581443 1626238 1672550 1720033 1768059 1816098 1863561 1909701 1954008 1996598 2037945 2078173
53270 2078173 2116748 2152986 2186726 2218296 2247753 2274426 2297418 2316446 2331904 2344122 2352877
53259 2352877 2357632 2357885 2352997 2342019 2324177 2299608 2269328 2234457 2195707 2153704 2109439 2064080
53247 2064080 2018397 1972642 1927008 1881931 1837874 1795073 1753718 1714177 1676732 1641069 1606277
53236 1606277 1571432 1536082 1500268 1464390 1429096 1395010 1362334 1330829 1300322 1271088 1243714
53225 1243714 1218691 1196174 1175964 1157685 1141240 1127101 1115796 1106968 1099288 1091432 1082771 1073026
$$ packed form
53303I19094J5845J6863J7610J8620K0149K1877K3283K4262K5236K6550K8078
53292A157467K9549L1057L2907L5163L7628M0117M2346M3768M4033M3664M3744
53281A581443M4795M6312M7483M8026M8039M7463M6140M4307M2590M1347M0228
53270B078173L8575L6238L3740L1570K9457K6673K2992J9028J5458J2218Q755
53259B352877M755K53m888j0978j7842k4569l0280l4871l8750m2003m4265m5359
53247B064080m5683m5755m5634m5077m4057m2801m1355l9541l7445l5663l4792
53236A606277l4845l5350l5814l5878l5294l4086l2676l1505l0507k9234k7374
53225A243714k5023k2517k0210j8279j6445j4139j1305q828p680p856q661r745
$$ plain form
53213 1073026 1061942 1049806 1037691 1026400 1015430 1003771 991619 980495 971544 964433 958169 952359
53201 952359 947289 943286 940535 939236 939465 940882 942889 945073 947485 950591 955035 961274 969350 979112
53187 979112 990657 1004321 1020127 1037486 1055585 1074043 1093171 1113733 1136335 1160709 1185498
53176 1185498 1209049 1230587 1250531 1269628 1288081 1305579 1321864 1336941 1350770 1362959 1372827
53165 1372827 1379779 1383658 1384717 1383263 1379438 1373397 1365391 1355423 1343074 1328057 1310755 1291830 1271420
53152 1271420 1249185 1225136 1199914 1174228 1148457 1122842 1097550 1072442 1047331 1022623 999207
53141 999207 977363 956351 935419 914785 895084 876223 857412 838179 818741 799318 779585
53130 779585 759086 737925 716849 696760 678293 661734 647061 633922 621766 610268 599701
$$ packed form
53213A073026j1084j2136j2115j1291j0970j1659j2152j1124q951p111o264n810
53201I52359n070m003k751j299K29J417K007K184K412L106M444O239Q076R762
53187I79112J1545J3664J5806J7359J8099J8458J9128K0562K2602K4374K4789
53176A185498K3551K1538J9944J9097J8453J7498J6285J5077J3829J2189R868
53165A372827O952L879J059j454l825o041q006r968j2349j5017j7302j8925k0410
53152A271420k2235k4049k5222k5686k5771k5615k5292k5108k5111k4708k3416
53141I99207k1844k1012k0932k0634j9701j8861j8811j9233j9438j9423j9733
53130G79585k0499k1161k1076k0089j8467j6559j4673j3139j2156j1498j0567
$$ plain form
53119 599701 590644 583240 576986 571330 566130 561241 556091 550115 543361 536129 528258 519388 509690 499617
53105 499617 488998 477269 464734 452711 442135 432734 423906 415613 407900 400330 392590 385140 378544
53092 378544 372571 366597 360501 354510 348518 342302 336201 330787 325956 321086 316037 311277 306979 302733
53078 302733 298338 294219 290733 287606 284420 281282 278572 276279 274018 271570 269043 266501 263775 260761
53064 260761 257666 254725 251785 248537 245202 242625 241375 240991 240532 239734 239150 239192 239602 239947 240005 239458 237856
53047 237856 235367 233107 232161 232512 233220 233391 232584 230775 228446 226436 225096 223787 221712 219050 216718
53032 216718 215253 214585 214737 215919 217831 219521 220291 220284 220009 219690 219292 218874 218675 218994 220002 221499 222912
53015 222912 223826 224442 225149 225788 225806 225073 223958 222559 220549 218081 216216 215924 216962 218186 218793 218808 218480
$$ packed form
53119E99701r057p404o254n656n200m889n150n976o754p232p871q870r698j0073
53105D99617j0619j1729j2535j2023j0576r401q828q293p713p570p740p450o596
53092C78544n973n974o096n991n992o216o101n414m831m870n049m760m298m246
53078C02733m395m119l486l127l186l138k710k293k261k448k527k542k726l014
53064B60761l095k941k940l248l335k577j250l84m59p98n84M2M10L45N8n47j602
53047B37856k489k260r46L51P08J71q07j809k329k010j340j309k075k662k332
53032B16718j465o68J52J182J912J690P70pk75l19l98m18j99L19J008J497J413
53015B22912R14O16P07O39J8p33j115j399k010k468j865k92J038J224O07J5l28
$$ plain form
52998 218480 217687 216139 213928 211650 209963 209047 208590 208312 208397 209202 210588 211826 212321 212298 212585 213717 215346
52981 215346 216575 216848 216440 216055 216157 216864 218264 220338 222523 223930 224365 224736 226028 228137 230080 231080
52965 231080 231042 230243 229117 228135 227323 226009 223608 220550 217863 215950 214404 212957 211824 211042 210271 209527
52949 209527 209384 210126 211327 212570 213925 215304 216096 216012 215730 215959 216371 216206 215549 215130 215043 214551 213256 211667
52931 211667 210424 209610 209075 208853 208868 208689 207995 207051 206370 206098 206047 206196 206724 207495 207848 207218 205916 205025 205313
52912 205313 206294 206632 205588 203865 202851 203233 204561 206034 207263 208244 208974 209339 209208 208513 207349 206100
52896 206100 205250 204953 204949 205081 205660 207050 209026 210843 211962 212455 212706 213007 213549 214526 215971 217564 218809
52879 218809 219412 219412 219078 218801 218956 219612 220369 220698 220527 220344 220671 221595 222883 224303 225614 226425 226398 225640 224678
$$ packed form
52998B18480p93j548k211k278j687r16m57k78Q5Q05J386J238M95k3K87J132J629
52981B15346J229K73m08l85J02P07J400K074K185J407M35L71J292K109J943J000
52965B31080l8p99j126r82q12j314k401l058k687j913j546j447j133p82p71p44
52949B09527j43P42J201J243J355J379P92q4k82K29M12j65o57m19q7m92j295j589
52931B11667j243q14n35k22J5j79o94r44o81k72n1J49N28P71L53o30j302q91K88
52912B05313R81L38j044j723j014L82J328J473J229R81P30L65j31o95j164j249
52896B06100q50k97mJ32N79J390J976J817J119M93K51L01N42R77J445J593J245
52879B18809O03%l34k77J55O56P57L29j71j83L27R24J288J420J311Q11k7p58r62
$$ plain form
52860 224678 223990 223728 223970 224979 226885 229228 231105 231916 231791 231176 230213 228699 226561 224052 221505 219134
52844 219134 217162 215883 215436 215617 216029 216323 216239 215618 214554 213386 212418 211770 211607 212201 213500 214842 215518
52827 215518 215440 214956 214200 213107 211978 211399 211471 211620 211385 210955 210639 210235 209328 208010 206887 206430 206549 206821
52809 206821 206959 207009 207145 207346 207414 207357 207480 207823 207856 207171 206287 206146 206868 207691 208150 208575 209266 209984 210629 211617
52789 211617 213062 214268 214637 214532 214581 214719 214614 214504 214709 214687 213544 211336 208995 207095 205541 204396 204016
52772 204016 204231 204283 203881 203610 203957 204592 204951 205008 205106 205495 206392 208077 210517 213115 215164 216394 217001 217373
52754 217373 217910 218749 219511 219531 218477 216523 213982 211115 208286 205824 203602 201190 198569 196307 194841
52739 194841 194033 193605 193567 193928 194369 194566 194583 194642 194698 194525 194083 193549 193128 192954 193094 193533 194284 195495 197264
$$ packed form
52860B24678o88k62K42J009J906K343J877Q11j25o15r63j514k138k509k547k371
52844B19134j972j279m47J81M12K94q4o21j064j168r68o48j63N94J299J342O76
52827B15518p8m84p56j093j129n79P2J49k35m30l16m04r07j318j123m57J19K72
52809B06821J38N0J36K01O8n7J23L43L3o85q84j41P22Q23M59M25O91P18O45R88
52789B11617J445J206L69j05M9J38j05j10K05k2j143k208k341j900j554j145l80
52772B04016K15N2m02k71L47O35L59N7R8L89Q97J685K440K598K049J230O07L72
52754B17373N37Q39P62K0j054j954k541k867k829k462k222k412k621k262j466
52739A94841q08m28l8L61M41J97J7N9N6j73m42n34m21j74J40M39P51J211J769
$$ plain form
52720 197264 199445 201932 205122 209674 215710 222546 229143 234388 237000 235963 231490 225151 218714 213077
52706 213077 208391 204600 201433 198346 195056 191953 189612 188051 186804 185550 184376 183616 183636 184564 185982
52691 185982 187111 187581 187767 188184 188927 189979 191573 193709 195667 196682 196974 197434 198311 198829 198268 196920
52675 196920 195692 195180 195376 195933 196324 195926 194459 192467 191057 190931 191745 192600 193044 193257 193303 192781 191555
52658 191555 190355 189965 189974 189091 186835 184231 182574 182107 182355 183194 184910 187423 190087 192269 193754 194613
52642 194613 195014 195218 195514 196088 197033 198382 200032 201768 203468 205097 206404 206981 206892 206899 207660 208861 209582
52625 209582 209439 208934 208704 208835 209041 209204 209506 210146 211064 211930 212396 212399 212164 211866 211336 210242 208572 206893
52607 206893 206080 206609 208049 209385 210054 210478 211259 212115 212175 211232 209988 208944 207866 206758 206547 208002 210465
$$ packed form
52720A97264K181K487L190M552O036O836O597N245K612j037m473o339o437n637
52706B13077m686l791l167l087l290l103k341j561j247j254j174p60K0R28J418
52691A85982J129M70J86M17P43J052J594K136J958J015K92M60Q77N18n61j348
52675A96920j228n12J96N57L91l98j467j992j410j26Q14Q55M44K13M6n22j226
52658A91555j200l90Rq83k256k604j657m67K48Q39J716K513K664K182J485Q59
52642A94613M01K04K96N74R45J349J650J736J700J629J307N77q9PP61J201P21
52625B09582j43n05k30J31K06J63L02O40R18Q66M66Lk35k98n30j094j670j679
52607B06893q13N29J440J336O69M24P81Q56O0r43j244j044j078j108k11J455K463
$$ plain form
52590 210465 212513 213720 214896 216568 217985 217971 216287 213893 212161 211984 213264 214999 216045 216038 215583 215501
52574 215501 216024 216736 217171 217308 217506 217996 218532 218657 218268 217714 217284 216839 216076 214948 213702 212685 212305 212868
52556 212868 214201 215618 216526 216993 217552 218552 219850 220948 221301 220691 219448 218099 216779 215303 213937
52541 213937 213496 214372 215979 217636 219520 222171 225410 228442 230849 232863 234799 236875 239371 242199 244330
52526 244330 244455 242417 239360 236351 233531 230779 228380 226528 224752 222442 219628 216836 214443 212646
52512 212646 211742 211871 212565 213046 213092 213241 214026 215260 216239 216580 216652 217141 218209 219203 219296 218406 217358 217080 217751
52493 217751 218762 219493 219997 220903 222614 224692 226130 226249 225214 223796 222929 223433 225649 228931 231776 232908
52477 232908 232241 230687 229225 228383 228285 228657 228876 228473 227629 226871 226381 225997 225751 225886 226301 226539 226482 226631 227411
$$ packed form
52590B10465K048J207J176J672J417j4j684k394j732j77J280J735J046pm55q2
52574B15501N23P12M35J37J98M90N36J25l89n54m30m45p63j128j246j017l80N63
52556B12868J333J417R08M67N59J000J298J098L53o10j243j349j320j476j366
52541B13937m41Q76J607J657J884K651L239L032K407K014J936K076K496K828K131
52526B44330J25k038l057l009k820k752k399j852j776k310k814k792k393j797
52512B12646r04J29O94M81M6J49P85J234R79L41P2M89J068R94R3q90j048k78O71
52493B17751J011P31N04R06J711K078J438J19j035j418q67N04K216L282K845J132
52477B32908o67j554j462q42r8L72K19m03q44p58m90l84k46J35M15K38n7J49P80
$$ plain form
52458 227411 228550 229369 229434 228770 227746 226946 226902 227623 228482 228733 228059 226608 224751 222966 221702 221138 221121 221416
52440 221416 221864 222270 222410 222313 222341 222790 223558 224319 224882 225175 225057 224422 223505 222839 222813 223355 224084 224709 225177 225546
52420 225546 225857 226212 226803 227617 228219 228136 227558 227355 228228 230035 232139 234132 235990 237809 239707 241769 243665
52403 243665 244505 243602 241306 238680 236333 234016 231418 228817 226762 225518 225077 225394 226283 227310 228071 228572
52387 228572 229173 230188 231607 233153 234543 235713 236704 237315 237074 235798 234047 232745 232392 232911 234074 235646
52371 235646 237125 237842 237584 236832 236287 236378 237254 238867 240870 242718 244106 245163 246074 246717 246801 246213 245107
52354 245107 243797 242656 241921 241508 241138 240668 240116 239403 238348 236996 235676 234575 233462 232000 230175 228327
52338 228327 226908 226190 226046 225941 225384 224456 223741 223729 224412 225409 226167 226131 225143 223835 223215 223681 224667 225411 225716
$$ packed form
52458B27411J139Q19O5o64j024q00m4P21Q59K51o74j451j857j785j264n64j7K95
52440B21416M48M06J40r7K8M49P68P61N63K93j18o35r17o66k6N42P29O25M68L69
52420B25546L11L55N91Q14O02q3n78k03Q73J807K104J993J858J819J898K062J896
52403B43665Q40r03k296k626k347k317k598k601k055j244m41L17Q89J027P61N01
52387B28572O01J015J419J546J390J170R91O11k41j276j751j302l53N19J163J572
52371B35646J479P17k58p52n45R1Q76J613K003J848J388J057R11O43Q4n88j106
52354B45107j310j141p35m13l70m70n52p13j055j352j320j101j113j462j825j848
52338B28327j419p18j44j05n57r28p15j2O83R97P58l6r88j308o20M66R86P44L05
$$ plain form
52319 225716 225797 225758 225618 225601 226025 226907 227970 229036 230231 231776 233777 236270 239400 243479 248788 255265
52303 255265 262341 269103 274577 277938 278703 276982 273506 269224 264870 260853 257297 253978 250523 247026
52289 247026 244267 242984 243020 243517 243774 243566 242924 242157 241950 242778 244207 245315 245792 246090 246556 247142 248023 249686
52271 249686 252129 254724 257217 260148 263788 267332 269800 271199 272129 272645 272255 270931 269405 268465 268405 269112
52255 269112 270214 271149 271580 271848 272728 274593 277021 279223 280698 281502 282103 282993 284296 285708 286890 287894
52239 287894 289156 291038 293410 295704 297488 299068 301301 304595 308350 311759 314982 318978 324249 330371
52225 330371 336830 343649 350955 358535 366202 374118 382409 390870 399391 408212 417384 426475 435306 444512
52211 444512 454802 465954 477156 488203 499804 512710 526976 542085 557565 573435 590193
$$ packed form
52319B25716Q1l9j40j7M24Q82J063J066J195J545K001K493L130M079N309O477
52303B55265P076O762N474L361P65j721l476m282m354m017l556l319l455l497
52289B47026k759j283L6M97K57k08o42p67k07Q28J429J108M77K98M66N86Q81J663
52271B49686K443K595K493K931L640L544K468J399R30N16l90j324j526r40o0P07
52255B69112J102R35M31K68Q80J865K428K202J475Q04O01Q90J303J412J182J004
52239B87894J262J882K372K294J784J580K233L294L755L409L223L996N271O122
52225C30371O459O819P306P580P667P916Q291Q461Q521Q821R172R091Q831R206
52211D44512J0290J1152J1202J1047J1601J2906J4266J5109J5480J5870J6758
$$ plain form
52200 590193 608199 627056 645929 664559 683388 702441 720707 737185 752010 765874 778716
52189 778716 789800 798948 806918 814499 821819 828641 834802 840249 844993 849058 852201 853807 853562 852184
52175 852184 850994 850552 850085 848427 845325 841732 838949 837499 836628 834964 831778 827532 823180 819269 815932
52160 815932 813394 812021 812049 813661 817193 822941 830871 840789 852618 866161 880764 895572 909916
52147 909916 923238 935036 945401 955249 965424 975738 985413 994189 1002352 1009892 1016504 1022374 1028104
52134 1028104 1033665 1038166 1040886 1041963 1041812 1040562 1038380 1035688 1032534 1028141 1021696 1013429 1004465 995690
52120 995690 987117 978370 969470 960908 953054 945702 938439 931375 925153 920146 916010 912292 909068 906567
52106 906567 904476 902260 900012 898436 898040 898878 901007 904546 909203 914333 919601 925107 930722 935852 940063
$$ packed form
52200E90193J8006J8857J8873J8630J8829J9053J8266J6478J4825J3864J2842
52189G78716J1084R148P970P581P320O822O161N447M744M065L143J606k45j378
52175H52184j190m42m67j658l102l593k783j450q71j664l186m246m352l911l337
52160H15932k538j373K8J612L532N748P930R918J1829J3543J4603J4808J4344
52147I09916J3322J1798J0365R848J0175J0314R675Q776Q163P540O612N870N730
52134A028104N561M501K720J077j51j250k182k692l154m393o445q267q964q775
52120I95690q573q747q900q562p854p352p263p064o222n007m136l718l224k501
52106I06567k091k216k248j576l96Q38K129L539M657N130N268N506N615N130M211
$$ plain form
52091 940063 943470 946261 948237 949112 948992 948322 947548 946931 946506 946176 945988 946152 946435 945822 943414 939638 935863
52074 935863 932707 929415 925123 920002 914754 909627 904484 899390 894518 889738 884853 880090 875966 872759
52060 872759 870456 869095 868817 869644 871434 873922 876605 878813 880247 881414 883261 886297 890165 893990 897036
52045 897036 899041 900048 900011 898717 896191 893002 889905 887270 885106 883489 882595 882422 882890 884125 886155
52030 886155 888457 890419 892291 894993 898844 903192 907508 911986 916634 920723 923944 927474 932846 940090
52016 940090 947985 956050 965311 976922 990930 1006694 1023784 1041929 1060685 1079809 1099706 1120820
52004 1120820 1142606 1163654 1183009 1200936 1218156 1234702 1249909 1263354 1275314 1286316 1296716
51993 1296716 1306837 1316970 1326909 1335885 1343427 1350022 1356451 1362625 1367592 1370576 1371526 1370747 1368544 1365148
$$ packed form
52091I40063L407K791J976Q75j20o70p74o17m25l30j88J64K83o13k408l776l775
52074I35863l156l292m292n121n248n127n143n094m872m780m885m763m124l207
52060H72759k303j361k78Q27J790K488K683K208J434J167J847L036L868L825L046
52045H97036K005J007l7j294k526l189l097k635k164j617q94j73M68J235K030
52030H86155K302J962J872K702L851M348M316M478M648M089L221L530N372P244
52016I40090P895Q065R261J1611J4008J5764J7090J8145J8756J9124J9897K1114
52004A120820K1786K1048J9355J7927J7220J6546J5207J3445J1960J1002J0400
51993A296716J0121J0133R939Q976P542O595O429O174M967K984R50p79k203l396
$$ plain form
51979 1365148 1360407 1353559 1344012 1332460 1320551 1309208 1297926 1286041 1274040 1263135 1254032 1246676
51967 1246676 1240822 1236383 1233430 1232248 1233212 1236302 1240921 1246426 1252618 1259520 1267004 1274866 1282912 1290759
51953 1290759 1297960 1304594 1311285 1318368 1325565 1332817 1340722 1349585 1358593 1366781 1374432 1382650 1391773 1400965
51939 1400965 1409305 1416487 1422422 1426880 1429676 1430655 1429337 1425110 1417888 1408191 1396510 1383015 1367905
51926 1367905 1351585 1334446 1316943 1299893 1284129 1269687 1255791 1241902 1228363 1215847 1204537
51915 1204537 1194076 1183906 1173364 1161695 1148389 1133467 1117435 1101062 1085174 1070333 1056529
51904 1056529 1043473 1031280 1020615 1011919 1004701 997798 990256 981866 972919 963569 953423 941738 928088
51891 928088 912828 896869 880965 865160 848633 830027 808318 783821 758181 733069 709101
$$ packed form
51979A365148m741o848r547j1552j1909j1343j1282j1885j2001j0905r103p356
51967A246676n854m439k953j182R64L090M619N505O192O902P484P862Q046P847
51953A290759P201O634O691P083P197P252P905Q863R008Q188P651Q218R123R192
51939A400965Q340P182N935M458K796R79j318m227p222r697j1681j3495j5110
51926A367905j6320j7139j7503j7050j5764j4442j3896j3889j3539j2516j1310
51915A204537j0461j0170j0542j1669j3306j4922j6032j6373j5888j4841j3804
51904A056529j3056j2193j0665q696p218o903p542q390q947r350j0146j1685j3650
51891I28088j5260j5959j5904j5805j6527j8606k1709k4497k5640k5112k3968
$$ plain form
51880 709101 686298 665190 646690 631025 617581 605962 596511 589565 584854 581998 580998 581731 583370
51867 583370 584738 584922 583223 579041 572439 564517 556554 548850 540981 533074 526150 521045 517512 514588
51853 514588 511534 508203 504915 502265 500869 500947 502197 504239 507162 511479 517480 524628 531662 537396 541575
51838 541575 544932 548318 551823 554874 557045 558444 559251 559179 557644 554377 549703 544262 538521 532496 525878
51823 525878 518533 510958 504057 498352 493518 488928 484503 480819 478457 477623 478383 480834 484813 489699 494801
51808 494801 499782 504480 508457 511066 511983 511534 510585 510307 511907 516260 523739 534545 549088 567586
51794 567586 589134 611341 631001 645059 651291 648867 638743 623304 605239 586714 569500 555222
51782 555222 544908 538398 534663 532653 531529 530190 527266 521913 514378 505521 495931 485718 475025
$$ packed form
51880G09101k2803k1108j8500j5665j3444j1619r451o946m711k856j000P33J639
51867E83370J368J84j699m182o602p922p963p704p869p907o924n105l533k924
51853E14588l054l331l288k650j396P8J250K042K923M317O001P148P034N734M179
51838E41575L357L386L505L051K171J399Q07p2j535l267m674n441n741o025o618
51823E25878p345p575o901n705m834m590m425l684k362q34P60K451L979M886N102
51808D94801M981M698L977K609R17m49r49k78J600M353P479J0806J4543J8498
51794E67586K1548K2207J9660J4058O232k424j0124j5439j8065j8525j7214j4278
51782E55222j0314o510l735k010j124j339k924n353p535q857r590j0213j0693
$$ plain form
51769 475025 464481 455089 447720 442714 439804 438308 437414 436446 435161 433922 433457 434178 435654 436815 436704
51754 436704 434920 431394 426072 419060 410955 402672 394871 387727 381339 376059 372175 369459 367397 365868
51740 365868 365214 365624 366806 368421 370411 372644 374656 376208 377818 380212 383332 386391 388799 390518 391579
51725 391579 391918 391839 391995 392624 393315 393761 394153 394387 393489 390524 385847 380773 376159 371843 367415 362897 358496
51708 358496 354251 350292 347191 345715 346153 347919 349924 351482 352891 354911 357587 359914 360941 360897 360818
51693 360818 361253 361836 362067 361948 361737 361528 361303 361006 360297 358564 355647 352497 350686 351117 353388 356498 359968
51676 359968 364039 368932 374374 379943 385436 390475 394043 395024 393299 389825 385542 380711 375482 370426
51662 370426 365995 361868 357454 352817 348554 344923 341632 338446 335466 332777 330378 328604 328193 329698
$$ packed form
51769D75025j0544r392p369n006k910j496q94r68j285j239m65P21J476J161j11
51754D36704j784l526n322p012q105q283p801p144o388n280l884k716k062j529
51740C65868o54M10J182J615J990K233K012J552J610K394L120L059K408J719J061
51725C91579L39p9J56O29O91M46L92K34q98k965m677n074m614m316m428m518m401
51708C58496m245l959l101j476M38J766K005J558J409K020K676K327J027m4p9
51693C60818M35N83K31j19k11k09k25k97p09j733k917l150j811M31K271L110L470
51676C59968M071M893N442N569N493N039L568R81j725l474m283m831n229n056
51662C70426m431m127m414m637m263l631l291l186k980k689k399j774m11J505
$$ plain form
51648 329698 332987 337408 342141 346412 349779 352481 355270 358646 362344 365693 368338 370496 372588 374833
51634 374833 377164 379381 381289 382611 382861 381450 378086 373112 367480 362376 358676 356429 354812 352853
51620 352853 350385 348146 346892 346673 347033 347567 348025 348187 347984 347692 347835 349032 351835 356224 361029 364396
51604 364396 365318 364424 362896 361056 358577 355705 353531 353019 354249 356577 359059 360842 361639 361899 362233 362825
51588 362825 363613 364679 365949 366856 366912 366377 365645 364208 361044 356008 350085 344291 339035 334525 330823 327399
51572 327399 323525 319459 316453 315243 315227 315487 315986 317317 319900 323864 329099 334909 340093 343916 346749
51557 346749 349455 352579 356400 361213 367062 373628 380857 389310 399411 410578 421312 429781 434124
51544 434124 432962 426354 416019 404173 392368 381580 372659 365960 360985 357151 354732 354478 356569
$$ packed form
51648C29698L289M421M733M271L367K702K789L376L698L349K645K158K092K245
51634C74833K331K217J908J322K50j411l364m974n632n104l700k247j617j959
51620C52853k468k239j254k19L60N34M58J62k03k92J43J197K803M389M805L367
51604C64396R22q94j528j840k479k872k174n12J230K328K482J783P97K60L34N92
51588C62825P88J066J270R07N6n35p32j437l164n036n923n794n256m510l702l424
51572C27399l874m066l006j210j6K60M99J331K583L964N235N810N184L823K833
51557C46749K706L124L821M813N849O566P229Q453J0101J1167J0734Q469M343
51544D34124j162o608j0335j1846j1805j0788q921o699m975l834k419k54K091
$$ plain form
51531 356569 360521 365868 372258 378980 384979 389416 391864 392145 390363 386932 382215 376312 369591 363035
51517 363035 357535 353054 348999 345139 341621 338420 335480 333274 332471 333023 334148 335258 336383 337809 339851
51502 339851 342897 347050 351800 356781 362875 371764 384159 399005 414486 428983 440789 447860 448801
51489 448801 444046 435617 425763 415955 406843 398730 392008 387194 384552 383805 384470 386332 389227 392584 395842
51474 395842 399307 403870 409641 415510 420409 424412 428136 431746 435282 439701 446853 458500 475863 499812
51460 499812 530600 567120 607076 648334 689964 731808 773417 813710 851350 884952 912887
51449 912887 933290 944574 945943 937476 919859 894161 861689 823903 782403 739006 695680 654248
51437 654248 616165 582537 554087 530776 511578 495097 480567 468040 457619 448859 441056 433802
$$ packed form
51531C56569L952N347O390O722N999M437K448K81j782l431m717n903o721o556
51517C63035n500m481m055l860l518l201k940k206q03N52J125J110J125J426K042
51502C39851L046M153M750M981O094Q889J2395J4846J5481J4497J1806P071R41
51489D48801m755q429r854r808r112q113o722m814k642p47O65J862K895L357L258
51474C95842L465M563N771N869M899M003L724L610L536M419P152J1647J7363K3949
51460D99812L0788L6520L9956M1258M1630M1844M1609M0293L7640L3602K7935
51449I12887K0403J1284J369q467j7617k5698l2472l7786m1500m3397m3326m1432
51437F54248l8083l3628k8450k3311j9198j6481j4530j2527j0421q760p803p254
$$ plain form
51425 433802 427063 421004 415860 411669 408003 404325 400744 397899 395817 393569 390554 387512 385437 384004
51411 384004 381996 379057 375970 373248 370518 367508 364589 361984 359347 356662 354809 354569 355667 357409
51397 357409 359671 362533 365407 367380 368278 368680 369023 369345 369781 370559 371401 371525 370489 368553 366025 362658
51381 362658 358030 352307 346399 341394 337864 335548 333625 331420 328946 326726 325178 324261 323587 322618 320856
51366 320856 318105 314668 311134 307923 305104 302580 300330 298569 297803 298550 300749 303565 306113 308362 311063
51351 311063 314789 319391 324434 329789 335612 341988 348819 355880 362734 368724 373346 376742 379772 383524
51337 383524 388650 394921 401285 406366 409039 408739 405487 399875 392873 385306 377402 369015 360336 352120
51323 352120 345100 339434 334942 331645 329723 329011 328855 328623 328197 327838 327666 327463 327016 326597 326866 328154 329893
$$ packed form
51425D33802o739o059n144m191l666l678l581k845k082k248l015l042k075j433
51411C84004k008k939l087k722k730l010k919k605k637k685j853k40J098J742
51397C57409K262K862K874J973Q98M02L43L22M36P78Q42J24j036j936k528l367
51381C62658m628n723n908n005l530k316j923k205k474k220j548r17o74r69j762
51366C20856k751l437l534l211k819k524k250j761p66P47K199K816K548K249K701
51351C11063L726M602N043N355N823O376O831P061O854N990M622L396L030L752
51337C83524N126O271O364N081K673l00l252n612p002p567p904q387q679q216
51323C52120p020n666m492l297j922p12j56k32m26l59j72k03m47m19K69J288J739
$$ plain form
51306 329893 331068 331319 331408 332430 334794 338181 342290 347189 352912 359117 365348 371414 377360 383269 389253
51291 389253 395453 401872 408407 415314 423433 433530 445448 458329 471874 487089 505583 528435
51279 528435 556047 588834 627419 671962 721611 774774 829657 884306 936466 983882 1024752
51268 1024752 1057618 1080895 1092952 1092794 1080459 1056678 1022649 980335 932449 881532 829117 776195
51256 776195 724254 675275 630689 590905 555957 526010 500927 479890 461919 446513 433469
51245 433469 422373 412719 404274 396985 390680 385234 380813 377548 375193 373481 372605 372785 373494 373679 372722
51230 372722 370724 367909 364361 360362 356328 352250 347779 343050 338820 335613 333299 331760 331279 331827 332601
51215 332601 332909 333105 334034 335864 337990 339785 340869 340934 340038 339000 338837 339711 340869 341619 341937 342154 342559
$$ packed form
51306C29893J175K51Q9J022K364L387M109M899N723O205O231O066N946N909N984
51291C89253O200O419O535O907Q119J0097J1918J2881J3545J5215J8494K2852
51279E28435K7612L2787L8585M4543M9649N3163N4883N4649N2160M7416M0870
51268A024752L2866K3277J2057j58j2335k3781l4029m2314m7886n0917n2415n2922
51256G76195n1941m8979m4586l9784l4948k9947k5083k1037j7971j5406j3044
51245D33469j1096r654q445p289o305n446m421l265k355j712q76J80P09J85r57
51230C72722j998k815l548l999m034m078m471m729m230l207k314j539m81N48P74
51215C32601L08J96R29J830K126J795J084O5q96j038j63Q74J158P50L18K17M05
$$ plain form
51198 342559 343396 344865 347009 349818 353315 357181 360465 362184 362206 361111 359290 356702 353493 350180 347102
51183 347102 344325 342269 341776 343123 345449 347513 348663 348730 347562 345238 342498 340289 338915 338029 337328
51168 337328 336852 336656 336674 336963 337693 338760 339727 340322 340728 341222 341710 341884 341733 341596 341644 341591 341065 340146 339337
51149 339337 339023 339187 339626 340162 340560 340554 340184 339905 340134 340875 342009 343635 345738 347796 349258 350350 351941
51132 351941 354539 357846 361212 363994 365431 364835 362247 358527 354583 350864 347617 345040 342864 340426
51118 340426 337577 335081 333666 333131 332886 332908 333499 334513 335573 336853 338882 341636 344570 347547 350959
51103 350959 354766 358148 360510 362276 364341 367054 370088 372950 375296 376958 377944 378257 377618 375725 372924
51088 372924 370190 368132 366395 364412 362428 361284 361348 362147 363017 363684 364207 364754 365515 366552 367615 368275
$$ packed form
51198C42559Q37J469K144K809L497L866L284J719K2j095j821k588l209l313l078
51183C47102k777k056m93J347K326K064J150O7j168k324k740k209j374q86p01
51168C37328m76j96J8K89P30J067R67N95M06M94M88J74j51j37M8n3n26r19q09
51149C39337l14J64M39N36L98ol70k79K29P41J134J626K103K058J462J092J591
51132C51941K598L307L366K782J437n96k588l720l944l719l247k577k176k438
51118C40426k849k496j415n35k45K2N91J014J060J280K029K754K934K977L412
51103C50959L807L382K362J766K065K713L034K862K346J662R86L13o39j893k801
51088C72924k734k058j737j983j984j144O4P99Q70O67N23N47P61J037J063O60
$$ plain form
51072 368275 368265 367547 366153 364242 362255 360599 359160 357478 355471 353649 352463 351906 351964 353010 355288 358204
51056 358204 360612 361773 361729 360869 359528 358058 356854 356138 355840 355732 355507 354838 353710 352659 352359 352889 353794
51039 353794 354878 356528 359079 362313 365784 369105 371591 372192 370510 367630 365193 363688 362267 360228
51025 360228 357961 356239 355244 354691 354400 354248 353857 352932 351823 351301 351754 352888 354271 355872 357920 360398
51009 360398 362834 364623 365582 366193 367116 368417 369470 369828 370038 371262 374055 377843 381666 385117 388275
50994 388275 390963 392573 392726 391781 390453 389041 387381 385470 383775 382690 381958 380907 379235 377308 375738
50979 375738 374870 374714 375040 375392 375198 374235 372988 372375 373001 374703 376847 378950 380910 382706 384170 385144
50963 385144 385663 385779 385410 384706 384439 385444 387588 389846 391708 393946 397495 402108 406904 412005 418757
$$ packed form
51072C68275j0p18j394j911j987j656j439j682k007j822j186n57N8J046K278K916
51056C58204K408J161m4q60j341j470j204p16k98j08k25o69j128j051l00N30R05
51039C53794J084J650K551L234L471L321K486O01j682k880k437j505j421k039
51025C60228k267j722r95n53k91j52l91r25j109n22M53J134J383J601K048K478
51009C60398K436J789R59O11R23J301J053L58K10J224K793L788L823L451L158
50994C88275K688J610J53r45j328j412j660j911j695j085p32j051j672j927j570
50979C75738q68j56L26L52j94r63j247o13O26J702K144K103J960J796J464R74
50963C85144N19J16l69p04k67J005K144K258J862K238L549M613M796N101O752
$$ plain form
50948 418757 428267 440454 454644 470295 486803 503328 519319 534655 548746 560045 567168 570188
50936 570188 570161 567697 562746 555518 546675 536484 524678 511481 498099 485763 474835 465291 457472
50923 457472 451696 447533 444297 442151 441942 443897 447206 451147 455814 461259 466608 470888 474494 478985
50909 478985 485419 493540 502719 512929 524473 537329 551316 566445 582603 599087 614974 629824
50897 629824 643754 657042 670106 683573 697872 712814 727989 743322 758730 773552 787101
50886 787101 799689 812297 825201 837711 849384 860526 871061 879722 885060 886807 885861 883557 881569
50873 881569 881893 886111 894864 908578 928227 954649 987465 1025524 1068236 1115657 1167376 1222261
50861 1222261 1279404 1338492 1398976 1459593 1519030 1576387 1630611 1680056 1723228 1759623 1789415
$$ packed form
50948D18757R510J2187J4190J5651J6508J6525J5991J5336J4091J1299P123L020
50936E70188k7k464m951p228q843j0191j1806j3197j3382j2336j0928r544p819
50923D57472n776m163l236k146k09J955L309L941M667N445N349M280L606M491
50909D78985O434Q121R179J0210J1544J2856J3987J5129J6158J6484J5887J4850
50897F29824J3930J3288J3064J3467J4299J4942J5175J5333J5408J4822J3549
50886G87101J2588J2608J2904J2510J1673J1142J0535Q661N338J747r46k304j988
50873H81569L24M218Q753J3714J9649K6422L2816L8059M2712M7421N1719N4885
50861A222261N7143N9088O0484O0617N9437N7357N4224M9445M3172L6395K9792
$$ plain form
50850 1789415 1812636 1829166 1839269 1843537 1842337 1835939 1825501 1813544 1802948 1795213 1789652 1784181
50838 1784181 1776835 1766666 1753729 1738772 1722942 1707152 1691265 1674036 1654134 1631044 1604756
50827 1604756 1574982 1541261 1503633 1462600 1418507 1371661 1323072 1274273 1226069 1178170 1130567
50816 1130567 1084640 1042158 1003544 967903 934667 904389 877697 854174 832792 813151 795815
50805 795815 781459 769977 760462 751861 743647 736019 729572 724682 721088 718053 714984 711897 709306 707741
50791 707741 707415 708211 709761 711553 713226 714929 717236 720538 724612 728897 733061 737153 741352 745825 750779
50776 750779 756378 762618 769514 777329 786339 796353 806796 817455 828937 842233 857909 875765
50764 875765 895112 915320 936412 959399 985970 1017570 1054657 1096868 1143940 1196416 1255520
$$ packed form
50850A789415K3221J6530J0103M268j200o398j0438j1957j0596p735n561n471
50838A784181p346j0169j2937j4957j5830j5790j5887j7229j9902k3090k6288
50827A604756k9774l3721l7628m1033m4093m6846m8589m8799m8204m7899m7603
50816A130567m5927m2482l8614l5641l3236l0278k6692k3523k1382j9641j7336
50805G95815j4356j1482r515q601q214p628o447m890l594l035l069l087k591j565
50791G07741l26P96J550J792J673J703K307L302M074M285M164M092M199M473M954
50776G50779N599O240O896P815R010J0014J0443J0659J1482J3296J5676J7856
50764H75765J9347K0208K1092K2987K6571L1600L7087M2211M7072N2476N9104
$$ plain form
50753 1255520 1322371 1397390 1480513 1571860 1672008 1781416 1899747 2025911 2158692 2297160
50743 2297160 2440553 2587880 2737363 2885745 3028154 3159267 3275036 3373226 3452413 3511113
$$ packed form
50753A255520O6851P5019Q3123R1347J00148J09408J18331J26164J32781J38468
50743B297160J43393J47327J49483J48382J42409J31113J15769R8190P9187N8700
$$ [...]
##END NTUPLES=NMR SPECTRUM
##END=
