##TITLE=AC1526_ROEFFECT0006_8213789_DTOzV0TmO8
##JCAMPDX= 6.0         $$ Bruker NMR JCAMP-DX V2.0
##DATA TYPE= NMR SPECTRUM
##DATA CLASS= NTUPLES
##ORIGIN= BRUKER
##OWNER= Administrator
$$ 1.72 TOPSPIN		Version 2.1
$$ 2014-08-04 22:45:13.732 -0700  Administrator@X
$$ Compression mode = diff/dup
##.OBSERVE FREQUENCY= 400.02188249412
##.OBSERVE NUCLEUS= ^1H
##.ACQUISITION MODE= SIMULTANEOUS (DQD)
##.ACQUISITION SCHEME= undefined
##.AVERAGES= 8
##.DIGITISER RES= 22
##SPECTROMETER/DATA SYSTEM= spect
##.PULSE SEQUENCE= zg30
##.SOLVENT NAME= COFFEE_meoh
##.SHIFT REFERENCE= INTERNAL, COFFEE_meoh, 1, 14.98509
##AUDIT TRAIL= $$ (NUMBER, WHEN, WHO, WHERE, PROCESS, VERSION, WHAT)
$$ ##TITLE= Audit trail, TOPSPIN		Version 2.1
$$ ##JCAMPDX= 5.01
$$ ##ORIGIN= Bruker BioSpin GmbH
$$ ##OWNER= Administrator
$$ $$ E:\/data/COFFEE/nmr/AC1526_ROEFFECT0006_8213789_DTOzV0TmO8/40/pdata/1/auditp.txt
$$ ##AUDIT TRAIL=  $$ (NUMBER, WHEN, WHO, WHERE, PROCESS, VERSION, WHAT)
(   1,<2014-08-04 22:45:06.941 -0700>,<Administrator>,<X>,<go>,<TOPSPIN 2.1>,
      <created by zg
	started at 2014-08-04 22:44:01.529 -0700,
	POWCHK enabled, PULCHK disabled,
       configuration hash MD5:
       16 EA D6 F4 BB 67 03 14 9B FF E7 A0 43 5B 48 2E
       data hash MD5: 64K
       A4 F6 3A 20 7D A1 92 70 F4 E9 2E FD A4 6B BD B3>)
(   2,<2014-08-04 22:45:09.872 -0700>,<Administrator>,<X>,<proc1d>,<TOPSPIN 2.1>,
      <Start of raw data processing
       efp LB = 0 FT_mod = 6 PKNL = 1 PHC0 = 0 PHC1 = 0 SI = 32K 
       data hash MD5: 32K
       78 4D 9C 90 E6 2C B1 ED DF 14 CD D7 72 83 FC 88>)
(   3,<2014-08-04 22:45:10.169 -0700>,<Administrator>,<X>,<proc1d>,<TOPSPIN 2.1>,
      <pk PHC0 = 91.49414 PHC1 = 0 
       data hash MD5: 32K
       20 9A 40 42 B2 30 C6 F3 86 DB D1 60 19 C0 5B C5>)
(   4,<2014-08-04 22:45:10.279 -0700>,<Administrator>,<X>,<proc1d>,<TOPSPIN 2.1>,
      <abs ABSG = 1 
       data hash MD5: 32K
       A4 A0 75 C1 18 A4 C3 86 A3 3E C5 20 EC AE 61 DB>)
(   5,<2014-08-04 22:45:10.357 -0700>,<Administrator>,<X>,<proc1d>,<TOPSPIN 2.1>,
      <abs ABSG = 2 
       data hash MD5: 32K
       69 BA E3 78 4D 55 10 F6 CB CE 95 21 FE E1 A9 F1>)
(   6,<2014-08-04 22:45:10.435 -0700>,<Administrator>,<X>,<proc1d>,<TOPSPIN 2.1>,
      <abs ABSG = 3 
       data hash MD5: 32K
       22 89 87 D3 6E 4C 66 58 01 7B B8 5A 93 D0 27 08>)
(   7,<2014-08-04 22:45:10.529 -0700>,<Administrator>,<X>,<proc1d>,<TOPSPIN 2.1>,
      <abs ABSG = 4 
       data hash MD5: 32K
       74 2A FF 76 63 46 F3 EB B9 CC 22 D7 1B F9 08 DC>)
(   8,<2014-08-04 22:45:10.591 -0700>,<Administrator>,<X>,<proc1d>,<TOPSPIN 2.1>,
      <abs ABSG = 5 
       data hash MD5: 32K
       00 1B 66 09 E5 8E C8 1A 7D 0E C8 99 DE F5 23 81>)
$$ ##END=
$$ 
$$ $$ hash MD5
$$ $$ 8A C3 80 99 C9 0F 92 B1 C1 79 B9 80 55 EC A3 1F
##$RELAX= 
##$RELAX= 
##$RELAX= 
##$RELAX= 
##$RELAX= 
##$RELAX= 
##$RELAX= 
$$ Bruker specific parameters
$$ --------------------------
##$DU= <E:\>
##$EXPNO= 40
$$ [...]
##$TP= (0..7)
150 150 150 150 150 150 150 150
##$TP07= 0
##$TPNAME0= <>
##$TPNAME1= <>
##$TPNAME2= <>
##$TPNAME3= <>
##$TPNAME4= <>
##$TPNAME5= <>
##$TPNAME6= <>
##$TPNAME7= <>
##$TPOAL= (0..7)
0.5 0.5 0.5 0.5 0.5 0.5 0.5 0.5
##$TPOFFS= (0..7)
0 0 0 0 0 0 0 0
##$TUNHIN= 0
##$TUNHOUT= 0
##$TUNXOUT= 0
##$USERA1= <user>
##$USERA2= <user>
##$USERA3= <user>
##$USERA4= <user>
##$USERA5= <user>
##$V9= 5
##$VALIST= <valist>
##$VCLIST= <CCCCCCCCCCCCCCC>
##$VD= 0
##$VDLIST= <DDDDDDDDDDDDDDD>
##$VPLIST= <PPPPPPPPPPPPPPP>
##$VTLIST= <TTTTTTTTTTTTTTT>
##$WBST= 1024
##$WBSW= 4
##$XGAIN= (0..3)
0 0 0 0
##$XL= 0
##$YL= 0
##$YMAX_a= 658038
##$YMIN_a= -519370
##$ZGOPTNS= <>
##$ZL1= 120
##$ZL2= 120
##$ZL3= 120
##$ZL4= 120
##$ABSF1= 14.98509
##$ABSF2= -5.573092
##$ABSG= 5
##$ABSL= 3
##$ALPHA= 0
##$AQORDER= 0
##$ASSFAC= 0
##$ASSFACI= 0
##$ASSFACX= 0
##$ASSWID= 0
##$AUNMP= <proc_prof1d_extract_pilot.lims>
##$AXLEFT= 0
##$AXNAME= <>
##$AXNUC= <1H>
##$AXRIGHT= 0
##$AXTYPE= 0
##$AXUNIT= <>
##$AZFE= 0.1
##$AZFW= 0.1
##$BCFW= 0
##$BC_mod= 0
##$BYTORDP= 0
##$COROFFS= 0
##$CY= 15
##$DATMOD= 1
##$DC= 0
##$DFILT= <>
##$DTYPP= 0
##$F1P= 0
##$F2P= 0
##$FCOR= 0.5
##$FTSIZE= 32768
##$FT_mod= 6
##$GAMMA= 0
##$GB= 0
##$INTBC= 1
##$INTSCL= 1
##$ISEN= 128
##$LB= 0
##$LEV0= 0
##$LPBIN= 0
##$MAXI= 10000
##$MC2= 0
##$MEAN= 0
##$ME_mod= 0
##$MI= 0
##$NCOEF= 0
##$NC_proc= -8
##$NLEV= 6
##$NOISF1= 0
##$NOISF2= 0
##$NSP= 0
##$NTH_PI= 0
##$NZP= 0
##$OFFSET= 14.98509
##$PC= 1
##$PHC0= 91.49414
##$PHC1= 0
##$PH_mod= 1
##$PKNL= yes
##$PPARMOD= 0
##$PPDIAG= 0
##$PPIPTYP= 0
##$PPMPNUM= 2147483647
##$PPRESOL= 1
##$PSCAL= 4
##$PSIGN= 0
##$PYNMP= <proc.py>
##$REVERSE= no
##$SF= 400.02
##$SI= 32768
##$SIGF1= 0
##$SIGF2= 0
##$SINO= 400
##$SIOLD= 32768
##$SPECTYP= <>
##$SREGLST= <1H.CDCl3>
##$SSB= 0
##$STSI= 32768
##$STSR= 0
##$SW_p= 8223.68421052631
##$SYMM= 0
##$S_DEV= 0
##$TDeff= 65536
##$TDoff= 0
##$TI= <>
##$TILT= no
##$TM1= 0
##$TM2= 0
##$TOPLEV= 0
##$USERP1= <user>
##$USERP2= <user>
##$USERP3= <user>
##$USERP4= <user>
##$USERP5= <user>
##$WDW= 1
##$XDIM= 32768
##$YMAX_p= 445408362
##$YMIN_p= -714871
##$CURPLOT= <Network HP LaserJet P1505>
##$CURPRIN= <$Network HP LaserJet P1505>
##$DFORMAT= <normdp>
##$LAYOUT= <+/1D_H.xwp>
##$LFORMAT= <normlp>
##$PFORMAT= <normpl>
##$SURQMSG= 1
$$ End of Bruker specific parameters
$$ ---------------------------------
##NTUPLES= NMR SPECTRUM
##VAR_NAME=  FREQUENCY,     SPECTRUM/REAL,   SPECTRUM/IMAG
##SYMBOL=    X,             R,               I
##VAR_TYPE=  INDEPENDENT,   DEPENDENT,       DEPENDENT
##VAR_FORM=  AFFN,          ASDF,            ASDF
##VAR_DIM=   32768,         32768,           32768
##UNITS=     HZ,            ARBITRARY UNITS, ARBITRARY UNITS
##FACTOR=    0.250966925370066, 1,           1
##FIRST=     8223.43324360094, -67899,       -54251
##LAST=      0,             -54110,          135876
##MIN=       0,             -714871,         0
##MAX=       8223.43324360094, 445408362,    0
$$ Real data points
##PAGE= N=1
##DATA TABLE= (X++(R..R)), XYDATA
$$ [...]
$$ plain form
19458 -86151 -227410 -130397 -107601 -156972 18437 -100257 -378895 -196927 91222 -325125 58985
19446 -217464 37293 -141787 -85708 115072 228229 -351341 117151 41894 -14126 -60429
19436 -60429 219831 54692 -290821 254720 231650 -319814 270919 -477407 182282 -285217
19425 11247 -65773 -45155 -82559 95339 299001 99429 29100 28406 -178101 -269810 58768 -51439
19412 122277 -49096 -349020 66212 -121590 -207222 77876 10084 -383738 -27932 146162 270546
19401 270546 58826 -303090 -187195 -124051 -12574 -102393 -179903 117360 67449 -196549 -95874
19389 -323861 -83184 -70829 -182390 -69496 -227979 -272230 12842 167374 60729 68204 206804
19378 206804 235210 -158976 -285486 92955 64294 -484051 -164797 -102094 134572 100247
$$ packed form
19458h6151j41259R7013K2796m9371A8437a00257k78638J81968I1222c25125E8985
19446b17464C7293a41787N6079A15072J13157c51341A17151D1894a4126m6303
19436f0429B19831E4692b90821B54720k3070c19814B70919d77407A82282b85217
19425A1247f5773K0618l7404I5339K03662I9429B9100o94a78101r1709E8768e1439
19412A22277d9096k99924F6212a21590q5632G7876A0084c83738b7932A46162J24384
19401B70546E8826c03090J15895O3144a2574q9819p7510A17360m9911a96549i5874
19389c23861h3184J2355j11561f9496j58483m4251A2842J54532F0729P475J38600
19378B06804K8406a58976j26510I2955k8661d84051a64797O2703A34572l4325
$$ plain form
19368 100247 -274832 -318737 -87939 -243027 -77115 97939 -205184 156307 103622 -125153
19357 269375 -193229 -101874 -45639 190441 115275 -194844 -38182 -351835 -16659 28071 -206648
19345 98091 136794 -77964 91807 15376 -271355 -359322 -225731 -87624 72414 358861 -132852
19333 -18311 -74322 -38657 -100461 -55936 87258 -100129 -117803 -138375 -202458 25596 -28921
19321 36559 23293 -37163 333207 -327051 -224290 -170379 -161996 -308770 54786 165880 -198935
19309 165835 -80021 -147867 50407 124260 -144481 -208221 -85620 26930 66608 -26775 -219707
19298 -219707 -32145 -159856 35986 79118 -323541 -220757 -392256 -186398 -29385 29064
19287 38731 50156 -100194 -193831 -207414 65797 -87739 -151851 -106214 102208 -36393 83781
$$ packed form
19368A00247b74832m3905h7939j55088g7115I7939b05184A56307n2685a25153
19357B69375a93229R1355d5639A90441p5166a94844c8182l13653a6659B8071b06648
19345I8091L8703g7964I1807A5376b71355q7967J33591h7624G2414K86447a32852
19333a8311n6011L5665o1804M4525H7258a00129j7674k0572o4083B5596b8921
19321C6559j3266c7163C33207c27051J02761N3911Q383j46774E4786J11094a98935
19309A65835h0021o7846E0407P3853a44481o3740h5620B6930L9678b6775j92932
19298b19707c2145j27711C5986M3132c23541J02784j71499a86398b9385B9064
19287C8731J1425a00194r3637j3583F5797h7739o4112M5637A02208c6393H3781
$$ plain form
19275 -37063 -50159 6888 33848 -170156 -89802 183476 -113946 273624 -203421 142249 -141422
19263 -131331 -211982 220312 -31631 47662 11829 -62105 -36873 90846 -34276 134295 -85134
19251 -252412 -432849 -126118 -130280 387946 -269011 -112294 -194394 -216004 33121 -218731
19240 -103054 -87345 -22093 27263 -13317 -403546 -214078 -71437 -188486 83864 -82858 405996
19228 117336 107755 -146359 -228589 -71774 -110472 49897 -267789 -35467 71606 -143166 -236367
19217 -236367 31985 106998 1960 81492 -205569 -185110 -73085 -43866 107825 -173052 -126377
19206 -126377 -98308 -106988 -63544 -77991 -253377 -36097 -117340 147057 192968 -161152 -268881
19195 -268881 -24609 -129088 -140902 -108499 -45458 253605 260836 -239426 -29752 24347 -241225
$$ packed form
19275c7063j3096F888K6960a70156Q0354A83476a13946B73624b03421A42249a41422
19263a31331q0651B20312c1631D7662A1829f2105K5232I0846c4276A34295h5134
19251b52412j80437a26118m162C87946b69011a12294q2100k1610C3121b18731
19240a03054J5709b2093B7263a3317l90229J89468g1437j17049H3864h2858D05996
19228A17336r581a46359q2230g1774l8698D9897b67789c5467G1606a43166r3201
19217b36367C1985P5013A960P9532b05569K0459g3085K9219A07825a73052M6675
19206a26377K8069q680M3444j4447j75386c6097q1243A47057M5911a61152j07729
19195b68881b4609j04479j1814L2403d5458B53605P231b39426b9752B4347b41225
$$ plain form
19183 53940 -148144 -320405 -267264 -170751 96669 26002 -215043 -175074 119493 -48550 -33056
19172 -33056 -170301 -598286 -166417 -62682 135363 -71303 181408 -85157 -294601 2816 225631
19161 225631 -197121 -141091 115056 -194886 -185447 256662 113534 117897 184987 -62082 191058
19149 -234554 -105264 -239881 -134309 210701 -2153 154237 217070 -58437 -142569 77062 -323787
19137 -259682 -58590 -64293 149679 256593 -122613 -115155 -174457 337490 69619 265476 -392320
19125 403338 -7469 256596 -148096 134568 -256892 -197414 52078 675 -26656 -97885 42934
19113 374118 -486078 17414 45964 9606 -144112 176604 32528 -82071 -103448 132448 -47591
19101 86836 -96417 -248880 -79733 -78645 -110103 10441 -161902 -358257 32244 -27532 -132406
$$ packed form
19183E3940a48144j72261N3141R6513I6669B6002b15043L9969A19493d8550J5494
19172c3056j37245m27985a66417f2682A35363g1303A81408h5157k09444B816K22815
19161B25631a97121N6030A15056a94886R439B56662A13534M363O7090f2082A91058
19149b34554a05264j34617J05572B10701b153A54237O2833e8437q4132G7062c23787
19137b59682e8590n703A49679J06914a22613P458n9302C37490F9619J95857c92320
19125D03338g469B56596a48096A34568b56892N9478E2078F75b6656p1229D2934
19113C74118d86078A7414K8550I606a44112A76604C2528h2071k1377A32448d7591
19101H6836i6417j52463g9733J088l1458A0441a61902j96355C2244b7532j04874
$$ plain form
19090 -132406 -120909 138322 152588 -120642 -246658 -131847 -158654 134470 -273545 -89829
19079 -173244 73226 -287989 -104724 90320 203908 50402 -232782 -81148 -393340 193305
19068 -65009 -76359 -89399 104224 -378047 -63155 -8659 -293412 390361 21213 -137615 -60054
19056 82833 150781 206277 200861 74875 115169 100740 -64207 -222992 27057 197937 51253
19044 99523 -26152 -281092 -374377 272324 92587 117489 -391515 105258 -145229 -211665 46683
19032 83315 -133894 -385843 -146609 -16958 -75577 20071 126982 -43096 298067 28826 -202767
19020 -295024 104849 -66455 85948 -100032 -191291 -39693 -5360 -217312 1040 -79250 117455
19008 -111523 -9159 -139925 -135885 44719 57053 -56138 -43612 143167 -133011 -385049 -224759
$$ packed form
19090a32406J1497A38322J4266a20642j26016J14811k6807A34470b73545h9829
19079a73244G3226b87989a04724I0320J13588E0402b32782h1148l12192A93305
19068f5009j1350j3040A04224c78047f3155h659k84753C90361B1213a37615f0054
19056H2833O7948N5496n416G4875M0294j4429f4207j58785B7057J70880E1253
19044I9523b6152k54940r3285B72324I2587K4902c91515A05258a45229o6436D6683
19032H3315a33894k51949a46609a6958n8619B0071J06911d3096B98067B8826b02767
19020b95024A04849f6455H5948a00032r1259c9693e360k11952A040g9250A17455
19008a11523i159j30766M040D4719J2334e6138J2526A43167a33011k52038J60290
$$ plain form
18997 -224759 155185 -106681 -35255 199999 180958 146305 -139214 132478 -183563 -161380
18987 -161380 -217613 -67322 345431 -264406 130619 147186 -97587 64570 -5009 -481052 -109962
18975 1766 -84403 -307662 86137 69075 24196 -361969 -123777 76866 -169076 22625 408941
18964 408941 158325 -364365 176 -168881 212758 -316939 286822 28857 98745 -268960
18953 70114 -231219 -56711 -25606 189370 189767 -119295 -123325 288319 175686 -86081 -199736
18942 -199736 52688 96337 103286 214519 185182 -177266 -39872 182307 -229067 -82406 267359
18930 193998 34589 61628 -67066 178576 -348351 -289489 122632 -47134 -80371 -429304 6230
18918 -74391 23047 -60178 -468763 -143116 -29592 -248932 -194725 -221515 -365668 286107 -234560
$$ packed form
18997b24759A55185a06681c5255A99999j9041l4653a39214A32478a83563K2183
18987a61380n6233f7322C45431b64406A30619J6567i7587F4570e009m76043a09962
18975A766h4403k23259H6137j7062B4196c61969a23777G6866a69076B2625L86316
18964D08941A58325c64365A76a68881B12758c16939B86822B8857O9888b68960
18953G0114b31219e6711b5606A89370L97a19295m030B88319j12633h6081j13655
18942a99736E2688M3649O949J11233k9337a77266c9872A82307b29067h2406B67359
18930A93998C4589K7039f7066A78576c48351N8862A22632d7134l3237l48933F230
18918g4391B3047f0178m08585a43116b9592k19340N4207k6790j44153B86107b34560
$$ plain form
18906 -400661 46208 -385335 -128095 336670 10512 20156 -180020 180316 128885 170232 -137160
18894 94481 41357 -106489 -110972 152621 -173888 -365143 76281 14738 -164038 -30457 -99142
18883 -99142 -221610 137380 -173906 -285243 -20834 -15628 -257372 -262812 -177838 234725 104294
18871 113869 -85038 -121679 -118615 -238467 35396 -95168 58865 -4607 -309836 -216691 -248139
18860 -248139 134540 -148343 2085 -257809 20413 38364 -181692 -246232 -165099 113153 197151
18849 197151 284357 -195115 -209792 -188566 -73211 69219 154869 -145925 -235222 117871 -51091
18837 108779 133714 -81663 173116 -97317 -205851 -53243 -145964 -183951 98837 -386272 -178614
18825 68966 -99106 207138 52385 -194483 -20683 -182009 214074 235162 -261714 -18435 101357
$$ packed form
18906d00661D6208c85335a28095C36670A0512R644a80020A80316n1431M1347a37160
18894I4481D1357a06489m483A52621a73888j91255G6281A4738a64038c0457o8685
18883i9142j22468A37380a73906j11337b0834N206k41744n440Q4974B34725A04294
18871A13869h5038l6641L064j19852C5396i5168E8865d607l05229R3145l1448
18860b48139A34540a48343B085b57809B0413J7951a81692o4540Q1133A13153Q3998
18849A97151Q7206a95115j4677K1226g3211F9219Q5650a45925q9297A17871e1091
18837A08779K4935h1663A73116i7317j08534e3243r2721l7987I8837c86272a78614
18825F8966i9106B07138E2385a94483b0683j61326B14074K1088b61714a8435A01357
$$ plain form
18813 -316198 -206168 -213609 112073 -136997 129844 117828 210182 197344 -68930 -269967 73909
18801 225786 69345 -179056 -38075 -203688 -405421 -63324 -36577 -203812 85809 175272 345182
18790 345182 -182452 -232595 -75511 113620 -13259 190287 -157440 88540 167023 -9516 -51190
18779 -51190 21557 -159856 434351 198243 -176990 -215849 222948 -7497 -170019 268079
18768 -297787 246889 -354895 -30296 -70270 -327218 -121161 140216 -194903 90643 -182350
18757 -275156 289716 165845 26548 -191993 -147346 -139608 -54305 -239618 297482 -131541
18746 128867 204492 -104352 213662 63729 -89935 373807 -76941 132182 -132979 173345
18735 129815 50321 -186467 6457 -362260 190000 -133795 -7013 -235600 -254319 -8978 -82747
$$ packed form
18813c16198J10030p441A12073a36997A29844j2016R2354j2838f8930k01037G3909
18801B25786F9345a79056c8075j65613k01733f3324K6747j67235H5809Q9463J69910
18790C45182a82452n0143g5511A13620a3259A90287a57440H8540P8483i516m1674
18779e1190B1557a59856D34351A98243a76990l8859B22948g497j62522B68079
18768b97787B46889c54895c0296l9974k56948a21161A40216a94903I0643a82350
18757b75156B89716j23871B6548a91993M4647P738e4305j85313B97482a31541
18746A28867P5625a04352B13662F3729h9935C73807g6941A32182a32979A73345
18735A29815E0321a86467F457c62260A90000a33795g013k28587j8719h978p3769
$$ plain form
18724 -82747 -36206 -158347 -211604 131316 -524533 -265493 380445 -18429 -72221 13454 -89868
18712 -281689 -233381 -45282 63357 -387834 -162937 -266143 253299 -52253 377282 -50365
18701 -123387 -195336 -181873 -246885 -28162 18181 -140552 -211687 -17244 -47224 272496 -300971
18689 -32973 240117 -70181 -20865 63846 288150 -156042 233557 78405 1379 53201 -138505
18677 -9394 -34259 101497 -232470 -301125 112995 57074 96496 -151978 -13044 -259907 -101960
18665 -178102 -89820 -85012 291155 -262566 152995 -149525 -40905 -238975 -46118 -40197 114571
18653 -475066 -88070 -430796 163858 -134653 -117572 -248693 -565384 -90250 -128700 71831
18642 24254 28354 77794 -160394 -169227 -293535 -198981 -92908 -113213 -323984 179389 241669
$$ packed form
18724h2747c6206j22141n3257A31316e24533K59040C80445a8429n3792A3454h9868
18712b81689M8308d5282F3357c87834a62937j03206B53299e2253C77282e0365
18701a23387p1949J3463o5012b8162A8181a40552p1135a7244k9980B72496c00971
18689c2973B40117g0181b0865F3846K24304a56042B33557G8405A379N1822a38505
18677i394k4865A01497b32470o8655A12995n5921L9422a51978a3044k46863a01960
18665a78102Q8282M808B91155b62566A52995a49525d0905j98070d6118N921A14571
18653d75066h8070l42726A63858a34653J7081j31121l16691i0250l8450G1831
18642B4254M100M9440a60394q833j24308R4554i2908k0305k10771A79389O2280
$$ plain form
18631 241669 -16046 154739 -205999 -162538 30085 63269 -261467 -100486 -19159 -22908 132141
18619 41407 82361 187162 6657 -23928 -24292 -81527 -219409 79375 -190203 1737 -318479 72140
18606 -181898 -142180 54304 -119084 74810 24568 -21596 -82084 -140019 -48476 27527 86263
18595 86263 -84638 -211986 -146868 -204762 -97201 61778 -206260 247031 108224 80663 -58195
18583 59609 -179617 119402 129079 135637 -247538 18203 172509 -155628 -262326 -153172 -6719
18571 367574 -200460 21584 -40846 247467 -206886 -19553 -227042 -202695 -124918 106288
18560 -138018 -12615 -291963 180561 -23532 -72021 -111006 -149639 21109 16279 -131560 -336817
18549 -336817 -71930 -403279 153104 -1905 83580 -198634 5058 -114785 8347 179766 -21114
$$ packed form
18631B41669a6046A54739b05999M3461C0085L3184b61467a00486a9159l749A32141
18619D1407M0954J04801F657b3928l64n7235j37882G9375a90203A737c18479G2140
18606a81898L9718E4304a19084G4810B4568b1596o0488n7935d8476B7527N8736
18595H6263h4638j27348O5118n7894i7201F1778b06260B47031A08224k7561e8195
18583E9609a79617A19402R677O558b47538A8203J54306a55628j06698J09154f719
18571C67574b00460B1584d0846B47467b06886a9553k07489K4347P7777A06288
18560a38018a2615k79348A80561b3532m8489l8985l8633B1109m830a31560k05257
18549c36817g1930l31349A53104a905H3580a98634E058a14785H347J71419b1114
$$ plain form
18537 -82737 287700 -87922 -141095 -213461 82902 -180001 -5471 261748 -63350 -224221 -121179
18526 -121179 -104232 -41252 -109620 -18981 -79165 87035 -166275 -122626 -222895 -380363 -243225
18515 -243225 68651 45128 -329104 -304976 -222720 -136561 70059 -306058 30822 9465 -223912
18503 126791 -220843 -449584 -334317 96249 72650 8895 -211675 -358891 -293303 -182887
18493 -182887 -99432 -114755 69056 -99538 123180 143461 253441 79044 -173662 -347920 -164144
18481 -152554 -35790 -15393 236345 44154 -310614 -184774 182271 201116 -124307 11395
18470 -164824 -18849 86232 -330379 -34265 77145 -353251 121048 317458 -23260 -126005
18460 -126005 -76250 -103934 -533577 -169802 -130069 62309 92716 2226 -3761 -374268 -314935
$$ packed form
18537h2737B87700h7922n3173p2366H2902a80001e471B61748f3350j60871J03042
18526a21179J6947d1252o8368a8981o0184H7035a66275M3649j00269j57468J37138
18515b43225F8651k3523c29104K4128Q2256Q6159G0059c06058C0822I465b23912
18503A26791b20843k28741J15267I6249k3599H895b11675j47216O5588J10416
18493a82887Q3455j5323F9056i9538A23180K0281J09980G9044a73662j74258a64144
18481a52554c5790a5393B36345D4154c10614J25840A82271J8845a24307A1395
18470a64824a8849H6232c30379c4265G7145c53251A21048J96410b3260j02745
18460a26005M9755k7684m29643a69802L9733F2309L0407B226c761l70507N9333
$$ plain form
18449 -314935 49227 33443 29762 -237376 -111228 -183106 -226237 -57980 -209250 113364 196625
18438 196625 25209 194114 16837 56579 -178985 -321543 -246219 -270395 213386 -397994
18427 -143676 107742 228994 42337 149644 -259498 -128343 168399 172240 -284017 -120891
18416 -198479 118082 118478 162176 12178 94903 -46884 19612 -28897 56174 -135410 -122807
18405 -122807 215333 -262662 -63185 -132624 -104649 -53193 225790 -86321 54147 69393 -46140
18393 -146054 -504943 -358570 -168968 -85898 -114321 -276840 106744 -20152 -101983 82979
18382 -144317 149653 7472 120831 421932 -192403 107826 23340 -211944 -6760 34428 -122064
18370 -332185 -245718 -306845 336564 -51096 -67349 237419 -69501 181814 65389 297978 130854
$$ packed form
18449c14935D9227j5784l681b37376a11228p1878m3131e7980j51270A13364Q3261
18438A96625B5209J68905A6837L9742a78985j42558P5324k4176B13386c97994
18427a43676A07742J21252D2337J07307b59498a28343A68399L841b84017a20891
18416a98479A18082L96M3698A2178Q2725d6884A9612b8897E6174a35410J2603
18405a22807B15333b62662f3185o9439K7975N1456B25790h6321E4147J5246d6140
18393a46054l58889J46373a68968Q3070k8423j62519A06744b0152q1831H2979
18382a44317A49653G472J13359L01101a92403A07826B3340b11944f760C4428a22064
18370c32185Q6467o1127C36564e1096j6253B37419f9501A81814F5389K32589A30854
$$ plain form
18358 -207889 -168728 -182350 89836 -119600 -42607 -228580 150157 15192 59902 425978 188493
18346 -108480 83180 133076 -14136 -198755 42607 -45739 -41473 3438 -65845 -12177 -182846
18335 -182846 -166056 -90423 51724 -52326 -170216 -276444 12921 -173081 69514 -12178 41216
18323 -206559 -79063 -84520 193848 -133000 111243 75180 -116213 38232 -211949 150409
18312 -22559 114885 59649 64212 -230776 -94220 -107436 110220 30490 247625 209541 2506
18300 -217108 -40277 -420283 -50570 12971 70230 -41850 198411 -408497 -251698 -29517 356846
18288 -157724 211272 189644 -105394 -360943 -299168 -143599 2896 18945 290194 114146
18277 56059 -90987 -10488 -99839 205084 -140515 -483846 -115398 40392 -49999 -426744 104013
$$ packed form
18358b07889L9161j3622H9836a19600d2607j85973A50157A5192M4710L66076A88493
18346a08480H3180M9896a4136j84619D2607d5739M266C438f5845a2177j70669
18335a82846J6790P5633E1724e2326j17890j06228A2921a73081F9514a2178D1216
18323b06559g9063n457A93848a33000A11243l6063a16213C8232b11949A50409
18312b2559A14885n5236M563b30776i4220j3216A10220C0490K17135l8084B506
18300b17108d0277l80006e0570A2971N7259d1850A98411d08497J56799b9517C56846
18288a57724B11272k1628a05394k55549O1775a43599B896J6049K71249A14146
18277E6059i0987a0488q9351B05084a40515l43331a15398D0392d9999l76745A04013
$$ plain form
18265 -80817 -164020 -50522 41913 -9619 186160 -206315 -23243 -342312 -326772 -123156 -122381
18254 -122381 53219 -424795 -166184 -153165 -63047 165797 301410 -412850 -79660 -36197
18243 2671 -386328 131286 -174545 52440 -20370 -212966 516 36149 -63604 -212063 -53178
18231 -9777 -574985 -67493 199487 -207636 -191890 -40666 598 155721 -21814 50391 -8415 591
18218 -68415 29483 318255 -19740 -186099 -83865 348039 -12593 1089 -6317 -195980 91297
18206 120230 191033 -2013 -295824 -114484 -330859 56050 -185877 200621 141084 -75723 -151940
18195 -151940 -22014 -27555 40139 -63653 -437592 -219945 43796 -217924 -148410 -6088 -113603
18184 -113603 -109932 74060 -202734 45093 51980 -573575 123375 236812 -163813 -116413 -16598
$$ packed form
18265h0817q3203e0522D1913i619A86160b06315b3243l19069J5540a23156P75
18254a22381E3219d24795a66184J3019f3047A65797J35613d12850g9660c6197
18243B671c86328A31286a74545E2440b0370j92596E16L5633f3604j48459e3178
18231i777n65208f7493A99487b07636J5746d0666E98J55123b1814E0391h415E91
18218f8415B9483K88772a9740j66359h3865C48039a2593A089f317j89663I1297
18206A20230P0803b013k93811a14484k16375E6050a85877B00621n9537g5723p6217
18195a51940b2014n541D0139f3653l73939K17647D3796b17924O9514f088j07515
18184a13603L671G4060b02734D5093O887e73575A23375J13437a63813M7400a6598
$$ plain form
18172 -331611 -28175 -121243 96858 70396 -16058 -222836 -405439 198498 285287 -107284 285204
18160 -49818 49754 -152955 275692 -291044 -108667 -154945 50472 -132465 -193173 -330947
18150 -330947 -96932 -82149 -174763 169531 -13374 -181371 -68871 -223074 -371838 -58268 1106
18138 156701 137915 61113 -331414 -13324 39773 -120500 150119 -197839 197113 -21012
18127 92241 -89082 133189 -51901 167754 -313476 93212 -9495 -121699 -151515 -212243 -182867
18116 -182867 119613 -56593 -309407 120183 -96800 -9993 -108460 -10926 127010 237859 -46301
18104 -75015 -85937 308244 130721 30575 -8051 -49707 -6702 192655 9690 260191 -10457
18092 -58091 -178234 317649 188755 -340868 -202080 108499 -9143 -82132 -385596 -25335
$$ packed form
18172c31611b8175r3068I6858k6462a6058k06778j82603A98498Q6789a07284B85204
18160d9818D9754a52955B75692b91044a08667m6278E0472a32465o0708j37774
18150c30947i6932J4783r2614A69531a3374j67997f8871j54203j48764e8268A106
18138A56701j8786F1113c31414a3324C9773a20500A50119a97839A97113b1012
18127I2241h9082A33189e1901A67754c13476I3212i495j12204k9816o0728K9376
18116a82867A19613e6593k52814A20183i6800i993r8467a0926A27010J10849d6301
18104g5015j0922C08244A30721C0575h051m1656f702A92655I690K50501a0457
18092e8091j20143C17649j28894c40868J38788A08499i143p2989l03464b5335
$$ plain form
18081 49260 151602 335228 -144784 -334438 -270323 -212000 661766 -186796 -445902 -293657
18071 -293657 123902 -382962 -186306 -116257 392343 15486 -100212 -173230 -89623 -45380
18061 -45380 121216 -119492 -25643 47317 -47377 -65874 166926 37653 -220455 -170405 -206769
18050 -206769 -56048 -87589 94418 -95583 -11183 104842 -276423 -178555 -233141 197662 -290075
18038 143770 176447 79023 13717 443005 -180237 -232090 178646 -16989 -121396 -66874 -111437
18027 -111437 -273307 36979 -22077 92525 -224190 -252361 72603 -35524 268717 -166206 -93096
18016 -93096 66294 23628 -42950 -154239 4550 221390 -54579 -53800 87640 -191491 -116773 -114038
18004 -114038 17620 18719 -76396 -249987 159464 22677 -12892 119581 181186 178006 -11924
$$ packed form
18081D9260J02342J83626a44784j89654O4115N8323F61766a86796k59106J52245
18071b93657A23902c82962a86306P0049C92343A5486a00212p3018Q3607M4243
18061d5380A21216a19492b5643D7317d7377j8497A66926C7653b20455N0050l6364
18050b06769e6048l1541I4418i5583a1183A04842b76423R7868n4586A97662b90075
18038A43770L2677G9023A3717M29288a80237n1853A78646a6989j04407N4522m4563
18027a11437j61870C6979b2077I2525b24190k8171G2603c5524B68717a66206P3110
18016i3096F6294B3628d2950j11289D550K16840e4579P79H7640a91491P4718K735
18004a14038A7620J099g6396j73591A59464B2677a2892A19581O1605l180a1924
$$ plain form
17992 -113143 -66272 -130621 -219100 364266 6520 252501 -213820 51524 -193625 -170453 70672
17980 22137 91328 -235942 110097 -101084 182871 -124778 -107516 -272452 151915 38870
17969 -34237 65723 -66209 164628 98104 168817 62196 154438 -340882 -93114 -172916 -192892
17958 -192892 -52619 -44440 -75951 -51868 -219877 82542 417728 214701 -117550 12610 108171
17947 108171 -92481 133022 269058 -10282 121815 14442 -30345 -239695 -7595 -147298 162181
17935 161433 -26793 -69692 218113 49925 -20726 -202021 -40915 -218179 -97740 -54191 12824
17923 -547239 -89530 -92328 195830 -163543 35593 73976 -231052 183452 -135660 63234 22723
17911 102651 -310060 -55931 24548 -55096 47388 -280048 65987 149000 96016 211677 -363959
$$ packed form
17992a13143M6871o4349q8479C64266F520K45981b13820E1524a93625K3172G0672
17980B2137O9191b35942A10097a01084A82871a24778J7262j64936A51915C8870
17969c4237F5723f6209A64628o6524P0713F2196R2242c40882i3114p9802j9976
17958a92892e2619Q179l1511K4083j68009H2542L35186k03027a17550A2610R5561
17947A08171i2481A33022J36036a0282A21815A4442c0345k09350g595j39703A62181
17935A61433b6793m2899B18113D9925b0726j81295d0915j77264i7740M3549A2824
17923e47239h9530k798A95830a63543C5593L8383b31052A83452a35660F3234B2723
17911A02651c10060e5931B4548e5096D7388b80048F5987Q3013n2984J15661c63959
$$ plain form
17899 -117261 -353180 270637 75606 86456 -353021 -325121 120223 196515 67946 167416 -120766
17887 197032 -137078 47805 -141433 -252863 163919 -421595 164734 199161 -138870 -27364
17876 -22020 -195730 -142809 -250556 83044 58109 -215149 172116 -76772 -232685 -219823 -64425
17864 168808 189369 -258315 30906 177949 -142357 -160587 -222187 -44002 -114752 -36341 170723
17852 -148814 -255797 -125576 -278012 -64900 144142 -480264 -100339 -94627 -30868 -25612 105466
17840 454775 -88057 126121 -254689 -58744 -154642 -106866 320206 -317506 19113 41815 31754
17829 31754 97324 -22123 -158408 -33603 52507 102271 -100440 75627 -139851 18962 51328
17818 51328 -303199 -69507 84356 151825 -457054 -10962 -235928 6700 -275653 82088 -202006
$$ packed form
17899a17261k35919B70637G5606J0850c53021K7900A20223P6292F7946R9470a20766
17887A97032a37078D7805a41433j11430A63919d21595A64734L4427a38870b7364
17876b2020j73710N2921j07747H3044k4935b15149A72116g6772j55913J2862f4425
17864A68808K0561b58315C0906J47043a42357j8230o1600d4002p0750c6341A70723
17852a48814j06983a25576j52436f4900A44142d80264a00339N712c0868N256A05466
17840D54775h8057A26121b54689e8744r5898M7776C20206c17506A9113K2702j0061
17829C1754O5570b2123j36285c3603E2507M9764a00440G5627a39851A8962L2366
17818E1328c03199f9507H4356O7469d57054a0962k24966F700b75653H2088b02006
$$ plain form
17806 -151381 -78036 75702 8138 175825 207024 221278 -75547 -90482 121756 127249 -259480
17794 -333919 76122 294324 170483 -130642 -410391 32297 284289 281100 -175059 178389
17783 -79707 -324940 -108953 1463 -105706 -186780 -283121 -82102 67119 -5898 -18376 -102513
17772 -102513 -189000 -98486 -129117 -139115 68080 85162 -56606 -155759 -65187 145654 -217175
17760 -39552 -198545 -24903 90606 -248871 -424351 -31558 -249856 -44547 256597 161055 16172
17748 -198718 -79279 289229 181902 -74386 171599 -205425 187290 33086 5072 34957 197086
17737 197086 -63515 -163864 116821 -169465 -159328 -99394 455256 28828 -165773 43665
17726 -249737 -110282 238238 -104105 -149405 361695 -187796 -73177 149325 241855 281081
$$ packed form
17806a51381P3345G5702H138J67687L1199J4254g5547j4935A21756N493b59480
17794c33919G6122K18202j23841a30642k79749C2297K51992l189a75059A78389
17783g9707k45233a08953A463a05706q1074r6341h2102F7119e898j2478q4137
17772a02513q6487R0514l0631r998F8080J7082e6606r9153f5187A45654b17175
17760c9552j58993b4903I0606b48871j75480c1558k18298d4547B56597r5542A6172
17748a98718g9279B89229j07327g4386A71599b05425A87290C3086E072K9885J62129
17737A97086f3515j00349A16821a69465J0137N9934D55256B8828a65773D3665
17726b49737a10282B38238a04105m5300C61695a87796g3177A49325R2530L9226
$$ plain form
17716 281081 64943 269204 53241 15412 -107390 44862 75297 -247846 37372 274595 27299
17704 -24110 84386 67958 -16702 -8449 332143 -235091 69056 57930 -291198 207499 204450
17693 204450 161925 -12733 -178171 -51381 -132691 -67517 316553 -136974 -98041 318366 -210141
17681 88478 206547 -162153 115252 115599 93053 202358 258256 6254 -45547 -195010 200006
17669 -149147 101541 -107740 216968 -150434 -29863 -62834 286210 64871 207330 208919
17659 208919 144385 33460 124055 -144750 3065 -48431 93213 447877 37568 76986 150067
17648 150067 -171630 -163174 -217777 -166734 73158 227387 -23498 -130769 54752 -207170 180814
17636 34875 231260 220528 170744 -178652 161087 -134746 -361024 -30139 -131774 7866 154056
$$ packed form
17716B81081F4943K04261E3241A5412a07390D4862L0435b47846C7372K37223B7299
17704b4110H4386j6428a6702Q253C32143b35091F9056j1126b91198B07499l049
17693B04450m2525a2733j65438e1381q1310O5174C16553a36974L8933C18366b10141
17681H8478J18069a62153A15252L47k2546J09305N5898F254d5547j49463B00006
17669a49147A01541a07740B16968a50434b9863l2971B86210F4871J42459J589
17659B08919o4534C3460R0595a44750C065d8431I3213L54664C7568L9418P3081
17648A50067a71630Q456n4603N1043G3158J54229b3498j07271E4752b07170A80814
17636C4875J96385j0732m9784a78652A61087a34746k26278c0139j01635G866J46190
$$ plain form
17625 154056 -162147 166748 192945 237908 108496 -54229 -181636 -87459 -93398 -266384 -31689
17613 3143 42147 211780 -314039 139780 150151 -113010 -16852 -37813 -51493 521138 166288
17601 179285 -66698 81016 151305 204051 95151 59893 -173968 87718 -147103 56419 198784
17590 198784 48442 3867 -117682 -39644 -79380 271548 20999 -30741 -150369 13405 61798
17579 61798 -15522 -163022 -60768 -299986 -80703 -257539 150671 -13438 -4208 133100 -120894
17567 299507 273391 -172516 -71349 -69829 -79239 141201 -27931 233382 81922 -55791 70828
17555 158228 219160 88347 -27277 -35339 501137 -182780 -202898 271766 -13581 -36177 233207
17543 45612 -112075 93478 -82135 161724 337603 -137204 76459 -108982 116896 -55190
$$ packed form
17625A54056a62147A66748K6197M4963A08496e4229j27407h7459n939j72986c1689
17613C143L9004J69633c14039A39780J0371a13010a6852k0961j3680E21138A66288
17601A79285f6698H1016P0289N2746I5151l5258a73968H7718a47103E6419J42365
17590A98784D8442C867a17682c9644l9736B71548B0999c0741j19628A3405M8393
17579F1798a5522j47500f0768k39218h0703j76836A50671a3438d208A33100a20894
17567B99507k6116a72516g1349J520r410A41201b7931B33382H1922e5791G0828
17555A58228O0932H8347b7277q062E01137a82780k0118B71766a3581k2596B33207
17543D5612a12075I3478h2135A61724J75879a37204G6459a08982A16896e5190
$$ plain form
17532 20270 79461 30219 240747 -233348 204899 124948 -65227 -25169 -150144 -67679 -24350
17520 -101731 -58093 181870 124409 -14547 180896 285678 140631 192845 96243 171425 216967
17509 216967 7680 130456 -90605 115043 -241722 22181 -92598 -140083 222827 503171 259939
17498 259939 -241086 120797 328381 -118784 6357 -74741 -120299 111243 -125815 130528
17487 17377 -190263 475687 -46651 31882 19547 411957 -243030 -50779 318451 -197866
17476 -8153 159380 369712 -55227 189176 127146 69666 141509 389468 90007 308696 -993
17464 179664 344117 176998 236746 7587 138229 10313 -72106 -13297 308878 219416 268078
17453 268078 -79056 165749 -26874 -273720 204886 219734 -133371 137411 188252 95066
$$ packed form
17532B0270N9191C0219K10528b33348B04899p9951f5227b5169j24975f7679b4350
17520a01731M3638A81870n7461a4547A80896J04782A40631N2214I6243P5182M5542
17509B16967G680J22776i0605A15043b41722B2181i2598m7485B22827K80344k43232
17498B59939b41086A20797K07584a18784F357g4741m5558A11243a25815A30528
17487A7377a90263D75687d6651C1882j2335L92410b43030e0779C18451a97866
17476h153A59380K10332e5227A89176o2030n7480P1843K47959I0007K18689i93
17464A79664J64453j67119N9748G587J30642A0313g2106a3297C08878q9462M8662
17453B68078g9056A65749b6874k46846B04886J4848a33371A37411N0841r3186
$$ plain form
17443 95066 178891 261981 99971 140266 458440 -22047 50817 -95035 90642 212003 -25595
17431 -151276 230138 -45723 256885 129306 284272 79339 319931 265436 -57950 -105166
17421 -105166 -177431 256234 38937 215860 220182 103452 446131 564337 329168 271748
17411 271748 158335 270156 370745 290034 351506 -64389 48643 13075 -43673 149352 409865
17400 409865 -6252 100086 121021 42265 521264 227778 91055 -91402 123195 274948 -111933
17388 345936 -267008 178868 37898 410544 202880 -79024 -98714 91321 -165615 -418 566867
17376 164636 572308 14988 283917 -75570 249706 120987 203576 157340 -28883 101387
17365 -140104 90515 414607 255428 150735 -73537 282605 -420367 23993 113944 -77720
$$ packed form
17443I5066Q3825Q3090I9971M0295L18174b2047E0817i5035I0642J21361b5595
17431a51276B30138d5723B56885j27579J54966G9339K40592n4495e7950m7216
17421a05166p2265B56234C8937J76923M322A03452L42679J18206k35169n7420
17411B71748j13413J11821J00589q0711O1472f4389D8643A3075d3673A49352K60513
17400D09865f252A00086K0935D2265M78999B27778I1055i1402A23195J51753a11933
17388C45936b67008A78868C7898L72646B02880g9024j9690I1321a65615d18E66867
17376A64636M07672A4988K68929g5570B49706A20987Q2589m6236b8883A01387
17365a40104I0515L24092j59179j04693g3537B82605d20367B3993Q9951g7720
$$ plain form
17354 257070 35756 205009 94014 -91362 -23634 124703 526717 183702 112084 383951
17344 383951 532470 461620 -46793 304517 19301 91852 -36732 -189622 439470 312064
17334 312064 168738 320890 -291696 107267 217567 -11341 353217 -3970 114553 153732
17324 153732 105083 95223 321562 -13124 139113 142952 154861 275872 203633 1356 42282
17313 42282 387527 161687 168274 261439 221742 396207 422416 -58384 299659 36599 272585
17302 272585 9791 39821 419225 -31698 -384854 302462 438364 16817 247030 -149681
17291 146224 270998 187073 -168091 -116856 210647 147116 -414339 137048 -27847 197883
17280 118239 194483 55618 74394 247559 332414 -9502 422779 144107 229872 405265 -42851
$$ packed form
17354B57070C5756J69253I4014i1362b3634A24703M02014A83702p1618K71867
17344C83951J48519p0850d6793C04517A9301P2551c6732j52890D39470j27406
17334C12064j43326J52152b91696A07267J10300a1341C53217c970A14553L9179
17324A53732m8649r860K26339a3124A39113L839J1909J21011p2239A356M0926
17313D2282L45245A61687O587R3165l9697J74465K6209e8384B99659C6599K35986
17302B72585I791L0030L79404c1698l53156C02462J35902A6817K30213a49681
17291A46224J24774q3925a68091N1235B10647o3531d14339A37048b7847A97883
17280A18239P6244E5618J8776J73165Q4855i502D22779A44107Q5765J75393d2851
$$ plain form
17268 43499 14639 86835 308619 69796 38909 39000 299169 214983 329712 108370 120647
17257 120647 260471 394417 -253507 -148090 551345 -17214 313211 129378 407050 112977
17246 67410 -21922 323872 273658 408576 127922 109999 -28797 185515 267197 170840 -111748
17234 -246712 143525 166434 133433 47744 670068 106269 389462 573178 126619 300895
17224 300895 42531 213371 26506 -63932 215031 431473 -127779 548392 496199 184442
17213 15258 420748 331969 308699 308700 287387 143415 367799 -36103 335473 229943 233529 176499
17201 176499 186969 106519 187537 251831 171193 167804 346182 146841 72403 269831 267747
17190 267747 128645 437132 255374 -72910 232265 442465 333548 370203 42732 518485
$$ packed form
17268D3499A4639P2196K21784F9796l0887R1K60169q4186J14729A08370J2277
17257A20647J39824J33946b53507J05417E51345a7214C13211A29378K77672A12977
17246F7410b1922C23872n0214J34918A27922j7923b8797A85515Q1682r6357a11748
17234b46712A43525K2909l3001D7744O22324A06269K83193J83716A26619J74276
17224C00895D2531J70840B6506f3932B15031K16442a27779E48392n2193A84442
17213A5258M05490q8779k3270Jk1313A43415K24384c6103C35473j05530L586n7030
17201A76499J0470q0450Q1018O4294q0638l389J78378A46841G2403J97428k084
17190B67747A28645L08487j81758g2910B32265K10200j08917L6655D2732M75753
$$ plain form
17180 518485 323299 139471 334892 29731 334785 -86738 307599 285560 51488 407312
17170 407312 337222 189530 384900 391364 231185 413645 353226 355527 124469 263673 21212
17158 190712 446963 316634 306924 111295 21119 262507 328182 178161 226444 427873
17148 427873 79646 97168 222179 299702 127413 26558 433015 488399 218987 -67832 86865
17136 302883 291449 -117507 218419 452409 318636 353188 425998 544546 92659 360320
17126 360320 247537 447196 452749 255031 344760 464386 313253 300074 31922 71905 428253
17115 428253 261436 425382 137898 140462 140105 644728 255338 265008 177860 314804 530403
17104 530403 543283 460173 682818 33758 306220 477516 383716 382102 289365 237096 228395
$$ packed form
17180E18485j95186A39471J95421B9731L05054h6738C07599k2039E1488L55824
17170D07312p0090j47692J95370O464j60179J82460o0419K301A24469J39204B1212
17158A90712K56251j30329r710A11295B1119K41388O5675j50021M8283K01429
17148D27873G9646J7522J25011P7523A27413B6558M06457N5384B18987f7832H6865
17136C02883j1434a17507B18419K33990j33773L4552P2810J18548I2659K67661
17126C60320j12783J99659N553j97718Q9729J19626j51133j3179C1922L9983L56348
17115D28253j66817J63946A37898K564l57N04623B55338R670q7148J36944K15599
17104E30403J2880q3110K22645C3758K72462J71296r3800j614r2737n2269q701
$$ plain form
17093 228395 278628 427659 472698 288055 305861 223080 151752 525631 327052 137218
17082 447085 428906 312456 602774 509870 731182 468085 533584 73854 340953 531767
17072 531767 522195 462359 484311 567103 340637 353137 -37802 330155 590251 861507 504074
17061 504074 348734 379676 211901 411951 310257 582627 415300 193452 627433 401704
17051 401704 633417 575834 335798 447033 818154 474036 201269 564439 396645 615755
17041 615755 487485 325649 381516 495338 447593 405781 507927 431541 505466 726249
17031 726249 279899 763386 828466 938412 513271 433295 265912 488080 727386 704478
17021 704478 690119 696493 696708 613199 544310 455776 504295 471303 614551 561538 260222 500111
$$ packed form
17093B28395N0233J49031M5039j84643J7806q2781p1328L73879j98579A37218
17082D47085j8179j16450K90318r2904K21312k63097O5499G3854K67099J90814
17072E31767r572n9836K1952Q2792k26466J2500c7802C30155K60096K71256l57433
17061E04074j55340L0942j67775K00050j01694K72370j67327A93452M33981k25729
17051D01704K31713n7583k40036J11235L71121l44118B01269L63170j67794K19110
17041F15755j28270j61836N5867J13822m7745m1812J02146p6386P3925K20783
17031G26249B79899M83487O5080J09946m25141p9976j67383K22168K39306k2908
17021G04478j4359O374K15q3509o8889q8534M8519l2992J43248n3013B60222K39889
$$ plain form
17009 500111 467279 972617 656085 698629 509041 692396 772586 628873 661351 498810
16999 498810 607096 466828 689240 268305 887876 390894 679787 1057482 759530 468721
16989 468721 711747 769477 593729 909460 686452 895840 757442 603105 836383 703537
16979 703537 755338 959524 1156345 907646 624753 1005969 741695 904860 627106 1025314
16969 1025314 944118 565868 633329 998329 808296 1001178 873779 726906 833578 914342
16959 914342 365441 891624 810793 671965 1119982 1224574 1200242 1109990 1054632 825743
16949 825743 987038 988878 886494 1206099 1128130 1004545 844626 1438094 1142211 698611
16939 698611 1141092 1202147 924544 1117688 985507 1145616 1018689 972387 956471 1319993
$$ packed form
17009E00111l2832N05338l16532M2544j89588J83355Q0190j43713L2478j62541
16999D98810J08286j40268K22412B68305O19571C90894K88893L77695k97952k90809
16989D68721K43026N7730j75748L15731k23008K09388j38398j54337K33278j32846
16979G03537N1801K04186J96821k48699k82893L81216k64274J63165k77754L98208
16969A025314q1196l78250O7461L65000j90033J92882j27399j46873J06672Q0764
16959I14342C65441N26183q0831j38828M48017J04592k4332r0252n5358k28889
16949H25743J61295J840j02384L19605p7969j23585j59919N93468k95883m43600
16939F98611M42481O1055k77603J93144j32181J60109j26927m6302j5916L63522
$$ plain form
16929 1319993 1135882 1183773 1117375 989039 1277034 1247721 1096006 1025285 1095754 1048571
16919 1048571 879592 1322986 1477045 1088452 1506708 1277215 1563682 1257283 1541229
16910 1541229 1296073 1181628 1298492 1266401 1609950 1609861 1424210 1281568 1425627 1161636
16900 1161636 1218667 1566022 1120175 1429225 1450151 1605744 1716939 1337810 1668337 1985275
16890 1985275 1675338 1361068 1560046 1753550 1671648 1495475 1437808 1765750 1623311 1596162
16880 1596162 1571640 1684233 1966118 1443613 1555780 2104798 2066239 1933179 2152667 1829298
16870 1829298 1441995 1975363 1692380 2070990 1827125 1698518 1947026 1795962 2039791
16861 2039791 2068590 2183015 2134557 1928382 2306929 1768305 2368724 2206554 2204187 2561840
$$ packed form
16929A319993j84111M7891o6398j28336K87995k9313j51715p0721P0469m7183
16919A048571j68979M43394J54059l88593M18256k29493K86467l06399K83946
16910A541229k45156j14445J16864l2091L43549q9j85651j42642J44059k63991
16900A161636N7031L47355m45847L09050K0926J55593J11195l79129L30527L16938
16890A985275l09937l14270J98978J93504q1902j76173n7667L27942j42439k7149
16880A596162k4522J12593K81885n22505J12167N49018l8559j33060K19488l23369
16870A829298l87303N33368k82983L78610k43865j28607K48508j51064K43829
16861B039791K8799J14425m8458k06175L78547n38624O00419j62170k367L57653
$$ plain form
16851 2561840 2310248 2536075 2533991 2602177 2374858 2667242 2138005 2057618 2621600 2326565
16841 2326565 2830742 2903385 2606236 2893869 2743945 3006313 3132524 3209415 2793081 2585610
16831 2585610 3118051 3016386 3259088 2970386 3177084 3012923 3188365 3085593 3484139
16822 3484139 3460984 3339493 3682203 3655648 3651856 3840019 3884925 3487638 4012885 3900719
16812 3900719 4172304 3964090 4218986 4032890 4390216 4339533 4376706 4314165 4456395 4957671
16802 4957671 4709771 4845438 4739825 4686999 4978113 5062397 5347716 5389174 5398360 5459154
16792 5459154 5590949 5691920 5884792 5821253 6070628 6261537 6296479 6291539 6820934 6510348
16782 6510348 6377384 6909968 7034717 7103032 7250208 7284045 7638065 7371859 7826487 7759067
$$ packed form
16851B561840k51592K25827k084O8186k27319K92384n29237q0387N63982k95035
16841B326565N04177P2643k97149K87633j49924K62368J26211P6891m16334k07471
16831B585610N32441j01665K42702k88702K06698j64161J75442j02772L98546
16822C484139k3155j21491L42710k6555l792J88163M4906l97287N25247j12166
16812C900719K71585k08214K54896j86096L57326n0683L7173o2541J42230N01276
16802D957671k47900J35667j05613n2826K91114Q4284K85319M1458R186O0794
16792E459154J31795J00971J92872o3539K49375J90909L4942m940N29395l10586
16782F510348j32964N32584J24749O8315J47176L3837L54020k66206M54628o7420
$$ plain form
16772 7759067 8270219 8454324 8583191 8648593 8906751 9073146 9477169 9592534 9982370 10117768
16762 10117768 10603729 10472875 10945639 10902458 11239248 11763007 12336588 12093477 12304657
16753 12304657 12814644 13236790 13477034 14012260 14682933 14769901 15014555 15629528 15927299
16744 15927299 16529995 17004626 17793831 18313432 18955924 19421837 20178507 20853856 21505204
16735 21505204 22467716 23031157 23810480 24943397 25821775 26280326 27296127 28490265 29427335
16726 29427335 30639556 31994672 33492914 34914484 36117024 37684712 39302735 40835056
16718 40835056 42590272 44365835 46306072 48584549 50829001 53068451 55024038 57872753
16710 57872753 60406210 62817751 66285926 68838429 72188549 74986833 77971242 81157225
$$ packed form
16772G759067N11152J84105J28867O5402K58158J66395M04023J15365L89836J35398
16762A0117768M85961j30854M72764m3181L36790N23759N73581k43111K11180
16753A2304657N09987M22146K40244N35226O70673Q6968K44654O14973K97771
16744A5927299O02696M74631P89205N19601O42492M65913P56670O75349O51348
16735B1505204R62512N63441P79323J132917Q78378M58551J015801J194138R37070
16726B9427335J212221J355116J498242J421570J202540J567688J618023J532321
16718D0835056J755216J775563J940237K278477K244452K239450J955587K848715
16710E7872753K533457K411541L468175K552503L350120K798284K984409L185983
$$ plain form
16702 81157225 84240884 87561003 90329705 93328655 96068794 98863052 100934570 103241558
16694 103241558 104955791 106182947 107593421 108355032 108892219 108892026 108643527 108562131 107152290
16685 107152290 106036012 105025477 104002180 102415124 100394701 98682137 97058813 94916331
16677 94916331 93020724 91128354 89333515 86894705 85043076 83086936 81416940 79543519
16669 79543519 77725969 76006743 74094037 72425181 70697858 69110682 67586915 65997113
16661 65997113 64516692 62892869 61492864 60290303 58844116 57605685 56256228 54998899
16653 54998899 53708960 52172260 50948213 50103927 48833792 48261218 46864331 45812910
16645 45812910 44638517 43624054 43035727 41950128 40819099 40306244 39296353 38552139
$$ packed form
16702H1157225L083659L320119K768702K998950K740139K794258K071518K306988
16694A03241558J714233J227156J410474P61611N37187j93k48499q1396j409841
16685A07152290j116278j010535j023297j587056k020423j712564j623324k142482
16677I4916331j895607j892370j794839k438810j851629j956140j669996j873421
16669G9543519j817550j719226j912706j668856j727323j587176j523767j589802
16661F5997113j480421j623823j400005j202561j446187j238431j349457j257329
16653E4998899j289939j536700j224047q44286j270135n72574j396887j051421
16645D5812910j174393j014463n88327j085599j131029n12855j009891p44214
$$ plain form
16637 38552139 37405353 36601617 35821415 35356994 34640222 33621071 32804541 32104560 32092115
16628 32092115 30996581 30489709 29766038 29207374 28464616 27798149 27258984 26757468 25889914
16619 25889914 25455633 25220030 24730439 23786621 23648077 23175995 22746251 22307320 21848920
16610 21848920 21306807 21012243 20756116 20201781 19951464 19252525 18795131 18805613 18209160
16601 18209160 18491267 17697148 17761203 17104891 17007248 16587734 16544178 16154677 15809295 15347410
16591 15347410 15343854 14656103 14697410 14878819 14557204 14150947 13800950 13889741 13610283 13348343
16581 13348343 13132215 12959791 12731748 12658977 12646881 12057660 12095293 12205444 11775927 11732299
16571 11732299 11620626 11449414 10993799 11120675 11142543 10765276 10597217 10928433 10748942
$$ packed form
16637C8552139j146786q03736p80202m64421p16772j019151q16530o99981j2445
16628C2092115j095534n06872p23671n58664p42758o66467n39165n01516q67554
16619B5889914m34281k35603m89591r43818j38544m72082m29744m38931m58400
16610B1848920n42113k94564k56127n54335k50317o98939m57394J0482n96453
16601A8209160K82107p94119O4055o56312r7643m19514m3556l89501l45382m61885
16591A5347410l556o87751M1307J81409l21615m06257l49997Q8791k79458k61940
16581A3348343k16128j72424k28043p2771j2096n89221L7633J10151m29517m3628
16571A1732299j11673j71212m55615J26876K1868l77267j68059L31216j79491
$$ plain form
16562 10748942 10568297 10443518 10429044 9916039 10182539 9908723 9959848 9999179 9421959 9598269
16552 9598269 9144909 9346101 9121174 9116301 8998499 9060423 8818921 8710180 8677710 8513697
16542 8513697 8370041 8621363 8267077 7873656 8639059 7939779 7642682 8115327 8037490 7893395
16532 7893395 7738924 7747807 7626483 7361239 7261586 7479182 7358756 7109056 6759797 6987956
16522 6987956 7159112 7239727 6610513 7080223 6613540 6773968 6869871 6775091 6484699 6597287
16512 6597287 6596347 7002001 6409882 6083800 6587631 6513185 6231709 5990111 6156775 5681770
16502 5681770 6254218 6096679 5733232 5874724 5526331 5984391 5580812 5716854 6031450
16493 6031450 5636779 5754062 5592934 5417521 5405886 5419390 5298053 5284212 5560757 4905686
$$ packed form
16562A0748942j80645j24779j4474n13005K66500k73816N1125L9331n77220J76310
16552I598269m53360K01192k24927m873j17802O1924k41502j08741l2470j64013
16542H513697j43656K51322l54286l93421P65403o99280k97097M72645p7837j44095
16532G893395j54471Q883j21324k65244r9653K17596j20426k49700l49259K28159
16522F987956J71156Q0615o29214M69710m66683J60428R5903r4780k90392J12588
16512F597287r40M05654n92119l26082N03831p4446k81476k41598J66664m75005
16502E681770N72448j57539l63447J41492l48393M58060m03579J36042L14596
16493F031450l94671J17283j61128j75413j1635J3504j21337j3841K76545o55071
$$ plain form
16483 4905686 5506876 5290674 4983331 5120000 5151035 5177279 5245876 4740759 4969402 4829669
16473 4829669 5062104 4598547 4844143 4744591 4838063 4596767 4780719 4721554 4459711 4762206
16463 4762206 4381532 4611377 4379248 4393512 4409633 4390468 4594613 3900879 4047643 4450946
16453 4450946 4090844 4436505 3938993 3854635 4289206 3978700 4101117 4062407 4128353 3795438
16443 3795438 4506293 3984618 3792356 3799240 3660003 3815670 3934928 3839340 3613876 3888245
16433 3888245 3883737 3625809 3547602 3787597 3797438 3814723 3392041 3767150 3362808 3428376 3310344
16422 3310344 3260829 3664336 3582331 3286417 3234300 3177115 3514925 3220993 2999621 3173736
16412 3173736 3069824 3402591 3482303 3136540 3031917 3152957 3249225 3210870 2917639 3088359
$$ packed form
16483D905686O01190k16202l07343J36669L1035K6244O8597n05117K28643j39733
16473D829669K32435m63557K45596r9552R3472k41296J83952n9165k61843L02495
16463D762206l80674K29845k32129J4264J6121j9165K04145o93734J46764M03303
16453D450946l60102L45661m97512q4358M34571l10506J22417l8710O5946l32915
16443C795438P10855n21675j92262O884j39237J55667J19258r5588k25464K74369
16433C888245m508k57928p8207K39995R841J7285m22682L75109m04342O5568j18032
16422C310344m9515M03507q2005k95914n2117n7185L37810k93932k21372J74115
16412C173736j03912L32767P9712l45763j04623J21040R6268l8355k93231J70720
$$ plain form
16402 3088359 3110620 2882423 3063858 3163554 3100708 2828991 2806057 2814363 2985203 2813905
16392 2813905 2597860 3017107 2966311 2718151 3163151 2880014 2860855 2845715 2707376 2936556
16382 2936556 2698769 2942942 2508588 3002914 2542308 2708169 2751568 2903362 2702068 2480427
16372 2480427 2560774 2542162 2540806 2452126 2919628 2301320 2338430 2406541 2486933 2404758 2494927
16361 2494927 2429547 2437639 2097311 2452129 2305605 2458021 2557751 2314656 2298876 2255851
16351 2255851 2265451 2189653 2065516 2220025 2170905 2365908 2474354 2230356 2315085 2506601
16341 2506601 1762888 2471860 2299682 1940947 2418150 1887547 2109939 1936606 1825968
16332 1825968 2138326 2230562 1800374 2085900 1999572 2351549 2173497 1923235 1959668 1857701
$$ packed form
16402C088359K2261k28197J81435R9696o2846k71717k2934Q306J70840j71298
16392B813905k16045M19247n0796k48160M45000k83137j9159j5140j38339K29180
16382B936556k37787K44173m34354M94326m60606J65861M3399J51794k01294k21641
16372B480427Q0347j8612j356q8680M67502o18308L7110O8111Q0392q2175R0169
16361B494927o5380Q092l40328L54818j46524J52416R9730k43095j5780m3025
16351B255851R600p5798j24137J54509m9120J95003J08446k43998Q4729J91516
16341B506601p43713P08972j72178l58735M77203n30603K22392j73333j10638
16332A825968L12358R2236m30188K85526q6328L51977j78052k50262L6433j01967
$$ plain form
16322 1857701 2274923 1913225 2022857 1960978 1804288 1798947 1906688 1710002 2184665 1936019
16312 1936019 1993556 1829329 2024421 1688507 1824196 1817706 2048147 2118348 1848106 1794633
16302 1794633 1912377 1671336 1769201 1445863 1513543 2051733 2009081 1643166 1675477 1834850
16292 1834850 1826254 1684350 1518801 1606383 1909983 1969855 1678276 1544953 1570300 1598950
16282 1598950 1734887 1818986 1346283 1808456 1515541 1630466 1212306 1666897 1488077 1603745
16272 1603745 1609929 1511591 1672445 1690793 1610946 1398080 1460598 1661925 1717971 1427622 1412396
16261 1412396 1577960 1137287 1562683 1606465 1224606 1360687 1371271 1702264 1466276 1359366
16251 1359366 1258931 1503197 1399346 1346729 1439412 1154459 1364964 1608362 1334934 1644263
$$ packed form
16322A857701M17222l61698J09632o1879j56690n341J07741j96686M74663k48646
16312A936019N7537j64227J95092l35914J35689o490K30441P0201k70242n3473
16302A794633J17744k41041R7865l23338O7680N38190m2652l65915L2311J59373
16292A834850q596j41904j65549Q7582L03600N9872k91579j33323K5347K8650
16282A598950J35937Q4099m72703M62173k92915J14925m18160M54591j78820J15668
16272A603745O184r8338J60854J8348p9847k12866O2518K01327N6046k90349j5226
16261A412396J65564m40673M25396M3782l81859J36081J0584L30993k35988j06910
16251A359366j00435K44266j03851n2617R2683k84953K10505K43398k73428L09329
$$ plain form
16241 1644263 1592958 1335563 1278362 1134594 1323368 1268944 1383758 1176734 1494194 1126825
16231 1126825 1409982 1481743 1433932 1186955 1202253 1178556 1082480 1405205 876374 1245476
16221 1245476 1343417 1030837 1098168 999207 1096367 1156331 1033241 1280050 1392260 1166767
16211 1166767 1359419 756795 1458708 1076934 859947 1183972 803835 1320948 1659463
16202 1659463 1102640 1027789 923811 1596163 1075863 1304505 1073774 1250247 1094309 1057488
16192 1057488 1094238 1265247 1245021 1027376 1090631 1148480 1048517 988466 1174448 1295815
16182 1295815 912104 1129677 980572 1002239 739008 1035974 985131 854229 1022105 850083
16172 850083 1018199 1108382 1294863 1131721 1207787 972483 864542 1076381 1103265 997691
$$ packed form
16241A644263n1305k57395n7201j43768J88774n4424J14814k07024L17460l67369
16231A126825K83157P1761m7811k46977J5298k3697r6076L22725n28831L69102
16221A245476R7941l12580O7331r8961R7160N9964j23090K46809J12210k25493
16211A166767J92652o02624P01913l81774k16987L24025l80137N17113L38515
16202A659463n56823p4851j03978O72352n20300K28642k30731J76473j55938l6821
16192A057488L6750J71009k0226k17645O3255N7849r9963o0051J85982J21367
16182A295815l83711K17573j49105K1667k63231K96966n0843j30902J67876j72022
16172H50083J68116R0183J86481j63142P6066k35304j07941K11839K6884j05574
$$ plain form
16162 997691 918007 1079773 723377 972711 1005478 970732 1098323 781341 1103886 999409
16152 999409 662438 1085478 652824 805064 896027 877955 971054 1225246 904047 773827
16142 773827 952457 878371 699821 971387 1146926 769924 942121 850037 677195 457009
16132 457009 875343 693012 983528 585019 660456 1026717 795292 703732 935586 768099
16122 768099 1000240 997448 984066 702182 799190 464061 586611 874081 1020761 553390
16112 553390 730109 632494 613658 796611 844259 1114416 635998 520356 796133 953799
16102 953799 327923 695876 852816 1029694 493312 510496 697027 932360 711469 844871
16092 844871 734230 582733 788656 660310 952798 909704 906961 530135 701738 574948
$$ packed form
16162I97691p9684J61766l56396K49334L2767l4746J27591l16982L22545j04477
16152I99409l36971M23040m32654J52240R0963j8072R3099K54192l21199j30220
16142G73827J78630p4086j78550K71566J75539l77002J72197r2084j72842k20186
16132D57009M18334j82331K90516l98509P5437L66261k31425r1560K31854j67487
16122G68099K32141k792j3382k81884R7008l35129J22550K87470J46680m67371
16112E53390J76719r7615j8836J82953M7648K70157m78418j15642K75777J57666
16102I53799C27923L67953J56940J76878D93312J7184J86531K35333k20891J33402
16092H44871j10641j51497K05923j28346K92488m3094k743l76826J71603j26790
$$ plain form
16082 574948 508973 854599 589113 575451 880750 954693 822877 537454 604506 884662
16072 884662 559969 526155 536288 606626 626028 497800 850042 319223 483547 592807
16062 592807 362265 412923 436316 684958 814581 670640 474196 351033 653247 882247
16052 882247 486634 680714 454739 436637 478058 579324 454190 340974 505385 758861
16042 758861 534846 532362 259738 786779 283779 816307 656196 482769 254614 673663
16032 673663 491692 594987 79782 529865 304868 536067 896521 569972 396503 80482
16021 382725 472885 629869 565953 705530 273828 442500 441045 823167 491955 585192
16011 585192 509858 590875 412603 359967 554871 532409 345627 467652 482012 509420 527311
$$ packed form
16082E74948o5975L45626k65486j3662L05299P3943j31816k85423O7052K80156
16072H84662l24693l3814J0133P0338J9402j28228L52242C19223J64324J09260
16062E92807k30542N0658K3393K48642J29623j43941j96444j23163L02214K29000
16052H82247l95613J94080k25975j8102M1421J01266j25134j13216J64411K53476
16042G58861k24015k484B59738N27041B83779N32528j60111j73427k28155M19049
16032F73663j81971J03295G9782M50083k24997K31199L60454l26549j73469H0482
16021C82725R0160J56984o3916J39577B73828J68672j455L82122l31212R3237
16011E85192p5334Q1017j78272n2636J94904k2462j86782J22025J4360K7408J7891
$$ plain form
16000 527311 427291 322662 399037 363940 383362 448579 545783 444882 510559 392581 355747
15989 355747 544677 307064 311359 643362 471774 278096 446350 42966 315205 206112
15979 206112 11831 363934 457949 375987 487581 551566 408287 367293 574445 42286 677605
15968 677605 564996 337953 372025 352000 352294 372878 311390 332381 169517 735104 311247
15956 546528 437642 813361 706493 520221 469531 386108 203317 621221 267760 264422
15946 264422 237991 381940 -123518 550789 321250 545933 380444 638620 82158 313094
15936 313094 352476 219371 171355 541566 618611 353819 666635 46127 295548 374786
15926 374786 239094 553380 287757 471043 375786 281566 148134 349836 363503 287189
$$ packed form
16000E27311j00020j04629P6375l5097J9422O5217R7204j00901O5677j17978l6834
15989C55747J88930k37613M295L32003j71588j93678J68254D2966K72239j09093
15979B06112A1831L52103R4015q1962J11594O3985j43279m0994K07152D2286O35319
15968F77605j12609k27043L4072k0025K94K0584o1488K0991j62864N65587C11247
15956E46528j08886L75719j06868j86272n0690q3423j82791M17904B67760l338
15946B64422k6431J43949a23518E50789k29539K24683j65489K58176H2158K30936
15936C13094L9382j33105m8016L70211P7045k64792L12816D6127K49421P9238
15926C74786j35692L14286k65623J83286r5257r4220j33432K01702J3667p6314
$$ plain form
15916 287189 376061 444594 478240 540819 293164 93786 185572 257535 343982 447174 459382
15905 459382 221426 629873 282113 531634 512063 364943 571476 107546 4641 400882
15895 400882 375975 65269 181569 -120392 129204 222032 582898 61109 -22805 331962
15884 440193 447218 333513 65422 331966 395500 378952 -38097 268118 213024 337087 255036
15873 255036 272453 22062 -29862 -2946 -68545 229358 401075 280008 504631 209193 562890
15862 562890 291166 139953 281988 180305 350539 272863 31090 338224 160883 160720
15852 160720 63209 106306 570924 49773 423351 111279 386570 346448 81309 131763 377797
15841 377797 90437 513491 332389 -200433 135713 127585 318764 188423 530148 -127295
$$ packed form
15916B87189Q8872O8533L3646O2579k47655I3786R1786P1963Q6447J03192J2208
15905D59382B21426M08447B82113K49521j9571j47120K06533A07546D641L96241
15895D00882k4907F5269J16300a20392A29204R2828L60866F1109b2805C31962
15884D40193P025j13705F5422K66544O3534j6548c8097B68118n5094J24063q2051
15873B55036J7417B2062b9862b946o5599B29358J71717j21067K24623B09193L53697
15862E62890k71724A39953J42035j01683J70234p7676C1090L07134A60883j63
15852A60720F3209M3097M64618D9773L73578A11279K75291m0122H1309N0454K46034
15841C77797I0437M23054j81102b00433A35713q128J91179j30341L41725a27295
$$ plain form
15830 -62961 426429 -29667 339257 281649 429678 540497 91353 293989 -89298 321237
15819 86412 404688 125253 76399 234285 285942 263283 282806 268601 245036 -312844 128345
15807 342834 68159 190243 134174 226167 103426 328523 99700 40616 -11851 188697 66667
15795 316277 520636 35699 -125638 -41863 150342 284111 -21772 -68023 -98593 -49761 311380
15783 1932 133614 308275 -3884 -49902 211573 -9267 24096 82739 152867 318999 413298
15772 413298 84600 -71988 325960 6882 8181 359870 -295916 328013 -6156 372408 174720
15760 276915 41812 -3980 35331 151655 61979 1057 144747 -343357 -103459 82356 222120
15749 222120 24685 230602 192988 408433 -3408 184789 414310 339379 416755 7051 198188
$$ packed form
15830f2961D26429b9667C39257n7608J48029J10819I1353K02636h9298C21237
15819H6412L18276A25253m8854J57886N1657k2659J9523j4205k3565c12844A28345
15807C42834F8159J22084n6069R1993A03426K25097I9700D0616a1851A88697F6667
15795C16277K04359C5699a25638d1863A50342J33769b1772m6251l0570M8832C11380
15783A932J31682J74661c884m6018B11573i267B4096N8643P0128J66132R4299
15772D13298H4600g1988C25960F882J299L51689b95916C28013f156C72408A74720
15760B76915D1812c980C5331J16324F1979A057J43690c43357a03459H2356J39764
15749B22120B4685K05917l7614K15445c408A84789K29521p4931P7376G051J91137
$$ plain form
15738 198188 80642 -7777 -173492 292240 234346 283214 229839 29923 100758 134855 430061
15727 430061 144871 409318 -58445 -13830 187027 -156343 -159422 584080 141971 311475
15717 311475 356585 -49797 -43773 473278 232573 -198782 306126 -149334 174245 72037
15706 232120 167485 46505 134297 146395 -49676 134270 114661 46301 535231 190541 208357
15695 208357 -146062 349277 206147 59210 132778 307805 -52339 378748 167740 395989
15685 395989 129621 246675 -298831 -64655 -291112 -121286 154218 -281752 75465 230697
15675 230697 25677 223616 20200 -56810 -342178 -153365 -194236 146475 252290 60633
15664 97979 -119400 89618 -159532 -110278 302188 78153 194618 162889 -190897 211720
$$ packed form
15738A98188H0642g777j65715B92240n7894M8868n3375B9923P0835L4097K95206
15727D30061A44871K64447e8445a3830A87027a56343l079E84080A41971J69504
15717C11475M5110d9797O024D73278B32573a98782C06126a49334A74245G2037
15706B32120o4635D6505Q7792J2098d9676A34270j9609D6301M88930A90541J7816
15695B08357a46062C49277j43130E9210P3568J75027e2339C78748A67740K28249
15685C95989A29621J17054b98831f4655k26457a21286A54218b81752G5465J55232
15675B30697B5677J97939B0200e6810k85368a53365m0871A46475J05815F0633
15664I7979a19400H9618a59532M9254C02188G8153J16465l1729a90897B11720
$$ plain form
15653 143484 346303 500427 95508 4613 230693 -278203 6930 -162729 -149691 133185 115376
15642 115376 266060 -25738 -156376 -35483 216345 -160428 -403697 164205 150042 -28108
15631 206410 104353 399974 175643 327953 208763 278042 210277 118007 -196503 276395
15620 -187044 -265240 -49071 -3788 306586 163011 69466 55094 66043 315601 108545 -45508
15608 252069 3347 -233040 53529 115540 -98345 -86468 39556 401370 70343 -241813 -66159
15596 197683 -14708 48887 219806 131289 168001 -190189 -5562 58915 -279086 -9760 238847
15584 129455 225821 220142 -174638 188430 1667 173492 340861 5320 -242680 517535 -196561
15572 -143073 -17970 30614 -27437 72978 178592 103327 96936 2291 300549 2943 -106733
$$ packed form
15653A43484K02819J54124I5508D613K26080b78203F930a62729J3038A33185j7809
15642A15376J50684b5738j30638c5483B16345a60428k43269A64205j4163b8108
15631B06410j02057K95621A75643J52310j19190O9279o7765r2270a96503B76395
15620a87044p8196d9071c788C06586j43575F9466j4372J0949K49558A08545d5508
15608B52069C347b33040E3529O2011i8345J1877C9556L61814G0343b41813f6159
15596A97683a4708D8887J70919q8517L6712a90189e562E8915b79086i760B38847
15584A29455R6366n679a74638A88430A667J71825J67369E320b42680E17535a96561
15572a43073a7970C0614b7437G2978J05614p5265o391B291K98258B943a06733
$$ plain form
15560 -68958 215608 1156 34323 81505 209726 235356 240038 -138361 182554 286828 227198
15549 227198 546116 209025 91551 34538 -345780 195429 -244180 -202556 22966 -172658
15538 4038 376870 -239331 75041 106626 -125668 -65970 165721 250127 -53685 417014 181680
15526 71032 35820 216597 255806 -206477 -211375 -45779 53965 9914 173199 84319 -14033
15514 27610 -157565 -155520 101603 82250 -34513 9473 -182166 135034 -139732 249743 -32072
15502 34964 -188793 13253 -209304 28471 -391639 212936 -165015 -8922 28057 -110403 115562
15490 -290774 60278 222742 244660 -67402 -54137 135514 50507 158297 -202053 88191 19110
15478 265016 143368 66645 -161476 196938 55097 274009 95523 3575 161609 74520 -262895
$$ packed form
15560f8958B15608A156L3167M7182J28221K5630M682a38361A82554J04274n9630
15549B27198L18918B09025I1551C4538c45780A95429b44180M1624B2966a72658
15538D038L72832b39331G5041L1585a25668N9698A65721Q4406e3685D17014A81680
15526G1032l5212J80777L9209b06477m898d5779E3965I914J63285H4319a4033
15514B7610a57565K045A01603j9353c4513I473a82166A35034a39732B49743c2072
15502C4964a88793A3253b09304B8471c91639B12936a65015h922B8057a10403A15562
15490b90774F0278J62464K1918f7402J3265A35514E0507J07790b02053H8191A9110
15478B65016j21648F6645a61476A96938E5097K18912I5523C575J58034G4520b62895
$$ plain form
15466 -290379 109710 182002 -261758 -83747 309549 38127 97915 -49920 191001 348056
15456 348056 128527 140336 202658 48734 192505 -143560 -37972 281865 108366 -83817
15445 -40850 373610 49404 -127459 34959 -217691 399559 122743 219011 -106430 91813
15434 204594 -182651 26353 126150 125548 243031 76914 632838 -4868 108602 191498 -198364
15422 428610 115331 -166209 -30660 -375761 212011 125379 -31671 -38702 -93103 -29250 220967
15410 -57909 -10482 -68209 115319 -7118 95411 104601 -116799 -10498 218434 -96099 -223534
15399 -223534 160822 -3658 -39894 360012 32330 92057 -106322 185980 -43572 174283 37994
15387 -11324 -152188 164179 34250 180905 -229887 115375 56961 181019 -93596 -59574
$$ packed form
15466b90379A09710P2292b61758h3747C09549C8127N9788d9920A91001J57055
15456C48056A28527J1809O2322D8734J43771a43560c7972B81865A08366h3817
15445d0850C73610D9404a27459C4959b17691C99559A22743R6268a06430I1813
15434B04594a82651B6353R9797o02J17483G6914N55924d868A08602Q2896a98364
15422D28610A15331a66209c0660l45101B12011q6632c1671p031n4401b9250B20967
15410e7909a0482n7727A15319g118I5411R190a16799a0498B18434i6099j27435
15399b23534A60822c658l6236C60012C2330N9727a06322A85980d3572A74283C7994
15387a1324j40864A64179C4250J46655b29887A15375E6961J24058i3596L4022
$$ plain form
15377 -59574 -22351 -28025 85501 -44470 47570 58488 210010 -37473 6143 102260 77119 326744
15365 326744 70492 16162 155990 415949 -74716 176551 154165 149518 -1296 -91570 158973
15353 -127960 -70324 27845 -8246 -72583 307882 236324 19036 246403 -128689 327059 72455
15341 19892 39157 174517 -262768 110491 46234 -38124 59097 129024 -220050 -81922 105161
15329 -31635 242844 228041 100488 215625 -209542 -14714 -130757 7074 241344 141849 -13866
15317 -92749 -26954 265264 126744 -86234 136394 -126583 10514 187382 41905 72846 311291
15306 311291 -96877 169916 -62658 96709 261429 53743 14901 133485 -221061 254482
15295 238164 35319 -21367 -121344 176633 92257 396491 221530 186033 -92994 147972 -84036
$$ packed form
15377e9574b2351n674H5501d4470D7570J0918J51522c7473F143R6117k5141K49625
15365C26744G0492A6162J39828K59959g4716A76551k2386m647a296r0274A58973
15353a27960N7636B7845h246o4337C07882p1558A9036K27367a28689C27059G2455
15341A9892J9265J35360b62768A10491D6234c8124E9097O9927b20050h1922A05161
15329c1635B42844j4803A00488J15137b09542a4714j16043G074K34270r9495a3866
15317i2749b6954B65264A26744h6234A36394a26583A0514J76868D1905L0941K38445
15306C11291i6877A69916f2658I6709J64720E3743A4901J18584b21061B54482
15295B38164C5319b1367r9977A76633q4376L04234j74961l5497i2994A47972h4036
$$ plain form
15283 -231761 -246451 -76080 162451 -105314 62053 240300 -215849 127344 -78248 -163390
15273 -163390 -74062 54045 -140393 88822 335028 365867 135369 -83096 100573 -159058
15262 251567 -43795 -69069 214306 221518 -58181 -113608 175438 41451 -50122 209449 -14404
15250 297272 7400 -151952 87633 -299100 -48361 76449 -227698 -30318 18892 43087 -109472
15238 178817 -107884 -247997 -202236 93157 49966 216826 -349015 -212789 -56072 -86822
15228 -86822 -231557 -55471 211829 25121 274772 262743 538718 575986 684327 319931
15217 266783 269441 316231 153664 174198 36569 169928 -203494 76783 309569 108357 332762
15206 332762 -43256 -58477 206969 12565 165697 387099 55696 241160 158012 170132 282431
$$ packed form
15283b31761j4690g6080A62451a05314F2053J78247b15849A27344g8248q5142
15273a63390g4062E4045a40393H8822K46206L0839A35369h3096A00573a59058
15262B51567d3795k5274B14306P212e8181n5427A75438D1451e0122B09449a4404
15250B97272G400a51952H7633b99100d8361G6449b27698c0318A8892K4195a09472
15238A78817a07884j40113M5761I3157m3191J66860c49015J36226e6072l0750
15228h6822j44735e5471B11829B5121K49651j2029K75975L7268J08341C19931
15217B66783K658M6790A53664K0534C6569J33359b03494G6783K32786A08357K24405
15206C32762d3256j5221B06969A2565J53132K21402E5696J85464q3148J2120J12299
$$ plain form
15195 282431 117589 -3636 195768 282316 -64764 120430 558737 98044 156705 -23843 338203
15183 285772 58035 116375 290504 377784 338084 139273 259298 27277 93121 -33730 228998
15171 74779 311427 30187 -22583 105714 192526 58942 -15996 88503 -22050 44355 387938
15160 387938 377447 201699 -45113 193478 -85507 87872 -195732 57168 -250164 73521 -106138
15148 51872 62799 35937 75160 24872 48363 156333 169318 80000 -298758 -160800 -15130
15136 255658 343187 222087 -78845 -83400 193876 166178 13975 917 91741 291324 335546
15125 335546 -145723 55531 404647 240575 -159756 146863 2615 245204 31057 265804
15115 265804 -154580 -54860 13475 219711 -118456 -131195 254596 -60259 101376 -41557
$$ packed form
15195B82431A17589c636A95768Q6548f4764A20430M38307I8044N8661b3843C38203
15183B85772E8035N8340J74129Q7280l9700A39273J20025B7277O5844c3730B28998
15171G4779K36648C0187b2583A05714Q6812E8942a5996H8503b2050D4355L43583
15160C87938j0491j75748d5113A93478h5507H7872a95732E7168b50164G3521a06138
15148E1872J0927k6862L9223B4872K3491J07970J2985H0000b98758J37958a5130
15136B55658Q7529j21100g8845m555A93876k7698A3975I17R0824J99583M4222
15125C35546a45723E5531L49116j64072a59756A46863B615K42589C1057K34747
15115B65804a54580e4860A3475K06236a18456j2739B54596f0259A01376d1557
$$ plain form
15104 219878 350505 185173 247201 214783 -38446 407525 291536 182043 -355243 124331
15093 -252778 -32160 461377 -185803 -57545 315088 181375 -34429 630922 118711 -168197
15082 -27710 347200 293922 479572 -178139 148747 13446 58284 56832 230426 -58526 148434
15070 -45647 38110 89664 367585 163512 -150285 72142 122681 332255 39829 -6114 354364
15058 270702 236161 200295 -38500 265286 295058 232015 125759 300179 191389 84444 216569
15047 216569 26115 245949 236102 113688 75783 561172 207876 14609 321436 187796
15037 187796 22716 24683 334972 367571 238374 51663 -21133 339985 30453 453802 -187602
15025 -22452 192932 55310 87630 272069 358289 -132726 429999 -39302 231622 19156 -36634
$$ packed form
15104B19878J30627j65332O2028l2418c8446D07525j15989j09493c55243A24331
15093b52778c2160D61377a85803e7545C15088j33713c4429F30922A18711a68197
15082b7710C47200n3278J85650a78139A48747A3446M4838j452J73594e8526A48434
15070d5647C8110N1554K77921A63512a50285G2142N0539K09574C9829f114C54364
15058B70702l4541l5866c8500B65286K9772o3043j06256J74420j08790H4444J32125
15047B16569B6115K19834r847A13688l7905M85389B07876A4609L06827j33640
15037A87796B2716J967L10289L2599j29197E1663b1133C39985C0453M23349a87602
15025b2452A92932E5310L2320J84439Q6220a32726D29999c9302B31622A9156c6634
$$ plain form
15013 14836 203284 115693 200466 208759 -15297 -32504 274724 218 -72185 192693 158640 -121802
15000 193684 -169903 -106754 -166486 -104896 142315 -8105 45040 319732 305814 181467 -127496
14988 212049 -138181 440627 523548 71312 369421 634873 19295 42309 145729 35370
14977 133738 118374 137154 241204 511022 164321 67150 -73826 366115 249250 295575
14967 295575 -36974 118039 -12523 433025 -256804 47975 165578 308002 157527 221585
14957 221585 -56027 392055 270773 348801 300595 374504 -66980 270543 9403 150919 64359
14945 33385 85986 -207596 315327 157571 458087 -87960 364807 356829 308600 -152428 69814
14933 321274 443594 227146 160311 456894 176391 174893 358069 231665 2107 320240
$$ packed form
15013A4836J88448q7591Q4773Q293a5297j7207B74724B18g2185A92693l4053a21802
15000A93684a69903O3149n9732O1590A42315h105D5040K74692j3918j24347a27496
14988B12049a38181D40627Q2921G1312K98109K65452A9295K3014J03420C5370
14977A33738j5364J8780J04050K69818A64321F7150g3826C66115j16865M6325
14967B95575c6974A18039a2523D33025b56804D7975J17603J42424j50475O4058
14957B21585e6027C92055j21282P8028m8206P3909f6980B70543I403J41516F4359
14945C3385N2601b07596C15327A57571L00516h7960C64807p978m8229a52428F9814
14933C21274J22320k16448o6835K96583A76391j498J83176j26404B107L18133
$$ plain form
14923 320240 112164 -44126 259823 311887 119048 204484 56932 343527 122141 494548
14913 494548 267582 407454 336230 223887 395671 244052 171066 310521 404528 250559
14903 250559 515804 322670 177832 78950 189328 315715 -25431 284747 213765 600422
14893 600422 165885 204229 233696 408395 229755 360086 169444 84769 324529 159252
14882 311075 361799 95904 390515 189206 708799 152608 311834 59323 123773 248878
14872 248878 472686 662027 426749 255586 79856 202548 231154 371626 397169 352700
14862 352700 542171 363096 364491 199389 488024 41977 293641 381860 284367 517354
14852 517354 370039 473552 338227 156693 435052 112633 237984 460811 417768 5163
$$ packed form
14923C20240A12164d4126B59823N2064A19048Q5436E6932K86595A22141L72407
14913D94548k26966J39872p1224j12343J71784j51619p2986J39455R4007j53969
14903B50559K65245j93134j44838G8950J10378J26387b5431B84747p0982L86657
14893F00422A65885L8344K9467J74699j78640J30331A69444q4675K39760A59252
14882C11075N0724I5904K94611A89206N19593A52608J59226E9323O4450J25105
14872B48878K23808J89341k35278j71163G9856J22692K8606J40472K5543m4469
14862C52700J89471j79075J395j65102K88635D1977K51664Q8219r7493K32987
14852E17354j47315J03513j35325A56693K78359A12633J25351K22827m3043E163
$$ plain form
14841 148720 412951 181332 325630 470245 302157 108274 271473 358957 179065 259720
14831 259720 438008 343611 480878 334426 345220 305743 513125 391770 394470 377828 391051
14820 391051 434376 153211 162907 477781 344607 443521 268167 342122 669616 164598
14809 503456 418790 555047 37286 565937 238227 266165 523076 442687 498931 27184 622529
14798 622529 460021 544055 431352 317779 671641 572426 421083 176019 541857 53378
14787 364363 887098 408553 485591 76112 498143 204690 462153 304119 494571 470757
14777 470757 469179 388490 349039 506902 189419 532370 516098 934923 52436 674313 575327
14766 575327 696414 602050 843698 510067 712336 350897 360105 363236 520697 532145 349891
$$ packed form
14841A48720K64231A81332J44298J44615j68088A08274J63199Q7484A79065Q0655
14831B59720J78288r4397J37267j46452J0794l9477K07382j21355K700j6642J3223
14820C91051M3325A53211R696L14874j33174R8914j75354P3955L27494A64598
14809E03456q4666J36257C7286N28651B38227K7938K56911q0389N6244B7184N95345
14798F22529j62508Q4034j12703j13573L53862r9215j51343A76019L65838E3378
14787C64363N22735D08553P7038G6112M22031B04690K57463j58034J90452k3814
14777D70757j578q0689l9451J57863A89419L42951j6272M18825E2436O21877r8986
14766E75327J21087r4364K41648l33631K02269C50897R208L131J57461J1448j82254
$$ plain form
14755 349891 190720 561733 487517 320581 842427 233653 365986 411210 621898 630580
14745 630580 212921 688618 449543 626598 603425 829564 472829 424834 769141 628570
14735 628570 763739 394056 303367 748921 496098 477856 333167 446068 367229 750109
14725 750109 704006 471835 684537 331246 346359 466566 627074 648706 828634 686468
14715 686468 612720 409061 257966 669439 673430 806252 365607 581446 617872 239150
14704 488655 835374 615024 474186 634701 584317 845662 653007 617620 678369 610220
14694 610220 418120 846343 875607 600772 807227 798822 705710 583908 735760 789512
14684 789512 605730 687161 576497 892048 423063 753119 663413 684541 721521 612913
$$ packed form
14755C49891j59171L71013p4216j66936N21846B33653J32333M5224K10688Q682
14745F30580B12921M75697k39075J77055k3173K26139l56735m7995L44307j40571
14735F28570J35169l69683r0689M45554k52823j8242j44689J12901p8839L82880
14725G50109m6103k32171K12702C31246J5113J20207J60508K1632J79928j42166
14715F86468p3748k03659j51095M11473L991J32822C65607K15839L6426B39150
14704D88655L46719k20350j40838J60515n0384K61345j92655l5387O0749o8149
14694F10220j92100M28223K9264k74835K06455q405r3112j21802J51852N3752
14684G89512j83782Q1431j10664L15551D23063L30056q9706K1128L6980j08608
$$ plain form
14674 612913 626847 72678 986853 765716 522272 1068080 492943 649276 961374 624215
14664 624215 1001114 972485 809301 837522 722970 735081 855705 755609 530528 871138
14654 871138 754058 675796 669420 907703 475265 972075 810235 497956 767646 751552
14644 751552 964189 900367 992581 915908 855078 409879 999531 868385 1177642 1072463
14634 1072463 855242 949841 734688 1211876 847214 1181919 1156239 905728 1022096 1182772
14624 1182772 812841 1121536 844862 915890 1114156 758304 1097048 1242918 1291238 786762
14614 786762 766873 935376 1410003 771171 813888 1022347 1211697 1258477 1107529 1019514
14604 1019514 1029788 1030241 1246349 1408579 1357898 862646 1669548 1269376 1040053 1098800
$$ packed form
14674F12913J3934G2678R14175k21137k43444N45808D92943J56333L12098l37159
14664F24215L76899k8629j63184K8221j14552J2111J20624j00096k25081L40610
14654H71138j17080p8262o376K38283m32438M96810j61840l12279K69690j6094
14644G51552K12637o3822R2214p6673o0830D09879N89652j31146L09257j05179
14634A072463k17221R4599k15153M77188l64662L34705k5680k50511J16368J60676
14624A182772l69931L08695k76674P1028J98266l55852L38744J45870M8320n04476
14614G86762j9889J68503M74627o38832M2717K08459J89350M6780j50948q8015
14604A019514J0274M53K16108J62230n0681m95252Q06902m00172k29323N8747
$$ plain form
14594 1098800 1316432 1343482 1173876 1365221 1677404 1180864 1365127 1193129 1709346 1342653
14584 1342653 1232050 1418945 1232040 1709549 1234086 1440679 1514360 1876574 1736584 1272798
14574 1272798 1419703 1549098 1416775 1341100 1517987 1394118 1623586 1578376 1616943 1217597
14564 1217597 1603586 1353531 1223524 1651431 1495585 1399553 1461700 1525208 1494574 1355094
14554 1355094 1333317 1503414 1812533 1883668 1784387 1927135 1821976 1854993 1925676 1314391
14544 1314391 1667236 2270078 1880181 1711874 1939912 2169051 1818910 1709515 2049127
14535 2049127 2370998 1800257 2202484 2230695 1969235 2118314 2219298 2430005 2426082 3060539
14525 3060539 2902585 3249810 4035417 6174501 9687997 15435003 15859382 12262159 9887237
$$ packed form
14594A098800K17632K7050j69606J91345L12183m96540J84263j71998N16217l66693
14584A342653j10603J86895j86905M77509m75463K06593P3681L62214j39990m63786
14574A272798J46905J29395j32323p5675J76887j23869K29468m5210L8567l99346
14564A217597L85989k50055j30007M27907j55846r6032O2147O3508l0634j39480
14554A355094k1777J70097L09119P1135r9281J42748j05159L3017P0683o11285
14544A314391L52845O02842l89897j68307K28038K29139l50141j09395L39612
14535B049127L21871n70741M02227K8211k61460J49079J00984K10707l923O34457
14525C060539j57954L47225P85607K139084L513496N747006M24379l597223k374922
$$ plain form
14516 9887237 8599285 6649294 6105565 5113422 4710622 4659335 4495911 4439593 3937543
14507 3937543 3659808 3736341 3904445 4093989 3700772 3637279 3336787 3608385 3633759 3439548
14497 3439548 3477853 3537804 3425808 3575824 3452840 3114606 3471235 3532623 3061734 3308087
14487 3308087 3258341 3082295 3045570 3551804 3257204 3045738 3098830 2612518 3106244 2964132
14477 2964132 3267928 3265341 3226452 2921201 3426393 3218147 3018293 2918644 3205769 3078108
14467 3078108 2813679 2854792 3264942 3036048 3004818 3527123 3022982 2984987 3161014 3118119
14457 3118119 3265023 3046114 3223864 3820133 3439013 3528101 3706233 3531506 3661942 3568506
14447 3568506 3446162 3736657 3493304 3553962 3512340 3691307 3792944 3472671 3691689 4023877
$$ packed form
14516I887237j287952j949991n43729r92143m02800n1287j63424n6318n02050
14507C937543k77735P6533J68104J89544l93217o3493l00492K71598K5374j94211
14497C439548L8305N9951j11996J50016j22984l38234L56629O1388m70889K46353
14487C308087m9746j76046l6725N06234k94600k11466N3092m86312M93726j42112
14477B964132L03796k587l8889l05251N05192k08246j99854r9649K87125j27661
14467C078108k64429M1113M10150k28894l1230N22305n04141l7995J76027m2895
14457C118119J46904k18909J77750N96269l81120Q9088J78132j74727J30436r3436
14447C568506j22344K90495k43353O0658m1622J78967J01637l20273K19018L32188
$$ plain form
14437 4023877 4165596 3555103 3812361 4072248 4299127 4226390 4217693 3847697 3796763 4068688
14427 4068688 4486965 4386608 4673961 4518182 4374697 4454510 4492010 4714738 4549931 4731718
14417 4731718 4912388 4465080 4712620 4479094 4754089 4690708 4895073 5125230 4784590 5187630
14407 5187630 4951253 5155569 5099487 5277731 5345848 5477778 5340733 5652882 5511550 5407682
14397 5407682 5613630 5839106 5879988 5877528 6487833 5735810 6461394 6579189 6467632 6386364
14387 6386364 6139788 6657112 6718726 6691894 6593347 6713885 7190663 6912197 7272166 7066690
14377 7066690 7542868 7443462 7450817 7421947 7561146 7958938 8028547 8333927 8206941 8782292
14367 8782292 8521312 8639747 8991446 9221336 9244477 9141653 9970376 9978397 9798158 9875615
$$ packed form
14437D023877J41719o10493K57258K59887K26879p2737q697l69996n0934K71925
14427D068688M18277j00357K87353j55779j43485P9813L7500K22728j64807J81787
14417D731718J80670m47308K47540k33526K74995o3381K04365K30157l40640M03040
14407E187630k36377K04316n6082J78244O8117J31930j37045L12149j41332j03868
14397E407682K05948K25476M0882k460O10305p52023P25584J17795j11557q1268
14387F386364k46576N17324O1614k6832r8547J20538M76778k78466L59969k05476
14377G066690M76178r9406P355k8870J39199L97792O9609L05380j26986N75351
14367H782292k60980J18435L51699K29890K3141j02824Q28723Q021j80239P7457
$$ plain form
14357 9875615 10280477 10352251 10572054 10560509 10502368 11275087 11427904 11575231 11933872 11548393
14347 11548393 12003375 12408890 12420043 12879142 13017197 13226848 13355249 13977079 13947505 14191293
14337 14191293 14876331 14924476 14834401 15285700 15358425 15902281 16480587 16292475 17232311 17605055
14327 17605055 17485983 17943645 18494687 18949446 19406467 19427758 19868992 20504271 20845986
14318 20845986 21806837 22074945 22412894 22897610 23664261 24060519 24498977 25247724 26211294
14309 26211294 26922692 27521565 28531591 29059995 29704755 30054815 31103763 32508205 33206017
14300 33206017 34137695 35381159 36340617 37435624 38379738 39636085 40603612 42442282 43743869
14291 43743869 45561428 46837224 48681892 50164897 52052526 54035144 56247181 58082710
$$ packed form
14357I875615M04862P1774K19803j1545n8141P72719J52817J47327L58641l85479
14347A1548393M54982M05515J1153M59099J38055K09651J28401O21830k9574K43788
14337A4191293O85038M8145r0075M51299P2725N43856N78306j88112R39836L72744
14327A7605055j19072M57662N51042M54759M57021K1291M41234O35279L41715
14318B0845986R60851K68108L37949M84716P66651L96258M38458P48747R63570
14309B6211294P11398N98873J010026N28404O44760L50060J048948J404442O97812
14300C3206017R31678J243464R59458J095007R44114J256347R67527J838670J301587
14291D3743869J817559J275796J844668J483005J887629J982618K212037J835529
$$ plain form
14283 58082710 60576968 63006478 65746919 68619033 71318167 74635358 77673171 81675996
14275 81675996 85236423 89301131 93569944 98690054 103426530 108664657 114413857 120627764
14267 120627764 127107492 134435757 142430824 150619053 159479918 169429963 179928966 191629041
14259 191629041 204535370 217732913 232302961 248695517 266059489 284848907 304673180
14252 304673180 326148843 348946046 372392559 395942747 418610503 437774090 445408362
14245 445408362 444173632 441470752 432519563 389216289 374590362 362834748 346777970
14238 346777970 330396506 315097675 301026761 288710094 278026993 269163975 260437009
14231 260437009 251997375 244122694 236723238 230043158 223743936 218327787 212685661 207768043
$$ packed form
14283E8082710K494258K429510K740441K872114K699134L317191L037813M002825
14275H1675996L560427M064708M268813N120110M736476N238127N749200O213907
14267A20627764O479728P328265P995067Q188229Q860865R950045J0499003J1700075
14259A91629041J2906329J3197543J4570048J6392556J7363972J8789418J9824273
14252C04673180K1475663K2797203K3446513K3550188K2667756J9163587P634272
14245D45408362j234730k702880q951189m3303274j4625927j1755614j6056778
14238C46777970j6381464j5298831j4070914j2316667j0683101q863018q726966
14231B60437009q439634p874681p399456o680080o299222n416149n642126m917618
$$ plain form
14223 207768043 202587146 197982941 193434848 189418256 185257622 181422657 177983868 174569691
14215 174569691 171073506 167884565 164252320 160628436 157442139 153301061 149680367 146307568
14207 146307568 143123238 140259364 137818181 134637209 132314849 129632000 127054930 124359630
14199 124359630 122462150 119949417 117461693 114830348 112502979 110444237 108869614 106713836
14191 106713836 104331527 102033873 99909642 98184780 96380514 94290446 92118177 90310980
14183 90310980 88139421 86281041 84292572 82566752 80818454 78816300 77031160 75582040
14175 75582040 74104214 72405128 70521835 69256526 67778129 66033532 64821312 63061378
14167 63061378 61738786 59931112 58597707 57050924 55941681 54496649 53558249 52754934
$$ packed form
14223B07768043n180897m604205m548093m016592m160634l834965l438789l414177
14215A74569691l496185l188941l632245l623884l186297m141078l620694l372799
14207A46307568l184330k863874k441183l180972k322360k682849k577070k695300
14199A24359630j897480k512733k487724k631345k327369k058742j574623k155778
14191A06713836k382309k297654k124231j724862j804266k090068k172269j807197
14183I0310980k171559j858380j988469j725820j748298k002154j785140j449120
14175G5582040j477826j699086j883293j265309j478397j744597j212220j759934
14167F3061378j322592j807674j333405j546783j109243j445032r38400q03315
$$ plain form
14159 52754934 51287794 49955756 49280915 48269930 47241267 46084134 45389935 45043914
14151 45043914 43890763 43338928 42244709 41329140 40640728 40103751 39407464 38961172 38187767
14142 38187767 37739302 37118716 36656525 35895799 35712964 35184848 34842185 34396273 33962488
14133 33962488 33478874 32808460 32687649 31964353 31682449 31055442 30884210 30711373 30441245
14124 30441245 29739427 29217900 28782005 28953237 28953310 28239388 27934239 27584727 27716320 27454538
14114 27454538 26950610 26304572 26151120 25779635 25723847 25118415 25168523 24549321 24560444 24328380
14104 24328380 24536102 24266220 23866800 23478983 23277340 23074642 22852020 22813128 22231055
14095 22231055 22465479 21982280 21620878 21765860 21577673 21319783 21147169 20885623 20882054 20705536
$$ packed form
14159E2754934j467140j332038o74841j010985j028663j157133o94199l46021
14151D5043914j153151n51835j094219r15569o88412n36977o96287m46292p73405
14142C8187767m48465o20586m62191p60726j82835n28116l42663m45912m33785
14133C3962488m83614o70414j20811p23296k81904o27007j71232j72837k70128
14124C0441245p01818n21527m35895J71232P3p13922l05149l49512J31593k61782
14114B7454538n03928o46038j53452l71485n5788o05432N0108o19202J1123k32064
14104B4328380K07722k69882l99420l87817k01643k02698k22622l8892n82073
14095B2231055K34424m83199l61402J44982j88187k57890j72614k61546l569j76518
$$ plain form
14085 20705536 20217841 19871530 20223399 19690607 19641958 19309741 18951355 19200098 18387152
14076 18387152 18571546 18588243 18268702 18114443 17942761 17835183 17974676 17905226 17535881 17143692
14066 17143692 17274087 16835836 16800219 16698892 16497215 16746358 16319782 16515747 16149637
14057 16149637 15894377 16083228 15797267 15705363 15327789 15478604 15213360 15115680 15142934 15040331
14047 15040331 14927251 14688675 14328755 14795656 14427035 14490115 14372079 14159213 14172725 13878558
14037 13878558 13588605 13941051 13576819 13869229 13522877 13497047 13516164 13249606 13204237 12969352
14027 12969352 13144910 12778167 12955793 12573793 12624785 12625810 12522427 12189227 12261224 12068448
14017 12068448 12065138 12104509 12074296 11926196 11644265 11592306 11495169 11358582 11353692 11351545 11576036
$$ packed form
14085B0705536m87695l46311L51869n32792m8649l32217l58386K48743q12946
14076A8387152J84394J6697l19541j54259j71682j07578J39493o9450l69345l92189
14066A7143692J30395m38251l5617j01327k01677K49143m26576J95965l66110
14057A6149637k55260J88851k85961r1904l77574J50815k65244r7680K7254j02603
14047A5040331j13080k38576l59920M66901l68621O3080j18036k12866J3512k94167
14037A3878558k89953L52446l64232K92410l46352k5830J9117k66558m5369k34885
14027A2969352J75558l66743J77626l82000N0992J025j03383l33200P1997j92776
14017A2068448l310L9371l0213j48100k81931n1959r7137j36587m890k147K24491
$$ plain form
14006 11576036 11214366 11141881 11194715 11251408 10978172 10863884 11238138 10923912 11054746 10955555
13996 10955555 10556150 10774714 10662724 10350280 10204198 10270505 10219952 9871498 10094355 10265999
13986 10265999 10153919 9831234 9911662 9779450 9778506 9705642 9520189 9463159 9444233 9593165
13976 9593165 9359789 9463933 8864056 9242944 9244769 8959201 8868511 8862095 8675526 8506613
13966 8506613 8915995 8763390 8773242 9025249 9931744 12994282 18387958 21043783 18575855
13957 18575855 16474235 15172609 13718744 12828603 12171726 11814751 11278728 10956256 10790363
13948 10790363 10545938 10510713 9695985 9779928 9877330 9708764 9361553 9497360 9444324 9230686
13938 9230686 9245231 8863572 8803185 8975091 8745090 8709854 8845408 8289467 8529493 8419304
$$ packed form
14006A1576036l61670p2485N2834N6693k73236j14288L74254l14226J30834r9191
13996A0955555l99405K18564j11990l12444j46082O6307n0553l48454K22857J71644
13986A0265999j12080l22685Q0428j32212r44p2864j85453n7030j8926J48932
13976I593165k33376J04144n99877L78888J825k85568r0690o416j86569j68913
13966H506613M09382j52605R852K52007R06495L062538N393676K655825k467928
13957A8575855k101620j301626j453865q90141o56877l56975n36023l22472j65893
13948A0790363k44425l5225q14728Q3943R7402j68566l47211J35807n3036k13638
13938I230686J4545l81659o0387J71906k30001l5236J35554n55941K40026j10189
$$ plain form
13928 8419304 8097245 7812207 8054460 7934542 7912946 7821740 7872749 7844612 7562590 7645724
13918 7645724 7660196 7532245 7560720 7007856 7227463 7282886 7326947 7141472 7450673 6918812
13908 6918812 6943561 7337627 7047089 6997155 6806034 6917237 6900622 7058159 6754216 6633330
13898 6633330 6874922 6451944 6524878 6688642 6368628 6556711 6512242 6016323 6502474 6361499
13888 6361499 6351661 6071473 6449357 6187653 6390501 5921188 6212716 5825491 6089090 5851569
13878 5851569 5770140 5862603 5901188 5683851 6196436 5885346 5818647 5515439 5556020 5612128
13868 5612128 5654352 5800459 5469871 5560828 5307946 5337621 5218374 5341281 5537670 5269058
13858 5269058 5253692 5466542 5226470 5404784 4873175 5124642 5190571 5149750 5177685 5157045
$$ packed form
13928H419304l22059k85038K42253j19918k1596r1206N1009k8137k82022Q3134
13918G645724J4472j27951K8475n52864K19607N5423M4061j85475L09201n31861
13908F918812K4749L94066k90538m9934j91121J11203j6615J57537l03943j20886
13898F633330K41592m22978P2934J63764l20014J88083m4469m95919M86151j40975
13888F361499r838k80188L77884k61704K02848m69313K91528l87225K63599k37521
13878E851569q1429R2463L8585k17337N12585l11090o6699l03208M0581N6108
13868E612128M2224J46107l30588R0957k52882K9675j19247J22907J96389k68612
13858E269058j5366K12850k40072J78314n31609K51467O5929m0821K7935k0640
$$ plain form
13848 5157045 5100752 5104328 5027549 5114400 5149471 4805803 4860100 4989509 5190214 4748541 4744096
13837 4744096 4745948 4732574 4392505 4523145 4575272 4818952 4385627 4463745 4529150 4498415 4869021
13826 4869021 4737161 4760987 4365001 4648475 4459738 4645810 4459173 4433971 4352352 4519760
13816 4519760 4374476 4478828 4333958 4258589 4270789 4136143 4206036 4289122 4246978 4165271
13806 4165271 4258440 3688702 4239094 4068738 4204564 3887958 3940762 4060827 4024428 4244765
13796 4244765 3856282 3923198 4032720 4064059 3810774 3705645 3979761 3814261 3676595 4100485
13786 4100485 3835282 3748322 3669271 4012594 4118399 3796090 3751577 3511453 3604311 3661493
13776 3661493 3807006 3950561 3882028 3605810 3570576 3756748 3451574 3865016 3382796 3337271
$$ packed form
13848E157045n6293L576p6779Q6851L5071l43668N4297J29409K00705m41673m445
13837D744096J852j3374l40069J30640N2127K43680m33325P8118O5405l0735L70606
13826D869021j31860K3826l95986K83474j88737J86072j86637k5202q1619J67408
13816D519760j45284J04352j44870p5369J2200j34646O9893Q3086m2144q1707
13806D165271R3169n69738N50392j70356J35826l16606N2804J20065l6399K20337
13796D244765l88483O6916J09522L1339k53285j05129K74116j65500j37666M23890
13786D100485k65203q6960p9051L43323J05805l22309m4513k40124R2858N7182
13776C661493J45513J43555o8533k76218l5234J86172l05174M13442m82220m5525
$$ plain form
13766 3337271 3435197 3335315 3511025 3719076 3211712 3275677 3037349 3377688 3224945 3502965
13756 3502965 3565947 3356745 3722457 3466394 3407994 3178012 3211977 3186286 3144457 3250037
13746 3250037 3162218 3465355 3154865 3173435 3342382 3286749 3294954 3111233 2948450 3105387
13736 3105387 3261064 3201267 3055619 3027919 3115698 2928195 2960541 3193102 2935084 2939030
13726 2939030 3155921 2757761 3020728 2788143 2674012 3017385 2873973 2856524 3016063 2853392
13716 2853392 2988553 2792777 2670195 3161431 3000932 2982070 2841007 2688098 3151866 2632468
13706 2632468 2703782 2711820 2870688 3083610 2784900 2809785 2730333 2748232 2761944 2763642 2255822
13695 2255822 2462624 2448692 2642752 2212539 2500424 2491331 2516215 2464041 2660407 2783508
$$ packed form
13766C337271R7926r9882J75710K08051n07364O3965k38328L40339j52743K78020
13756C502965O2982k09202L65712k56063n8400k29982L3965k5691m1829J05580
13746C250037q7819L03137l10490J8570J68947n5633Q205j83721j62783J56937
13736C105387J55677n9797j45648k7700Q7779j87503L2346K32561k58018L946
13726B939030K16891l98160K62967k32585j14131L43373j43412j7449J59539j62671
13716B853392J35161j95776j22582M91236j60499j8862j41063j52909M63768n19398
13706B632468P1314Q038J58868K12922k98710K4885p9452J7899J3712J698n07820
13695B255822K06802j3932J94060m30213K87885r093K4884n2174J96366J23101
$$ plain form
13685 2783508 2531883 2769517 2793083 2517733 2202436 2443075 2392359 2320255 2314739 2491631
13675 2491631 2468064 2225498 2087692 2233953 2606422 2418927 2288273 2631337 2248260 2339969
13665 2339969 2596394 2204977 2328632 2221209 2144885 1960191 2313761 2055878 2113910 2250676
13655 2250676 2024257 2338184 2148709 2157486 2583459 2135174 2182829 2190451 2294590 2326884
13645 2326884 2411021 2232714 2203798 2056302 2237246 2253291 2004071 2069300 2057752 2181936
13635 2181936 1925990 1690482 2020031 2166370 2178907 1909172 2261730 2120773 2111548 1939747
13625 1939747 1859084 2175346 1872672 1927996 1939291 2034083 1874605 2370389 1684684 2065278
13615 2065278 1933245 1852744 2297525 1823415 1870114 1820714 1685864 1731565 1863009 1822746
$$ packed form
13685B783508k51625K37634K3566k75350l15297K40639n0716p2104n516J76892
13675B491631k3567k42566j37806J46261L72469j87495j30654L43064l83077R1709
13665B339969K56425l91417J23655j07423p6324j84694L53570k57883N8032J36766
13655B250676k26419L13927j89475Q777M25973m48285M7655P622J04139L2294
13645B326884Q4137j78307k8916j47496J80944J6045k49220O5229j1548J24184
13635B181936k55946k35508L29549J46339J2537k69735L52558j40957r225j71801
13625A939747q0663L16262l02674N5324J1295R4792j59478M95784o85705L80594
13615B065278j32033q0501M44781m74110M6699m9400j34850M5701J31444m0263
$$ plain form
13605 1822746 1650592 2239813 1731324 1390161 1758061 2002259 1661345 1822263 2057665
13596 2057665 1674320 2110461 1880465 1768049 1769704 1832830 1660886 1683873 1853159 1851160
13586 1851160 1418059 1934588 1536931 1761816 1680803 1514799 2145471 1720472 1457422 1488679
13576 1488679 1378242 1379494 1670564 1745535 1524534 1788984 1601097 1594394 1549605 1793427
13566 1793427 1665266 1629202 1766011 1602612 1834621 1486891 1412828 1419471 1532358 1366594
13556 1366594 1714528 1580616 1348253 1562643 1366153 1408044 1345043 1583313 1558594 1556847
13546 1556847 1040131 1497688 1908194 1304582 1056989 1476502 1469330 1172077 1083206 1501907
13536 1501907 1275485 1459305 1451248 1455106 1178748 1711348 1629799 1314459 1367613 1608371
$$ packed form
13605A822746j72154N89221n08489l41163L67900K44198l40914J60918K35402
13596B057665l83345M36141k29996j12416J655O3126j71944K2987J69286j999
13586A851160m33101N16529l97657K24885q1013j66004O30672m24999k63050L1257
13576A488679j10437J252K91070P4971k21001K64450j87887o703m4789K43822
13566A793427j28161l6064J36809j63399K32009l47730p4063O643J12887j65764
13556A366594L47934j33912k32363K14390j96490M1891o3001K38270k4719j747
13546A556847n16716M57557M10506o03612k47593M19513p172k97253q8871M18701
13536A501907k26422J83820q057L858k76358N32600q1549l15340N3154K40758
$$ plain form
13526 1608371 1183964 1453093 1368657 1363604 1184192 1404383 1100405 1743029 1220883 1116509
13516 1116509 1403373 1455856 1457181 1588822 1171088 1288455 1190569 1287023 1140346 1189749
13506 1189749 1296852 1154235 1401812 1518586 1228194 1185216 1436054 1355622 1077992 1265772
13496 1265772 860593 1326082 1340785 1077209 1252812 1074011 1166950 952770 1432623 936006
13486 936006 1306816 1058278 1024179 1326588 1151746 823751 1355542 1094419 945918 878021
13476 878021 1084198 1022073 1056472 1145709 771890 1102150 1226260 830352 1344217 1412756
13466 1412756 940405 709551 1172492 917340 1331254 975880 1131052 1240667 1190121 965824
13456 965824 1207956 1115486 1038964 1105890 1202760 1037704 943147 1395783 869002 1003629
$$ packed form
13526A608371m24407K69129q4436n053j79412K20191l03978O42624n22146j04374
13516A116509K86864N2483J325J31641m17734J17367r7886R6454j46677M9403
13506A189749J07103j42617K47577J16774k90392m2978K50838q0432k77630J87780
13496A265772m05179M65489J4703k63576J75603j78801R2939k14180M79853m96617
13486I36006L70810k48538l4099L02409j74842l27995N31791k61123j48501o7897
13476H78021K06177o2125L4399Q9237l73819L30260J24110l95908N13865O8539
13466A412756m72351k30854M62941k55152M13914l55374J55172J09615n0546k24297
13456I65824K42132r2470p6522O6926R6870j65056r4557M52636n26781J34627
$$ plain form
13446 1003629 964855 1014860 966969 846016 894079 566952 1313705 1139841 1176655 1026001
13436 1026001 1059389 1063378 806284 1027435 909688 967646 847325 866327 892000 763155
13426 763155 1005322 812708 979301 1139467 834365 732432 937722 909020 932428 944545
13416 944545 1011936 1102010 939539 793667 1022194 885342 357010 712941 1055610 919764
13406 919764 774718 862963 722153 617892 752963 1132064 451125 1007125 870720 933498
13396 933498 622487 747828 788081 1104255 1013655 648564 620652 868210 780506 779730 755565
13385 755565 789227 574832 845006 1045371 372546 553980 701436 1064478 641180 443683
13375 443683 767033 597664 819323 289670 718922 778394 694460 742022 953827 770934
$$ packed form
13446A003629l8774N0005m7891j20953M8063l27127P46753j73864L6814j50654
13436A026001L3388L989k57094K21151j17747N7958j20321J9002K5673j28845
13426G63155K42167j92614J66593J60166l05102j01933K05290k8702K3408J2117
13416I44545O7391R0074j62471j45872K28527j36852C57010L55931L42669j35846
13406I19764j45046Q8245j40810j04261J35071L79101D51125N56000j36405O2778
13396I33498l11011J25341M0253L16174r0600l65091k7912K47558q7704p76k4165
13385G55565L3662k14395K70174K00365C72546J81434J47456L63042m23298j97497
13375D43683L23350j69369K21659B89670M29252N9472q3934M7562K11805j82893
$$ plain form
13365 770934 990275 881310 751632 574794 828473 994628 813635 578145 765522 875593
13355 875593 577301 586480 604982 557531 770429 540256 971240 524328 679962 838658
13345 838658 534957 560014 795254 1038053 566596 962555 663872 914353 588745 539572
13335 539572 807289 893937 601947 245564 442643 466117 541310 773133 811146 889805
13325 889805 602848 712060 821971 764831 929656 649222 799275 547790 829343 558558
13315 558558 731767 673479 605784 898681 841989 769915 828179 529505 629100 624582 459582
13304 459582 438394 489647 384082 596029 896480 576916 443021 797414 471998 650551
13294 650551 571256 469721 759648 700676 444947 558969 594439 648192 723584 662655 565670
$$ packed form
13365G70934K19341j08965j29678j76838K53679J66155j80993k35490J87377J10071
13355H75593k98292R179J8502m7451K12898k30173M30984m46912J55634J58696
13345H38658l03701K5057K35240K42799m71457L95959k98683K50481l25608m9173
13335E39572K67717Q6648k91990B45564J97079K3474P5193K31823L8013P8659
13325H89805k86957J09212J09911n7140J64825k80434J50053k51485K81553k70785
13315E58558J73209n8288o7695K92897n6692p2074N8264k98674R9595m518j65000
13304D59582k1188N1253j05565K11947L00451l19564j33895L54393l25416J78553
13294F50551p9295j01535K89927n8972k55729J14022L5470N3753P5392o0929r6985
$$ plain form
13283 565670 613066 552157 820814 417702 634003 525097 561928 412761 634721 520497
13273 520497 1025305 358563 363859 834809 607843 748271 424814 462581 873273 739338
13263 739338 851701 609062 185853 751675 266312 576083 286103 249264 320671 473476
13253 473476 283833 391762 665998 416989 226528 368254 144953 907569 181664 493364
13243 493364 121790 554499 502249 463806 400195 363571 325774 377479 532273 542567 589799
13232 589799 444087 846186 574681 659321 565125 409549 585785 691340 356885 247102
13222 247102 841383 424562 223164 1055546 338439 926540 353370 132530 446019 168784
13211 274859 214615 282130 366854 444928 315908 482134 322117 531143 230548 650529
$$ packed form
13283E65670M7396o0909K68657m03112K16301j08906L6831j49167K21960j14224
13273E20497N04808C58563N296M70950k26966J40428l23457L7767M10692j33935
13263G39338J12363k42639A85853N65822B66312L09771B86103l6839P1407J52805
13253D73476j89643J07929K74236k49009j90461J41726A44953P62616A81664L11700
13243D93364A21790M32709n2250l8443o3611l6624l7797N1705J54794J0294M7232
13232E89799j45712M02099k71505Q4640r4196j55576J76236J05555l34455j09783
13222B47102N94281m16821k01398Q32382C38439N88101C53370A32530L13489A68784
13211B74859o0244O7515Q4724P8074j29020J66226j60017K09026B30548M19981
$$ plain form
13201 650529 495298 147712 433650 619727 572990 451118 119229 422561 340361 260275
13191 260275 245594 482663 304381 490673 319441 621430 434969 561249 482738 65056
13180 388964 457792 592132 470195 423585 463064 505403 239484 116741 239031 365806
13170 365806 326604 289906 245905 363515 504432 443255 300375 304328 82430 713274 609406
13159 609406 30101 465889 378020 361102 219844 448850 227492 580994 632479 293490
13148 591966 263990 245661 237355 255721 254348 405601 248815 378524 406442 295426 516309
13137 516309 477093 259910 110249 559263 145504 463958 27353 525065 109674 231376
13127 231376 67797 291276 508941 440043 273409 459864 356376 408528 139719 397970
$$ packed form
13201F50529j55231A47712K85938J86077m6737j21872A19229L03332q2200q0086
13191B60275j4681K37069j78282J86292j71232L01989j86461J26280p8511F5056
13180C88964O8828J34340j21937m6610L9479M2339B39484A16741J22290J26775
13170C65806l9202l6698m4001J17610J40917o1177j42880L953H2430O30844j03868
13159F09406C0101M35788q7869j6918j41258K29006k21358L53502N1485B93490
13148E91966B63990j8329q306J8366j373J51253j56786J29709K7918j11016K20883
13137E16309l9216k17183A10249M49014A45504L18454B7353M97712A09674J21702
13127B31376F7797K23479K17665o8898j66634J86455j03488N2152A39719K58251
$$ plain form
13117 397970 134036 242868 88248 258437 249955 293480 510379 551667 571833 265455 270558
13106 270558 259699 415492 304717 231047 243952 122722 376650 199261 407776 514506
13096 514506 111003 199477 354269 342580 266243 -7375 547106 451242 315845 265374 177753
13085 177753 349558 375508 388609 110284 46988 423989 13454 425572 351206 -21693 451272
13073 142989 -9343 161538 248719 272970 404971 345985 354362 216826 44116 61435 270813
13062 270813 166163 202717 301495 571145 445403 213862 387666 438827 773430 336743
13051 368853 479103 198723 169865 130541 154263 152358 240560 97000 79238 184072 107144
13040 107144 372790 87712 123329 512384 -123852 223483 410425 621480 426094 321276
$$ packed form
13117C97970A34036J08832H8248J70189q482M3525K16899M1288K0166B65455N103
13106B70558j0859J55793j10775p3670J2905j21230K53928j77389K08515J06730
13096E14506A11003Q8474J54792j1689p6337g375E47106r5864j35397n0471q7621
13085A77753J71805K5950J3101A10284D6988L77001A3454M12118p4366b1693D51272
13073A42989i343A61538Q7181K4251J32001n8986Q377j37536D4116J7319K09378
13062B70813j04650L6554R8778K69650j25742B13862J73804N1161L34603C36743
13051C68853J10250A98723k8858l9324K3722j905Q8202I7000j7762J04834p6928
13040A07144K65646H7712L5617L89055a23852B23483J86942K11055j95386j04818
$$ plain form
13030 321276 232305 152709 124358 353314 206218 134079 260914 202241 167034 318744 270495
13019 270495 594676 361520 175911 438978 251214 232251 -1726 50024 262566 387353
13009 387353 138361 234545 233411 -179990 354269 110541 -59540 350778 288666 501784
12999 501784 384287 -42276 444682 379993 122634 37174 440024 133002 37934 106110
12989 106110 329459 140540 387193 197551 416374 211959 10145 420447 472463 476612
12979 476612 -14443 183490 -55647 27872 -50218 333452 61012 68433 78169 -112985 228382
12967 125431 104448 108661 295845 35760 -115271 -172198 38930 285728 329452 261676 320774
12956 320774 128844 -145933 268388 78826 249648 17301 252031 228168 157710 311719
$$ packed form
13030C21276q8971p9596k8351K28956j47096p2139J26835n8673l5207J51710m8249
13019B70495L24181k33156A75911K63067j87764j8963a726E0024K12542J24787
13009C87353A38361R6184j134a79990C54269A10541e9540C50778o2112K13118
12999E01784j17497d2276D44682o4689A22634C7174M02850A33002C7934O8176
12989A06110K23349A40540K46653j89642K18823k04415A0145M10302N2016M149
12979D76612a4443A83490e5647B7872e0218C33452F1012P421R736a12985B28382
12967A25431k0983M213J87184C5760a15271n6927C8930K46798M3724o7776N9098
12956C20774A28844a45933B68388G8826J70822A7301K34730k3863p0458J54009
$$ plain form
12946 311719 130626 242928 -277181 298286 218277 218426 196922 -100702 308191 179412
12936 179412 198631 281926 426175 263612 17815 -156622 90853 413495 246736 -59911
12925 68078 274744 -156929 23803 238992 215380 82577 148894 192992 390043 81683 379969
12914 379969 63456 79617 130212 263654 -24505 124437 383917 165793 105741 533194
12904 533194 -38078 400178 -124194 269698 381711 182109 -79458 -46182 419034 7841
12893 -32495 36913 -107081 41468 152169 227795 114402 271274 397446 225140 175689
12883 175689 90776 265039 74058 348460 36002 160586 209651 198386 81537 85989 551692
12872 551692 324017 -16147 291177 169745 33775 119596 155745 212094 -7703 349072 221066
$$ packed form
12946C11719A30626J12302b77181B98286q0009J49k1504a00702C08191j28779
12936A79412J9219Q3295J44249j62563A7815a56622I0853L22642j66759e9911
12925F8078K06666a56929B3803K15189k3612H2577O6317M4098J97051H1683K98286
12914C79969F3456J6161N0595J33442b4505A24437K59480A65793o0052M27453
12904E33194c8078D00178a24194B69698J12013A82109g9458L3276D19034G841
12893c2495C6913a07081D1468J10701P5626j13393J56872J26172j72306m9451
12883A75689q4913J74263G4058K74402C6002J24584M9065j1265H1537M452M65703
12872E51692k27675a6147B91177j21432C3775Q5821L6149N6349g703C49072j28006
$$ plain form
12861 221066 -71842 304231 156163 200841 218145 56234 232431 137327 -40203 -12959 3638
12849 -144217 -176882 534144 103462 -45452 90770 287395 59256 -275446 180478 191052
12839 191052 363521 12163 220838 236903 159574 -41245 -381166 193441 -116818 427691
12828 22252 72157 215209 436663 31681 30921 65048 -110327 573076 -161034 -62287 66686
12816 169345 208242 -247614 -335341 67975 44928 424121 -110450 184611 -53634 -76334 20689
12804 -148704 -97140 113739 48231 112323 -14018 30244 24979 -17188 -288657 88262 357334
12793 357334 42985 243433 310639 125209 449537 87437 4002 -138583 148743 -320891
12782 77461 9154 112576 -228544 178910 -68825 53324 -70222 -178874 97888 51322 128894
$$ packed form
12861B21066g1842C04231j48068M4678J7304E6234J76197r5104d0203a2959C638
12849a44217l2665E34144A03462d5452I0770J96625E9256b75446A80478J0574
12839A91052J72469A2163K08675J6065p7329d1245l39921A93441a16818D27691
12828B2252M9905J43052K21454C1681p60L4127a10327E73076a61034f2287F6686
12816A69345L8897b47614q7727F7975k3047L79193a10450A84611e3634k2700B0689
12804a48704N1564A13739D8231O4092a4018C0244n265a7188k71469H8262K69072
12793C57334D2985K00448O7206A25209L24328H7437D002a38583A48743c20891
12782G7461I154J03422b28544A78910f8825E3324g0222j08652I7888m6566P7572
$$ plain form
12771 128894 -35642 201812 224193 161133 58544 -87585 -114342 -30722 244997 165691 33146
12759 -88342 -222220 78736 -13168 296844 -37464 233841 -64875 278539 71000 397138 -107556
12747 221922 -81265 -73307 -216526 164697 9030 146230 99661 86746 -18051 -116311 137206
12735 -70686 -16960 58717 -5115 77638 130047 156355 211514 120593 135886 73631 -137164 51460
12722 -191808 130977 -152904 67355 40083 -225774 28864 18144 98022 83887 285315 179127
12711 179127 548122 174903 171068 331891 157406 317518 51896 360054 163044 24267
12700 362186 -108578 -63098 401056 127851 76410 56051 -84263 -135715 -67331 48249 -119127
12688 261553 -116921 -26588 -226473 -44917 -132422 149949 267186 203226 346163 358227
$$ packed form
12771A28894c5642B01812K2381o3060E8544h7585k6757c0722B44997p9306C3146
12759h8342j33878G8736a3168B96844c7464B33841f4875B78539G1000L26138a07556
12747B21922h1265P958j43219A64697I030J37200m6569j2915a8051r8260A37206
12735g0686a6960E8717e115G7638N2409K6308N5159r0921J5293o2255a37164E1460
12722a91808A30977a52904F7355k7272b25774B8864j0720P9878j4135K01428j06188
12711A79127L68995A74903l835J60823A57406J60112E1896L08158A63044B4267
12700C62186a08578M5480D01056A27851n1441k0359h4263n1452f7331D8249a19127
12688B61553a16921b6588j99885d4917q7505A49949J17237o3960J42937J2064
$$ plain form
12678 358227 298361 85476 7040 -197629 165428 30141 -231585 272526 129317 57683 95597
12667 95597 183332 63071 139193 250342 108757 239260 -89185 222332 66603 108520 155296
12656 155296 -264222 123116 391834 181026 87921 139243 -38470 170156 160986 374201
12646 374201 111580 146113 -182174 116014 149663 318560 -17078 3972 113592 -11327 -374074
12635 -374074 135286 -226765 343756 -43411 102474 242121 315130 183304 385204 143054
12624 -52635 -12952 59214 296371 39506 -44055 78115 153676 -34679 103835 294863 -26504
12612 -25649 100453 -38125 56134 126105 -92947 196531 107239 501438 -83598 -133308 -39222
12600 -36867 384558 -117374 114617 -173483 -41624 21300 270625 416626 -57459 12059
$$ packed form
12678C58227n9866H5476G040a97629A65428C0141b31585B72526A29317E7683L7914
12667I5597Q7735F3071P6122J11149A08757J30503h9185B22332F6603M1917M6776
12656A55296b64222A23116K68718A81026H7921N1322c8470A70156r170K13215
12646C74201A11580L4533a82174A16014L3649J68897a7078C972J09620a1327l62747
12635c74074A35286b26765C43756d3411A02474J39647P3009j31826K01900A43054
12624e2635a2952E9214K37157C9506d4055G8115P5561c4679A03835J91028b6504
12612b5649A00453c8125E6134O9971i2947A96531q9292L94199h3598m9710c9222
12600c6867C84558a17374A14617a73483d1624B1300K49325J46001e7459A2059
$$ plain form
12589 223086 -33874 173666 48036 380034 -8481 -15061 113946 341640 -93248 18589 278468
12578 278468 58730 188341 149067 45879 432318 279612 317005 191955 -179538 144772
12567 431971 324568 20858 -69001 7373 -96784 1886 381304 -189595 77850 -11273 219358
12555 184905 150362 -80248 -139504 162020 45862 -74656 123712 -146897 136746 -146974
12544 248114 179591 -72210 -239508 167230 63752 -180292 259535 27002 62306 -201021
12533 -221066 -103690 -72235 161822 113006 -224434 -28157 -346116 58745 -137783 82530
12522 6840 -4801 142303 115 68573 -74612 -61848 61522 6700 181169 118946 -75108 -114216
12510 -114216 23271 -241448 56497 324928 235901 53271 298073 -318731 -28851 54744 -81719
$$ packed form
12589B23086c3874A73666D8036L31998h481o580A13946K27694i3248A8589K59879
12578B78468E8730J29611l9274D5879L86439j52706L7393j25050a79538A44772
12567D31971j07403B0858f9001G373i6784A886L79418a89595G7850a1273B19358
12555A84905l4543h0248n9256A62020D5862g4656A23712a46897A36746a46974
12544B48114o8523g2210j67298A67230F3752a80292B59535B7002L5304b01021
12533b21066a03690L1455A61822m8816b24434b8157l17959E8745a37783H2530
12522F840d801A42303A15O8458g4612J2764F1522F700J74469o2223g5108l9108
12510a14216B3271b41448E6497K68431q9027E3271K44802c18731b8851E4744h1719
$$ plain form
12498 36866 233359 -66172 -30961 165140 -120019 -211079 264409 107031 -78304 358105
12487 -120158 152245 -558500 -106365 359188 -108194 -42158 23606 267268 -50294 1061
12476 168009 5191 -3866 -340422 -251139 -141284 10324 89799 42821 -172221 319973 -110781
12464 -50115 -43537 111186 -32229 107140 -97113 279662 204478 -88721 19968 24789 237439
12453 237439 -10632 128233 -66224 261176 80829 -30597 -119337 -74336 55105 -428859 38045
12441 -481461 -53574 -72902 183022 -137748 -117098 -182358 -22503 196812 29421 9496 142660
12430 142660 -225796 -229412 219581 -123898 -192567 37114 100147 -5328 25335 -74030 88188
12418 -139723 -52562 58043 74983 33977 178778 387551 24654 -5756 100626 92767 -162419
$$ packed form
12498C6866J96493f6172c0961A65140a20019r1060B64409A07031g8304C58105
12487a20158A52245e58500a06365C59188a08194d2158B3606K43662e0294A061
12476A68009E191c866l36556Q9283J09855A0324P9475D2821a72221C19973a10781
12464e0115O578A11186c2229A07140i7113B79662p5184h8721A9968M821K12650
12453B37439a0632A28233f6224B61176H0829c0597q8740M5001E5105d28859C8045
12441d81461e3574j9328A83022a37748K0650o5260b2503A96812B9421I496J33164
12430A42660b25796l616B19581a23898o8669C7114O3033e328B5335g4030H8188
12418a39723e2562E8043J6940C3977J44801K08773B4654e756A00626p859a62419
$$ plain form
12406 -138013 -342965 -125143 83100 201461 234726 146038 87938 13750 -126562 -281231
12396 -281231 -141252 303112 -94381 -81524 -62273 -275925 156847 407055 127923 -20222
12385 11302 67376 -110596 18705 145795 324 -114821 -52601 -176860 200782 168864 40162
12373 -42773 155650 -231940 -203595 176190 -213257 341451 -294532 116667 148625 247544
12363 247544 -140582 -169151 274759 264703 13177 292792 -224585 -28549 99015 12614 84023
12352 84023 -72989 98086 -31278 157072 -236660 -56886 103643 177678 -56018 -144073 22054
12340 262905 -122102 142394 -28260 -66415 52522 -82774 9265 -50514 81094 -450938 379850
12328 101772 -5203 -28354 -158121 -39997 -67215 278386 -59682 78243 -20704 -90991 141688
$$ packed form
12406a38013k04952a25143H3100J18361L3265q8688n8100A3750a26562j54669
12396b81231J39979C03112i4381J2857J9251k13652A56847K50208A27923b0222
12385A1302N6074a10596A8705J27090C24a14821e2601j24259B00782l1918D0162
12373d2773A55650b31940K8345A76190b13257C41451b94532A16667L1958R8919
12363B47544a40582k8569B74759j0056A3177K79615b24585b8549I9015A2614P1409
12352H4023g2989I8086c1278A57072b36660e6886A03643P4035e6018q8055B2054
12340B62905a22102A42394b8260l8155E2522h2774I265e0514H1094d50938C79850
12328A01772e203k3151j29767c9997k7218B78386e9682G8243b0704p0287A41688
$$ plain form
12316 -190101 -48258 -157654 293550 -125512 -193647 17195 -170871 25912 181626 49477
12305 -65325 82608 -115481 53141 -235675 158653 401436 222723 127581 -184165 108067
12294 -212042 -104906 -113207 64289 12756 -103827 -179757 116112 -122830 -47201 109843 -294262
12282 -224765 72918 72408 80805 -118893 21118 128243 -62958 105815 88680 85093 51917 -513672
12269 -191926 -41360 236403 -133616 59215 -229633 -35161 -193914 -76341 347664 -175094
12258 -106278 -2498 -99377 -84021 48693 -71992 -133356 8082 -140896 -288686 120851 165681
12247 165681 125330 100326 -182094 194542 91682 -189522 91201 -108854 -3688 15618 217126
12236 217126 328104 -342354 -4266 -202515 -62199 272761 43569 61236 217052 -49764 -99262
$$ packed form
12316a90101d8258j09396B93550a25512o8135A7195a70871B5912J55714D9477
12305f5325H2608a15481E3141b35675A58653K42783j78713r5142a84165A08067
12294b12042a04906q301F4289A2756a03827p5930A16112a22830d7201A09843b94262
12282b24765G2918n10Q397a18893B1118J07125f2958A05815j7135l587l3176e13672
12269a91926d1360B36403a33616E9215b29633c5161j58753g6341C47664a75094
12258a06278b498r6879J5356D8693g1992o1364H082a40896j47790A20851M4830
12247A65681m0351k5004a82094A94542I1682a89522I1201a08854c688A5618K01508
12236B17126J10978c42354d266j98249f2199B72761D3569J7667J55816d9764m9498
$$ plain form
12225 -99262 213355 -158734 441533 -73418 -39059 140779 -287380 -204455 79484 23869 -144924
12213 -109900 234648 -128839 -233834 -7886 244454 103913 337586 272915 -164872 174290
12202 -23410 277905 253489 -31972 -10573 -87350 304719 -107994 -102365 206149 388696 -91378
12190 205331 -108174 429275 -130758 152815 185894 260989 46231 182537 256719 26293
12179 -56633 31366 -47372 223760 151023 62836 11742 356771 -8809 214317 35992 -1811
12167 26444 187132 -6260 292894 -29675 175096 71268 73668 203383 -18466 378571 392630
12156 392630 143073 -295359 173379 -8671 193706 104350 56189 -21393 -20473 336563 493752
12145 493752 163891 543362 80238 219741 414753 44429 59073 168728 72165 -49527
$$ packed form
12225i9262B13355a58734D41533g3418L4359A40779b87380Q2925G9484B3869a44924
12213a09900B34648a28839j04995g886B44454A03913K33673o4671a64872A74290
12202b3410B77905k4416c1972a0573p6777C04719a07994N629B06149J82547i1378
12190B05331a08174D29275a30758A52815L3079P5095D6231J36306P4182B6293
12179e6633C1366d7372B23760p2737F2836A1742L45029h809B14317C5992a811
12167B6444J60688f260B92894b9675A75096G1268K400J29715a8466C78571J4059
12156C92630A43073b95359A73379h671A93706q9356m8161b1393R20C36563J57189
12145D93752A63891L79471H0238J39503J95012D4429J4644J09655G2165d9527
$$ plain form
12134 184567 217008 152978 260985 86469 -209659 215841 288502 149020 -31891 -81987 431447
12122 275515 -176128 -176191 -151256 43427 -52609 105220 283498 -123005 252874 366226 -125628
12110 -93189 899 32741 -264773 239801 -162791 58473 13386 -77063 688 66367 8255 -117249
12097 -46183 -95714 175216 -46268 -121932 43969 119311 150304 46386 119941 19594 -230412
12085 -124890 -83221 59282 408456 169870 -242682 -116288 -18043 150044 161674 -333355
12074 82947 -117901 -80956 184746 70388 144604 31644 -78358 -44549 90803 170746 -60668
12062 -58066 142662 -78164 -51446 -65611 55173 123449 117303 -169037 302648 -3942 -29932
12051 -29932 13323 108756 133155 -100468 266547 161391 -114803 249550 401532 5848 -65619
$$ packed form
12134A84567L2441o4030J08007H6469b09659B15841P2661j39482c1891n0096D31447
12122B75515a76128o3K4935D3427e2609A05220J78278a23005B52874J13352a25628
12110i3189H99L1842b64773B39801a62791E8473A3386g7063F88O5679H255a17249
12097d6183m9531A75216d6268p5664D3969P5342L0993D6386P3555A9594b30412
12085a24890M1669E9282L49174A69870b42682a16288a8043A50044J1630c33355
12074H2947a17901L6945A84746G0388P4216C1644g8358L3809I0803P9943f0668
12062e8066A42662g8164K6718j4165E5173O8276o146a69037C02648c942k5990
12051b9932A3323R5433K4399a00468B66547j05156a14803B49550J51982E848f5619
$$ plain form
12039 114157 -35178 373991 163041 310325 -6937 -243641 -23163 244396 -109947 177869
12028 271815 23215 55861 10213 -1683 166682 7267 132386 -151316 101368 -63173 -102754
12017 -102754 133880 65177 92319 -46209 69391 95440 375498 -36786 -297949 -149588 226253
12005 -10009 -136172 -253044 117357 370061 -245061 -131678 -225523 158054 147188 138647
11995 138647 95325 49082 1097 101025 59472 -5627 17418 160506 67330 -269836 -173115
11984 -173115 220908 -203051 -147959 -244363 -58197 7114 161839 93077 28243 -102853 -54497
11973 -54497 338738 18970 253533 -282898 -304087 193229 -46372 -319669 122837 162782
11963 162782 316551 -29597 -88029 14268 -77549 -150864 -119665 2078 92555 345798 77033
$$ packed form
12039A14157c5178C73991A63041J47284f937k36704b3163B44396a09947A77869
12028B71815B3215L2646A0213a683A66682G267J25119a51316A01368f3173l9581
12017a02754A33880F5177K7142d6209F9391K6049K80058c6786k61163J48361B26253
12005a0009j26163j16872A17357K52704b45061J13383r3845A58054j0866q541
11995A38647m3322m6243A097R9928m1553e627A7418J43088F7330b69836R6721
11984a73115B20908b03051N5092r6404e8197G114J54725o8762B8243a02853M8356
11973e4497C38738A8970K34563b82898k1189A93229d6372k73297A22837L9945
11963A62782J53769b9597n8432A4268g7549p3315L1199B078R0477K53243G7033
$$ plain form
11951 62224 73320 164927 -490083 311133 47151 -229674 20384 170928 35845 -77448 66849
11939 -232366 61801 -77193 -13151 4912 289794 -349296 -58751 -182427 -14756 -182693 292700
11927 17783 -241456 -48034 -117308 -91239 -128579 -159845 1459 -130390 17567 -17287 -102554
11916 -102554 131132 173088 -168078 6854 -120352 -189401 13231 -251106 191663 102195 16642
11904 157280 37870 -104544 -6765 -101207 234866 18358 -23792 210583 -167212 49908 -22610
11892 -285492 73139 173394 102548 78096 15962 66067 28802 -33918 -184384 -262205 -176760
11881 -176760 -166256 -60919 -103387 102633 24650 148249 -100530 7213 -174657 -196229 133315
11869 49500 -103010 257485 402788 -302082 89331 6908 -367064 55928 52679 -310095 -206568
$$ packed form
11951F2224J1096R1607d90083C11133D7151b29674B0384J50544C5845g7448F6849
11939b32366F1801g7193a3151D912K84882c49296e8751j23676a4756j67937B92700
11927A7783b41456d8034o9274K6069l7340l1266A459a30390A7567a7287q5267
11916a02554A31132M1956a68078F854a20352o9049A3231b51106A91663q9468A6642
11904A57280C7870a04544f765r4442B34866A8358b3792B10583a67212D9908b2610
11892b85492G3139J00255p0846k4452A5962N0105B8802c3918j50466p7821Q5445
11881a76760J0504f0919m2468A02633B4650J23599a00530G213a74657k1572A33315
11869D9500a03010B57485J45303c02082H9331F908c67064E5928l249c10095J03527
$$ plain form
11858 -206568 -24437 -83193 -303504 61385 70627 -28076 -219199 26247 -108924 160916 -360213
11846 -266011 -16884 -604500 78294 11059 -58901 252062 41867 -134673 -9655 70899 -92639
11834 -43147 -108627 -268071 -164233 49191 169461 -174453 -191499 -154560 172920 -203508
11823 70229 -58886 -265419 154137 27542 -147258 232196 -157571 -10375 -10165 -94607 309293
11811 22893 -53567 -271653 -78467 -189091 54688 187415 -8809 -393596 184699 -234217 -189538
11800 -189538 -127047 171636 -193536 132686 -8398 -1531 23131 80358 -31206 16182 -260040
11788 -226895 390565 -1943 -37928 116424 -100113 -209667 -281285 -103190 -14320 -220113
11778 -220113 123603 221553 92645 291494 -181934 -174714 189417 455054 -48747 -102378 -107428
$$ packed form
11858b06568b4437n8756k20311F1385R242b8076j91123B6247a08924A60916c60213
11846b66011a6884n87616G8294A1059e8901B52062D1867a34673i655G0899i2639
11834d3147o5480j59444J03838D9191J20270a74453j7046L6939A72920b03508
11823G0229e8886k06533A54137B7542a47258B32196a57571a0375K10q4442C09293
11811B2893e3567k18086g8467j10624E4688J32727h809l84787A84699b34217M4679
11800a89538O2491A71636a93536A32686h398a531B3131N7227c1206A6182b60040
11788b26895C90565a943l5985A16424a00113j09554p1618a03190a4320k05793
11778b20113A23603R7950I2645J98849a81934P220A89417K65637d8747n3631n050
$$ plain form
11767 -107428 123007 119485 92769 236142 367325 -10620 162826 8700 -23606 7803 -32905
11755 63828 166965 192911 -95167 -33460 356738 -123556 81254 -84673 -84161 87552 142843
11744 142843 66295 -90502 348004 55700 366889 -347288 -277590 -188595 22067 -67958 -244261
11733 -244261 -57611 113412 107966 -32987 -323482 212310 -180664 -53472 -189764 -23010 103018
11721 -162997 -271389 -52579 24755 322242 -137738 78167 -23685 -313107 -194141 -305429
11711 -305429 129553 86130 28134 41664 85400 -78850 -77230 84856 -13586 30904 310207
11700 310207 144566 -175102 -236612 -261605 22167 24231 -189209 408964 164246 -79262 143697
11688 -12266 101853 -112368 181100 -4148 211161 -68099 -149367 -280290 4570 190625 -11668
$$ packed form
11767a07428A23007l522k6716J43373J31183a0620A62826H700b3606G803c2905
11755F3828J03137K5946i5167c3460C56738a23556H1254h4673N12H7552N5291
11744A42843F6295i0502C48004E5700L11189c47288O9698Q8995B2067f7958j76303
11733b44261e7611A13412n446c2987k90495B12310a80664e3472j36292b3010A03018
11721a62997j08392e2579B4755K97487a37738G8167b3685k89422J18966j11288
11711c05429A29553m3423B8134J3530M3736g8850J620H4856a3586C0904K79303
11700C10207A44566a75102o1510k4993B2167K064a89209D08964A64246g9262A43697
11688a2266A01853a12368A81100d148B11161f8099q1268j30923D570J86055a1668
$$ plain form
11676 250899 178077 77476 402191 -112516 -275473 67779 77743 -302063 -331093 276501 381729
11665 381729 -2754 -284514 76212 -54786 95128 165124 -123989 -77189 -59464 18420 -10543
11653 113263 -49913 -146041 -347920 39159 101047 -143595 -141935 203768 -228631 -259674 -369859
11642 -369859 -57806 -78710 122555 180512 454064 -16295 -169389 63170 -2715 102622 -46455
11630 -135198 19790 -100462 -101786 -14871 221161 94970 -188713 -117599 158376 111857 165213
11619 165213 250987 183204 -398726 32430 -163830 -35780 -40002 136296 -11459 235045 68778
11607 -51840 -232663 136162 260370 -130654 177720 78861 37621 92954 -411657 -96301
11596 -24999 248440 -152713 -196185 -100199 -20178 155136 -353067 -6836 255636 145581 -298994
$$ packed form
11676B50899p2822G7476L24715a12516j62957F7779R964c02063k9030B76501J05228
11665C81729b754k81760G6212e4786I5128O9996a23989M6800J7725A8420a0543
11653A13263d9913r6128k01879C9159O1888a43595J660B03768b28631l1043j10185
11642c69859e7806k0904A22555N7957K73552a6295j53094F3170b715A02622d6455
11630a35198A9790a00462j324a4871B21161I4970a88713P1114A58376m6519N3356
11619A65213Q5774o7783c98726C2430a63830c5780m222A36296a1459B35045F8778
11607e1840j80823A36162J24208a30654A77720G8861C7621N5333d11657i6301
11596b4999B48440a52713m3472R5986b0178A55136c53067f836B55636j10055b98994
$$ plain form
11584 437645 129627 -257771 -1839 -65166 233365 -85870 -12779 -50775 292468 -78437 -449924
11573 -449924 -56242 -22647 52912 66243 92450 176660 142264 -318963 -140446 248316 282148
11562 282148 52029 181105 222941 -97393 106150 143566 21946 202229 -208229 215179
11551 299711 -167322 -136062 -19656 151647 -203136 268946 157172 77934 -76313 -158725
11541 -158725 89430 -135036 -53172 42965 60634 189059 -54067 341324 -30589 -96536 -287261
11530 -287261 -150855 37872 11713 167478 210433 -195755 -47850 32772 -215384 -99357 -2233
11518 -34220 2075 58994 212714 -139500 127186 -85538 -24566 -175162 123447 67485 -206082
11506 382641 4051 -86633 81183 -11014 79282 78798 30308 -26658 106320 231467 134869 90745
$$ packed form
11584D37645A29627b57771a839o3327B33365h5870a2779l7996B92468g8437l71487
11573d49924e6242b2647E2912J3331K6207Q4210l4396c18963a40446B48316L3832
11562B82148E2029J29076M1836i7393A06150L7416B1946J80283b08229B15179
11551B99711a67322L1260a9656A51647b03136B68946j11774G7934g6313q2412
11541a58725H9430a35036e3172D2965J7669J28425e4067C41324c0589o5947j90725
11530b87261J36406C7872A1713J55765M2955a95755d7850C2772b15384i9357b233
11518c4220B075N6919J53720a39500A27186h5538b4566j50596A23447n5962b06082
11506C82641D051h6633H1183a1014G9282m84C0308b6658A06320J25147r6598m4124
$$ plain form
11494 90745 -9871 302718 113164 147008 -5258 32608 -79108 48494 233416 257633 50506
11482 -64491 -285046 310675 -10661 80331 -64157 60505 68898 110662 274471 453663 293329
11471 293329 416774 175047 261923 -166991 293505 -108910 326584 273545 -115373 -73098
11461 -73098 74366 7298 -131048 549601 51903 -184719 -72923 -53478 41034 250563 -59597
11449 121035 59151 296502 41014 -77467 84107 -56698 117419 38736 65059 356480 -13894
11437 90668 253900 460217 250665 21514 215511 -34080 326316 48102 223093 -129557
11426 71876 476720 59043 -85307 -85418 -75446 35089 252206 153385 -85747 136103 237218
11415 237218 5225 -155620 73259 -76403 -48393 231850 -11996 54477 -105431 98118 83864
$$ packed form
11494I0745i871C02718A13164L3844e258C2608g9108D8494J84922K4217E0506
11482f4491k20555C10675a0661H0331f4157F0505Q393M1764J63809J79192j60334
11471B93329J23445A75047Q6876a66991B93505a08910C26584n3039a15373M2275
11461g3098G4366G298a31048E49601E1903a84719g2923J9445D1034K09529e9597
11449A21035E9151K37351D1014g7467H4107e6698A17419C8736K6323K91421a3894
11437I0668J63232K06317k09552B1514J93997c4080C26316D8102J74991a29557
11426G1876M04844E9043h5307j11R972C5089K17117r8821h5747A36103J01115
11415B37218E225a55620G3259g6403K8010B31850a1996E4477a05431I8118j4254
$$ plain form
11404 83864 -46987 -43747 3622 -142205 -71374 -47899 89689 9676 -402260 130428 49754 197667
11392 197667 236878 -13198 121551 -195632 -112225 -18316 -292728 19993 46583 100884 176591
11381 176591 144039 57719 72389 81668 68652 116990 -108949 5274 155410 -200019 83690
11369 125246 -42221 7327 164317 -25288 111041 220139 -4212 -235423 -138981 -57767 -101678
11358 -101678 -138647 -211330 -31366 -167488 250373 124515 5206 205765 -47009 123200 12376
11346 -248553 25612 156441 20227 6138 131622 44588 529199 -90812 366638 -42017 231155
11334 104309 18405 83091 53738 -362047 58616 144969 9663 -10453 -90443 92747 57096
11323 57096 206620 -62034 -267633 282283 -373504 -254915 232012 -81518 35379 197291
$$ packed form
11404H3864d6987L240C622a42205P0831K3475H9689I676d02260A30428D9754J47913
11392A97667L9211a3198A21551a95632Q3407a8316k74412A9993K6590N4301P5707
11381A76591l2552E7719J4670R279j3016M8338a08949E274J50136b00019H3690
11369A25246d2221G327J56990b5288A11041J09098d212k31211R6442e7767m3911
11358a01678l6969p2683c1366j36122B50373A24515E206K00559d7009A23200A2376
11346b48553B5612J30829B0227F138J25484D4588M84611i0812C66638d2017B31155
11334A04309A8405O4686k9353c62047E8616Q6353I663a0453p9990I2747l5651
11323E7096J49524f2034k05599B82283c73504J18589B32012h1518C5379J61912
$$ plain form
11313 197291 -24005 -65859 -381744 -128968 -3351 12486 26716 51814 -18096 -93208 196977
11301 162121 224189 -291686 -117197 -40290 41090 18027 100502 72333 -199990 -33789 162282
11289 -20590 145297 130682 -19432 133550 -116015 -156540 -29095 294846 66153 5279 485369
11278 485369 -188514 -238383 -111920 205241 -230235 -192398 99737 -123985 -113613 -357744
11268 -357744 325144 213174 471699 46451 113644 -82464 -93149 43115 -91635 -353120 -113181
11256 173235 55931 153961 255607 -130254 232631 -6400 -82509 -112726 -181108 -91896 -113182
11245 -113182 -167903 -98121 86834 425555 17150 -96101 -331667 -41341 322467 204757 87078
11233 -14445 -71992 -88457 -20619 -384914 -331739 -80728 -252070 109748 135211 -69607 8561
$$ packed form
11313A97291b4005m1854l15885a28968c351A2486J4230K5098a8096p5112A96977
11301A62121O2068b91686a17197d0290D1090A8027Q2475k8169a99990c3789A62282
11289b0590A45297j4615a9432A33550a16015m0525b9095B94846F6153E279M80090
11278D85369a88514m9869a11920B05241b30235L7837I9737a23985J0372k44131
11268c57744C25144j11970K58525D6451O7193h2464j0685D3115i1635k61485a13181
11256A73235E5931R8030J01646a30254B32631f400p6109l0217o8382Q9212k1286
11245a13182n4721O9782H6834L38721A7150i6101k35566d1341C22467j17710H7078
11233a4445n7547j6465b0619l64295N3175h0728j71342A09748K5463f9607H561
$$ plain form
11221 -388836 -338361 -73127 -166641 -338693 65652 -407260 -285480 -87297 -80429 -22874 143583
11209 -147634 -145227 -155721 -19769 -161778 -98681 93351 -15014 -259787 -113826 1976 -71012
11197 -354822 -244959 -13198 108499 -410950 70840 -189526 -309941 406297 82593 120714
11187 120714 -241024 97555 44355 -169285 85263 -211717 197518 -107823 -138314 -150136
11177 -150136 159235 -99026 -132239 -285626 -421684 60105 46235 -54520 222815 -84367 -42172
11165 50460 165160 90972 -310097 171267 -216874 -167849 -82760 227195 -26400 51669 -227863
11153 -93645 -173377 207399 -33649 -198813 -239752 223882 -100411 45930 91337 -74413 629525
11141 272725 87340 3728 -75978 179475 149343 -296443 184797 -96759 -120768 -116979 -47443
$$ packed form
11221c88836N0475g3127r3514j72052F5652d07260J21780h7297O868b2874A43583
11209a47634K407j0494a9769j42009O3097I3351a5014k44773a13826A976g1012
11197c54822J09863a3198A08499d10950G0840a89526j20415D06297H2593L8121
11187A20714b41024I7555D4355a69285H5263b11717A97518a07823l0491j1822
11177a50136A59235i9026l3213j53387j36058F0105j3870e4520B22815h4367d2172
11165E0460J14700p4188c10097A71267b16874M9025h2760B27195b6400E1669b27863
11153i3645p9732B07399c3649j65164m0939B23882a00411D5930M5407g4413F29525
11141B72725H7340C728g5978A79475l0132b96443A84797i6759k4009L789d7443
$$ plain form
11129 42376 228517 375640 123991 -312499 -234792 280873 -154078 290212 -149275 82789
11118 -13709 -1827 -210491 -100549 94274 980 36366 -154812 78179 -167241 105318 194998
11107 194998 -62365 161773 -108421 113048 632 -157709 86880 -16849 16570 -135960 -106449
11096 -106449 36074 -27428 -95871 442577 51247 204763 158030 -100482 101887 8677 285011
11085 285011 24206 -47066 -126782 4956 242607 -10524 408551 -54447 291424 -57915 -140494
11074 -140494 119401 27575 152710 -81399 108895 248525 414902 105790 67729 321487
11064 321487 111413 -15632 266703 -14990 -98564 140938 145900 135266 132229 377489 264242
11053 264242 190098 40270 365686 407467 176345 141757 277194 164476 306594 478106
$$ packed form
11129D2376J86141J47123A23991c12499P7707B80873a54078B90212a49275H2789
11118a3709a827k08664a00549I4274I80L5386a54812G8179a67241A05318Q9680
11107A94998f2365A61773a08421A13048F32a57709H6880a6849A6570a35960K9511
11096a06449C6074b7428o8443D42577E1247J53516m6733a00482A01887H677K76334
11085B85011B4206d7066p9716D956K37651a0524D08551e4447B91424e7915q2579
11074a40494A19401B7575J25135h1399A08895J39630J66377A05790l8061K53758
11064C21487A11413a5632B66703a4990q3574A40938M962j0634l037K45260j13247
11053B64242p4144D0270L25416M1781A76345l4588J35437j12718J42118J71512
$$ plain form
11043 478106 209634 16525 494651 225631 307541 85115 -190441 188818 27237 203583
11033 203583 421844 -73624 503734 278143 369066 366646 280751 305921 268630 411057 617727
11022 617727 392817 470026 445773 352543 659441 -2552 51254 358132 551335 402722 157556
11010 495633 358085 534705 296520 456666 506803 490835 473873 374145 386351 217861
11000 217861 527520 514473 373176 620397 481816 91217 642958 561316 106566 386596
10990 386596 577625 605100 366701 182290 384649 300341 552639 276790 223287 500710
10980 500710 353545 627331 115917 513874 462493 472884 356815 174312 459653 675375
10970 675375 678048 735657 361717 421303 317244 316102 528597 596663 709970 506060 986117
$$ packed form
11043D78106B09634A6525M78126B25631Q1910H5115a90441A88818B7237J76346
11033B03583K18261g3624E03734k25591R0923k420q5895K5170l7291J42427K06670
11022F17727k24910P7209k4253r3230L06898b552E1254L06878J93203j48613A57556
11010D95633j37548J76620k38185J60146N0137j5968j6962r9728J2206j68490
11000B17861L09659j3047j41297K47221j38581I1217N51741q1642A06566K80030
10990C86596J91029K7475k38399A82290K02359q4308K52298k75849n3503K77423
10980E00710j47165K73786A15917L97957n1381J0391j16069A74312K85341K15722
10970F75375K673N7609C61717N9586j04059j142K12495O8066J13307k03910M80057
$$ plain form
10959 986117 623518 572989 695605 625366 646203 1129995 623014 578044 879217 829208
10949 829208 1126788 983380 739767 1147405 1325556 1472633 1477749 1385142 1522501 1697477
10939 1697477 1622037 1608704 1402987 1136029 1328682 1367260 1210389 1173814 1437003 1087117
10929 1087117 1770471 1269590 1264901 1179127 1380969 1281855 992453 1008527 872252 1068851
10919 1068851 1035517 849289 872991 646160 730755 750388 638743 611438 501890 751014
10909 751014 692358 457354 293817 227274 348175 557100 283720 595366 174569 691914
10899 691914 562921 445051 453698 19993 3689 130332 393892 840223 274612 180805 199677
10888 199677 276084 341706 159851 328979 204243 395996 41221 89401 110057 -27504 -26703
$$ packed form
10959I86117l62599n0529J22616p0239K0837M83792n06981m4970L01173n0009
10949H29208K97580j43408k43613M07638J78151J47077N116r2607J37359J74976
10939A697477p5440j3333k05717k66958J92653L8578j56871l6575K63189l49886
10929A087117O83354n00881m689q5774K01842r9114k89402J6074j36275J96599
10919A068851l3334j86228K3702k26831Q4595J9633j11645k7305j09548K49124
10909G51014n8656k35004j63537o6543J20901K08925k73380L11646A74569N17345
10899F91914j28993j17870Q647A9993C689J26643K63560M46331B74612r3807J8872
10888A99677P6407O5622A59851J69128j24736J91753D1221M8180K0656b7504Q01
$$ plain form
10877 -26703 32681 -219235 632533 208312 68723 -83948 576106 277605 279239 10609 -13461
10865 286503 326549 -122584 -62041 511067 312956 -113365 436180 424373 40893 -66836
10854 158662 -31185 278678 111422 70203 -94822 842 236803 248638 96218 -84430 229842
10842 -42999 200162 -104841 37171 89422 -102118 245537 199325 64101 -7106 408020 529
10830 -3400 380489 49031 204927 331222 -38750 303568 167894 -96704 45507 -197012 377960
10818 136661 -118703 38066 272208 -13358 252599 151813 -160110 -195750 -149674 -169861
10808 -169861 4668 144505 107237 511031 -340311 88724 40781 10253 -26483 -137301 -225874
10797 -225874 80866 -281247 -104746 -156489 62906 206909 26413 31472 143765 -31220 -31613
$$ packed form
10877b6703C2681b19235F32533B08312F8723h3948E76106B77605J634A0609a3461
10865B86503M0046a22584O0543E11067j98111a13365D36180j1807D0893f6836
10854A58662c1185B78678A11422m1219i4822H42K35961J1835I6218h4430B29842
10842d2999B00162a04841C7171N2251a02118B45537m6212F4101g106D08020E29
10830c400C80489D9031J55896J26295c8750C03568j35674i6704D5507a97012C77960
10818A36661a18703C8066K34142a3358B52599j00786a60110l5640M6076k0187
10808a69861D668J39837l7268M03794c40311H8724D0781A0253b6483j10818q8573
10797b25874H0866b81247a04746n1743F2906J44003B6413N059J12293c1220l93
$$ plain form
10786 -31613 -89021 226703 68045 160268 463896 -170231 -170152 196142 253995 -333017 188824
10774 253222 -31979 -158102 3562 109594 -139245 168171 61673 48133 -310593 240591
10763 -121728 16188 -86426 -212204 112572 7892 -175379 108367 -183504 -225039 271888
10752 346762 -96861 145245 -191903 -143005 140681 86790 157774 -32185 -61079 -47986 -147462
10741 -147462 39923 26564 -137581 148940 -274539 -242649 57950 365850 115177 -8166 175974
10729 52279 329149 224672 -372870 -47053 -165150 -64806 -239416 112314 -175159 175786
10718 -123831 383496 295654 -134025 -78796 52947 46419 -281708 537966 166898 53988 76752
10707 76752 292039 -249419 -13816 -11245 -141807 163683 -22127 -195963 -213162 -111930 89348
$$ packed form
10786c1613n7408B26703F8045R2223L03628a70231P9A96142N7853c33017A88824
10774B53222c1979j26123C562J06032a39245A68171F1673j3540c10593B40591
10763a21728A6188h6426j25778A12572G892a75379A08367a83504m1535B71888
10752C46762i6861A45245a91903M8898A40681n3891P0984c2185k8894J3093r9476
10741a47462C9923j3359a37581A48940b74539L1890E7950L07900A15177h166A75974
10729E2279K76870j04477c72870d7053j18097f4806j74610A12314a75159A75786
10718a23831C83496q7842a34025N5229E2947o528b81708E37966A66898E3988K2764
10707G6752K15287b49419a3816K571j30562A63683b2127j73836j7199J01232H9348
$$ plain form
10695 -205726 -303700 -205888 48802 161799 136878 36810 119364 17855 -337228 89108 -139305
10683 -212184 -262668 -244977 -79483 -134238 -98986 -43287 -115852 -319767 -101328 -128031 102809
10671 -189279 -240803 -27403 150310 175892 -57301 -25693 -14380 -197608 -250989 -5791 133990
10659 -81008 -10569 302462 -97135 38681 -11670 54049 2090 -54350 -327598 -151621 -198040
10648 -198040 -102371 81020 -224327 -69786 -235412 99283 174687 -371444 -13800 118188 175719
10637 175719 119131 19528 -268744 127173 -175684 18874 -271992 276260 -45214 -276127
10627 -276127 474426 -18116 79869 49801 152863 128353 -466164 -19828 -89402 -146310 -83311
10616 -83311 -148787 190996 -290139 -245287 136570 57183 -289288 -410910 294716 -91680
$$ packed form
10695b05726r7974R7812D8802J12997k4921C6810Q2554A7855c37228H9108a39305
10683b12184n0484J7691g9483n4755L5252d3287p2565k03915a01328k6703A02809
10671a89279n1524b7403A50310K5582e7301b5693J1313j83228n3381e791A33990
10659h1008a0569C02462i7135C8681a1670E4049B090e4350k73248a51621m6419
10648a98040R5669H1020b24327f9786j65626I9283P5404c71444a3800A18188N7531
10637A75719n6588A9528b68744A27173a75684A8874b71992B76260d5214k30913
10627b76127D74426a8116G9869l0068J03062k4510d66164a9828o9574n6908O2999
10616h3311o5476A90996b90139M4852A36570E7183b89288j21622B94716i1680
$$ plain form
10605 366912 -79930 64089 -142630 175265 -40672 -57983 -384791 -96554 235034 -182861
10594 93754 -71354 30648 255725 -119584 -256712 165360 99047 -10148 -152935 -147196 -101462
10583 -101462 -171460 -89447 57002 -101357 49258 92722 -70771 155904 241113 53745 44654
10572 44654 -15508 26266 -192541 -16544 458026 -276125 21701 -200842 235212 -202675
10561 -175553 9073 -78190 -288838 183754 3711 -49070 -157325 -79455 11685 293437 257128
10550 257128 69029 -14109 107297 70236 -269059 172061 209632 -31408 -412472 109187
10539 -121179 -128439 35363 -206198 -382528 24846 322431 -271421 33686 74820 39182 89157
10528 89157 -97057 -62524 188607 12481 50127 -315728 89513 -52190 41089 -35772 13810
$$ packed form
10605C66912g9930F4089a42630A75265d0672j7311l26808i6554B35034a82861
10594I3754g1354C0648K25077a19584j37128A65360o6313a0148j42787N739M5734
10583a01462o9998Q2013E7002a01357D9258M3464g0771A55904Q5209E3745r091
10572D4654a5508B6266a92541a6544D58026b76125B1701b00842B35212b02675
10561a75553I073g8190k10648A83754C711d9070j08255P7870A1685K81752l6309
10550B57128F9029a4109A07297l7061b69059A72061L7571c1408l81064A09187
10539a21179p260C5363b06198j76330B4846K97585b71421C3686M1134l5638M9975
10528H9157i7057L4533A88607A2481L7646c15728H9513e2190D1089c5772A3810
$$ plain form
10516 -145484 342663 -152914 24908 -75490 503877 117240 48717 39768 -368222 87937 65736
10505 65736 312173 -239147 -87498 228954 -351887 24003 -93060 -416045 78409 224954
10495 224954 141170 -34973 -277180 130251 -307443 -269252 162174 22325 194773 -102565
10484 -68123 -47505 100929 -107253 203577 464505 -34784 237853 34510 140146 -212875
10473 -30067 -39129 205479 -133864 -222628 -301575 -32653 -334391 -88778 -79164 -111350 329913
10461 200856 -63159 66654 -7649 -125103 72145 -9607 -163152 -51265 50035 -74002 319893
10449 112196 314152 265723 40747 16618 69714 146385 553471 -412341 -122243 137730
10438 -98148 10752 81493 -5244 -328711 -124080 112846 -139610 20736 -239768 26126 -16784
$$ packed form
10516a45484C42663a52914B4908g5490E03877A17240D8717q949c68222H7937k2201
10505F5736K46437b39147h7498B28954c51887B4003i3060l22985G8409J46545
10495B24954q3784c4973k42207A30251c07443L8191A62174B2325J72448a02565
10484f8123K0618A00929a07253B03577K60928c4784B37853C4510J05636b12875
10473c0067r062B05479a33864q8764p8947c2653l01738h8778R614l2186C29913
10461B00856f3159F6654g649j17454G2145i607j53545e1265E0035g4002C19893
10449A12196K01956m8429D0747A6618N3096P6671M07086d12341a22243A37730
10438i8148A0752P0741e244l23467a24080A12846a39610B0736b39768B6126a6784
$$ plain form
10426 -104325 -48106 -75552 -484798 305275 -316437 -81553 29498 118039 284403 -117018
10415 197713 119493 58029 -172752 -40718 -102745 70737 -5124 -280008 -8787 -104414 -234269
10404 -234269 -316416 -87799 -321549 -145598 -79231 -167892 -29623 158627 24322 -103209 -140004
10393 -140004 186203 104190 146700 -14490 -114691 4494 64980 -187601 -141287 27972 122341
10382 122341 2678 -178715 -29226 28463 -224314 36023 -113194 61141 27860 86650 140653
10371 140653 -116407 56644 67975 126364 -235804 -233706 -76892 89616 3637 123082 383535
10360 383535 37918 62342 -61 -17568 342698 -71845 -90789 10677 -88259 208217 -28852 -13116
10347 374797 405165 39795 -141142 334044 -150382 475496 253904 563021 146661 133498
$$ packed form
10426a04325d8106k7446m09246C05275c16437h1553B9498Q8541J66364a17018
10415A97713p8220E8029a72752d0718o2027G0737e124k74884h787r5627j29855
10404b34269q2147h7799k33750a45598O6367q8661b9623A58627B4322a03209l6795
10393a40004A86203q2013M2510a4490j00201D494O0486a87601M6314B7972R4369
10382A22341B678a78715b9226B8463b24314C6023a13194F1141B7860N8790N4003
10371A40653a16407E6644J1331N8389b35804K098g6892H9616C637J19445K60453
10360C83535C7918K4424f1j7507C42698g1845j8944A0677h8259B08217b8852a3116
10347C74797L0368C9795a41142C34044a50382D75496k21592L09117A46661j3163
$$ plain form
10337 133498 194941 -25826 430545 199060 29399 403242 86937 122363 329328 -39137 87414
10325 328870 55449 25724 174045 128378 67540 218191 358439 55736 7549 112830 129129
10314 129129 170197 74086 249696 365618 188689 229027 117267 232244 213142 357474
10304 357474 88883 157758 33696 176466 106821 -251481 382733 20647 135656 340910
10294 340910 342779 -61173 269423 199775 -38725 290196 137300 -263888 172859 436244
10284 436244 323684 95813 -52105 -8099 219570 -183839 -51451 1362 14684 12345 421573
10273 421573 747759 -261283 -73198 69187 305154 193300 49473 -78862 191058 -32760
10262 -20615 -411898 118498 42670 129497 -56196 242076 73960 14970 -195327 47048 246841
$$ packed form
10337A33498O1443b5826D30545A99060B9399L73843H6937L5426K06965c9137H7414
10325C28870E5449B5724J48321m5667o0838J50651J40248E5736G549J05281J6299
10314A29129M1068G4086J75610J15922j76929M0338j11760J14977j9102J44332
10304C57474H8883O8875C3696J42770o9645b51481C82733B0647J15009K05254
10294C40910J869f1173B69423o9648c8725B90196A37300b63888A72859K63385
10284D36244j12560I5813e2105h099B19570a83839e1451A362J3322k339M09228
10273D21573L26186b61283g3198F9187K35967j11854D9473g8862A91058c2760
10262b0615l91283A18498D2670Q6827e6196B42076G3960A4970a95327D7048J99793
$$ plain form
10251 246841 -45166 93176 253502 162045 -42138 34789 -366101 -116719 -90909 117039 -217852
10239 155838 143613 11787 -277946 103984 -47985 390140 210140 -32032 334462 -275055
10228 129841 -18386 84231 110117 148946 106334 43391 -226136 -167200 99706 -44041 108980
10216 -40866 -117860 43949 373239 262830 -258571 121316 2328 57631 257314 88191 125889
10205 125889 111115 -50611 -77990 387426 -433980 -129592 -7674 -53384 135290 -135749 111294
10193 -246548 -35120 241928 102285 5341 -219354 316266 -94997 22949 -30714 55996 -26283
10181 98440 128734 321714 -307680 -134421 -74789 99473 -54358 157007 242520 -25555 -284547
10170 -284547 -7842 20302 -102494 -85364 -287987 -431055 -124055 329548 -152548 1212 -54062
$$ packed form
10251B46841d5166I3176J60326r1457d2138C4789c66101a16719K5810A17039b17852
10239A55838j2225A1787b77946A03984d7985C90140j80000c2032C34462b75055
10228A29841a8386H4231K5886L8829m2612D3391b26136N8936I9706d4041A08980
10216d0866p6994D3949L29290j10409b58571A21316B328N5303J99683H8191L7698
10205A25889j4774e0611k7379C87426d33980a29592g674m5710A35290a35749A11294
10193b46548c5120B41928A02285E341b19354C16266i4997B2949c0714E5996b6283
10181I8440L0294J92980c07680a34421N9632I9473e4358A57007Q5513b5555k58992
10170b84547g842B0302a02494J7130k02623j43068a24055C29548a52548A212e4062
$$ plain form
10158 -96465 -128192 -181061 -74833 -411441 -39329 35446 50422 -2609 53055 -165154 -355335
10147 -355335 -522684 158988 183673 87317 316173 -2448 -100140 -223355 61979 -410102 -129844
10135 -175470 -36065 -26018 -251391 -228647 -23594 33959 -164444 -275784 -195813 45521 -184710
10123 -232620 232896 1035 389433 -39738 -35101 63891 214015 -119131 -207046 228225 -92513
10111 -276517 118403 29699 -60510 -31979 28371 -28841 58700 37129 -49685 -81040 -207539
10100 -207539 -267326 -155142 19811 233342 211619 76725 274717 -203268 90208 -321157
10089 -205251 -14334 -338758 -241919 185251 -104434 44160 216122 -141340 -312290 221744
10078 -231698 -206066 -319889 -191844 -233562 95943 -472550 -204264 32247 -218471 -100649
$$ packed form
10158i6465l1727n2869g4833l36608c9329C5446J4976b609E3055a65154j90181
10147c55335j67349A58988K4685H7317K28856b448r7692j23215F1979d10102a29844
10135a75470c6065J0047k25373K2744b3594C3959a64444j11340P9971D5521a84710
10123b32620B32896A035L88398c9738M637F3891J50124a19131q7915B28225i2513
10111b76517A18403B9699f0510K8531B8371b8841E8700k1571d9685l1355j26499
10100b07539n9787J12184A9811K13531k1723G6725J97992b03268I0208c21157
10089b05251a4334l24424R6839A85251a04434D4160J71962a41340j70950B21744
10078b31698K5632j13823J28045m1718I5943d72550b04264C2247b18471a00649
$$ plain form
10067 -240832 135106 45617 -46194 193984 -193585 -187314 -63363 -404260 -237200 -93661 -624771
10056 -624771 -6973 97262 -17643 54016 128691 80614 23615 -107002 -103799 36678 -195040
10044 -71271 -123442 -302825 -105922 -168726 -260228 -233632 -207580 -51068 -72102 -288829 31241
10032 -243420 92630 -54750 18583 122810 5183 194405 153473 -23984 -39942 -240917 216649
10020 -20253 -25343 10915 -258461 14052 155222 55466 99981 23407 -11375 -106051 -398727
10009 -398727 10209 -202813 79913 76660 -59372 -291821 -347963 7669 38481 255591 -67665
9997 -150849 -190564 -37293 -44576 -171496 -463753 -26348 407294 75748 206314 -250954 237036
9985 165230 -189374 -164292 92124 -440869 -142989 59778 3295 35674 -6505 -98783 -192363
$$ packed form
10067b40832A35106D5617d6194A93984a93585O271f3363l40897J67060i3661n31110
10056f24771f973I7262a7643E4016P4675m8077B3615a07002L203C6678a95040
10044g1271n2171j79383a05922o2804r1502K6596K6052e1068k1034k16727C1241
10032b43420I2630e4750A8583J04227E183J89222m0932b3984j5958k00975B16649
10020b0253n090A0915b58461A4052J41170E5466M4515B3407a1375r4676k92676
10009c98727A0209b02813G9913l253e9372k32449n6142G669L0812K17110f7665
9997a50849l9715c7293p283j26920k92257b6348D07294G5748J30566b50954B37036
9985A65230a89374K5082I2124d40869a42989E9778C295L2379f505r2278r3580
$$ plain form
9974 -192363 24582 -61726 -245409 -58127 -27190 -90571 -390154 34910 176114 -162794 -156968
9963 -156968 52379 -181848 -68797 -190869 78462 -147911 -402413 63753 -258047 44832 -207070
9951 -362164 -155083 -105008 -146839 16619 -161204 106328 127272 -25609 297924 -57947 -322271
9940 -322271 -103098 116492 133221 -112243 -69404 22586 -84639 -118408 -73638 -179378 58980
9928 -275840 -230343 -231985 -282617 252484 -311770 -137624 151681 -22415 -326597 -192142 -342691
9917 -342691 -102705 -355234 -158074 -169199 315032 -190443 -86407 122120 159094 29330
9906 82351 -315441 -56756 -287691 -5837 -36597 -131304 247690 -199614 31058 337785 24887
9894 -142312 89022 10798 14948 -68796 -87112 -62678 -23552 -128957 -251109 79637 -450895
$$ packed form
9974a92363B4582f1726j83683e8127b7190o3381k99583C4910J41204a62794N826
9963a56968E2379a81848f8797j22072G8462a47911k54502F3753b58047D4832b07070
9951c62164a55083N0075m1831A6619a61204A06328K0944b5609B97924e7947k64324
9940c22271a03098A16492J6729a12243M2839B2586h4639l3769M4770j05740E8980
9928b75840M5497j642n0632B52484c11770a37624A51681b2415l04182J34455j50549
9917c42691a02705k52529a58074j1125C15032a90443h6407A22120L6974B9330
9906H2351c15441e6756k30935e837l0760r4707B47690a99614C1058L06727B4887
9894a42312H9022A0798M150f8796j8316K4434b3552j05405j22152G9637d50895
$$ plain form
9882 -151448 80998 -75425 -222464 -180589 -226339 -4816 -332186 -333010 -20720 -135586 -161476 -39435
9869 -121957 -98820 -11400 -190421 -121097 30905 152664 -107057 -266572 20035 -221752 -7575
9857 -92356 155505 13179 -406629 8874 -207037 153972 -104635 37439 -197539 178702 -160597
9845 205683 -70160 55662 -16875 111653 -299271 198644 51761 25671 73517 113598 -230281
9833 -268777 -136680 -126041 87001 -100638 59199 -200280 -49197 -61573 -132748 -125223 -71404
9822 -71404 -244614 -342715 105238 -209604 264131 -32032 -37181 -247092 -58578 -27408 -67297
9811 -67297 -243524 -490065 -277243 -106444 321146 -111856 -136910 -89513 -517624 -162512
9800 239559 -20567 -20846 -151575 -173133 -41830 -71693 208012 123500 -108084 38434 -203466
$$ packed form
9882a51448H0998g5425j47039M1875m5750d816l27370q24b0720j14866k5890c9435
9869a21957K3137a1400j79021O9324C0905J21759a07057j59515B0035b21752g575
9857i2356A55505A3179d06629H874b07037A53972a04635C7439a97539A78702a60597
9845B05683g0160E5662a6875A11653b99271A98644E1761B5671M7846M0081b30281
9833b68777J32097J0639H7001a00638E9199b00280d9197j2376p1175P525N3819
9822g1404j73210r8101A05238b09604B64131c2032n149k09911e8578b7408l9889
9811f7297j76227k46541K12822a06444C21146a11856k5054M7397m28111a62512
9800B39559b0567k79j30729k1558d1830k9863B08012q4512a08084C8434b03466
$$ plain form
9788 -42149 193780 -83483 81349 19969 -245174 -354643 61482 -171376 99209 -164024 137622
9776 82512 251608 103414 5946 225768 -156332 269855 -248020 -27982 -170759 300894
9765 68200 157421 84413 -78791 -326058 -379661 -20453 -167525 4048 -424732 -204568 -27514
9753 8774 -60446 311374 157063 -445809 -66542 19354 -352498 62662 -96957 -80618 129076
9741 -492283 -38083 -271121 16517 92851 -158552 -302363 -7344 251221 -345437 -216425 -176516
9730 -176516 -159124 136314 -89846 162323 -103744 -119990 -98954 -122181 -67716 -81212 -54525
9719 -54525 79635 -157964 -454724 -282217 -12926 36488 -35179 7154 42074 -38462 -131612
9708 -131612 410171 -144423 -199521 87311 -163903 -252549 -1871 20155 -247472 -283820 25551
$$ packed form
9788d2149A93780h3483H1349A9969b45174j09469F1482a71376I9209a64024A37622
9776H2512J69096A03414E946K19822a56332B69855b48020b7982j42777C00894
9765F8200Q9221p3008g8791k47267n3603b0453j47072D048d24732b04568b7514
9753H774f0446C11374j54311d45809f6542A9354c52498F2662i6957J6339A29076
9741d92283c8083k33038A6517P6334a58552j43811g344B51221c45437J29012L9909
9730a76516J7392A36314h9846A62323a03744j6246K1036k3227N4465j3496K6687
9719e4525G9635a57964k96760J72507a2926C6488c5179G154L4920c8462r3150
9708a31612D10171a44423n5098H7311a63903q8646a871B0155b47472l6348B5551
$$ plain form
9696 7162 -132858 -53979 -182817 -245034 -105860 169239 123644 -48395 -225073 30647 160939
9685 160939 -104410 -274968 52897 -133066 184754 122995 -148683 -123220 -440384 117412
9674 -99505 -199812 -267757 -125824 -179045 -55361 83785 -76655 -346281 47631 -225401 -353012
9663 -353012 -13536 -120561 -143643 -57972 165361 81117 -119849 -261799 -370348 -26259 -307670
9652 -307670 134920 -106500 -91530 -277196 119141 -172724 -46069 -124760 -34768 104865
9641 52400 225053 -300378 250217 -87954 -193815 -47114 -144555 -145805 50111 -18330 -67163
9630 -67163 5104 -113277 -42259 140648 -171241 124393 -165866 -47588 -271883 -36750 -502074
9619 -502074 -87151 -62636 -192010 -223020 -281350 163011 552406 -59095 -431844 -40563 -177637
$$ packed form
9696G162a32858e3979j28838o2217a05860A69239m5595d8395j76678C0647J30292
9685A60939a04410j70558E2897a33066A84754o1759a48683K5463l17164A17412
9674i9505j00307o7945a25824n3221e5361H3785g6655k69626D7631b25401j27611
9663c53012a3536j07025k3082e7972A65361H1117a19849j41950j08549b6259k81411
9652c07670A34920a06500J4970j85666A19141a72724d6069p8691c4768A04865
9641E2400J72653c00378B50217h7954j05861d7114r7441j250E0111a8330m8833
9630f7163E104a13277d2259A40648a71241A24393a65866d7588k24295c6750m65324
9619e02074h7151K4515j29374l1010n8330A63011L89395e9095l72749d0563j37074
$$ plain form
9608 -177637 123915 -45217 -79762 -173304 260904 174683 -114629 -200290 15006 -69690 -229039
9597 -229039 -31973 169601 47950 -271227 22589 -88315 100376 -116509 86143 -150285 60805
9585 136860 19343 -157943 86569 -278101 118297 -78695 -296141 229117 266098 -72556 -241633
9574 -241633 183794 -21112 -8383 -72083 -156703 -63963 -42901 163043 101364 -5521 -460686
9563 -460686 20165 -92034 -13559 -309102 -396441 -98113 -22492 -197474 -163941 -212992 -25324
9551 169024 -272621 22657 -197989 -45186 -61147 78777 190676 -577466 2824 142512 15201
9539 100537 -197836 -86799 -34186 -25783 -202288 -170761 17741 -142928 -196048 -9709 -63056
9528 -63056 -103575 -159467 115314 -87395 125781 -119413 -124637 118763 37976 -94309 -152522
$$ packed form
9608a77637A23915d5217l4545r3542B60904q6221a14629q5661A5006f9690j59349
9597b29039c1973A69601D7950b71227B2589h8315A00376a16509H6143a50285F0805
9585A36860A9343a57943H6569b78101A18297g8695k17446B29117L6981g2556j69077
9574b41633A83794b1112h383o3700q4620f3963K1062A63043o1679e521m55165
9563d60686B0165i2034a3559k95543q7339i8113b2492j74982L3533m9051b5324
9551A69024b72621B2657a97989d5186j5961G8777J11899e77466B824J39688A5201
9539A00537a97836h6799c4186Q403j76505L1527A7741a42928n3120i709n3347
9528f3056m0519n5892A15314h7395A25781a19413n224A18763C7976i4309n8213
$$ plain form
9517 -152522 -137556 14103 -303658 47444 -34683 174754 -234348 13012 -54773 -134891 -77657
9506 -77657 22110 -359595 -362459 -528563 -21231 70771 57411 5302 -91129 -251981 -165718 -294000
9494 -294000 -153031 -171359 83553 74336 -269612 -19503 -132454 -235909 -67295 -490531 -225411
9482 82275 204888 -178684 -269088 -183536 287491 11435 -133431 -94819 -81791 155566 149418
9471 149418 -186879 -184126 209538 93047 24710 275773 -402962 11844 -123187 255257 -400853
9459 -115658 -176709 10045 -146293 152711 116682 -33962 -1673 19407 -185618 192719 -421147
9447 54196 68911 58161 -9745 -173981 -137145 -97323 -252298 -58166 -318491 -257342 45043
9435 136901 -253365 -27151 291052 126470 -222718 -263356 -98743 -384290 -124345 180627
$$ packed form
9517a52522J4966A4103c03658D7444c4683A74754b34348A3012e4773q0118N7234
9506g7657B2110c59595k864j66104b1231G0771j3360E302i1129j60852Q6263j28282
9494b94000J40969j8328H3553r217b69612a9503j12951j03455f7295m23236b25411
9482H2275J22613a78684r0404Q5552B87491A1435a33431L8612J3028A55566o148
9471A49418a86879K753B09538I3047B4710K51063d02962A1844a23187B55257d00853
9459a15658o1051A0045a46293A52711l6029c3962a673A9407a85618A92719d21147
9447E4196J4715j0750i745j64236L6836L9822j54975e8166k60325O1149D5043
9435A36901b53365b7151B91052A26470b22718m0638i8743k85547a24345A80627
$$ plain form
9424 160665 -72956 -84092 60416 -83179 -63495 -263221 -116356 129442 -173795 14230 -181677
9412 223213 -180096 351505 -134574 -145871 -102734 -455549 290996 229301 91057 -336124
9401 -90035 -47177 -9970 -54641 37240 76278 -118551 168111 -286087 -218049 -146007 -81224
9390 -81224 -268559 54204 -177003 78839 -311441 -32952 173033 383924 -73965 99228 -83990
9378 213596 -256696 -45725 98153 -62956 -8540 -25888 47669 -320575 -50196 -518371 75856
9366 -237825 -119093 -176175 -141150 -141725 -113069 11598 41918 -172373 302804 94859 -43587
9354 -30984 -57892 -123566 -86675 -282826 -260740 75039 -106544 128136 -273150 -223026 -205765
9343 -205765 -26751 206538 -416835 -16214 -114340 227128 92286 -313521 248734 181253 56430
$$ packed form
9424A60665g2956j1136F0416h3179J9684j99726a16356A29442a73795A4230a81677
9412B23213a80096C51505a34574j1297M3137l52815B90996o1695I1057c36124
9401i0035M2858i970m4671C7240L9038a18551A68111b86087O8038P2042O4783
9390h1224j87335E4204a77003G8839c11441c2952A73033K10891g3965I9228h3990
9378B13596b56696d5725I8153f2956h540j7348D7669c20575e0196m68175G5856
9366b37825J18732n7082L5025n75K8656A1598L0320a72373C02804I4859d3587
9354c0984k6908o5674L6891j96151K2086G5039a06544A28136b73150N0124J7261
9343b05765b6751B06538d16835a6214r8126B27128I2286c13521B48734o7481E6430
$$ plain form
9331 -190004 130628 -62814 -80920 207018 -114457 -198825 -133249 -380820 144825 -111078
9320 34306 -50022 -54711 -8391 -142139 -302601 -27827 -242877 108844 -184040 -397248 -219919
9309 -219919 -227416 -171292 50780 -304141 -360806 24220 -377207 -68482 81357 317833 87295
9297 -230037 -261643 -57606 12374 -72098 70472 41103 227041 -32803 -26679 60322 -426212
9285 -157896 60891 82552 -102014 -116894 -232439 -34313 87009 75150 55512 -99984 -27960
9273 154750 -394954 -4294 -198525 -150688 -85585 -206247 -269250 249430 486254 207976 -312008
9261 -340473 117920 -59641 95084 -625582 167841 -403288 -171064 -184943 -347725 -339824 225828
9249 28477 -6697 -175959 20313 -434775 -282107 -54444 -115991 223064 130007 125111 41155
$$ packed form
9331a90004A30628f2814j8106B07018a14457q4368O5576k47571A44825a11078
9320C4306e0022m689h391j33748j60462b7827k15050A08844a84040k13208J77329
9309b19919p497N6124E0780c04141n6665B4220c77207f8482H1357K36476H7295
9297b30037l1606e7606A2374g2098G0472k9369J85938c2803O124F0322d26212
9285a57896F0891K1661a02014j4880j15545c4313H7009j1859j9638i9984b7960
9273A54750c94954d294j94231M7837O5103j20662o3003B49430K36824B07976c12008
9261c40473A17920e9641I5084f25582A67841d03288a71064j3879j62782P901B25828
9249B8477f697j69262B0313d34775J52668e4444o1547B23064r3057m896D1155
$$ plain form
9237 -81592 212389 65169 -195126 115089 215350 -153887 -16276 22065 -267936 150576
9226 65726 -41889 -253627 13900 41996 -59859 -194847 -184801 -121284 74360 77265 138403 -390727
9213 38809 -253046 54606 -189953 -345944 -327534 51590 -51086 6484 22958 -326265 -59799
9201 32423 -114540 -142753 -17140 403360 -332428 -58210 -1524 -193368 -66991 -122531 -231488
9190 -231488 -129072 -244262 -2318 -40103 193764 243968 20071 -202069 141513 -236978 -69438
9178 18786 -89668 -228139 -212441 193239 191555 9057 -10674 -253046 -67891 -165537 156563
9166 -192844 166673 -218354 -173519 118083 34730 213146 -192274 -51052 -20550 -211198
9156 -211198 -86378 34208 76829 -10174 -96707 17249 -185088 -279712 -27019 175920 101161
$$ packed form
9237h1592B12389F5169a95126A15089J00261a53887a6276B2065b67936A50576
9226F5726d1889k11738A3900K8096e9859j34988J0046O3517G4360K905O1138c90727
9213C8809b53046E4606a89953j55991J8410E1590e1086F484J6474c26265e9799
9201C2423a14540k8213a7140D03360c32428e8210a524j91844f6991n5540j08957
9190b31488J02416j15190b318l7785A93764N0204B0071b02069A41513b36978f9438
9178A8786h9668j38471J5698A93239j684I057a0674k42372f7891r7646A56563
9166a92844A66673b18354M4835A18083C4730J78416a92274e1052b0550j90648
9156b11198h6378C4208M2621a0174q6533A7249a85088r4624b7019A75920p4759
$$ plain form
9145 101161 98107 201750 -6010 -386129 -204786 -261815 120003 -172565 382680 -141041 67913
9133 -139794 -249202 -49130 -269673 -167730 228924 -128474 -404232 16121 -69323 13448
9122 -281049 345946 -45068 164841 70940 77163 -210945 -207324 -189186 296697 -62513 -285124
9111 -285124 22704 65229 55668 71013 191911 -138072 59502 -472266 -107467 -987 113342
9099 -96471 27988 64076 -298916 -148990 -231780 -11512 -3261 78208 325695 -312969 104253
9087 19138 18044 132932 -61647 18289 -203717 -38206 39265 97400 -50281 -56058 -105432 -170079
9075 -170079 -482782 -122831 71248 -215438 67071 -28370 -263473 200538 -87872 -19110 133640
9063 -133508 -213698 37315 -270998 400125 210101 122443 -182768 -294593 78569 293431
$$ packed form
9145A01161l054J03643f010l80119J81343n7029A20003a72565C82680a41041F7913
9133a39794j09408d9130k20543J01943B28924a28474k75758A6121f9323A3448
9122b81049C45946d5068A64841G0940O223b10945L621J8138B96697f2513k22611
9111b85124B2704M2525r561J5345J20898a38072E9502d72266a07467i87A13342
9099i6471B7988L6088b98916a48990q2790a1512c261G8208K47487c12969A04253
9087A9138j094J14888f1647A8289b03717c8206C9265N8135e0281n777m9374o4647
9075a70079l12703a22831G1248b15438F7071b8370k35103B00538h7872a9110A33640
9063a33508q0190C7315b70998D00125j90024q7658a82768j11825G8569K14862
$$ plain form
9053 293431 70726 -158975 -383197 135472 -267460 -29666 -240988 -28127 -154801 -116540
9043 -116540 -278490 -345149 4159 184334 4547 274926 66328 -89171 -188095 -69839 165654
9031 -101550 -368506 -112841 -69955 29136 199850 -310740 -134973 42514 -80981 -51068 -61362
9020 -61362 70036 26403 -301695 4330 -257592 -29898 130594 385150 93254 -141513 -212053
9009 -212053 -172307 -334554 9898 -238475 32486 203083 -258058 -41245 -386663 137292 -278864
8997 89014 -190381 -266808 81847 -119824 -256559 -305267 12503 -317178 -158684 -358890 -12611
8985 131709 -187005 -331631 -247410 -9496 -15423 -273647 77946 -358100 -345748 105216 31071
8973 -165402 27781 85657 84006 -14214 147561 -130511 183294 -62077 -85218 -301491 -199923
$$ packed form
9053B93431G0726a58975k24222A35472b67460b9666k11322b8127j26674L8261
9043a16540j61950o6659D159J80175D547K70379F6328h9171r8924f9839A65654
9031a01550k66956a12841M2886B9136J70714c10740a34973D2514h0981K9913j0294
9020f1362G0036B6403c01695D330b57592b9898A30594K54556I3254a41513p0540
9009b12053L9746j62247I898b38475C2486J70597b58058d1245l45418A37292b78864
8997H9014a90381p6427H1847a19824j36735m8708A2503c17178J58494k00206a2611
8985A31709a87005j44626Q4221i496n927k58224G7946c58100J2352A05216C1071
8973a65402B7781N7876j651a4214A47561a30511A83294f2077k3141k16273J01568
$$ plain form
8962 -199923 164048 -82215 198101 18773 -161696 -224588 161058 50411 -285189 171101
8951 -148813 174804 -173247 249176 289429 -612821 68921 -9824 -7452 -196307 114296 70578
8940 70578 -420603 110059 193412 -71050 -99947 134032 -40294 -210514 344340 76979 -49666
8928 -199379 -340719 -85300 -134779 -267799 129637 -160342 200721 162920 -313804 78819
$$ packed form
8962a99923A64048h2215A98101A8773a61696o2892A61058E0411b85189A71101
8951a48813A74804a73247B49176M0253f12821F8921i824K372j88855A14296m3718
8940G0578d20603A10059Q3353g1050k8897A34032d0294j70220C44340G6979d9666
8928a99379j41340h5300m9479j33020A29637a60342B00721l7801c13804G8819
$$ [...]
##END NTUPLES=NMR SPECTRUM
##END=
