##TITLE=AC1526_ROEFFECT0006_8213789_DTOzV0TmO8
##JCAMPDX= 6.0         $$ Bruker NMR JCAMP-DX V2.0
##DATA TYPE= NMR SPECTRUM
##DATA CLASS= NTUPLES
##ORIGIN= BRUKER
##OWNER= Administrator
$$ 1.72 TOPSPIN		Version 2.1
$$ 2014-08-04 22:58:14.855 -0700  Administrator@X
$$ Compression mode = diff/dup
##.OBSERVE FREQUENCY= 400.02188249412
##.OBSERVE NUCLEUS= ^1H
##.ACQUISITION MODE= SIMULTANEOUS (DQD)
##.ACQUISITION SCHEME= undefined
##.AVERAGES= 64
##.DIGITISER RES= 22
##SPECTROMETER/DATA SYSTEM= spect
##.PULSE SEQUENCE= noesygpps1d.comp
##.SOLVENT NAME= COFFEE_meoh
##.SHIFT REFERENCE= INTERNAL, COFFEE_meoh, 1, 14.97807
##AUDIT TRAIL= $$ (NUMBER, WHEN, WHO, WHERE, PROCESS, VERSION, WHAT)
$$ ##TITLE= Audit trail, TOPSPIN		Version 2.1
$$ ##JCAMPDX= 5.01
$$ ##ORIGIN= Bruker BioSpin GmbH
$$ ##OWNER= Administrator
$$ $$ E:\/data/COFFEE/nmr/AC1526_ROEFFECT0006_8213789_DTOzV0TmO8/42/pdata/1/auditp.txt
$$ ##AUDIT TRAIL=  $$ (NUMBER, WHEN, WHO, WHERE, PROCESS, VERSION, WHAT)
(   1,<2014-08-04 22:58:09.355 -0700>,<Administrator>,<X>,<go>,<TOPSPIN 2.1>,
      <created by zg
	started at 2014-08-04 22:46:38.138 -0700,
	POWCHK enabled, PULCHK disabled,
       configuration hash MD5:
       16 EA D6 F4 BB 67 03 14 9B FF E7 A0 43 5B 48 2E
       data hash MD5: 64K
       1B 15 6F 01 D0 1A F8 97 8C 37 6B 1F 03 16 82 61>)
(   2,<2014-08-04 22:58:12.527 -0700>,<Administrator>,<X>,<proc1d>,<TOPSPIN 2.1>,
      <Start of raw data processing
       efp LB = 0.3 FT_mod = 6 PKNL = 1 PHC0 = 0 PHC1 = 0 SI = 128K 
       data hash MD5: 128K
       70 73 E3 8A 86 98 BB 10 09 75 1B 96 FD 82 12 4B>)
(   3,<2014-08-04 22:58:13.527 -0700>,<Administrator>,<X>,<proc1d>,<TOPSPIN 2.1>,
      <pk PHC0 = -85.35278 PHC1 = 0 
       data hash MD5: 128K
       EF E0 A1 EE 8D 2A 3B BF 91 C1 2C 87 76 95 A5 DC>)
(   4,<2014-08-04 22:58:14.043 -0700>,<Administrator>,<X>,<proc1d>,<TOPSPIN 2.1>,
      <abs ABSG = 1 
       data hash MD5: 128K
       8A 0E F6 7F FF 3A 6D 60 00 D9 57 AA 6E 26 87 7B>)
(   5,<2014-08-04 22:58:14.152 -0700>,<Administrator>,<X>,<proc1d>,<TOPSPIN 2.1>,
      <abs ABSG = 2 
       data hash MD5: 128K
       C1 10 05 14 99 F0 0D 5B 7A E6 0C A4 B6 98 1A 5E>)
(   6,<2014-08-04 22:58:14.308 -0700>,<Administrator>,<X>,<proc1d>,<TOPSPIN 2.1>,
      <abs ABSG = 3 
       data hash MD5: 128K
       12 02 7E 52 B9 32 7A EA BF 79 E4 E8 1F 0F 34 47>)
(   7,<2014-08-04 22:58:14.449 -0700>,<Administrator>,<X>,<proc1d>,<TOPSPIN 2.1>,
      <abs ABSG = 4 
       data hash MD5: 128K
       43 C7 48 1A 62 69 1D 0D 4A 0E B6 9A 3C 8E D7 7B>)
(   8,<2014-08-04 22:58:14.558 -0700>,<Administrator>,<X>,<proc1d>,<TOPSPIN 2.1>,
      <abs ABSG = 5 
       data hash MD5: 128K
       C7 97 E3 54 85 51 1C F3 1A 95 EF 09 74 F7 13 BC>)
$$ ##END=
$$ 
$$ $$ hash MD5
$$ $$ 2D 17 DC 08 A3 1E 69 85 4F 16 6A F5 31 A0 11 8A
##$RELAX= 
##$RELAX= 
##$RELAX= 
##$RELAX= 
##$RELAX= 
##$RELAX= 
##$RELAX= 
##$RELAX= 
$$ Bruker specific parameters
$$ --------------------------
##$DU= <E:\>
##$EXPNO= 42
$$ [...]
##$TP07= 0
##$TPNAME0= <>
##$TPNAME1= <>
##$TPNAME2= <>
##$TPNAME3= <>
##$TPNAME4= <>
##$TPNAME5= <>
##$TPNAME6= <>
##$TPNAME7= <>
##$TPOAL= (0..7)
0.5 0.5 0.5 0.5 0.5 0.5 0.5 0.5
##$TPOFFS= (0..7)
0 0 0 0 0 0 0 0
##$TUNHIN= 0
##$TUNHOUT= 0
##$TUNXOUT= 0
##$USERA1= <user>
##$USERA2= <user>
##$USERA3= <user>
##$USERA4= <user>
##$USERA5= <user>
##$V9= 5
##$VALIST= <valist>
##$VCLIST= <CCCCCCCCCCCCCCC>
##$VD= 0
##$VDLIST= <DDDDDDDDDDDDDDD>
##$VPLIST= <PPPPPPPPPPPPPPP>
##$VTLIST= <TTTTTTTTTTTTTTT>
##$WBST= 1024
##$WBSW= 4
##$XGAIN= (0..3)
0 0 0 0
##$XL= 0
##$YL= 0
##$YMAX_a= 29914432
##$YMIN_a= -42240592
##$ZGOPTNS= <>
##$ZL1= 120
##$ZL2= 120
##$ZL3= 120
##$ZL4= 120
##$ABSF1= 14.97807
##$ABSF2= -5.580112
##$ABSG= 5
##$ABSL= 3
##$ALPHA= 0
##$AQORDER= 0
##$ASSFAC= 0
##$ASSFACI= 0
##$ASSFACX= 0
##$ASSWID= 0
##$AUNMP= <proc_prof1d_extract.lims>
##$AXLEFT= 0
##$AXNAME= <>
##$AXNUC= <1H>
##$AXRIGHT= 0
##$AXTYPE= 0
##$AXUNIT= <>
##$AZFE= 0.1
##$AZFW= 0.1
##$BCFW= 0
##$BC_mod= 0
##$BYTORDP= 0
##$COROFFS= 0
##$CY= 15
##$DATMOD= 1
##$DC= 0
##$DFILT= <>
##$DTYPP= 0
##$F1P= 0
##$F2P= 0
##$FCOR= 0.5
##$FTSIZE= 131072
##$FT_mod= 6
##$GAMMA= 0
##$GB= 0
##$INTBC= 1
##$INTSCL= 1
##$ISEN= 128
##$LB= 0.3
##$LEV0= 0
##$LPBIN= 0
##$MAXI= 10000
##$MC2= 0
##$MEAN= 0
##$ME_mod= 0
##$MI= 0
##$NCOEF= 0
##$NC_proc= -2
##$NLEV= 6
##$NOISF1= 0
##$NOISF2= 0
##$NSP= 0
##$NTH_PI= 0
##$NZP= 0
##$OFFSET= 14.97807
##$PC= 1
##$PHC0= -85.35278
##$PHC1= 0
##$PH_mod= 1
##$PKNL= yes
##$PPARMOD= 0
##$PPDIAG= 0
##$PPIPTYP= 0
##$PPMPNUM= 2147483647
##$PPRESOL= 1
##$PSCAL= 4
##$PSIGN= 0
##$PYNMP= <proc.py>
##$REVERSE= no
##$SF= 400.020002807198
##$SI= 131072
##$SIGF1= 0
##$SIGF2= 0
##$SINO= 400
##$SIOLD= 131072
##$SPECTYP= <>
##$SREGLST= <1H.CDCl3>
##$SSB= 0
##$STSI= 131072
##$STSR= 0
##$SW_p= 8223.68421052631
##$SYMM= 0
##$S_DEV= 0
##$TDeff= 65536
##$TDoff= 0
##$TI= <>
##$TILT= no
##$TM1= 0
##$TM2= 0
##$TOPLEV= 0
##$USERP1= <user>
##$USERP2= <user>
##$USERP3= <user>
##$USERP4= <user>
##$USERP5= <user>
##$WDW= 1
##$XDIM= 131072
##$YMAX_p= 163820107
##$YMIN_p= -280982170
##$CURPLOT= <Network HP LaserJet P1505>
##$CURPRIN= <$Network HP LaserJet P1505>
##$DFORMAT= <normdp>
##$LAYOUT= <+/1D_H.xwp>
##$LFORMAT= <normlp>
##$PFORMAT= <normpl>
##$SURQMSG= 1
$$ End of Bruker specific parameters
$$ ---------------------------------
##NTUPLES= NMR SPECTRUM
##VAR_NAME=  FREQUENCY,     SPECTRUM/REAL,   SPECTRUM/IMAG
##SYMBOL=    X,             R,               I
##VAR_TYPE=  INDEPENDENT,   DEPENDENT,       DEPENDENT
##VAR_FORM=  AFFN,          ASDF,            ASDF
##VAR_DIM=   131072,        131072,          131072
##UNITS=     HZ,            ARBITRARY UNITS, ARBITRARY UNITS
##FACTOR=    0.0627417313425164, 1,          1
##FIRST=     8223.62146879497, 23181,        -130997
##LAST=      0,             -16699,          -131705
##MIN=       0,             -280982170,      0
##MAX=       8223.62146879497, 163820107,    0
$$ Real data points
##PAGE= N=1
##DATA TABLE= (X++(R..R)), XYDATA
$$ [...]
66192 3105455 3110986 3116166 3121917 3128637 3135605 3141819 3147152 3152332 3157978 3163993 3169938 3175700 3181639 3188069
66178 3188069 3194759 3201140 3207089 3213304 3220609 3228944 3237295 3244674 3251032 3257163 3263874 3271255 3278678 3285500
66164 3285500 3291813 3298401 3305784 3313585 3321037 3327973 3334824 3341782 3348587 3355186 3362038 3369395 3376742 3383388
66150 3383388 3389388 3395478 3402257 3409790 3417810 3425881 3433388 3439838 3445382 3450777 3456720 3463347 3470416 3477706
66136 3477706 3485090 3492428 3499621 3506720 3513831 3520907 3527687 3533878 3539410 3544572 3549980 3556252 3563557 3571411
66122 3571411 3579056 3586119 3592832 3599625 3606597 3613522 3620248 3626866 3633485 3640050 3646497 3652941 3659612 3666693
66108 3666693 3674282 3682325 3690454 3698127 3705154 3712016 3719378 3727388 3735658 3743773 3751505 3758634 3765049 3771144
66094 3771144 3777680 3785057 3792959 3800877 3808603 3816057 3823033 3829522 3836042 3843112 3850477 3857282 3863175 3868831
66080 3868831 3875233 3882649 3890507 3898161 3905470 3912654 3919778 3926642 3933243 3940058 3947653 3955973 3964359 3972287
66066 3972287 3979829 3987281 3994646 4001790 4008853 4016099 4023499 4030770 4037853 4045012 4052504 4060339 4068358 4076280
66052 4076280 4083739 4090658 4097551 4105083 4113193 4121094 4128252 4135062 4142280 4150128 4158227 4166113 4173535 4180490
66038 4180490 4187307 4194574 4202586 4210981 4219212 4227216 4235268 4243343 4251173 4258871 4266907 4275312 4283488 4291112
66024 4291112 4298637 4306509 4314365 4321666 4328744 4336416 4344647 4352407 4359079 4365286 4371945 4379148 4386506 4394045
66010 4394045 4401982 4409906 4417034 4423395 4430026 4437681 4445905 4453693 4460660 4467173 4473717 4480622 4488194 4496513
65996 4496513 4505050 4512987 4520103 4527136 4535054 4544116 4553692 4562889 4571258 4578995 4586576 4594199 4601664 4608823
65982 4608823 4615968 4623594 4631797 4640170 4648266 4655943 4663187 4669902 4676048 4681858 4687738 4693999 4700827 4708329
65968 4708329 4716414 4724664 4732550 4739917 4747175 4754933 4763388 4772111 4780422 4787993 4795094 4802257 4809781 4817559
65954 4817559 4825317 4832908 4840376 4847872 4855555 4863567 4872015 4880893 4889908 4898460 4906083 4913066 4920401 4928801
65940 4928801 4937904 4946741 4954873 4962648 4970389 4977904 4985029 4992168 4999862 5008024 5016109 5023840 5031367 5038721
65926 5038721 5045630 5051996 5058247 5065016 5072671 5081251 5090611 5100459 5110341 5119811 5128600 5136637 5144003 5150903
65912 5150903 5157589 5164302 5171353 5179232 5188279 5198145 5207822 5216514 5224366 5232099 5240041 5247882 5255356 5262717
65898 5262717 5270339 5278092 5285518 5292500 5299489 5307051 5315403 5324456 5333995 5343646 5352770 5360649 5366991 5372301
65884 5372301 5377747 5384454 5392593 5401190 5409071 5416064 5423013 5430551 5438312 5445641 5452630 5459872 5467459 5474881
65870 5474881 5481944 5489081 5496539 5503849 5510503 5516689 5522943 5529509 5536518 5544432 5553585 5563307 5572151 5579271
65856 5579271 5585288 5591654 5599325 5608094 5616961 5625159 5632905 5641112 5650173 5659294 5667349 5674272 5681116 5688714
65842 5688714 5696898 5705073 5713063 5720993 5728844 5736588 5744569 5753325 5762967 5772996 5782672 5791486 5799411 5806918
65828 5806918 5814708 5823204 5832329 5841818 5851594 5861644 5871632 5880942 5889176 5896600 5904013 5912149 5921087 5930161
65814 5930161 5938612 5946299 5953692 5961174 5968631 5975798 5982708 5989644 5996811 6004272 6012022 6019950 6027861 6035690
65800 6035690 6043542 6051375 6058853 6065717 6072087 6078151 6083783 6088823 6093587 6098790 6104909 6111878 6119318 6126811
65786 6126811 6133997 6140675 6146906 6152910 6158964 6165360 6172228 6179225 6185729 6191678 6197836 6204798 6212105 6218936
65772 6218936 6225429 6232476 6240330 6248225 6255586 6262762 6270222 6277722 6284773 6291346 6297581 6303320 6308543 6313938
65758 6313938 6320350 6327868 6335966 6344295 6352749 6360885 6368045 6374166 6380005 6386392 6393541 6401043 6408203 6414464
65744 6414464 6419938 6425549 6432134 6439443 6446492 6452921 6459433 6466734 6474647 6482593 6490383 6498148 6505899 6513608
65730 6513608 6521372 6529110 6536405 6543143 6549966 6557488 6565378 6572826 6579798 6587004 6594658 6602019 6608454 6614252
65716 6614252 6619974 6625549 6630558 6635062 6639647 6644850 6650941 6657989 6665720 6673505 6681017 6688757 6697463 6707058
65702 6707058 6716605 6725256 6732740 6739022 6744141 6748567 6753128 6758297 6763913 6769724 6775761 6781936 6787909 6793736
65688 6793736 6800113 6807499 6815348 6822738 6829396 6835618 6841555 6847214 6852943 6859139 6865631 6872073 6878816 6886508
65674 6886508 6894760 6902204 6908277 6914094 6920914 6928423 6935242 6940879 6946379 6953083 6961331 6970464 6979685 6988729
65660 6988729 6997896 7007584 7017826 7028357 7039086 7050248 7062009 7074170 7086366 7098286 7109625 7120155
65648 7120155 7130095 7140006 7150095 7159862 7168702 7176488 7183287 7188977 7193592 7197674 7201714 7205490 7208527 7210938
65634 7210938 7213223 7215359 7216911 7218068 7219852 7223033 7227266 7231578 7235274 7238278 7240943 7243798 7247073 7250373
65620 7250373 7253154 7255572 7258428 7262113 7266156 7270025 7273820 7277809 7281813 7285618 7289611 7294391 7299860 7305334
65606 7305334 7310499 7315668 7321050 7326265 7330929 7335280 7339896 7344943 7350087 7355099 7360221 7365825 7371917 7378190
65592 7378190 7384465 7390822 7397275 7403586 7409561 7415374 7421440 7428060 7435390 7443568 7452615 7462336 7472550 7483290
65578 7483290 7494536 7505902 7516965 7527783 7538704 7549715 7560534 7571250 7582263 7593417 7603857
65567 7603857 7613069 7621572 7630174 7639027 7647867 7656746 7665968 7675472 7684816 7693640 7701777 7709103 7715720 7722095
65553 7722095 7728563 7734829 7740408 7745462 7750658 7756167 7761346 7765467 7768375 7770305 7771430 7771812 7771509 7770656 7769544
65538 7769544 7768587 7767918 7767183 7766133 7765340 7765750 7767452 7769458 7770832 7771538 7771955 7772226 7772606 7773802 7776301 7779542
65522 7779542 7782530 7785162 7788278 7792297 7796428 7799594 7801669 7803455 7805638 7808164 7810576 7812636 7814574 7816854
65508 7816854 7819769 7823196 7826767 7830274 7833775 7837311 7840695 7843818 7846993 7850691 7854952 7859364 7863668 7868050
65494 7868050 7872720 7877478 7882008 7886326 7890675 7895126 7899641 7904407 7909771 7915899 7922834 7930738 7939616 7948849
65480 7948849 7957705 7966386 7975945 7986816 7998020 8008273 8017335 8025734 8033627 8040756 8047204 8053329 8058861
65467 8058861 8062943 8065340 8066935 8068698 8070561 8071689 8071524 8070261 8068559 8067123 8066459 8066698 8067671 8069132 8070835
65452 8070835 8072359 8073215 8073251 8072849 8072631 8073072 8074341 8076109 8077551 8077928 8077427 8077137 8078016 8080152 8083082 8086401
65436 8086401 8089767 8092710 8094913 8096489 8097755 8098878 8100028 8101587 8103782 8106239 8108325 8109850 8111156 8112631
65422 8112631 8114394 8116384 8118455 8120405 8122218 8124146 8126377 8128759 8131167 8133883 8137220 8140878 8144176 8146814
65408 8146814 8148949 8150586 8151557 8152219 8153561 8156274 8160102 8164339 8168539 8172408 8175502 8177584 8179080 8180676
65394 8180676 8182566 8184449 8186180 8188021 8190233 8192799 8195594 8198581 8201721 8204892 8207948 8210667 8212735 8214051
65380 8214051 8215172 8217097 8220326 8224260 8227737 8230129 8231775 8233364 8235108 8236645 8237649 8238305 8239053 8240023 8240994
65365 8240994 8241943 8243280 8245257 8247363 8248791 8249460 8250206 8251751 8253918 8256097 8258200 8260651 8263525 8266193 8267983
65350 8267983 8268937 8269681 8270744 8272153 8273644 8275009 8276218 8277315 8278338 8279426 8280893 8283042 8285729 8288280
65336 8288280 8290097 8291348 8292831 8295062 8297734 8300144 8301912 8303096 8303840 8304267 8304570 8304923 8305295 8305646 8306248 8307524
65320 8307524 8309475 8311600 8313473 8315114 8316631 8317794 8318340 8318511 8318916 8319832 8320897 8321573 8321679 8321378 8320869 8320385
65304 8320385 8320413 8321590 8324183 8327688 8331185 8334153 8336869 8339903 8343240 8346098 8347613 8347659 8346962 8346495 8346806 8347794
65288 8347794 8349002 8350096 8351104 8352200 8353409 8354572 8355576 8356424 8357073 8357372 8357236 8356726 8355906 8354824 8353760
65273 8353760 8353257 8353646 8354671 8355837 8357015 8358446 8360230 8362203 8364301 8366652 8369177 8371458 8373330 8375291
65259 8375291 8377963 8381216 8384237 8386475 8388208 8390130 8392594 8395407 8398113 8400285 8401683 8402396 8402850 8403539 8404702
65244 8404702 8406180 8407531 8408246 8408092 8407358 8406687 8406467 8406410 8405878 8404539 8402599 8400480 8398556 8397142 8396364 8395919
65228 8395919 8395243 8394124 8392951 8392100 8391255 8389670 8387135 8384412 8382640 8382272 8382662 8382559 8381078 8378285 8374961
65213 8374961 8371865 8369260 8367085 8365285 8363861 8362753 8361793 8360718 8359219 8357283 8355519 8354732 8354893 8354882 8353741
65198 8353741 8351954 8350881 8351075 8351799 8352289 8352779 8353889 8355560 8357115 8358095 8358553 8358645 8358340 8357515 8356069 8353945
65182 8353945 8351315 8348647 8346388 8344605 8343096 8341792 8340812 8340162 8339555 8338638 8337228 8335333 8333157 8331081 8329505
65167 8329505 8328542 8327898 8327179 8326337 8325684 8325381 8325038 8324089 8322651 8321620 8321669 8322367 8322691 8322217 8321321 8320299 8318961
65150 8318961 8317266 8315737 8314773 8313946 8312448 8310065 8307359 8305035 8303402 8302273 8301070 8299272 8297015 8295007
65136 8295007 8293607 8292282 8290445 8288458 8287205 8286720 8285937 8283929 8280913 8277824 8275337 8273539 8272220 8271173
65122 8271173 8270196 8269029 8267352 8264933 8261948 8258976 8256492 8254360 8252026 8249152 8245896 8242726 8240144 8238452
65108 8238452 8237452 8236474 8235015 8233289 8231842 8230753 8229637 8228355 8227213 8226341 8225314 8223573 8220993 8217947
65094 8217947 8214988 8212491 8210301 8207818 8204711 8201514 8199081 8197538 8196235 8194697 8193039 8191322 8189186 8186421
65080 8186421 8183392 8180504 8177622 8174424 8170960 8167567 8164456 8161759 8159610 8157885 8156112 8154028 8151975 8150394
65066 8150394 8149158 8147833 8146405 8145247 8144409 8143352 8141429 8138459 8134849 8131382 8128774 8127199 8126202 8125234 8124175
65051 8124175 8123149 8122004 8120279 8117726 8114666 8111790 8109608 8108072 8106744 8105344 8104071 8103141 8102188 8100529
65037 8100529 8098072 8095484 8093365 8091736 8090442 8089499 8088634 8087115 8084557 8081546 8078961 8076991 8075308 8073781
65023 8073781 8072435 8070955 8068931 8066393 8063567 8060356 8056745 8053440 8051197 8049573 8047196 8043437 8039011 8034742
65009 8034742 8030569 8026135 8021650 8017564 8013943 8010594 8007450 8004382 8000985 7996991 7992651 7988357 7984171 7980071
64995 7980071 7976277 7972904 7969481 7965342 7960444 7955449 7950999 7947186 7943746 7940471 7937337 7934332 7931232 7927664
64981 7927664 7923534 7919324 7915634 7912437 7909097 7905323 7901632 7898670 7896397 7894281 7891988 7889505 7886834 7883958
64967 7883958 7880944 7877756 7874154 7870177 7866507 7863822 7861833 7859527 7856380 7852843 7849510 7846291 7842728 7838816
64953 7838816 7835162 7832331 7830239 7828109 7825082 7820947 7816294 7811811 7807475 7802734 7797462 7792328 7788006 7784359
64939 7784359 7780712 7776694 7772469 7768198 7763736 7758955 7754044 7749257 7744581 7739841 7735080 7730607 7726682 7723331
64925 7723331 7720442 7717771 7714760 7710689 7705328 7699364 7693926 7689585 7686055 7682843 7679865 7677207 7674627 7671680
64911 7671680 7668294 7664917 7661938 7659191 7656158 7652635 7649030 7645976 7643615 7641316 7638208 7634015 7629329 7624982
64897 7624982 7621287 7617909 7614349 7610332 7605864 7601195 7596784 7593097 7590244 7587866 7585428 7582602 7579377 7575911
64883 7575911 7572376 7568803 7565076 7561067 7556799 7552288 7547287 7541439 7534891 7528570 7523474 7519749 7516742 7513929
64869 7513929 7511309 7508765 7505594 7501224 7496148 7491479 7487624 7483892 7479595 7474884 7470238 7465643 7460845 7456015
64855 7456015 7451500 7447124 7442375 7437265 7432301 7427530 7422302 7416323 7410339 7405313 7401311 7397669 7393973 7390236
64841 7390236 7386337 7381880 7376769 7371436 7366274 7361184 7355872 7350398 7345194 7340590 7336449 7332322 7327893 7323227
64827 7323227 7318545 7313841 7308920 7303904 7299409 7295923 7293086 7289879 7285464 7279752 7273221 7266527 7260289 7254906
64813 7254906 7250402 7246523 7243103 7240123 7237464 7234787 7231809 7228512 7224991 7221257 7217380 7213724 7210796 7208847
64799 7208847 7207630 7206591 7205217 7203305 7201005 7198715 7196866 7195575 7194357 7192242 7188520 7183502 7178356 7173866
64785 7173866 7169558 7164319 7157788 7150716 7143966 7137663 7131533 7125671 7120428 7115664 7110609 7104629 7098005 7091759
64771 7091759 7086723 7082747 7078873 7074259 7069021 7064059 7060032 7056631 7052939 7048363 7043045 7037497 7032007 7026485
64757 7026485 7020705 7014576 7008186 7001627 6994937 6988264 6982028 6976611 6971806 6966820 6961051 6954749 6948619 6942914
64743 6942914 6937229 6931279 6925474 6920513 6916539 6912966 6909095 6904695 6899943 6894948 6889532 6883470 6876886 6870305
64729 6870305 6864315 6859230 6855026 6851476 6848203 6844715 6840650 6836103 6831553 6827372 6823465 6819477 6815285 6811066
64715 6811066 6807012 6803092 6799198 6795296 6791380 6787302 6782805 6777696 6772025 6766152 6760664 6756054 6752294 6748797
64701 6748797 6744891 6740371 6735463 6730343 6724945 6719244 6713494 6707971 6702665 6697396 6692200 6687337 6682834 6678225
64687 6678225 6672880 6666666 6660185 6654375 6649754 6646069 6642640 6639002 6635125 6631044 6626521 6621279 6615447 6609550
64673 6609550 6604050 6599037 6594327 6589676 6584888 6580005 6575471 6571939 6569731 6568539 6567712 6566656 6564927 6562151
64659 6562151 6558236 6553678 6549457 6546372 6544396 6542716 6540420 6537122 6532877 6527638 6521148 6513572 6505907 6499288
64645 6499288 6493829 6488523 6482368 6475281 6467872 6460786 6454480 6449122 6444252 6438879 6432454 6425560 6419225 6413720
64631 6413720 6408508 6403252 6398193 6393531 6389082 6384774 6380903 6377586 6374354 6370626 6366301 6361551 6356410 6350929
64617 6350929 6345477 6340420 6335638 6330709 6325480 6320160 6314932 6309764 6304516 6299030 6293167 6286995 6280754 6274450
64603 6274450 6267758 6260602 6253561 6247159 6241008 6234196 6226556 6218898 6211963 6205694 6199728 6194067 6188973 6184521
64589 6184521 6180468 6176294 6171310 6165226 6158768 6153215 6148942 6144897 6139925 6134087 6128193 6122514 6116770 6111118
64575 6111118 6106273 6102508 6099207 6095634 6091604 6087221 6082455 6077311 6072032 6066815 6061521 6055939 6050101 6044066
64561 6044066 6037656 6030718 6023580 6016919 6011155 6006146 6001486 5996935 5992478 5988080 5983452 5978250 5972488 5966702
64547 5966702 5961535 5957256 5953752 5950811 5948142 5945234 5941680 5937681 5933831 5930238 5926217 5921120 5915163 5909197
64533 5909197 5903879 5899390 5895633 5892268 5888718 5884566 5880006 5875586 5871471 5867216 5862261 5856412 5849909 5843302
64519 5843302 5837217 5831848 5826613 5820657 5813847 5806902 5800383 5793935 5786838 5779062 5771303 5764110 5757344 5750576
64505 5750576 5743681 5736899 5730577 5725000 5720310 5716261 5712089 5706916 5700524 5693661 5687465 5682530 5678578 5675031
64491 5675031 5671660 5668608 5665947 5663494 5661039 5658522 5655883 5652940 5649633 5646233 5643098 5640222 5637284 5634132
64477 5634132 5630983 5627883 5624200 5619101 5612666 5606184 5600949 5596806 5592285 5586248 5579066 5571973 5565606 5559518
64463 5559518 5552986 5545797 5538232 5530681 5523493 5516842 5510516 5504013 5497102 5490104 5483446 5477178 5471119 5465275
64449 5465275 5459668 5453935 5447582 5440768 5434304 5428720 5423677 5418579 5413443 5408723 5404477 5400170 5395334 5390077
64435 5390077 5384774 5379543 5374149 5368370 5362285 5356275 5350713 5345607 5340537 5335024 5328938 5322477 5315862 5309226
64421 5309226 5302783 5296754 5291026 5285110 5278651 5271881 5265431 5259782 5254982 5250780 5246816 5242725 5238239 5233353
64407 5233353 5228384 5223756 5219599 5215509 5210912 5205794 5200867 5196666 5192671 5187779 5181700 5175290 5169359 5163769
64393 5163769 5158103 5152627 5147895 5143748 5139423 5134603 5129661 5124935 5120361 5115958 5111973 5108298 5104230 5099083
64379 5099083 5092784 5085792 5078846 5072767 5067859 5063246 5057467 5050119 5042395 5035632 5029861 5024308 5018713 5013453
64365 5013453 5008741 5004541 5001035 4998305 4995576 4991588 4985959 4979476 4972930 4966276 4959261 4952222 4945805 4940203
64351 4940203 4935120 4930181 4925056 4919442 4913314 4907125 4901427 4896314 4891368 4886049 4880054 4873454 4866701 4860306
64337 4860306 4854366 4848540 4842663 4837138 4832465 4828522 4824675 4820533 4816250 4812048 4807717 4802834 4797360 4791844
64323 4791844 4787051 4783484 4781209 4779991 4779459 4779180 4778856 4778617 4779006 4780372 4782283 4783808 4784577 4785315 4787095 4790129
64307 4790129 4793509 4796167 4797848 4799079 4800297 4801202 4801037 4799337 4796268 4792180 4787167 4781232 4774758 4768381
64293 4768381 4762290 4755835 4748075 4738572 4727597 4715739 4703558 4691646 4680744 4671512 4663967 4657222 4650002
64280 4650002 4641642 4632533 4623521 4615045 4607081 4599720 4593215 4587365 4581391 4574816 4568141 4562219 4557085 4551894
64266 4551894 4546010 4539667 4533466 4527539 4521557 4515303 4508973 4502866 4497057 4491421 4485832 4480222 4474479 4468498
64252 4468498 4462337 4456310 4450834 4446149 4442065 4437935 4432926 4426630 4419482 4412429 4406052 4400186 4394476 4388993
64238 4388993 4383960 4379094 4373805 4368057 4362481 4357451 4352560 4347352 4342083 4337307 4332948 4328363 4323243 4317969
64224 4317969 4312958 4308105 4303021 4297584 4292055 4286818 4282079 4277717 4273443 4269216 4265424 4262330 4259354 4255361
64210 4255361 4249841 4243523 4237460 4231755 4225609 4218589 4211367 4204991 4199658 4194539 4188757 4182272 4175740 4169710
64196 4169710 4164200 4159005 4154135 4149741 4145715 4141654 4137236 4132476 4127509 4122373 4117186 4112362 4108243 4104531
64182 4104531 4100457 4095805 4091419 4088269 4086127 4083627 4079784 4075029 4070528 4066789 4063340 4059528 4055197 4050567
64168 4050567 4045843 4041157 4036648 4032421 4028468 4024712 4021005 4017069 4012553 4007297 4001466 3995405 3989392 3983515
64154 3983515 3977738 3972050 3966512 3961057 3955335 3948981 3942159 3935529 3929486 3923704 3917761 3911908 3906733 3902226
64140 3902226 3897787 3893158 3888755 3884922 3881414 3877827 3874072 3870102 3865700 3860835 3855882 3851117 3846316 3841117
64126 3841117 3835470 3829465 3823200 3817153 3812130 3808268 3804446 3799444 3793421 3787640 3782869 3778844 3775084 3771370
64112 3771370 3767264 3762092 3755833 3749439 3743769 3738657 3733499 3728327 3723723 3719854 3716192 3712209 3707971 3703925
64098 3703925 3700370 3697248 3694301 3691305 3688221 3685223 3682554 3680370 3678627 3677109 3675505 3673461 3670656 3666961
64084 3666961 3662662 3658376 3654453 3650492 3645766 3640166 3634356 3628909 3623712 3618537 3613611 3609105 3604429 3598805
64070 3598805 3592347 3585943 3580099 3574590 3569256 3564303 3559663 3554753 3549312 3543930 3539297 3535339 3531551 3527780
64056 3527780 3524201 3520745 3517042 3512912 3508534 3504134 3499697 3494989 3489784 3484185 3478718 3473928 3469771 3465720
64042 3465720 3461478 3457261 3453335 3449682 3446295 3443274 3440428 3437193 3433305 3429110 3424928 3420601 3416091 3411949
64028 3411949 3408463 3404825 3399979 3394214 3389052 3385497 3383027 3380470 3377242 3373520 3369745 3366304 3363382 3360811
64014 3360811 3358271 3355690 3353248 3350918 3348424 3345739 3343280 3341364 3339700 3337674 3334983 3331861 3328809 3326286
64000 3326286 3324448 3323051 3321579 3319552 3316737 3313218 3309502 3306294 3303863 3301625 3298752 3295133 3291387 3287894
63986 3287894 3284338 3280368 3276204 3272241 3268362 3264074 3259174 3254001 3249084 3244766 3241004 3237435 3233684 3229794
63972 3229794 3226187 3223042 3219957 3216377 3212167 3207531 3202612 3197461 3192289 3187391 3182861 3178554 3174307 3170033
63958 3170033 3165668 3161296 3157224 3153706 3150634 3147685 3144700 3141745 3138899 3136206 3133786 3131740 3130031 3128676
63944 3128676 3127881 3127613 3127207 3125896 3123860 3122198 3121604 3121480 3120687 3118895 3116717 3114700 3112613 3109834 3106137
63929 3106137 3101986 3098150 3095105 3092746 3090616 3088328 3085620 3082153 3077681 3072558 3067617 3063223 3058678 3053076
63915 3053076 3046519 3039998 3034135 3028590 3022830 3016934 3011396 3006534 3002359 2998631 2994800 2990247 2984988 2979865
63901 2979865 2975663 2972265 2968990 2965569 2962237 2959056 2955646 2951695 2947294 2942767 2938460 2934741 2931797 2929385
63887 2929385 2927059 2924633 2922109 2919212 2915536 2911270 2907294 2904316 2902335 2901044 2900276 2899816 2899283 2898637 2898335
63872 2898335 2898524 2898496 2897542 2896027 2894989 2894798 2894903 2894846 2894898 2895554 2896937 2898966 2901688 2905227 2909645 2915058 2921626
63855 2921626 2929357 2938210 2948521 2961004 2976147 2993807 3013622 3035699 3060809 3090075 3124419 3164087
63843 3164087 3208523 3256932 3309000 3364940 3424827 3488184 3554291 3622494 3691991 3761547 3829674
63832 3829674 3895014 3956490 4013342 4065140 4111487 4151617 4184543 4209778 4227530 4237976 4240732
63821 4240732 4235443 4222659 4203662 4179593 4151077 4118596 4082725 4044019 4003012 3960414 3917036
63810 3917036 3873493 3830224 3787754 3746657 3707175 3669210 3632709 3597836 3564741 3533481 3504270
63799 3504270 3477525 3453426 3431557 3411136 3391532 3372592 3354576 3337824 3322301 3307485 3292824
63788 3292824 3278371 3264757 3252542 3241785 3232226 3223589 3215673 3208468 3202359 3197893 3195134 3193541 3192711
63775 3192711 3193020 3195088 3198801 3203371 3208390 3214332 3221780 3230520 3239879 3249880 3261567 3275948 3292800
63762 3292800 3310846 3329098 3347608 3366816 3386533 3406061 3425079 3443762 3461886 3478503 3492909
63751 3492909 3505505 3517084 3527520 3535804 3541340 3544505 3545742 3544770 3541070 3534644 3525743 3514218 3499822
63738 3499822 3483151 3465605 3448104 3430195 3410727 3389185 3366140 3342571 3319047 3295613 3272153
63727 3272153 3248728 3225563 3202834 3180541 3158642 3137266 3116701 3097141 3078512 3060589 3043146
63716 3043146 3025921 3008571 2990911 2973164 2955895 2939606 2924427 2910131 2896327 2882709 2869244
63705 2869244 2856181 2843757 2831928 2820461 2809305 2798623 2788431 2778412 2768216 2757813 2747381
63694 2747381 2737129 2727387 2718655 2711034 2703613 2694960 2684590 2673582 2663370 2654077 2644654 2634532 2624483
63681 2624483 2615557 2607718 2600154 2592622 2585701 2579571 2573361 2566134 2558149 2550512 2543861 2537938 2532325 2526918
63667 2526918 2521495 2515495 2508644 2501490 2494857 2488983 2483521 2478186 2472905 2467480 2461635 2455505 2449679 2444569
63653 2444569 2440028 2435662 2431185 2426275 2420475 2413641 2406375 2399654 2393980 2389062 2384280 2379311 2374249 2369270
63639 2369270 2364320 2359219 2354076 2349434 2345691 2342414 2338565 2333594 2327981 2322511 2317407 2312538 2308129 2304627
63625 2304627 2301967 2299536 2296990 2294551 2292397 2290233 2287814 2285380 2283145 2280704 2277465 2273508 2269479 2265675
63611 2265675 2261728 2257320 2252706 2248250 2243728 2238557 2232697 2226976 2222342 2218895 2215829 2212247 2207882 2203003
63597 2203003 2197941 2192933 2188281 2184247 2180745 2177463 2174395 2171871 2169840 2167516 2164170 2160116 2156404 2153541
63583 2153541 2150976 2147973 2144512 2141092 2137886 2134503 2130480 2125770 2120754 2115998 2112050 2109205 2107243 2105438
63569 2105438 2103082 2100115 2097176 2094824 2092811 2090409 2087430 2084474 2081952 2079315 2075759 2071445 2067359 2063941
63555 2063941 2060471 2056138 2051155 2046460 2042534 2038981 2035118 2030657 2025834 2021123 2016856 2012956 2009058 2004912
63541 2004912 2000590 1996211 1991752 1987259 1983032 1979322 1976027 1972947 1970216 1968148 1966778 1965919 1965524 1965564 1965476
63526 1965476 1964338 1961895 1959157 1957560 1957623 1958635 1959638 1960474 1961812 1964305 1967815 1971514 1974709 1977613 1981200
63511 1981200 1986320 1992902 2000024 2006598 2012050 2016453 2020164 2023358 2025888 2027702 2029244 2031203 2033690 2035876
63497 2035876 2036776 2036358 2035525 2034942 2034193 2032368 2029222 2025375 2021426 2017326 2012704 2007418 2001539 1995142 1988453
63482 1988453 1981952 1975977 1970302 1964472 1958390 1952233 1945989 1939563 1933329 1927912 1923319 1918875 1914222 1909838
63468 1909838 1906252 1903337 1900827 1898981 1898105 1897768 1897229 1896421 1895836 1895596 1895379 1895357 1896366 1898878 1902296 1905672
63452 1905672 1908697 1911768 1915481 1920313 1926379 1933089 1939287 1944034 1947231 1949357 1950907 1952228 1953508 1954531
63438 1954531 1954681 1953606 1951770 1950033 1948783 1947761 1946670 1945570 1944629 1943741 1942439 1940120 1936384 1931343 1925527
63423 1925527 1919380 1912969 1906327 1899793 1893662 1887550 1880600 1872408 1863466 1854597 1846283 1838652 1831728 1825356
63409 1825356 1819095 1812532 1805638 1798574 1791303 1783755 1776301 1769578 1763703 1758061 1752153 1746285 1741064 1736473
63395 1736473 1731955 1727277 1722771 1718625 1714531 1710241 1706085 1702479 1699286 1696096 1692934 1690222 1688116 1686337
63381 1686337 1684670 1683258 1682226 1681327 1680101 1678265 1675885 1673345 1671169 1669674 1668677 1667571 1665739 1662862
63367 1662862 1659052 1654850 1650933 1647490 1644040 1640097 1635944 1632344 1629566 1627029 1623948 1620015 1615505 1611156
63353 1611156 1607840 1605864 1604456 1602513 1599932 1597710 1596519 1595824 1594739 1593218 1591990 1591669 1592425 1594148 1596549
63338 1596549 1599232 1602022 1604953 1607710 1609601 1610506 1611349 1613024 1615178 1616863 1618063 1619746 1622382 1625355
63324 1625355 1628076 1630938 1634775 1639885 1646032 1653001 1660674 1668682 1676422 1683418 1689521 1694803 1699396 1703328
63310 1703328 1706470 1708664 1709939 1710535 1710771 1711048 1711821 1713250 1714813 1715539 1714721 1712238 1708257 1703014 1696990
63295 1696990 1690906 1685123 1679243 1672613 1665189 1657616 1650432 1643502 1636382 1629083 1622152 1615932 1609975 1603491
63281 1603491 1596324 1589241 1583086 1577902 1573081 1568260 1563801 1560394 1558340 1557251 1556365 1555154 1553783 1552948
63267 1552948 1553267 1554797 1557133 1559776 1562391 1564931 1567721 1571254 1575766 1581110 1587129 1593894 1601374 1609099
63253 1609099 1616370 1622668 1627682 1631251 1633542 1635091 1636270 1636942 1636935 1636650 1636756 1637353 1637825 1637516 1636237 1634137
63237 1634137 1631351 1627704 1622630 1615600 1606889 1597576 1588518 1579711 1571034 1563044 1556234 1549994 1543285 1536198
63223 1536198 1529836 1524637 1519834 1514651 1509011 1502836 1495781 1488144 1481041 1475040 1469370 1463106 1456390 1449847
63209 1449847 1443572 1437512 1432103 1427545 1423032 1417691 1411952 1406946 1402786 1398489 1393519 1388406 1383734 1379425
63195 1379425 1375280 1371520 1368471 1366192 1364478 1362793 1360294 1356610 1352635 1349770 1348160 1346409 1343290 1339101
63181 1339101 1334982 1331579 1328824 1326445 1324067 1321229 1317872 1314571 1311832 1309376 1306631 1303647 1300916 1298365
63167 1298365 1295269 1291317 1287263 1284150 1282196 1280724 1278984 1276804 1274508 1272497 1270902 1269457 1267630 1265092
63153 1265092 1262155 1259662 1258171 1257367 1256441 1255088 1253801 1253144 1252996 1252725 1251931 1250756 1249626 1248917 1248766 1248944
63137 1248944 1249060 1249101 1249654 1251240 1253597 1256055 1258609 1262100 1267156 1273357 1279720 1285698 1291366 1296866 1302051
63122 1302051 1306799 1311455 1316824 1323593 1331673 1340182 1348309 1356134 1364422 1373592 1383251 1392770 1401954 1410919
63108 1410919 1419636 1427924 1435639 1442617 1448508 1453031 1456250 1458360 1459238 1458524 1456126 1452377 1447645 1442072
63094 1442072 1435811 1429329 1423190 1417569 1412133 1406441 1400445 1394495 1388942 1383805 1378973 1374552 1370791 1367668
63080 1367668 1364827 1362085 1359768 1358301 1357698 1357750 1358629 1360915 1364839 1369814 1374863 1379389 1383394 1387191 1391171
63065 1391171 1395693 1400809 1406019 1410533 1413977 1416746 1419526 1422514 1425255 1427111 1427661 1426701 1424150 1420165
63051 1420165 1415163 1409553 1403478 1396948 1390074 1383032 1375821 1368272 1360347 1352285 1344443 1337097 1330430 1324565
63037 1324565 1319439 1314704 1309857 1304549 1298910 1293605 1289434 1286604 1284379 1281614 1277740 1273132 1268547 1264405
63023 1264405 1260643 1256969 1253065 1248717 1244035 1239506 1235591 1232304 1229354 1226626 1224283 1222366 1220545 1218486
63009 1218486 1216226 1214100 1212317 1210742 1209065 1207105 1204975 1202978 1201298 1199742 1197950 1195926 1194201 1193247
62995 1193247 1192820 1192084 1190367 1187598 1184098 1180329 1176876 1174243 1172386 1170679 1168674 1166675 1165306 1164673 1164284
62980 1164284 1163709 1162913 1161993 1161037 1160260 1159894 1159807 1159611 1159268 1159142 1159362 1159557 1159553 1159795 1160694 1161883 1162711 1163252 1164219
62961 1164219 1165972 1168173 1170547 1173415 1177265 1182140 1187766 1194017 1200968 1208589 1216646 1224971 1233801 1243804
62947 1243804 1255670 1269551 1284952 1301280 1318322 1336038 1354145 1372341 1390850 1410291 1430857
62936 1430857 1452048 1473326 1494671 1516264 1537996 1559702 1581681 1604561 1628621 1653404 1678038
62925 1678038 1701680 1723705 1743713 1761556 1777307 1791032 1802472 1810969 1815956 1817511 1816278 1812655
62913 1812655 1806396 1797327 1786119 1773822 1760782 1746701 1731850 1717349 1703928 1691080 1678035 1665079
62901 1665079 1653177 1642710 1633368 1625128 1618483 1613659 1610372 1608635 1609028 1611834 1616446 1622102 1628696 1636403
62887 1636403 1644880 1653521 1662211 1671150 1680020 1688085 1695275 1702514 1710626 1719360 1727910 1735909 1743382 1749999
62873 1749999 1755054 1758168 1759449 1758861 1755958 1750486 1742826 1733553 1722941 1711199 1698724 1685681 1671677
62860 1671677 1656420 1640463 1624652 1608943 1592589 1575529 1558870 1543608 1529521 1515771 1502080
62849 1502080 1488767 1476021 1463736 1451879 1440431 1429132 1417776 1406647 1396150 1386122 1376109
62838 1376109 1366321 1357650 1350496 1344182 1337732 1330845 1323743 1316520 1309139 1301861 1295261 1289806 1285528 1281992
62824 1281992 1278428 1274144 1269094 1263863 1258925 1254126 1249130 1244015 1239060 1234179 1229133 1224138 1219733 1215880
62810 1215880 1211739 1206528 1200388 1194210 1188853 1184595 1181074 1177610 1173781 1169811 1166180 1162890 1159414 1155449
62796 1155449 1151291 1147354 1143778 1140760 1138634 1137144 1135034 1131157 1125852 1120588 1116215 1112216 1107772 1102954
62782 1102954 1098539 1095144 1092897 1091526 1090386 1088574 1085546 1081606 1077544 1073823 1070354 1067002 1064074 1062082
62768 1062082 1061090 1060413 1059167 1057122 1054846 1052824 1050808 1048358 1045771 1043769 1042301 1040388 1037380 1033801
62754 1033801 1030559 1027897 1025600 1023715 1022450 1021636 1020851 1019886 1018621 1016741 1014183 1011662 1010023 1009216 1008455
62739 1008455 1007352 1006192 1005102 1003706 1001773 999599 997492 995401 993237 991031 988581 985459 981692 977968
62725 977968 974845 972205 969773 967694 966231 965264 964525 963995 963619 962997 961826 960411 959257 958329 957198 955801
62709 955801 954546 953687 953066 952494 952035 951743 951439 950866 950007 949198 948974 949666 951016 952292 953043 953649 954923
62692 954923 957230 960220 963365 966511 969907 973885 978667 984363 991085 999041 1008420 1019199 1031253 1044673
62678 1044673 1059762 1076725 1095589 1116516 1139753 1165059 1191556 1218581 1246451 1275930 1307002
62667 1307002 1338579 1369371 1398667 1426258 1451929 1475198 1495352 1511740 1524148 1532823 1537997 1539494
62655 1539494 1537104 1531249 1522919 1512895 1501322 1488069 1473211 1456983 1439551 1421086 1402027 1382961
62643 1382961 1364203 1345601 1326988 1308803 1291979 1277020 1263350 1249921 1236342 1222978 1209992
62632 1209992 1196954 1183628 1170594 1158600 1147673 1137349 1127538 1118591 1110650 1103460 1096816 1090740
62620 1090740 1085161 1079738 1074086 1068082 1062033 1056744 1053078 1051049 1049533 1047399 1044797 1042944 1042677 1043737
62606 1043737 1045361 1047068 1048730 1050396 1052298 1054808 1058283 1063084 1069615 1078145 1088666 1101215 1116046
62593 1116046 1133083 1151542 1170640 1190505 1211608 1233522 1255158 1276247 1297515 1318986 1339063
62582 1339063 1355978 1369488 1380453 1389289 1395648 1399271 1400303 1398787 1394567 1387839 1379335 1369727 1359192
62569 1359192 1347600 1334947 1321455 1307373 1292797 1277716 1262315 1247140 1232792 1219389 1206517
62558 1206517 1193711 1180821 1167899 1155116 1142843 1131502 1121094 1111129 1101132 1091061 1081108 1071492
62546 1071492 1062519 1054496 1047326 1040566 1034096 1028321 1023459 1018963 1014086 1008702 1003200 997804 992443 987145
62532 987145 982141 977567 973332 969213 964950 960407 955864 951856 948558 945479 942067 938296 934438 930586
62518 930586 926810 923447 920749 918432 916051 913633 911498 909608 907625 905514 903612 902141 901114 900649
62504 900649 900800 901114 900967 900471 900567 901984 904560 907750 911389 915655 920648 926374 932983 940770 949945 960488
62488 960488 972071 984115 996186 1008435 1021381 1035076 1048687 1061134 1071991 1081559 1090164 1097552
62476 1097552 1103081 1106325 1107455 1106912 1104845 1101112 1095971 1090332 1084927 1079353 1072473 1063814 1054122 1044419
62462 1044419 1034975 1025433 1015565 1005497 995442 985624 976350 967787 959685 951611 943525 935810 928720
62449 928720 922011 915302 908596 902274 896631 891603 886962 882593 878538 874808 871247 867538 863407 858891
62435 858891 854408 850373 846753 843184 839648 836704 834779 833488 832047 830201 828238 826265 824124 822130
62421 822130 821130 821428 822273 822934 823744 825468 828044 830807 833766 837791 843335 849736 856115 862555 869968
62406 869968 879050 889603 900730 911459 921318 930483 939368 948079 956304 963596 969505 973602 975654
62393 975654 975874 974781 972792 970068 966620 962354 957116 950985 944453 937918 931120 923511 915156 906806
62379 906806 899009 891645 884535 877981 872386 867589 862936 857792 851826 845093 838081 831543 825927 820973
62365 820973 815990 810535 804823 799549 795244 791684 787998 783589 778816 774452 770582 766571 762188 758252
62351 758252 755771 754771 754299 753425 751999 750562 749723 749521 749324 748495 747153 745988 745255 744365 742689 740464
62335 740464 738533 737419 736994 736883 736886 736939 736898 736467 735313 733291 730549 727376 723996 720601 717467 714689 711940
62318 711940 708795 705336 702051 699187 696554 694015 691634 689266 686515 683314 680094 677126 674196 671182
62304 671182 668468 666410 664800 663246 661730 660376 659101 657864 656942 656458 656027 655337 654745 654687 654807 654315
62288 654315 653100 651921 651600 652423 654142 655918 656577 655649 654173 653755 654787 656241 657278 658215 659660 661411
62272 661411 662842 663914 665190 666979 668920 670512 671806 673500 676355 680558 685700 691411 697809 705210
62258 705210 713665 723068 733484 744952 757133 769659 782735 796830 811629 825868 838408 849198
62246 849198 858923 868050 876432 883682 889672 894741 899372 903554 906562 907574 906469 903768 900018 895619
62232 895619 891054 886686 882280 877222 871332 864990 858480 851715 844772 838122 832077 826352 820380 813733
62218 813733 806211 797929 789475 781542 774297 767532 761372 756143 751467 746328 740428 734634 729688 725150
62204 725150 720318 715466 711427 708408 705949 703730 701631 699328 696560 693599 690774 687823 684447 681213
62190 681213 679022 677806 676681 675368 674523 674527 674789 674609 673891 672777 671247 669531 668245 667652 667255 666632 666209
62173 666209 666704 668068 669511 670348 670481 670235 670102 670542 671785 673853 676901 681226 686777 693008 699499 706472
62157 706472 714353 723207 732954 743938 756666 771012 786085 800942 815116 828504 841046 852632
62145 852632 863065 872102 879673 886005 891283 895187 897104 896854 894921 891868 887776 882428 875812 868174
62131 868174 859765 850812 841776 833296 825623 818246 810329 801669 793020 785310 778659 772384 765961 759586
62117 759586 753720 748378 743192 738014 733160 729110 726238 724825 725005 726510 728688 730967 733218 735496
62103 735496 737562 738926 739507 740013 741401 743879 746665 748800 750094 751058 752123 753226 754145 754834 755213 754969
62087 754969 753876 752218 750639 749581 749062 748826 748519 747830 746828 746130 746358 747288 747883 747366 745986 744586
62071 744586 743653 743230 743545 745162 748363 752756 757757 763302 769765 777351 785777 794534 803142 811166 818319
62056 818319 824712 830792 836803 842378 846835 849755 851216 851583 851291 850645 849568 847528 844045 839269 833929
62041 833929 828724 823983 819735 815689 811148 805521 799173 793389 789080 785890 782873 779748 776938 774595
62027 774595 772245 769535 766850 764921 764082 764088 764492 765068 766054 768067 771661 776775 782711 788635 794026 798682
62011 798682 802625 806063 809217 811971 813955 815123 816120 817681 819716 821173 820961 818902 815787 812632 810041
61996 810041 808122 806771 805856 805265 804966 805111 805822 806898 807882 808567 809275 810504 812485 815173 818458 822166
61980 822166 826082 830227 834927 840290 845875 851242 856679 862814 869640 876500 883109 889857 897018 904289
61966 904289 911493 919068 927389 936001 944135 951632 958912 966285 973779 981320 988469 994214 997698 999182
61952 999182 999747 1000120 1000311 1000269 1000164 999876 998947 997320 995575 994049 992205 989233 984993 979939 974441 968531
61936 968531 962131 955128 947392 939036 930547 922295 914010 905079 895369 885362 875475 865588 855519 845672
61922 845672 836882 829507 822906 816043 808564 801056 794135 787574 780678 773348 766288 760042 754270 748343
61908 748343 742247 736500 731339 726579 722276 719022 717245 716478 715575 713654 710648 707091 703620 700764 698821
61893 698821 697726 696962 695906 694272 692178 689752 686974 683945 681015 678255 675083 670838 665678 660383
61879 660383 655276 649925 644169 638837 634915 632353 630249 627992 625618 623133 620209 616806 613549 611071
61865 611071 609225 607338 605156 603237 602397 602922 604324 605676 606165 605506 603985 602265 601070 600942 602004
61850 602004 603846 605642 606646 606755 606682 607390 609251 611755 614200 616523 619297 622894 627040 631317 635809
61835 635809 640950 646892 653326 659888 666524 673427 680777 688558 696443 703912 710599 716489 721665 726031
61821 726031 729448 732032 734016 735469 736473 737508 739192 741520 743762 745359 746659 748566 751670 755924
61807 755924 760953 766419 772117 777921 783609 788733 792849 796016 798801 801612 804207 806068 807000 806974 805592
61792 805592 802287 797199 791429 786002 780851 775131 768453 761432 754985 749394 744246 739054 733647 728047
61778 728047 722325 716724 711567 706831 701921 696232 689852 683522 677897 673129 669134 665971 663749 662395
61764 662395 661605 660910 659725 657690 655135 653029 652181 652653 654069 656221 659088 662586 666756 672100 679216
61749 679216 688120 698270 709307 721228 733763 746150 757909 769385 781126 792927 803966 813739
61737 813739 822430 830344 837402 843255 847667 850726 852979 855418 858982 863849 869355 874738 879892 885268
61723 885268 891270 897910 904962 912167 919237 925743 931138 934913 936831 936923 935250 931735 926464 920048 913430
61708 913430 907126 900833 893900 885992 877140 867459 857218 847117 837976 829980 822459 814633 806403 798282
61694 798282 790685 783583 776776 770300 764337 758816 753308 747514 741760 736736 732670 728983 724961 720577
61680 720577 716335 712454 708596 704484 700389 696785 693778 691011 688116 685028 681990 679314 677077 674991
61666 674991 672620 669661 666008 661770 657557 654443 653097 652894 652545 651683 651131 651339 651400 650329 648580 647291
61650 647291 646434 644858 642201 639592 638106 637431 636622 635438 634244 633038 631441 629468 627663 626346 625156
61635 625156 623468 621086 618509 616662 616208 616952 617984 618568 618769 619086 619626 619935 619515 618332 616801 615512
61619 615512 614886 614934 615343 615864 616485 617157 617562 617432 616879 616260 615815 615652 615794 615977 615590 614356 612910 612258
61601 612258 612552 612894 612412 611132 609573 607940 606038 603772 601336 599021 597037 595411 593840 591793 589009
61586 589009 585896 583111 580798 578485 575874 573437 571963 571515 571149 569802 567408 564895 563185 562404 562045
61571 562045 561507 560292 557994 554680 551138 548305 546245 544112 541296 538276 535991 534631 533454 531733
61557 531733 529492 527248 525337 523698 522151 520702 519491 518556 517714 516828 516121 516075 516776 517551 517479 516318 514661
61540 514661 513208 512087 511077 510100 509239 508373 507271 506046 505189 504915 504711 503807 501980 499693 497484 495459
61524 495459 493385 491050 488509 486136 484451 483704 483500 483028 481791 479988 478134 476538 475308 474516 474008
61509 474008 473206 471541 469089 466474 464127 461989 459937 458004 455955 453095 448950 443993 439333 435721
61495 435721 433040 430636 427840 424340 420402 416748 413915 411746 409742 407811 406232 404907 403240 401004
61481 401004 398767 397053 395415 392944 389500 385867 382743 380148 377902 376139 375027 374397 374022 373958 374206
61466 374206 374289 373551 371869 369646 367229 364736 362507 361173 360964 361200 360884 359638 357905 356280 354946 353728
61450 353728 352435 350993 349480 348117 347218 346992 347353 347902 348093 347517 346218 344728 343701 343304 343069 342398
61434 342398 341185 339845 338770 337946 337157 336371 335787 335541 335595 335863 336309 336827 337161 337013 336240 334903 333292
61417 333292 331838 330820 330060 329082 327697 326283 325253 324453 323355 321825 320333 319337 318717 318038 317143 316314
61401 316314 315874 315853 316023 316160 316177 316073 315842 315462 314940 314287 313396 312071 310283 308328 306610 305393 304777 304795
61383 304795 305266 305738 305855 305719 305582 305311 304548 303421 302541 302186 301956 301521 301195 301387 301852 302033 301860 301672
61365 301672 301489 300949 299957 298902 298139 297675 297429 297347 297160 296494 295470 294791 294935 295550 296001 296224 296601 297161
61347 297161 297364 296792 295676 294614 293973 293767 293888 294246 294691 295096 295579 296509 298049 299767 300838 300824 300172
61330 300172 299907 300790 302748 305042 306952 308312 309453 310660 311927 313292 315154 317792 320646 322528 322830
61315 322830 322105 321246 320429 319374 318278 317835 318282 319001 319270 319071 318917 319160 319630 319817 319262 317958 316430
61298 316430 315289 314647 314160 313553 312845 312008 310847 309455 308481 308578 309659 310918 311543 311283 310438 309454 308578
61281 308578 307803 307123 306667 306515 306480 306371 306361 306833 307809 308983 310281 311968 313967 315561 316123 315869 315566 315787
61263 315787 316713 318342 320380 322181 323289 324001 324961 326308 327655 328811 329994 331337 332778 334540 337183
61248 337183 340778 344504 347487 349820 352384 355796 359830 363844 367423 370611 373677 376730 379413 381079
61234 381079 381425 380918 380413 380382 380664 380960 381207 381399 381314 380729 379778 378882 378347 378302 378894 380226 381984 383437 384008
61215 384008 383750 383087 382374 381892 382062 383218 385282 387864 390631 393295 395457 397010 398606 401114 404445
61200 404445 407476 409497 411169 413633 417070 420690 423819 426412 428660 430701 432684 434670 436414 437698
61186 437698 438755 439883 440683 440331 438709 436726 435242 434236 433328 432637 432628 433432 434723 436068 437052 437347 437035
61169 437035 436680 436706 436945 437160 437676 438913 440457 441420 441896 443248 446529 451077 455240 458185 460476 463007
61153 463007 465977 468989 471650 473794 475281 475926 475656 474628 473140 471450 469683 467965 466588 465822 465415
61138 465415 464513 462475 459750 457514 456380 455851 455256 454685 454628 454987 455196 455176 455558 456730 458236 459406 460208
61121 460208 461124 462490 464311 466494 468871 471184 473435 476089 479494 483179 486189 488208 489856 491846
61107 491846 494256 496851 499612 502631 505748 508818 512162 516362 521551 527282 533139 539249 546042 553733
61093 553733 562162 570892 579247 586433 592015 596443 600825 605951 611561 616755 620986 624451 627511 630118
61079 630118 631985 633114 633840 634449 634912 634955 634171 632190 629049 625388 621905 618545 614537 609370 603427 597420
61063 597420 591544 585477 579120 572882 567235 562254 557715 553372 549084 544849 540922 537731 535524 534097
61049 534097 532988 531836 530478 528831 526925 525001 523334 521819 519980 517469 514455 511356 508439 505890
61035 505890 504092 503328 503268 503201 502964 503239 504665 507069 510016 513724 518868 525533 532933 540202 547006 553319
61019 553319 559216 565122 571772 579450 587559 595282 602473 609608 617056 624824 632802 640792 648267 654587
61005 654587 659579 663696 667472 671041 674179 676556 677877 678091 677539 676675 675396 672957 668782 663282 657622
60990 657622 652679 648344 643812 638318 631636 624077 616234 608633 601547 595029 589027 583400 577863 572113
60976 572113 566200 560693 556244 552878 549866 546457 542659 539084 536089 533343 530458 527714 525892 525399
60962 525399 525860 526520 526859 526722 526232 525768 525853 526765 528340 530327 532877 536349 540625 544997 548964 552992
60946 552992 558077 564553 571604 578165 584100 590247 597359 605311 613408 621249 629060 637316 646259 655826
60932 655826 665785 675936 686192 696654 707539 719056 731361 744562 758575 773009 787468 802143
60920 802143 817871 835392 854663 875264 897416 922266 951010 984093 1021464 1063441 1111085
60909 1111085 1166059 1230626 1307986 1402314 1518205 1660106 1832355 2039773 2288041 2583296
60899 2583296 2931081 3335525 3798988 4320837 4893473 5497027 6098273 6658567 7148217
60890 7148217 7557888 7899408 8197215 8477597 8760685 9054736 9351489 9624874 9837024
60881 9837024 9951452 9947224 9826105 9609190 9326432 9006269 8670300 8332928 8002815 7684133
60871 7684133 7377710 7082676 6798141 6524093 6261363 6011210 5774948 5553721 5348295
60862 5348295 5158696 4983868 4821944 4671196 4530806 4400591 4280076 4168204 4063914
60853 4063914 3966582 3875732 3790691 3710798 3635698 3565076 3498273 3434454 3373038 3313759 3256416
60842 3256416 3200890 3147345 3095998 3046659 2998740 2951890 2906431 2862960 2821603 2781802 2742905
60831 2742905 2704875 2668318 2633708 2600761 2568772 2537554 2507677 2479525 2452514 2425621 2398633
60820 2398633 2372444 2348053 2325551 2304151 2282945 2261503 2239996 2218916 2198728 2179680 2161926
60809 2161926 2145552 2130281 2115327 2099970 2084304 2069146 2055113 2042189 2030142 2018906 2008328
60798 2008328 1998043 1987942 1978407 1969615 1960955 1951660 1941818 1932165 1923029 1914131 1905499 1897836 1891690
60785 1891690 1886744 1882326 1878225 1874700 1871972 1870091 1868998 1868345 1867484 1865982 1863985 1861726 1858985 1855466
60771 1855466 1851451 1847491 1843615 1839369 1834604 1829515 1823914 1817176 1809163 1800507 1791678 1782309 1771881 1760524
60757 1760524 1748664 1736344 1723447 1710228 1697062 1683873 1670448 1657033 1644016 1631126 1617664
60746 1617664 1603465 1589100 1575039 1561292 1547841 1534840 1522178 1509382 1496159 1482539 1468386
60735 1468386 1453402 1437865 1422802 1409004 1396299 1384126 1372278 1360617 1348632 1335971 1323200
60724 1323200 1311326 1300585 1290254 1279660 1268932 1258637 1249078 1240116 1231494 1223155 1215180 1207383
60712 1207383 1199185 1190249 1181275 1173588 1167654 1162488 1156901 1150782 1144638 1138372 1131362 1123560 1115672 1108274
60698 1108274 1101448 1095263 1089785 1084489 1078395 1071196 1063649 1056626 1050175 1043791 1037063 1029851 1022310 1015119
60684 1015119 1009158 1004549 1000369 995607 989977 983535 976113 967730 959078 950959 943413 935987 928532 921245
60670 921245 914184 907380 901224 895939 890827 884804 877861 871158 865498 860337 854643 848060 840880 833484
60656 833484 826420 820521 816169 812533 808229 802746 796852 791586 787345 784015 781449 779425 777465 775082
60642 775082 772222 769186 766159 763019 759649 756190 752811 749310 745187 740283 735148 730636 727073 723976
60628 723976 720618 716791 712916 709529 706703 704033 701038 697519 693485 688833 683348 677192 671248 666633
60614 666633 663657 661378 658329 653693 647720 641270 635112 629685 625156 621465 618367 615526 612705 609866
60600 609866 607080 604305 601367 598169 594897 591811 588918 586008 583120 580682 578951 577486 575537 572865
60586 572865 569904 567059 564253 561279 558336 555891 554174 553028 552206 551570 551080 550814 550948 551560 552378 552957
60570 552957 553125 553144 553347 553770 554154 554174 553630 552604 551482 550708 550356 550084 549545 548746 547884 547024 546086 545070
60552 545070 544048 543123 542554 542800 543978 545312 545543 544208 542162 540574 539678 538831 537541 535760 533331 529932
60536 529932 525930 522582 520772 519899 518690 516840 515118 513906 512528 510292 507459 504720 502266 499919
60522 499919 497780 496093 494761 493550 492605 492096 491480 489876 487220 484423 482214 480411 478585 476830 475486
60507 475486 474533 473691 472890 472192 471438 470293 468615 466562 464462 462627 461133 459704 458078 456504 455504
60492 455504 455072 454584 453639 452523 451587 450681 449618 448617 447899 447279 446709 446663 447308 447763 447048 445435 444006
60475 444006 443059 441987 440647 439760 439732 440035 440165 440427 441318 442870 444905 447310 449599 450928 451128 451128 451860
60458 451860 453297 455088 457388 460243 462717 463679 463257 462635 462554 462868 463438 464458 465656 466134 465412 464077
60442 464077 462982 462315 461855 461678 462062 463023 464449 466535 469639 473692 478026 481864 484803 486855 488224
60427 488224 489079 489573 489970 490659 491779 492951 493676 494113 495051 496895 498891 499764 499009 497301 495656 494574
60411 494574 494033 493900 494069 494381 494765 495454 496858 499073 501661 503974 505673 506854 507873 509221 511493 515201
60395 515201 520457 526913 534197 542308 551517 561944 573352 585299 597258 608598 618706 627364 634863
60382 634863 641458 646683 649465 649067 645840 640898 635213 629192 622948 616552 609938 602910 595528 588277
60368 588277 581648 575637 569872 564054 558139 552231 546541 541313 536538 531872 527086 522397 517981 513444
60354 513444 508232 502538 497132 492345 487856 483594 480131 477809 476044 474005 471518 468859 466052 462980
60340 462980 459930 457463 455765 454528 453379 452000 450085 447637 445277 443738 442968 442191 440886 439358 438243
60325 438243 437728 437417 436738 435445 433829 432446 431538 430809 429907 428889 428011 427326 426800 426595 426772 426918 426591
60308 426591 425974 425611 425540 425288 424642 423808 422703 420845 418156 415297 412846 410703 408623 406878 405916 405775
60292 405775 406266 407411 409184 410970 411890 411647 410732 409770 408987 408334 407847 407735 408176 409116 410299 411501 412676
60275 412676 413725 414310 414195 413775 413918 415090 416911 418631 419754 420094 419639 418675 417794 417470 417782 418634 419992
60258 419992 421616 422913 423443 423422 423423 423729 424219 424748 425355 426245 427792 430426 434228 438695 443071 446778 449534
60241 449534 451316 452465 453454 454256 454236 453045 451290 449870 448881 447720 446026 443987 441813 439593 437698
60226 437698 436679 436565 436722 436641 436426 436328 436203 435713 434807 433722 432673 431750 430941 430168 429381 428709 428405 428594
60208 428594 429194 429991 430608 430576 429848 429180 429573 431221 433408 435471 437439 439621 442105 444865 447849 450594
60192 450594 452264 452503 451861 450934 449529 447259 444577 442416 440833 438821 435595 431470 427248 423370 420053
60177 420053 417681 416447 415836 415057 413974 413097 412672 412149 410835 408774 406708 405271 404430 403737 402920 402137
60161 402137 401666 401483 401183 400343 398922 397285 395893 395079 395036 395803 397037 397969 397855 396611 394917 393606 393026
60144 393026 392906 392756 392313 391702 391166 390699 390009 388976 387945 387354 387102 386745 386216 385938 386067 386170 385925 385676
60126 385676 385852 386219 386279 386170 386519 387408 388174 388295 387988 387771 387967 388803 390528 393071 395882 398373 400380
60109 400380 402037 403435 404524 405151 405160 404737 404559 405173 406214 406771 406692 406876 408007 409586 410633 410807 410367
60092 410367 409543 408593 408004 407972 407964 407469 406894 406947 407430 407484 406955 406592 406875 407543 408445 409864 411575 412424 411588 409730
60072 409730 408287 407969 408474 409296 410134 410714 410840 410684 410585 410571 410366 409873 409351 409093 409131 409210 408932 408049 406832
60053 406832 406024 406165 407052 408082 408940 409723 410476 411069 411479 411965 412830 414170 415824 417527 419197 421100 423522
60036 423522 426152 428082 428744 428572 428452 428773 429429 430524 432347 434684 436744 438002 438667 439171 439656 440167
60020 440167 440809 441339 441015 439432 437270 435726 435201 434999 434349 433337 432635 432578 432772 432499 431403 429696 427879
60003 427879 426268 424838 423444 422133 421215 421067 421788 423013 424062 424486 424458 424500 424801 425009 424814 424509 424773
59986 424773 425962 427851 430010 432245 434600 437062 439382 441144 442108 442486 442903 443899 445412 446757 447180
59971 447180 446428 444845 442952 441094 439398 437902 436451 434534 431659 428099 425091 423800 424136 424832 424734
59956 424734 423696 422207 420594 418836 416814 414426 411660 408908 406949 406282 406538 406897 407054 407360 408132 409239
59940 409239 410456 411664 412511 412270 410570 407997 405571 403665 401870 399872 398023 396784 396020 395188 394024
59925 394024 392644 391048 389041 386755 384752 383207 381326 378105 373693 369477 366669 365136 363867 362260
59911 362260 360606 359513 359234 359611 360314 360940 361029 360222 358551 356593 355117 354347 353590 351919 349312 346905
59895 346905 345945 346692 348475 350490 352244 353446 353970 353918 353500 352841 352145 351816 352054 352442 352390 351932 351585 351376
59877 351376 350620 348980 347204 346405 346806 347650 348108 347944 347382 346743 346254 345983 345901 346132 346950 348354 349788 350637
59859 350637 350955 351428 352547 354089 355463 356353 356867 357226 357500 357570 357283 356648 355881 355228 354741 354425 354466 355084
59841 355084 356043 356587 356088 354645 352820 350922 348887 346794 345051 343942 343291 342845 342682 342869 342997 342555
59825 342555 341728 341255 341430 341701 341607 341542 342181 343437 344511 344870 344707 344554 344857 345939 347871 350259 352433
59808 352433 354003 355049 355855 356771 358225 360372 362651 364161 364619 364529 364370 364143 363928 364267 365453 366871
59792 366871 367609 367543 367339 367577 368271 369205 370269 371445 372780 374340 376028 377537 378737 379869 381094 382065
59776 382065 382361 382171 382077 382305 382673 383213 384201 385471 386274 386128 385398 384777 384522 384430 384253 383882 383275 382512 381789
59757 381789 381202 380666 380146 379781 379612 379508 379468 379860 381048 382910 384930 386746 388434 390284 392375 394379
59741 394379 395757 396294 396376 396603 397118 397564 397784 398273 399732 402321 405537 408582 410789 411892 412192 412311 412500
59724 412500 412278 410937 408390 405303 402462 400180 398220 396121 393601 390803 388152 385839 383611 381220
59710 381220 378928 377265 376335 375680 374874 373948 373118 372419 371844 371619 371915 372270 371621 369188 365282 361108 357743
59693 357743 355410 353743 352487 351719 351436 351303 350978 350496 350200 350406 351221 352495 353743 354320 354036 353524 353651
59676 353651 354411 354702 353398 350520 347221 344777 343751 343928 344739 345690 346570 347413 348253 348901 349069 348746 348386
59659 348386 348535 349263 350012 350133 349506 348634 348187 348556 349766 351591 353667 355590 357125 358299 359297 360285 361454
59642 361454 363024 365040 367192 369095 370786 372662 374808 376577 377190 376749 376383 377198 379176 381266 382532
59627 382532 383005 383370 384010 384648 384909 384951 385263 385964 386561 386502 385729 384638 383650 383043 383042 383643 384253 383812 381629
59608 381629 378160 374738 372474 371492 371233 371244 371527 372175 373008 373718 374297 375061 376159 377194 377527 376946 375853
59591 375853 374728 373605 372327 371141 370665 371131 372018 372634 372919 373353 374175 375019 375353 375054 374450 373951 373734
59574 373734 373645 373298 372401 371068 369740 368687 367703 366421 364835 363331 362167 361074 359464 357059 354208
59559 354208 351623 349755 348519 347627 347055 347034 347589 348314 348702 348604 348251 347981 347965 348107 348072 347575 346843 346604 347279
59540 347279 348265 348427 347413 346111 345614 346099 346950 347700 348311 348719 348641 347994 347051 346041 344876 343439 341828
59523 341828 340099 338141 336138 334840 334882 335943 337015 337473 337480 337392 337280 337136 337087 337140 337041 336628 336106 335736 335493
59504 335493 335164 334615 333832 332981 332575 333175 334627 335844 335789 334503 332894 331687 330937 330387 329860 329337 328995
59487 328995 329121 329668 330035 329626 328586 327570 326937 326499 325996 325307 324294 322957 321767 321245 321077 320236 318241
59470 318241 315787 313838 312626 311856 311513 311922 313224 315112 316903 317749 317140 315558 314254 314067 314684 315425
59454 315425 316285 317645 319234 320102 319647 318114 316135 314250 312985 312758 313534 314911 316799 319616 323621
59439 323621 328359 333098 337639 342367 347622 353174 358366 362536 365334 366738 366973 366474 365844 365565 365574 365378
59423 365378 364818 364593 365618 367839 370057 371134 371075 370713 370534 370164 368977 366868 364323 361887 359804 358044
59407 358044 356438 354701 352539 349959 347372 345190 343361 341586 339883 338590 337676 336520 334691 332683
59393 332683 331449 331289 331527 331274 330239 328820 327639 326982 326604 326074 325374 324947 325040 325261 325067 324458 323781 323120
59375 323120 322388 321936 322370 323706 325225 326429 327638 329369 331513 333464 334779 335380 335424 335305 335630 336796
59359 336796 338665 340841 343168 345705 348453 351402 354717 358482 362284 365488 367953 370151 372445 374585
59345 374585 376065 376764 376949 376862 376611 376354 376232 375969 374964 373073 371139 370264 370579 371121 371085 370706 370545 370399
59327 370399 369689 368822 369223 371676 375251 378500 381244 384466 388644 393150 397397 401730 406656 411729 416020
59312 416020 419408 422721 426449 430034 432676 434314 435355 435911 435927 435815 436217 437043 437464 437124 436800 437351 438435
59295 438435 438777 437574 435056 431860 428464 425314 422912 421360 420098 418336 415756 412616 409354 406174
59281 406174 402936 399413 395646 392034 388876 385993 383045 380244 378360 377926 378733 380180 381847 383506 384971
59266 384971 386259 387678 389393 391023 392054 392693 393927 396605 400587 404890 408578 411439 413966 416830
59252 416830 420389 424585 429190 434003 438846 443490 447746 451659 455538 459759 464409 469104 473221 476361
59238 476361 478514 479792 480219 479969 479527 479219 478724 477471 475534 473579 471799 469482 465984 461675 457374
59223 457374 453212 448673 443731 439251 436050 433978 432216 430208 427992 425859 424039 422815 422542 423312 424608
59208 424608 425544 425516 424631 423465 422531 422048 422109 422781 424075 426063 428970 432856 437089 440527 442471 443224 443444
59191 443444 443220 442131 440031 437292 434207 430653 426553 422390 418919 416492 414882 413685 412670 411737 410837
59176 410837 410123 410098 411249 413415 415688 417243 418126 419025 420302 421710 423048 424606 426607 428581 429810
59161 429810 430247 430472 430746 430647 429790 428530 427628 427418 427546 427369 426441 424734 422605 420533 418764 417247 415939
59144 415939 415054 414818 415164 415784 416501 417291 418039 418522 418746 419009 419436 419648 419178 418097 416903 415785 414376
59127 414376 412468 410581 409443 409044 408650 407721 406429 405152 403862 402307 400512 398783 397313 396056 394921
59112 394921 393807 392462 390593 388252 385896 384000 382653 381667 380900 380362 380047 379815 379423 378590 377077 374932
59096 374932 372751 371411 371252 371598 371391 370308 368910 367735 366759 365973 365839 366598 367514 367627 367080 366890 367398
59079 367398 367754 367282 366505 366336 366856 367583 368471 369971 372268 375048 377921 380592 382796 384608 386683 389596
59063 389596 392981 395857 397802 399264 400632 401670 402132 402421 403155 404332 405193 404905 403240 400721 398230
59048 398230 396306 394812 393333 391802 390478 389400 388181 386389 383835 380494 376568 372642 369410 367022
59034 367022 365055 363222 361756 360850 360201 359451 358724 358283 357919 357146 355856 354332 352648 350588 348278 346485
59018 346485 346039 347150 349484 352635 356215 359621 362182 363790 365203 367447 370896 375095 379412 383643
59004 383643 387839 391884 395505 398651 401533 404318 406960 409344 411452 413374 415279 417230 418931 419845
58990 419845 419874 419666 419867 420243 420074 419368 418957 419237 419527 419073 418052 417022 415842 413870 411073 408222 405985
58973 405985 404260 402502 400288 397553 394623 392066 390207 388755 387150 385234 383250 381265 379116 376883
58959 376883 374905 373097 370832 367870 364978 363143 362347 361686 360627 359660 359555 360297 361046 360982 360040 358786
58943 358786 357827 357365 357258 357307 357379 357357 357162 356900 356724 356565 356116 355258 354327 353911 354451 356141 358932 362385 365703
58924 365703 368211 369869 371133 372430 374021 376213 379254 382878 386352 389149 391344 393144 394421 394966
58910 394966 394943 394724 394474 394255 394335 394989 396015 396890 397364 397511 397313 396773 396512 397477 399730 402075 403460 404289
58892 404289 405729 407933 409741 410149 409440 408684 408598 409169 409975 410562 410644 410318 409915 409555 409018 408217 407629 407941
58874 407941 409321 411211 412954 414497 416484 419700 424453 430374 436754 442974 448640 453525 457581 461086
58860 461086 464536 468267 472272 476344 480298 483886 486667 488171 488305 487473 486257 484967 483499 481522 478720
58845 478720 474983 470599 466353 463171 461314 460002 458084 455142 451701 448398 445326 442330 439469 436798
58831 436798 434049 430995 427981 425628 424142 423265 422796 422579 422085 420660 418432 416451 415567 415507 415301 414346
58815 414346 412755 410984 409508 408680 408492 408371 407519 405589 403123 401319 401266 403113 405933 408652 411107 413962
58799 413962 417554 421319 424626 427754 431574 436459 441997 447748 453823 460559 467924 475475 482835 490055
58785 490055 497474 505284 513224 520791 527640 533668 538704 542410 544560 545301 545000 543993 542493 540519 537827
58770 537827 534173 529765 525241 521071 517260 513793 510973 508938 507174 504983 502338 499805 497653 495474
58756 495474 492816 489830 487085 484906 483054 480975 478306 475226 472286 469833 467638 465141 461932 457917
58742 457917 453271 448485 444271 440979 438181 435175 431898 428939 426566 424179 421040 417259 413697 411011
58728 411011 409157 407720 406459 405303 404122 402821 401630 400961 400845 400764 400360 400052 400461 401279 401307 399976 398265
58711 398265 397578 398028 398475 398241 397944 398387 399226 399320 398158 396352 394693 393205 391440 389363 387552 386392
58695 386392 385433 383773 381056 377923 375507 374568 374939 375574 375208 373366 370842 368934 368164 367979 367701 367263
58679 367263 366860 366404 365806 365352 365288 365312 365078 364990 365845 367711 369795 371499 372934 374179 374676 373795 371659 368962
58661 368962 366266 363754 361437 359149 356533 353493 350597 348681 347918 347557 346693 345159 343521 342324 341496
58646 341496 340526 339156 337744 336920 336909 337353 337784 338138 338736 339817 341179 342285 342745 342724 342876 343838 345758
58629 345758 348271 350794 352797 354023 354730 355658 357524 360401 363616 366317 368142 369462 371046 373377 376193
58614 376193 378786 380868 382856 385179 387545 389307 390357 391215 392244 393206 393664 393346 392039 389580 386270
58599 386270 382910 380086 377552 374562 370636 365760 360135 354157 348566 344127 340980 338468 335790 332748
58585 332748 329769 327257 325095 322786 320017 316937 313866 310868 307791 304635 301727 299472 298100 297595
58571 297595 297760 298272 298928 299977 302003 305340 309595 313915 317759 321316 325152 329507 334005 337987 341029
58556 341029 343032 343985 343895 342960 341569 339959 338133 336156 334340 332857 331405 329521 327095 324351 321453
58541 321453 318506 315792 313596 311776 309934 308074 306622 305686 304662 302909 300571 298469 297226 296764 296574
58526 296574 296290 295922 295566 295094 294339 293605 293667 294984 297129 299312 301264 303140 304762 305630 305801 306120 307259
58509 307259 308995 310718 312213 313533 314452 314614 314095 313350 312571 311508 309979 308293 306930 305972 304922 303206
58493 303206 300834 298538 297123 296655 296407 295662 294519 293839 294463 296517 299386 302329 305138 308092 311227
58478 311227 313931 315555 316238 316780 317706 318895 320072 321331 323001 325276 328113 331257 334405 337571 341226
58463 341226 345729 350756 355778 361004 367182 374357 381539 387785 393047 397667 401728 405361 409074 413188
58449 413188 417293 420729 423321 425265 426716 427891 429131 430325 430714 429784 427972 425872 423221 419441 414826
58434 414826 410394 406733 403796 401610 400250 399092 397080 394084 391239 389591 388939 388404 387645 387099 387305
58419 387305 388341 389763 390957 391716 392452 393636 395082 396186 396792 397313 397940 398257 397848 396838 395598 394302
58403 394302 392966 391629 390199 388484 386539 384755 383338 381944 380023 377335 374032 370449 366986 363918
58389 363918 361171 358471 355857 353835 352907 353089 353910 354705 354984 354833 355006 356193 358204 360231 361940 363677
58373 363677 365460 366451 365946 364348 362542 360658 358123 354834 351560 349061 347322 345881 344563 343535 342848
58358 342848 342221 341391 340585 340445 341439 343340 345439 347187 348440 349163 349266 348897 348547 348574 348791 348745 348235 347341
58340 347341 346193 344938 343797 342773 341494 339700 337862 336891 337169 338172 339126 339784 340400 341240 342279 343275
58324 343275 343992 344467 345138 346526 348666 350953 352667 353545 353736 353435 352810 352205 351987 352074 351867 350838 349035
58307 349035 346789 344180 341135 337943 335237 333380 332152 331191 330394 329702 328848 327623 326175 324734 323197
58292 323197 321435 319817 319023 319288 320183 321097 321634 321515 320607 319224 318022 317382 317017 316430 315566 314858 314738
58275 314738 315234 315980 316569 317000 317759 319281 321329 323141 324283 325030 325841 326721 327479 328350 329956 332494 335188
58258 335188 336830 336967 336478 336739 338158 339776 340430 340055 339521 339422 339566 339608 339586 339599 339542 339492 340013 341605 344101
58239 344101 346983 350074 353512 357156 360533 363413 366014 368536 370795 372584 374086 375687 377426 378922
58225 378922 379906 380626 381585 382925 384266 385182 385679 386098 386723 387610 388676 389766 390725 391628 392827 394501 396293
58208 396293 397673 398665 399856 401688 404136 407086 410601 414587 418601 422247 425523 428522 431129 433306
58194 433306 435442 438062 441338 445182 449628 454659 459769 464125 467383 470090 473137 476941 481269 485670
58180 485670 489957 494346 499293 505227 512247 520005 527932 535743 543696 552272 561575 571273 581149 591413
58166 591413 602325 613768 625468 637387 649518 661511 672988 684186 695792 708067 720566
58155 720566 732857 745155 758000 771608 785733 800066 814625 829819 846160 863739 882157
58144 882157 901110 920843 941731 963654 986265 1009690 1034412 1060594 1088167 1117429 1148817
58133 1148817 1182081 1216560 1252481 1291076 1333130 1378212 1425703 1475796 1528899 1584927 1643812
58122 1643812 1706139 1772658 1843780 1920152 2003097 2093769 2192412 2299115 2414726 2540331 2676540
58111 2676540 2824266 2985725 3163591 3359548 3574793 3811956 4075594 4370859 4702694
58102 4702694 5076583 5499736 5982027 6537089 7183453 7945156 8852861 9946455 11277397
58093 11277397 12907561 14904255 17334468 20261580 23744946 27839993 32595038 38043429
58085 38043429 44193763 51017540 58421735 66195150 73951289 81130171 87107182 91376655
58077 91376655 93704293 94157880 93018449 90650908 87410123 83602828 79483491 75258818
58069 75258818 71090550 67096647 63353863 59903597 56759871 53916476 51351948 49033683
58061 49033683 46922114 44974639 43149789 41412661 39740272 38123673 36565911 35078165
58053 35078165 33675690 32373372 31181423 30103421 29137127 28275625 27507152 26815102 26180078
58044 26180078 25583063 25008167 24444619 23888006 23339681 22804022 22285705 21788851 21317264
58035 21317264 20873795 20459126 20071498 19707571 19363152 19033542 18714252 18402166 18096099
58026 18096099 17796311 17503669 17219206 16944050 16679548 16427295 16188670 15963921 15751635
58017 15751635 15549343 15354517 15164749 14977336 14789772 14601374 14414143 14231495 14055957
58008 14055957 13888144 13727495 13573350 13425230 13282579 13144632 13010479 12879147 12749866
57999 12749866 12622373 12496827 12373280 12251536 12131713 12014585 11900908 11790558 11682693
57990 11682693 11576604 11471934 11368096 11264281 11160360 11057368 10956686 10859005 10764368 10672846
57980 10672846 10584726 10500093 10418554 10339168 10260386 10180367 10097895 10013062 9926830 9840069 9753400
57969 9753400 9667615 9583599 9501517 9420478 9339196 9256810 9173055 9087938 9001578 8914256 8826583
57958 8826583 8739636 8654711 8572536 8492617 8413611 8334422 8254864 8175407 8096717 8019422 7943833
57947 7943833 7869664 7796389 7724148 7653935 7586577 7521808 7458723 7396943 7336756 7278093 7219934
57936 7219934 7161036 7101041 7040625 6980799 6922320 6865667 6811058 6758227 6706368 6654648 6602813
57925 6602813 6551095 6499562 6447814 6395449 6342553 6289506 6236653 6184502 6133991 6085913 6039926
57914 6039926 5994570 5948525 5901632 5854517 5807594 5760816 5714259 5668424 5623725 5579899 5536121
57903 5536121 5491773 5446969 5402212 5357617 5312645 5266781 5220284 5174075 5128888 5084818 5041637
57892 5041637 4999136 4957110 4915400 4874309 4834728 4797435 4762303 4728390 4694739 4660890 4626719
57881 4626719 4592117 4556820 4520355 4482129 4441866 4399983 4357331 4314523 4271684 4228882 4186488
57870 4186488 4144944 4104393 4064783 4026187 3988799 3952632 3917385 3882588 3847731 3812311 3776030
57859 3776030 3739052 3701908 3665046 3628520 3592181 3555998 3520037 3484193 3448139 3411587 3374552
57848 3374552 3337319 3300244 3263595 3227456 3191812 3156690 3122220 3088457 3055195 3022140 2989306
57837 2989306 2957203 2926472 2897398 2869704 2842766 2816029 2789354 2763137 2737902 2713662 2689717
57826 2689717 2665228 2639929 2614146 2588212 2562135 2535862 2509594 2483689 2458387 2433779 2409971
57815 2409971 2387027 2364679 2342225 2318910 2294562 2269781 2245421 2221840 2198687 2175443 2152047
57804 2152047 2128915 2106412 2084407 2062304 2039533 2016111 1992778 1970458 1949403 1929024 1908702
57793 1908702 1888628 1869575 1851908 1835180 1818715 1802231 1785760 1769283 1752768 1736404 1720478
57782 1720478 1705047 1689917 1674982 1660402 1646432 1633092 1620027 1606719 1592940 1578982 1565333
57771 1565333 1552139 1539086 1525817 1512160 1497926 1482910 1467342 1452150 1438326 1426087 1414893
57760 1414893 1404125 1393393 1382375 1370871 1359174 1347931 1337500 1327732 1318522 1310103 1302540 1295228
57748 1295228 1287399 1278959 1270470 1262314 1254211 1245604 1236291 1226627 1217287 1208765 1200993 1193383 1185397 1177077
57734 1177077 1168873 1161158 1154077 1147743 1142163 1136993 1131704 1126132 1120544 1115110 1109675 1104199 1099040 1094505
57720 1094505 1090375 1086219 1081948 1077739 1073623 1069473 1065287 1061031 1056374 1051065 1045620 1041038 1037558 1034083
57706 1034083 1029208 1022655 1015425 1008634 1002502 996384 989582 982033 974327 967122 960693 955094 950466 946791
57692 946791 943442 939497 934685 929619 924937 920664 916616 912827 909119 904800 899521 894142 889880 886716
57678 886716 883473 879521 875521 872200 869302 866304 863342 860704 857892 854142 849628 845279 841489 837776
57664 837776 833876 830307 827516 825087 822296 819057 815802 812674 809362 805698 802008 798769 796131 793709
57650 793709 790778 786736 781677 776481 772110 768772 765892 762838 759432 755762 751815 747522 743045 738744
57636 738744 734791 730965 726895 722515 718122 713970 709962 705875 701778 697963 694433 690799 686893 683177
57622 683177 680266 678122 676071 673594 670675 667393 663637 659521 655679 652665 650211 647422 643739 639401
57608 639401 635022 631081 627784 625008 622133 618318 613320 607951 603388 600124 597797 595853 593910 591525
57594 591525 588169 583846 579392 575733 572932 570305 567393 564450 561936 559904 558020 555896 553263 550160
57580 550160 547064 544549 542545 540267 537293 534397 532827 532777 533182 533118 532906 533656 536064 540054 545289 551686
57564 551686 559410 568512 578548 588464 597043 603538 607750 609518 608428 604313 597833 590307 582978 576452
57550 576452 570562 564595 557882 550478 543118 536361 529992 523524 516962 510671 504724 498824 492832 486928
57536 486928 481286 475982 471221 467251 463959 460965 458097 455421 452775 449789 446531 443591 441296 439242
57522 439242 436906 434302 431625 428686 425183 421338 417719 414453 411082 407285 403409 400112 397620 395528
57508 395528 393289 390834 388567 386723 384906 382565 379880 377745 376702 376237 375366 373661 371443 369281 367592
57493 367592 366505 365650 364233 361745 358537 355414 352718 350081 347020 343394 339438 335680 332767 330866
57479 330866 329272 327115 324442 322121 320550 319090 317066 314660 312320 309761 306342 302243 298520 295879
57465 295879 293958 292039 289937 287901 285994 284018 281908 279822 277848 275862 273730 271472 269211 267088
57451 267088 265242 263664 262124 260393 258559 256886 255361 253666 251713 249946 248895 248598 248648 248635 248376 247836
57435 247836 247053 246007 244407 241783 238093 234125 230914 228905 227848 227269 226615 225121 222323 218782 215801
57420 215801 214174 213586 213306 212909 212183 210952 209381 208041 207209 206461 205263 203624 201784 199705 197353 195138
57404 195138 193545 192481 191480 190302 188906 187140 185024 183089 181805 180850 179559 177912 176432 175179
57390 175179 173659 171765 169945 168245 165974 162738 159226 156410 154451 152905 151646 151002 151083 151449 151450 150671
57374 150671 149089 147019 144862 142803 140773 138726 136769 134959 133186 131391 129696 128276 127211 126523
57360 126523 126149 125820 125222 124317 123274 122055 120445 118551 116854 115614 114539 113307 112037 110916 109735
57345 109735 108131 106127 104091 102304 100821 99543 98206 96427 94180 92104 91051 91274 92170 92727 92118
57330 92118 90153 87487 85254 84123 83705 83122 82099 81168 80844 80951 80842 80083 78755 77271 75999 74988
57314 74988 74018 72933 71863 71014 70293 69413 68356 67540 67328 67477 67284 66229 64381 62175 60020 58226
57298 58226 57036 56407 55809 54615 52797 50953 49480 48141 46749 45810 45868 46399 46061 44180 41412 38820
57282 38820 36832 35357 34376 33912 33766 33646 33445 33011 31892 29707 26711 23681 21223 19410 18036 16952
57266 16952 16216 16059 16639 17717 18621 18751 18020 16777 15363 13901 12423 11044 10050 9754 10141 10667 10651
57249 10651 9970 9140 8662 8547 8534 8436 8122 7510 6724 5899 4720 2639 -186 -2728 -4263 -5206 -6307 -7507
57231 -7507 -8308 -8878 -9888 -11348 -12502 -12976 -13250 -13696 -13892 -13369 -12582 -12514 -13495 -14863 -15729 -15815 -15540 -15496 -15977
57212 -15977 -16930 -18273 -20091 -22426 -25025 -27493 -29640 -31490 -33068 -34436 -35937 -38039 -40780 -43607 -45906
57197 -45906 -47609 -49153 -50934 -52926 -54761 -56176 -57356 -58790 -60734 -62915 -64841 -66300 -67462 -68638
57183 -68638 -70055 -71717 -73307 -74468 -75333 -76559 -78562 -80912 -82920 -84557 -86310 -88220 -89715 -90507 -91071
57168 -91071 -91940 -93021 -93962 -94828 -95951 -97392 -99013 -100961 -103591 -106784 -109726 -111622 -112471 -112994 -113898 -115381
57152 -115381 -117264 -119340 -121513 -123726 -125902 -127944 -129740 -131217 -132499 -134021 -136293 -139462 -143096 -146471
57138 -146471 -149055 -150844 -152338 -154164 -156569 -159303 -162100 -165073 -168408 -171819 -174778 -177278 -179937 -183245
57124 -183245 -187134 -191481 -196464 -202042 -207529 -212197 -216164 -220230 -224961 -230243 -235633 -240743 -245358 -249504
57110 -249504 -253434 -257429 -261670 -266339 -271606 -277310 -282960 -288338 -293838 -299927 -306458 -312827 -318611 -323725
57096 -323725 -328330 -332970 -338543 -345581 -353641 -361856 -369918 -378136 -386719 -395529 -404477 -413659 -423086 -432613
57082 -432613 -442128 -451471 -460317 -468587 -476833 -485737 -495281 -504861 -514284 -524168 -535364 -548249 -562665
57069 -562665 -578228 -594790 -612856 -633319 -656524 -681823 -708455 -736534 -766577 -798486 -831680
57058 -831680 -866004 -901573 -937748 -973294 -1007833 -1042451 -1078486 -1116198 -1154929 -1194058 -1233512
57047 -1233512 -1273672 -1314996 -1357566 -1400982 -1444969 -1489989 -1536830 -1585754 -1636542 -1689356 -1744915
57036 -1744915 -1803713 -1865616 -1930319 -1997860 -2068570 -2142946 -2221576 -2304889 -2393008 -2486126 -2584798
57025 -2584798 -2689448 -2799964 -2916340 -3039427 -3170433 -3310024 -3458527 -3616660 -3785367
57016 -3785367 -3965433 -4158122 -4365671 -4590150 -4832319 -5092869 -5374500 -5681472 -6017422
57007 -6017422 -6385117 -6788295 -7232266 -7722728 -8265616 -8868574 -9541574 -10296324 -11146730
56998 -11146730 -12110581 -13210326 -14473602 -15936337 -17647921 -19675919 -22111875 -25082106
56990 -25082106 -28761303 -33380848 -39226346 -46622826 -55905655 -67378083 -81265051 -97672924
56982 -97672924 -116551652 -137650671 -160472335 -184235385 -207859414 -230000548 -249204924
56975 -249204924 -264218357 -274353986 -279695953 -280982170 -279243180 -275441253 -270290162 -264249096
56967 -264249096 -257587876 -250459228 -242965736 -235205280 -227274699 -219248371 -211173919 -203096004
56959 -203096004 -195077007 -187190514 -179501071 -172054130 -164877852 -157984726 -151370473 -145017300
56951 -145017300 -138903344 -133012242 -127337468 -121880881 -116647826 -111642552 -106866744 -102320362
56943 -102320362 -98001691 -93905818 -90023100 -86337484 -82823810 -79447048 -76168050 -72954773
56935 -72954773 -69791425 -66679925 -63634843 -60675933 -57821304 -55083480 -52469749 -49984599
56927 -49984599 -47630111 -45403403 -43294302 -41285237 -39351895 -37463926 -35587397 -33689565
56919 -33689565 -31743465 -29730261 -27640424 -25474819 -23244700 -20969695 -18674756 -16387225
56911 -16387225 -14133828 -11937893 -9818298 -7790254 -5865770 -4052697 -2353907 -768001
56902 709682 2087172 3376352 4592780 5755167 6885316 8007797 9148415 10332096
56894 10332096 11581083 12913182 14339422 15861907 17473112 19156753 20889417 22642487
56886 22642487 24384252 26082020 27704016 29221187 30608725 31847053 32922617 33829023
56878 33829023 34568181 35150458 35594049 35924872 36176864 36390825 36610714 36879020 37233470
56869 37233470 37705210 38317200 39082351 40002296 41067408 42257650 43543650 44887907 46246640
56860 46246640 47572896 48820805 49949928 50928403 51734536 52357192 52795290 53056368 53154559
56851 53154559 53108862 52942300 52681801 52358279 52006225 51662401 51363753 51145286 51038212
56842 51038212 51067770 51250579 51592838 52090654 52731918 53497948 54364467 55302642 56280501
56833 56280501 57264352 58220223 59115926 59923354 60619807 61188218 61617272 61902056 62044502
56824 62044502 62053064 61942030 61730741 61442628 61104110 60743745 60391545 60077888 59832190 59681855
56814 59681855 59651277 59760342 60022601 60444113 61023186 61750528 62610014 63580364 64636988
56805 64636988 65752807 66898572 68044238 69161106 70222792 71204581 72083125 72837702
56797 72837702 73451771 73913618 74216623 74359762 74347523 74188662 73895062 73481870 72968068
56788 72968068 72376250 71731827 71062482 70397470 69766149 69196460 68714073 68341643 68097442
56779 68097442 67994162 68038811 68233009 68572687 69047915 69644359 70346080 71137663 72004767
56770 72004767 72933600 73910140 74919586 75946633 76976802 77997635 78998582 79970135
56762 79970135 80903523 81791042 82625949 83402048 84114060 84758702 85335157 85844469 86288807
56753 86288807 86671200 86994953 87262611 87475582 87635110 87743489 87803874 87818963 87790043 87717221
56743 87717221 87600397 87440132 87238253 86998295 86725669 86427162 86109688 85779000 85439250
56734 85439250 85093640 84745401 84398311 84056710 83725240 83408286 83109202 82829840 82570752
56725 82570752 82331546 82110755 81905517 81711624 81523958 81336737 81143751 80939191 80719016
56716 80719016 80481832 80228540 79961126 79681492 79390851 79089617 78777248 78451644 78108388
56707 78108388 77740782 77341149 76902826 76421989 75898817 75337417 74743809 74122820 73476419
56698 73476419 72805151 72110930 71397975 70671280 69935031 69192621 68447012 67699944 66950828
56689 66950828 66197279 65437452 64672186 63905305 63142330 62389091 61651336 60935106 60247094
56680 60247094 59594379 58983788 58421322 57911859 57458997 57064798 56729124 56448546 56215803
56671 56215803 56020845 55853133 55703166 55562243 55421731 55273263 55109302 54923041 54708520
56662 54708520 54462198 54184715 53880440 53555157 53214854 52866473 52518158 52177643 51850771
56653 51850771 51542041 51255742 50995584 50763529 50559717 50383302 50232638 50104808 49995662
56644 49995662 49900425 49813904 49730510 49645052 49553895 49455155 49348033 49232605 49110103 48982663
56634 48982663 48852480 48721496 48591774 48465499 48344433 48229841 48123077 48025613 47938186 47860294
56624 47860294 47790785 47728562 47672452 47620892 47572302 47525714 47480941 47438287 47398286 47361459 47328042
56613 47328042 47297986 47271223 47247633 47226778 47207997 47190940 47175658 47161901 47148717 47135040 47120551
56602 47120551 47105800 47091655 47078843 47067751 47058489 47051231 47046578 47045399 47048285 47055479 47067336 47084283
56590 47084283 47106143 47132058 47161483 47194778 47232339 47273618 47317536 47363500 47411444 47461115 47512019
56579 47512019 47563961 47616977 47670770 47724694 47778373 47831827 47884986 47937508 47988970 48038786 48086045
56568 48086045 48130140 48171688 48212307 48253284 48294936 48337289 48380804 48426146 48473621 48523119 48574225
56557 48574225 48626214 48678362 48730499 48782950 48835784 48888607 48941308 48994551 49049103 49105003 49161797
56546 49161797 49219353 49278092 49338574 49401145 49465815 49532226 49599911 49668781 49739223 49811619 49885972
56535 49885972 49962005 50039216 50116678 50193368 50269100 50344734 50421043 50497804 50574551 50651749 50730407
56524 50730407 50810754 50892146 50974357 51058148 51144264 51232402 51321479 51410548 51499167 51587231 51674836
56513 51674836 51762189 51849368 51936253 52022729 52108816 52194488 52279655 52364438 52449192 52534048 52618593
56502 52618593 52702264 52784953 52866954 52948432 53029275 53109521 53189589 53269859 53350196 53430157 53509605
56491 53509605 53588922 53668634 53749125 53830780 53913983 53998743 54084573 54171157 54258915 54348389 54439137
56480 54439137 54529760 54619139 54707239 54794587 54881586 54968522 55055633 55142615 55228444 55312267 55394265
56469 55394265 55475165 55555106 55633395 55709255 55782372 55852840 55921109 55987994 56054352 56120729 56187518
56458 56187518 56255237 56324128 56393665 56463080 56532337 56602063 56672489 56743132 56813744 56884987 56957836
56447 56957836 57032682 57109260 57187186 57266188 57346125 57427163 57509821 57594678 57682058 57771963 57864050
56436 57864050 57957626 58052001 58147059 58243212 58340705 58439082 58537515 58635356 58732282 58828178 58923067
56425 58923067 59017023 59110010 59202042 59293547 59385161 59477059 59568774 59659942 59750861 59841993 59933195
56414 59933195 60023877 60113801 60203335 60292883 60382375 60471410 60559659 60647060 60733784 60820136 60906490
56403 60906490 60993069 61079715 61165866 61251025 61335331 61419444 61503789 61588165 61672304 61756460 61840970
56392 61840970 61925484 62009307 62092292 62174799 62256752 62337576 62417284 62496783 62576712 62656591 62735634
56381 62735634 62813912 62892063 62970267 63048148 63125406 63201898 63277271 63351175 63423955 63496629 63570073
56370 63570073 63644374 63718875 63792663 63865121 63936320 64006751 64076524 64145063 64211841 64277122 64341598
56359 64341598 64405668 64469571 64533858 64599013 64664694 64730021 64794765 64859777 64926170 64994527 65064957
56348 65064957 65137480 65212073 65288612 65366894 65446542 65526950 65607587 65688405 65769722 65851800 65934730
56337 65934730 66018461 66102448 66185429 66266137 66344445 66421378 66497932 66574161 66649328 66722483 66792975
56326 66792975 66860843 66926839 66991659 67055333 67117873 67180225 67243639 67308016 67371811 67433964 67494977
56315 67494977 67555620 67615529 67673877 67730673 67786367 67840621 67892642 67942662 67992027 68041566 68090576
56304 68090576 68137825 68183012 68226971 68270824 68315264 68360449 68406276 68452693 68499735 68547236 68594792
56293 68594792 68642197 68689672 68737266 68784306 68830063 68875027 68920848 68968781 69018514 69068820 69118920
56282 69118920 69168943 69219377 69270535 69322542 69375453 69429217 69483641 69538467 69593581 69649161 69705516
56271 69705516 69762647 69820039 69877119 69933947 69991247 70049811 70109974 70171551 70233977 70296512 70358734
56260 70358734 70420929 70483630 70546636 70608862 70669373 70728225 70785997 70842911 70898783 70953594 71007654
56249 71007654 71061237 71114427 71167261 71219729 71271664 71322985 71373947 71424858 71475599 71525772 71575248
56238 71575248 71624122 71672207 71718961 71764094 71807784 71850160 71890994 71930160 71968034 72005081 72041302
56227 72041302 72076472 72110756 72144744 72178936 72213394 72247854 72282026 72315858 72349624 72383646 72417840
56216 72417840 72451789 72485370 72519023 72553196 72587852 72622811 72658167 72693948 72729666 72764781 72799499
56205 72799499 72834539 72870253 72906608 72943866 72982537 73022493 73062887 73103239 73143961 73185468 73227321
56194 73227321 73268722 73309393 73349530 73389321 73429057 73469342 73510552 73552295 73593935 73635493 73677465
56183 73677465 73719925 73762409 73804701 73847152 73890070 73933250 73976280 74018926 74061015 74102278 74142502
56172 74142502 74181630 74219568 74256099 74291059 74324524 74356764 74388138 74419008 74449557 74479730 74509556
56161 74509556 74539440 74569927 74601319 74633791 74667718 74703412 74740708 74779415 74820160 74864057 74911287
56150 74911287 74960654 75011013 75062631 75116651 75173674 75233430 75295549 75359868 75425981 75493158 75560888
56139 75560888 75629123 75697717 75765915 75832557 75896670 75957723 76015465 76069512 76119013 76162780 76200007
56128 76200007 76230858 76256183 76276582 76291969 76302047 76306988 76307526 76304556 76298679 76289875 76277607 76261572
56116 76261572 76242536 76222176 76201814 76181495 76160483 76138452 76115824 76093185 76070913 76049351 76028751
56105 76028751 76008898 75989281 75970017 75952169 75936651 75923025 75909982 75896867 75884199 75872665 75862233
56094 75862233 75852524 75843444 75835096 75827411 75820338 75814181 75809246 75805289 75801775 75798572 75795896 75793561 75790859 75787416
56080 75787416 75783733 75780554 75777992 75775690 75773611 75772146 75771411 75770902 75770074 75768954 75767837 75766463 75763941 75759596
56066 75759596 75753628 75746665 75738951 75730368 75721140 75712059 75703757 75696060 75688334 75680289 75672212 75664580 75657723 75651727
56052 75651727 75646431 75641458 75636513 75631687 75627397 75623999 75621428 75619153 75616506 75613293 75610110 75607795 75606466 75605530
56038 75605530 75604726 75604654 75605878 75608092 75610806 75614459 75620002 75627474 75635795 75644025 75652059 75659965 75667477 75674509
56024 75674509 75681532 75688906 75696234 75702781 75708239 75712678 75716047 75717984 75717941 75715290 75709678 75701447 75691141 75678347
56010 75678347 75661541 75639581 75612912 75582799 75549906 75514330 75476640 75437966 75399099 75360314 75322129
55999 75322129 75285480 75250836 75217786 75185788 75154923 75125498 75097278 75069601 75042116 75015082 74988994
55988 74988994 74964131 74940421 74917466 74894703 74871820 74849175 74827708 74808184 74790474 74773759 74757510
55977 74757510 74742039 74727867 74714769 74701993 74689360 74677579 74667257 74658109 74649497 74641277 74633512 74625658
55965 74625658 74616718 74606307 74595017 74583525 74571717 74558860 74544344 74528121 74510537 74491971 74472630
55954 74472630 74452576 74431803 74410260 74387879 74364759 74341195 74317285 74292526 74266192 74238104 74208575
55943 74208575 74177516 74144281 74108699 74071675 74034199 73996283 73957527 73918230 73879151 73840404 73801457
55932 73801457 73762174 73723092 73684691 73647069 73610316 73574527 73539429 73504651 73470453 73437432 73405470
55921 73405470 73373785 73342216 73311560 73282313 73253832 73225289 73196792 73169002 73142162 73116107 73090796
55910 73090796 73066258 73042317 73018859 72996183 72974636 72954126 72934335 72915267 72897277 72880799 72866231
55899 72866231 72853815 72843356 72834287 72826286 72819642 72814919 72812583 72812971 72816078 72821258 72827763 72835789 72846335
55886 72846335 72859772 72875334 72892621 72912749 72937267 72966567 73000239 73038582 73082877 73134339 73193571
55875 73193571 73260886 73336583 73421121 73515565 73621740 73741496 73876160 74027107 74196400 74386547
55865 74386547 74600459 74842368 75118094 75433787 75795572 76211849 76695709 77264654 77939643
55856 77939643 78747030 79722402 80912755 82376255 84180246 86396554 89095469 92343952
55848 92343952 96208873 100757159 106049313 112134691 119044255 126745381 135035661 143434670
55840 143434670 151197456 157511596 161781905 163818023 163820107 162217284 159491029 156068241
55832 156068241 152285823 148392491 144561218 140899861 137457391 134232481 131192182 128296669
55824 128296669 125517246 122841331 120269523 117811087 115478809 113283581 111231717 109326220
55816 109326220 107568820 105959769 104496097 103170459 101971050 100882518 99888063 98971827
55808 98971827 98120003 97320727 96563925 95841085 95144353 94466133 93801059 93148823 92514109
55799 92514109 91903115 91320361 90768463 90249218 89763632 89311182 88889720 88495924 88125600
55790 88125600 87774062 87437017 87111204 86794147 86483549 86176977 85871880 85566070 85258819
55781 85258819 84951837 84648706 84353027 84067124 83792211 83529001 83277851 83038723 82811237
55772 82811237 82594365 82386045 82183774 81985872 81791736 81600790 81411876 81223984 81036911
55763 81036911 80850768 80665473 80481193 80298715 80118833 79941753 79767570 79596738 79429540
55754 79429540 79265626 79104781 78947693 78795205 78647007 78501827 78358619 78216880 78076013
55745 78076013 77935313 77794558 77653851 77512627 77369584 77223852 77075794 76926476 76776856
55736 76776856 76627726 76479924 76334122 76190578 76049374 75910991 75776589 75647598 75524701
55727 75524701 75406895 75291637 75176265 75059228 74939823 74817226 74690522 74559617 74425350
55718 74425350 74288402 74148510 74004973 73857554 73706753 73553652 73399853 73247252 73097350
55709 73097350 72950834 72807981 72669359 72535857 72408001 72285335 72166567 72050256 71935423
55700 71935423 71821567 71708178 71594428 71479363 71362231 71242552 71120098 70994982 70867646
55691 70867646 70738567 70608222 70477506 70347852 70220471 70095575 69972755 69852010 69733933
55682 69733933 69618933 69506692 69396375 69287087 69178109 69069193 68960709 68853227 68746845
55673 68746845 68641137 68535603 68429797 68323180 68215475 68107255 67999675 67893458 67788415
55664 67788415 67684027 67579988 67476099 67372220 67268651 67166120 67065126 66965548 66867021 66769314
55654 66769314 66672160 66575168 66478205 66381503 66285080 66188433 66091135 65993452 65896057 65799317 65703097
55643 65703097 65606928 65510127 65412092 65312850 65213045 65113066 65012427 64910388 64806942 64702767
55633 64702767 64598472 64494302 64390498 64287407 64185157 64083529 63982218 63881005 63779681
55624 63779681 63678044 63576125 63474195 63372463 63270752 63168571 63065593 62962174 62859298
55615 62859298 62757848 62657951 62559122 62460862 62362811 62264600 62166117 62067879 61970545 61873962 61777232
55604 61777232 61679904 61582513 61485741 61389705 61294375 61200019 61106716 61014038 60921824 60830711 60741339
55593 60741339 60653494 60566722 60481324 60397848 60315936 60234553 60153235 60072224 59991596 59911175 59831243
55582 59831243 59752339 59674119 59595394 59515810 59436661 59359510 59284472 59210325 59135898 59060871 58985527
55571 58985527 58910198 58834894 58759289 58683245 58607330 58532372 58458312 58383943 58308137 58230960 58153301
55560 58153301 58075837 57998672 57921730 57844964 57768345 57692012 57616274 57541041 57465423 57388388 57309912
55549 57309912 57231162 57153330 57076472 56999596 56921787 56843119 56764478 56686631 56609609 56533042 56456812
55538 56456812 56381077 56305798 56230699 56155846 56081878 56009372 55938129 55867410 55796795 55726507 55656897
55527 55656897 55587850 55518892 55449864 55381313 55314099 55248633 55184600 55121463 55058996 54997202 54935915
55516 54935915 54874819 54813724 54752524 54691050 54629380 54568135 54507924 54448437 54388604 54327887 54266885
55505 54266885 54206314 54145964 54085122 54023623 53961866 53899942 53837438 53774213 53710818 53647943 53585787
55494 53585787 53524135 53462765 53401536 53340309 53279015 53217770 53156710 53095776 53034849 52974123 52914103
55483 52914103 52855130 52797013 52739280 52681722 52624495 52567665 52510990 52454324 52397994 52342400 52287310
55472 52287310 52231840 52175256 52117494 52058814 51999269 51938693 51877122 51815024 51753093 51691829 51631182
55461 51631182 51570567 51509423 51447787 51386138 51324668 51263041 51201042 51139121 51077899 51017292 50956524
55450 50956524 50895017 50832926 50770735 50708730 50647078 50586049 50525850 50466297 50407012 50347930 50289191
55439 50289191 50230465 50170863 50109967 50048637 49988297 49929354 49870860 49811842 49752364 49693020 49633903
55428 49633903 49574613 49514990 49455232 49395456 49335654 49276040 49216913 49158127 49099183 49039946 48980837
55417 48980837 48922297 48864392 48806907 48749386 48691095 48631587 48571471 48512033 48453816 48396096 48337990
55406 48337990 48279560 48221424 48163801 48106539 48049610 47992965 47936130 47878604 47820569 47762638 47704863
55395 47704863 47646580 47587408 47528032 47469724 47413159 47357759 47302204 47245723 47188950 47133301 47079395
55384 47079395 47026415 46973211 46919597 46866062 46812589 46758543 46703772 46649081 46595355 46542669 46490495
55373 46490495 46438440 46386450 46334563 46282834 46231424 46180493 46130008 46079708 46029296 45978684 45928042
55362 45928042 45877570 45827254 45777013 45727170 45678439 45631090 45584264 45536505 45487005 45436082 45384550
55351 45384550 45333095 45282226 45232249 45182934 45133533 45083523 45033101 44982624 44931850 44880260 44828046
55340 44828046 44776244 44725595 44675598 44625108 44573666 44521823 44470210 44418699 44366717 44314120 44261356
55329 44261356 44208957 44157182 44106062 44055446 44004952 43954263 43903581 43853404 43803772 43754125 43704008
55318 43704008 43653561 43603077 43552561 43502039 43451827 43402062 43352321 43302194 43251908 43201792 43151486
55307 43151486 43100437 43049040 42998415 42948918 42899586 42849398 42798433 42747421 42696644 42645800 42594591
55296 42594591 42543065 42491506 42440297 42389759 42339850 42290096 42240017 42189464 42138424 42086769 42034448
55285 42034448 41981804 41929421 41877619 41826201 41774651 41722571 41670013 41617365 41564820 41512045 41458580
55274 41458580 41404484 41350238 41296064 41241818 41187605 41133989 41081272 41028889 40975845 40921569 40866151
55263 40866151 40810113 40754212 40699157 40645062 40591279 40537082 40482392 40427556 40372669 40317496 40261953
55252 40261953 40206278 40150852 40096114 40042634 39990816 39940436 39890717 39840907 39790671 39740009 39689140
55241 39689140 39638435 39588222 39538525 39489151 39440024 39391211 39342676 39294223 39245780 39197535 39149697
55230 39149697 39102288 39055158 39008104 38961005 38913957 38867294 38821264 38775654 38729905 38683681 38637243
55219 38637243 38591208 38545923 38501072 38455854 38409740 38363082 38316814 38271386 38226252 38180622 38134462
55208 38134462 38088352 38042542 37996667 37950425 37903965 37857416 37810520 37763064 37715335 37667785 37620451
55197 37620451 37573053 37525577 37478351 37431546 37384989 37338485 37292022 37245493 37198515 37150778 37102495
55186 37102495 37054283 37006568 36959362 36912660 36866818 36822170 36778308 36734078 36688513 36641643 36594238
55175 36594238 36546853 36499360 36451329 36402669 36353830 36305551 36258416 36212484 36167237 36122021 36076476
55164 36076476 36030556 35984285 35937781 35891448 35845816 35800969 35756365 35711340 35665661 35619553 35573428
55153 35573428 35527645 35482334 35437255 35392014 35346563 35301237 35256213 35211165 35165734 35120068 35074569
55142 35074569 35029198 34983509 34937366 34891273 34845891 34801413 34757467 34713481 34669099 34624500 34580391
55131 34580391 34537475 34495858 34455025 34414254 34372868 34330271 34286302 34241729 34197938 34155794 34114992
55120 34114992 34074730 34034696 33995065 33955757 33916281 33876315 33836096 33796044 33756262 33716526 33676597
55109 33676597 33636448 33596278 33556363 33516857 33477707 33438763 33399917 33361045 33321927 33282412 33242620
55098 33242620 33202830 33163205 33123862 33085061 33047093 33009922 32973098 32936087 32898500 32860043 32820666
55087 32820666 32780843 32741341 32702494 32663858 32624789 32585158 32545274 32505364 32465469 32425678 32386073
55076 32386073 32346463 32306452 32265894 32225062 32184260 32143468 32102434 32061025 32019439 31978137 31937539
55065 31937539 31897661 31858000 31817921 31777259 31736435 31696011 31656237 31617038 31578215 31539539 31500717
55054 31500717 31461485 31421642 31380952 31339196 31296535 31253774 31211880 31170947 31129939 31087873 31045154
55043 31045154 31003157 30962316 30921237 30878276 30833623 30789048 30745735 30703214 30660587 30617883 30575582
55032 30575582 30533481 30490894 30447701 30404442 30361425 30318458 30275430 30232564 30189976 30147575 30105542
55021 30105542 30064328 30023923 29983648 29943031 29902450 29862494 29823056 29783517 29743727 29704318 29665969
55010 29665969 29628651 29591664 29554251 29516166 29477713 29439288 29401015 29362926 29325301 29288483 29252329
54999 29252329 29216258 29180065 29144259 29109336 29074952 29040232 29004759 28968922 28933269 28897882 28862473
54988 28862473 28826882 28791284 28755939 28720783 28685465 28649812 28614157 28579001 28544444 28510173 28475958
54977 28475958 28441734 28407280 28372279 28336823 28301364 28265922 28229838 28192715 28155163 28118074 28081557
54966 28081557 28045159 28008885 27973293 27938541 27903987 27868916 27833191 27797085 27760890 27724856 27689204
54955 27689204 27654028 27619314 27585043 27551068 27516898 27482049 27446606 27411067 27375676 27340283 27304946
54944 27304946 27270067 27235669 27201080 27165785 27130237 27095269 27060926 27026376 26990948 26954758 26918181
54933 26918181 26881184 26843535 26805449 26767682 26730833 26694764 26658851 26622720 26586511 26550464 26514475
54922 26514475 26478245 26441754 26405333 26369305 26333787 26298796 26264298 26230108 26195903 26161442 26126708
54911 26126708 26091867 26057182 26022913 25989031 25955082 25920575 25885573 25850677 25816360 25782503 25748693
54900 25748693 25714676 25680434 25646052 25611736 25577832 25544586 25511815 25478928 25445269 25410620 25375429
54889 25375429 25340504 25306253 25272374 25238468 25204806 25172048 25140220 25108524 25076316 25043790 25011435
54878 25011435 24979294 24947189 24915296 24883951 24853086 24822292 24791363 24760399 24729491 24698678 24668091
54867 24668091 24637695 24607053 24575884 24544782 24514658 24485351 24455497 24424173 24392115 24360763 24330485
54856 24330485 24300405 24269775 24238725 24207656 24176615 24145605 24114983 24085011 24055327 24025427 23995470
54845 23995470 23966013 23936974 23907469 23876847 23845419 23813809 23782127 23750271 23718615 23687662 23657159
54834 23657159 23626340 23595132 23564355 23534432 23504579 23473879 23442678 23412279 23383424 23355651 23327999
54823 23327999 23299729 23270389 23239874 23208726 23177854 23147612 23117390 23086416 23054771 23023279 22992544
54812 22992544 22962402 22932281 22901818 22871036 22840049 22808802 22777089 22744808 22712154 22679530 22647239
54801 22647239 22615304 22583585 22552060 22520969 22490638 22461112 22431950 22402531 22372650 22342709 22313182
54790 22313182 22284050 22254966 22225899 22197312 22169552 22142368 22115276 22088243 22061688 22035764 22009927
54779 22009927 21983472 21956478 21929916 21904619 21880183 21855140 21828276 21799634 21770099 21740372 21710661
54768 21710661 21681180 21652300 21623995 21595663 21566896 21538149 21510182 21482948 21455516 21427136 21397990
54757 21397990 21368799 21340127 21312190 21284885 21257688 21229864 21201220 21172495 21144538 21117241 21089754
54746 21089754 21061643 21033266 21005097 20977315 20950267 20924543 20900055 20875605 20850023 20823450 20796886
54735 20796886 20770722 20744440 20717629 20690420 20662822 20634444 20605243 20575925 20547183 20518954 20490824
54724 20490824 20462823 20435355 20408575 20382249 20355995 20329438 20302362 20274974 20247799 20221028 20194248
54713 20194248 20167132 20139966 20113058 20086006 20058172 20029635 20001102 19972981 19945206 19917914 19891591
54702 19891591 19866345 19841559 19816442 19790608 19764073 19737092 19710107 19683428 19656797 19629704 19602175
54691 19602175 19574783 19547860 19521166 19494563 19468389 19442862 19417624 19392290 19366955 19341744 19316238
54680 19316238 19289923 19263037 19236469 19210817 19185901 19161177 19136365 19111724 19087841 19064981 19042560
54669 19042560 19019544 18995569 18971330 18947614 18924330 18900799 18876558 18851456 18825455 18798880 18772570
54658 18772570 18747118 18722140 18696869 18671193 18645423 18619367 18592474 18564810 18536876 18508460 18478817
54647 18478817 18448246 18418337 18390011 18362275 18333744 18304590 18275951 18248084 18220284 18192396 18165128
54636 18165128 18138749 18112500 18085729 18058811 18032531 18007102 17982222 17957600 17932983 17908009 17882515
54625 17882515 17856764 17831033 17805199 17779045 17752752 17726720 17700991 17675261 17649443 17623818 17598544
54614 17598544 17573264 17547331 17520366 17492499 17464141 17435675 17407374 17379615 17352975 17327845 17303858
54603 17303858 17280022 17255583 17230590 17205451 17180183 17154464 17128347 17102513 17077734 17054280 17031796
54592 17031796 17009521 16986670 16962925 16938679 16914553 16890581 16866228 16841243 16816097 16791302 16766660
54581 16766660 16741634 16716278 16691268 16667076 16643516 16620166 16596837 16573427 16549648 16525256 16500467
54570 16500467 16475864 16451892 16428631 16406031 16384118 16362825 16341668 16319804 16296604 16272231 16247622
54559 16247622 16223788 16201053 16178938 16156726 16134119 16111408 16089109 16067394 16045845 16023795 16001019
54548 16001019 15978075 15955835 15934634 15913974 15893121 15871853 15850552 15829488 15808189 15785727 15761704
54537 15761704 15736850 15712500 15689501 15667776 15646896 15626610 15606595 15586183 15564800 15542616 15520306
54526 15520306 15498120 15475692 15452869 15430207 15408298 15386886 15365060 15342314 15319134 15296493 15274987
54515 15274987 15254373 15233893 15213001 15191691 15170095 15147943 15124875 15101332 15078609 15057555 15037559
54504 15037559 15017241 14995951 14974129 14952391 14930873 14909540 14888515 14867742 14846773 14825209 14803155
54493 14803155 14780984 14758882 14736856 14715001 14693410 14671919 14650262 14628500 14607050 14586238 14565962
54482 14565962 14545789 14525241 14503974 14481804 14458700 14434837 14410664 14386895 14364116 14342224 14320445
54471 14320445 14298099 14275357 14253044 14231696 14211025 14190322 14169178 14147697 14126220 14105037 14084277
54460 14084277 14063847 14043376 14022433 14000940 13979349 13958277 13937898 13917802 13897525 13877155 13857235
54449 13857235 13838109 13819553 13801112 13782537 13763664 13744083 13723329 13701534 13679603 13658530 13638648
54438 13638648 13619631 13600994 13582351 13563283 13543418 13522944 13502764 13483813 13466194 13449167 13431995
54427 13431995 13414557 13396998 13379155 13360671 13341624 13322623 13304124 13285888 13267344 13248248 13228744
54416 13228744 13209020 13189194 13169551 13150502 13132140 13114042 13095704 13077045 13058332 13039712 13020964
54405 13020964 13001801 12982299 12962894 12943893 12925064 12905891 12886303 12866882 12848081 12829502 12810418
54394 12810418 12790951 12772140 12754547 12737279 12718837 12698690 12677610 12656664 12636440 12617120 12598679
54383 12598679 12580803 12563050 12545265 12527652 12510272 12492833 12475081 12457075 12438973 12420866 12402942
54372 12402942 12385429 12368088 12350207 12331478 12312516 12294048 12275902 12257310 12238044 12218682 12199757
54361 12199757 12181262 12163023 12145027 12127259 12109682 12092500 12075973 12059723 12042676 12024097 12004491
54350 12004491 11985174 11967073 11950099 11933316 11915532 11896042 11875268 11854487 11834641 11815478 11796131
54339 11796131 11776317 11756555 11737292 11718385 11699517 11680787 11662658 11645412 11628796 11612106 11594578
54328 11594578 11575934 11556665 11537720 11519833 11503074 11486937 11470815 11454426 11437880 11421363 11404838
54317 11404838 11388236 11371881 11356319 11341553 11326758 11311084 11294510 11277579 11260585 11243478 11226477
54306 11226477 11210154 11194762 11179839 11164695 11148999 11132814 11116413 11100159 11084287 11068609 11052695
54295 11052695 11036471 11020421 11004989 10990026 10975070 10959914 10944734 10929735 10914871 10899900 10884543
54284 10884543 10868705 10852606 10836659 10821188 10806325 10791989 10777778 10763003 10747278 10731108 10715477
54273 10715477 10700688 10686039 10670789 10654972 10638986 10622935 10606882 10591324 10576757 10562862 10548716
54262 10548716 10533841 10518560 10503316 10488141 10472893 10457578 10442311 10427232 10412599 10398618 10384988
54251 10384988 10370954 10356069 10340771 10325962 10312108 10298871 10285656 10272390 10259655 10247944 10236861
54240 10236861 10225290 10212531 10199034 10185774 10173135 10160697 10147960 10134765 10121130 10107113 10092944
54229 10092944 10078927 10065125 10051482 10038188 10025365 10012370 9998106 9982285 9965845 9949753 9933991
54218 9933991 9918221 9902822 9888393 9874541 9860118 9844737 9829245 9814490 9800333 9786204 9771996
54207 9771996 9757848 9743495 9728539 9713191 9698138 9683620 9669146 9654255 9639188 9624502 9610258
54196 9610258 9596009 9581424 9566615 9551845 9537176 9522515 9507775 9492822 9477483 9461791 9446089
54185 9446089 9430742 9415884 9401583 9388054 9375359 9363032 9350386 9337148 9323454 9309281 9294495
54174 9294495 9279550 9265425 9252482 9239849 9226485 9212478 9198710 9185527 9172483 9159283 9146177
54163 9146177 9133366 9120670 9108035 9095689 9083442 9070485 9056457 9042270 9029248 9017675 9006670
54152 9006670 8995331 8983417 8970970 8957968 8944540 8931044 8917741 8904739 8892405 8881311 8871356
54141 8871356 8861323 8849873 8836978 8823922 8811811 8800491 8788953 8776468 8763063 8749185 8735310
54130 8735310 8721856 8709090 8696963 8685166 8673407 8661531 8649345 8636539 8622991 8609041 8595279
54119 8595279 8581992 8568951 8555680 8541856 8527571 8513401 8500225 8488603 8478100 8467441 8455634
54108 8455634 8442828 8429902 8417342 8404896 8392255 8379553 8366937 8354112 8340814 8327559 8315279
54097 8315279 8304075 8292850 8280543 8267398 8254617 8242928 8231983 8221170 8210405 8199814 8189086
54086 8189086 8177606 8165229 8152494 8139955 8127656 8115340 8102926 8090545 8078265 8066038 8053877
54075 8053877 8041878 8030086 8018549 8007532 7997367 7987864 7978106 7967170 7955097 7942830 7931087 7919542
54063 7919542 7907420 7894596 7881735 7869407 7857454 7845370 7832936 7820237 7807372 7794509 7782083
54052 7782083 7770581 7760047 7749973 7739761 7729138 7718135 7706853 7695292 7683333 7670929 7658336
54041 7658336 7646088 7634540 7623568 7612874 7602396 7592138 7581730 7570678 7559121 7547857 7537392
54030 7537392 7527367 7517108 7506366 7495218 7483606 7471463 7459078 7446852 7434821 7422817 7410978
54019 7410978 7399638 7388702 7377715 7366627 7355978 7346043 7336248 7325818 7314748 7303673 7292896 7281934
54007 7281934 7270128 7257496 7244842 7233097 7222594 7212933 7203479 7193849 7183942 7173651 7162827 7151533
53995 7151533 7140055 7128605 7117204 7105911 7094906 7084228 7073639 7062924 7052153 7041451 7030744
53984 7030744 7019979 7009353 6999021 6988709 6977990 6966964 6956335 6946697 6937920 6929282 6920037 6909907
53972 6909907 6899259 6888845 6879136 6869898 6860600 6851151 6841954 6833175 6824425 6815362 6806294 6797929 6790814
53959 6790814 6785137 6780774 6777075 6772844 6767059 6759664 6751314 6742353 6732423 6721150 6708800 6696030 6683380
53946 6683380 6671194 6659677 6648675 6637506 6625525 6612935 6600762 6589916 6580378 6571357 6562060 6552250
53934 6552250 6542244 6532557 6523533 6515126 6506956 6498537 6489519 6479869 6469928 6460236 6451088 6442258 6433280 6424007
53920 6424007 6414708 6405521 6396112 6386173 6376085 6366714 6358434 6350589 6342108 6332519 6322237 6312054 6302435
53907 6302435 6293214 6283837 6273924 6263758 6254066 6245178 6236525 6227202 6216957 6206379 6196073 6186064 6176135
53894 6176135 6166339 6156850 6147513 6137969 6128193 6118526 6109129 6099795 6090389 6081180 6072506 6064368 6056557 6048921
53880 6048921 6041342 6033656 6025901 6018423 6011379 6004312 5996650 5988475 5980302 5972181 5963644 5954615 5945641 5936935
53866 5936935 5927871 5917999 5908020 5898999 5890886 5882565 5873207 5862922 5852138 5841147 5830372 5820378 5811220
53853 5811220 5802352 5793424 5784721 5776550 5768736 5761061 5753709 5746835 5740044 5732772 5724822 5716165 5706660 5696583
53839 5696583 5686973 5678765 5671743 5664984 5658176 5651785 5646003 5640293 5634141 5627625 5621023 5614435 5607966 5601789
53825 5601789 5595759 5589464 5582929 5576817 5571657 5567184 5562731 5557908 5552662 5547088 5541538 5536541 5532303 5528532
53811 5528532 5525002 5521981 5519679 5517587 5514834 5511114 5506976 5503242 5500303 5497742 5494390 5489129 5481936 5473853
53797 5473853 5465659 5456949 5446954 5435837 5424534 5413541 5402579 5391370 5380047 5368651 5356883 5344629
53785 5344629 5332315 5320540 5309547 5299193 5289190 5279262 5269348 5259648 5250182 5240401 5229649 5218023
53773 5218023 5206389 5195408 5184942 5174539 5164085 5153801 5143897 5134469 5125533 5116903 5108253 5099445
53761 5099445 5090618 5081915 5073260 5064440 5055255 5045609 5035718 5026119 5017128 5008402 4999498 4990742 4982884 4975801
53747 4975801 4968346 4959786 4950684 4941881 4933265 4924138 4914429 4904770 4895654 4887141 4879220 4871819 4864525 4856917
53733 4856917 4849182 4841816 4834712 4827138 4818780 4810286 4802458 4795235 4787848 4779780 4771330 4763290 4756136 4749602
53719 4749602 4742938 4735603 4727634 4719407 4711312 4703728 4696961 4690942 4685108 4678928 4672395 4665746 4658972 4652009
53705 4652009 4645165 4638853 4632894 4626568 4619464 4611887 4604374 4597184 4590396 4584146 4578554 4573594 4569123 4564788
53691 4564788 4559977 4554207 4547702 4541276 4535511 4530263 4525084 4519851 4514782 4510018 4505326 4500208 4494268 4487670
53677 4487670 4481091 4475041 4469328 4463393 4457135 4450978 4445193 4439538 4433534 4426700 4418606 4409314 4399914 4391881
53663 4391881 4385502 4379449 4372254 4363844 4355251 4347266 4339913 4332876 4325810 4318356 4310412 4302361 4294688 4287455
53649 4287455 4280458 4273701 4267225 4260655 4253491 4245904 4238718 4232350 4226191 4219337 4211671 4204010 4197243 4191482
53635 4191482 4185990 4179869 4172842 4165369 4158027 4150933 4143839 4136597 4129237 4121685 4113825 4105918 4098636 4092472
53621 4092472 4087215 4082149 4076724 4070924 4064986 4058922 4052466 4045613 4038944 4033141 4028116 4022966 4016976 4010341
53607 4010341 4003732 3997492 3991555 3985837 3980227 3974422 3968282 3962273 3957095 3952786 3948584 3943751 3938176 3932179
53593 3932179 3926172 3920496 3915164 3909705 3903633 3897245 3891428 3886544 3882003 3877146 3872082 3867209 3862412 3857340
53579 3857340 3852060 3846813 3841312 3835011 3828191 3822003 3817114 3812877 3808192 3802805 3797215 3791579 3785445 3778591
53565 3778591 3771562 3765079 3759243 3753680 3748147 3742501 3736383 3729552 3722588 3716613 3711970 3707734 3702888 3697490
53551 3697490 3692152 3686843 3681034 3674849 3669032 3663678 3657945 3651456 3645153 3640026 3635594 3630540 3624548 3618618
53537 3618618 3613554 3609054 3604488 3599837 3595296 3590496 3584740 3577950 3570856 3564205 3558187 3552707 3547845 3543658
53523 3543658 3539647 3534820 3528595 3521673 3515717 3511900 3509806 3507898 3505052 3501391 3497553 3493569 3488871 3483328
53509 3483328 3477730 3472998 3469227 3465824 3462370 3458946 3455671 3452399 3449013 3445620 3442216 3438426 3433899 3428836
53495 3428836 3423901 3419766 3416836 3415118 3413973 3412235 3409212 3405585 3402842 3401670 3401332 3400701 3399479 3398052
53481 3398052 3396556 3394515 3391346 3386926 3381681 3376268 3371129 3366294 3361652 3357378 3353749 3350512 3346784 3341845
53467 3341845 3335818 3329410 3323178 3317184 3311153 3304782 3298142 3291933 3286981 3283184 3279353 3274453 3268750 3263293
53453 3263293 3258596 3254289 3249894 3245371 3240886 3236517 3232218 3227699 3222465 3216488 3210690 3206151 3202769 3199368
53439 3199368 3195265 3191058 3187558 3184593 3181390 3177707 3173902 3170172 3166341 3162419 3158809 3155747 3152836 3149392
53425 3149392 3145179 3140706 3136766 3133654 3130953 3128202 3125640 3123976 3123345 3122977 3122154 3121143 3120774 3121245 3121799
53410 3121799 3121632 3120765 3119955 3119874 3120514 3121291 3121683 3121806 3122371 3124016 3126779 3130204 3133811 3137385 3140950 3144647
53394 3144647 3148542 3152560 3156724 3161399 3166976 3173237 3179343 3184727 3189686 3194835 3200297 3205828 3211458 3217445
53380 3217445 3223654 3229561 3234912 3239945 3244894 3249677 3254319 3259293 3265124 3271763 3278516 3284613 3289838 3294699
53366 3294699 3299929 3305583 3310868 3315102 3318622 3322301 3326355 3330194 3333479 3336511 3339344 3341216 3341365 3339958
53352 3339958 3337703 3335016 3332111 3329457 3327447 3325733 3323515 3320414 3316448 3311352 3304704 3296808 3288775 3281368
53338 3281368 3274306 3266980 3259251 3251243 3242870 3234116 3225502 3217743 3211034 3205072 3199557 3194328 3189019 3183109
53324 3183109 3176469 3169532 3162859 3156695 3150988 3145636 3140590 3135876 3131616 3127970 3125011 3122694 3120908 3119526
53310 3119526 3118404 3117511 3116990 3116940 3117204 3117541 3118072 3119365 3121923 3125622 3129695 3133345 3136442 3139629 3143777 3149234
53294 3149234 3155678 3162689 3170337 3179052 3189023 3200004 3211717 3224283 3238080 3253167 3268892 3284194
53282 3284194 3298515 3312521 3327729 3345142 3364240 3383438 3401550 3418644 3435592 3453089 3471227
53271 3471227 3489751 3508436 3527134 3545584 3563363 3580214 3596383 3612337 3628003 3642615 3655609
53260 3655609 3667375 3678652 3689296 3698225 3704582 3708431 3710280 3710482 3709261 3706735 3702593 3696325 3688085
53247 3688085 3678846 3669285 3659041 3647630 3635453 3623175 3610578 3597073 3583064 3569698 3557110 3544000
53235 3544000 3529349 3513640 3497857 3482068 3465751 3449021 3432662 3417118 3402155 3387455 3372972
53224 3372972 3358635 3344211 3329685 3315457 3301999 3289418 3277443 3265814 3254633 3244302 3234989
53213 3234989 3226127 3216727 3206259 3195006 3183494 3172007 3160819 3150405 3140956 3132046 3123265 3114881
53201 3114881 3107397 3100714 3094375 3088372 3082976 3077862 3072269 3066198 3060594 3056028 3051993 3047903 3044078 3041089
53187 3041089 3038735 3036508 3034686 3034095 3034884 3036391 3038288 3041030 3044922 3049432 3053809 3057919 3062036 3066159
53173 3066159 3070062 3073793 3077619 3081460 3084796 3087345 3089529 3092048 3095026 3097774 3099457 3099878 3099529 3098878 3097798
53158 3097798 3095780 3092543 3088218 3083059 3077241 3070935 3064298 3057199 3049248 3040277 3030591 3020564 3010151
53145 3010151 2999136 2987702 2976398 2965534 2954916 2944250 2933471 2922543 2911239 2899356 2886983
53134 2886983 2874317 2861354 2847994 2834357 2820685 2807013 2793231 2779494 2766253 2753790 2742002
53123 2742002 2730712 2719936 2709573 2699160 2688304 2677278 2666778 2657113 2647898 2638600 2629036 2619275
53111 2619275 2609324 2599133 2588758 2578356 2568128 2558328 2549040 2539858 2530067 2519413 2508483 2497966
53099 2497966 2487846 2477715 2467671 2458295 2449662 2441003 2431654 2421888 2412443 2403522 2394799 2386176 2377989
53086 2377989 2370452 2363263 2355885 2347968 2339447 2330524 2321674 2313355 2305550 2297802 2289843 2281950 2274389 2266838
53072 2266838 2258767 2250332 2242352 2235233 2228351 2220846 2212800 2205208 2198802 2193312 2187907 2181959 2175239 2167739
53058 2167739 2159771 2152052 2145233 2139316 2133756 2128188 2122762 2117728 2113000 2108243 2103117 2097335 2090781 2083872
53044 2083872 2077424 2071820 2066490 2060552 2053913 2047353 2041531 2036321 2031166 2025778 2020312 2015060 2010206 2005699
53030 2005699 2001288 1996805 1992384 1988280 1984414 1980391 1976058 1971725 1967700 1963750 1959349 1954364 1949206 1944336
53016 1944336 1939768 1935169 1930312 1925358 1920667 1916312 1911883 1906893 1901327 1895683 1890477 1885875 1881764 1877980
53002 1877980 1874409 1870991 1867658 1864216 1860344 1855976 1851564 1847573 1843724 1839167 1833614 1827848 1822883 1819028
52988 1819028 1815986 1813397 1810818 1807580 1803307 1798412 1793595 1789017 1784495 1780342 1777242 1775237 1773526 1771424
52974 1771424 1768951 1766226 1762907 1758699 1753998 1749541 1745605 1741982 1738603 1735729 1733441 1731268 1728464 1724660
52960 1724660 1720215 1715959 1712424 1709326 1705898 1701738 1697155 1692692 1688612 1684906 1681420 1677784 1673461 1668268
52946 1668268 1662767 1657957 1654571 1652664 1651622 1650420 1648185 1644849 1641155 1637836 1634900 1631897 1628644 1625337
52932 1625337 1622070 1618684 1615124 1611626 1608363 1605143 1601655 1597931 1594300 1590950 1587674 1584153 1580467 1577091
52918 1577091 1574390 1572255 1570324 1568404 1566411 1564173 1561627 1559125 1557116 1555492 1553673 1551368 1548844 1546388
52904 1546388 1543957 1541559 1539400 1537369 1534932 1531937 1529023 1526690 1524484 1521798 1519011 1516954 1515387 1512999
52890 1512999 1509137 1504736 1501214 1498967 1497374 1495842 1494286 1492724 1490788 1487919 1484067 1480112 1477263 1475818
52876 1475818 1474785 1473037 1470520 1467877 1465306 1462586 1460076 1458701 1458657 1458920 1458432 1457169 1455607 1453765 1451337
52861 1451337 1448420 1445501 1442986 1441124 1440098 1439685 1439061 1437485 1435093 1432631 1430512 1428472 1426088 1423265
52847 1423265 1420264 1417497 1415242 1413347 1411307 1408843 1406241 1403949 1402045 1400318 1398601 1396750 1394632 1392456
52833 1392456 1390751 1389552 1388005 1385349 1381987 1378867 1376077 1372911 1369343 1366422 1364878 1364138 1363193 1361836
52819 1361836 1360435 1358969 1357020 1354480 1351688 1348929 1346287 1343978 1342285 1341072 1339747 1337956 1336100 1334851
52805 1334851 1334224 1333374 1331427 1328432 1325305 1322819 1320859 1318839 1316654 1314782 1313443 1312125 1310251 1308039
52791 1308039 1306306 1305509 1305265 1304823 1303725 1301980 1299848 1297656 1295724 1294261 1293239 1292321 1291005 1288903 1286030
52776 1286030 1282805 1279719 1276972 1274403 1271775 1269095 1266611 1264536 1262804 1261224 1259816 1258797 1258167 1257545
52762 1257545 1256588 1255401 1254212 1252802 1250661 1247796 1244993 1243073 1242099 1241515 1240833 1239920 1238783 1237398 1235737
52747 1235737 1233764 1231389 1228533 1225259 1221753 1218281 1215163 1212622 1210513 1208333 1205749 1203027 1200742 1199140
52733 1199140 1197969 1196861 1195562 1193852 1191655 1189320 1187435 1186122 1184807 1182958 1180829 1179137 1178100 1177251
52719 1177251 1176273 1175589 1175833 1176890 1177823 1177768 1176679 1175157 1173718 1172368 1170771 1168675 1166147 1163516 1161139
52704 1161139 1159142 1157291 1155185 1152656 1150018 1147803 1146135 1144481 1142210 1139362 1136672 1134697 1133239 1131767
52690 1131767 1130215 1128951 1128066 1127118 1125711 1123946 1122139 1120378 1118696 1117357 1116578 1116046 1115105 1113483 1111515
52675 1111515 1109629 1107881 1106084 1104137 1102089 1100069 1098214 1096522 1094729 1092496 1089880 1087443 1085761 1084850
52661 1084850 1084153 1083101 1081662 1080389 1079803 1079667 1078999 1077041 1074128 1071314 1069194 1067440 1065539 1063531 1061815
52646 1061815 1060564 1059627 1058858 1058277 1058017 1058172 1058555 1058546 1057501 1055477 1053284 1051615 1050395 1049234 1048104 1047124
52630 1047124 1045971 1044094 1041499 1038875 1036933 1035923 1035713 1035920 1035941 1035282 1033964 1032366 1030694 1028927 1027209
52615 1027209 1025815 1024661 1023338 1021847 1020800 1020611 1020805 1020510 1019411 1017876 1016338 1014861 1013266 1011407 1009335
52600 1009335 1007381 1005982 1005225 1004629 1003528 1001729 999719 998243 997679 997686 997421 996212 994156 991977 990308 989280
52584 989280 988721 988438 988150 987498 986382 985066 983765 982312 980531 978712 977399 976754 976401 975860 974974 973958
52568 973958 973199 972882 972688 972004 970662 969301 968682 968781 968825 968212 967097 966080 965579 965491 965269 964387 962840 961147
52550 961147 959681 958213 956389 954392 952720 951448 950128 948447 946495 944428 942320 940397 938992 938087
52536 938087 937294 936461 935849 935551 935111 934034 932391 930722 929562 929187 929474 929806 929442 928199 926577 925064
52520 925064 923691 922394 921342 920609 919880 918847 917526 915898 913695 911015 908685 907377 906751 906061 905323
52505 905323 905063 905136 904695 903372 901659 899943 898033 895958 894442 893992 894010 893433 891963 890170 888611 887347
52489 887347 886262 885327 884588 884185 884399 885343 886536 887061 886328 884654 882989 881963 881216 879798 877345 874706
52473 874706 873121 872868 873070 872776 871850 870757 869882 869286 868752 867920 866665 865486 865135 865605 865976 865549 864637
52456 864637 863792 862759 860884 858302 855959 854534 853955 853910 854138 854086 853016 850819 848324 846440 845288 844409
52440 844409 843540 842824 842391 842051 841413 840219 838614 837090 836065 835549 835347 835462 835907 836275 835899 834597 832831
52423 832831 831057 829378 827976 827324 827530 827849 827355 825909 824097 822404 820855 819356 817945 816768 816131
52408 816131 816479 817886 819582 820427 819912 818378 816362 814180 812258 811204 811140 811310 810784 809487 808165 807443
52392 807443 807173 806738 805732 804239 802622 801137 799742 798246 796619 795149 794209 793937 794167 794598 794954 795029
52376 795029 794725 794105 793332 792545 791755 790885 789939 789108 788629 788433 788031 786921 785083 782951 780955 779344 778327
52359 778327 778020 778109 777916 777116 776144 775585 775336 774753 773533 772051 770827 770081 769785 769773 769616 768863 767575 766379
52341 766379 765749 765584 765633 765902 766228 765937 764541 762632 761369 761033 760714 759554 757725 755824 753941 751821
52325 751821 749585 747677 746168 744746 743401 742661 742864 743447 743295 741735 739151 736654 735217 735011 735504 736110
52309 736110 736689 737296 737688 737424 736538 735805 736044 737277 738794 739962 740697 741140 741183 740568 739370 738038 736928
52292 736928 735959 734825 733401 731750 729935 728029 726265 724919 724004 723284 722613 722053 721672 721430 721331 721398 721409
52275 721409 721003 720215 719580 719386 719105 718047 716417 715227 715088 715572 715917 715965 716141 716713 717405 717652 717099 715937
52257 715937 714736 713946 713486 712972 712274 711622 711273 711341 711994 713381 715170 716526 716883 716495 715974 715513 715077 715067
52239 715067 716159 718324 720557 721911 722388 722533 722431 721704 720360 719142 718811 719408 720466 721664 722972 724334
52223 724334 725627 726989 728828 731379 734421 737594 740778 744042 747391 750742 753954 756841 759336 761866
52209 761866 765307 770154 775919 781628 786922 792309 798415 805354 812784 820241 827348 834143 841253 849295
52195 849295 857960 866149 873284 880009 887222 894834 902032 908500 914721 921094 927359 933017 937964 942456
52181 942456 946757 951017 955291 959482 963328 966633 969489 972194 974960 977730 980291 982462 984214 985600
52167 985600 986685 987616 988673 990056 991622 993021 994164 995319 996671 998075 999415 1001017 1003342 1006500
52153 1006500 1010314 1014783 1020138 1026441 1033340 1040165 1046150 1050757 1054244 1057819 1062750 1069100 1075615 1081070
52139 1081070 1085552 1090203 1095845 1102078 1107762 1112258 1116019 1119924 1124135 1127879 1130415 1131896 1133078 1134419
52125 1134419 1135838 1137136 1138173 1138658 1138313 1137414 1136699 1136565 1136632 1136281 1135312 1133853 1132002 1129935 1128134 1127132
52109 1127132 1127002 1127358 1127750 1127924 1127783 1127418 1127140 1127246 1127707 1128230 1128622 1128930 1129258 1129691 1130427 1131797 1133982 1136774
52091 1136774 1139710 1142398 1144694 1146607 1148098 1149051 1149460 1149649 1150153 1151197 1152376 1153032 1153036 1153007 1153626 1154842 1155990
52074 1155990 1156617 1156861 1156910 1156432 1154923 1152524 1150071 1148223 1146853 1145425 1143687 1141798 1140054 1138798 1138404
52059 1138404 1138962 1139977 1140738 1141009 1141211 1141937 1143411 1145323 1146896 1147254 1146118 1144248 1142872 1142568 1142924 1143301
52043 1143301 1143581 1143953 1144342 1144399 1143926 1143131 1142487 1142491 1143380 1144927 1146569 1147863 1148723 1149170 1149014 1148068 1146613 1145513
52025 1145513 1145738 1147680 1150775 1153882 1156197 1157849 1159488 1161404 1163410 1165531 1168324 1172215 1176869 1181531
52011 1181531 1185869 1190201 1195093 1200934 1207786 1215331 1222984 1230316 1237346 1244357 1251541 1258967 1266731 1274859
51997 1274859 1283160 1291343 1299207 1306581 1313271 1319329 1325207 1331323 1337532 1343295 1348385 1353075 1357708 1362329
51983 1362329 1366809 1371040 1374837 1377889 1379992 1381319 1382393 1383714 1385339 1386772 1387435 1387298 1386897 1386612 1386190
51968 1386190 1385225 1383889 1382853 1382643 1383337 1384827 1386903 1389157 1391254 1393367 1395963 1398982 1401699 1403585 1404932
51953 1404932 1406349 1407964 1409602 1411456 1414071 1417605 1421533 1425250 1428684 1432237 1436254 1440712 1445331 1449808
51939 1449808 1453996 1457865 1461396 1464517 1467304 1470100 1473260 1476575 1479117 1479895 1478713 1476236 1473258 1470113
51925 1470113 1466931 1464078 1461961 1460442 1458708 1455911 1451781 1446756 1441682 1437310 1433738 1430253 1426082 1421245
51911 1421245 1416349 1411534 1406180 1399995 1393819 1388775 1384884 1381047 1376342 1370778 1364807 1358618 1352152 1345501
51897 1345501 1339057 1333298 1328379 1323797 1318586 1312159 1304834 1297342 1289975 1282578 1275176 1267990 1260753 1252598
51883 1252598 1242961 1232305 1221715 1211951 1203020 1194434 1185690 1176641 1167587 1159017 1151325 1144801 1139523
51870 1139523 1134990 1130101 1124136 1117603 1111572 1106225 1100726 1094563 1088238 1082346 1076756 1071149 1065750 1060875
51856 1060875 1056260 1051461 1046562 1041920 1037468 1032899 1028339 1024195 1020463 1016771 1013075 1009777 1007158 1005170
51842 1005170 1003769 1002978 1002539 1001994 1001152 1000211 999330 998391 997170 995413 992884 989780 986889 984796 982954 980182
51826 980182 976172 971878 968245 965191 962093 958690 955115 951530 948141 945208 942594 939734 936437 933356
51812 933356 931144 929472 927496 925078 922880 921250 919743 917926 916115 915010 914800 914969 914959 914839 915390 917404
51796 917404 920878 924885 928369 930913 932579 933350 933158 932320 931353 930174 928003 924258 919292 913985 908989
51781 908989 904591 900919 897938 895337 892885 890704 888923 887150 884714 881420 877729 874185 870931 867805
51767 867805 864573 860931 856709 852209 848075 844611 841411 837986 834471 831447 829095 826943 824429 821458
51753 821458 818361 815509 813096 811001 808703 805486 800987 795616 790237 785448 781212 777208 773415 770194
51739 770194 767869 766353 765327 764564 763911 763110 761933 760538 759334 758372 757173 755352 753150 751091 749388
51724 749388 747967 746848 746074 745400 744550 743638 742941 742242 740980 739084 737132 735500 733861 731769 729255 726559
51708 726559 723774 721094 718937 717325 715559 713061 710271 708077 706639 705405 704104 702985 702071 700986
51694 700986 699697 698729 698249 697505 695613 692624 689424 686874 685376 684910 685080 685210 684795 683942 683209 683082 683602
51677 683602 684347 684613 683898 682430 681045 680364 680197 679927 679225 678166 676852 675304 673624 671931 670125 668026
51661 668026 665747 663746 662375 661536 660725 659480 657847 656474 655982 656125 655866 654571 652844 651756 651403 650745
51645 650745 648903 646218 643843 642599 642424 642715 642999 643364 644294 645952 647664 648359 647548 645672 643447 641279
51629 641279 639441 638359 638256 638664 638756 638153 637113 635920 634486 632771 631254 630586 630730 630768 629738 627608
51613 627608 625264 623571 622682 622236 621979 621980 622390 623188 624072 624503 624010 622722 621397 620613 620089 619194 618049 617505
51595 617505 617957 618805 619322 619472 619441 618925 617543 615654 614076 613076 612291 611522 610952 610422 609246 607113 604680
51578 604680 602889 601974 601488 600948 600068 598609 596536 594390 593002 592723 593084 593316 593063 592546 592210 592273 592563
51561 592563 592733 592630 592468 592579 593127 594083 595395 596978 598514 599521 599767 599648 600022 601543 604063 606665
51545 606665 608402 608999 608867 608481 607934 607096 605940 604543 602875 600880 598764 597100 596502 597093 598323 599356
51529 599356 599785 599877 599987 599901 599103 597715 596621 596414 596583 596148 594875 593376 592188 591207 590023 588387 586281
51512 586281 583944 581884 580513 579646 578674 577399 576317 575949 576131 576264 576004 575517 575216 575449 576365 577852 579728
51495 579728 581970 584629 587518 590231 592531 594403 595662 595891 595043 593717 592524 591501 590423 589367 588473
51480 588473 587455 585968 584390 583711 584548 586625 589194 591556 593206 594014 594441 595204 596582 598331 600313
51465 600313 602835 606217 610518 615842 622471 630407 639206 648618 658995 670703 683412 696389 709205
51452 709205 721653 733289 743685 753072 762025 770368 776916 780599 781491 780490 778338 775192 770954 765615
51438 765615 759331 752350 744939 737339 729862 722932 716832 711348 705915 700185 694330 688695 683415 678408
51424 678408 673582 668904 664501 660738 657908 655725 653408 650468 647131 643761 640279 636538 632919 629961
51410 629961 627617 625443 623463 622107 621223 619849 617380 614431 612063 610475 608937 606788 604016 601002
51396 601002 598226 596329 595896 596861 598293 599062 598724 597659 596456 595318 594101 592725 591389 590322 589479
51381 589479 588578 587401 585943 584329 582676 581028 579290 577333 575262 573481 572229 571194 569869 568197
51367 568197 566510 564872 563024 561014 559311 558034 556578 554438 551965 549953 548788 548402 548647 549213 549595
51352 549595 549682 550077 551206 552456 552880 552479 552040 551912 551912 552292 553709 556029 558162 559438 560188 560670 560446 559510
51334 559510 559013 559902 561524 562527 562678 562678 562563 561461 559006 556025 553559 551882 550733 549869 549087 548083
51318 548083 546616 544647 542322 539990 538138 536874 535648 533948 532180 531273 531425 531863 531949 531924 532298 533019
51302 533019 533605 533658 533030 531899 531037 531530 533722 536612 538837 540158 541575 543946 546920 549439 551048 552377
51286 552377 554377 557423 561429 566551 573168 581077 589286 597176 605550 615926 628922 643855 659840
51273 659840 676536 693673 710498 726217 740638 754030 766520 777838 787429 794586 798732 799852
51261 799852 798520 795441 790992 785308 778488 770665 762030 752873 743445 733826 724238 715293 707436 700168
51247 700168 692429 683971 675755 668767 662971 657785 652967 648495 644027 639120 633843 628690 624103 620376
51233 620376 617688 615701 613456 610255 606522 603210 600471 597497 593631 589132 584821 581427 579258 578011
51219 578011 576883 575280 573527 572473 572339 572371 571722 570263 568405 566508 564706 562990 561275 559493 557728
51204 557728 556133 554757 553659 553087 553205 553643 553691 552986 551789 550582 549735 549542 550109 551083 551848 552112 551991
51187 551991 551468 550279 548475 546696 545541 545044 544949 545130 545417 545355 544574 543258 541885 540656 539466 538351
51171 538351 537539 537035 536407 535146 533211 531213 530029 530067 530901 531680 531865 531392 530321 528802 527373 526658 526492
51154 526492 525939 524587 523325 523232 524086 524702 524489 523862 523110 521839 519864 517934 517006 517139 517617 517859 517791 517473
51136 517473 516873 516027 515134 514418 514002 513892 513972 514139 514503 515227 515966 515796 514144 511650 509642 508810 508791 509055
51118 509055 509534 510204 510565 510098 508898 507505 506306 505503 505318 505708 506088 505920 505562 505881 506991 508044 508413
51101 508413 508352 508203 507683 506617 505756 506017 507144 507998 508138 508295 509139 510315 511106 511462 511857 512479 513068 513389
51083 513389 513402 513070 512339 511394 510583 510025 509457 508632 507785 507533 508259 509583 510554 510408 509126 507248 505369 503973
51065 503973 503448 503806 504334 504049 502701 501061 500031 499684 499483 499115 498810 498890 499308 499609 499238 497976 496206
51048 496206 494651 493619 492748 491616 490418 489727 489740 490151 490652 491204 491793 492356 493001 493897 494829 495205 494734 493792
51030 493792 492972 492516 492416 492650 492984 492786 491547 489528 487475 485830 484599 483941 484230 485338 486375 486603
51014 486603 486343 486590 487859 489790 491749 493344 494275 494151 492843 490893 489321 488886 489571 490723 491738 492539
50998 492539 493369 494216 494689 494595 494287 494153 493996 493370 492449 491957 492197 492628 492694 492501 492354 492074 491357 490518 490215
50979 490215 490500 490726 490501 490206 490379 490941 491342 491254 490821 490367 490028 489697 489198 488564 488141 488366 489381 490862
50961 490862 492191 492708 492043 490448 488814 488084 488477 489449 490379 491216 492381 494277 496983 500303 503957 507761
50945 507761 511763 516161 521058 526239 531212 535544 539257 542856 546756 550608 553403 554428 553974 552927
50931 552927 551937 551205 550791 550557 549906 548156 545392 542637 540918 540327 540098 539463 538330 537242 536776 536990 537565
50914 537565 538433 539899 541932 543797 544971 546111 548390 551886 555394 558028 560333 563469 567869 573086
50900 573086 578485 583681 588558 593328 598364 603856 609813 616465 624184 632717 641101 648676 655796 663075
50886 663075 670428 677335 683636 689464 694722 699320 703704 708524 713802 718960 723600 727752 731572 735406
50872 735406 740061 746276 753905 762214 771140 781558 794060 808123 822852 838123 854525 872525
50860 872525 892124 913181 935648 959414 984069 1008863 1032939 1055774 1077429 1098225 1118150
50849 1118150 1136772 1153712 1168883 1182329 1194179 1204913 1215256 1225539 1235317 1243903 1251121 1257365
50837 1257365 1263044 1268214 1272644 1276076 1278401 1279714 1280193 1279827 1278327 1275411 1271186 1266180 1260893 1255274
50823 1255274 1248633 1240224 1229967 1218493 1206392 1193644 1180038 1165921 1152147 1139194 1126652 1113770
50811 1113770 1100349 1086994 1074559 1063458 1053396 1043740 1034111 1024620 1015525 1006814 998330 990135 982565
50798 982565 975882 970099 965080 960636 956531 952560 948634 944682 940593 936360 932157 928070 923962 919910
50784 919910 916616 914895 914691 914950 914579 913326 911704 910377 909687 909560 909723 910082 910875 912355 914491 917206
50768 917206 920631 924803 929275 933615 938167 943755 950619 958227 966258 975165 985611 997848 1011980
50755 1011980 1028250 1046778 1067457 1090490 1116589 1146185 1178880 1214163 1252306 1293902 1338807
50744 1338807 1386206 1435655 1487406 1541526 1597218 1653230 1708596 1762674 1814690 1863612 1908587
50733 1908587 1949470 1986742 2020742 2050965 2076418 2096750 2112777 2125767 2136583 2145836 2154478 2163525
50721 2163525 2173157 2182587 2191032 2198458 2205279 2211588 2216908 2220485 2221595 2219701 2214539 2206133 2194612 2180064
50707 2180064 2162592 2142507 2120250 2096096 2069945 2041640 2011544 1980736 1950452 1921313 1893145
50696 1893145 1865590 1838766 1813351 1790077 1769125 1749921 1731605 1713853 1697230 1682604 1670280
50685 1670280 1659861 1650811 1642794 1635480 1628462 1621495 1614589 1607685 1600514 1592916 1585089 1577416 1570197 1563607
50671 1563607 1557586 1551663 1545168 1537797 1529648 1520662 1510448 1498927 1486745 1474658 1462856 1451233
50659 1451233 1440008 1429529 1419651 1409894 1400239 1391305 1383589 1376828 1370298 1363576 1356916 1350981 1346279
50646 1346279 1342868 1340622 1339635 1340140 1342074 1345092 1349081 1354236 1360544 1367720 1376005 1386457 1399978 1416388
50632 1416388 1434989 1455609 1478422 1503116 1529015 1556014 1584441 1613908 1643093 1671021 1697949
50621 1697949 1724556 1750709 1775349 1797320 1816050 1831742 1845109 1856616 1865734 1871325 1873090 1872292
50609 1872292 1870660 1868812 1866264 1862753 1859014 1856078 1854198 1852762 1851059 1848916 1846590 1844286 1841870 1839052
50595 1839052 1835555 1830971 1824553 1815468 1803460 1789189 1773760 1757884 1741471 1724033 1705447 1686311
50583 1686311 1667632 1650209 1634387 1620270 1607915 1597269 1588114 1580283 1573843 1568966 1565776 1564443
50571 1564443 1565275 1568493 1573906 1580917 1588810 1597038 1605405 1614038 1623000 1631938 1640368 1648311 1656203 1663993
50557 1663993 1670880 1676259 1680493 1684254 1687542 1689972 1691714 1693385 1695107 1696371 1696801 1696476 1695475 1693876
50543 1693876 1692342 1692107 1694042 1698083 1703705 1710450 1717947 1725907 1734376 1743561 1753257 1762929 1772557 1782894
50529 1782894 1794603 1807617 1821569 1836308 1851557 1866565 1880495 1892742 1902486 1908487 1910035 1907881
50517 1907881 1903604 1898208 1891849 1884795 1877912 1872050 1867346 1863347 1859528 1855611 1851677 1848121 1845347 1843352
50503 1843352 1841715 1839924 1837673 1834774 1830967 1825831 1818915 1809978 1799166 1786931 1773798 1760247 1746580
50490 1746580 1732687 1718017 1702230 1685854 1669902 1654748 1639843 1624769 1610007 1596273 1583477
50479 1583477 1570940 1558381 1546131 1534485 1523342 1512564 1502219 1492388 1482954 1473803 1464992 1456700
50467 1456700 1449118 1442381 1436532 1431530 1427486 1424780 1423708 1424009 1424966 1426105 1427706 1430531 1435027 1440900
50453 1440900 1447544 1454906 1463632 1474107 1485512 1496328 1505861 1514790 1524044 1533595 1542731 1551083 1558913
50440 1558913 1566579 1574250 1582176 1590793 1600492 1611423 1623557 1636691 1650479 1664694 1679433 1695021
50428 1695021 1711814 1730366 1751496 1775846 1803309 1833171 1864771 1897762 1931769 1966163 2000334
50417 2000334 2034017 2067204 2099707 2130879 2159744 2185475 2207704 2226356 2241207 2251882 2258244
50406 2258244 2260533 2259073 2254110 2245982 2235102 2221719 2206119 2189185 2172237 2156090 2140756 2126405
50394 2126405 2114023 2104588 2098139 2094277 2093106 2094944 2099420 2105788 2113922 2123976 2135005 2144874 2151869
50381 2151869 2155721 2156718 2154535 2148446 2138184 2124121 2106808 2086769 2064527 2040565 2015350 1989448
50369 1989448 1963395 1937307 1911011 1884631 1858771 1833936 1810139 1787206 1765150 1744029 1723695
50358 1723695 1704023 1685105 1667086 1650049 1634316 1620472 1608780 1598730 1589524 1580901 1573170 1566516
50346 1566516 1560649 1555218 1550257 1545958 1542107 1538039 1533407 1528771 1525100 1522612 1520471 1517822 1514807 1512206
50332 1512206 1510361 1508892 1507334 1505640 1504057 1502904 1502420 1502454 1502456 1502081 1501703 1501911 1502750 1504000 1505997 1509469
50316 1509469 1514530 1520516 1526907 1533745 1541125 1549057 1557997 1568701 1581215 1594734 1608742 1623495 1638936
50303 1638936 1654083 1668158 1681643 1695436 1709473 1722972 1735477 1746856 1756569 1763874 1768553 1770665
50291 1770665 1769824 1765548 1758303 1749318 1739277 1727871 1714759 1700275 1685073 1669656 1654513 1640203
50279 1640203 1627021 1614917 1603932 1594417 1586664 1580561 1575744 1571916 1569118 1567791 1568441 1570831 1573684
50266 1573684 1575603 1576169 1575719 1574257 1571208 1566192 1559368 1550875 1540542 1528374 1514850 1500566 1485943
50253 1485943 1471373 1457164 1443128 1428707 1413735 1398621 1383708 1368941 1354442 1340771 1328267
50242 1328267 1316574 1305260 1294483 1284559 1275254 1266052 1256987 1248684 1241648 1235861 1230966 1226553 1222329
50229 1222329 1218326 1214835 1212003 1209699 1207940 1207129 1207480 1208509 1209502 1210234 1210715 1210488 1208859 1205890 1202560
50214 1202560 1199748 1197538 1195630 1193903 1192247 1190274 1187664 1184623 1181648 1178987 1176529 1174215 1172197 1170624
50200 1170624 1169399 1168158 1166465 1164071 1161212 1158478 1156271 1154361 1152181 1149488 1146517 1143453 1140041 1136000
50186 1136000 1131614 1127604 1124268 1120981 1116809 1111561 1106025 1101171 1097372 1094449 1092176 1090442 1089053 1087760
50172 1087760 1086556 1085711 1085435 1085718 1086572 1088229 1090859 1094274 1098072 1101932 1105562 1108519 1110457 1111602 1112678
50157 1112678 1114121 1115579 1116325 1116108 1115395 1114821 1114489 1113832 1112151 1109313 1105994 1103130 1101152 1099861 1099012 1098713
50141 1098713 1099096 1099859 1100568 1101359 1103019 1106253 1111082 1117048 1123776 1131204 1139385 1148292 1157814 1167926 1178793
50126 1178793 1190611 1203262 1216204 1228893 1241220 1253331 1265086 1276048 1286004 1295097 1303256 1309762
50114 1309762 1313747 1314942 1313735 1310584 1305687 1299194 1291506 1283228 1274884 1266655 1258297 1249425 1239916 1230001
50100 1230001 1219918 1209621 1198901 1187705 1176170 1164451 1152628 1140751 1129007 1117801 1107649
50089 1107649 1098753 1090758 1083127 1075742 1068815 1062225 1055504 1048610 1042166 1036534 1031178 1025435 1019561 1014393
50075 1014393 1010239 1006762 1003781 1001425 999448 997134 994162 991010 988159 985408 982285 978843 975618 972950
50061 972950 970660 968299 965582 962611 959816 957587 955984 954878 954269 954129 954015 953239 951489 949022 946196
50046 946196 943181 940151 937381 934936 932632 930437 928578 927080 925603 924031 922838 922583 923192 924053 924611
50031 924611 924721 924674 925090 926545 929095 932348 936134 940764 946469 953063 960494 969284 979936 992209 1005547
50016 1005547 1020006 1036234 1054574 1074639 1095789 1117661 1140303 1164089 1189317 1215548 1241603
50005 1241603 1266717 1291532 1317257 1343879 1369802 1393328 1413825 1431246 1445226 1455181 1460903 1462595
49993 1462595 1460559 1455215 1447240 1437260 1425517 1412056 1397158 1381353 1365135 1348890 1332928 1317326
49981 1317326 1301827 1286195 1270634 1255584 1241095 1226808 1212673 1199410 1187911 1178268 1169713 1161618
49969 1161618 1154227 1148134 1143226 1138551 1133347 1127843 1122859 1118936 1116107 1114257 1113143 1112117 1110311 1107329
49955 1107329 1103535 1099588 1095903 1092605 1089602 1086538 1083037 1079192 1075619 1072722 1070211 1067614 1065040 1062933
49941 1062933 1061220 1059239 1056655 1054025 1052118 1050986 1050024 1048860 1047741 1046993 1046515 1046048 1045712 1045948 1046897 1048057
49925 1048057 1048583 1047843 1045835 1043363 1041776 1042065 1043895 1045782 1046521 1046397 1046696 1048282 1050894 1053719 1056151
49910 1056151 1057975 1059228 1060218 1061463 1063419 1066227 1069791 1073977 1078657 1083718 1089080 1094780 1101021 1108224
49896 1108224 1116788 1126586 1136835 1146803 1156611 1167029 1178520 1190829 1203459 1216029 1228021 1238742
49884 1238742 1247959 1256259 1264369 1272351 1279689 1285904 1290537 1292871 1292267 1288903 1283669 1277165 1269205 1259492
49870 1259492 1248375 1236652 1224851 1213044 1201295 1189943 1179432 1170006 1161711 1154495 1148208 1142545
49858 1142545 1137188 1132087 1127547 1123944 1121303 1119171 1116853 1113784 1109755 1105014 1100147 1095704 1091709 1087565
49844 1087565 1082535 1076385 1069563 1062800 1056541 1050719 1044935 1038819 1032183 1024970 1017271 1009460 1002064 995311
49830 995311 988917 982612 976671 971582 967243 962983 958443 953935 949727 945498 940892 936234 932242 929222
49816 929222 926994 925369 924241 923257 921985 920484 919400 919330 920340 922130 924359 926742 928976 930698 931463
49801 931463 930951 929396 927591 926114 924729 922960 921032 919625 918758 917573 915386 912326 908727 904501 899523
49786 899523 894106 888714 883527 878670 874445 870884 867476 863817 860159 856852 853569 849773 845677 842003
49772 842003 838959 836140 833436 831339 830196 829792 829816 830116 830451 830608 831008 832466 834993 837473 838973 839811
49756 839811 840799 841981 842846 843407 844204 845301 846014 845791 844845 843766 842864 841924 840386 837726 834061 830232
49740 830232 826966 824022 820716 817143 814190 812220 810507 808376 806162 804506 803188 801550 799767 798881
49726 798881 799378 800469 801134 801435 802291 804167 806419 808063 808857 809447 810572 812367 814494 816573 818214 818810
49710 818810 817891 815901 814136 813536 813643 813221 811793 810121 809118 808741 808230 807154 805796 804570 803467 802242
49694 802242 800938 799857 799028 797975 796283 794256 792733 792224 792469 792846 792983 792837 792513 792246 792344 792836 793341
49677 793341 793548 793742 794509 795993 797810 799609 801330 802843 803814 804221 804570 805214 805630 804831 802474 799260
49661 799260 796117 793224 790001 785972 781418 777119 773603 770717 767920 764798 761299 757605 754000 750757
49647 750757 747991 745557 743186 740644 737756 734443 730918 727748 725422 723860 722538 721104 719686 718638
49633 718638 718181 718326 718862 719359 719436 719183 719197 720076 721997 724692 727623 730138 731752 732471 732772 733176 733866 734648
49615 734648 735032 734502 732956 730968 729254 727893 726323 724219 722015 720448 719785 719571 718899 717034 714176
49600 714176 711557 710226 709731 708668 706637 704791 704110 704079 703774 703411 703815 704848 705546 705638 705902 706976 708817
49583 708817 711427 715148 719881 724759 729055 732825 736348 739480 741982 744024 745935 747792 749530 751056
49569 751056 752051 752088 751312 750494 750099 749649 748463 746619 744663 742715 740484 738034 735918 734471 733345 731861
49553 731861 729585 726599 723346 720228 717250 714135 710842 707714 704976 702407 699813 697528 696024 695157
49539 695157 694256 692913 691279 689581 687729 685615 683548 682137 681664 681580 680675 678048 674023 670038 667455
49524 667455 666602 666897 667552 667940 667711 667009 666446 666431 666604 666304 665483 664788 664711 665011 665019 664248 662741 661005 659638
49505 659638 658784 658030 657019 655977 655294 654838 654101 652936 651672 650464 649107 647538 646102 645081 644336 643589
49489 643589 642828 642198 641803 641706 641862 641881 641248 639966 638744 638279 638562 639099 639589 640160 641027 642131 643147 643845
49471 643845 644488 645666 647461 648990 649273 648537 648116 648882 650486 652362 654780 658270 662544 666701 670283
49456 670283 673411 676132 678268 679912 681353 682460 682814 682585 682651 683501 684536 684821 684153 682985 681636 680066
49440 680066 678353 676878 675974 675632 675643 675786 675818 675503 674824 674109 673781 674023 674775 676092 678270 681445 685110
49423 685110 688402 690944 693202 695837 698935 702156 705406 708903 712514 715612 717820 719587 721613 723961
49409 723961 726101 727732 729098 730452 731662 732559 733308 734011 734207 733268 731384 729650 728949 729050 729094 728657 727938
49392 727938 727134 726216 725344 724897 724906 724852 724349 723602 722898 722094 721109 720566 721310 723313 725617 727401 728649 729748
49374 729748 730882 732058 733243 734300 735065 735626 736257 736995 737577 737910 738225 738593 738711 738356 737678 736841 735821
49357 735821 734808 734278 734185 733657 732089 730134 728811 727893 726104 722920 719305 716414 714372 712687 711259
49342 711259 710343 709916 709524 708671 707094 704989 703121 702370 702790 703450 703542 703282 703369 703940 704613 705304 706301 707618
49324 707618 708911 710076 711360 712730 713621 713545 712621 711320 709965 708706 707660 706880 706333 706074 706214 706728
49308 706728 707546 708942 711411 714977 718940 722693 726441 730719 735399 739674 743066 746044 749537 754040
49294 754040 759360 765046 770892 776954 783202 789332 795013 800210 805019 809282 812623 815011 816860 818475
49280 818475 819690 820316 820580 820744 820551 819530 817749 815836 814275 813103 812254 811793 811666 811597 811396 811114 810889
49263 810889 810885 811441 812888 815015 817009 818178 818516 818431 818145 817587 816718 815680 814698 813948 813411 812786 811705 810187
49245 810187 808701 807561 806472 804867 802654 800352 798528 797261 796168 794850 793247 791621 790169 788767
49231 788767 787213 785640 784417 783674 783195 782841 782714 782748 782591 782174 782095 782907 784271 785276 785601 785837 786664 788127
49213 788127 789892 791803 793878 795971 797768 799112 800172 801297 802771 804772 807442 810915 815129 819747
49199 819747 824402 829107 834191 839741 845306 850363 854887 859255 863726 868193 872309 875580 877519 878047
49185 878047 877651 876877 875756 874074 871974 869780 867354 864271 860774 857922 856519 856300 856484 856726 857191 858100
49169 858100 859622 861901 864681 867140 868606 869426 870669 872976 875995 878916 881115 882304 882484 881991 881306
49154 881306 880634 879807 878648 877232 875706 874087 872368 870670 869190 868105 867601 867774 868370 868849 868948 869007 869532
49137 869532 870445 871079 870882 869932 868635 867232 865756 864336 863235 862587 862279 862133 862060 862028 862032 862238 862942 864247
49119 864247 865887 867536 869250 871306 873686 875990 878010 880119 882919 886519 890403 893933 896942 899742
49105 899742 902692 905809 908895 912036 915768 920629 926578 933137 939971 947084 954402 961628 968687 976009
49091 976009 984026 992617 1001260 1009586 1017392 1024406 1030497 1036070 1041770 1047652 1053091 1057630 1061551 1065418
49077 1065418 1069417 1073445 1077584 1082106 1087158 1092695 1098658 1104936 1111297 1117721 1124627 1132338 1140297 1147357
49063 1147357 1153071 1158269 1164017 1170434 1176915 1183277 1189965 1197135 1204191 1210540 1216308 1221924 1227402 1232539
49049 1232539 1237686 1243670 1250886 1258863 1266910 1274785 1282576 1290302 1298070 1306324 1315530 1325545 1335649
49036 1335649 1345240 1354279 1362971 1371331 1379305 1387183 1395557 1404720 1414268 1423471 1432015 1440124 1448018 1455528
49022 1455528 1462520 1469430 1476936 1485072 1493119 1500490 1507336 1514119 1520952 1527715 1534494 1541539 1548871 1556332
49008 1556332 1563866 1571417 1578671 1585400 1591946 1598948 1606454 1613815 1620541 1626893 1633386 1640033 1646257 1651334
48994 1651334 1654819 1656914 1658619 1661132 1664763 1668664 1671924 1674644 1677616 1681218 1685051 1688571 1691638 1694490
48980 1694490 1697587 1701420 1706044 1710771 1714697 1717703 1720563 1723933 1727614 1731021 1734051 1737173 1740794 1744834
48966 1744834 1748790 1751989 1753852 1754292 1753913 1753648 1754078 1755212 1756894 1759104 1761806 1764597 1766878 1768311 1769016
48951 1769016 1769310 1769446 1769671 1770301 1771526 1773183 1774936 1776685 1778562 1780629 1782862 1785547 1789345 1794593 1800697
48936 1800697 1806486 1811130 1814452 1816516 1817325 1817068 1816279 1815549 1815199 1815310 1815792 1816255 1816151 1815340 1814349 1813865 1814045
48919 1814045 1814608 1815403 1816475 1817632 1818433 1818727 1818877 1819311 1820090 1821164 1822666 1824739 1827231 1829927 1832884 1836233
48903 1836233 1839695 1842785 1845551 1848771 1853232 1858980 1865426 1871958 1878265 1884226 1889784 1894945 1899695 1903937
48889 1903937 1907623 1910970 1914391 1918164 1922182 1926089 1929595 1932653 1935321 1937494 1938873 1939322 1939229 1939305 1939874
48874 1939874 1940468 1940255 1938860 1936661 1934385 1932524 1931105 1929847 1928535 1927229 1926109 1925152 1924144 1923115 1922485
48859 1922485 1922622 1923358 1924281 1925284 1926575 1928197 1930012 1932110 1934820 1938151 1941636 1944906 1948106 1951518 1955137
48844 1955137 1958835 1962680 1966756 1970958 1975267 1979960 1985228 1990843 1996671 2003198 2010908 2019268 2027118 2034289
48830 2034289 2042132 2051995 2063675 2075828 2087588 2099165 2111123 2123748 2137314 2152360 2169320 2187993
48818 2187993 2207580 2227195 2246318 2265018 2283891 2303648 2324551 2346286 2368437 2390936 2413840
48807 2413840 2436940 2459963 2483188 2507387 2532933 2559228 2585260 2610525 2635095 2659086 2682586
48796 2682586 2706081 2730232 2754963 2779294 2802582 2825561 2849579 2874876 2900229 2924273 2946702
48785 2946702 2968014 2988668 3008778 3028329 3047247 3065426 3082912 3099869 3116066 3130641 3142771
48774 3142771 3152479 3160475 3167268 3172900 3177474 3181354 3184497 3186088 3185309 3182402 3178458 3174212 3169433 3163652
48760 3163652 3156986 3149928 3142543 3134380 3125166 3115209 3104896 3094104 3082384 3069558 3055896 3041806
48748 3041806 3027671 3014026 3001458 2990098 2979375 2968569 2957639 2947268 2938064 2929871 2922003 2914102
48736 2914102 2906587 2900059 2894442 2889009 2883412 2878354 2874857 2872960 2871627 2870040 2868547 2868047 2868829 2870445
48722 2870445 2872462 2874838 2877503 2880212 2883062 2886768 2891980 2898495 2905545 2912857 2920966 2930249 2940002 2948902
48708 2948902 2956456 2963630 2971950 2982159 2993894 3006360 3018968 3031413 3043648 3055884 3068385 3081087
48696 3081087 3093679 3106134 3118872 3132184 3145840 3159552 3173522 3188087 3202899 3217030 3229924
$$ [...]
##END NTUPLES=NMR SPECTRUM
##END=
