##TITLE=AC1527_ROEFFECT0007_8202252_xZO1EJQUhu
##JCAMPDX= 6.0         $$ Bruker NMR JCAMP-DX V2.0
##DATA TYPE= NMR SPECTRUM
##DATA CLASS= NTUPLES
##ORIGIN= BRUKER
##OWNER= Administrator
$$ 1.72 TOPSPIN		Version 2.1
$$ 2013-09-26 23:56:28.063 -0700  Administrator@X
$$ Compression mode = diff/dup
##.OBSERVE FREQUENCY= 400.02188249412
##.OBSERVE NUCLEUS= ^1H
##.ACQUISITION MODE= SIMULTANEOUS (DQD)
##.ACQUISITION SCHEME= undefined
##.AVERAGES= 8
##.DIGITISER RES= 22
##SPECTROMETER/DATA SYSTEM= spect
##.PULSE SEQUENCE= zg30
##.SOLVENT NAME= COFFEE_meoh
##.SHIFT REFERENCE= INTERNAL, COFFEE_meoh, 1, 14.98509
##AUDIT TRAIL= $$ (NUMBER, WHEN, WHO, WHERE, PROCESS, VERSION, WHAT)
$$ ##TITLE= Audit trail, TOPSPIN		Version 2.1
$$ ##JCAMPDX= 5.01
$$ ##ORIGIN= Bruker BioSpin GmbH
$$ ##OWNER= Administrator
$$ $$ E:\/data/COFFEE/nmr/AC1527_ROEFFECT0007_8202252_xZO1EJQUhu/10/pdata/1/auditp.txt
$$ ##AUDIT TRAIL=  $$ (NUMBER, WHEN, WHO, WHERE, PROCESS, VERSION, WHAT)
(   1,<2013-09-26 23:56:20.828 -0700>,<Administrator>,<X>,<go>,<TOPSPIN 2.1>,
      <created by zg
	started at 2013-09-26 23:55:14.141 -0700,
	POWCHK enabled, PULCHK disabled,
       configuration hash MD5:
       C8 4E 4E 5D D3 5C D8 9E 9F 52 82 E0 59 8A DE 15
       data hash MD5: 64K
       CE 35 65 F9 5A E7 D2 1C 3A 2D F9 8F 3A FA A4 EE>)
(   2,<2013-09-26 23:56:23.860 -0700>,<Administrator>,<X>,<proc1d>,<TOPSPIN 2.1>,
      <Start of raw data processing
       efp LB = 0 FT_mod = 6 PKNL = 1 PHC0 = 0 PHC1 = 0 SI = 32K 
       data hash MD5: 32K
       8A F5 79 08 C5 32 92 60 EA D7 D6 1D F7 BC DB 3C>)
(   3,<2013-09-26 23:56:24.297 -0700>,<Administrator>,<X>,<proc1d>,<TOPSPIN 2.1>,
      <pk PHC0 = 93.98254 PHC1 = 0 
       data hash MD5: 32K
       FE FF A5 E5 61 73 7C 84 66 78 8F 03 52 97 4D 0C>)
(   4,<2013-09-26 23:56:24.469 -0700>,<Administrator>,<X>,<proc1d>,<TOPSPIN 2.1>,
      <abs ABSG = 1 
       data hash MD5: 32K
       97 EC E5 E0 B2 D7 1C 9D 38 DA BB DD AA E8 FE 07>)
(   5,<2013-09-26 23:56:24.547 -0700>,<Administrator>,<X>,<proc1d>,<TOPSPIN 2.1>,
      <abs ABSG = 2 
       data hash MD5: 32K
       A7 0D FE D0 8F 14 E7 5B 96 50 84 CB 4B AA A0 23>)
(   6,<2013-09-26 23:56:24.625 -0700>,<Administrator>,<X>,<proc1d>,<TOPSPIN 2.1>,
      <abs ABSG = 3 
       data hash MD5: 32K
       63 A9 B3 9F 35 59 19 1E B7 0F 4E DA 91 56 12 C6>)
(   7,<2013-09-26 23:56:24.672 -0700>,<Administrator>,<X>,<proc1d>,<TOPSPIN 2.1>,
      <abs ABSG = 4 
       data hash MD5: 32K
       FC 7B AF D0 0E 64 7C C3 04 F1 06 52 02 01 D8 AB>)
(   8,<2013-09-26 23:56:24.719 -0700>,<Administrator>,<X>,<proc1d>,<TOPSPIN 2.1>,
      <abs ABSG = 5 
       data hash MD5: 32K
       0E 6F 12 05 CD CA 68 6A 74 35 8B 3A 9B 0F 31 48>)
$$ ##END=
$$ 
$$ $$ hash MD5
$$ $$ 9F ED 4C 63 E8 4A FD A7 B6 2A A9 D3 BE A4 83 73
##$RELAX= 
##$RELAX= 
##$RELAX= 
##$RELAX= 
##$RELAX= 
##$RELAX= 
##$RELAX= 
$$ Bruker specific parameters
$$ --------------------------
##$DU= <E:\>
##$EXPNO= 10
$$ [...]
150 150 150 150 150 150 150 150
##$TP07= 0
##$TPNAME0= <>
##$TPNAME1= <>
##$TPNAME2= <>
##$TPNAME3= <>
##$TPNAME4= <>
##$TPNAME5= <>
##$TPNAME6= <>
##$TPNAME7= <>
##$TPOAL= (0..7)
0.5 0.5 0.5 0.5 0.5 0.5 0.5 0.5
##$TPOFFS= (0..7)
0 0 0 0 0 0 0 0
##$TUNHIN= 0
##$TUNHOUT= 0
##$TUNXOUT= 0
##$USERA1= <user>
##$USERA2= <user>
##$USERA3= <user>
##$USERA4= <user>
##$USERA5= <user>
##$V9= 5
##$VALIST= <valist>
##$VCLIST= <CCCCCCCCCCCCCCC>
##$VD= 0
##$VDLIST= <DDDDDDDDDDDDDDD>
##$VPLIST= <PPPPPPPPPPPPPPP>
##$VTLIST= <TTTTTTTTTTTTTTT>
##$WBST= 1024
##$WBSW= 4
##$XGAIN= (0..3)
0 0 0 0
##$XL= 0
##$YL= 0
##$YMAX_a= 663774
##$YMIN_a= -563077
##$ZGOPTNS= <>
##$ZL1= 120
##$ZL2= 120
##$ZL3= 120
##$ZL4= 120
##$ABSF1= 14.98509
##$ABSF2= -5.573092
##$ABSG= 5
##$ABSL= 3
##$ALPHA= 0
##$AQORDER= 0
##$ASSFAC= 0
##$ASSFACI= 0
##$ASSFACX= 0
##$ASSWID= 0
##$AUNMP= <proc_prof1d_extract_pilot.lims>
##$AXLEFT= 0
##$AXNAME= <>
##$AXNUC= <1H>
##$AXRIGHT= 0
##$AXTYPE= 0
##$AXUNIT= <>
##$AZFE= 0.1
##$AZFW= 0.1
##$BCFW= 0
##$BC_mod= 0
##$BYTORDP= 0
##$COROFFS= 0
##$CY= 15
##$DATMOD= 1
##$DC= 0
##$DFILT= <>
##$DTYPP= 0
##$F1P= 0
##$F2P= 0
##$FCOR= 0.5
##$FTSIZE= 32768
##$FT_mod= 6
##$GAMMA= 0
##$GB= 0
##$INTBC= 1
##$INTSCL= 1
##$ISEN= 128
##$LB= 0
##$LEV0= 0
##$LPBIN= 0
##$MAXI= 10000
##$MC2= 0
##$MEAN= 0
##$ME_mod= 0
##$MI= 0
##$NCOEF= 0
##$NC_proc= -8
##$NLEV= 6
##$NOISF1= 0
##$NOISF2= 0
##$NSP= 0
##$NTH_PI= 0
##$NZP= 0
##$OFFSET= 14.98509
##$PC= 1
##$PHC0= 93.98254
##$PHC1= 0
##$PH_mod= 1
##$PKNL= yes
##$PPARMOD= 0
##$PPDIAG= 0
##$PPIPTYP= 0
##$PPMPNUM= 2147483647
##$PPRESOL= 1
##$PSCAL= 4
##$PSIGN= 0
##$PYNMP= <proc.py>
##$REVERSE= no
##$SF= 400.02
##$SI= 32768
##$SIGF1= 0
##$SIGF2= 0
##$SINO= 400
##$SIOLD= 32768
##$SPECTYP= <>
##$SREGLST= <1H.CDCl3>
##$SSB= 0
##$STSI= 32768
##$STSR= 0
##$SW_p= 8223.68421052631
##$SYMM= 0
##$S_DEV= 0
##$TDeff= 65536
##$TDoff= 0
##$TI= <>
##$TILT= no
##$TM1= 0
##$TM2= 0
##$TOPLEV= 0
##$USERP1= <user>
##$USERP2= <user>
##$USERP3= <user>
##$USERP4= <user>
##$USERP5= <user>
##$WDW= 1
##$XDIM= 32768
##$YMAX_p= 485195757
##$YMIN_p= -728041
##$CURPLOT= <Network HP LaserJet P1505>
##$CURPRIN= <$Network HP LaserJet P1505>
##$DFORMAT= <normdp>
##$LAYOUT= <+/1D_H.xwp>
##$LFORMAT= <normlp>
##$PFORMAT= <normpl>
##$SURQMSG= 1
$$ End of Bruker specific parameters
$$ ---------------------------------
##NTUPLES= NMR SPECTRUM
##VAR_NAME=  FREQUENCY,     SPECTRUM/REAL,   SPECTRUM/IMAG
##SYMBOL=    X,             R,               I
##VAR_TYPE=  INDEPENDENT,   DEPENDENT,       DEPENDENT
##VAR_FORM=  AFFN,          ASDF,            ASDF
##VAR_DIM=   32768,         32768,           32768
##UNITS=     HZ,            ARBITRARY UNITS, ARBITRARY UNITS
##FACTOR=    0.250966925370066, 1,           1
##FIRST=     8223.43324360094, -54150,       -253438
##LAST=      0,             17690,           -159537
##MIN=       0,             -728041,         0
##MAX=       8223.43324360094, 485195757,    0
$$ Real data points
##PAGE= N=1
##DATA TABLE= (X++(R..R)), XYDATA
$$ [...]
23844 163944 -98394 -148391 -80259 -61201 8170 223418 68458 87712 82703 -72321 152885
23832 -295879 -37027 30153 90595 -274706 13203 42006 -12020 -78302 -51098 309988 -35193
23820 -23912 -288896 244695 34461 245960 181149 414244 141612 86167 -191003 -77215
23809 -57191 -58606 31070 -2398 -21684 35848 95714 231871 -301926 -53539 156526 15052
23797 239945 469254 70418 -343544 158797 -117367 -38405 -69899 -282847 21855 458225
23787 458225 74672 -118364 -157032 -319943 69904 -23483 -12554 37728 32408 48934 247198
23776 247198 -113548 -69857 183677 -74617 36362 306721 -141713 248137 108804 31607
23765 -21950 74369 89930 -53820 -59099 -147348 -256418 -8064 132902 -79302 -101328 268784
23753 -147700 -232500 -354918 -892 55989 -10322 -64134 -116137 -73028 -141179 349273 -13018
23741 -54123 40035 258014 -110078 77554 -57813 -273692 -66854 -192695 16767 191470 117641
23730 117641 -20375 131014 64586 -17062 -49268 45955 64897 207376 132040 83379 140340
23719 140340 -82367 -173903 1496 269141 -310711 188317 234719 -24824 88429 79957 -230088
23707 -94562 223126 12046 24420 -66624 74354 94964 -127930 151995 -108275 -188533 -37994
23695 -194454 246489 58314 -91565 103148 -140592 84458 78232 -182705 79334 480238 -121915
23683 -27090 168839 161229 227971 -44562 126968 36316 88574 -87720 59153 204430 -250398
23671 139513 -6158 51570 -60453 -121375 -30531 6920 -251057 -188738 -57953 216410 -213999
23659 -50364 84038 -422833 479 61903 -319623 25739 -12184 381928 -143061 -102071 367206
23647 -151568 -31032 -123154 81713 -5794 207438 -82474 -264728 232914 -128702 -134773 -67943
23636 -67943 -54069 -102164 110099 -41141 22061 -260292 -162121 75857 272796 13429 117677
23625 117677 -170715 -76851 -253719 9296 -41242 137289 -66175 41220 284127 30744 35103
23614 35103 -120473 -15323 182526 434684 -135939 3098 72253 -291824 -149057 -296839
23604 -296839 -25868 413289 -18399 229485 18347 -179580 35326 221846 139063 86901 73601
23593 73601 -95996 -29663 335833 -144008 -148028 534137 53624 365276 -3473 -23414 -163295
23582 -163295 53390 -211050 79195 -222970 -64913 216415 -168479 284724 -4632 161277
23571 -252671 574283 280015 -101729 -389639 -236430 -42891 -168460 18060 13088 33807
23561 33807 -203319 90490 -144421 -166259 -55536 -186270 76670 11069 28348 135352 14626
23549 -147623 3263 9763 -56029 239122 -12414 -9795 159239 147366 -68238 -5703 227362 -29179
23536 -22229 74655 -62230 272479 -333621 64618 -188035 -324316 92390 54133 84781 -158078
23524 -90313 -263114 -265305 287026 -305145 -109130 224487 3305 200664 -23600 -265354 77324
23512 1428 77481 5969 181945 40682 -116748 -10385 26672 -107745 -203248 143092 -141626
23500 -173133 73284 -59047 -3572 -274644 -5295 -116295 -18017 130347 2996 160772 66445
23488 -257008 215144 -378055 -135586 276536 81836 -68818 106404 -96758 -102999 -292216
23478 -292216 55811 -419042 -199928 37630 260177 307858 6059 -304321 11152 240779 114998
23466 -343409 -135412 60857 -185633 183865 41660 239249 -223301 8731 -39976 4195 330875
23455 330875 -142576 -210662 -182946 223828 -250148 -289412 -53513 -13867 -157047 -81412 105027
23443 -105820 -183123 99391 -321027 -333523 22644 -72289 -335809 139534 182412 157489 -459240
23431 -228998 77204 152282 -161884 -258381 -95081 -6746 -44540 -61457 84389 116633 42482
23419 -27331 -110685 -84525 273287 -157050 97617 -157230 88030 -191290 -219471 -216050 -135199
23408 -135199 142484 -88550 129146 60025 202252 -122973 -46656 35364 135295 -26010 156784
23396 157958 -213653 -129422 -98920 -242321 -155065 -30649 63773 267531 -110614 -279615
23386 -279615 -129021 -130796 132070 -268160 -285317 -169292 -264155 -104992 67768 341409
23376 341409 65572 -157063 39884 76494 -38264 20979 147603 74690 -208180 -5363 6731
23364 -213808 66469 -156810 326273 157842 -382754 -282337 68490 -196557 39093 -94526
23353 -93990 -213797 -13173 -69392 -68163 276337 134948 -130460 71807 39054 158734 128060
23342 128060 70731 144285 6211 -54050 -424576 -19305 347239 -46707 24685 189732 178191
23331 178191 -46693 -246673 196291 -250035 -41445 229594 92002 70564 -114452 -539 349595
23319 60896 16012 322186 -96537 -115194 -183149 159464 -130586 369451 -78577 116817 -70828
23307 127054 195290 35236 488994 -150153 -98488 -191365 7541 131552 -102715 -326448 -90984
23295 -204552 322194 23082 -86925 -211433 -122241 39951 -23071 -326631 87612 44834 -45445
23283 -253975 -196742 -108840 84424 135985 11160 75306 282471 -79919 185862 172560 -42927
23271 219140 33771 -152234 145479 -47175 391265 -128623 -48635 66448 -15509 158115
23260 -220250 -180179 27807 -7333 53903 134757 5682 83157 -89330 43085 -93787 190177 -121358
23247 -245941 -247662 117212 165825 -52158 -132743 -351939 55147 -286884 283016 -109565 -8357
23235 -85391 -184751 86099 75875 -207212 115619 -175619 97958 -491153 65061 102941 -130290
23223 -32978 -260358 198101 -88528 -202499 -120430 -74477 -49560 -238681 -186868 -385666 -121665
23211 143534 -28335 -121419 1114 57637 84272 -263841 -82267 2474 -259123 248716 79264
23199 -128142 -383419 57462 203402 -162879 -125937 -166787 -35901 47745 -98587 -3086 -87004
23188 -87004 176175 349583 -156977 -16396 -147463 -314730 -301153 -9789 -325783 -293540 117908
23176 217113 -151580 199737 209348 -140171 -12106 -99431 -63121 377079 291580 -115431 11908
23164 -248224 -92861 190471 -17130 -111638 89124 79471 -227943 -202986 89262 28897 -204579
23152 47970 -27344 323353 -336778 22818 -171432 -531713 -203759 96982 -102333 -106200 97963
23140 -286891 -104483 -142183 -172451 142385 107963 392657 -105004 -245558 357873 294025
23130 294025 107510 177349 -95773 -18246 -56239 -209112 -190422 -20090 -293975 201350 -102791
23118 -11796 15806 174345 -66458 -110279 111051 -68706 -282255 -108327 266946 -288016
23107 -204508 184922 184180 -279341 -270733 -217309 456964 107815 130850 -143217 94904 138635
23096 138635 -61508 -145501 -68621 -111310 -8415 -163390 -32739 710864 -65582 -170893 32308
23084 183484 416969 6299 -30023 -718 225615 -198562 -73330 -72449 -375908 -192957 -70862
23072 245096 378875 34123 -140843 -27956 12890 62288 -48138 139239 116548 -5425 -420995
23061 -420995 56305 -297367 18109 1662 293669 -116204 208398 -256277 -83589 -206749
23051 -206749 -56737 52111 107494 8194 114796 138278 -13486 -100734 116873 -306594 94088
23039 54217 -37446 -53882 -104459 21601 286035 372871 129568 -133142 26794 -4966 -12567
23028 -12567 139029 295494 -14992 -74361 67611 -197215 -7623 -76484 144195 -44591 54351
23016 -344402 68140 -62954 -69658 84198 106243 97439 243048 73865 205890 -18018 -43885
23005 -43885 366801 109512 -123176 106741 -78855 -71818 -423096 214574 -150295 -61389
22994 54012 -294703 -73584 -328479 30427 212308 -265695 106652 -295975 -89293 -216478
22984 -216478 -41348 -4236 4851 -136056 -132633 -368718 -31002 -56581 -141774 15819 67681 -27229
22971 -35384 -89178 -69729 102920 175329 86343 -67761 -136758 55356 -348522 -2347 -114851
22960 -114851 -44016 -38311 -56009 168589 13226 248838 -31851 -42059 -194374 -171532 63992
22948 -44189 -259802 -292175 -361323 -57692 -166478 180949 48047 -118057 75726 77718 -73901
22936 -26756 62585 26370 215749 -94589 -15508 -114575 -186463 -303221 -222911 -143960 -1251
22924 52756 126122 -181734 69481 65999 -11720 69276 329840 255804 125140 -177099 -64815
22912 -122007 -345219 -32833 54376 81713 173472 -38225 -220505 -346616 -165439 -50320 -24116
22900 16078 -304942 -11054 -265161 -97508 -181728 204097 -230520 -45675 179344 306980
22890 306980 260019 -266514 -55553 336303 -38471 124227 -44540 -785 17115 -27423 -48371
22879 -48371 159536 366497 -195869 209484 212446 -294742 -145541 2792 -200126 -297350 281426
22867 162499 -366642 -134713 286418 -74395 -11521 -1854 82414 -98995 -489162 -355573 25786
22855 27552 -209664 75977 -6631 179799 -57156 -115184 -190644 -66882 315687 -64519 -139150
22844 -139150 -131201 48621 -236570 -9901 155785 -117129 -41819 -150438 95614 -84894 22058
22832 447358 -48037 -8571 -59563 1196 -84228 278608 -146598 -78651 -100192 35612 -303810
22820 -64560 267090 -130549 -52072 -423708 -177873 -38236 -31983 -261486 215229 268871 154931
22809 154931 -106079 86650 47940 105885 -58553 -162512 180316 -218081 -292248 178573
22798 71012 185696 -50656 -54673 -90623 -254526 -83529 75926 140895 -338524 -89289 27899
22786 -113123 109310 -17165 -200670 154166 331823 69462 164910 119668 77515 196024
22776 196024 368129 -84289 -847 285124 137946 -13266 26015 -78637 -391529 100753 -26224
22764 99772 15076 -206872 44172 -10399 -404823 -115983 13977 -224671 -143230 -13562 -234273
22753 -234273 -141011 13829 -135009 288116 16741 -117104 -284275 -328966 -45658 268458
22742 18620 -61154 -10461 -172370 129506 -236311 -131665 67379 -239700 -130900 202752
22731 -143840 -158897 -174160 -21768 -72044 355818 -214348 -102357 139085 -375589 -220611
22721 -220611 -453433 -169069 -130378 -240359 2631 -49395 -148631 108388 -94208 -133970 -133841
22710 -133841 -57410 -55581 -208791 -82452 -54930 -91984 -367912 192192 -30433 91505 -192277
22698 17695 -30557 -94803 117318 -77518 276255 167150 -152268 -41637 -605107 -117668
22687 183428 -237651 87216 177523 280835 -336116 183129 164522 -232234 287173 491317
22677 491317 30109 243693 125618 -492908 -49469 -86437 -172392 48238 -292491 207305
22666 -274318 -57024 -390805 -239780 -122226 -194302 -94699 8173 -405332 -264326 -640519
22656 -640519 -101960 -232400 156761 62367 120187 -9556 83886 -295256 264361 -132451
22645 -49346 31764 -342809 -419196 -11732 187603 -39337 74898 174863 191242 62955 -19625
22633 126773 39612 108625 174808 -363615 -328005 256805 145258 -151447 -102194 21542 -302199
22621 15207 -216091 -107862 200252 43949 244777 -76892 -187743 -329159 -78944 75727
22610 -120561 -128757 -44261 -436940 -260555 -53800 108910 -128343 -227433 -148437 124858 -108198
22598 -22118 66778 -73614 67286 -299053 64262 279827 -337578 -110692 -342353 101453
22587 -42515 5595 -259001 -62450 -219117 -77983 465330 142564 -233955 -145891 -40614 -199914
22576 -199914 -109888 205856 -186138 -187934 -24286 94651 -278251 163773 79860 -65493 80520
22564 -39101 -183217 -153502 90269 -149351 103779 -30222 37899 -88054 -12939 -51342 9267
22552 70369 -124343 68316 55449 -119416 -188204 -347849 -179183 -202435 245038 77584 173356
22541 173356 168646 -182031 281644 9214 199126 -258640 275586 -82422 -196717 189116
22530 95227 18025 134014 -190568 36093 207411 12647 58939 -233735 64739 -97590 -338839
22519 -338839 -103836 -71294 171698 -232104 -21179 5391 33088 -126961 289794 55031 -160664
22507 -102846 -1916 16107 94435 -6713 224895 15618 -286104 -154146 132170 -83316 95429
22495 142557 43503 45382 -74940 -6870 58318 -263682 274731 -69445 -60825 145946 -105823
22483 -91695 -25334 343014 389819 182039 124320 -320217 -114788 -221868 -221753 -57255 -59699
22472 -59699 36087 -32925 431213 123807 -269897 191854 -57390 287999 52849 7367 156428
22461 156428 -206314 218748 46395 -315815 -28838 -52285 164614 -315957 -189806 144775
22450 223132 -125500 -61800 -75727 205404 6911 -132351 239107 -243395 158751 61332
22439 207167 125581 -242124 -64758 -109995 19499 -160948 -163976 -40206 240544 76112 -85703
22427 -205754 -55488 -236563 -295688 -336967 -183424 135190 -149720 7334 -297449 482134
22416 -50354 -258484 -183303 -145515 -32473 -134083 89604 89212 158014 -3738 -189567 151329
22404 115442 132584 8240 -68809 -391454 -5431 -84956 -156691 49502 -150379 71028 237033
22393 237033 -166395 -190420 189025 -94997 137946 -349286 185516 -371633 148494 -404150
22382 -183969 229376 -141739 -126273 -382577 -162242 -232506 54739 -300671 196892 36256
22371 -11787 382590 -278663 53646 -105517 -185544 307408 135056 -196517 107592 -96185
22360 39636 -164859 -346187 -193655 -567737 89620 -299145 128802 149183 -200055 180632
22349 -29116 -261060 -61312 -194595 -223165 -45403 -54447 -236570 162687 61844 274409 -19475
22337 -60336 125767 57679 97527 -41451 -116190 277034 -268980 167160 -144373 -294397
22327 -294397 -444531 -54597 -20238 -129103 -57770 90438 69148 -38053 98710 -4089 -71323
22316 -71323 263062 184164 61787 155144 160774 54104 131095 133963 -259148 173210 48206
22304 135390 130335 -115849 -254869 -190400 -23162 10026 -101444 -55174 102506 -74104 -85949
22293 -85949 108996 -38159 -80305 246338 84322 -47719 -63681 -182117 114424 -147583 317696
22281 -266896 -141763 190091 -188343 -352621 -79705 -150124 188585 -165460 221989 -48642
22270 -92228 40535 -158632 -304205 -82934 -1713 48013 -42478 209392 -98235 -255411 12159
22258 -45244 39892 -492891 -237446 208761 181088 -97285 196203 353500 33688 -184529
22247 -128217 283788 -221905 174833 -298764 -74742 -77898 213855 19777 -16413 -134173
22237 -134173 309513 -139423 -484509 -129057 -139562 3289 -232645 -183427 -185193 -104946 109762
22225 -372486 337131 -143093 -42101 -83622 5399 179421 -338308 -28323 -21277 387029 -142487
22213 28683 -258646 265740 15681 -197670 -144714 166019 -188344 103725 -122775 -112094
22203 -112094 -38146 -28310 181142 -24139 228833 -293013 -57385 -265613 -201584 86974 198940
22192 198940 -142829 24934 -23661 -303566 -292604 184378 17950 -596871 -74796 63982 124835
22181 124835 -60234 -59663 192487 42730 173258 -25094 -229874 -24218 160458 -90600 -267801
22170 -267801 -112698 263464 90198 -102856 -201663 110487 -165341 -4023 145858 11777
22159 80504 -28498 -402272 228128 -159970 117365 281781 138625 -407478 -97411 131986
22148 -80105 81529 -7702 -255570 -172781 66723 173832 -55782 -30690 -28836 58726 131894 -56368
22135 -252734 -198533 78395 -56404 47224 -159122 68033 114099 74225 -382060 -10581 -76577
22124 -76577 -14717 -174347 136194 185672 -10467 -124425 -96792 253161 18813 -144880 97310
22112 -158276 34208 -160587 -202306 -44919 147497 -114812 -97392 -178519 -82131 78836 -44466
22100 223724 -100039 17545 -235074 -154795 207359 58221 -35234 80791 -260573 -75336 -247322
22089 -247322 -163781 -91999 226375 55911 47980 -28115 53628 -40441 73810 36846 -117824
22077 32474 162060 69533 -67731 -47434 -167509 -95470 -181347 54367 18963 -309213 -296341
22066 -296341 -87849 -141082 -23952 318736 305266 158689 197530 61411 65619 -406202 -359935
22055 -359935 -67914 -63383 139047 -366550 -175822 257804 -361045 28390 -84384 28866 -120254
22043 225633 113067 -124196 69940 -233642 -170518 -137599 -67782 -624900 6852 -203186 -332459
22032 -332459 3002 27419 -161864 -97120 -241825 -26360 73943 -30033 -235510 160934 -163729
22020 -36079 181789 -88800 -107951 -311529 -428765 2345 -235468 44587 -202441 -35245 -155641
22009 -155641 -83293 -346966 -16259 -211448 210462 100840 -25670 -26217 62970 26747 -194526
21997 -82409 57957 299440 -300511 180282 -326345 -219878 139422 -22068 -265559 -3125
21986 160877 80660 214018 -82284 -68318 -296066 -205735 -21844 34321 184695 31539 217504
21975 217504 20453 -517170 -400993 -109545 181352 -241074 -392 -243528 -149294 -187048 -228483
21964 -228483 123705 -78113 -199262 142922 212856 -168591 22685 -328619 179094 90819
21954 90819 161392 -374942 -74382 3553 -196501 130599 -81235 -69451 -312784 -51676 278619
21942 114786 237024 124283 28454 -16283 305195 -216552 -249872 -107124 -23774 48754
21931 46207 -259976 -200283 200348 -22980 -328310 -89766 -30247 172221 -236382 -93031 -77526
21920 -77526 -30894 254015 -193937 66390 -168919 38874 -176342 -232733 -194308 272296 -146271
21908 -103493 142225 102093 -8937 160606 -31334 -214692 72034 -8120 617 -119540 315602
21896 53645 -182185 -352983 -325162 157013 -180287 -272048 179114 146238 -248234 84761
21885 -51883 21766 -342999 245875 38488 -208087 52332 85969 174858 565132 -220150 318370
21873 -158569 73242 157709 -194341 83577 -52029 146310 292668 -34682 105995 78315 228802
21862 228802 264374 81914 59900 -68110 -66018 -178746 168221 193770 -214852 264929 -201258
21850 -157656 -315135 -362649 -70506 -287534 -283024 156142 44218 131723 -381017 -259573 -44532
21838 202186 7368 -106120 -186295 -183540 232707 16877 236288 -122920 -135841 -480957 -316882
21827 -316882 136512 15546 -53151 -212996 83261 -61140 -241883 -12371 32409 329650 75710
21815 365124 -11939 -259730 -251295 -75916 -51567 -93888 77962 20975 -346330 -108571 -236642
21804 -236642 -56163 -321320 15840 75531 -15963 -44547 -21725 323563 -211980 -54027 31750
21792 200560 -121643 131612 -61430 39950 -3501 -305341 -325528 35217 131577 53710 -363457
21780 25133 -147115 -87279 -190674 -476152 61035 -150428 18789 -113932 -339381 -13981
21769 45685 -195742 180030 43664 -119382 118092 130621 102046 70030 -48202 -78608 426521
21757 -5173 40332 7526 -309333 5744 -124729 -169577 191763 67369 80101 59919 -326908
21745 -184702 -10371 75445 -294262 -323367 -148621 156728 -190792 277537 -105370 -35083
21734 173054 -144016 -17462 -137963 -125634 -202703 84765 -247993 -21039 -244139 -235967 -85140
21722 -236038 525988 -27113 -219064 103450 267030 -301220 -92907 -2987 66844 -386687
21711 -15364 139822 -136789 45583 -107707 -147049 -23659 176880 -52616 -169107 -211108 36141
21699 -303082 -58540 -73820 329763 32407 -41971 297202 29842 -260820 38098 92965 -10580
21687 -85832 48857 -52750 -275056 -103666 -254388 -132527 -155347 -170628 38949 -110027 68044
21675 92139 -116993 -151669 -281622 71199 -88877 107989 62522 -18654 -175666 149795 81084
21664 81084 470 190642 100167 170704 317583 -31721 392874 -5992 -66375 64150 42426 61620
21652 61620 -234433 -126360 -86991 -121023 292448 -74407 -354173 -301875 81216 35201 -246671
21640 -73193 107765 129855 -238152 91996 187694 -319533 176826 -94997 -162130 -347831 140869
21628 99864 179560 -274011 -26493 -208981 -499423 -152676 -9044 -349341 -82229 41745 -343411
21616 38141 77925 318842 111410 -504092 -135877 86960 40935 -179133 222455 -44695
21605 115833 139922 -17484 -154478 -80728 -63096 66865 -326389 95701 -338604 198930 -8099
21593 -202141 96266 280594 22832 -26416 134853 91311 -22266 -218067 50019 -38935 -11717
21581 -157957 383251 50961 -412563 154535 128570 -219473 239519 -29373 -8777 -74321 -27749
21569 23915 -208360 -168312 -102861 -399186 190070 -145652 -40354 -201276 -171330 60620 -205177
21557 -144681 163986 108016 -324309 -47216 15407 -59174 2740 100593 -157870 -363061 -75166
21545 -359355 -24062 228108 -87603 235713 -366248 219826 -448515 -179667 -106650 -63415
21535 -63415 -62914 -250010 105172 -117441 -395660 -154138 -64784 -155731 -73701 28128 203254
21524 203254 246193 151406 115124 46964 -123704 -270541 -305439 -69133 112682 -11895 -205730
21513 -205730 114118 -80277 180506 108275 -221806 -211157 527821 -144120 141261 -31634
21502 173963 -63884 -208687 -185504 -64570 -208217 -207365 -46719 173690 -265502 -246448 26194
21490 101872 -177986 -37041 -119821 -206616 -342368 -118518 -271625 157338 153532 -9976 401251
21478 66329 -7302 -81876 -171005 -261940 -76211 -43789 -215784 -168401 -184278 -151417 -259089
21467 -259089 -232172 -15595 36920 -76094 122879 -143871 142336 -297903 -99988 292225
21456 72072 12144 -240334 -151233 261571 -339778 287118 48657 151791 80758 -493496
21445 -64276 205330 -142039 356158 -10252 472383 -67700 269439 265420 348246 447492 157219
21433 380343 410955 57859 247107 -27117 24903 69647 66134 -19226 238978 157437 -62461
21421 -239798 -56298 -251347 -395233 -341096 -39815 -72304 -414348 37452 -174518 136403
21410 -41467 -169260 -330533 190352 -499962 193826 -207897 -56394 11465 -2648 -168178
21400 -168178 -75331 319599 348729 416337 67463 -104748 -253424 -146366 146240 -96411
21389 -12373 63870 -70910 137613 9044 -302169 -213787 186711 -119480 271999 -216305 -13446
21377 -156661 80817 36324 12826 -308343 70120 -189936 -205780 -443454 -262658 148685
21366 -102953 1052 -322796 -111484 303508 84948 -347031 -154170 -128916 -200178 -85383 -265526
21355 -265526 -73543 143172 137832 70783 -55170 -166412 158091 -42755 -131923 -67359 33324
21343 160239 -79315 188385 53454 64114 213644 -81111 341279 -357493 -154808 42988
21332 20820 -157370 -10805 -287235 -311024 -120473 -275312 -153196 37521 -224696 -88531
21321 130577 43818 181808 235112 348922 -194747 144352 -249324 -21630 -22197 -96382 -194807
21310 -194807 -316639 -88906 -26468 -76893 379669 -287071 -59774 -100714 -70502 -215103 -296178
21299 -296178 -19652 -101867 -125072 126884 -14705 -42198 -135062 -389450 71223 -164295 -77672
21287 49184 -27561 -129835 131554 -304953 -106363 -195200 61308 -366818 101304 -20805
21276 146778 -218126 95016 -312 138468 78334 -148778 56145 59835 -309817 -222350 12312
21264 -192896 -46704 214575 165556 -104852 -107827 -128722 -123483 -108383 79139 -32978 51741
21252 -18770 -242599 -316810 -168364 -83888 40130 -9090 157499 94803 -439650 456946 173774
21240 25407 90294 27946 -184373 26262 79858 -187374 225620 29233 43123 -205956 -238005
21229 -238005 119152 62966 -3870 26889 -75012 116195 -197172 -106304 -31915 26923 -204781
21217 -296469 -374370 -227186 95918 16359 163156 -63875 149288 -3063 -140334 243815 179439
21206 179439 -88415 -169408 -56849 -467494 -189117 -317587 -80188 -331565 -228406 -144308
21196 -144308 130349 -236624 100735 204638 -178206 -183189 172541 161099 201746 256621
21186 256621 -399438 99788 -379292 -121995 -237686 236807 -131458 -279478 259800 -115366
21175 35594 -418869 -12420 -293506 -76193 -209602 -373825 2960 -169447 -10784 -32761 49
21163 -273194 -199146 -196709 192554 1935 -127716 182437 3894 -185249 -61633 155427 -127370
21151 -136056 66178 38711 -44501 129172 3409 -123595 -235374 157756 -47830 52491 -189996
21139 -6898 -157509 -180908 -68660 99851 188941 34925 40269 -2811 101958 -435757 -200885
21127 58959 -8051 -169501 -332137 84321 86217 -34757 46680 -407871 -178689 -260969 -131958
21116 -131958 -204297 -122748 -168400 -390944 135140 -290331 -285230 -242878 -105944 61018 -364759
21104 99323 -155676 131404 -419958 43221 22770 -277780 86995 -5491 -88274 -200082 281483
21092 -144452 12668 -471203 518078 -43834 -357544 -171947 -285047 -58823 103121 -279466
21081 146765 60490 -190599 -303628 229800 -174808 32994 86210 -2412 -298143 -86202 -146407
21070 -146407 -374765 -237135 -337275 207841 -123106 -271128 312000 233103 -32235 64388
21059 44985 -183807 -146726 -92383 -580432 220506 49291 136722 -137038 95913 -410755 15553
21047 -311268 11986 199792 -265956 -10027 56418 -82992 -189229 -147484 109741 14434 -170209
21035 -214855 11949 -49039 -262566 -11597 -29077 343785 -347473 -34911 382416 -41733 -328033
21024 -328033 -181219 -65374 -220781 -5107 220265 250100 -191020 -199592 -2685 -267279 -282007
21013 -282007 55177 -75723 66508 -130866 -528821 174696 -72750 -51876 -96258 75799 29840
21001 337336 -229589 -485600 -437876 -41628 -92247 69104 -92145 82168 447 59166 124086
20990 124086 121914 22505 -325784 159052 88757 -73115 95848 -184041 -56556 -145049 -87972
20979 -87972 140933 4877 95325 104730 55702 160438 26113 395290 54036 -44729 39357
20967 -32643 126320 170416 -258251 -176063 -236253 -82443 211812 329820 40442 -94505 246122
20955 -275904 -285282 -499219 -104767 -55922 160315 -336792 -72174 216967 192851 84271 386798
20944 386798 167956 117986 75863 -41070 29979 -229645 -39180 -259673 -294357 -4570 224887
20932 121597 -76040 284763 -79023 231633 131520 -93280 -246510 -258928 -126073 -57215
20921 162996 125604 22379 -62677 -25369 126150 -138653 231303 -150403 184457 18171
20910 5766 -51490 69642 -362513 274832 154094 -85531 -217183 -268791 196384 32122 -103546
20898 -171102 107014 -167706 425428 -15143 10244 18194 6426 -133322 -302192 -178852 -152176
20887 -152176 -225514 -160895 -251996 40144 282265 -468515 -274620 -151222 -124259 -88916 136915
20875 23283 427424 -330875 262613 155510 -74736 212446 192579 46775 -41483 -374163
20865 -374163 31352 -372367 16824 -189768 188873 -48976 -169401 -350803 53269 -135066
20854 -290791 -209765 19419 176313 -175428 65800 -182041 287126 -81275 58064 -36127 128689
20842 -37617 -118865 317208 -90077 216448 -205582 -254203 -58376 -208220 -25171 105732 -245189
20830 -40614 -156077 -302679 138747 116811 147557 -369819 -220596 113310 8667 -8502 -95028
20819 -95028 -92109 -15867 -145169 -249790 -436529 13101 -89649 -174338 -248473 -124749 183324
20807 134437 -224489 -202863 -33504 -317974 30732 -465420 -491670 20634 -14323 -31554 -232010
20796 -232010 181299 -242620 -167202 -99269 34489 -10145 168664 161832 99781 21940 -193287
20784 16544 277667 -17474 28467 290782 175879 -215268 -78558 7633 145506 22418 -20645
20772 43551 -77524 -384252 205045 -39199 -92438 -277962 -11141 175204 189800 -140863 -56466
20760 -120872 56165 -338554 211576 -131927 48544 78962 -87992 -102897 -25002 -162344 147837
20748 379981 -4387 79362 -327899 -197148 109372 -144649 -273020 -121452 88493 -127475
20737 6165 -130107 -154444 90209 79662 -147452 -499291 290168 193962 -98567 -219486 -303648
20726 -303648 384052 -84518 -12253 131731 -308312 10298 67581 -211870 224928 98640
20715 -59862 43529 -144519 -210331 12363 6711 3401 -11735 137650 -213778 -310023 146563
20703 -153700 86053 13077 -106517 -264719 -382281 -209175 166114 -325253 249393 -263213
20692 -182390 46936 -111443 -437629 187966 136814 -164231 254477 -262257 -4520 178548
20681 93668 257664 282632 -34188 285 -79780 -210610 -400625 -47533 65139 10764 -96387
20669 -30726 -277606 -62277 -56843 14005 -27601 -128682 327202 -481677 101211 -168349 -518024
20658 -518024 -127749 67335 -91800 85718 -19662 -203081 56368 -3760 -164675 -112112 -34593
20646 -212740 172031 61974 -140043 -330442 -257473 -202239 -322698 33338 327603 68850
20635 -175264 184868 28526 12429 108203 -3345 -69380 -6313 -58461 232637 -149336 -55336
20623 -62584 -362050 -330854 -162114 -68100 -220412 103946 -62783 25268 -212051 -78081 -186020
20612 -186020 -42005 -94430 122401 104941 -145859 -92291 13956 -107382 66657 -114114 -22041
20600 -276934 -128398 230578 -179357 -230750 -256134 -26228 45585 -18220 -5817 -84386 81674
20588 4698 -302060 144090 85939 76014 -224625 2006 97123 -165391 -18283 -1303 46170 30935
20576 30935 -68085 -58230 -184979 148004 -321152 -8483 -62874 -150251 -91437 173539 -7128
20564 -94338 -429049 5883 -194400 -28281 161030 -219781 -402107 5116 -120100 -57411 17657
20552 -73641 474721 -13552 162567 -58876 -53741 -67555 -75833 309181 -157147 158493 -79097
20540 98860 -174441 -52368 76868 18843 -65818 149655 125760 -166410 203506 -274821 88600
20528 -74099 -7605 -368103 145532 231141 -133127 -126616 84529 122558 -121087 167022 -14634
20516 -183640 -45717 -349392 332088 161606 -69436 -205078 -140436 384518 -156336 120276
20505 205192 28351 259871 -138993 -537467 142161 -247816 12266 -5638 284145 -231783
20494 -61852 142862 -72813 -126132 -90302 -354738 295193 -358512 -265804 -51568 -34373 -156823
20483 -156823 -76860 -39519 -253002 -126164 78870 -69747 -115190 -22132 -348120 159334 334548
20472 334548 -104474 -20292 -242494 -119999 -255939 -19392 60852 2563 -94125 -100130 120902
20460 225904 490303 373416 -33765 -112511 -117923 -54096 337062 -41572 -35261 227946 99848
20448 -32221 -109148 110745 -68990 -286384 -179075 -83697 -266342 36052 177124 -97080 -121360
20437 -121360 -231583 54090 -353529 -104064 -95638 -208538 -180927 -235862 38398 -86298 -85144
20426 -85144 278157 -235276 -189797 -42020 -216999 -155748 15196 -164994 -290509 27562 119678
20415 119678 -386241 -146726 -364013 -212809 -203144 37807 132539 -22779 -118780 27511 -191588
20403 88270 -185819 23856 -136952 -163093 207096 -207985 1981 -113318 -55389 -219966 -6946
20391 74721 130430 3959 -72127 -246655 -73098 147745 -112330 -206783 -226546 -406388 -23074
20379 -143283 -193332 -199512 -355880 -75966 40785 -93214 58018 -19532 -119180 -388421 -185597
20367 367132 76131 -20853 -246374 -344019 -214476 92579 89155 -80499 129227 -141480 7440
20355 -94512 227688 -57530 253030 -38942 33751 -32400 -223548 393404 58768 -52932 79023
20343 7317 -273414 236955 -38944 67917 215995 -147556 -162643 -39188 420934 114071 -42916
20331 -8162 6216 -121768 191574 -400364 7084 136232 -160711 194747 -101812 3722 -94161
20319 -136698 -42951 196284 -147667 -81508 -92087 -339622 69156 -98820 -11204 -16226 160705
20307 149384 -204258 89862 68535 -75113 -131020 -51365 198560 -163445 -345823 -130321
20296 -270103 -395378 123378 38121 44552 -523716 -160121 259096 -156679 -135165 206052
20285 -177289 -104227 -498988 -113732 -398304 137812 333827 -286978 129300 -110784 -189139
20275 -189139 -455888 -364207 190824 49849 55292 -200782 58847 218736 -192786 -208509 -68889
20263 -114343 -165806 175557 -393256 88931 23190 -33102 -494977 -164612 117768 -290622
20252 -145400 -88114 -47769 40662 -249710 24773 71098 -98441 -84722 31562 -29001 -70230
20241 -70230 39183 217166 5058 41064 41119 -212982 51858 147668 -33291 -125542 109626 -547280
20228 -78200 -113178 -83336 133906 -156999 159387 35664 -45588 -109905 28792 -196738 82812
20216 -123398 -219201 98503 -62792 -304875 242031 -83833 -134790 -31718 77566 184378 -19900
20204 -489009 -221042 -3786 -235072 93214 -350901 53606 -33644 87538 256144 31460 -236936
20192 102775 -187128 -223779 -316098 39260 97610 -273734 208293 194401 -52622 -13823 -148362
20181 -148362 -206931 34183 -101615 165363 -27995 -488860 -102249 143463 -139500 111461
20170 30981 -59970 -177542 -77175 221074 -226847 81819 -252871 -20297 -443606 -25409 -163248
20159 -163248 -156420 203629 84657 149515 70595 54884 -378836 -185916 -109899 -91448 -69064
20148 -69064 107159 20025 29008 132979 -19345 19816 -58792 -34770 363364 -143595 -32219
20136 237536 139047 223698 56959 -192646 -124355 265513 -8265 298084 61968 105899 -101330
20124 87084 63350 -106562 -139541 -147596 -78841 25164 114700 -27332 476312 108162 210519
20113 210519 20711 -151053 51605 -350698 31499 -134529 -333167 -235307 -300011 99672 28633
20101 159275 54736 60790 -163945 523866 -193660 -146607 -49229 25227 -155523 18956 -111637
20089 31395 -34986 -340417 -25503 -159047 74164 -85829 75666 -356768 28804 -350250 -46928
20077 -91849 -72620 148312 -127066 -375155 -192587 -154474 238961 -11482 20026 -9444 205323
20065 31042 -46622 125323 -171177 9611 -61161 -82362 -89737 83046 -50178 -61662 -30304 163712
20052 150550 -62802 32167 -468090 -151120 -106151 -111982 16641 93741 -147755 -139908 180908
20040 -99533 -296412 55578 317821 -63777 -139383 -69760 33281 -50770 59168 -114485 96763
20028 1965 141584 151134 257775 7070 -185907 -427393 267524 18676 -346901 -191068 -33307
20016 -117547 -67670 -107684 -307360 -143156 201773 -200407 80797 347130 -60023 18943
20005 -339098 14428 -73926 -309891 262834 -183875 -66168 -174862 119633 -205969 -273692
19995 -273692 -234165 -102798 -42128 -210966 -75571 -108088 45532 -341754 71745 188612 105358
19984 105358 -134474 -153219 -42341 -96865 -52435 15622 -7131 -174110 -200927 -174775 -64487
19972 56093 -137949 -182436 84549 -185043 -108141 -99658 -15516 -235283 150948 -118912 116456
19960 -184578 -98736 10361 229409 -108205 -334184 252495 216639 81891 87576 -38899 382619
19948 -139645 -113797 -328903 201378 17645 -80670 110932 -277426 -94020 -3728 -247142 -100323
19936 11776 -118696 295248 -129307 -59162 -65428 -56624 64729 -169094 -9246 83563 262779
19925 262779 230245 259954 54343 -456223 -156222 -57625 68776 39270 -130323 216873 -130247
19913 47160 -234964 2972 72297 138759 -145884 -69175 -194553 16821 -329176 37045 -25536
19901 -498655 -136802 49611 17226 -62123 -33629 -65053 -225650 -86516 -63239 -13660 -303220
19890 -303220 -28798 -182187 -25049 -32849 -132670 103679 -23354 -48969 94042 152561 160005
19879 160005 -55434 30011 -195247 -25336 126694 -51335 -80241 -117345 138389 93663 -69575
19867 -72332 164243 -281511 113283 -81143 336073 -43477 -129535 -167301 110129 -135118
19856 -6956 -54961 404232 -198403 -9178 -29804 -33362 66336 -251408 -167486 -296543 -76932
19844 58860 58931 89695 4377 -63646 -161497 110258 39269 10089 -40327 -116197 407055 -76315
19831 179614 315688 -235891 177179 -217391 -114516 -132600 -169347 -165367 -24641 -34893 -70745
19820 -70745 218140 -257115 -25641 42117 -75869 -18712 -107548 -168130 -175749 40765 -135737
19808 -72937 -123731 -218083 -187236 145327 -118027 -150580 74271 -83695 -158602 3161 11543 -128900
19795 7471 -103778 -16765 -462557 -301434 78282 160546 365928 -155550 -188609 237426 -230110
19783 -111304 -258858 -376303 13931 -117497 -86921 -366303 -137108 -130082 -82411 -75588 62686
19771 -21926 -40487 -134520 -367794 -220378 350228 -233741 -262137 -775 -263609 109822 -159750
19759 -247328 -338881 -148250 256674 -257930 -19664 -232726 -74762 -62002 -231492 133002
19748 -85691 26416 -876 -43175 68186 -345409 -237467 -159536 177191 -50307 73268 10204
19736 -56140 -8578 114566 85661 -135933 27717 -31804 -357556 -176428 68927 -323307 -260900
19725 -260900 153343 73014 -140935 -265705 35000 -105455 -94089 -56547 -110461 -222948
19715 -222948 187006 101842 -306957 -79538 -192679 112373 -189417 -278077 7132 -171128
19704 -43089 148705 -188544 179561 -117586 97382 -146141 197643 21838 -224814 -9062
19693 -205361 -221078 39189 -450355 -383182 -60128 52608 -369082 -8782 134953 -289427 -226688
19682 -226688 -69260 105979 -184396 141751 -47264 -244315 17249 -159578 -300016 131832
19671 200849 -447938 144116 271867 -217035 246921 52110 241639 10433 178317 19950
19660 -199983 -249075 92617 -317235 130060 -42734 -53416 153637 -179053 -287670 -405911
19650 -405911 1140 196346 -8561 -112377 375477 -89729 58262 56915 165176 -290631 -320795
19639 -320795 111823 -96444 97302 -24602 207833 297377 40639 89410 -104038 139955 150973
19628 150973 16122 151935 -126324 76428 -273059 63808 -102468 -237900 112566 155737
19618 155737 -161491 -74252 -238285 -92122 8498 -305001 -164281 -155141 -179664 -82462 -174455
19607 -174455 36599 -268867 83473 -55646 5714 -196457 268235 -68216 -65385 -176853 -186698
19596 -186698 -234815 -288424 -40398 -137507 -496873 -310906 9015 -77736 -4106 -165310 -370054
19585 -370054 -289110 -122517 199019 -228926 -114609 -445886 -122088 -596386 276836 -93566
19574 490181 -76972 -16085 -166985 -35553 -246820 -63030 -148200 -487958 -134766 209024
19563 297545 -54888 -48108 -162508 155630 -237181 -291271 -74471 -301521 -492122 -211404
19552 -345650 213273 36950 -50660 -217664 -32285 -68677 -85776 -249986 209155 -34587 -82120
19541 -82120 -199110 -151517 -116033 -184418 11582 76937 59116 -34085 -167596 -93798 -80851
19530 -80851 -111130 -145587 -254383 4827 -53322 -44179 -195203 -258065 -336474 -13620 104602
19518 -165816 -231937 -219499 -396620 14986 130414 -66320 131671 -285137 -86100 67800 44687
19507 44687 32862 16059 14280 -269850 -135853 58034 -243173 -25102 172184 289514 -403639
19495 -263116 -57563 166172 -182097 72338 -1976 -346814 -231665 -138649 433605 -17410 -190764
19484 -190764 -93928 -25094 266729 -165463 -52415 146223 -401323 57661 -317681 32709
19473 126373 -29446 12118 -81020 -244941 3170 -300518 -244117 -273223 154664 53365 219955
19462 219955 -38481 -247483 -105107 -127079 -122096 -262404 13960 -86878 80145 38599 175316
19451 175316 -10170 196285 -106622 22719 225452 -142268 238402 167983 -55382 -63814 -309714
19440 -309714 -64363 12321 -60864 71137 19507 -69361 -427339 362678 -289835 70595 27228
19428 81372 -130769 247378 -119645 84108 -375198 -236513 180340 42179 -13189 76023
19417 -84382 280361 -167277 -399450 136326 -167410 -137750 -26898 241064 -18088 -177960
19407 -177960 31643 -44203 78546 -41317 71813 -369314 43917 -73404 -723 72138 -65608 -106830
19395 -106830 59311 -48583 60410 -47857 -185704 276 5412 -282000 77424 -27338 -82746 -494956
19383 -494956 -175754 132262 -64330 112168 -128058 -201894 -313882 187168 2802 -65626
19372 -27985 22722 -249616 -107328 -118070 217272 4303 -148569 31477 -217288 296920 -352218
19360 -190001 -89470 -18925 -121561 -240612 41434 209121 -64708 -19061 159869 -114337
19349 -84127 201215 -310950 60552 -188936 132918 -341301 -173452 -230822 -234513 -108368
19338 -71402 49226 -127774 -142998 16365 -67597 166569 107100 -134489 -31243 -55709 -157904
19327 -157904 -355265 163927 -409588 -309722 -247814 -104232 -56184 198100 115408 -131464
19316 -212655 -193266 -375834 -97595 -8079 117490 92874 -170355 -59054 -316695 74265 -242941
19304 -164021 -70374 88257 -330330 -90052 115024 174839 -131165 -133021 -80940 -253695 204401
19292 46495 -194329 -201230 -33095 -69094 -229842 147603 -64141 -113500 16908 -404807 196599
19280 -19742 -251029 -64017 -449701 -184226 -77980 -83615 45810 -5902 180755 -348127 -78548
19268 -391468 366645 -161193 -162305 123532 200336 -289406 -35131 -348180 -290437 -109338
19257 132305 18303 -396426 166704 -86429 45180 -105316 62872 -137158 -252573 -149527
19247 -149527 26727 -95253 -178028 -268767 -241240 -23277 -307485 -341888 -227053 -114793 -77614
19236 -77614 57650 90526 169880 61681 -116947 -214960 -132807 240952 -16351 -56373 -131055
19225 -131055 -187301 254994 -375802 1147 -210785 57706 -407857 -230707 -5655 -236525 -164724
19214 -164724 40724 169120 -87213 273140 -75961 -227177 -46278 163419 -120721 -513900
19204 -513900 -129727 146723 -61245 -34867 -217792 -169341 60533 -329364 -121175 -113299 -163317
19193 -163317 165520 -93204 60123 -29557 -4052 -15809 152605 42430 -20849 -216528 -279160
19182 -279160 -382701 86043 -115247 -79840 -54985 27602 -418077 -33420 19425 223926 143892
19171 143892 54162 99496 78548 -297622 32942 -191006 48752 -370023 -55276 -219631 200316
19159 320293 -100652 14032 167630 -19497 61201 -102366 -132885 -173657 -191650 -153962 275703
19147 13696 -67712 35843 94263 -121316 -86157 157237 67070 -13060 -155171 -198585 -347280
19136 -347280 73247 -126351 -102733 -145577 217672 -94528 -69853 -407357 -309061 -71414 44576
19124 -57512 -26981 -73614 196221 69040 80825 170123 26027 -23647 13273 45172 -230662
19112 63462 -39586 -148985 83280 24363 -127468 -96854 -235513 104849 -197720 104086
19101 107172 61283 -140518 -293805 -194736 -337086 -138618 -318857 123964 81872 140666
19091 140666 -366159 9634 102406 132236 -227058 -54249 -159701 -228575 231164 281954 69087
19079 -123587 -105997 75697 11399 67651 -135732 -366526 119026 -52608 -241166 -119988
19068 -121243 -228743 -282763 115697 -278051 -124937 262034 -226004 -182200 -109953 286321
19057 -168005 234166 -137678 -42263 -45239 45955 -42954 47992 50550 -208843 -129765 65774
19045 -69767 -102590 190292 7759 78840 62303 -17296 159408 77310 -17153 -70700 83181
19033 -517982 -98110 -75324 300154 -95869 -122331 143475 -16304 115848 311742 -7730 -269881
19022 -269881 406051 41070 -281048 26386 -267920 -71494 -270600 72622 -92208 75341 57600
19011 57600 -225904 18296 -118250 -187678 19408 -282886 380908 186072 -383921 15554
19000 28876 -149523 -66617 128627 -351402 -81239 -368289 186275 -124485 -102646 237357
18989 -109593 -130203 -221631 -281645 404117 -216124 -211857 -14236 -231320 -96651 -154055 32561
18977 -287167 -283277 -69554 59180 40603 -181313 -9318 -124649 -241535 325820 103170 53452
18966 53452 -414148 -63239 -137900 -251745 -52005 -237728 108980 -133890 -11588 -121150
18956 -121150 -46587 -133073 -57515 105908 -225526 28416 19399 -392001 68239 35116 -229462
18944 -194946 -69471 58320 -32072 14152 -99498 -45632 150803 -223962 64035 162858 -44772
18932 411238 -221106 -129906 300279 -27536 283331 -228123 -29546 -518499 51506 301658
18922 301658 -110268 -188663 -241080 121792 -39854 -40757 -21415 -460277 -275185 -231450 78094
18910 -188924 279794 -123079 363479 -113128 -121163 -485307 -136038 51156 74261 -194223
18899 45990 36264 -97048 118000 -130663 -36032 102975 -104456 -124621 -364337 -139878 -94918
18888 -94918 3206 241957 38951 317386 76302 -285049 58382 -143793 -52177 -232513 167186
18876 -147364 -170744 -125904 83423 -108545 -420339 -205065 182657 -26980 146574 41306
18865 -16508 32983 -380514 -43231 -35250 355046 36635 -41791 -11540 121277 98099 -14343
18853 -47746 90618 -80666 -67070 -34303 -142370 -46474 43060 -58389 115463 84826 -10845
18841 66966 -182953 -208083 -11717 -98648 295500 -137149 -62556 70274 -58145 -166148 -179059
18830 -179059 77706 91368 -1067 107551 -41669 -6477 -207438 270101 28166 -30075 117560
18818 11226 394547 -71993 58209 156180 341636 -86528 159715 -98053 116379 -85203 38558
18806 129483 -269850 -224208 2486 176452 -386682 19280 204888 -344519 -191862 144168
18795 -155348 -24679 99140 59680 -139885 -24955 -127674 -232142 102806 91971 149046 -45771
18783 190914 -22060 -160002 -247363 219097 -397968 -158851 109307 -44531 -32161 138568
18772 -247732 86271 273019 2580 -161966 -332311 104604 119726 195967 15916 128350 -157726
18760 -189422 -266016 -385648 418721 239005 242476 -78469 -66283 -158687 -66934 -135629 50371
18748 -80607 84956 274089 -121994 -27181 -101247 148939 -169917 -53420 -175541 145004
18737 33600 19768 -316150 111500 -63086 459274 26443 110943 34356 -55734 -96189 356978
18725 42663 -84509 270000 67124 -182237 -206876 57292 -76889 21536 -147517 -221438 147389
18713 -159179 125087 88751 -68 -34728 171382 83261 -260837 -113909 -124160 -315261 286917
18701 58207 166014 -155073 -164966 131401 -85733 -11517 -144332 99095 -148301 23947 80515
18690 80515 -230815 -105201 -36027 156990 -189471 119476 -8863 -297553 402 26255 -282872
18678 -134099 -35995 -69693 117903 -226631 -99859 314046 23825 -343328 -101472 22775
18667 -389500 -182736 -150638 -275030 132482 -245349 -414889 129838 181654 166947 49685
18656 25106 7709 19546 -264727 -372489 44400 -163311 -88220 -136422 52396 -263017 200316
18644 -204747 103634 290286 -84481 -345565 -104892 -453603 -384762 116923 74308 -69813
18633 -156019 -264693 115886 -56466 82794 70993 -332632 -426245 -147977 181008 -19586
18622 -28558 -392253 12121 -90155 -420272 161295 -492952 24095 307619 -157600 54150
18611 50412 -19723 234101 291651 -309410 -216444 -60417 -175188 -339077 345992 -65615 25958
18599 31359 -53774 -168368 -176919 -326298 90230 -118032 -142287 -170792 -119757 20465 275295
18588 275295 -254583 -165975 -277982 -218234 203954 -116635 62823 -121097 141749 -30752
18577 74385 -153960 -87959 -9002 -233064 65621 -112791 104067 176183 -84545 -94410 -201496
18566 -201496 -112142 -181913 -114407 -268634 -152647 362168 -199849 -232306 -271798 -96744 -87039
18555 -87039 -598116 10258 -288131 -161465 -104726 -263946 -476099 -112730 138654 -161405
18544 199790 136950 -152809 -168937 274910 -147565 -189428 -2889 -49912 85549 -3971 95605
18532 207059 54263 -55599 -53538 -68038 305547 -112724 -44580 219263 140901 47762 251741
18521 251741 -456105 -133214 -101403 153307 -257932 125816 -201802 -32350 69406 -151721
18510 134249 -81946 -185468 -153403 45576 247078 -123797 -400938 -2784 -118594 -168701 26347
18498 -48766 -83750 -101454 94135 104784 -154063 -75495 -8410 -211415 29022 -86573 9522 -244467
18485 -142497 -149363 104445 -29034 101749 -194165 -133742 81930 -137942 54962 -126235 145093
18473 -304180 26764 420021 -25608 97975 -46684 109562 -146476 158985 212138 -24183 142154
18461 87812 -190587 -341816 121668 -28842 -84126 111552 -284891 22433 43284 69489 -89666
18449 -79503 -25986 120395 -142512 47588 -403124 -40267 -108986 49134 -220840 -185864 63099
18437 30507 -246887 76030 -263134 3244 30277 21486 -130031 165524 -23120 -348562 -96127
18425 153590 -123660 372693 164480 211344 -212288 -50030 -200535 19338 -24237 -69274
18415 -69274 11019 -93609 18690 -26538 13094 -238957 126020 93560 -425362 71538 -17124
18403 -192372 -297561 13581 3187 6183 255148 -237157 -56396 -218977 -86132 -25499 -87882
18392 -87882 114267 -141961 96710 -233522 -38096 -150061 -220181 -169805 -151203 282286 -188845
18380 -112244 -93129 -20285 269202 163375 -250547 198154 -107396 67972 -2946 -64918 -410269
18369 -410269 110550 -233372 -319610 -28824 112267 -128344 -199478 -45497 143179 -97497
18358 62624 -168228 101987 -186935 -220627 140668 -174616 54532 51168 58910 -236265 102576
18346 -203456 50301 23822 98939 -89769 41049 -232271 -55590 -65590 -158930 48569 205095
18335 205095 35999 127017 -10173 59749 -76969 47815 334875 -96021 -43080 263921 -22635
18323 -41967 -162386 43552 99099 15730 57412 -1836 285493 -132516 254008 224935 -166474
18311 161091 34101 -3266 12410 -168460 -172271 -70582 -131437 -416282 219506 -262558 207379
18299 34583 -18160 33595 -42594 142695 -173933 -247125 -503096 -34360 -103111 -42384 57084
18287 12636 -351412 -304363 -470357 -311557 -82676 -193539 80445 54257 296281 262809 -228967
18275 19239 -222753 -211168 69264 20364 -76467 223921 -260627 -13196 -254554 -195114 667
18263 -254223 -217336 -165440 -262481 -153630 218690 -51925 10826 -174518 308494 -186101
18252 106914 142297 -279399 260988 -128856 322511 210646 -182458 -402934 -113874 -67360
18242 -67360 -104236 90917 12537 17898 67840 145552 188500 183308 47077 -266414 -76118 -490195
18230 -490195 -5474 -152656 121196 -27669 166789 -282234 19405 -26309 -55801 -99551 156309
18218 -278554 -50615 -65086 -18918 218682 115603 -10442 -122139 161439 93664 -54070 507394
18206 -253107 -98556 -123571 -117831 -112056 -96806 -198352 -394897 -255758 -210370 -226129 154438
18194 -112928 -55040 -220224 -245847 13523 -235484 86123 -41173 -303391 -17242 77425 155057
18183 155057 55337 -192106 -21373 -86061 -89634 108144 -47807 116019 -60786 36344 -88195
18171 211582 208550 121666 115771 181027 259067 -215673 -140427 -91986 -32650 -43520 45014 -10804
18158 424915 330647 231988 -339723 -22081 -362061 90767 1712 -145159 -141419 -61582 60814
18146 23232 56125 -190932 -136746 -22126 78513 -78650 -29857 253452 133313 -65515 -115149
18135 -115149 -105250 232414 25931 74457 -149750 -91763 165240 128120 -3450 94802 -138112
18123 -355528 241039 -386335 -115032 -97859 132922 -56540 -160790 -33221 -85351 -110555
18113 -110555 -50726 -93862 274012 -161337 -155570 204294 -93013 -199421 204213 40599 -118105
18101 -57509 -195648 -195883 -245997 210397 -330907 21440 87535 -159629 -5992 -5717 88387 -43794
18088 170553 210647 154878 58815 24954 122362 146435 -341466 -20447 246109 39787 43647
18077 43647 -464944 -389136 -390942 -97264 -93392 -212635 -151167 -265959 137852 250684 -239900
18065 -309578 137516 -201597 -119792 133531 -107453 -481948 78782 57737 -87525 -6720 16301
18053 31975 -232336 -14147 -144468 -64556 -169751 -137949 384632 219029 150448 140969 11705
18041 394978 -106068 256472 59745 68286 -208521 -133207 -249058 -22583 -44944 -173845 -2131
18029 80835 -6309 -108483 380464 -191649 -162509 59469 -66808 286453 245393 -306710 -181990
18018 -181990 -62108 77939 -21300 -106337 -108316 124508 -434756 -177464 108981 211438 -333697
18006 67337 14813 -161885 139237 -178076 239810 69408 -365306 187148 24872 166963
17996 166963 -219834 -69482 -466045 68112 187458 -102664 -113114 -166787 -71586 -85948 89564
17984 -60830 -185483 -83351 -46803 13769 -26069 -242670 -106649 -40643 151032 -137966 -46069
17972 -202248 73999 11850 -78580 -251669 141916 -91519 14553 113477 -271894 -291706 108715
17960 -4446 115008 -242592 105763 -388540 -57025 412479 -51980 -612481 -195206 95786
17949 -51470 -45130 -38605 -185094 70978 24279 -230654 59892 191695 -10826 23068 -480725
17937 185980 -112363 13515 147806 -242446 -88966 60823 136861 -159376 78775 89768 150721
17926 150721 -271922 97694 21511 168871 -45477 -115910 -142987 -49922 -148459 -323044 -35039
17914 152429 -357482 -88890 -181303 241742 111748 -52264 -242983 -208214 -91751 -194573
17904 -194573 161641 374437 -140870 -114038 66458 -74314 -121261 124123 24133 110198 -204944
17892 24455 -281323 55937 -163107 -172122 -116460 271074 -81418 14689 323045 363827 -106214
17880 -96101 114749 -306010 387479 45694 148999 -238568 125539 89801 -350745 177186
17869 215375 -99901 -44522 221574 -67136 -76273 121664 3928 -254625 -181473 -209547 185136
17857 63525 -31312 -47480 227732 140944 93277 -77674 -132636 -113554 98395 -217421 -165266
17846 -165266 -190917 -22404 90632 158221 233042 16018 85934 -211955 -84433 -157843 -167838
17835 -167838 -123579 198525 62868 -380475 -45343 63699 -4140 -105991 144504 84083 -146833
17823 61542 -331415 -217629 -32451 -89497 -110624 -116394 -96505 130787 197433 180954 178026
17812 178026 -123383 -26450 -88115 -41026 -62231 31403 -20547 34452 -46602 -172924 105432
17800 7532 -101433 -12078 183253 127081 377983 -332629 -3340 45843 -247106 -71451 22243
17788 33987 139638 -28970 308156 -31950 -261616 -141417 -192075 -198418 25295 -42138 237019
17776 82976 3600 -75639 -13128 20383 17700 78598 -101462 54464 192113 21661 360571
17765 360571 125877 -179490 235519 -151261 -242323 266600 -322066 98679 137475 -73641
17754 116082 -306611 13402 -193398 3969 62511 -36036 298555 116978 -345874 -10100 13720
17742 395629 -37311 14005 -6500 -232563 41277 290224 163261 236349 -136490 -96988 260686
17730 -236285 -393210 108447 105659 91571 134221 384980 -32936 26616 -171091 -116696 166749
17718 250404 -270013 -51792 -84643 -290486 -113219 -55453 182154 50659 221447 13896
17707 -342782 -101114 64525 -30647 21526 -187788 -13276 -51242 -120758 162788 -28314 85807
17695 -115553 -151391 -393546 -26945 19638 166538 -267280 -226395 -307184 -276850 102650 71527
17684 71527 -118499 79885 -80896 171839 77586 -58737 -57228 -67615 -36772 128918 110071
17673 110071 -110991 -170686 -67534 347029 271798 18272 -199887 208711 408975 164002
17662 65580 207410 -48908 -266228 -51123 188754 245229 438361 -58788 157323 41035 -103111
17650 120344 -64887 -159294 219644 39692 109359 22114 105119 -224623 268408 215864 -86274
17638 205872 -18727 302196 -336215 167520 44131 -218397 312825 -132683 80110 23816
17627 374325 -136521 -209307 328684 206337 158543 44583 55252 203712 99305 -179582
17616 199025 -135617 207019 -66818 198845 58255 -181852 -152233 63205 123750 194758 -329049
17604 284319 74438 -156121 169313 359951 -184114 -10648 111094 -248402 -84667 -218645
17594 -218645 295899 -144420 -347694 -110832 -13261 -322057 -62876 211080 -19638 -157852
17584 -157852 13342 226262 -114438 155986 -207752 -145113 -135381 -7518 15357 28066 71670
17573 71670 -60599 204279 177505 34585 370142 27822 97006 133205 213376 34744 -32356
17561 135307 322769 -227518 -53393 49050 -175274 -184274 134744 192620 108122 194963 288095
17550 288095 -231544 195149 30301 -29464 -46601 -73545 95705 -59833 -179067 1253 -236292
17538 153195 104455 19441 -137719 -31124 239833 -335687 -118413 -42917 233038 9809 23114
17527 23114 139509 -283973 296030 127582 274287 -245713 344423 263320 -285941 245994
17516 26254 145911 30972 183533 -37383 -49010 -139145 -39087 10952 73310 -588129 -175854
17504 110593 39055 255211 181893 100604 -127807 104586 178392 41395 -121974 -39221 163407
17492 5132 -148618 214559 117099 307017 26404 139236 74722 269915 -77475 -124699 -63243
17481 -63243 55539 232338 65897 132680 137052 144865 331853 223790 351555 83531 312348
17470 312348 203691 118497 341030 -94749 144492 439656 194421 309063 -249167 360508
17459 -131189 257638 304314 84120 17628 93336 257283 214090 307991 216416 163704 511781
17448 511781 278273 243424 328710 486792 398316 238098 -61198 -128536 293070 168061
17438 168061 252941 374197 232376 167414 13021 333552 324026 249782 279742 -111004 263455
17426 -91719 195539 416713 243550 305198 214996 357711 260589 403497 141611 30169
17415 320253 217113 220834 382567 406892 110548 110092 252451 -200636 489513 -285329 33988
17403 206248 138945 367423 -39424 224896 329935 73741 -17815 287269 149840 592679
17393 592679 419213 -101954 -56048 20070 65713 -25085 380894 257165 -33930 34301 349736
17382 349736 228301 175083 140005 -37914 213593 113196 20257 166047 -17529 392197
17371 500178 -173074 322436 248151 21659 -8049 122904 213114 324306 159954 2439 -68977
17359 69060 185368 -214219 287715 -248385 141822 -19490 182578 -45567 -88752 74594
17348 74475 46871 -60554 271129 281165 218471 16132 -58943 352070 130050 76209 375781
17337 375781 15466 224864 276469 570386 49528 191921 -50344 211693 -52896 234963
17326 507844 33160 12960 132264 205099 -201624 16510 -38101 4535 306526 6497 183393
17315 183393 -226287 303853 -185986 143181 -195518 150268 -77332 128741 16035 -187843
17304 337791 53660 -92793 -33905 18016 -161550 -167057 256640 -126041 105125 322617 435096
17293 435096 -4594 -226949 103621 390300 -34273 133719 419200 134955 257081 183835
17283 183835 302957 135719 223907 127276 440977 14961 328312 226319 174327 206122
17273 206122 397684 194216 173287 70109 377192 73119 70135 320411 -183760 368762
17262 345183 -13045 32787 108246 258770 285971 5284 -36884 52218 -17379 152650 301538
17251 301538 144923 -213958 165083 5058 3727 305001 -195085 -164761 44455 82235 241214
17240 241214 203894 139946 41639 -189553 3953 -109658 192428 415081 148909 256660
17230 256660 155975 112293 134987 329357 417476 151581 -97148 372254 154206 250435
17220 250435 252435 163035 231113 -108126 -50879 277174 -31067 60789 428733 410999 455401
17209 455401 180329 -11002 88894 258035 364698 530174 325990 340227 166335 313329
17199 313329 58352 188767 -46191 270622 281376 147748 288328 186385 -21535 266743
17188 330320 204757 -101546 35607 -78780 230547 579331 222272 183029 535843 58260
17177 135716 249708 398057 129443 90778 337709 195131 -56424 264221 850182 237155
17166 254234 -125728 481869 506068 219229 534793 381060 290354 219477 64627 97971
17156 97971 423916 2335 204236 123396 69041 -30437 344403 523655 347803 279629 -160599
17144 117025 -65133 737111 294689 101454 159081 110760 297886 348853 322503 493904
17134 493904 337580 114932 521453 280492 498591 334071 163365 290797 405805 356794
17124 356794 291684 385964 516303 151377 381540 282386 639200 286646 246230 108547
17113 275284 42755 914701 112459 358639 175823 648527 112862 370057 491491 420373
17103 420373 218299 562876 315689 135445 189678 484614 121465 629952 362648 441520
17093 441520 186485 385436 443678 385452 485211 390748 510742 639047 401616 509613
17083 509613 718614 496837 198953 424638 7880 457410 152515 448584 536634 157492
17072 540412 357029 118714 424836 417417 169082 825271 394923 859770 797578 665257
17062 665257 460306 314513 545886 354875 500765 333913 742777 446555 401794 536974
17052 536974 207898 404130 181927 826843 801803 625692 499227 226668 390123 394513
17042 394513 312217 692269 690054 735650 566481 769201 402170 704211 500769 340339
17032 340339 426144 716586 663989 628634 452537 450235 625483 615055 368174 638120 408895
17021 408895 510247 606707 793607 677741 619813 669044 644390 509908 566559 528606 331635
17010 331635 916090 654158 746594 496980 275788 946336 560649 383711 698450 812069
17000 812069 777598 723771 681371 906401 770771 341362 875674 685623 543623 881539
16990 881539 905399 1061457 683069 821679 792485 646229 1138061 689603 798226 808301
16980 808301 456070 1204268 1060122 729682 800342 913141 449215 808095 644921 675577
16970 675577 695601 1114496 518059 882863 619959 548545 1105036 733068 486918 1184355
16960 1184355 658390 1011528 810168 1047478 852351 1025149 749851 1043865 1277220
16951 1277220 895769 851549 1139465 1255428 889246 1287305 1167184 1048078 590965 930963
16941 930963 1160729 1420603 1241053 1081450 1203117 1063730 1252193 1113331 1504725 1071662
16931 1071662 1361029 1143310 1256842 1346562 1250078 1600234 794456 1057732 935157 1580867
16921 1580867 1431803 1171502 995448 1283226 1190584 878593 1548935 1591141 1214257 1426102
16911 1426102 1283733 1547676 1469888 1411834 1495266 1336574 1694173 1697991 1314120 1717740
16901 1717740 1800064 1487945 1462628 1504989 1731029 1503617 1901531 1801252 1604450 1729345
16891 1729345 1656663 1862205 1789764 1724809 1964670 1893214 2037716 2022351 1950412 2141371
16881 2141371 2124339 1998110 2252943 2168817 1701997 2455879 2134909 2482584 2228348 2397582
16871 2397582 2323437 2420385 2239858 2537801 2171739 2222972 2332428 2161315 2759491 2926528
16861 2926528 2161763 2560787 2822972 2707289 2683603 2938915 2624811 2559888 3160287 3176543
16851 3176543 2798885 2915600 2989907 3183471 3107948 3648429 2918608 3298866 3534496 3662090
16841 3662090 3361988 3680038 3823118 3410283 3544290 3738014 3889975 4123026 3687260
16832 3687260 4099442 4282869 3890282 4397564 4480660 4402570 4892293 4781307 4501329 5028672
16822 5028672 4590676 4940951 5040566 4811733 5365031 4934102 5278108 5492430 5599513 5541089
16812 5541089 5971449 5874642 6155136 6102290 6638984 6339924 6679459 6651072 6812027 6798834
16802 6798834 7009978 7349073 7341608 7607646 8017880 7703749 8269513 8539498 8314736 8941734
16792 8941734 9148922 9448736 9718842 10018061 10372318 10300209 10515304 10570915 11077973 11474506
16782 11474506 11743440 12408437 12527949 12808494 13076478 13851247 14006604 14138828 14764922
16773 14764922 15535058 16011699 16632031 16973416 17986914 18006556 19113833 19989048 20381019
16764 20381019 21225888 21751819 22836730 23622496 24717120 25718156 26885822 27790884 28594058
16755 28594058 30412006 31669421 32996016 34345783 36062385 37877088 39892750 41693957
16747 41693957 44037973 46148745 48278140 51297768 53990181 56988333 60111214 63469102
16739 63469102 66792072 71486987 75280887 79747709 84325844 90040809 95478835 101429293
16731 101429293 107876988 114426488 120943244 128333953 136215831 143843013 151868753 159918157
16723 159918157 167392784 175032355 182233351 188672887 194245704 198352417 201835608 203694330
16715 203694330 204439155 203626583 201658845 197853401 193469271 187895625 181911400 174487122
16707 174487122 166752792 158807842 150894333 142739138 134492819 126837136 119274913 112160813
16699 112160813 105809792 99189357 93426924 87742417 82556539 77464536 72976390 68657383
16691 68657383 64684602 60735820 57821462 54453186 51742520 49149271 46491918 43929744
16683 43929744 41908651 39764609 37889297 36364554 34418614 32913992 31491782 30132023
16675 30132023 28499053 27859181 26453845 25008618 24381321 23341961 22432228 21634662 21081338
16666 21081338 20019382 19337125 18248759 18096147 17311997 16731917 16075744 15713580 15152359
16657 15152359 14666614 14218791 13388556 13144874 12864802 12220944 12148595 11854081 11297509
16648 11297509 11116845 10884237 10419060 10185229 9457131 9807231 9083196 9043262 8965080 8755790
16638 8755790 8619005 8381983 8360321 7870134 7517706 7223150 7263729 6810963 7146262 6816329
16628 6816329 6351140 6034451 6045551 6303163 5922636 5907484 6027293 5592162 5293523 5059549
16618 5059549 5131838 5280371 5015257 5004544 4839948 4564676 4822981 4667131 4389766 4657099
16608 4657099 4499499 4189690 3985604 4262423 3884995 4134082 3909882 3835779 4085330 3781119
16598 3781119 3593140 3410123 3521379 3519548 3503095 3218010 3039814 3297833 3540962 2873241
16588 2873241 3155560 3100268 2650312 2740418 2668941 2305732 2946361 2723139 2597450 2588869
16578 2588869 2477506 2578690 2632198 2459362 2518850 2430203 2170527 2427328 2347435 2361487
16568 2361487 1911382 1843946 2488792 2064550 2021231 1860549 1875806 1960785 1976470 1999173
16558 1999173 1704002 1877082 1610592 1775112 2103527 1863304 1732900 1618415 1475142
16549 1475142 1643544 1160205 1698847 1351482 1452987 1385361 1321654 1345784 1277556 1451378
16539 1451378 1221798 1429186 1274133 1477249 1424672 1633130 1297564 1174625 1338368 1573018
16529 1573018 1284036 1303705 1518601 1253170 1245125 966296 1289208 1481357 924422 1152754
16519 1152754 1219701 1195355 853119 987508 840458 1271271 1218641 1076023 934918 1111352
16509 1111352 1175864 1134245 1420509 1125443 1224856 1105540 937403 1198902 867388 837937
16499 837937 1009708 1278476 847209 731452 788674 863764 965910 909516 1190019 980475
16489 980475 1190468 935140 1110402 532409 647595 471458 1101549 726753 938001 1197988
16479 1197988 938994 680526 852969 774412 826368 779050 623735 452531 648696 754642
16469 754642 613353 960272 532348 305281 940229 906426 702927 643451 484659 737882
16459 737882 822755 700064 492317 802891 428462 788667 977200 587347 353870 812383
16449 812383 322521 517468 980182 487967 697612 674747 567811 619398 944281 305918
16438 550075 539546 639246 845336 811692 553174 246016 329763 581190 426550 660758
16428 660758 616421 590628 638471 602364 707763 615399 630047 369212 372785 709166 630212
16417 630212 631326 248289 416747 268770 387820 324659 547450 271208 233591 203999
16407 203999 545277 360388 127119 367487 505554 248945 666401 596202 498426 594784
16397 594784 366128 481156 367879 612915 140455 266049 653541 288362 611772 139253
16386 478843 562352 426964 250179 338024 21093 345501 289054 571262 141034 248191
16376 248191 257554 351249 384366 348219 252877 582547 426000 188362 12627 273852 327000
16365 327000 238479 387219 448550 316067 822523 82844 129418 204074 546059 375575
16355 375575 339953 141760 -189184 229428 20832 52646 142311 21819 403669 401827 261714
16344 261714 321954 412993 324538 233515 299385 127309 332743 568221 259700 199701 314803
16333 314803 71380 -73827 -19522 169581 -214985 244429 202596 118566 93589 78147 461753
16322 461753 -5580 103483 57923 229337 425695 415980 139881 -32281 553771 166370 -62951
16310 -30908 368436 -98224 406100 121320 439189 183626 363329 -178903 248224 408564
16300 408564 81200 191562 592657 63490 280739 229800 -5762 -15027 60799 120530 60373
16289 60373 524190 -261284 157928 377359 -170149 153829 58731 -349650 221669 188723
16279 188723 338664 217259 212086 323600 70769 71620 -109475 -110069 409360 -1064 64921 266137
16267 266137 -110245 -46227 445868 34914 83224 -1519 -38812 161597 261945 89211 81176
16256 81176 -109377 408410 110951 234705 280197 140980 238801 49250 91043 159718 179733
16245 179733 169403 -195032 77948 -12571 -69069 223964 -23871 -34368 -230974 156073 171072
16234 171072 5734 -322501 278185 204510 -11283 -37264 247877 208366 94749 248095 6920
16222 -7954 221533 201172 -147445 100536 268476 174673 174046 330023 347572 43742 62221
16211 62221 32834 117887 112954 -32400 6072 44081 191342 -18620 -330680 75122 -11114 -285514
16199 -285514 100809 69327 288839 44710 5323 278902 430768 294320 70223 108904 -481422
16187 -50057 46755 131685 441509 4465 -68501 392228 -77039 314349 18760 -149699 -15373
16175 245718 202036 254751 -400866 7169 -298540 360065 445459 -101823 -219538 -86456 113679
16163 -9188 -128912 99899 -133189 -14118 204366 288277 119315 339932 -154570 -53953 -20114
16151 212500 65876 -83865 78162 47207 206864 -152146 294307 290323 -27903 -298945 104367
16139 357928 -193601 41307 270775 213266 -65133 50032 74213 -67271 263296 314128 -8933
16127 149161 -167141 108780 -45005 29536 -212619 101935 158936 225395 -330009 10639
16116 -317064 73136 -203529 132560 390576 72205 203228 155729 -173100 225563 220511
16106 220511 201929 -167381 -253706 -220236 105523 369257 -59939 142955 86028 36415 153774
16095 153774 -226915 -159439 -275265 -422767 -324220 -457812 -48892 106264 57614 -302395
16084 -168523 37381 -303732 292027 44205 -420205 117342 385078 177863 -191861 -16936
16073 -113278 -130735 -41491 -23033 -40487 -124712 -44299 -98789 -192696 -123240 -81889 186267
16061 39231 -35823 55117 -54079 -163659 -196820 49569 198855 72565 118023 -282731 -8303
16049 -285585 51156 -294586 -39854 204538 -104780 135214 102981 163816 -134365 -31558
16038 -93260 136599 -212892 -117064 -60908 -150823 233231 138887 -10320 194507 203357 11403
16026 -439801 -296228 10418 -111747 -271456 -50876 -33136 -267075 5297 -114203 45447 -175524
16014 130035 48852 -219757 -169074 223756 76318 83254 17732 -299423 70787 -149295 -48727
16002 194734 71409 40222 -96528 -235191 171291 -257146 -359041 -15500 -77749 199558
15991 -75642 -84858 -125101 -27356 50321 114862 -110889 -11407 -293493 127368 412366 147368
15979 318365 131256 19061 -183892 281452 -4099 -194160 233570 200859 303239 97834
15968 287328 77665 56926 175068 198755 -221700 195092 -140628 -112135 -182991 -227229 -15498
15956 257354 -240048 -87910 20818 -138324 3665 -189681 8262 -215131 -276364 -45960 -229887
15945 -229887 -264898 -210581 -39487 -194758 111558 -30259 -72912 -134016 -298848 38877 -28102
15933 199661 -273088 -366737 -475793 119487 -142267 -29435 -304357 -436034 -122134 12354
15922 -39017 -97978 -172346 161150 -124623 -238831 -259460 47875 60739 -213095 -205773 -148936
15911 -148936 -201007 -3569 -242349 37640 53826 -154141 186934 -169305 29688 183466 7994
15899 208146 148108 181635 168271 -76114 -40459 -162580 -146060 21640 -50348 -299291 17181
15887 269528 -65019 -304882 204408 14715 178788 112749 94090 -142368 -35078 -1089 -173616
15876 -173616 2820 -25355 301234 168928 237012 130829 -77138 21511 -439701 -41647 -300448
15865 -300448 370222 -5425 -211001 -19052 -131771 -46762 100593 -144426 -77164 -158199 190269
15853 146444 360216 263455 -15089 77638 227327 38822 101119 10961 -72327 -127035 -193819
15842 -193819 190042 -92675 -357404 117283 72916 56229 -187452 130862 227553 -83729
15831 100322 67352 -224134 118453 333987 -203539 -47783 18553 -18178 -12591 -287972 -94350
15819 14905 -465194 52558 -96178 -65563 -116089 207456 42062 -348217 -406668 281717 237695
15808 237695 10701 -204101 -186712 86024 -128475 -81801 98730 69835 -288426 -262197 -85323
15796 239758 -37861 -66550 -40205 -110198 113543 220386 -126893 -122214 -111570 -137026 -4742
15784 -70979 213386 -297162 366908 53454 -249586 64780 31246 -268231 77133 -77988 77354
15772 -348974 117034 -209870 -109111 -213417 -62975 251983 -110577 -381634 -136665 -60124
15761 -340441 27347 -161933 179069 -132743 -47943 137821 -41448 224600 54678 -406256
15750 219955 -26610 31905 -280581 330467 -145785 256022 92022 -130853 101818 -88627
15739 22184 -16855 179183 225371 -172171 -169104 -29620 -147484 66794 -11888 44287 -93783
15727 18952 -123436 49516 -123236 -159442 244191 -199164 218218 634151 111845 -58093
15716 -128043 12983 -273028 -69974 147190 -173705 -290694 1932 224721 -175779 -198640
15706 -198640 -203644 -163694 350381 34650 -233700 117913 -243698 -243962 -31865 101670 -141117
15694 33148 -264685 435762 -138897 -132541 -95194 -88759 -45220 -443277 -48754 -33499 212676
15682 44051 104586 104292 81834 192382 241481 139072 -122639 -75968 18881 224661 438827
15671 438827 105423 109326 -5294 210650 -133398 -353632 -56293 36364 168571 124065 -164899
15659 81695 -266941 245997 388759 -40675 92488 -85125 101168 -342893 44216 145866
15649 145866 -204974 15075 251352 23655 -157067 243240 -231153 -339345 155530 108544
15639 108544 -34780 172083 -430521 145568 -43008 20845 47927 -74336 77002 -201369 -119521
15628 -119521 -43030 -90219 -91800 -2899 -146298 -309290 -50934 -30687 54541 -97542 49151
15616 7964 -446666 198145 22926 -145693 -5765 213735 105488 269839 -30786 -251352 -150234
15605 -150234 -207481 246281 37803 34234 148603 -112838 146698 105073 375707 67151 -198977
15593 -6853 -136139 57068 -5972 -354812 -26664 -58438 124155 480130 72514 179483 94151
15582 94151 -76724 -91478 -130451 234901 -176441 -210563 -293329 -209623 247747 -169020 126333
15570 -222988 42004 -203010 -144444 -191466 98848 85186 59403 464485 343063 -114244 132199
15558 82084 -174579 -117396 -175727 -40248 -63696 -201770 -80058 238241 -164262 -68388 -248108
15547 -248108 -283415 83951 -59820 -287848 161829 103891 -149388 11669 -81877 -112003 -21
15535 -28944 359874 309077 -82495 -147177 -65029 -82513 -65275 -295211 -225509 103293 -295230
15523 -511613 137942 -90358 -59433 -121476 -183065 -110862 43221 6346 -3263 33371 -42659 302844
15510 225079 105838 251637 -174511 106283 -98999 -8874 96828 -102752 76120 -866 -129791
15499 -129791 -387539 -243014 28524 -150085 33109 196533 155894 -42527 58798 -212690
15488 -498832 130048 256937 -42491 -47401 -11403 -50181 -104291 -88377 198379 -78099 151597
15476 -118019 32040 -153975 -39065 277564 113394 -263650 -32219 -179617 -97840 295753
15465 -207519 51995 -383095 300350 -120094 -141619 -173285 172914 139277 124965 -89082 -264666
15454 -264666 -70986 186332 213814 81808 -111648 95020 -95612 -188538 -100270 169097 -85105
15442 -119383 11030 -383867 118878 264816 24122 -264424 70603 -150065 -1480 -117826
15432 -117826 -169816 153297 243734 -20814 -81712 132129 -181106 -55267 -46513 328063 16622
15420 156383 -212915 -26699 -53687 198068 -105898 -48549 -124298 36865 -11891 -24781 97302
15408 -377146 136448 -423058 -155456 -32474 -9982 -342455 -106223 445070 -188453 524 115525
15397 115525 -215254 -199454 -24704 -176145 45557 246950 182233 152217 384814 -29828 -79509
15386 -79509 -218665 61970 204472 -106290 523014 -88545 153611 -167074 65851 339935
15376 339935 -390983 20994 -45606 68597 75138 -61760 -171042 460672 -13471 23173 -94620
15364 -14369 75365 27539 -173845 -98808 93321 214571 -68528 -93408 112902 162144 269141
15353 269141 90474 158060 136205 -71726 -153658 -276163 -171056 207009 92386 110035 131040
15342 131040 30570 170617 114869 -86400 49821 -114655 -291062 130667 238713 271910
15332 271910 -44795 -77907 -118885 68765 61498 -313730 -462885 10856 230849 -32403 223135
15320 -218056 76838 51206 32556 35452 124614 -2291 94979 -124677 234924 -219432 -125053
15309 -125053 180581 193867 -141537 -80148 76638 177873 -187322 -188060 -107497 -56472 76413
15297 131360 233733 -90659 -43419 466595 -437266 112947 13386 -48186 -64864 -61824 91971
15285 -122664 -30986 400724 -35389 370998 315893 136483 -118076 167880 77973 80464 -136478
15273 174180 69376 335257 -159522 79573 140700 130877 102573 203163 -128865 -166373 257933
15261 29657 -140454 111062 254181 303950 157951 207375 -274471 31716 119722 121808 324966
15250 324966 559064 842440 1385696 1414787 1496882 1434321 770519 168055 143356 -472131
15239 -47434 130075 -70047 311507 59723 278844 142092 458900 214843 51574 18435
15228 -10301 -207721 191801 -39880 248283 -92350 288221 16732 88422 -61491 310020 -90086
15216 26701 -472712 360455 72283 -108262 -140165 -439652 -15977 -64389 -64384 246759 -145631
15204 20951 187728 140234 223556 131056 -103167 258436 -178500 205681 154661 90864 -72188
15192 134849 53192 -60305 61804 82949 50403 97980 183568 78019 -70763 -70297 230783 -27303
15179 -171426 269346 305835 36806 125178 170502 21791 -45964 -178988 190887 -127836 493696
15167 221929 -1100 3382 271889 63240 -19159 502200 1000 182055 -71643 232874 408317
15156 408317 22016 44459 331468 245806 76457 283649 -86646 -174000 90639 62653 141794
15145 141794 235768 41806 150993 141003 -67022 59376 189891 125427 -175101 113943 147052
15134 147052 378491 2387 -15153 -142292 233984 285259 54759 -119575 137417 230921 493830
15123 493830 -282300 104441 378051 422418 294622 365634 172750 -31400 305657 42868
15112 156266 113759 137769 170507 75190 96578 63485 -2388 84692 32895 218073 307700
15101 307700 34390 250711 147198 257755 130715 202272 -99334 28059 136035 221307
15091 221307 19960 309928 176974 486436 264577 176982 49905 183613 293596 -54634
15080 329527 221711 -68003 -83615 157207 -97422 150092 212140 -4822 -248870 133913 92183
15069 92183 203190 -198281 97918 27152 413371 -50647 195159 87730 209978 164845 253004
15058 253004 76971 434461 86196 108304 242558 114740 231927 474094 394378 -146589
15047 -404 8407 209657 -179694 159114 268867 201781 147963 167257 38084 348319 100631
15035 146063 -127767 392896 248716 -75719 -30930 141088 -152920 -25943 372840 330140
15025 330140 550768 268057 103061 -24372 -41829 377246 209972 196824 286161 170017
15015 170017 -317942 260270 128985 -37614 106512 615202 124210 292190 34163 243538
15005 243538 156541 -93428 148040 -61307 270510 34316 114621 405173 353665 260573 258063
14994 258063 107193 458555 299543 442006 345755 -51474 375085 71631 470610 51139
14983 106512 133925 532068 225271 85121 22655 129756 377143 238441 286517 -10529
14972 276807 -12434 240624 372003 -10901 151583 405987 -87289 159372 369426 33006
14961 68337 247723 461817 521022 410556 302128 479085 129928 -51977 283148 53655
14950 -114321 227433 385958 168629 437443 219408 -37864 300437 81309 29205 336778
14940 336778 181151 340769 323242 369737 265709 321501 459729 111549 269766 299961
14930 299961 199992 175108 188601 108752 91983 -275045 121393 160168 326148 201728 272096
14919 272096 109189 175414 -310317 372463 440334 137933 445484 425384 52688 157497
14909 157497 358517 123332 222711 254324 267568 380516 169475 485495 208230 860261
14899 860261 569272 97784 392617 309398 152772 396557 -7573 480959 80684 454717
14889 454717 332175 427247 591498 414152 594157 188116 208511 307600 194989 256764
14879 256764 360653 217737 531300 783391 213024 421359 627339 544398 140903 141839
14869 141839 420698 158794 145609 552573 581829 162340 516019 526259 444661 173105
14858 96217 592319 441411 311095 352099 286196 446735 449758 208566 23483 295943 318527
14847 318527 249181 444451 233341 376330 151616 517302 449030 239512 -74779 423521
14836 363352 592316 531987 413466 430183 453298 479701 382119 211367 380784 399931 280856
14825 280856 486546 369564 234122 190388 257187 359037 421984 361175 383214 446923 676835
14814 676835 525715 282050 532608 542710 538077 376533 486810 221883 675100 664094
14804 664094 537113 493566 368265 431938 747863 783527 565762 448575 353826 223804
14794 223804 625086 596073 775736 234011 235312 500617 436166 485149 725812 603050
14784 603050 610663 501682 694585 836137 916463 439952 178527 438202 525595 829833
14774 829833 461867 746265 718773 453461 772519 912708 449270 591920 491610 566954
14764 566954 520181 188517 401667 545830 441542 577407 493289 748643 935014 742774
14754 742774 639841 454732 560587 487738 600107 592341 396032 734080 856362 897112
14744 897112 768313 831032 543680 767482 780236 834898 642965 720827 757654 754954 922721
14733 922721 640860 652015 641276 876188 730653 678718 384174 344371 769954 778582 716909
14722 716909 774131 670713 515663 826410 497271 819883 958288 751587 788243 1169154
14712 1169154 793024 760529 501382 687628 1034402 909470 836290 849559 732239 756769
14702 756769 983442 927950 1107914 724035 1127948 867272 848210 1000033 1052730 965426
14692 965426 959115 1077385 680580 992485 841333 682772 1183735 872645 943443 786075
14682 786075 1010876 793291 1241180 762920 593953 608873 829096 871966 881168 745078
14672 745078 1282568 1102237 927198 1287796 1290539 1029126 1205694 765517 993019 933845
14662 933845 981674 1194557 1282022 1353906 1042172 1232642 1259270 1150877 940157 1128456
14652 1128456 1259073 1257686 1121353 931136 1137351 1083379 1022183 931449 1318139 1017775
14642 1017775 1182861 1075484 1389237 1260049 1245673 1090104 1219414 1073136 1457680 1313018
14632 1313018 1092870 1119341 824485 1373020 1379681 1735520 1808794 1568384 1485320 1444619
14622 1444619 1348727 1293979 958893 1188584 1308269 1526441 1487798 1419599 1474049 1391341
14612 1391341 1351819 1333002 1520502 1458832 1220576 1599484 1595216 1539676 1929722 1734329
14602 1734329 1763380 1725837 1576250 1276356 1960589 1603845 1926283 1810006 1577633 1813172
14592 1813172 1845012 1796293 1693093 1451741 1700021 1696237 1904109 1612507 1985115 2133465
14582 2133465 1998767 2295382 2201242 1954389 2176627 1986715 1995890 2189595 2066287 1879342
14572 1879342 1894096 2681718 2120447 2473210 2370512 2479438 2093330 2687777 2634707 2598735
14562 2598735 2995196 2921328 2761141 3043008 2984602 2933328 3309487 3547812 3706948 3764931
14552 3764931 4341173 5135639 6352829 8541474 13338762 22903434 37578721 40303283
14544 40303283 26770952 11472097 5389463 3377624 2650770 2400650 2373027 1969761
14536 1969761 1772384 1953566 2285198 2118239 2271310 2192222 2292405 2039267 1925948 2482110
14526 2482110 2451769 2407381 2334230 2063926 2232371 2456227 2418144 2351773 2296117 2561146
14516 2561146 2611276 2579954 2611628 2754160 2657807 2719854 2759927 2620920 2922742 2826014 2775523
14505 2775523 3223444 3061524 3166906 3240762 2756792 3058904 2825443 3229093 3107857 3314384
14495 3314384 3361071 3487499 3377430 3596107 3219745 3648933 3353955 3772283 3757465 3539261
14485 3539261 3596514 3943430 3882572 3847611 3726852 3984951 3965856 4154355 4010688 4178533
14475 4178533 3984917 4139305 4004284 4254982 4239156 4364965 4520027 4466566 4295329 4420335
14465 4420335 4375685 4778926 4727324 4551342 4634510 4546906 4786244 4904717 5096571 4973092
14455 4973092 5242551 4989760 5154261 5115728 5594150 5454841 5507952 5484532 5550423 5903757
14445 5903757 5903812 5595354 6273509 5981273 6044265 6198755 6745634 6370028 6267750 6559117
14435 6559117 6674328 6443937 6605184 6896561 6851426 6981748 6996459 6860511 6946943 7393816
14425 7393816 7430173 7413361 7513607 7890363 8016248 7848046 7975316 8015263 8060759 8446070
14415 8446070 8872856 8526035 8534936 9461946 9125593 9006058 9089000 9480676 9591816 9835225
14405 9835225 10104123 9722968 10298583 10613049 10569246 11173290 10604016 11115576 11177376 11500621
14395 11500621 11158877 11363298 12038260 12062552 12447113 12557837 12862988 13061416 13114355 13407756
14385 13407756 13464631 14064946 14024588 14790169 14497269 15082036 15318243 15208283 15740786 16205503
14375 16205503 16555748 16423901 16917972 17043630 18118403 17727269 18580444 18938116 19332793
14366 19332793 19311529 19884728 20613529 20771681 21575374 21774534 22058607 22907254 23339531
14357 23339531 23633697 24243390 24909182 25482967 26133800 26727798 27473883 27943069 28947669
14348 28947669 29490714 30409719 30816992 31893747 33165687 33427920 34424559 35271575 36333884
14339 36333884 37515731 38111157 39599586 40634091 41811093 43180683 43876733 46081789
14331 46081789 47010536 48576892 50075607 51992919 53336755 55233899 57107405 59013914
14323 59013914 61381005 63262716 65750308 68431061 70618506 73462113 76073201 79146194
14315 79146194 82266038 85249102 88639879 92254523 96397278 100869032 104529092 109323989
14307 109323989 114030156 119231302 124593648 130344727 136278001 142800912 149622934 157194572
14299 157194572 164900035 173342579 181866798 191395836 201091359 211744391 222447104 233937212
14291 233937212 246153895 258900612 272542046 286314393 300929163 316300432 331562341
14284 331562341 347582632 363750663 379708693 395841400 411592426 426811861 441210718
14277 441210718 454378027 466091828 476148072 482802215 485195757 484731125 482533537 481317972
14269 481317972 477629458 476890917 472991719 464196656 453044562 440434173 426353006 411109621
14261 411109621 395068777 378481427 361871719 344888089 328286373 312387968 296926587
14254 296926587 282629348 268452928 254684465 241424618 229486465 217730225 206751018
14247 206751018 196719598 186706241 178150871 169752690 161369019 153519368 146547502 139934237
14239 139934237 133285398 127871032 122820906 117133007 111998744 107324795 103035321 98910003
14231 98910003 95055164 91555249 87873595 84155109 80893697 78167143 75278639 72424548
14223 72424548 70145003 67467960 65052327 63076960 61270967 58984046 57105033 55297106
14215 55297106 53417268 52112745 50596990 49157178 47262328 46075535 44860260 43623592
14207 43623592 42554502 41600246 40244420 39263288 37650063 36602576 36029254 35434593 34306398
14198 34306398 33355686 32272839 31444509 30787418 30570552 29501523 28649326 27839222 27076070
14189 27076070 26498465 25898977 25579236 25010933 24266463 23610178 23069383 22623393 22275207
14180 22275207 21911659 21143732 20808387 20541871 19904766 19287312 19091918 18827720 18368031
14171 18368031 17971066 17865567 17328664 17299081 16488579 16606262 16218127 16054680 15874840
14162 15874840 15308947 15051624 14741573 14573414 14415581 14085955 13938877 13760646 13528839
14153 13528839 12751450 13104719 12832890 12391944 12240828 12290860 11857214 11635429 11584217 11395820
14143 11395820 11007534 11131380 11054303 10648099 10471954 10305715 10464410 10382247 10121234 10074879
14133 10074879 9518158 9636320 9359871 8955154 8703261 8938416 9116005 8517399 8751275
14124 8751275 8628938 8583636 8296766 8347406 8005370 8148454 8093421 7790094 7428637 7447536
14114 7447536 7195955 7235425 7199882 7156313 6653640 7012237 6957762 6916744 6818357 6459983
14104 6459983 6376092 6524305 6239032 6514800 6016832 6120561 5913586 6010004 6005199 5938232
14094 5938232 5614855 5765257 5524967 5382045 5552912 5372609 5479632 5229329 5074865
14085 5074865 5420406 5194894 5060857 5226837 5073797 5013238 4658259 5149724 4791723 4964629
14075 4964629 4706584 4658000 5090818 4636788 4760762 4745460 4308935 4387009 3962767 4255966
14065 4255966 3998250 4505127 4154512 3977167 4013078 4431610 4456941 4049384 4221339 4051160
14055 4051160 3786030 3737899 3708415 3767320 3769035 3783848 3606838 3746565 3566792 3675407
14045 3675407 3384863 3526545 3540668 3405025 3262252 3297697 3284025 3294264 3224722 3319100
14035 3319100 3267730 3516978 3335025 3390315 3017642 3122381 3309490 3206769 2884285 2981657
14025 2981657 2868895 2867352 2863833 3206996 3148537 2765466 2910429 2741809 2623531 2975550
14015 2975550 2782026 2781495 2560586 2659388 2487323 2685064 2125327 2536967 2299824 2755788
14005 2755788 2200379 2729880 2246150 2044268 2509978 2148000 2362148 1909013 2488604
13996 2488604 2150145 2319051 2386822 2257604 2277093 2277038 2988432 4376939 8389119 16277900
13986 16277900 31619039 39210291 29511692 15234173 8735684 6485141 4902492 4374538
13978 4374538 3821408 3255814 3090057 3008799 2553846 2798068 2955543 2819285 2711021 2662735
13968 2662735 2276772 2421852 2447482 2250872 2288929 2389750 2437687 2284239 2199099 2040309
13958 2040309 1663858 1806485 2042105 2309621 2047455 2389400 2075977 2057400 2269331 1956949
13948 1956949 2037123 2099489 1671579 1980657 1796316 2197325 2114842 1836437 1727635 1896229
13938 1896229 1775979 1998622 1443273 1933930 1548863 1828947 1460789 1691801 1632563 1532437
13928 1532437 1365777 1892552 1522217 1358222 1244614 1516519 1643948 1348412 1607074
13919 1607074 1574239 1361561 1296348 1474293 1858972 1687452 1703426 1634082 1303075 1553100
13909 1553100 1524777 1336207 1780922 1354947 1583508 1572742 1306515 1335245 1644771 1246403
13899 1246403 1525757 1222047 1462069 1369833 1444889 1217025 1343509 1530600 1105233 1277286
13889 1277286 1061702 1215707 1025314 1445300 1231097 1151707 1221385 1344774 1416777 1353958
13879 1353958 1099398 864529 1603811 932714 1252914 1610651 1343706 1113553 1296639
13870 1296639 1185329 1041797 1466803 1235608 1024324 793434 1027808 1270658 950742
13861 950742 1117855 953817 1275424 1042728 944390 1441231 1134988 1132193 1039632 1102012
13851 1102012 1448700 1058385 621207 648959 1270646 899456 1204199 893276 994652 947512
13841 947512 1106870 1359532 1169368 951403 1142627 1455220 988054 1008196 1048897 1265168
13831 1265168 1016904 1039465 829260 681036 904744 1190668 956942 792272 843507 1145188
13821 1145188 783905 1295622 899057 1005487 607917 950327 488109 1033943 761930
13812 761930 1033747 749283 1318156 1061012 811562 744812 1129830 529379 1091652 727947
13802 727947 812754 667390 868880 824203 347984 661965 781146 687805 973186 1000298
13792 1000298 708802 844392 936687 879430 840150 746980 1051719 757002 657737 913732
13782 913732 817457 781578 1004637 933119 532833 872584 869288 905454 366460 451495 656842
13771 656842 708802 756350 669467 691473 622368 905108 756797 910734 777108 1163896
13761 1163896 1006527 737530 861572 640351 933098 904306 934574 628940 751035 817997
13751 817997 839044 480293 857872 809141 458292 708683 364844 749337 566473 680785
13741 680785 382476 712891 619489 825854 458281 511677 808109 665646 841443 783203
13731 783203 427882 446188 594846 622872 309405 538287 530793 680386 457386 638217
13721 638217 511747 760963 883331 447575 303091 935486 175267 498655 266704 702254
13711 702254 705059 500662 574003 393496 573821 445251 572068 465731 669889 700267
13701 700267 634260 419281 622208 868021 375784 624227 523482 770960 631764 444352
13691 444352 439334 534342 566649 474484 384016 721393 571013 328245 483852 570055 630381
13680 630381 52514 583403 675215 631535 726296 481130 210276 334343 432680 726081
13670 726081 280490 468333 302620 468568 405872 491652 281065 26981 543243 576021
13660 576021 554387 571542 527549 492202 656724 269210 645109 267066 334305 304982 660759
13649 660759 512635 108765 490006 485500 534076 422830 336139 787575 641088 484106
13639 484106 579272 475666 432371 682140 163374 701582 326172 561068 415565 591146
13629 591146 12572 163032 541900 487119 337429 550056 565831 584453 317305 380401
13619 380401 141003 543954 129437 224955 560931 563759 256974 253211 693207 589446
13609 589446 170108 505323 318452 439872 -4684 565669 408673 567151 464677 41601
13598 548476 435375 487044 72927 370577 456273 -65544 459550 202477 54036 187633
13588 187633 311207 408922 282469 537896 323931 -42892 564120 326735 688459 268613
13577 453516 323143 406380 382052 15513 221195 474470 646223 395170 -11550 78870
13566 219929 555978 -45864 391665 236842 317184 300739 573802 381133 370400 341169
13556 341169 173872 470078 -98362 293745 232808 331989 80082 836555 321494 737594
13546 737594 508789 854277 491457 301567 197120 700161 392958 93521 142469 189732
13536 189732 175995 332753 424565 263582 228676 217565 610296 248121 579610 334564
13526 334564 141966 378047 114469 418022 253662 470356 413963 394958 315072 139739
13515 120972 190201 276961 462239 361010 270198 224760 99937 581222 159876 103251 481997
13504 481997 336051 538617 355794 249112 324294 152416 376853 588767 62147 348305
13494 348305 640218 190971 315311 168499 282145 188433 403506 608025 208215 174549
13484 174549 487347 176400 16960 262815 401912 585640 350672 415984 216510 248296
13474 248296 63126 347974 134541 -67932 27668 271547 212964 547242 159243 -108359
13463 149486 604472 194980 242938 149563 240161 240063 143040 118317 262608 403824 495928
13452 495928 242853 189162 113152 565220 348926 255918 508266 238716 271647 -18744
13441 286003 313741 233933 398270 185783 255244 235637 112952 8906 260752 198576 328868
13430 328868 77693 391402 239281 191522 373808 283045 247438 -28855 100139 318263
13420 318263 267100 219393 -36432 38188 93982 380433 -54090 -30584 301504 454502 31672
13408 90063 288850 195674 129289 159431 118278 -16959 20460 24305 428391 235912 402071
13397 402071 423849 -155438 236954 240147 164729 111934 239079 238026 476046 35942 -76144
13385 258049 86087 167488 12210 258096 71858 140200 34511 19960 -176474 -44965 64028
13373 249571 17855 370342 361886 376219 290713 3531 261090 183509 322457 521564 125870
13361 211746 143120 438250 353720 364081 307590 26833 35356 -58202 160055 470673 290368
13350 290368 312754 191473 318558 249184 356111 382650 106302 348460 346122 131065
13339 301864 -6570 246507 422946 213622 165383 456555 181518 426620 374897 81164
13328 645095 100114 524411 274898 305267 27765 320378 349869 386914 213386 196031
13318 196031 655551 14985 272941 115979 153783 239805 293960 148009 326144 293974
13308 293974 14648 -122370 22580 361284 238662 127572 233438 159736 325294 247245
13298 247245 560692 129797 156895 7648 157564 83632 131678 279037 353902 97952 482455
13287 482455 153278 264612 -188371 169756 422639 280035 161605 208565 -20315 25702
13276 124351 93321 6517 9431 179037 224180 164843 -62373 39786 -261029 276831 136545
13264 115102 256658 86337 -112886 -92522 123325 -191009 196556 270849 373098 -17360
13253 79886 70553 -38503 -49792 158538 -38650 -116942 -197429 -156143 243424 178179 269680
13242 269680 181815 136074 20777 370190 -25367 237689 95346 34002 221697 39539 -62028
13230 -375779 64141 330323 154070 62624 158056 -137049 594299 61355 44638 50520 111389
13219 111389 -88830 332666 -20110 250645 290854 469193 105 96652 230784 266638 132898
13207 238331 163066 -17550 -91413 -88463 187965 162915 28014 204878 10160 282735 -22144
13195 96755 -74435 1505 190930 -23402 171156 -10856 4858 37823 331197 -96503 371045
13183 114318 42689 138493 19507 -211536 -105284 -205107 -198555 234232 -207065 -28986 236280
13171 -370110 93607 245692 8597 -74673 262805 -26771 263135 302891 62870 31547 96959
13160 96959 177683 96368 304199 112945 192001 214351 142142 208848 241952 -103464 616590
13148 -30235 -127453 -203369 55400 -69850 58869 91590 438743 -154797 163479 149267 264419
13137 264419 255193 76460 365595 -134019 -56350 75387 481249 -61705 168888 218280 317474
13126 317474 -7195 127382 -27855 -316655 207938 -112386 155589 239332 191209 -47491 159596
13114 30464 297762 58090 21072 190186 94258 289303 125637 165146 224880 129250 136844
13103 136844 -23311 284210 529161 103315 289984 -106888 121189 262543 166615 -17111
13092 15914 -102496 339284 198352 160350 188290 -9323 185657 93171 48673 -56899 -24533
13080 219265 -151754 296091 222603 -150103 136100 -45021 104730 -45019 64714 -30708
13069 -16015 -26316 150508 -44565 318603 248683 218922 38266 292824 111845 26659 135712
13058 135712 139817 -151658 -99101 -228284 100932 226903 -107173 219135 143737 10607
13047 194638 -48285 -4367 47734 279112 205085 77579 101187 23096 58710 237962 266501
13036 266501 -216031 -21948 510003 49041 -74659 171649 167180 232890 230536 138893 396681
13025 396681 487102 -566 -224541 -15397 158259 -162109 -72773 195001 187793 181644 170604
13014 170604 285577 -135293 519181 436168 70236 436070 -128349 106759 102540 199151
13004 199151 114833 29678 157595 -116906 377631 -215642 210893 -37060 149985 325016
12994 325016 -115611 65042 210507 -129013 288829 204087 61832 -56298 127349 -173356
12983 202887 64580 35315 -140682 595258 -32104 122215 -9344 65479 123166 -197171 251637
12971 189817 -52308 80781 179054 134486 454303 190311 198342 198034 21169 -13390 99832 70983
12959 70983 433205 64086 -204786 -314580 224732 79103 211655 34078 -271523 -169584
12949 -169584 276403 50527 -77463 200572 -219342 239919 86334 -63560 -50959 105008
12938 241045 -126671 -159254 -60468 524999 -60994 179180 314304 18823 81181 -44641 -104585
12927 -104585 196060 65534 -137976 135318 -213015 274777 -80929 -2036 -55266 107700
12916 154745 10755 187138 -205761 -242625 115245 -122555 92179 -20220 62255 61831 -28527
12904 -119245 132701 208820 286234 -104336 40730 21154 102797 3047 -13661 -68849 234392
12892 -205808 -174677 177182 -92032 -6980 -266944 111099 384236 164707 167330 202612 -21803
12880 -112183 212353 -141604 -224189 250448 47363 123537 169576 -96304 -83745 95788 58151
12869 58151 -365492 -198017 -272624 -32151 -38440 60799 407776 -196559 -60810 -50476 36449
12857 54388 -165606 -15174 227978 -107818 -70349 -69983 17301 -12725 -62279 -76354 -49805
12846 -49805 75767 273617 110556 12655 -17515 191707 92377 -159077 -261476 -167683 364970
12834 112583 110297 -181353 -102828 9634 353307 15542 -36797 -136514 -165570 -2396 125261
12822 -296430 -48930 -20373 268822 -2131 -108852 84610 -172216 -12911 246587 45076 -242184
12810 168493 410939 -24253 248873 -116590 243636 59019 209810 -248353 -113592 158603
12799 -253782 186419 57313 292335 51709 -51445 -232953 25507 89120 54792 42547 172911
12788 172911 -8224 264109 187326 -9104 -180383 -171777 -173252 -2173 118068 -166280 176090
12776 -118557 -2572 143649 128087 -139913 115626 275560 304004 106000 42749 -102940
12765 234207 60888 -5261 5777 -145513 345317 115354 -12600 -171235 193643 21078 156884
12754 156884 191683 158900 -223063 15980 -36317 101248 69548 80388 -15829 242921 118254
12742 -279571 547122 -45416 7535 -102482 168952 60453 -254031 186745 127006 -5677 135163
12730 146843 122342 -37840 184120 159289 65919 392846 173540 167044 21899 -93842 -295180
12719 -295180 -196157 -244742 38432 35814 118137 207329 -298525 -42031 -23955 6431 88493 254018
12707 254018 219653 162951 613060 88229 129549 193262 238043 302495 121956 273117 20531
12695 434403 155199 148558 84805 -199487 464729 147334 -283628 -66087 31003 -101602
12684 144240 -42648 -145758 261434 201500 293468 171407 160702 190852 -79277 269990 123818
12672 457186 238932 -25168 653 442003 33147 183864 224831 209442 166262 86680 -278926
12660 5455 165457 -5588 94220 89458 142204 40558 215810 251716 7309 117103 93321 -57990
12647 89651 302226 -68646 43008 -77118 -358046 -170335 -245749 -104257 -89659 -38303 -79398
12636 -79398 -58735 53723 214557 2577 -18903 9926 363022 253159 124265 178918 -187949
12624 76565 217059 174429 429857 158192 306855 179745 -92446 96343 -227192 -150045
12614 -150045 -136730 -247103 -152139 -14373 9413 382830 -162610 -341097 36702 -144511 292184
12602 22722 136216 -57844 54736 65910 -139263 405583 132524 42043 334020 112532
12591 17204 131162 327197 104272 -353946 200728 79353 -87771 -304116 179645 384107
12581 384107 -23643 1888 -122997 -109576 23544 -203298 5833 250383 -81984 -127013 63686
12569 64645 359230 169914 188683 258558 -217154 44872 -99494 21424 130079 344074 68946
12557 79590 -19224 -13277 71156 -22350 -14926 215474 -194343 -157995 81421 73353 -38700 225644
12544 397911 -557509 339214 -162526 107680 -96662 296118 50713 -139029 -53700 198307
12533 -95739 420409 -197056 -51855 -139260 -132205 -17248 161868 102497 124144 145607 105927
12522 105927 -114071 -71262 -87802 -137170 -142890 59193 183754 -153988 226907 -156634 -210414
12511 -210414 98275 -50588 -214890 -60014 -143589 120865 -194906 160784 205364 100287
12500 22680 -115977 117644 -134634 347302 196361 132494 31893 -59588 335091 110200
12489 328166 253381 53249 -214402 84668 403573 50816 -87715 158214 58049 334857 -575555
12477 -31718 119964 83129 6488 -110375 -98026 -222743 -28868 59134 -90554 223194 -31282
12465 48216 58477 51772 17495 -108236 88265 -207237 -87847 -49214 216994 61239 349872
12454 349872 134381 -118376 -126202 -7177 89210 151370 307372 188252 -114784 41416 369788
12443 369788 126288 -172571 140815 189780 -222037 -128964 145891 21274 136651 72653
12433 72653 -78262 -135979 52608 -115634 438211 -186222 158901 -334445 -279356 -56185 -70528
12422 -70528 -344218 26745 55877 173033 143612 152304 300316 -73591 73505 154591 40073
12410 59953 -34185 71558 -268567 49765 -55988 -290153 59564 312904 -355667 188867 40910
12398 -57618 98595 -15637 -308585 -213664 58265 270186 -198275 92616 122057 203687 134181
12387 134181 -125548 140220 -176726 -242025 9104 199866 63795 136299 -351745 -68868 359078
12375 371543 -87107 250737 -132621 -7085 232156 137314 195642 -83738 -45065 -199651 302430
12363 -21463 125612 36784 345615 145389 -373720 383103 117611 145672 -259998 140857
12352 -243247 -101026 226867 -114259 -107822 -123958 -287406 69841 217460 106923 29507
12341 328927 -23133 188199 13866 -107529 179236 108315 201294 212314 23943 213361 154584
12330 154584 81030 126685 -339601 21653 -72433 79190 45268 21993 89638 -153168 237950
12318 -118694 -49296 49462 174012 95028 -118955 52488 142672 -153147 -178498 -198149 38570
12306 294381 96301 90279 -164546 297818 79630 -29408 27972 -361505 263647 239073 -222491
12294 145086 263337 292595 126712 -296453 265071 -158444 102139 178647 344445 -68617
12283 270165 -77594 221927 145061 303248 52133 55144 426849 274705 198995 338884 528000
12272 528000 203821 190956 -224144 243917 255963 135816 -52386 -29570 393815 -102722
12261 77107 -157720 217986 348551 -87122 236753 -6698 -72001 -168234 416939 183378 293772
12250 293772 106166 66047 -134517 117403 -117306 -66031 326863 136203 183034 222161
12240 222161 132529 -149666 -122847 268463 164187 306372 208743 -157755 -26265 51810
12229 82923 320272 -110559 112793 443826 289680 296876 120217 -265189 279000 145036
12219 145036 285301 282763 -5943 54447 46233 106611 456968 -207468 19833 -348080 313599
12207 57604 -162671 230189 -188297 86384 476702 310141 67660 45883 54646 487420 90045
12195 398861 117474 400623 67795 521104 389218 205374 347804 128056 280032 303517
12185 303517 -55357 60950 465412 132138 330421 339290 -2541 142832 115117 -86137 80902
12173 218284 44068 114967 298769 257189 -11208 187686 474820 -183973 146044 -54065
12162 286244 262003 -44449 154399 30927 -17786 31622 257897 -170164 106392 366399
12152 366399 210281 28397 39739 -66466 120078 -25843 -4818 -42462 151310 184447 -61133
12140 374836 261180 283017 -23971 171890 -238144 -7867 33207 -216575 -42289 194298 -147837
12128 312501 135098 88006 -7360 -146167 252676 112440 128915 -221536 256177 -75510
12117 59025 -19577 158284 -368674 -98 -108162 -257544 333549 -166477 33420 25944 -13281
12105 89867 60153 -168720 -232546 -34653 153027 -169434 -162816 -85110 -135538 -52764 -107367
12094 -107367 -12403 -443092 44742 169897 -117115 -17600 -213338 -51065 139204 33404
12083 -183724 -266907 31717 -70418 212528 -194374 -145038 -87914 153645 249309 277034 102265
12071 508488 370793 1098362 1652009 1198014 675078 -112787 211147 42936 -261776 206112
12060 610304 487900 81956 -43971 178332 -214635 252880 -265462 134158 133955 126993 -257508
12048 117737 -99140 -45361 -46065 -32778 211383 -40160 60423 278782 -101808 -114416 -109431
12037 -109431 -208433 16587 412715 191375 -61953 -200507 70141 -142813 49030 63444 -222107
12025 90052 -125493 -160931 322401 -108035 -193731 -92182 -230190 -35779 68055 -7810 6702
12013 137280 -103413 -255141 -36093 -143401 54664 313967 -228337 -191242 -183549 37389 178019
12002 178019 332727 -47010 299494 -151072 62535 -50260 65301 42666 -93267 415613 3020
11990 104422 1636 -295492 -168230 50512 -96699 -128202 28879 151799 -103575 165674 201151
11979 201151 -11777 286709 197389 156653 -101721 -21977 20662 100329 -69749 -244249 -237093
11968 -237093 -332306 -56090 -34582 -229343 -23725 -61025 93848 -158982 -146266 -63164 194326
11956 -23333 -234766 -232839 -149831 -28648 161703 -32530 189684 68273 132986 -279157 189688
11944 92547 -261600 440690 -27205 -87912 -106787 -23655 48504 11630 81457 84339 33902
11932 -195742 14193 16677 287393 54442 25688 -62490 270369 -184154 -80197 114671 147577
11921 147577 -209626 -39484 135406 -108587 37153 110071 -175154 33317 307572 355638
11911 355638 -169169 -431864 176708 -330835 177185 73967 -217380 25550 81020 62790
11901 62790 -10513 -49465 -299096 93975 20865 35529 -224630 252914 98424 -4680 -266221
11890 -266221 255841 -227084 -91392 52641 -119632 -64905 -52436 -43910 -470075 -173297 253670
11878 182925 -71210 4838 170832 75557 27380 -209302 -115040 -65425 -358733 -9570 25611
11866 90696 -1106 93463 -286003 114478 155216 107748 -315785 244809 -56133 130009 -2734
11854 -208978 -434777 -7402 -231834 -16254 -86412 40300 -35718 -22725 -57759 -227155 28177
11842 144564 -127603 17714 -313138 -45471 -14559 199294 -115940 -104056 100388 -18495
11831 -95457 122425 -11608 -84224 -234547 16663 14147 3405 131559 -68672 -415660 144592
11819 282003 233185 -494636 153356 15812 -94434 -71744 -287234 -124886 140359 126602
11809 126602 292194 160445 -240662 12342 -85374 339211 279970 203482 5766 7058 -310834
11797 -118492 6737 -249891 -56536 -147267 -42307 131645 -112442 -31506 226272 198121 112274
11786 112274 -186495 4086 -214573 -107277 -79703 26635 -111703 104627 68627 68852 -45166
11774 76322 128753 194750 -10517 -83717 49443 35874 -66550 21285 -302817 -138956 -363163
11763 -363163 281656 57881 92322 34395 375 -18054 -53883 -37623 -136180 -29058 -231298
11752 -231298 -318621 155341 -148470 128053 244797 282736 -58505 141665 -111343 -6793
11741 -12236 319902 125234 57890 173115 -164052 -114606 -20017 -129285 -135987 -256098 118789
11729 -138640 123616 3657 -117900 130650 177600 30281 25491 102332 140510 -235833 109294
11717 -53631 -77773 28131 -44078 -59985 212465 -115719 48801 291107 -162332 172723 -47911
11705 -118248 -68356 197349 -50745 79803 182352 399072 -32756 145501 138415 -72662 141765
11693 -180296 -177027 121080 -197147 -167725 15951 218956 177716 -146584 33054 -83040 523059
11681 110052 -161299 39923 -165233 101905 78640 237254 114544 72483 -20416 -89335
11671 -89335 -288218 116034 320300 -150799 264963 -19982 -338179 145561 13303 -107173
11660 93712 -98345 -196577 -104203 -139883 196092 -19819 -212183 155727 317368 -75130 41183
11648 32680 120112 -25433 54220 27785 135735 -171988 38903 -205199 276710 -77 -22295
11637 -22295 -217700 34194 63810 45057 -135136 -73788 -58774 -138888 198154 114019 -25570
11625 299183 75781 12002 -229348 39581 250902 65052 10446 46249 145493 322230 -62763
11613 50012 -87535 -74210 -92946 44525 475890 273988 -7333 -275387 306518 -43104 271024
11601 -178293 14099 317265 179063 -23712 4967 43159 236014 335258 115722 62666 74951
11590 74951 -139079 -165524 61753 91759 -378511 372854 112933 479648 224008 252120
11580 252120 158238 -354660 -144274 113369 107004 13116 74530 423035 234173 70655 264752
11569 264752 112150 204536 212863 -246118 343564 -5855 -113883 171594 -201 37148 -103238
11557 57583 18599 115699 67527 -225858 308744 9134 -323135 119234 27471 90185 -120689
11545 125160 -92901 180352 98976 370012 -186366 322578 -136605 121106 362809 386874
11535 386874 109007 -290047 371377 108936 340391 265808 190575 202065 270442 219153
11525 219153 -157257 97886 17511 395258 183354 -95907 -8903 -32673 -165714 -33463 302651
11513 -82632 -214058 -16270 -202905 273869 -107793 255603 45257 -73853 233114 -98516
11502 -140129 57214 291024 -186699 -148709 150798 110307 218833 -214805 -19133 -18357 117306
11490 587031 526834 -79239 665750 -193930 19443 -363421 38453 -30159 156926 71211 64702
11479 64702 -25303 331698 399511 290654 235186 253355 347019 -91349 137428 299351 289405
11468 289405 82459 173502 225439 -255306 159149 97162 -189203 219673 411424 307324
11458 307324 63947 82628 277749 -103636 -9377 160527 105794 677558 242331 -356246
11447 -73366 -134141 339919 232430 261710 -101816 -93133 -23743 -272854 171390 164911 -18943
11435 54684 45812 114265 10891 175887 157243 151397 -175004 210444 81228 29189 -283737
11423 -132365 43930 104763 -2174 152423 286207 -235963 51039 -31081 84148 38671 281659
11412 281659 -357844 92327 112477 348137 91122 -24309 675 -249221 104139 -27346 48345
11400 -135143 207049 293115 229916 -157695 -68524 18327 101640 -81936 -157117 33599 -57855
11388 -86421 9112 370004 106032 146 -81614 85015 395772 133486 270138 93051 -27512
11376 202289 238173 472916 53901 -287425 -62774 -296303 -115695 180478 76040 -272389
11365 23672 146395 121639 -81376 -218966 -340709 -280787 -178499 204457 -113553 -103443
11355 -103443 -303364 -269806 -296573 132362 -11274 214536 20309 56353 -1368 169181 -161930
11343 132440 106307 24967 -123370 17627 46511 -216440 -164896 88744 132752 73993 -169465
11331 -81771 116358 -238407 89542 18677 -231079 -475115 200115 -91996 -290833 -279903
11321 -279903 -432053 -78672 14993 90728 -164035 48322 142998 124554 99359 56730 2900
11309 -330073 -416293 165755 -41145 89007 -17902 112056 -91055 -328686 -83592 141034 266142
11298 266142 3035 -357900 -359932 120969 -64651 26317 136470 -140220 -323134 8712 355703
11287 355703 -152135 -174776 -33148 -132534 35085 -132103 91294 -467955 -83834 -253583 -123263
11275 205993 -57409 -363059 -374998 37989 -343511 -406442 -110532 -213019 157387 -514534
11264 -96759 -69380 -120894 50286 -37308 63259 63795 -452234 262689 99109 -208683 -250745
11253 -250745 171712 -6570 -238316 304066 108011 176022 -214330 -122129 -32782 -128320 -62341
11241 -414649 -204243 -136808 46064 -62850 102709 -241165 88694 24902 -73062 90421 247811
11230 247811 212298 -155694 230815 -178255 -151846 -88889 151016 -382229 6909 -189465
11219 -30345 112122 -190210 -80633 64329 -300012 -7311 -123495 144933 57986 91135 24335
11207 -26772 -160283 53732 -139948 50740 220171 26765 -111994 55451 -68954 -365853 157080
11195 109970 -314998 -34644 -264487 44185 78345 27307 -4745 24665 -74538 -175235 280225
11183 -314301 343931 -297781 158936 -78031 59594 139554 -17538 69875 13278 -212437 -442555
11172 -442555 -25841 141694 9001 -105713 -195287 -183004 -55837 -24528 35314 338386 123841
11160 110633 -189299 -72 -196990 -344335 -163410 -139090 64822 165565 -143016 -62919 -18204
11148 88682 83255 -261094 26652 -69778 -105461 -55087 93545 -51380 -173636 326380 83505
11136 -278251 181785 -201034 125064 358357 -10274 200050 -199992 -14930 44030 354073
11126 354073 280877 149050 240420 48057 20552 147851 -206705 -3111 164110 -71792 9816
11114 49151 -83782 171334 -116504 21908 58434 258300 299273 449783 223656 434231
11104 434231 61885 369254 295982 74476 332843 146002 148963 98988 605462 232154 242902
11093 242902 186756 -79715 83893 151513 328649 353688 224223 189924 -83534 20902 541886
11082 541886 463643 -88847 163810 16816 108748 548106 -103618 416752 278530 225687
11072 225687 357482 29415 33205 444870 643138 442358 508344 338690 355974 331042 755990
11061 755990 711866 483114 937908 631785 418376 294975 566665 669751 622971 704467
11051 704467 711422 735541 878434 870181 799784 487819 797486 522607 1058358 998100 763622
11040 763622 832073 993311 1065033 681987 984407 856714 654026 734907 867856 829987
11030 829987 743261 681571 898385 944779 813198 724284 772186 759466 894902 1014896 896083
11019 896083 598702 655865 708381 650520 648076 349151 797880 700427 408043 446142 482862
11008 482862 1005414 864117 569913 791402 613526 599794 1014007 703653 786987 461786
10998 461786 886531 693120 680196 823447 664069 819387 498895 655099 907991 843250
10988 843250 793349 1073583 978762 1264917 1134542 1424383 1324090 1476626 1756555 1864750
10978 1864750 1502580 1537552 2176013 2683803 2683996 2970942 3059986 3103131 2828431 2594357
10968 2594357 3037573 2722452 2305985 1959147 2088667 1979290 1943248 1911486 2186496 2043193
10958 2043193 2050759 2308489 2057321 1577393 1837181 1190276 842247 994990 600317 773416
10948 773416 638394 544178 380982 195701 403878 387379 87477 -101096 57157 408690
10938 408690 372637 238897 13711 -49093 406272 -35977 -21546 -89227 20445 83617 237928
10927 237928 114391 257499 231391 -115630 128127 -71619 -162231 -183671 102846 220681
10917 220681 4453 -362706 -42828 -276065 -37193 270552 -182016 -198275 -71613 -9434 75858
10905 -25988 53739 -285123 -30860 -12009 151698 -128704 157994 6496 293066 -148294 77802
10893 266473 146789 -73592 60066 103173 -206076 272386 -65888 67567 18347 -289089 -116787
10881 -156836 -198606 -67907 -26040 -68696 43321 -100222 -172989 3755 129975 -251958 459354
10869 -229032 56655 55238 -370 1696 96630 73021 22470 154772 351491 80443 26715 -190575
10856 -76930 74644 -105805 -179363 9820 11354 -164771 255003 -181274 -312489 -164308 275788
10844 65077 127638 -57370 120912 109736 69364 48284 28574 65288 144959 -113023 -76778
10833 -76778 -29295 -244497 163453 91951 10667 -201796 -42608 11453 -9384 -235854 -66134
10821 38750 -15969 -1054 -110138 273677 170137 191486 10816 -220262 -10478 85461 15491
10809 70055 151901 -141447 -72836 -234050 -10027 -138446 -213948 175683 -115473 -79554 256927
10797 -61087 82872 -298669 -150 -76462 -61735 -357880 -64246 171251 -226714 -54785 -279594
10786 -279594 -82130 40030 115971 -88393 -219162 -57461 -182624 -62295 28193 -284689 -90356
10774 27706 -271886 3317 18126 67166 347023 -301819 -296357 38098 -68044 -23319 -316650
10763 -316650 -74218 -487622 -260965 -181054 46941 57333 79011 -50362 225743 -298289 -401435
10752 -401435 94393 141695 -94748 290764 181324 -177747 -101247 -251352 -104434 -233276
10742 -233276 -57804 -85068 -295650 -254551 -48756 137279 -253723 56035 246730 106337
10731 -161054 230602 40862 -160398 -178178 432715 304678 56229 414764 -72436 47678
10720 14392 -124687 -147690 -58240 22878 -320484 132860 -263753 70313 407947 153332
10709 -77332 -86036 266984 -125477 -30667 8303 -50348 -3035 -393920 135306 106608 -152003
10697 -78951 -81863 -71172 -151191 92475 -52628 193868 112602 251547 -3463 -167659 -487022
10686 -487022 -184087 -382152 389915 4644 154377 7993 178532 -57979 188135 -96693 -193988
10675 -193988 -13236 -194490 126856 -5943 -9880 123049 3645 234661 -57305 -260949 -66189
10663 95257 -216669 -69126 7149 16168 657799 61852 109487 -303299 -145996 -42389 -141359
10652 -141359 -83823 -32245 118543 -177044 -310234 20739 97142 235452 269476 -156267
10641 -131242 -117949 -141060 186947 -87232 143256 -107840 338756 -310078 -30008 -104764
10631 -104764 10542 -14874 -150609 -841 171735 14187 146970 -126853 -36331 -90300 -160763
10620 -160763 -84978 113068 247793 103602 -118277 -496630 263182 80157 106844 -200747
10609 -103889 -153867 512 -102445 -16245 -93213 -319942 128686 170068 -181539 206291 -198229
10597 -209490 15117 -469404 -33601 -150366 26934 -211724 -39193 76156 -127943 51381 63125
10586 63125 -22952 59047 134213 -172585 186027 49726 365453 152134 -221426 -243038 96843
10574 88505 -224491 -25188 236621 -69455 -393906 89927 -347793 -98904 -121948 -321547 -93418
10562 159700 -146829 -45801 226020 132785 -7583 52340 23925 136105 7421 70160 -256438
10550 -21331 -70581 167309 318268 72619 -14079 43846 -181872 -163368 -50623 108521 345868
10539 345868 -345577 2809 45338 22000 -96073 -313316 162550 -74053 -436110 -66587 191301
10527 182165 -159704 30580 -54317 171880 322934 -215139 -123518 34356 -154854 -116323
10517 -116323 264647 -258779 -223830 -156242 3827 -158656 309731 -389049 -110772 264014
10506 13416 -446804 36948 4011 63843 18028 -19137 9709 -104648 -34498 -129088 -148489 83907
10493 228674 74258 -237329 -125785 -248239 -126494 -132876 -124049 -197652 138824 -281592 111851
10481 91995 90646 93620 520697 -178619 374301 24445 -16854 109377 190900 -132292 59048
10469 -61830 181870 -51214 136184 177927 107986 131670 -28214 110864 -18122 217409 76790
10457 -73494 126894 164507 63014 -6868 -63831 -79814 -193940 -31139 41875 64828 -46696
10445 205652 -310659 76867 -30281 -152956 -128752 40197 83260 358100 -92831 36786 -88635
10433 -400588 -234016 -19586 -168176 -59763 -124596 -21302 -84216 70003 -121862 -117180 82131
10421 191222 -103194 -154612 22141 -48945 19384 12007 -308462 -290621 29823 -321097 -235903
10410 -235903 -32780 -211978 -174186 27691 28849 172544 68202 101107 187539 -257826 -72232
10398 -30886 -65904 -179119 270553 287239 95137 2380 273383 324949 89926 -36837 223506
10386 72769 87038 66377 244643 357182 -67828 175340 347759 37365 174669 65982 383612
10375 383612 181737 9592 344009 381082 315962 27872 254594 44066 437522 486657 305747
10364 305747 194358 96405 177185 386001 572678 -53636 45673 359567 327022 -128838
10353 514388 325306 534336 424789 672265 300519 727961 99497 461979 333031 232417
10343 232417 416746 385129 151933 -164053 -79327 249478 167474 157508 463401 361575
10333 361575 265627 -114762 218261 143113 167208 369469 -160900 8794 362418 320528 -66304
10321 369069 148137 516364 16156 320938 399547 263106 235170 -17413 103268 6417 6646
10310 6646 179118 -170270 -153808 -136085 48957 -257181 116790 -86168 153826 -163383 -43317
10298 82466 -74486 170900 448891 -341666 -48773 104476 90061 -67482 -55619 211397 60738
10286 -532796 6695 -403054 -50972 -42951 -213396 -141266 -290252 109849 166436 -126558 51283
10274 -386589 -120275 -92963 386027 -3333 -96375 320694 11579 206120 -118752 -160021 -137324
10263 -137324 -44309 127193 -97245 609377 269629 608195 758122 200172 17672 -181149
10252 267744 278745 -175787 60718 100550 -79248 -256728 -29788 -74214 -19449 32121 -401775
10240 235008 147301 -79521 -22824 -343306 -55340 358127 11155 148947 -208330 -161066 -63693
10228 -191096 -43887 -118669 -66346 -306280 62739 -32586 -212863 94583 61178 -129419 76379
10216 -346559 -29506 -180352 -17125 236979 -423799 -126508 -5665 -32633 405479 -461158
10205 -77815 2194 -2888 -76261 -95491 48980 271069 -144184 173976 -133845 91404 42109
10193 -263736 -39872 -137977 -139225 -265200 -156150 -160279 42113 -183293 39447 -72409 -127682
10182 -127682 113018 -50687 -70171 149974 41765 44067 -135318 -124645 -31987 -231536 187043
10170 -115569 -66886 -397201 -219173 -336264 -267865 -36020 -116165 -55371 -125744 44561 -100714
10158 -160627 -14284 -130600 -79407 260608 -37453 -37210 -191834 -197361 18620 -142572 4878
10146 -109782 -25223 -511499 44761 79186 -143881 -137315 246068 -142745 -344348 145337
10135 178596 46371 161069 -72459 -44596 69594 4150 -69313 213554 278434 -26202 -168746
10124 -168746 -19608 -352675 -141374 -361212 -4640 -37262 210915 -200763 -166952 446079
10113 -262277 -69195 155450 -47215 14258 -106213 -54979 -234435 -240663 232518 -110354 -56501
10102 -56501 -83852 -158361 -65326 192772 -216645 184161 -94529 27106 -36956 -44088 -232649
10091 -232649 33396 31023 -199323 -148536 164618 -132549 -59182 17550 3588 -31277 -208326
10080 -208326 19444 145776 217685 -195347 27636 158771 83434 -55169 10801 -199722 -96337
10068 -21616 -81491 -414921 -130644 -31959 318989 -102651 118776 -464359 -157123 -470206
10058 -470206 -156635 -3027 257617 7957 -157018 -37169 418969 33322 155992 -124299 225410
10046 -76864 170429 -368122 -280429 -108768 315400 -192019 9877 -24210 -171519 302206
10035 84970 74750 -97929 -159502 -417548 -48593 -29369 15003 -283708 68932 -97115 253566
10023 -30565 -213651 107024 102760 -226516 -1588 59194 -105069 -276372 -264058 -350172 114117
10011 -159883 -262420 -355011 -213774 124872 83159 -320960 74433 13433 -117157 -134693
10001 -134693 -27166 -156342 11944 174177 -234619 -433334 174742 152248 -64975 111132
9990 121772 160919 -50425 80991 -55107 61038 -46539 185748 209756 300009 -142511 -550380
9979 -550380 58372 166415 -76208 -246531 -1172 105418 330978 140075 13519 -207688 10360
9967 241267 -227004 -12292 -11279 -64305 -132174 -205696 228761 -300219 227565 259565 109010
9955 -457864 -501638 -93726 -120968 -104795 -184987 -286794 74136 -130536 307676 106356 11350
9943 185034 -4971 -422879 -239968 156640 93823 -378982 -228281 762066 -129751 44687
9932 65034 -139172 -40355 -96723 -70905 -240774 -130371 104368 -3870 144947 -290949 -187529
9921 -187529 -126313 46463 -99499 -130038 -80879 -320885 -74533 -145085 -256430 -177999 112211
9909 22278 234856 37091 -96565 -312801 -112756 1596 160263 320180 -178521 -213234 -332490
9898 -332490 320440 -361912 -80564 -403648 -28143 -435157 -167779 -192794 58953 -108803
9887 -242507 -56125 -366637 -196790 -336276 -105840 33258 -106304 -256382 51623 120397
9877 120397 67847 -45916 -28422 -113441 -290817 31678 96240 138213 123352 18887 38600
9866 38600 91498 -204106 -53546 138767 101493 -3516 -81004 -198388 -180217 -81996 141804
9854 126953 -249235 -145387 36227 -132943 -201042 51120 -171325 207828 -255853 256656
9843 -134976 -249698 -247997 -86921 78165 -109926 24527 146761 -210354 -212149 -239960 -181366
9832 -181366 2381 -54071 -226497 188302 -114398 -307283 250173 -188997 434729 -44208
9821 -240414 466433 -211363 -67869 140437 -111639 95674 -267224 -68285 -203987 66920
9810 -39597 -200154 -108140 -165898 79657 -334316 343246 -52763 118390 68279 -184419 137904
9798 -276508 -14648 -223173 -108426 32525 -10192 -24770 122113 -14339 152928 116243 35563
9786 375429 -333501 -232925 49580 18818 -86720 135231 57899 -237916 147795 -361491
9775 -178022 -118910 -247033 -57900 -26220 -256181 -233775 -287514 -202406 -296885 39304 -165934
9763 -134732 37233 -121118 254057 -236426 -258847 35155 -85275 152963 173216 -248619 -195338
9752 -195338 -39965 -37895 367871 16324 19115 61743 25634 -55580 10002 69479 -427257 -69502
9739 -263793 249917 110097 -205395 -410354 -162985 -185544 50724 -237498 -28362 -124541
9729 -124541 -125744 59523 -120933 56204 22641 43529 -111984 -243006 -400311 -190463 -102126
9718 -102126 180084 -299574 -580609 -128070 -173699 -188045 29061 58463 125198 -101797 -64710
9707 -64710 337811 17718 47490 -162118 104857 -48977 72889 128647 -360041 418035 -212469
9695 -87507 -131139 -61963 -81275 -72496 -158622 -175785 -290637 -168410 222019 102487 181537
9684 181537 193088 12228 4024 -156119 -338558 -86291 7500 66355 -104268 -147658 188983
9672 103796 -356940 -118041 -127930 44200 -26826 82119 -290705 -116057 -302111 14991 -101579
9660 150741 134324 179435 369820 66957 58387 -50824 91581 204308 224499 -132321 128264
9648 -85911 -113777 -172261 -21221 -40903 2663 -120662 9059 -23498 253794 -75554 90722 -258841
9635 77141 -10997 -361188 328295 197683 68387 -118398 128983 116880 -481712 -158366
9624 285283 5150 1326 -75040 -107406 94712 -52403 -188547 82169 -35961 76905 209929 -207881
9611 28652 -184775 -125325 -86075 147173 1429 -206837 -220961 -205177 -64955 79963 -118948
9599 -71974 -282090 -77390 -350391 -168123 -358520 163531 -117750 174842 -208004 -9490
9588 172215 -32380 156722 -32803 -190218 -282914 -11224 -331565 -115506 44186 -218907 9080
9576 320238 -530524 -55253 -276777 213124 -122170 -119686 -120762 -30469 35946 -241183 35337
9564 -201175 101535 -215660 -237065 -15931 126687 -53318 259523 -123716 47400 -157895
9553 -103001 545260 -130765 55234 -84030 11000 -145318 -125506 -37965 175694 -65528 -397910
9542 -397910 -14650 76025 -10230 -256139 -87941 327564 -182419 331714 -113227 11442 185461
9531 185461 -223444 -271577 -62270 -77505 107757 -101343 8083 159043 -211972 -102133 284337
9519 -483955 -17193 -371173 -264242 58069 83016 -241405 156140 -459924 -90082 -329752
9509 -329752 -90796 52255 -97859 -14536 74312 83298 -211398 84398 -103651 -233716 -109408
9497 -124488 22074 -252317 240006 -252403 46205 -148553 -56265 -146 310173 25402 -424889
9485 79184 -379907 100338 -189035 -145399 94583 -148338 -445690 192804 -94570 137271
9474 -108975 -346249 -186339 253847 9807 157289 299186 -159414 -124984 67410 -5219 -52162
9463 -52162 -304864 -184608 -120731 113871 -45980 -290258 -5214 86663 -235195 214318 -58469
9451 21707 -131387 -81913 -239444 76755 210678 165300 125998 153133 -288227 -104780 67769
9439 -207306 418120 -5699 -169253 -169066 -52790 -11519 -119458 -328373 -190480 -342161 305343
9427 -358715 105978 69312 -552886 -388499 -69436 -162773 -114658 118065 -8022 120791 162065
9416 162065 -197655 126860 -94416 22273 -107951 -114565 130691 88645 -192793 34156 -84353
9404 42875 38177 9755 69969 12978 41488 -203679 -1490 24723 -163896 179828 -122640 -140098
9392 -140098 -167231 187002 -262191 -356605 -163354 -256422 -271587 -85343 -137505 -173335 -164324
9381 -164324 -116106 121592 90172 -51152 -189107 -120007 103536 -184524 -18004 46807 -1373
9369 84157 -81036 -94219 -7708 -269522 -174161 -141 -169879 428934 -36237 -210141 -177765 -80576
9356 -50727 33603 35639 -11742 -92624 -146053 -24351 -376213 -142894 -242043 4030 -67339 -121981
9344 -121981 60565 43331 -201140 -17164 -550970 -328939 292888 -358292 -125181 -77343
9334 -77343 -301241 -52641 -100201 47170 59609 -289004 -57054 -14918 -135609 89226 34697
9322 -44414 -25450 203110 -351099 21265 90630 -182331 43335 -143755 -163870 -339390 -80247
9310 -3249 -12797 -319487 -127951 -188204 -57592 -96378 -154773 -347649 -56700 -201318 26316
9298 87596 25120 -177975 -27588 -202660 -154529 -137452 -262144 -88005 285698 -62368 -97260
9287 -97260 -226553 181446 130151 -211316 -191403 55604 187658 -42307 71356 248072 -131291
9275 45085 89382 -376683 60190 -234892 -154895 462131 276683 -15597 -24987 -26299 -141853
9264 -141853 -258824 -29908 -73736 -50417 28147 128459 -339698 -143427 1099 13620 41776
9253 41776 116967 184268 121113 193380 -176739 80964 233286 -77590 -278560 -139027 -101025
9242 -101025 -116813 -202068 55594 -202557 -125457 45773 -240209 -21348 238033 -208561 -57473
9230 -119673 71 29526 62324 248095 32037 85597 -542058 -38872 -257638 114662 -84550
9218 -148601 282384 -205599 20522 81371 -187004 -122586 -225501 -101245 -19516 51104 -248446
9206 81017 -328824 -170116 125900 67688 -170616 179294 33685 62231 -22024 -239154 -7025
9194 -69104 133890 -316853 -107671 89677 -194841 96345 -102200 -22415 187697 -182208
9183 -61189 -204501 -62840 127423 -174679 68668 -37007 180233 -159033 -196132 36202 158711
9172 158711 -245615 309333 -241935 -67880 -388829 -219604 71674 166733 68963 -39022 -132364
9161 -132364 -351941 -31554 -54297 -109816 33053 -113854 404120 149890 289462 -25748 -184694
9150 -184694 -71875 -74653 -216210 -274660 -31003 -100847 354469 -95740 -307158 -161089 107573
9138 -7053 -190420 -63619 194816 -184807 250449 -231371 -66173 -146775 -160938 -130313 49520
9126 408680 -67093 -15472 93299 -258490 -95432 -43805 -298323 -48531 -284564 -262097 33510
9114 -118127 178650 -66110 -252985 -42827 -149224 397445 -354776 180720 151128 -66001
9103 244013 153625 -42673 -67067 284530 -234748 -627769 211553 -485457 120692 -18589
9092 -172317 -166128 -245913 -58845 -79495 -30884 -101908 -254204 -47219 88777 -381949 -121779
9080 -168398 -122831 -149982 -363960 -213238 438741 114217 -20529 28912 316877 -219735
9069 -155804 86763 -97593 44153 -382685 -214800 -212627 -48733 314037 -113836 -36327 358694
9057 -142185 309881 -136259 -299944 -236671 -33351 98820 56697 -130004 11936 212185 -449331
9045 -187589 134576 -197326 346383 237853 -362453 -197080 95522 -149143 -380253 450691
9034 -193005 -142858 20131 -236136 -87374 219626 50081 -183869 -179197 52382 -197790 -231082
9023 -231082 289706 44491 224402 209017 -40934 326778 -248907 69669 -257737 -131269
9013 -131269 -237384 -109664 -304815 -255183 -115719 -38593 -67742 166676 63925 1086 166216
9002 166216 -202783 -49205 76617 -270653 -312693 183414 -170137 37590 -79287 187683 -409102
8990 132753 115275 -389854 -30640 -99432 169373 -58206 85579 149735 -94320 -77980 319586
8978 -574390 198274 -135921 99292 -22296 -323201 -313377 146057 251891 -269236 -362489 -160606
8966 -102797 -210335 12593 -111074 83251 -140054 111272 73042 -27493 108756 103788 68383
8955 68383 -55708 -97902 6126 -285661 -83803 109220 -128153 94201 246011 -11058 -125309
8944 -125309 -316237 413450 -26777 40218 -170038 256922 70782 311332 80034 39144 298482
8933 298482 45890 171926 -4731 -195051 36338 458724 244824 362660 1386324 2328643
8923 2328643 6589221 16426006 13447030 4794612 1422715 853016 289738 329036 187669
8914 187669 154766 -211438 -28832 345680 254635 49149 288114 534633 191858 108213 -106984
8902 -113940 -237953 -17056 -308698 11364 142010 -153124 -417044 299283 6596 -131925
8891 -226259 36096 86543 -238464 301757 -220548 -229367 82103 -185458 224875 -164016 -123297
8880 -123297 -295487 -8278 -181506 -252433 80408 299255 -75198 210836 -51489 -65824 -112753
8869 -112753 9925 -255551 -96518 -298187 99206 28171 -106228 -304655 -300149 -141936 5146
8857 -74688 -141235 -327343 138432 -18965 46528 -78487 105952 -400383 -224373 89671 -124716
8845 -24781 -7388 -54984 -290862 -393773 -143499 -85540 -128542 -217993 -156768 -192330 -274831
8834 -274831 -67136 -384545 -175137 -419975 -331771 -106379 -48310 -119883 -386836 -241758
8824 -241758 273 62947 411572 -114370 227180 42837 -40830 -78451 103254 -136567 136321
8812 -287016 -93446 -184901 30452 -198655 38819 -68752 -112861 50020 57790 341958 233723
8801 233723 355271 -24811 -157252 220760 -112351 119792 112789 166559 -153492 -209041 72403
8789 98163 -83383 15446 158050 -218695 -151751 -199672 -53852 -27930 -225915 -306390 -71228
8777 99944 348479 139329 5451 -234631 -305130 -39663 -64511 308775 -197392 -49279 137680
8765 -34915 -129931 -160120 -16254 -151368 -203566 -210615 -107833 55577 60991 -478558 264853
8753 -151235 -133019 32911 38221 20121 36510 13766 -258092 267472 108493 -70995 -45624
8742 -45624 -64423 364352 -244306 82556 -275184 -46057 -153519 -135061 -47329 101170 211286
8731 211286 -176202 -226470 -5273 -242390 71360 -93100 -60540 207238 117201 127964 108612
8720 108612 -460688 -35542 -247740 -219779 -32595 -180636 152900 -111771 -138738 -98218 -192734
8709 -192734 -252806 -147688 -142225 47136 -344095 -234644 -98178 -438332 -129021 -38869 -20880
8698 -20880 -6065 -137732 371119 177698 -145420 -42484 34695 -133274 38983 -327988 13911
8686 267310 310882 -141556 64597 -66596 -85864 -421125 -13054 72206 195429 -354688 -193331
8675 -193331 322704 -206904 20035 138122 -82740 -193157 210797 6655 -83266 83401 -94418
8663 35739 -142899 -200257 42521 -66623 -191956 28297 105294 -31255 -81746 -378741 10617
8651 -68729 90878 89872 -208737 -207990 -204406 83959 -277732 99182 148359 -116246 268028 -41600
8638 359972 -115262 92585 -174098 22262 -446084 -81744 -122081 -182319 8847 118936 -350974
8626 46770 -66638 -107594 186530 -7176 -161877 -73698 -160107 -361201 -358935 -286116 -202816 -321274
8614 -321274 -212838 121209 -38813 -9285 -211536 -201324 -133154 175528 -1828 200806 -319303
8602 474670 -41509 -330495 -136650 259970 38761 -398835 -153938 35172 -193859 405552
8591 3692 -80478 135452 74373 -47193 6509 -535792 24700 182001 -54241 61129 65618 -111719
8578 -118827 125101 -38896 -46308 -201615 -81097 10537 -373404 -237924 -84610 433832 129116
8566 -319849 -199144 -46456 -162177 -38087 -215146 -259107 -37296 6899 -247762 -69852 67217
8554 -140636 -390884 -40755 -136487 -110963 -74779 -145438 94048 1304 100906 -155509 -27838
8542 68649 -135466 -251168 -188859 289501 57619 182616 -29315 -138250 -2283 -84031 -149935
8531 -149935 -436378 164709 16170 307517 102056 262912 -71833 144507 -244555 239353
8520 81779 -113632 -47557 233748 1588 7838 -278696 -306248 32043 104533 -164788 -44648
8508 -52440 -360032 59619 303989 -94923 -120989 -2213 -184266 -106493 -191868 -421983 -151090
8496 -117325 425802 -139468 -215624 -108142 -100055 123773 -53593 -212844 -79268 -399020 -99926
8484 113204 179663 -39402 -300676 21132 163573 -269940 -388516 87825 -307671 -112138
8473 20680 -214158 -94069 308675 -345950 -52143 -430761 -40178 -60066 10443 240002 46479
8461 -260179 75411 -81883 -167491 310027 -163572 -111883 -121938 -70559 30120 151771 118637
8450 118637 -186989 -188300 180343 -96908 -236993 63574 -22981 -28905 -83683 109100 74190
8439 74190 -154272 -34595 161337 -58837 17152 156267 -129946 -47166 -27761 -318796 156434
8427 -290497 35531 -84846 -12751 117446 95336 194996 -287287 -9140 -225645 -427748 -146202
8415 51759 -23088 -7818 -76047 -70495 -197981 315986 -129986 150638 -297363 -227996 262414
8403 -119111 -249986 -232103 257977 -234788 -67896 -79313 -11834 42910 -243446 -414000 193539
8391 117339 38634 -246490 -144659 24128 -205105 26138 -88610 125535 -147905 97359 -166116
8379 -205110 -237156 -193023 -124764 -32483 -225943 250088 48967 -214626 -99871 64369 -46129
8367 75610 48098 -78318 233796 426794 165746 -169906 181804 134511 -116347 -214650 -188913
8356 -188913 -85711 24601 1957 25033 17963 -97102 122205 -28290 -134440 -185853 -42597 -322938
8344 -322938 -30506 43206 129812 -186266 81436 108495 -24384 -20805 -260114 -60826 101350
8332 -76423 -513928 164161 221110 -428861 86851 -70072 -94319 -15507 -67509 -202821 -277950
8321 -277950 -26088 72950 -86197 -28149 -225996 -273942 -263470 180380 -189468 -116572 416387
8309 -19364 -322778 -186965 84143 39555 27122 -147859 -69640 160287 -24180 -214468 -164439
8298 -164439 -224214 -27550 -47093 -40109 -328924 307352 -209804 -79664 -99571 39954 64573
8287 64573 -91603 47035 -96180 3888 -56933 76480 -22626 323793 114218 -129153 74095
8275 -189341 -3824 -307858 -175887 94909 128312 -495234 -190105 -289119 -54772 -59499 -270558
8264 -270558 -126886 -190722 -183544 -305587 114171 -167 -306864 -3174 -21459 -27687 54464 -162428
8251 -205316 267694 213048 108819 -290659 92706 175297 110972 -175286 -227411 71214 -107370
8239 -224885 110678 -216806 -594994 -245411 -240581 224718 218288 -53846 -84696 -297869 233816
8227 -225063 1066 196822 348624 -157830 29549 394116 -105140 110246 -121722 -92574
8217 -92574 -22097 -251827 175464 260931 119420 -243715 390722 -191759 314541 14193
8206 107686 14542 23476 -49270 -243835 44721 -17727 98655 343739 -156912 -363708 20488
8194 -136600 164102 71704 -60171 -204201 193623 -32791 -148294 -107500 7563 -105126 -331743
8183 -331743 -90736 -72464 109347 123191 -273508 -136396 17852 -164105 74558 -387439 88025
8171 15869 -120974 -63000 170812 -267868 64353 -57717 106844 -33213 64594 -93639 272768
8159 111341 181305 -51939 -171960 -50387 103551 1010 15125 65492 -105633 -48266 -363830
8148 -363830 -80334 -220896 36464 -166589 47576 -19531 -197583 282151 -30686 -194145 -237317
8137 -237317 -100274 -55300 247938 142033 126260 -286283 236874 -310544 353420 38062
8126 -183220 -252398 169048 87773 93155 150514 -56341 -5538 213268 -337864 -29201 -81728
8115 -81728 66769 174546 -283494 123075 265853 -82760 6181 -42975 84179 258492 -49253
8103 -109168 -245222 -20985 66227 -36689 -7288 -134244 -20840 60769 152836 -154527 85116
8091 -3949 -90128 962 -21444 96685 21340 5133 -106887 148486 50679 -376226 -245339 -34629
8078 -70814 80956 -108044 -286041 -73805 -221057 -196176 13880 344320 257592 -283070 -68323
8066 -104253 59920 121207 -38266 39175 -62027 -232376 -115186 -83694 25437 -93744 3437
8054 53765 -99549 -269037 230652 -266289 -180106 316444 -24275 -45737 138332 340611 190026
8043 190026 -98476 40158 -20426 -129952 42787 -141135 -9506 -344034 51086 -87404 270663
8031 -304975 -25795 -169377 365882 226383 -269195 -125231 116771 -149455 166153 60477
8020 71007 -316270 -424430 -44003 61285 -80483 -196485 73370 101768 49606 -66562 -49104
8009 -49104 -117733 15044 -225270 -154859 128169 121823 -119967 -99967 44015 -355579 -58761
7997 -116893 -248667 308531 -12228 -55978 -42893 -76814 40800 -57505 -237527 43124 -29381
7985 -154099 -142467 371197 -112373 -288540 -95489 -254533 54585 128931 -229430 -126462
7975 -126462 -21350 158509 -218307 96167 -221253 254861 44753 -49348 -166238 -239249 131318
7963 -137849 43923 -166516 -157005 18310 -302640 -219726 86502 59233 -125131 151851 -300724
7951 145568 -285783 -328740 6655 259936 -109183 341371 -78216 8315 -315251 -201299 -286297
7940 -286297 139942 -40725 212946 -111067 -106886 -58100 -181110 169680 163390 -43990 147795
7928 122301 -100320 -52483 -157988 -237754 259665 -164620 -20658 181676 55966 253337
7918 253337 -220195 -69269 -395332 -239902 213508 154160 -75140 -303913 95400 -98324 159715
7906 62646 -83508 -123594 1291 285197 44013 -26235 -281168 23338 147156 104299 83015
7895 83015 72108 9460 -50508 345515 -40479 -75369 32190 -185848 -70715 -285629 219335
7883 59008 -96909 -267923 352834 6488 -294755 -240109 -13870 -123416 100174 -22124 -98735
7872 -98735 1658 330304 318871 -3790 -436719 265422 -122353 139304 -23070 -21975 125031
7860 180224 -41549 -75397 -140108 424933 48152 276013 124157 97527 -176339 124619 -129725
7848 383336 -173621 225576 213141 -235051 49785 192531 27089 30576 -4107 -182787 -172308
7837 -172308 -81746 -189417 -127411 -127797 45480 241010 -285459 -253090 -66871 93807 142892
7826 142892 26465 -414838 -154723 -357256 -43709 -152646 58282 51873 -174546 100510 8521
7814 -738 141875 183486 48233 -253158 -135997 -174958 -138652 52146 337991 -6093 311034
7802 -39882 -309002 -107953 -230497 197255 352618 -192401 -231935 -75337 -140835 387555
7791 14829 -205772 -176429 -60909 384967 123059 -146507 -34267 -91535 115791 -76596 166794
7779 -182886 -36950 -97029 255895 -272950 -123701 -208956 -252818 -76837 -62630 27796 195036
7768 195036 25128 -1057 80025 -95555 -58664 20745 9499 -277682 -54788 243362 -586238
7756 -314415 -50313 51918 -168722 169819 -244345 284665 -93797 -220249 -122147 -145920 -33015
7744 49574 34881 211084 -66535 61926 -235500 79899 3670 28245 162375 -337834 -173783
7733 -173783 -72631 -315729 191262 -198725 236829 -2928 -218043 -151242 -141745 46164 -219189
7721 -236894 -51901 -188648 265176 -162261 -262537 245751 199317 -64531 51943 -333875
7710 -3113 -241403 -152005 95786 -87428 -111799 -144611 -80839 -284511 -103243 -42155 -230520
7699 -230520 110949 -49944 78776 -114943 -38755 237898 -60291 -265470 -62644 -179631 -43084
7687 47677 -34652 134742 -285484 -114848 76956 9952 -46773 138908 -285564 -46281 -239868
7676 -239868 56621 -202390 -4216 -142581 -275229 -66377 12604 83522 147867 -184207 -31328
7664 -5632 131586 284573 -23705 -195050 -26534 -210284 13034 -82273 -241690 6985 -291766
7652 141157 126867 135875 -231900 386054 76087 -301856 -40494 -247 36200 69234 96479 381689
7640 381689 126656 -36010 -97482 205184 -372711 -192926 193159 348517 336950 94084
7629 190258 -269194 -160396 -45794 -108881 52383 -439967 63964 53464 306333 -59299 251747
7617 153940 193869 -106849 -138935 -54577 66542 72841 62232 -50052 292654 156441 191028
7606 191028 47326 91062 -275596 28390 -143345 -305318 -31516 -96842 199342 51528 -10419
7594 164287 -163343 -83765 145470 -72626 57861 -195037 6359 -67746 8512 56364 -167493
7582 -99479 -92830 -272892 224386 409121 119789 -206375 56378 -116964 -135629 -304993 62796
7570 -197634 -196718 -196821 -54302 -51817 53720 -120560 -116920 194508 71907 -84929 -43248 -228628
7558 -228628 -125899 -326259 -507184 -194693 -53535 65254 -61510 37259 -249523 -127521
7548 -127521 162014 -333068 130292 -106588 147641 -128184 -457671 76999 -135524 429386
7537 -93303 111256 -28929 182823 -113839 -270033 -59038 -198351 -258690 -111224 -202636 -475259
7526 -475259 -148557 -199031 -294470 -106912 -270798 -151906 -358483 -12293 -363381 122244
7515 70651 -161719 -436785 132029 52136 -62350 107307 167663 -91790 -85021 289021 -136559
7503 31010 -300501 -226569 195408 -87260 106057 120201 126381 -280988 183064 -3882 89776
7491 -9757 156205 -314375 -72885 -102381 202461 51036 -95452 -39025 137845 110898 -227944
7479 -98143 -189371 258347 -124340 290816 57818 37803 -82713 -29908 -88288 -341649 20798
7467 28024 236504 -43848 91653 -114082 11312 12396 201774 -261756 -103931 83916 -109159
7455 -105396 -114826 146901 -192237 -193246 -315871 44790 -28699 -139416 -105039 -89947 -189093
7444 -189093 -294007 -166738 20980 184201 343222 340153 -195711 -174196 22527 -68659 -121849
7433 -121849 258082 230862 -93451 -54610 -22734 265214 226407 8494 286319 -94644 62227
7421 360994 5280 121515 -46850 91487 -129032 74815 329329 292324 -202328 -338748 -98923
7409 -40724 -28874 79943 15711 215280 -144503 160621 167213 -107134 144357 56904 82960
7398 82960 205237 -121031 -339979 6216 -54076 -18941 -10742 -14046 -166379 221174 -391512
7386 -228300 47721 -115181 -383283 67332 -408243 -13109 -182351 -112679 87322 -487359 196483
7374 -212282 -14693 121918 74693 74892 -73013 -207668 -400976 -62389 -161724 93986 -411887
7362 -221407 52924 235729 -188008 -118441 -337785 -33574 44757 72122 -90550 -114577 344959
7350 -392666 80319 -227559 -83734 -133622 -102963 45059 -42023 -178641 -298377 -178975 -148097
7339 -148097 -139502 -296374 232693 126753 -25888 -165286 331115 -247754 -196479 -395394
7329 -395394 -43127 -99078 69772 -208251 -332708 49737 -429637 213473 169844 -117292 -357467
7318 -357467 -152459 288498 48110 -233073 181088 -72726 59879 106232 -117869 225900
7307 -115618 96319 -230 -181754 -238242 -72581 -135662 149626 -174845 -441173 188783 263606
7296 263606 -399989 116136 -62579 -325270 -26343 -129296 -178782 187855 154823 -236859
7285 14161 106275 -95216 47826 -167549 129484 -235815 362930 -57924 154972 -197875 -14928
7273 -389639 -257330 41162 30909 -63038 -201044 4626 342032 354568 -1305 -411077 -99121
7261 116373 -218232 -161142 -61359 282548 -7892 -192507 -337327 -202563 165649 213665 148646
7250 148646 -61730 -8185 51864 59809 126834 155301 233361 -203186 -176310 -237369 75189 -144518
7237 -43762 287403 -101620 -97958 -47515 -167167 216001 36271 -13826 112147 -1521 120281
7225 -19493 148712 -76145 -34487 73937 -148550 -91398 -203085 -9097 -88202 -30405 217298
7213 -142755 -120570 -256533 -183325 -83905 -21800 319236 -205319 -87400 91655 -64762 64575
7201 88739 371218 25739 -25124 -230054 53621 782 159828 14885 -89588 -14934 -48370 109217
7188 11273 -29118 -127186 -348606 -63330 153543 -342919 -253209 -3015 -344426 -26733 119052
7176 -39934 -4734 -184481 161987 312533 344328 -32182 167952 165878 348303 -57846 33521
7164 4300 -123662 207059 -150538 -1496 -2798 202299 -35191 -349575 97111 25852 -188756
7152 105682 -230780 -20167 -260058 -84344 -147460 -163797 237279 4076 108857 111294 83545
7141 83545 -66074 -29192 22302 124700 -182829 -593 -159145 35215 -124479 -165712 -125495
7130 -125495 -207711 17708 4232 247507 -317136 -380819 -303326 -2791 -64204 61738 -22839 308903
7117 -138141 132887 -244594 43293 14666 -40942 123613 -68497 -37859 -106210 -129003 109827
7105 -414964 17083 -267742 -254815 -45145 9287 -22348 -59269 -138812 224033 -1918 -176706
7094 -176706 -254438 38752 -139540 224376 -44343 992 238685 -53296 -115123 43686 -62851
7082 150212 167853 -177851 -293371 3085 125339 137732 -76507 -77194 -14690 120752 130385 -267113
7069 -195941 -33350 -522337 245819 71517 -264906 77668 54963 159311 338276 -262744
7058 -117539 100407 -94121 -154091 285128 -23493 27422 -67932 -161037 -65668 297379 201493
7047 201493 -400594 -66728 -41819 -187579 -59020 84480 -54137 -182886 -498423 -29694 -108478
7036 -108478 160985 388168 -155496 -315565 110248 23824 177924 122566 -12322 -49145
7026 -49145 60119 252924 213765 -113102 65870 41587 27738 -60788 231313 19057 -97167
7014 47539 -137334 32960 -188352 -67372 214493 149519 -49122 -495171 -57314 -186393 -323683
7003 -323683 -95002 -55791 -33262 -93900 222540 152940 -296867 103378 29849 -16091 -323688
6992 -323688 -108529 314481 277914 237419 -249176 -71314 -368843 -150848 -6010 16077 -44699
6980 -146750 131223 -180867 119600 -88641 -65666 303897 -153069 3032 -2374 -291622 256974
6968 79182 239175 123160 -42556 11684 -60553 -136016 -4500 -2215 5466 -123396 -277716 -212743
6956 -212743 186435 -5140 28850 22289 -146032 87078 94257 78994 63012 -21663 253211 348854
6944 348854 61719 -57740 85361 -403575 -100194 -79813 -96798 -456439 -74817 4092 123749
6933 123749 345469 -19693 -110669 29481 202034 -81134 -392484 -2856 -5944 187093 -277127
6921 192912 105508 30831 -90420 -153933 -96568 266845 -76249 -162669 -184388 37354 61526
6910 61526 -63356 181661 -246914 80635 186289 54930 130756 32479 -154967 43689 175541
6899 175541 -129980 136852 -116639 -79240 -105888 124948 -187141 26150 62742 123123 -350211
6887 -41276 -161959 -134654 -149368 -4787 -118998 12958 -139040 -380837 167635 346571 116882
6875 25333 -73220 -13237 -329759 -15250 -14805 100730 -141383 -62136 -198542 -142499 7995 -237657
6862 -19401 -240164 -480686 325166 194727 51435 -256560 -19403 -206808 -21564 139557
6851 -412325 -346335 -236213 271943 -171019 227225 -32020 -25499 204924 45318 213262 3363
6839 -76389 -171239 141153 -86161 -207310 -264091 76791 -122818 -168118 -156524 -31446 -61302
6828 -61302 17249 273786 82900 219677 -6276 -223423 101041 295807 -52783 8934 -129757
6816 -455096 26805 -514827 -406956 -298443 256578 -328039 -151790 -213348 -65321 6283 -259741
6804 47879 -289147 431974 333594 -232691 -74465 -22926 -256530 235858 -362791 101937
6793 -205670 -252288 -159087 82033 52867 -70395 49205 112532 164134 -101759 -90401 92602
6781 16531 -193474 336358 376515 57038 -209786 -32522 90655 -61325 9814 -112747 -516903
6770 -516903 127642 96303 -18962 108364 23049 -158662 105862 -223781 166316 -174686
6759 355470 -123399 87097 176147 -181638 58511 -2783 -39300 189232 128902 -235811 -140867
6748 -140867 11635 31319 131045 -120838 -184227 -343532 -190023 -92845 143063 109280 223591
6737 223591 16121 -86822 169024 32526 -139127 43866 77686 -160973 25942 -360124 -2301
6725 -104537 134815 -8196 206376 -321248 213498 13941 -171600 -100889 -287773 -169664
6715 -169664 94761 -104277 280059 -125160 -178040 187901 -210479 353209 28448 284017
6705 284017 185722 -32687 -11367 86712 97552 272442 -479702 346807 -92512 146626 150996
6694 150996 -35759 -294406 16372 109842 242473 126664 -104333 -309910 -47990 -453196
6684 -453196 232299 -92254 -155823 369123 -23468 -24631 -45644 -164637 -33360 -27392 70580
6672 215463 397293 -280262 341163 47512 -74485 107668 262316 -101730 -312216 60145
6661 -33947 -127523 216533 -266797 310712 262439 -138308 -5730 -18168 -46496 88899 -286872
6649 55310 -227328 106575 18790 -13202 195109 -141403 -284240 121250 320422 -119722
6638 20076 -3455 15975 -39292 150172 -213532 -58657 18832 -90385 -297962 184763 130887
6627 130887 -279214 294106 257112 -22594 686 248161 -100822 89445 -144388 106471 274679
6616 274679 65112 -88398 135830 -40854 157277 76773 -191184 201663 186919 145207 224449
6605 224449 25098 -91140 82304 -513828 -214045 205749 -39911 175931 57322 -26011 -281311
6594 -281311 137355 -194015 -143618 -363185 4172 67440 -65512 -89773 -167373 -91197 115567
6582 -318858 -205242 70395 -38893 241406 -86848 -31700 244155 157133 235910 131095 55329
6570 -88176 -309242 101173 -19729 -224933 -649 169467 281850 44437 33055 70385 25511
6558 63749 128292 313494 -281930 -97243 -157878 198272 81151 -240146 25512 29784 -118270
6546 314218 -162539 174796 46521 -51691 -5781 -133110 -101987 103875 266427 -228696 -179700
6535 -179700 79237 99318 -20359 51371 -150946 -98307 73808 285498 -20470 203125 -56251
6523 -115947 -229104 154517 -438498 -232944 30173 -372937 53548 203007 -40023 -295839
6513 -295839 60221 -476216 -109998 -175649 130992 94499 58263 -442308 -77119 3041 -126995
6501 -25231 17696 47756 -123663 -242008 113295 -86758 -19382 -352746 -192535 -214328 285479
6489 -37987 -151815 37458 -234323 -86673 -138813 -202959 155595 314559 -81632 129801 -182720
6477 67881 221884 76356 -254543 45103 -83376 125653 -144540 53229 -172811 121734 178839
6466 178839 58855 -129920 -287213 10150 173925 -58350 208668 -95164 -69210 175748 229728
6455 229728 62503 -282856 30897 -37553 -270402 -327744 62961 -42648 -269896 -362767 -40568
6443 -15695 -306217 -389432 58624 96268 -38911 -20040 108402 -147406 465950 -37580 129446
6431 30613 -28993 -98074 177422 86386 168926 -399099 16890 -105061 -298630 181674 130761
6420 130761 83581 -75400 -185585 -187758 183258 57785 203109 174030 -178796 118590 -89062
6408 91660 83118 168590 -117284 -260417 -150995 225064 -89394 76930 -79484 -88043 -93347 239997
6395 -109706 266491 -142723 95638 -123674 -171678 196994 176537 -414401 -80354 70754 -36049
6383 150661 -33677 61889 -48789 -69351 -41122 -255712 140393 468992 148403 -445121 -180477
6371 60465 -166788 137131 26267 -243505 6004 -251331 -64598 -111653 52474 229357 -97100
6359 -132449 61947 -67851 -46767 -229702 -31814 -139894 -166568 68405 -11422 -229105 133790
6347 -121833 422172 61367 56256 -79505 381177 55247 -88677 173285 52353 -175197 -24095
6335 277150 155402 -3339 -186788 -15663 -73594 -371110 295421 164837 -160300 -189188 62017
6323 316 -146262 -16242 -191632 395862 -114518 -14092 -222167 -1462 530035 -42671 -141 -360172
6311 -360172 277823 -202936 196778 18455 310801 -55773 -19287 144083 13501 36547 -116488
6299 -33280 72381 -199715 -136240 -36078 -226035 -12645 151147 -21365 191553 43656 3126
6287 66138 -2586 91723 284444 -181578 -91854 156614 174613 227385 -19424 -115487 358482
6275 278955 143607 -159316 3179 -152381 100004 102520 -88723 10606 91481 74040 14850
6263 -3382 -144459 -107903 -114663 -165142 -198432 -352142 45940 53292 56985 127503 -153507 -1561
6250 -149712 319828 114183 113278 -82480 12818 -206203 154886 109364 95284 252586 255007
6239 255007 -231983 -4783 54328 -93041 3582 -23564 374667 -156578 -185775 226808 -18717
6227 -117717 140462 237461 -133082 -165316 24987 -246098 438 -84724 1398 59175 -25790 -95363
6215 -95363 -35394 184664 -47837 87192 -28410 76432 80595 91462 -95805 -131078 47233 -165366
6202 -288347 30772 -3227 100514 -11947 -234904 -288254 48124 -180898 -76275 22474 177327
6191 177327 172346 -89706 -173214 194283 -34697 7745 -93350 -156978 66055 -126671 126934
6179 -160113 360171 31857 -363608 -90610 -273478 55789 111334 427419 -178038 206742
6168 278073 18913 24833 177405 226525 6925 260730 42370 215459 74385 56342 -17325
6156 -97714 86445 202844 117409 -178473 -37464 303790 1608 30528 -97306 -62279 -364353
6145 -364353 43537 110340 1756 -207960 -57296 4580 -136012 25094 -99997 63270 250983
6134 250983 44161 -104634 -13459 -497219 86338 -170725 123904 -55254 -224427 -18302 9896
6122 -49411 -295315 285455 137140 26724 -39288 -19779 68761 221650 115879 -231487 145515
6110 -274946 232431 -3832 -117633 -296638 -62443 -41948 -144267 96594 325813 186596 123962
6099 123962 -88260 -54734 -217463 201952 -176704 177537 18100 -225483 16165 511961
6089 511961 -79564 499053 -94728 -132591 -149938 -325419 128361 70567 -47075 -7087 -27218
6078 -27218 -98510 -99274 117972 35487 -44327 -88248 -67655 288153 -54160 -90200 -52337 -119118
6066 -119118 -104314 26541 -66394 -149313 70105 -256956 29901 102060 -169884 -46637 -30705
6055 -30705 -242941 295230 -118041 -11036 -105180 -151459 -340829 -243101 -234144 44183 342201
6044 342201 -561 -148104 425458 -208869 139341 64136 -31911 44138 -119495 -174375 574457
6032 -127419 -85890 -96650 15265 -76579 177247 73029 230805 -259685 -158117 -218700 -44210
6020 158351 -168290 -118151 -287970 41404 -357283 -115905 -211931 -61091 -502268 380309
6009 -104194 -7789 -470196 85263 156667 64846 9119 229372 340843 244308 -162052 -179710
5998 -179710 -25083 37109 284619 -119505 -26656 73566 60301 -281725 64871 -32119 148989
5986 355821 -53392 1179 -7707 47688 -67274 -147256 244771 -88480 144087 -40838 -261651
5975 -261651 -153644 -169252 192784 51585 150252 289090 -48010 307751 -117462 -149083 189229
5963 9848 -52067 -85188 22369 434744 -143177 -175599 -234078 -211233 126853 96979 87748 -164893
5950 371388 184148 -32938 -228064 139646 -259988 191063 -45865 121092 -276362 -51658
5939 -183962 -189673 197709 207207 82627 273744 -133795 -397179 -77611 -73145 94548 3903 -67871
5926 -193710 242939 -15514 -45705 273519 -26893 83019 -313686 244163 571208 -83917 -277109
5915 -277109 418647 221034 439999 -87912 -438847 -218088 13931 162629 47469 201661
5905 201661 104699 147074 -92443 -101125 37470 -167680 176959 -67515 276290 -67744 -269504
5894 -269504 -17141 -114290 15356 231769 -69507 -90904 -269450 213610 94275 -12094 232428
5882 253107 95941 79091 -189457 -354179 -182381 -39357 109629 -61609 302329 441314
5872 441314 27507 208714 260453 72273 -175270 243514 134585 -140523 -161144 76926 -81914
5860 -67056 242408 355040 28664 -371688 -81583 -380 -191650 -188699 -56136 94615 -14419 158707
5847 -7803 -48666 112019 118399 -185398 -219024 13179 -242905 -79510 26778 -65623 -253776
5836 -253776 -135745 57156 -129083 12365 176342 50370 245209 65755 -2262 174297 186937
5825 186937 -99002 -283228 51869 -105529 -114083 523968 -185600 16183 -39113 -5318 -241083
5814 -241083 -16223 -101315 -73049 -318675 121777 -465639 105381 110160 83856 59302 34491
5803 34491 144691 -111251 -287069 9163 -16752 -121041 -182907 -49786 116202 -40258 142042
5791 -183333 -147701 237721 33422 -51367 34493 144661 5207 2040 -107536 -365 279323 -151839
5778 -78395 -90477 -20712 -273710 24188 40876 -70885 -90463 167648 -103075 325207 -19415
5766 168453 10416 -47377 -307041 168839 80501 168573 67142 -55731 111939 -1223 -39611
5755 -39611 -52521 157788 -378401 -306320 166260 85720 -147784 43611 -214714 -50210 -117076
5744 -117076 -51128 -223808 -356077 -298875 -196465 -77644 487331 -164074 116836 -185213
5733 -71697 -330288 -46710 5575 41177 -154883 141297 -157209 -295203 76775 104414 40699
5721 3321 389205 -15161 -176507 40048 -115967 24942 -4568 195396 199002 -33579 107366
5709 -33024 188779 -22729 33580 -132033 184694 -133700 302147 239276 248974 148787 178277
5698 178277 266746 -144368 -16064 -4719 266197 -45999 70545 145994 -331634 284216 136653
5686 -179879 -342779 -205194 146595 188821 -21290 64293 170288 -110907 41945 67214 308824
5675 308824 -315903 139253 -233271 -114619 -194409 -241094 -124220 -87067 5143 124380 -250124
5663 296941 -58710 324519 -168557 117544 -85415 -8505 102022 -120055 250175 -53259 -98112
5652 -98112 -102288 181829 -266885 -37907 -14163 292546 -214165 -113507 106516 34739 12094
5640 -74032 -177799 -89767 -94831 -24743 -306959 -26335 172712 50914 27821 -351918 -179072
5629 -179072 -9476 366003 125140 106022 126255 39893 76294 -280122 109586 94793 -200290
5617 -162135 -36712 -36624 74925 173246 -120209 -96854 -167193 -227229 134652 -164943 97204 40123
5604 -27274 100808 285829 154937 174461 48084 128083 -305963 73817 -190554 26707 -100844
5592 100196 382404 -147196 -24095 53571 -42835 -158794 65261 -24259 -224387 -155811 83969
5580 36271 -108617 256306 142200 258793 423422 -127659 -26046 -390062 173501 45908
5569 -32017 -267228 -436846 -99267 -227641 -67051 65080 -80934 -28411 -179420 34254 24097
5558 24097 146758 -47228 -69653 -64914 -9169 24514 -147212 -271708 70723 -74331 136161
5546 73623 41895 -43332 170042 246551 -286613 175106 -24114 80364 -33973 -211135 -104751
5534 287657 206698 106134 -209160 -21919 -202679 -155143 -205285 -306280 -148395 3511 -37292
5522 -29311 31890 367668 -157263 112626 457804 64476 39303 18137 37690 -84814 43039
5510 23211 -198877 133237 82419 38707 163340 142348 -196283 95134 -152458 -167988 -259504
5499 -259504 50045 -81045 298803 222392 322164 -266415 -257316 85322 20624 311304 -50219
5487 -363193 341855 266551 -34631 -45463 136342 38940 -77572 -259794 -245775 -251638 108034
5475 -238426 -79562 36372 67703 174971 263173 -47628 19730 -207545 27694 -239199 -113918
5463 227272 -83791 88856 37166 -59011 -75534 514273 164996 32770 -235946 -20482 209254
5451 69328 -152189 -27937 -126009 38669 -77495 62787 115151 40034 35963 117528 208655 -295851
5438 -35023 -128778 -239046 130736 -309644 145761 72408 151257 -302944 407869 136618
5427 81350 344739 -74597 95338 14848 -15277 200560 120415 5589 194552 288739 344352
5416 344352 -154674 -236280 26854 -26025 -232697 -112788 41612 -97153 -348749 -282981 192816
5404 282767 -187506 -295046 -148696 137198 142324 19273 180384 96363 -148898 506120
5393 21351 59962 146343 18868 -286300 70093 -119870 -415894 1225 -1708 149181 -284713
5381 -56608 -136490 -5342 333842 -142692 56614 133971 261268 292572 -136132 -142467 -16763
5369 154615 39127 -127569 446854 -33333 17342 -315624 157232 -292364 -345409 166840
5358 126808 352894 -125876 -123266 63746 -71542 130208 2748 145351 240144 -218788 313320
5346 -186254 -223598 125353 164946 -134335 -77766 -116583 127257 -404760 193694 -88948 22030
5334 301673 143205 -133220 -42830 61943 -180954 99205 -36035 -67625 -150673 -242266 -266609
5323 -266609 -227475 183003 -98825 53322 -339755 -197271 -235666 -108896 -283682 -100095
5312 -361045 -3463 -32720 213207 -261727 5845 -245482 263252 194658 -6907 -193914 38767
5300 19371 -34409 268376 85633 -126459 -69250 171032 134574 134474 153012 66820 -168791
5288 -75421 109722 183597 -73500 -167377 -19755 -384236 -334647 65963 -23782 -68142 198890
5276 107057 -33108 -159308 -670 -6645 365842 -106221 213221 -74720 87361 -60069 -26759
5264 -34114 -109917 -219200 -3781 50972 -194792 -129965 -41878 22166 186578 -172439 -144823
5253 -144823 6367 56980 -247110 -223572 -24360 -92566 -74579 187487 123537 12228 51576
5242 51576 89437 81253 -7507 101731 -120238 -47179 192719 -161437 176071 -181013 51625
5230 -50229 269490 110816 313091 -36204 -131984 173986 -697 77727 -94454 85353 42304
5218 58855 -134445 -417322 170537 -10030 285284 47496 -139693 89515 348045 -68389 31684
5206 -142744 56446 -232503 -157631 -114122 216798 112339 270109 -56348 -297994 -107344
5195 -289145 299539 74976 -168341 9797 265958 222393 -62734 18033 211566 199220 122188
5184 122188 244130 752 -84454 34204 -53237 110478 231335 -36474 223856 -74617 -21080
5172 -55433 -164466 -87482 6145 164597 248774 -322461 -88496 33338 98298 180915 245310
5161 245310 -60342 -42265 61648 199422 443810 -57732 22929 -121560 -98280 24163 132282
5150 132282 -295586 19923 -157110 17932 -234553 240496 -20419 -207993 -140554 136561
5139 -13966 15181 138786 299668 -119829 36506 -100184 -145536 109813 183391 214976 305325
5128 305325 27433 -126103 -50834 138878 179623 162682 115452 11273 -239350 121760 63901
5117 63901 -4920 -10843 146692 101493 -48982 -183211 -226984 -46946 -206925 166960 -282429
5105 -63401 -286842 271787 -77141 -127763 -25537 -285012 30451 -202547 -249696 -6714 -60418
5094 -60418 -214456 45971 -236212 -95157 22636 336853 -60566 545446 181035 -11813 -84928
5083 -84928 249277 32190 -46884 -169447 -191103 35563 257601 -170838 -134076 -9401 254676
5071 262137 23885 -100165 -4415 -137183 -369284 112007 -69133 74547 444566 -19348 177272
5059 -122756 -355213 220691 119279 33872 -306075 -77561 -27097 -144284 141177 5183 29250
5048 29250 151592 83007 -190489 -91458 -111660 -244211 -25307 40714 -122837 262138 221225
5037 221225 132323 -343341 -29436 -125558 -125263 -225225 75018 154368 67883 209536 169819 196134
5025 196134 -207160 -144310 -82269 -20283 -50988 103237 -44898 -86499 -1654 -854 -52479 36447
5012 29687 -245706 122086 -67426 -191992 -52350 92930 -112361 -167284 -45570 -123335 13976
5000 -30694 -69675 -102989 66777 -55965 -150250 -400078 196969 -70878 111299 114937 223421
4989 223421 89581 -279626 275970 -120916 87903 86275 -2582 380357 -288470 -174580 137077
4977 -136511 5807 -185619 -168921 327006 -18253 23335 -108865 189593 -317031 -322410 27375
4965 -30662 285343 -126375 92445 -236785 -55227 16504 -111898 -73254 -167234 -472121 -35868
4953 -210001 29018 257305 -64917 285289 -122177 274763 17333 -76186 -51535 296731 177914
4942 177914 224216 -162242 296643 87546 29798 -174331 -255566 -280002 -150290 113745 -107869
4930 -109582 -82735 -125055 -100904 233481 48217 18378 29184 -87642 327 126814 96320 358739
4918 358739 -362803 177085 98704 198261 -39771 136602 -182262 123133 -26916 60056 -66370
4906 6443 -4077 232459 384893 -331753 306507 -119633 147914 228054 -34699 141215 155461
4895 155461 116627 -175428 80358 289263 113301 13656 284592 -117437 -60177 -174558
4885 -174558 82296 122118 181596 -14867 -111569 58448 -66780 -220551 -422988 -185500 -27780
4873 105770 -30723 49715 211802 -140719 -198909 -56175 339798 -78318 128573 221627 -129344
4861 88486 264192 -126163 106732 -199021 -182847 29453 102902 -33033 23205 -159827 -96290
4850 -96290 -62141 -151719 -3154 -12659 1532 30973 277625 -226514 -219742 98323 -199746 69761
4837 53964 -262208 -86168 257804 -89270 -587268 -72451 -19905 -153708 6252 10107 -172139
4825 -183421 3723 187735 442613 -65601 -265148 -71105 -45228 -118275 58499 8125 -89920
4813 265329 34262 -126466 210227 -35772 -61022 218733 238359 194767 -330544 -135464 104899
4801 223615 229964 -154792 -43726 -61910 184557 156025 118144 -114300 -35912 -74012 186003
4789 -136846 26668 365783 40297 7915 -194502 -92198 102758 141382 142854 28465 268979
4778 268979 457655 261893 265415 142398 -223271 60986 15354 10176 -84570 460648 -136621
4766 50695 -294582 -43145 35091 -120916 -47427 22415 -280221 51603 -64512 301488 255473
4755 255473 65063 85710 457056 18496 -85332 353639 22541 -469509 -30248 -391415 310613
4743 -51540 -131434 -201000 -186709 -58032 -192642 -191698 -22357 212292 54929 8052 127347 -127353
4730 -287027 42880 -134777 -87761 396060 286354 -49850 28251 -118616 -25299 -189817 181196
4718 -254609 205601 205536 -113153 -66510 64280 -174848 163016 338490 38150 390829 -268411
4706 -184448 198766 347720 72258 -42875 78091 -82265 -64137 12778 60004 177082 97623
4695 97623 172059 -121896 302446 -109069 -193254 -37174 -246330 44610 82006 233398 54883
4683 -73508 -76730 -150468 299113 129704 246902 40661 49310 76690 109500 -442005 5912 -16077
4670 64900 144562 113805 118849 64946 23050 306251 308448 -55837 150784 -78390 -91862 -73824
4658 -73824 14077 197025 -163941 161950 -34967 -195304 142533 -44819 -339311 173208
4647 157041 127680 115579 173015 -14733 298942 17638 -265158 -170903 -148417 -53018 -63755
4636 -63755 -340648 -39472 -141516 -85832 150538 125096 860 179874 -218188 -22815 73211
4624 -262296 156787 152948 405938 -28621 87853 -49014 -44661 -38752 9994 -82549 -9033 -109914
4612 -109914 181639 225678 202139 203718 -180960 76256 59628 211481 -55657 114387 146652
4601 146652 -297504 -141565 -15191 52737 275495 169352 -192513 -51292 -177975 190648
4590 617820 -207332 -49982 -283466 123874 312287 -430439 -152471 187010 -90439 -78658
4580 -78658 54142 -352786 57511 -5853 -8237 -83716 29403 -447339 106818 74605 44298 120636
4568 120636 193983 -179345 75534 -171799 -460 -9362 86693 236473 -149199 -33613 -98219
4557 -98219 -232941 -257787 -9786 -98941 -300548 -7332 -152076 39774 -189473 -440294 -357836
4546 -357836 -88458 -15420 355145 288809 168601 -79368 30649 -212434 -60778 35794 -119800
4534 350532 146390 39341 -61808 -2702 63796 -44314 197172 440426 126152 9689 -120918
4522 -148123 344202 340388 108302 74454 -51871 353703 -2182 -336580 117688 -217080 13263
$$ [...]
##END NTUPLES=NMR SPECTRUM
##END=
