##TITLE=AC1527_ROEFFECT0007_8202252_xZO1EJQUhu
##JCAMPDX= 6.0         $$ Bruker NMR JCAMP-DX V2.0
##DATA TYPE= NMR SPECTRUM
##DATA CLASS= NTUPLES
##ORIGIN= BRUKER
##OWNER= Administrator
$$ 1.72 TOPSPIN		Version 2.1
$$ 2013-09-27 00:09:28.475 -0700  Administrator@X
$$ Compression mode = diff/dup
##.OBSERVE FREQUENCY= 400.02188249412
##.OBSERVE NUCLEUS= ^1H
##.ACQUISITION MODE= SIMULTANEOUS (DQD)
##.ACQUISITION SCHEME= undefined
##.AVERAGES= 64
##.DIGITISER RES= 22
##SPECTROMETER/DATA SYSTEM= spect
##.PULSE SEQUENCE= noesygpps1d.comp
##.SOLVENT NAME= COFFEE_meoh
##.SHIFT REFERENCE= INTERNAL, COFFEE_meoh, 1, 14.96076
##AUDIT TRAIL= $$ (NUMBER, WHEN, WHO, WHERE, PROCESS, VERSION, WHAT)
$$ ##TITLE= Audit trail, TOPSPIN		Version 2.1
$$ ##JCAMPDX= 5.01
$$ ##ORIGIN= Bruker BioSpin GmbH
$$ ##OWNER= Administrator
$$ $$ E:\/data/COFFEE/nmr/AC1527_ROEFFECT0007_8202252_xZO1EJQUhu/12/pdata/1/auditp.txt
$$ ##AUDIT TRAIL=  $$ (NUMBER, WHEN, WHO, WHERE, PROCESS, VERSION, WHAT)
(   1,<2013-09-27 00:09:23.895 -0700>,<Administrator>,<X>,<go>,<TOPSPIN 2.1>,
      <created by zg
	started at 2013-09-26 23:57:53.203 -0700,
	POWCHK enabled, PULCHK disabled,
       configuration hash MD5:
       C8 4E 4E 5D D3 5C D8 9E 9F 52 82 E0 59 8A DE 15
       data hash MD5: 64K
       36 91 FD 69 68 4E 4E 20 0D A5 89 0D 09 37 2D 07>)
(   2,<2013-09-27 00:09:26.624 -0700>,<Administrator>,<X>,<proc1d>,<TOPSPIN 2.1>,
      <Start of raw data processing
       efp LB = 0.3 FT_mod = 6 PKNL = 1 PHC0 = 0 PHC1 = 0 SI = 128K 
       data hash MD5: 128K
       42 E8 2E D7 24 27 EA 18 56 D8 A9 BD 70 78 86 0B>)
(   3,<2013-09-27 00:09:27.543 -0700>,<Administrator>,<X>,<proc1d>,<TOPSPIN 2.1>,
      <pk PHC0 = -83.90259 PHC1 = 0 
       data hash MD5: 128K
       F1 5D 1F 58 6F 98 9C 77 A4 CB D4 74 D1 0A 0B 0C>)
(   4,<2013-09-27 00:09:27.960 -0700>,<Administrator>,<X>,<proc1d>,<TOPSPIN 2.1>,
      <abs ABSG = 1 
       data hash MD5: 128K
       BF 31 A2 5F F4 49 5A 66 8E D1 02 04 89 FC 5F 8C>)
(   5,<2013-09-27 00:09:28.058 -0700>,<Administrator>,<X>,<proc1d>,<TOPSPIN 2.1>,
      <abs ABSG = 2 
       data hash MD5: 128K
       11 48 BD 7C CA C7 E4 61 CC 4E B0 21 65 8C FB 01>)
(   6,<2013-09-27 00:09:28.169 -0700>,<Administrator>,<X>,<proc1d>,<TOPSPIN 2.1>,
      <abs ABSG = 3 
       data hash MD5: 128K
       D1 4B 3B 43 B5 4A 0E 9C 8D 12 22 8C 11 1F 3A 80>)
(   7,<2013-09-27 00:09:28.253 -0700>,<Administrator>,<X>,<proc1d>,<TOPSPIN 2.1>,
      <abs ABSG = 4 
       data hash MD5: 128K
       94 94 23 A6 26 2D 29 33 13 E8 62 12 E6 4B 5E FA>)
(   8,<2013-09-27 00:09:28.336 -0700>,<Administrator>,<X>,<proc1d>,<TOPSPIN 2.1>,
      <abs ABSG = 5 
       data hash MD5: 128K
       C2 66 AF 6A 3D 93 C5 DC AC 1A 34 D3 01 40 23 D1>)
$$ ##END=
$$ 
$$ $$ hash MD5
$$ $$ 6A AF 69 4C 9A 0D 2E A3 AF 34 58 4F 43 EA 80 E4
##$RELAX= 
##$RELAX= 
##$RELAX= 
##$RELAX= 
##$RELAX= 
##$RELAX= 
##$RELAX= 
##$RELAX= 
$$ Bruker specific parameters
$$ --------------------------
##$DU= <E:\>
##$EXPNO= 12
$$ [...]
##$TP07= 0
##$TPNAME0= <>
##$TPNAME1= <>
##$TPNAME2= <>
##$TPNAME3= <>
##$TPNAME4= <>
##$TPNAME5= <>
##$TPNAME6= <>
##$TPNAME7= <>
##$TPOAL= (0..7)
0.5 0.5 0.5 0.5 0.5 0.5 0.5 0.5
##$TPOFFS= (0..7)
0 0 0 0 0 0 0 0
##$TUNHIN= 0
##$TUNHOUT= 0
##$TUNXOUT= 0
##$USERA1= <user>
##$USERA2= <user>
##$USERA3= <user>
##$USERA4= <user>
##$USERA5= <user>
##$V9= 5
##$VALIST= <valist>
##$VCLIST= <CCCCCCCCCCCCCCC>
##$VD= 0
##$VDLIST= <DDDDDDDDDDDDDDD>
##$VPLIST= <PPPPPPPPPPPPPPP>
##$VTLIST= <TTTTTTTTTTTTTTT>
##$WBST= 1024
##$WBSW= 4
##$XGAIN= (0..3)
0 0 0 0
##$XL= 0
##$YL= 0
##$YMAX_a= 6974535
##$YMIN_a= -13495863
##$ZGOPTNS= <>
##$ZL1= 120
##$ZL2= 120
##$ZL3= 120
##$ZL4= 120
##$ABSF1= 14.96076
##$ABSF2= -5.597422
##$ABSG= 5
##$ABSL= 3
##$ALPHA= 0
##$AQORDER= 0
##$ASSFAC= 0
##$ASSFACI= 0
##$ASSFACX= 0
##$ASSWID= 0
##$AUNMP= <proc_prof1d_extract.lims>
##$AXLEFT= 0
##$AXNAME= <>
##$AXNUC= <1H>
##$AXRIGHT= 0
##$AXTYPE= 0
##$AXUNIT= <>
##$AZFE= 0.1
##$AZFW= 0.1
##$BCFW= 0
##$BC_mod= 0
##$BYTORDP= 0
##$COROFFS= 0
##$CY= 15
##$DATMOD= 1
##$DC= 0
##$DFILT= <>
##$DTYPP= 0
##$F1P= 0
##$F2P= 0
##$FCOR= 0.5
##$FTSIZE= 131072
##$FT_mod= 6
##$GAMMA= 0
##$GB= 0
##$INTBC= 1
##$INTSCL= 1
##$ISEN= 128
##$LB= 0.3
##$LEV0= 0
##$LPBIN= 0
##$MAXI= 10000
##$MC2= 0
##$MEAN= 0
##$ME_mod= 0
##$MI= 0
##$NCOEF= 0
##$NC_proc= -2
##$NLEV= 6
##$NOISF1= 0
##$NOISF2= 0
##$NSP= 0
##$NTH_PI= 0
##$NZP= 0
##$OFFSET= 14.96076
##$PC= 1
##$PHC0= -83.90259
##$PHC1= 0
##$PH_mod= 1
##$PKNL= yes
##$PPARMOD= 0
##$PPDIAG= 0
##$PPIPTYP= 0
##$PPMPNUM= 2147483647
##$PPRESOL= 1
##$PSCAL= 4
##$PSIGN= 0
##$PYNMP= <proc.py>
##$REVERSE= no
##$SF= 400.020009732317
##$SI= 131072
##$SIGF1= 0
##$SIGF2= 0
##$SINO= 400
##$SIOLD= 131072
##$SPECTYP= <>
##$SREGLST= <1H.CDCl3>
##$SSB= 0
##$STSI= 131072
##$STSR= 0
##$SW_p= 8223.68421052631
##$SYMM= 0
##$S_DEV= 0
##$TDeff= 65536
##$TDoff= 0
##$TI= <>
##$TILT= no
##$TM1= 0
##$TM2= 0
##$TOPLEV= 0
##$USERP1= <user>
##$USERP2= <user>
##$USERP3= <user>
##$USERP4= <user>
##$USERP5= <user>
##$WDW= 1
##$XDIM= 131072
##$YMAX_p= 386861278
##$YMIN_p= -13411
##$CURPLOT= <Network HP LaserJet P1505>
##$CURPRIN= <$Network HP LaserJet P1505>
##$DFORMAT= <normdp>
##$LAYOUT= <+/1D_H.xwp>
##$LFORMAT= <normlp>
##$PFORMAT= <normpl>
##$SURQMSG= 1
$$ End of Bruker specific parameters
$$ ---------------------------------
##NTUPLES= NMR SPECTRUM
##VAR_NAME=  FREQUENCY,     SPECTRUM/REAL,   SPECTRUM/IMAG
##SYMBOL=    X,             R,               I
##VAR_TYPE=  INDEPENDENT,   DEPENDENT,       DEPENDENT
##VAR_FORM=  AFFN,          ASDF,            ASDF
##VAR_DIM=   131072,        131072,          131072
##UNITS=     HZ,            ARBITRARY UNITS, ARBITRARY UNITS
##FACTOR=    0.0627417313425164, 1,          1
##FIRST=     8223.62146879497, 2800,         -70236
##LAST=      0,             3547,            -70634
##MIN=       0,             -13411,          0
##MAX=       8223.62146879497, 386861278,    0
$$ Real data points
##PAGE= N=1
##DATA TABLE= (X++(R..R)), XYDATA
$$ [...]
63876G22899K524N774R603J2860J4925J6511J8665K1459K3965K5339K5785K6322
63864I26631K7558K8810K8840K7423K5602K4225K2844K0406J6607J2165Q045M748
63852A173904K011j067n173r871j3953j6900j9357k1945k4367k6275k8171l0612
63840I78224l3066l4503l4774l4538l4143l3502l2864l2677l2700l2143l0844
63829F12470k9373k7938k6043k3573k1324j9937j8981j7633j5830j4163j2954
63818C84721j1945j0796r504q366p643p267o788n842m660l918l898m160m079l549
63804B92306k939k581k471k381k168j971k081k458k630k350k162k784l935m391
63790B55004l479j970j152j381j990k292k153j716j090m83k53n92j240j664j557
$$ plain form
63876 722899 725423 731197 740800 753660 768585 785096 803761 825220 849185 874524 900309 926631
63864 926631 954189 982999 1011839 1039262 1064864 1089089 1111933 1132339 1148946 1161111 1169156 1173904
63852 1173904 1175915 1174848 1169675 1159804 1145851 1128951 1109594 1087649 1063282 1037007 1008836 978224
63840 978224 945158 910655 875881 841343 807200 773698 740834 708157 675457 643314 612470
63829 612470 583097 555159 529116 505543 484219 464282 445301 427668 411838 397675 384721
63818 384721 372776 361980 352476 344110 336467 329200 322412 316570 311910 307992 304094 299934 295855 292306
63804 292306 289367 286786 284315 281934 279766 277795 275714 273256 270626 268276 266114 263330 259395 255004
63790 255004 251525 249555 248403 247022 245032 242740 240587 238871 237781 237298 237045 236453 235213 233549 231992
63775B31992j072n93l19k06k63o33j225j482r46JM35K3o10p93o84q39j266j396
63757B20124r69l92j08J6M03J007J198N69l83o73l3O73N69LP1J034J906J941J692
63738B28648K043K713K668J789J188J736L023M055M349M023L421K970K971L118
63724B68715K703J706J190K038L726N036N600N898O037N520M335L155K201Q37
63710C18697j150k771l074k487k086k012j584p07r6j17k82j81o1j59j05N46J608
63693C03979K501K889K810K439K053J971K236K498K460K199J941J744J577J439
63679C34736J205O37k35r40j103q81o51m92k52J01N22J051J596J748J219L83p7
63662C38567k0Om67j278j998k503l029l711m306m386l806k944k361k243k316k324
$$ plain form
63775 231992 230920 230327 230008 229802 229539 228906 227681 226199 225253 225254 225689 225712 225102 224309 223625 222786 221520 220124
63757 220124 219155 218763 218655 218671 219074 220081 221279 221848 221465 220792 220759 221432 222001 222004 222075 223109 225015 226956 228648
63738 228648 230691 233404 236072 237861 239049 240785 243808 247863 252212 256235 259656 262626 265597 268715
63724 268715 271418 273124 274314 276352 280078 285114 290714 296612 302649 308169 312504 315659 317860 318697
63710 318697 317547 314776 311702 309215 307129 305117 303533 302826 302730 302613 302331 302150 302089 301930 301825 302371 303979
63693 303979 306480 309369 312179 314618 316671 318642 320878 323376 325836 328035 329976 331720 333297 334736
63679 334736 335941 336578 336343 335403 334300 333419 332768 332276 332024 332125 332647 333698 335294 337042 338261 338644 338567
63662 338567 338547 338553 338086 336808 334810 332307 329278 325567 321261 316875 313069 310125 307764 305521 303205 300881
63646C00881k244j963j185J3R17J022Q51J302K286K797K465K292L316N128O388
63631C24266O504O203O421P299Q363R192R577R409Q875Q561R002J0070J1167J2021
63617D46930J2947J4269J5851J7463J9185K1110K2905K4176K5146K6482K8401
63606F74865L0414L2060L3328L4164L3977L2090K8395K3375J7693J2056P181L411
63594I63009L92k519n461p924r413j0118j0850j2338j4589j6994j9105k1136k3453
63581H09501k5788k7405k7961k7735k6958k5511k3422k1017j8376j5250j1854
63570E58224q974o849m637j752R83K403K741L299M685O403P985R437J0486J0576
63556E95010R986R973J1375J3718J6153J8557K1244K4176K7053K9827L2677L5764
$$ plain form
63646 300881 298637 296674 295489 295502 296419 297441 298292 299594 301880 304677 307142 309434 312750 317878 324266
63631 324266 330770 336973 343394 350693 359056 368248 377825 387234 396109 404670 413672 423742 434909 446930
63617 446930 459877 474146 489997 507460 526645 547755 570660 594836 619982 646464 674865
63606 674865 705279 737339 770667 804831 838808 870898 899293 922668 940361 952417 959598 963009
63594 963009 963401 960882 955421 947497 938084 927966 917116 904778 890189 873195 854090 832954 809501
63581 809501 783713 756308 728347 700612 673654 648143 624721 603704 585328 570078 558224
63570 558224 549250 542401 537764 536012 536995 539398 542139 545438 550123 556526 564511 573948 584434 595010
63556 595010 604996 614969 626344 640062 656215 674772 696016 720192 747245 777072 809749 845513
63544H45513L9165M2502M4410M3088L7982L0598K2973J5786Q519J156n185r418
63532A117089j1663j2891j3729j3995j3392j2365j2048j3316j6121j9847k4068
63521I53654k8547l2748l5922l7747l8460l8293l7262l5555l3556l1295k8452
63510E75817k5181k2302k0277j8581j6513j4222j2324j0934r644q268p058o287
63498D04226n998o011n898n175l843k501j630j109p20o65j083j480j268n63J20
63483C66402O61J200J538J459J430K137L343M075M004L782L868L828L159K095
63469D02981J101J22j130k523l572m015l949l600l189k852k512j960j237o53m01
63454C72611l43k28J13Q29J908K937L418L372L302L523M054N128P132R774J2031
$$ plain form
63544 845513 884678 927180 971590 1014678 1052660 1083258 1106231 1122017 1130536 1131692 1126507 1117089
63532 1117089 1105426 1092535 1078806 1064811 1051419 1039054 1027006 1013690 997569 977722 953654
63521 953654 925107 892359 856437 818690 780230 741937 704675 669120 635564 604269 575817
63510 575817 550636 528334 508057 489476 472963 458741 446417 435483 425839 417571 410513 404226
63498 404226 398228 392217 386319 381144 377301 374800 373170 372061 371341 370676 369593 368113 366845 366282 366402
63483 366402 367063 368263 369801 371260 372690 374827 378170 382245 386249 390031 393899 397727 400886 402981
63469 402981 404082 404204 403074 400551 396979 392964 389015 385415 382226 379374 376862 374902 373665 373012 372611
63454 372611 372268 372040 372153 372982 374890 377827 381245 384617 387919 391442 395496 400624 407756 417530 429561
63439D29561J3398J4553J6289J8434K0485K2798K6123L0131L3304L4378L3352
63428F92806L0960K7748K3932J9767J5756J2583J0759J0240J0545J1591J4012
63417H80699J8187K3237K7729L1239L4366L7169L8530L7431L4055K9087K2749
63406A214478J5303P960K216j627m533p303r815j1770j3445j5343j7580k0049
63394A138492k2856k6189k9906l3585l6894l9586m1202m1219l9665l7376l5279
63383G54735l3448l1064k7509k3259j9448j6588j4128j1373q395n704l338q51
63371E59630J861M320O154P670R470J1828J4592J7421J9865K1541K2599K3877
63359G20828K6165K9334L2431L4653L6029L7155L8465L9804M0541M0043L8020
$$ plain form
63439 429561 442959 457512 473801 492235 512720 535518 561641 591772 625076 659454 692806
63428 692806 723766 751514 775446 795213 810969 823552 834311 844551 855096 866687 880699
63417 880699 898886 922123 949852 981091 1015457 1052626 1091156 1128587 1162642 1191729 1214478
63406 1214478 1229781 1237741 1239957 1238330 1233797 1226494 1216679 1204909 1191464 1176121 1158541 1138492
63394 1138492 1115636 1089447 1059541 1025956 989062 949476 908274 867055 827390 790014 754735
63383 754735 721287 690223 662714 639455 620007 603419 589291 577918 569523 563819 560481 559630
63371 559630 561491 565811 571965 579635 589105 600933 615525 632946 652811 674352 696951 720828
63359 720828 746993 776327 808758 843411 879440 916595 955060 994864 1035405 1075448 1113468
63348A113468L4464K9339K2689J5111P814J813k788o443r299j1140j2123j3050
63336A169855j4674j7136k0127k3320k6403k9074l1381l3758l6374l8545l9196
63325H59867l7983l5545l2622k9220k4959k0019j5383j2022j0098r143q880r581
63313F14412j1496j4275j7082j9229k0463k0767k0156j8738j6774j4518j2144
63302D28770r817p791o341n607n470n554n452n046m563m204l880l375k692k017
63288C56961j497j228j341j862k496k840k754k340j713j038o60p69j039r82o30
63273C33772m10m16l57k01k54m37j85O09J194R82M64N17J208J898K234K420K612
63256C45650K668K557K534K796L250L681L966M121M310M676N111N337N404N774
$$ plain form
63348 1113468 1147932 1177271 1199960 1215071 1222885 1224698 1221910 1215467 1206168 1195028 1182905 1169855
63336 1169855 1155181 1138045 1117918 1094598 1068195 1039121 1007740 973982 937608 899063 859867
63325 859867 821884 786339 753717 724497 699538 679519 664136 652114 642016 632873 623993 614412
63313 614412 602916 588641 571559 552330 531867 511100 490944 472206 455432 440914 428770
63302 428770 418953 411162 404821 399214 393744 388190 382738 377692 373129 368925 365045 361670 358978 356961
63288 356961 355464 354236 352895 351033 348537 345697 342943 340603 338890 337852 337192 336423 335384 334402 333772
63273 333772 333362 332946 332589 332388 332134 331697 331512 332121 333315 334297 334761 335278 336486 338384 340618 343038 345650
63256 345650 348318 350875 353409 356205 359455 363136 367102 371223 375533 380209 385320 390657 396061 401835
63242D01835O702P846Q774R504J0242J0959J1670J2687J4056J5141J5440J5511
63230E40367J6303J7762J8924J9313J9364J9434J9288J8806J8397J8351J8489
63219G44798J8732J9305K0032K0085J8971J7227J5634J4185J2378J0044P364M381
63207I23136J034k546o240j0157j4187j7621j9747k0623k0726k0120j8555j6259
63195G57389j3930j1844r530o591l306j96K765O106J0120J4404J8145K0882K2908
63182H07322K4834K6830K8515K9623L0418L1210L1840L2009L1837L1612L1144
63171A137194K9948K8113K6360K5008K3302K0182J5490J0108M916n3n485j1919
63159A303164j9192k6587l3315l8819m2847m5518m7289m8487m8849m7787m5275
$$ plain form
63242 401835 408537 416383 425157 434661 444903 455862 467532 480219 494275 509416 524856 540367
63230 540367 556670 574432 593356 612669 632033 651467 670755 689561 707958 726309 744798
63219 744798 763530 782835 802867 822952 841923 859150 874784 888969 901347 911391 918755 923136
63207 923136 924170 921624 915384 905227 891040 873419 853672 833049 812323 792203 773648 757389
63195 757389 743459 731615 722085 715494 712188 711992 714757 720863 730983 745387 763532 784414 807322
63182 807322 832156 858986 887501 917124 947542 978752 1010592 1042601 1074438 1106050 1137194
63171 1137194 1167142 1195255 1221615 1246623 1269925 1290107 1305597 1315705 1320621 1320568 1315083 1303164
63159 1303164 1283972 1257385 1224070 1185251 1142404 1096886 1049597 1001110 952261 904474 859199
63148H59199m2063l8870l5707l2316k8858k5718k2899k0107j7347j4854j2660
63137E67800j0724r394r034r145q537o758m699l445k960k404j349j24Q68J640
63123E01735K340K894L070K738K099J687J992K923L782M056M004M201M611M606
63109E46738L907K985K390K044J567J008P61Q53Q09L79j9J47P70J281J401J301
63093E68322J082O55J85J57O22Q24J31r81j428q78j5N33Q84J370K006K744L728
63076E79941M796N306M974M493M724N546O194O553P239Q413R307R402R372J0314
63062F76574J2418J4872J6859J8218J9257K0471K2311K4846K7575K9859L1617
63051I14877L3367L5579L8215M0883M3211M5074M6646M8183M9538N0015M9121
$$ plain form
63148 859199 817136 778266 742559 710243 681385 655667 632768 612661 595314 580460 567800
63137 567800 557076 547682 538648 529503 520966 514208 509509 506064 503104 500700 499351 499227 500095 501735
63123 501735 504075 506969 510039 512777 514876 516563 518555 521478 525260 529316 533320 537521 542132 546738
63109 546738 550645 553630 556020 558064 559631 560639 561400 562253 563062 563441 563422 563569 564339 565620 567021 568322
63093 568322 569404 570059 570244 570401 571023 571847 571978 570997 569569 568691 568676 569209 570093 571463 573469 576213 579941
63076 579941 584737 590043 595017 599510 604234 609780 615974 622527 629766 638179 647486 656888 666260 676574
63062 676574 688992 703864 720723 738941 758198 778669 800980 825826 853401 883260 914877
63051 914877 948244 983823 1022038 1062921 1106132 1151206 1197852 1246035 1295573 1345588 1394709
63040A394709M7402M6064M5724M5970M6244M6502M6689M6260M4802M2678M0276
63029A893320L6946L1599K4327J6494R005J337p296j6560k5410l3246l9963m5205
63017A845348m8401m9531m9168m7686m4969m0980l6022l0306k3729j6297q434
63006A449825o22O939J4148K0902K7347L3814M0186M5685M9727N2659N5211N7398
62994A853219N8558N8440N7685N7188N7258N7458N6922N4890N1411M7412M3615
62983B454056L9248L2575K2957J1704M35j0818k3084l6512m9848o1811p2053q0630
62971B226219q7291r1761r4144r4594r2950q9186q3921p8098p2285o6617o1166
62960A314206n6028n1138m6405m1942l7958l4576l1966l0357k9546k8746k7341
$$ plain form
63040 1394709 1442111 1488175 1533899 1579869 1626113 1672615 1719304 1765564 1810366 1853044 1893320
63029 1893320 1930266 1961865 1986192 2002686 2011691 2013028 2005732 1989172 1963762 1930516 1890553 1845348
63017 1845348 1796947 1747416 1698248 1650562 1605593 1564613 1528591 1498285 1474556 1458259 1449825
63006 1449825 1449203 1456142 1470290 1491192 1518539 1552353 1592539 1638224 1687951 1740610 1795821 1853219
62994 1853219 1911777 1970217 2027902 2085090 2142348 2199806 2256728 2311618 2363029 2410441 2454056
62983 2454056 2493304 2525879 2548836 2560540 2560975 2550157 2527073 2490561 2440713 2378902 2306849 2226219
62971 2226219 2138928 2047167 1953023 1858429 1765479 1676293 1592372 1514274 1441989 1375372 1314206
62960 1314206 1258178 1207040 1160635 1118693 1080735 1046159 1014193 983836 954290 925544 898203
62949H98203k5612k4188k3032k1634k0075j9027j8622j8095j6871j5291j3926
62938F81830j2767j1587j0536r788r028p916o710n877n335m709m029l575l205
62925E86768k640k226k627l604l980l151j945j569k141k766k691j912q98k15l51
62910E54052j368k690l487l501l237l281l636l858l787l729l901l887l133j886
62896E08671j140j395j872j405R5J538J860R44n78j868k203j368P2J230J727J823
62880E06131J745J430R57O28M24J7m67m08K10M63j83q87o69j7k43j526k732l080
62862E01793k909k628k026j020j72J95N99J426K012J552N06J17O62J080N06n60
62846E01133j037o73j96k84q71j464j785j907j912j725j340j015j010j224j303
$$ plain form
62949 898203 872591 848403 825371 803737 783662 764635 746013 727918 711047 695756 681830
62938 681830 669063 657476 646940 637152 628124 620208 613498 607621 602286 597577 593548 589973 586768
62925 586768 584128 581902 579275 575671 571691 568540 566595 565026 562885 560119 557428 555516 554618 554403 554052
62910 554052 552684 549994 546507 543006 539769 536488 532852 528994 525207 521478 517577 513690 510557 508671
62896 508671 507531 506136 504264 502859 502954 504492 506352 507296 506718 504850 502647 501279 501351 502581 504308 506131
62880 506131 507876 509306 510263 510891 511315 511332 510865 510457 510667 511130 510947 510060 509391 509374 509131 507605 504873 501793
62862 501793 498884 496256 494230 493210 493038 493233 493832 495258 497270 498822 499328 499445 500107 501187 501693 501133
62846 501133 500096 499423 499227 498943 498072 496608 494823 492916 491004 489279 487939 486924 485914 484690 483387
62831D83387j119q51o49m90m32n85o97k23Q73J775J729J110R85J759K753L137
62815D92462K805K278K088K473L235L835L895L725L945M588N007M871M712N092
62801E45011N705N886N707N930O920Q192R083R493R825J0521J1788J3536J5480
62788F63077J7440J9503K1784K4137K6450K9100L2661L7194M2201M7362N2729
62777A013638N8057O2518O5550O7536O9142P0199O9860O7666O3862N8638N1701
62766A718367M2932L2954K2524J1646j54j2656k4552l4581m2729m9879n6408o1684
62754A545780o5032o6638o7121o6634o4969o2385n9539n6575n2977m8588m4138
62743H91184m0341l6986l3405k9514k5838k2741k0222j8215j6615j5035j3121
$$ plain form
62831 483387 482268 481417 480768 480278 479846 479261 478564 478341 479214 480989 482718 483828 484813 486572 489325 492462
62815 492462 495267 497545 499633 502106 505341 509176 513071 516796 520741 525329 530336 535207 539919 545011
62801 545011 550716 556602 562309 568239 575159 583351 592434 601927 611752 622273 634061 647597 663077
62788 663077 680517 700020 721804 745941 772391 801491 834152 871346 913547 960909 1013638
62777 1013638 1071695 1134213 1199763 1267299 1336441 1406640 1476500 1544166 1608028 1666666 1718367
62766 1718367 1761299 1794253 1816777 1828423 1828269 1815613 1791061 1756480 1713751 1663872 1607464 1545780
62754 1545780 1480748 1414110 1346989 1280355 1215386 1153001 1093462 1036887 983910 935322 891184
62743 891184 850843 813857 780452 750938 725100 702359 682137 663922 647307 632272 619151
62732F19151j1039r219p671o039m266k625j135M03J735K253K025K097L326N419
62718E94415P511R230J0724J2058J3182J4363J6039J8296K0853K3573K6616L0132
62706G96992L4105L8470M3212M8327N3816N9641O5575P1319P6873Q2519Q8228
62695A459077R3392R7535J00894J03838J05845J05694J02604R6668Q8147P7005
62685B430699O3327M7632L0441J1903p697k7366m5772o2097p6248q8200r7581
62674B179041j03981j07526j08814j08288j05891j01525r5769q9731q4038p8373
62664A195105p2244o5873n9857n4222m8505m2759l7760l4011l1108k8449k5976
62653F94341k3824k1675j9169j6628j4815j3896j3285j2458j1485j0629r902r231
$$ plain form
62732 619151 608112 598893 591222 585183 580917 578292 577157 577560 579295 581548 583573 585670 588996 594415
62718 594415 601926 611156 621880 633938 647120 661483 677522 695818 716671 740244 766860 796992
62706 796992 831097 869567 912779 961106 1014922 1074563 1140138 1211457 1288330 1370849 1459077
62695 1459077 1552469 1650004 1750898 1854736 1960581 2066275 2168879 2265547 2353694 2430699
62685 2430699 2494026 2541658 2572099 2584002 2576305 2548939 2503167 2441070 2364822 2276622 2179041
62674 2179041 2075060 1967534 1858720 1750432 1644541 1543016 1447247 1357516 1273478 1195105
62664 1195105 1122861 1056988 997131 942909 894404 851645 813885 779874 748766 720317 694341
62653 694341 670517 648842 629673 613045 598230 584334 571049 558591 547106 536477 526575 517344
62641E17344q642q011p013n566m125l181k644k092j496j272j588k011k060j786
62627D65857j544j486j533j749k255k824k948k399j424k84R99K217K755K336J669
62612D57387J745K596L347L553L783M600N640O262O635P535R224J1143J2729J3982
62598E50161J5170J6392J7662J9080K0805K2994K5811K9098L2102L3850L4039
62587H17164L3176L1750K9675K6699K2929J8539J3429P614J642l933r251j4683
62575I74750j9837k3797k6415k8546l0685l2133l2045l0692k9071k7581k5819
62564F68129k3579k1317j9515j8105j6686j4989j2973j0828q990p851p257o536
62552D99503n235l668k610k532l135l569l122j900p24k01k6M95J408K124K404
$$ plain form
62641 517344 508702 500691 493678 488112 483987 480806 478162 476070 474574 473302 471714 469703 467643 465857
62627 465857 464313 462827 461294 459545 457290 454466 451518 449119 447695 447411 448410 450627 453382 455718 457387
62612 457387 459132 461728 465075 468628 472411 477011 482651 488913 495548 503083 512307 523450 536179 550161
62598 550161 565331 581723 599385 618465 639270 662264 688075 717173 749275 783125 817164
62587 817164 850340 882090 911765 938464 961393 979932 993361 1000975 1002617 998684 989433 974750
62575 974750 954913 931116 904701 876155 845470 813337 781292 750600 721529 693948 668129
62564 668129 644550 623233 603718 585613 568927 553938 540965 530137 521147 513296 506039 499503
62552 499503 494268 490600 487990 485458 482323 478754 475632 473732 473008 472807 472781 473276 474684 476808 479212
62537D79212K654L113L386L131K730K767L242L779M258M857N701P015R162J2039
62523E47046J4690J6304J7421J9327K2331K5509K8335L1641L6308M1693M6225
62512H46830M9270N1710N4545N7518N9469N9678N8496N6566N3804M9426M2918
62501A440230L4579K5020J4579L555p308j7073k5244l1775l6594l9603m1021m1164
62489A278181l9853l6705l2095k7173k2654j8164j3155p909l103J250N777J0721
62477A095118J5389J8629J9727J8900J7030J4801J2072Q313L569j502o631j2233
62465A203182j8472k4644l0024l4678l8817m1869m3093m2783m2024m1263l9958
62454H05557l7624l4508l1140k7805k4709k1974j9312j6216j2684r332o581m226
$$ plain form
62537 479212 481866 484979 488365 491496 494226 496993 500235 504014 508272 513129 518830 525845 535007 547046
62523 547046 561736 578040 595461 614788 637119 662628 690963 722604 758912 800605 846830
62512 846830 896100 947810 1002355 1059873 1119342 1179020 1237516 1294082 1347886 1397312 1440230
62501 1440230 1474809 1499829 1514408 1517963 1510655 1493582 1468338 1436563 1399969 1360366 1319345 1278181
62489 1278181 1238328 1201623 1169528 1142355 1119701 1101537 1088382 1080473 1077370 1078620 1084397 1095118
62477 1095118 1110507 1129136 1148863 1167763 1184793 1199594 1211666 1219979 1223548 1222046 1215415 1203182
62465 1203182 1184710 1160066 1130042 1095364 1056547 1014678 971585 928802 886778 845515 805557
62454 805557 767933 733425 702285 674480 649771 627797 608485 592269 579585 570253 563672 559446
62442E59446j959J59J958L449M624N354N756O175O514O115M712L054K005J349
62428F08711Q9k209m916p172q681r627j0280j0868j1483j1859j1481j0193q573
62415E01458p485p209p185o706n732m860m465m176l390k156j184j022j539k291
62401D42058k978l375l129k008l33J164J949K082K030K170K463K578K356K143
62387D49170K452L289M012L992L275K504K318K958M224N616O633P173P595Q317
62373E13528R391J0627J1926J3293J4610J5579J6019J6091J6321J7345J9473K2454
62361F96657K5771K9248L3097L7302M1340M4862M8372N2667N7584O1818O4115
62350A192833O4318O3033O0529N6352M9909M1224L1095K0729J1116K567n301j2983
$$ plain form
62442 559446 557487 557646 559604 563053 567677 573031 578787 584962 591476 597591 602303 605357 607362 608711
62428 608711 608800 606591 601675 594503 585822 576195 565915 555047 543564 531705 520224 510031 501458
62415 501458 493973 486764 479579 472873 467141 462281 457816 453640 450250 448094 446910 445888 444349 442058
62401 442058 439080 435705 432576 430568 430235 431399 433348 435430 437460 439630 442093 444671 447027 449170
62387 449170 451622 454911 458923 462915 466190 468694 471012 473970 478194 483810 490443 497616 505211 513528
62373 513528 522919 533546 545472 558765 573375 588954 604973 621064 637385 654730 674203 696657
62361 696657 722428 751676 784773 822075 863415 908277 956649 1009316 1066900 1128718 1192833
62350 1192833 1257151 1320184 1380713 1437065 1486974 1528198 1559293 1580022 1591138 1593705 1588404 1575421
62338A575421k0465k7249l3041l8135m2905m6993m9424m9632m8155m6046m3814
62327A129562m1190l7782l3651k9295k5399k2609k1191k0816k0901k1259k2107
62316H33362k3364k4346k4379k3509k2318k1268k0411j9626j8850j8056j7134
62305F00101j5793j3715j1037q604p242o714n863m110k296j552j729j701r82l11
62291E18452m76j192j480p95N33J775K489K781L089L649M252M530M446M304M363
62276E50720M612M916N202N500N937O640P538Q392R207J0371J2156J4219J6035
62263F61445J7676J9760K2640K6048K9636L3474L7833M2798M8188N3579N8378
62252A051455O2143O4932O7006O8059O7145O3553N7513M9807M1018L1381K1134
$$ plain form
62338 1575421 1554956 1527707 1494666 1456531 1413626 1366633 1317209 1267577 1219422 1173376 1129562
62327 1129562 1088372 1050590 1016939 987644 962245 939636 918445 897629 876728 855469 833362
62316 833362 809998 785652 761273 737764 715446 694178 673767 654141 635291 617235 600101
62305 600101 584308 570593 559556 550952 543710 536996 531133 527023 524727 523175 521446 519745 518763 518452
62291 518452 517976 516784 515304 514509 515042 516817 519306 522087 525176 528825 533077 537607 542053 546357 550720
62276 550720 555332 560248 565450 570950 576887 583527 591065 599457 608664 619035 631191 645410 661445
62263 661445 679121 698881 721521 747569 777205 810679 848512 891310 939498 993077 1051455
62252 1051455 1113598 1178530 1245536 1313595 1380740 1444293 1501806 1551613 1592631 1624012 1645146
62241A645146J0685M44r389j8881k8184l7137m5130n1627n6771o1074o4466o6199
62229A217417o5820o3746o0606n6553n1659m6444m1435l6507l1393k6608k3077
62218G13569k0774j8558j5681j2869j1329j1029j0564q775o046l733k568k008
62206E89635j112L67J978L379M623N733O538P109P855Q852R511R317Q621Q233
62192F70639Q455Q968R412R545R018P662N985M777M136L583L127L385M290M580
62178G57562L369J594J025K076L565M516N301O683Q671J0903J3560J7147K1572
62165H57544K6107L0311L4430L8697M2716M5765M7426M7557M5919M2284L6910
62154A295666L0525K3727J6681R532K708l494r437j5735k2351k8423l3177l6630
$$ plain form
62241 1645146 1655831 1656275 1646886 1628005 1599821 1562684 1517554 1465927 1409156 1348082 1283616 1217417
62229 1217417 1151597 1087851 1027245 970692 919033 872589 831154 794647 763254 736646 713569
62218 713569 692795 674237 658556 645687 634358 623329 612765 603990 597944 594211 591643 589635
62206 589635 588523 588890 590868 594247 598870 604603 611141 618250 626105 634957 644468 653785 662406 670639
62192 670639 679094 688062 697474 707019 716037 723699 729684 734461 738597 742180 745307 748692 752982 757562
62178 757562 760931 762525 763550 765626 769191 773707 779008 785691 794362 805265 818825 835972 857544
62165 857544 883651 913962 948392 987089 1029805 1075570 1122996 1170553 1216472 1258756 1295666
62154 1295666 1326191 1349918 1366599 1376131 1378839 1375345 1365908 1350173 1327822 1299399 1266222 1229592
62142A229592l9196m0913m1449m0709l9039l6762l3835l0129k5841k1519j7710
62131H62490j4661j2246j0130q092o261m961m275l899l506l038k557j926r12M83
62117G86509J980L238L982M000L319K307J330L06j073k627l624l681l398l719
62103G88849m859o241p368q229q857q916q118o704n177l710k088k62J447K810
62089G22577M058N502P006Q152Q915R760J0979J2267J3250J4076J5194J6688J8332
62076H66756K0095K2116K4139K5557K6229K6715K7445K8084K8143K7804K7725
62065A150808K8180K8916K9722L0672L1777L2783L3349L3252L2394L0771K8275
62054A490899K4556J9359J3260P533K820j675p128j3507j9812k5589l1286l7057
$$ plain form
62142 1229592 1190396 1149483 1108034 1067325 1028286 991524 957689 927560 901719 880200 862490
62131 862490 847829 835583 825453 817361 811100 806139 801864 797965 794459 791421 788864 786938 786026 786509
62117 786509 788489 791727 795709 799709 803028 805335 806665 806971 805898 803271 799647 795966 792568 788849
62103 788849 783990 777749 770381 762152 753295 744379 736261 729557 724380 720670 718582 718320 719767 722577
62089 722577 726635 732137 739143 747295 756210 765970 776949 789216 802466 816542 831736 848424 866756
62076 866756 886851 908967 933106 958663 984892 1011607 1039052 1067136 1095279 1123083 1150808
62065 1150808 1178988 1207904 1237626 1268298 1300075 1332858 1366207 1399459 1431853 1462624 1490899
62054 1490899 1515455 1534814 1548074 1555607 1558427 1556752 1549624 1536117 1516305 1490716 1459430 1422373
62042A422373m2217m6236m9420n2080n3666n3416n1500m8897m6373m4057m1825
62031H92686l9552l6978l3814l0160k6616k3864k2077k0718j8980j6598j4185
62020F09144j2541j1659j0831r713q809q687r150r440r023p952o745o056o089
62007D92449o163n243l210j186k85l37k02R36K881M761N702N402M388L487K933
61992E06313K226J070n9n87o83r87j767k750l573m041m188m366m972n799o103
61977D69734n534m604l832l005j821o80k02k93l72k23l5P4L1l27q10p52M2P36
61959D48127O11K18M63J126J352J192J377J869J921J506J350J571J657J863L191
61944D69394N640P859R012R701J0591J1450J2130J3180J4649J5522J5305J4968
$$ plain form
62042 1422373 1380156 1333920 1284500 1232420 1178754 1125338 1073838 1024941 978568 934511 892686
62031 892686 853134 816156 782342 752182 725566 701702 679625 658907 639927 623329 609144
62020 609144 596603 584944 574113 564400 555591 546904 537754 528314 519291 511339 504594 498538 492449
62007 492449 486286 481043 477833 476647 476362 476025 475823 476759 479640 484401 490103 495505 499893 503380 506313
61992 506313 508539 509609 509550 508963 508280 507293 505526 502776 499203 495162 490974 486608 481636 475837 469734
61977 469734 464200 459596 455764 452759 450938 450258 450056 449763 449391 449168 449133 449207 449238 448911 448101 447349 447391 448127
61959 448127 448738 448956 449419 450545 451897 453089 454466 456335 458256 459762 461112 462683 464340 466203 469394
61944 469394 475034 482893 491905 501606 512197 523647 535777 548957 563606 579128 594433 609401
61932F09401J5372J5794J5210J4040J3283J2759J1607R970Q666P564N778L364
61920G42808J396K33j017k984n102o526p042o686n278k869j02K375M495O483Q357
61905G28541R957J1169J1880J1899J1099R524P317M728K055o07l423o376q971
61892G88792j0778j2009j3127j4065j4302j3667j2614j1695j1175j1091j1241
61881F53028j1184j0644r924r557r629r800r855r790r466q644p443o265n308m431
61867E31088l535k690j925j159l39O65K095L912N648P005Q378J0243J2314J3933
61853E85633J5070J6289J7827J9445K1126K3139K5306K6957K7778K8052K7855
61842H34477K6723K4421K1418J8212J4733J0767O613K877j40k545m519o072o983
$$ plain form
61932 609401 624773 640567 655777 669817 683100 695859 707466 717436 726102 733666 739444 742808
61920 742808 744204 744437 743420 740436 735334 728808 721766 715080 709802 706933 706831 709206 713701 720184 728541
61905 728541 738498 749667 761547 773446 784545 794069 801386 806114 808169 807562 804139 797763 788792
61892 788792 778014 766005 752878 738813 724511 710844 698230 686535 675360 664269 653028
61881 653028 641844 631200 621276 611719 602090 592290 582435 572645 563179 554535 547092 540827 535519 531088
61867 531088 527553 524863 522938 521779 521440 522105 524200 528112 533760 540765 549143 559386 571700 585633
61853 585633 600703 616992 634819 654264 675390 698529 723835 750792 778570 806622 834477
61842 834477 861200 885621 907039 925251 939984 950751 957364 960241 960101 957556 953037 946965 939982
61829I39982o962o009m539k873p80K006M997P274Q558R250R414Q472O102K789
61815I77681q58m713q838j3097j7322k1325k4545k6321k6838k7140k7760k7918
61803G51006k6572k3803k0688j8191j6580j5600j4694j3373j1644r967q642p648
61791E63604p073p067p159o468m945l716l604m035l987l417k958k779k566k255
61777E01575j980j587r30m09m91r24j100r45p64n44j14K30R0k07kO14R49R08J104
61758D95473J723K177K097J862J877K018K109K317K704K885K470J520L73o51j293
61743E19661j513j683k177k758k871k607k617k989k939k003q69m97q75j135n98
61728D91530O50J958K569K193J400J133J626K187K249K113K219K319J907J197
$$ plain form
61829 939982 933020 927011 922472 919599 918819 920825 925822 933096 941654 950904 960318 968790 974892 977681
61815 977681 976823 972110 963272 950175 932853 911528 886983 860662 833824 806684 778924 751006
61803 751006 724434 700631 679943 661752 645172 629572 614878 601505 589861 579894 571252 563604
61791 563604 556531 549464 542305 535837 530892 527176 523572 519537 515550 512133 509175 506396 503830 501575
61777 501575 499595 498008 497078 496669 496178 495254 494154 493209 492445 491901 491787 492017 492107 491900 491898 492512 493461 494369 495473
61758 495473 497196 499373 501470 503332 505209 507227 509336 511653 514357 517242 519712 521232 521605 520954 519661
61743 519661 518148 516465 514288 511530 508659 506052 503435 500446 497507 495504 494635 494138 493263 492128 491530
61728 491530 492180 494138 496707 498900 500300 501433 503059 505246 507495 509608 511827 514146 516053 517250
61714E17250Q99J229J727K024K164K118J491M8j747k998l213k749k426k644l041
61699E10132l129l089l554m575n310n006l905k815k175j934k057k595l304l686
61685D62998l509l001k495k155j999j988j990j933j975k306k777k935k535j872
61671D29528j498j671k099k225j867j427j378j620j657j387j239j372j256n01
61657D08331L86P03O42R72J749K157J772J206J160J462J527J340J435K029K731
61642D29602L015K701J994J351J209J567J849J495O49l9k90n41j303k472l455
61627D37332l801l532k980k554k531k885l258l274k872k257j609j026o74p22j105
61612D02252j532j844k129k475k860l342m064m837n112m689m115l977m037l648
$$ plain form
61714 517250 518149 519378 521105 523129 525293 527411 528902 528950 527203 524205 520992 518243 515817 513173 510132
61699 510132 507003 503914 500360 495785 490475 485469 481564 478749 476574 474640 472583 469988 466684 462998
61685 462998 459489 456488 453993 451838 449839 447851 445861 443928 441953 439647 436870 433935 431400 429528
61671 429528 428030 426359 424260 422035 420168 418741 417363 415743 414086 412699 411460 410088 408832 408331
61657 408331 408717 409420 410062 411034 412783 414940 416712 417918 419078 420540 422067 423407 424842 426871 429602
61642 429602 432617 435318 437312 438663 439872 441439 443288 444783 445432 445393 445103 444562 443259 440787 437332
61627 437332 433531 429999 427019 424465 421934 419049 415791 412517 409645 407388 405779 404753 404079 403357 402252
61612 402252 400720 398876 396747 394272 391412 388070 384006 379169 374057 369368 365253 361276 357239 353591
61598C53591k861k413k610k925k979l120l636m000l577k629j974j898k106k482
61584C14381l092l508k991j604m41l38q86j116p47l01l22q50j498j678r55M15
61568B94469J456J323J98r85j536j438q88L6J147J919J863J010q6q02r09o21k53
61551B95903J45P56J526K033J998J757J821K063J821R15R3J17P79J236J130Q68
61535C14961Q52R66R67R45J072J208J064O99M26K79n7p21j314j351q80n09p38
61518C17869j433j892j464j44J321K025J639N75n81j511j985j709p38J47R8p03
61502C11514j139n61L07K53r27k192k413j468k06M50L52J57N06J175J359Q64M91
61485C08522Q96J523J273M9j069j186n18J83N82Q34J136J553K016K305K220J853
$$ plain form
61598 353591 350730 348317 345707 342782 339803 336683 333047 329047 325470 322841 320867 318969 316863 314381
61584 314381 311289 307781 304790 303186 302745 302407 301521 300405 299658 299357 299035 298185 296687 295009 294054 294469
61568 294469 295925 297248 297446 296461 294925 293487 292599 292635 293782 295701 297564 298574 298488 297686 296777 296156 295903
61551 295903 296048 296804 298330 300363 302361 304118 305939 308002 309823 310738 310831 310948 311727 312963 314093 314961
61535 314961 315813 316779 317746 318691 319763 320971 322035 322734 323160 323439 323382 322661 321347 319996 319116 318607 317869
61518 317869 316436 314544 313080 312936 314257 316282 317921 318496 317915 316404 314419 312710 311972 312119 312217 311514
61502 311514 310375 309814 310121 310374 309447 307255 304842 303374 303168 303618 303970 304127 304633 305808 307167 308031 308522
61485 308522 309418 310941 312214 312263 311194 310008 309490 309673 310255 311089 312225 313778 315794 318099 320319 322172
61469C22172J495J198P86L46J89K13j11q35j161n04N40Q94L86j30O8Q35J486J458
61451C29325P49P5L29J467K164J242o98j858j386j72N86P96J044J538K085K604
61435C39890L069L120K421J341Q34J442K642L265K557R12m64o97m6O00Q20R21
61419C62627J157J359J482J943K960L965M193L617K798K000J033j42j092j392
61405C86508j137q79j135j891k479k134q86K80M43k23q43j034j206j693k156k087
61389C67448j507q06j57N77J422K104K300J947J276O45L67N67J018J245R42L21
61373C79709q5m9J74L48O56J279J868J877J378R91J044J341J754K407L063L042
61357D00797K224J537J838K756L310L323L510M321N437O383P013P311P239O889
$$ plain form
61469 322172 323667 324865 325651 325997 326186 326399 326288 325453 324292 323788 324328 325222 325608 325478 325546 326381 327867 329325
61451 329325 330074 330149 330478 331945 334109 335351 334653 332795 331409 331237 331823 332619 333663 335201 337286 339890
61435 339890 342959 346079 348500 349841 350675 352117 354759 358024 360581 361493 361029 360332 360286 360886 361706 362627
61419 362627 363784 365143 366625 368568 371528 375493 379686 383303 386101 388101 389134 388992 387900 386508
61405 386508 385371 384492 383357 381466 378987 376853 375967 376247 376690 376467 375624 374590 373384 371691 369535 367448
61389 367448 365941 365135 364978 365555 366977 369081 371381 373328 374604 375249 375616 376183 377201 378446 379388 379709
61373 379709 379624 379575 379749 380097 380753 382032 383900 385777 387155 388146 389190 390531 392285 394692 397755 400797
61357 400797 403021 404558 406396 409152 412462 415785 419295 423616 429053 435436 442449 449760 456999 463888
61343D63888O388N689M794M076L882L901L550K958K870L519M192M254L942L767
61329E21670L629L005J750L25o76j004q78p77j018j436j630j416q23K02J666L183
61313E25772M284N088O086P282Q161Q634R343J0700J2319J3710J4842J5619J5504
61300F57344J4230J2347J0473Q482O042L408R84j362l771n618o316o518p429r022
61286F73274j0067j0011r670r757r852r375q692q397q159p198n514l882k797k086
61272E67817j514j096p46j45P92J643J938J750J717K349L429M187M237M147M732
61257E95237N913O782O889O799P013O988N954M201K785K100J682J328J508K316
61243F57495K948K643J582L24r80k230k836k367j464j149j400j232k65P94J417
$$ plain form
61343 463888 470276 475965 480759 484835 488717 492618 496168 499126 501996 505515 509707 513961 517903 521670
61329 521670 525299 528304 530054 530379 529703 528699 527821 527044 526026 524590 522960 521544 520721 520923 522589 525772
61313 525772 530056 535144 541230 548512 556673 565307 574650 585350 597669 611379 626221 641840 657344
61300 657344 671574 683921 694394 702876 708918 712326 713310 711948 708177 702559 696243 689725 682296 673274
61286 673274 663207 653196 643526 633769 623917 614542 605850 597453 589294 582096 576582 572700 569903 567817
61272 567817 566303 565207 564461 564316 565108 566751 568689 570439 572156 574505 577934 582121 586358 590505 595237
61257 595237 601150 607932 614821 621620 628633 635621 641575 645776 648561 650661 652343 653671 655179 657495
61243 657495 660443 663086 664668 664992 664012 661782 658946 656579 655115 653966 652566 651334 651069 651863 653280
61228F53280K169L734N705P019P256O934O698O791P187P754Q300Q784R360R975
61214G50946J0083R268P934O899O367N835N032M320M012L832L444L136L483M516
61200H29107N630O325O769P485Q639R869J0852J1810J3210J4911J6107J6197J5320
61187I72231J3760J1337Q011M695K588J746J090q3j415k467l535m945o228o761
61173I90024o813p255q350r472r993j0058j0328j1208j2386j3137j3182j3163
61161H64679j3906j5207j5917j5445j4531j4110j4006j3411j2211j0981r876q461
61149G06617o660n127m317l865l238k632k715l646m768n332n302n235n402n370
61135F43008m696l753l235k928j793L84K363L171L712N571Q633J1182J2347J3126
$$ plain form
61228 653280 655449 659183 664888 671907 679163 686097 692795 699586 706773 714527 722827 731611 740971 750946
61214 750946 761029 770297 778231 785130 791497 797332 802364 806684 810696 814528 817972 821108 824591 829107
61200 829107 834737 841062 847831 855316 863955 873824 884676 896486 909696 924607 940714 956911 972231
61187 972231 985991 997328 1005339 1010034 1012622 1014368 1015458 1015375 1013960 1011493 1007958 1003013 996785 990024
61173 990024 983211 975956 967606 958134 948141 938083 927755 916547 904161 891024 877842 864679
61161 864679 850773 835566 819649 804204 789673 775563 761557 748146 735935 724954 715078 706617
61149 706617 699957 694830 690513 686648 683410 680778 678063 674417 669649 664317 659015 653780 648378 643008
61135 643008 638312 634559 631324 628396 626603 626987 629350 632521 636233 641804 650437 661619 673966 687092
61121F87092J4683J6755J8499J9947K1762K4020K6122K7711K8909K9869L0623
61110I45992L1308L1885L1762L0408K8327K6748K6090K5360K3424K0372J7080
61099A238756J3850J0212N982J711k184o096j0542j5156j8998k1665k3566k5158
61087A147146k6517k7688k8819k9689k9694k8736k7577k6894k6322k5055k3081
61076H47074k1241k0074j9234j8070j6293j4037j1681r692q314p272o029m337
61064F90800k388n20R09J528J322R68J344K641M289N785P093Q297R296J0121J1049
61049G52534J2219J3486J4815J6491J8641K0866K2678K4094K5576K7454K9614
61038I78468L1697L3495L5147L6964L9042M1151M3072M4834M6551M8268N0164
$$ plain form
61121 687092 701775 718530 737029 756976 778738 802758 828880 856591 885500 915369 945992
61110 945992 977300 1009185 1040947 1071355 1099682 1126430 1152520 1177880 1201304 1221676 1238756
61099 1238756 1252606 1262818 1268800 1270511 1268327 1262231 1251689 1236533 1217535 1195870 1172304 1147146
61087 1147146 1120629 1092941 1064122 1034433 1004739 976003 948426 921532 895210 870155 847074
61076 847074 825833 805759 786525 768455 752162 738125 726444 716752 708438 701166 695137 690800
61064 690800 688412 687892 688801 690329 691651 692619 693963 696604 700893 706678 713771 722068 731364 741485 752534
61049 752534 764753 778239 793054 809545 828186 849052 871730 895824 921400 948854 978468
61038 978468 1010165 1043660 1078807 1115771 1154813 1195964 1239036 1283870 1330421 1378689 1428853
61027A428853N2525N5195N7401N8657N9564O1231O4215O8610P4702Q2744R2281
61016B155978J02701J14376J28411J45442J65767J90527K21352K58813L02647
61007C786014L53840M15109M89127N78096O85073Q13104R62602J133377J329982
60998A0546324J555899J790925J975156K030509J912843J645906J301134R46501
60990B3705197O19583L43641J48622N7011M7814M8810k2032k02762m72478p82319
60980B3491087j093275j384791j638431j826052j918522j903639j794066j619939
60972A0312372j415064j206828j012781q41696o96222n75430m76671l96701l32310
60963C358669k80565k38985k05688j79225j58077j40407j24638j10256r7668q7146
$$ plain form
61027 1428853 1481378 1536573 1593974 1652631 1712195 1773426 1837641 1906251 1980953 2063697 2155978
61016 2155978 2258679 2373055 2501466 2646908 2812675 3003202 3224554 3483367 3786014
61007 3786014 4139854 4554963 5044090 5622186 6307259 7120363 8082965 9216342 10546324
60998 10546324 12102223 13893148 15868304 17898813 19811656 21457562 22758696 23705197
60990 23705197 24324780 24668421 24817043 24874054 24921868 24970678 24948646 24745884 24273406 23491087
60980 23491087 22397812 21013021 19374590 17548538 15630016 13726377 11932311 10312372
60972 10312372 8897308 7690480 6677699 5836003 5139781 4564351 4087680 3690979 3358669
60963 3358669 3078104 2839119 2633431 2454206 2296129 2155722 2031084 1920828 1823160 1736014
60953A736014p8097o9500o0876n2695m5886m0938l7477l4680l2183l0356k9525
60942A223801k9087k7848k5254k2027j9392j7912j7228j6745j6187j5496j4480
60931A002145j2952j1207r969r568r374q465o781n139m134l566l072k694k440
60918I12784j917q63L86J437K404L335L647K958K117K366L613M535M430L958L781
60903I48971L560K812J879J357J127O77n8p56j311j850k458l220m288n433o002
60888I35007n789n597o359p952r522j0632j1415j1847j1725j1315j1193j1326
60876H20335j1138j0652j0677j1456j1998j1344r921q830q331p863p285p105p329
60863F96406p101n817m014k645k004j836k031k638l385l831m011m388n087n643
$$ plain form
60953 1736014 1657917 1588417 1527541 1474846 1428960 1388022 1350545 1315865 1283682 1253326 1223801
60942 1223801 1194714 1166866 1141612 1119585 1100193 1082281 1065053 1048308 1032121 1016625 1002145
60931 1002145 989193 977986 968017 958449 949075 940610 933829 928690 924556 920990 917918 915224 912784
60918 912784 910867 910004 910390 911827 914231 917566 921213 924171 926288 928654 932267 936802 941232 945190 948971
60903 948971 952531 955343 957222 958579 959706 960383 960325 959569 958258 956408 953950 950730 946442 941009 935007
60888 935007 929218 923621 917262 909310 899788 889156 877741 865894 854169 842854 831661 820335
60876 820335 809197 798545 787868 776412 764414 753070 743149 734319 725988 718125 710840 703735 696406
60863 696406 689305 683488 679474 676829 674825 672989 670958 668320 664935 661104 657093 652705 647618 641975
60849F41975n642n249m916m887n160n712o490p346q072q449q337p894p635p858
60835E48328q080p560o457n890o497p486p561o379m626l109k286k330k922l234
60821D73911k770j994j537j111j01J024J052j07j121j139r52j573k617l053k801
60806D55111k532k288j402J54J442J712J229O48K01j74m09m13l80n84r97j353
60790D49965j482j444j334j183j060j141j566k191k634k687k564k569k559k148
60776D23403j436j181j889l080l761l539k827k114j492q75l23L7J83J79J34J77
60760D01596L22L92K61J14J84L21J70k06l08O8M76N34N76J158K128K717K576K193
60742D15272K102K092J545L52r39j822k337k817l416m028m452m483m025l285k727
$$ plain form
60849 641975 636333 631084 626168 621281 616121 610409 603919 596573 588501 580052 571715 563821 556186 548328
60835 548328 540248 532688 526231 520341 513844 506358 498797 492418 487792 484683 482397 480067 477145 473911
60821 473911 471141 469147 467610 466499 466398 467422 468474 468367 467246 466107 465155 463582 460965 457912 455111
60806 455111 452579 450291 448889 449043 450485 452197 453426 454074 454275 454101 453692 453279 452899 452315 451318 449965
60790 449965 448483 447039 445705 444522 443462 442321 440755 438564 435930 433243 430679 428110 425551 423403
60776 423403 421967 420786 418897 415817 412056 408517 405690 403576 402084 401209 400886 400923 401106 401285 401419 401596
60760 401596 401918 402310 402571 402685 402869 403190 403360 403154 402846 402914 403390 403924 404500 405658 407786 410503 413079 415272
60742 415272 417374 419466 421011 421363 420424 418602 416265 413448 410032 406004 401552 397069 393044 389759 387032
60727C87032k555k455k065j599j667k395l163l351l047k764k686k503j934j144
60713C53704n75n15q61j258j434j374j139o54P4O20M00n79j505j601r58k61J54
60696C42238N41J078J439J267Q00O94J205J855K031J715J402J380J412J290J376
60681C61723K132L276L952L840L605L913M478M602M306M281M724M921M247L097
60667D17097K317K082J768R98J78j59k26p10j739k590k563j861j219r73q61o26
60651D10913l52q8L50J020J608J825J745J516J034K09o70j252j660k337l369m326
60635D06166m751m575m051l560l358l254k663j330P8N35j43j072j328p85P2P48
60619C76729R35N70J2j73J46M65L47Po6J62L59L69L12K53J81K64O92J274J577
$$ plain form
60727 387032 384477 382022 379957 378358 376691 374296 371133 367782 364735 361971 359285 356782 354848 353704
60713 353704 353129 352614 351753 350495 349061 347687 346548 345894 345968 346588 346988 346409 344904 343303 342345 342084 342238
60696 342238 342779 343857 345296 346563 347363 348057 349262 351117 353148 354863 356265 357645 359057 360347 361723
60681 361723 363855 367131 371083 374923 378528 382441 386919 391521 395827 400108 404832 409753 414000 417097
60667 417097 419414 421496 423264 424262 424440 424281 424055 423345 421606 419016 416453 414592 413373 412400 411539 410913
60651 410913 410561 410473 410823 411843 413451 415276 417021 418537 419571 419780 419110 417858 416198 413861 410492 406166
60635 406166 401415 396840 392789 389229 385871 382617 379954 378624 378702 379237 379094 378022 376694 375909 375981 376729
60619 376729 377664 378234 378246 378073 378219 378684 379031 379038 378972 379134 379493 379862 380174 380427 380608 380872 381564 382838 384415
60600C84415J483J242R45L89l23n03M03K036L353L580K793J670Q68N35K80l22
60584D02844j105j499j345j155j232j084k66O58Q00M62R03K422L748L864L539
60569D11554M235O067P828Q701Q953R082R190R276R306Q895P581N629L786K205
60555E12288L48j802l431m129m523n090n143l827j503P36K413L646M269M044L632
60540E01928M237O154Q482J0353J1638J2341J2195J1233J0024Q872P364N147K670
60527F12638O55p75k008l284m494n394n694n245m397l857l873l868l252k273j603
60512E63276j320q46J94J579K916L991M632M758M763N484P428J0233J3140J5868
60498F36096J8781K2242K6167L0254L4305L7980M0535M1235M0171L8225L5966
$$ plain form
60600 384415 385898 387140 388085 388474 388151 387648 388051 390087 393440 397020 399813 401483 402351 402886 403166 402844
60584 402844 401739 400240 398895 397740 396508 395424 395158 395816 396616 397078 397981 400403 404151 408015 411554
60569 411554 415789 421856 429684 438385 447338 456420 465610 474886 484192 493087 500668 506297 510083 512288
60555 512288 512636 510834 507403 503274 498751 493661 488518 484691 483188 483924 486337 489983 494252 498296 501928
60540 501928 506165 512319 520801 531154 542792 555133 567328 578561 588585 597457 604821 609968 612638
60527 612638 613293 612518 610510 607226 602732 597338 591644 586399 582002 578145 574272 570404 567152 564879 563276
60512 563276 561956 561110 561304 562883 565799 569790 574422 579180 583943 589427 596855 607088 620228 636096
60498 636096 654877 677119 703286 733540 767845 805825 846360 887595 927766 965991 1001957
60487A001957L2840K7786K0486J1665K254p292j6857k6152l4481m0836m4371m5117
60475H81882m4185m2783m1072l8356l4469l0298k6745k3807k1031j8409j6260
60464E44467j4531j2876j1280j0125r550r213q734q064p362o703o048n349m640
60451D29992m072l733l460l023k589k610l058l150k366j404j402k301k697j620
60437C92507J69J062M36q64j618j358m39M80Q16L17o99j455j333m57M57R10J044
60420C89975J160J125N94l01q91p25q0M59O87Q49J223J772K202K216J771J179
60404D03215Q37Q36R95J236J629K038K087J674J206J037J043R71R25J116J452
60389D22297J789K273K985L452L140K338J898K124K461K431K227K199K261K137
$$ plain form
60487 1001957 1034797 1062583 1083069 1094734 1096988 1089696 1072839 1046687 1012206 971370 926999 881882
60475 881882 837697 794914 753842 715486 681017 650719 623974 600167 579136 560727 544467
60464 544467 529936 517060 505780 495655 486105 476892 468158 460094 452732 446029 439981 434632 429992
60451 429992 425920 422187 418727 415704 413115 410505 407447 404297 401931 400527 399125 396824 394127 392507
60437 392507 392676 393738 394174 393310 391692 390334 389895 390375 391191 391508 390809 389354 388021 387564 388021 388931 389975
60420 389975 391135 392260 392854 392553 391662 390937 390857 391316 392003 392852 394075 395847 398049 400265 402036 403215
60404 403215 404052 404888 405883 407119 408748 410786 412873 414547 415753 416790 417833 418804 419729 420845 422297
60389 422297 424086 426359 429344 432796 435936 438274 440172 442296 444757 447188 449415 451614 453875 456012
60375D56012J840J595J485J463J499J538J505J490J628J750J463P75L25N83J157
60360D76108J245P21K53L98R21J219J210J526K726M529O044O778P117P581P900
60345E26276P409O194N154M717M103K371k17k475l722m349n072o093p069p515
60331E19712p121o038m905m285m021l547k823k582l286m282m419l445k271j815
60317D64872j947j822j054j56K50L51R35K386M172N508O287P179Q779J0955J3021
60302E19716J4399J5027J5175J5048J4555J3383J1237Q008L870p00n022q511j1041
60289F05144j2833j3967j4058j2776j0587q653p759p467o682n013l258k414k512
60276D97165k719k492k133k140k469k757k998l520m286m723m347l340k309j708
$$ plain form
60375 456012 457852 459447 460932 462395 463894 465432 466937 468427 470055 471805 473268 474043 474368 474951 476108
60360 476108 477353 478074 478327 478725 479646 480865 482075 483601 486327 490856 496900 503678 510795 518376 526276
60345 526276 533685 539879 545033 549750 553853 556224 556007 553532 549810 545461 540389 534296 527227 519712
60331 519712 512591 506553 501648 497363 493342 489795 486972 484390 481104 476822 472403 468958 466687 464872
60317 464872 462925 461103 460049 459893 460143 460494 461429 463815 467987 473495 479782 486961 495740 506695 519716
60302 519716 534115 549142 564317 579365 593920 607303 618540 626548 630418 629718 624696 616185 605144
60289 605144 592311 578344 564286 551510 540923 532270 524511 517044 510362 505349 502091 499677 497165
60276 497165 494446 491954 489821 487681 485212 482455 479457 475937 471651 466928 462581 459241 456932 455224
60262D55224j655k047k621k935k613j658n81p7m88j416j893j219L25J719K264
60247D40329K179K089K231K363K223J790J196O42L08J40j65p01j077q63k27K74
60231D52731M93Q06J395J846J724J268J178J819K894L809M198M107L857L725L722
60216D89572L737L820M207M973N865O623P260P898Q475Q834R027R235R428R319
60202E88273Q766Q036P578P577P809P885P545O769N706M560L521K709K122J577
60188F70433Q11l00j606k814l723m334m779n166n477n562n372n151n296n875o414
60173F09375o289n379m229l564l654m102m166l434k286j580j710k126j978j172
60159E63706l82j34l24p00j221j653j375k17R62J213Q55J023J950K589K271J740
$$ plain form
60262 455224 453569 451522 448901 445966 443353 441695 441114 441037 440549 439133 437240 436021 436346 438065 440329
60247 440329 442508 444597 446828 449191 451414 453204 454400 455042 455350 455490 455325 454624 453547 452684 452457 452731
60231 452731 453224 454030 455425 457271 458995 460263 461441 463260 466154 469963 474161 478268 482125 485850 489572
60216 489572 493309 497129 501336 506309 512174 518797 526057 533955 542430 551264 560291 569526 578954 588273
60202 588273 597039 605075 612653 620230 628039 635924 643469 650238 655944 660504 664025 666734 668856 670433
60188 670433 671244 670944 669338 666524 662801 658467 653688 648522 643045 637483 632111 626960 621664 615789 609375
60173 609375 603086 597707 593478 589914 586260 582158 577992 574558 572272 570692 568982 566856 564878 563706
60159 563706 563324 563190 562866 562166 560945 559292 557917 557700 558662 559875 560730 561753 563703 566292 568563 570303
60143E70303J940K514K473J843J605K182L028L744M612N629O094N708N318N725
60129F22718O356N977M513L117K589K510K177J618J338J553K113K812L438L707
60115F66536L463K873K361K318K864L587L647K519P17o75j263j691k565l598m171
60100F76922m231m169m148m192m531n255n763n333m196l314k954k220m17J672
60086F27871K528J612n9j082r56k64J74Q4k37n03q08j361k037k568l081l983n264
60069F10066o293o566o359o306o618o977p037o689o062n466n287n555n707n050
60055E24094l543j854o99k92m10o66o91k58N95J674K819L918M809N353N571N578
60039E45998N453N309N394N845O378O470N870M705L172J437k08j455k328l094
$$ plain form
60143 570303 572243 574757 577230 579073 580678 582860 585888 589632 594244 599873 605967 611675 616993 622718
60129 622718 629074 635051 639564 642681 645270 647780 649957 651575 652913 654466 656579 659391 662829 666536
60115 666536 669999 672872 675233 677551 680415 684002 687649 690168 690885 690210 688947 687256 684691 681093 676922
60100 676922 672691 668522 664374 660182 655651 650396 644633 639300 635104 631790 628836 626616 626199 627871
60086 627871 630399 632011 631952 630870 629914 629650 629824 629908 629671 629168 628360 626999 624962 622394 619313 615330 610066
60069 610066 603773 597207 590848 584542 577924 570947 563910 557221 551159 545693 540406 534851 529144 524094
60055 524094 520551 518697 517998 517706 517296 516630 515939 515681 516276 517950 520769 524687 529496 534849 540420 545998
60039 545998 551451 556760 562154 567999 574377 580847 586717 591422 594594 596031 595823 594368 592040 588946
60025E88946l818m400n039o212p877r193r426q863q412q481q598q085o806n250
60011D88486m137l835m034m023l457k683k170j871j429q64o02q71j430j884k002
59996D53194j666r01rN78P59Q85J392K339L363L985M014L764L771M098M160L436
59980D87162K206J132L48n16j442j868j644j454j874k570k922l049l505m183m225
59965D61596l143j419R6R66J230J056P18O02Q73J254J368J224J189J507K047K489
59949D73653K642K491K149J780J552J503J544J616J739J846J664J023J80l78n53
59934D94451q02j523k428k776k188j018N7O13O86N76N31N33M82N60J134K148K903
59917D93939K889K587K887L807M441M262L816L802M118M227L992L582K888J668
$$ plain form
60025 588946 585128 580728 575689 569477 561600 552407 542981 534118 525706 517225 508627 500542 493736 488486
60011 488486 484349 480514 476480 472457 469000 466317 464147 462276 460847 459983 459381 458510 457080 455196 453194
59996 453194 451528 450627 450618 451196 451955 452840 454232 456571 459934 463919 467933 471697 475468 479566 483726 487162
59980 487162 489368 490500 490848 490332 488890 487022 485378 483924 482050 479480 476558 473509 470004 465821 461596
59965 461596 458453 457034 457130 458096 459326 460382 461100 461702 462575 463829 465197 466421 467610 469117 471164 473653
59949 473653 476295 478786 480935 482715 484267 485770 487314 488930 490669 492515 494179 495202 495382 495004 494451
59934 494451 493649 492126 489698 486922 484734 483716 483773 484386 485072 485648 486179 486712 487194 487754 488888 491036 493939
59917 493939 496828 499415 502302 506109 510550 514812 518628 522430 526548 530775 534767 538349 541237 542905
59903E42905J47j032j436j123m41J20R4m48p17k7J267K168K336K407K976L830
59887E53026M450M793N116N424N419M968M268L619L194L028L082L269L410L251
59873F10317K573J454K36q49j868k844l523l811m220n343o919p924p718o689n571
59858E57301m606l540k131l90J431K902L700L974M275N002O190P737R455J0742
59844F02042J0772R341P120M913L004J465N99N16O73M19k20p73j201j939l133
59829F33598m356n188n612n779n727n513n317n263n304n379n501n642n680n499
59815E57838n074m504m017l811l717l201j962n03K52n9r35j711k247k724l061
59800E20564k820j811n85j11q45k201l094l005k333j728j408j257j192j156j072
$$ plain form
59903 542905 543052 542020 540584 539461 539020 539140 539234 538786 538069 538042 539309 541477 543813 546220 549196 553026
59887 553026 557476 562269 567385 572809 578228 583196 587464 591083 594277 597305 600387 603656 607066 610317
59873 610317 612890 614344 614580 613731 611863 609019 605496 601685 597465 592122 585203 577279 569561 562872 557301
59858 557301 552695 549155 547024 546634 548065 550967 554667 558641 562916 567918 574108 581845 591300 602042
59844 602042 612814 622155 629275 634188 637192 638657 639256 639772 640445 640864 640644 639871 638670 636731 633598
59829 633598 629242 624054 618442 612663 606936 601423 596106 590843 585539 580160 574659 569017 563337 557838
59815 557838 552764 548260 544243 540432 536715 533514 531552 531049 531301 531242 530307 528596 526349 523625 520564
59800 520564 517744 515933 515348 515237 514392 512191 509097 506092 503759 502031 500623 499366 498174 497018 495946
59785D95946j055j394j978k047j049L91R92K88q86j515j432j077p33m07j74j76
59769D83694k84j49L81J005J332J412J723K526L365L458K634J597J164J503K289
59754E07650L215M042M494M511M461M709N153N533N951O575P022O681N586M434
59740E80017L695L250K928K772K664K248J491Q57P03Q57R84R59P71M51J82J53
59724F04982J71m9k79j3O20Q87N68K63L20L32O4K6M62O45L0o43m00L75N78K18
59704F09157L55J259J914J620J007R94J601K251K649K763K520K036J766J933K153
59689F35978J977J556J310J248J009M98n6n22r90j431j618j529j508j889k629
59674F31404l455m232m913n312n231m891m890n481o126o132n554m998m598l847
$$ plain form
59785 495946 494891 493497 491519 489472 488423 488814 489806 490094 489208 487693 486261 485184 484451 484044 483870 483694
59769 483694 483410 483261 483642 484647 485979 487391 489114 491640 495005 498463 501097 502694 503858 505361 507650
59754 507650 510865 514907 519401 523912 528373 533082 538235 543768 549719 556294 563316 569997 575583 580017
59740 580017 583712 586962 589890 592662 595326 597574 599065 599922 600625 601482 602466 603425 604196 604647 604829 604982
59724 604982 605153 605104 604825 604812 605432 606319 606887 607150 607470 607802 607866 607892 608354 608999 609029 608386 607986 608361 608939 609157
59704 609157 609512 610771 612685 614305 615312 616306 617907 620158 622807 625570 628090 630126 631892 633825 635978
59689 635978 637955 639511 640821 642069 643078 643576 643520 642998 642008 640577 638959 637430 635922 634033 631404
59674 631404 627949 623717 618804 613492 608261 603370 598480 592999 586873 580741 575187 570189 565591 561744
59660E61744k577j468j145j221q12K93J545K495L198L823M366M760M860M414L403
59645E87678K340J759J492R00k42j552k687l588m104l997l538l381l685l825l368
59630E60202k757k628k862k883k638k667l275m017m168l419k107r04l72p37j907
59615E22861l483m761n034m230l131k563k477k126j079M00J866L052L669L420
59601E06384K456J334L86m60j169j440j291j218j427j530j231q82q44q64n67j37
59585D97500M5P7K31K97j68j082j916k325k362k179k036k254k673k434j001Q01
59569D78521J482O30o72j200p35J24O56M37l74r99p75j3L94K27J36N30R69R72
59551D80310P29O56P75J026J590K446L090L311L805N285P290Q701R330J0206J2090
$$ plain form
59660 561744 559167 557699 556554 555333 554521 554814 556359 558854 562052 565875 570241 575001 579861 584275 587678
59645 587678 590018 591777 593269 594169 593927 592375 589688 586100 581996 577999 574461 571080 567395 563570 560202
59630 560202 557445 554817 551955 549072 546434 543767 540492 536475 532307 528888 526781 525877 525505 524768 522861
59615 522861 519378 514617 509583 505353 502222 499659 497182 495056 493977 494377 496243 499295 502964 506384
59601 506384 508840 510174 510560 510100 508931 507491 506200 504982 503555 502025 500794 499912 499068 498204 497637 497500
59585 497500 497545 497622 497853 498150 497982 496900 494984 492659 490297 488118 486082 483828 481155 478721 477720 478521
59569 478521 480003 480633 479961 478761 478026 478150 478806 479243 478869 477870 477095 477082 477476 477703 477839 478369 479338 480310
59551 480310 481039 481695 482470 483496 485086 487532 490622 493933 497738 503023 510313 519014 528344 538550 550640
59536E50640J4441J6123J6543J5654J3356R589M994P98k203m188n620o325n687
59523F18115l689j208Q52K305L333L848L703L206K718J830l11l587o544p875p874
59508F08822p897q673r711j0200r885r001p821o569n490m758m365m154l924l563
59494E12811l098k612k035j148M7J137J689J737J666J756K070K693L683M755N466
59479E30617N823O374P380Q305Q438P839P325P474Q008Q141P321N581L439J574
59465F23639M44mj52j98N4Q21J876K735L306M114N672P781R667J0847J1601J2447
59449F94650J3402J4011J4070J3891J3627J2647J0016N649O83l491o375q470j0354
59436G63956j1963j2810j2716j2101j1520j1085j0470r492q389p413o397m992
$$ plain form
59536 550640 565081 581204 597747 613401 626757 636346 641340 642138 639935 635747 630127 623802 618115
59523 618115 614426 613218 614070 616375 619708 623556 627259 630465 633183 635013 634702 631115 624571 616696 608822
59508 608822 600925 592252 582541 572341 562456 553455 545634 539065 533575 528817 524452 520298 516374 512811
59494 512811 509713 507101 505066 503918 503965 505102 506791 508528 510194 511950 514020 516713 520396 525151 530617
59479 530617 536440 542814 550194 558499 566937 574776 582101 589575 597583 605724 613045 618626 622065 623639
59465 623639 624083 624079 623927 623729 623783 624604 626480 629215 632521 636635 642307 650088 659755 670602 682203 694650
59449 694650 708052 722063 736133 750024 763651 776298 786314 791963 792646 789155 782780 774310 763956
59436 763956 751993 739183 726467 714366 702846 691761 681291 671799 663410 655997 649600 644608
59424F44608l228j440L29K427M982P689J0375J3270J6309J8695J9896K0830K3098
59411G77840K6771K9577K8785K3630J5651P093n72o852j1721j5173j7052j6999
59399H40978j4562r723l651J133K088j239o680j1633j5501j9348k3300k5684k5106
59386F87772k2338j9281j6747j4253j1491q864o669m764l150k063j345m16Q93
59373E77284K064K659K805K804K785K973L611M413M643M167L880M647O190P432
59359F32357P719P291O861P078Q142R641J0896J1724J2563J3691J4722J5295J5804
59346G73784J6858J8214J8840J8127J6599J5290J4678J4261J3090J0749P830N254
59334I43574L144P50k392n821q946j1886j4860j7310j8427j8379j8167j8320j8389
$$ plain form
59424 644608 641380 639940 640269 642696 647678 655367 665742 679012 695321 714016 733912 754742 777840
59411 777840 804611 834188 862973 886603 902254 909347 908775 901923 890202 875029 857977 840978
59399 840978 826416 816693 813042 814175 816263 815024 808344 796711 781210 761862 738562 712878 687772
59386 687772 665434 646153 629406 615153 603662 594798 588129 583365 580215 578152 576807 576391 577284
59373 577284 579348 582007 584812 587616 590401 593374 596985 601398 606041 610208 614088 618735 624925 632357
59359 632357 640076 647367 654228 661306 669448 679089 689985 701709 714272 727963 742685 757980 773784
59346 773784 790642 808856 827696 845823 862422 877712 892390 906651 919741 930490 938320 943574
59334 943574 946718 947468 945076 939255 930309 918423 903563 886253 867826 849447 831280 812960 794571
59321G94571j7741j6187j3896j1379r585r161r452r009p380n638m797m490l793
59308F72063k594j430m44O84K012L247M285N291O421P858R855J2064J3101J1549
59294G43962P478K388k332o328r702j2303j3927j4677j4698j3912j2317j0264
59282F43368q143o056m033k326j193m45N51K379N092Q108J0630J2298J3381J4199
59268F87810J4623J4442J3955J3583J3028J1521Q986O258L976J946j24k087m005
59255G83912o469r551j2087j2926j2483j2088j2120j1740j0391q575p029n915
59243F62538n025m083k719p75J228K523L095L597M313M936N402N983O339N606
59229F92958L826K330J916J676M13j642l496m997o526p615p347o010n069n290
$$ plain form
59321 794571 776830 760643 746747 735368 725783 716622 707170 698161 690781 685143 680346 675856 672063
59308 672063 669469 668039 667595 668279 670291 673538 677823 683114 689535 697393 707248 719312 732413 743962
59294 743962 751440 753828 751496 745168 735466 723163 709236 694559 679861 665949 653632 643368
59282 643368 635225 629169 625136 622810 621617 621172 621723 624102 629194 637302 647932 660230 673611 687810
59268 687810 702433 716875 730830 744413 757441 768962 777948 784206 788182 790128 790004 787917 783912
59255 783912 777443 767892 755805 742879 730396 718308 706188 694448 684057 675482 668453 662538
59243 662538 657513 653430 650711 649936 651164 653687 656782 660379 664692 669628 675030 681013 687352 692958
59229 692958 696784 699114 701030 702706 703119 701477 697981 692984 686458 678843 671496 665486 660417 655127
59215F55127n970o246o099n645m488k492n22L20q6r61j597j799j683j463j410
59200F14986j584j648j186k28O71Q52J18r95j583j237m47P8K84N74Q85P06Q1j26
59182F10201O66J944K791K948K734K393K019J891K215K721L002L163L712M798
59168F47198O030P029P817Q531R173R678J0038J0188J0032R579Q864P707N805
59155G57669L166K41k489m843o756q054q668q977r595j0710j1830j2301j1935
59142F64918j0976r657q124o743n996n888n887n714n844o651p411o932n167l442
59128E70486k818k888k591j614m29O43J674K660L435M141N207O773Q414R586J0080
59113F12759J0065R901R954J0287J0445R846Q435O792N513M673L965L168K321
$$ plain form
59215 655127 649157 642911 636812 631167 626679 624187 623665 623985 623899 622938 621341 619542 617859 616396 614986
59200 614986 613402 611754 610568 610340 611011 611863 611981 610986 609403 608166 607719 607797 608081 608655 609540 610246 610327 610201
59182 610201 610867 612811 615602 618550 621284 623677 625696 627587 629802 632523 635525 638688 642400 647198
59168 647198 653228 660257 668074 676605 685778 695456 705494 715682 725714 735293 744157 751864 757669
59155 757669 760835 761076 758587 753744 746988 738934 730266 721289 711694 700984 689154 676853 664918
59142 664918 653942 644285 636161 629418 623422 617534 611647 605933 600089 593438 586027 579095 573928 570486
59128 570486 567668 564780 562189 560575 560146 560789 562463 565123 568558 572699 577906 584679 593093 602679 612759
59113 612759 622824 632725 642679 652966 663411 673257 681692 688484 693997 698670 702635 705803 708124
59100G08124J589J133J079J400J734J508M30j058k070k224k076k330k731k376
59086G02132j097M6L6r42k031k935l974n219o319p167p998q761q965q347p231
59071F31228o080n166m762n052n609n560m682l809l699l982l829l249k918l000
59057E69831k986k705k621k892k896k183j231p12m89p3L25J4r49j561j140j65
59041E47567M59N21M50N04M11j96j251k124k033q66M41P78K36Q6J131K664L633
59024E52411M207N365P243Q933R885J0528J1273J1799J1704J1131J0265Q835O671
59011F70250M318K444J064j55j147j618j637j461r88J9J327K444L395M602O021
58996F88878P016P244P044O752O215N271M244L559L124K541J716R19K68m35j349
$$ plain form
59100 708124 709713 710846 711925 713325 715059 716567 716997 715939 713869 711645 709569 707239 704508 702132
59086 702132 701035 701081 701117 700175 698144 695209 691235 686016 679697 672530 664532 655771 646806 638459 631228
59071 631228 625148 619982 615220 610168 604559 598999 594317 590508 586809 582827 578998 575749 572831 569831
59057 569831 566845 564140 561519 558627 555731 553548 552317 551605 551116 551043 551368 551382 550433 548872 547732 547567
59041 547567 548026 548547 548997 549501 549912 549716 548465 546341 544308 543442 543883 544661 544897 544983 546114 548778 552411
59024 552411 556618 561983 569226 578159 588044 598572 609845 621644 633348 644479 654744 663579 670250
59011 670250 674568 677012 678076 677921 676774 675156 673519 672058 671070 671089 672416 674860 678255 682857 688878
58996 688878 695894 703138 710182 716934 723149 728420 732664 736223 739347 741888 743604 744523 744791 744356 743007
58981G43007k239k653k336j436l25P04J592K409L299M543O493R206J2132J4440
58967G88836J5696J6137J6225J6104J5628J4776J3789J2877J1860J0328Q152N716
58955I46124L459J339j076l966o983r701j2086j4332j6410j7982j8708j8511j7623
58942H13544j6439j5234j3891j2119j0020q253p356p077o615n538m166l081k509
58929G01246k258k089j915j729j478j136p92n58l54k3K74P4p02j332j019L6Q47
58912F87092R20P57J001J680K591L821N420P026Q298R375J0481J1457J2153J2959
58898G75031J4203J5356J5554J4845J4164J4039J4062J3847J3850J4762J6532
58887I36245J8389J9712K0510K1090K1490K1311K0077J7730J4664J1254P609L833
$$ plain form
58981 743007 740768 738115 735779 734343 734018 734722 736314 738723 742022 746565 753058 762264 774396 788836
58967 788836 804532 820669 836894 852998 868626 883402 897191 910068 921928 932256 940408 946124
58955 946124 949583 950922 949846 945880 938897 929196 917110 902778 886368 868386 849678 831167 813544
58942 813544 797105 781871 767980 755861 745841 737588 730232 723155 716540 711002 706836 703755 701246
58929 701246 698988 696899 694984 693255 691777 690641 689849 689291 688937 688914 689188 689262 688560 687228 686209 686245 687092
58912 687092 688012 688769 689770 691450 694041 697862 703282 710308 718606 727981 738462 749919 762072 775031
58898 775031 789234 804590 820144 834989 849153 863192 877254 891101 904951 919713 936245
58887 936245 954634 974346 994856 1015946 1037436 1058747 1078824 1096554 1111218 1122472 1130081 1133914
58875A133914K65k881n894r171j2500j5141j6604j7120j7252j7327j7256j6747
58863I86286j5674j4291j3004j1981j1183j0765j1007j1645j1785j0967r922r702
58851H44360j0377j1122j1388j1349j1252j1030j0574r950r211q417p812p593
58839G24285p592p541p539p843q304q523q419q139p587o604n507m710l954k615
58825F29408q32N04J011J272J831K506L127M100N676P147P526O775N827N484N597
58810F86959N372M281K690J546J289J283O03p53j985k714l358m188m739m606m289
58795F77391m663n883p257q093q365q477q563q136o639m380k472j533q39O13K547
58780F05251L737L671L024K527K301K456L257M260M260K665K93j763l388n038
$$ plain form
58875 1133914 1134179 1131298 1125404 1116233 1103733 1088592 1071988 1054868 1037616 1020289 1003033 986286
58863 986286 970612 956321 943317 931336 920153 909388 898381 886736 874951 863984 854062 844360
58851 844360 833983 822861 811473 800124 788872 777842 767268 757318 748107 739690 731878 724285
58839 724285 716693 709152 701613 693770 685466 676943 668524 660385 652798 646194 640687 635977 632023 629408
58825 629408 628576 629080 630091 631363 633194 635700 638827 642927 648603 655750 663276 670051 675878 681362 686959
58810 686959 692331 696612 699302 700848 702137 703420 704023 703270 701285 698571 695213 691025 686286 681680 677391
58795 677391 672728 666845 659588 651495 643130 634653 626090 617954 611315 606935 604463 602930 602091 602704 605251
58780 605251 608988 612659 615683 618210 620511 622967 626224 630484 634744 637409 637702 635939 632551 627513
58766F27513o678p851q376q357p788o664n301m092l161k500k131j822j106Q3J113
58751E62882J452J345J402J786K220K503K657K767K982L445M043M514M899N533
58737F04430O390O961O995O878P023P303P363P049O322N250M335M194M643M722
58723F89858L974L129L038L518L787L541L118K983L398M265N008N174N198N899
58709G45888P059P413O407M828L252J076k080n177p165q612j0667j3103j4790
58696G14329j5503j5876j5943j5317j4607j5042j6386j6662j4505j0807p538n695
58684E50448m987m834m993n358n619n308m244k944k208k170k151j689j052m49
58670E02442N73K219L701M261M378N133O732Q526R996J0804J0321Q249N405K951
$$ plain form
58766 627513 620835 612984 604608 596251 588463 581799 576498 572406 569245 566745 564614 562792 561686 561769 562882
58751 562882 564334 565679 567081 568867 571087 573590 576247 579014 581996 585441 589484 593998 598897 604430
58737 604430 610820 617781 624776 631654 638677 645980 653343 660392 666714 671964 676299 680493 685136 689858
58723 689858 693832 696961 699999 703517 707304 710845 713963 716946 720344 724609 729617 734791 739989 745888
58709 745888 752947 760360 766767 771595 774847 775923 773843 768666 761501 752889 742222 729119 714329
58696 714329 698826 682950 667007 651690 637083 622041 605655 588993 574488 563681 556143 550448
58684 550448 545461 540627 535634 530276 524657 519349 515105 512161 509953 507783 505632 503943 502891 502442
58670 502442 503015 505234 508935 513196 517574 522707 529439 537965 547961 558765 569086 577335 582740 585691
58656E85691J028p91k238k702k619l128m356n326n576n656n899n900n492n072
58642E31964m725m097l295k852k580j631K6J342J738J847K207K500K537K838L531
58627E31350L748K959J955J625J602J061J44l54k23J83P76J716K846L863M822
58612E58073N836O547O537O084N823N825N480M342K689J295Q51J389K088J913
58598F14772O74q10j778k403l191l958l908k671q14P35J560K043K874M300N931
58583F13356P288Q332R251R998J0439J0679J0813J0575R759Q824Q431Q547Q629
58570G34921Q620Q971R787J0783J2106J4267J7042J9369K0685K1594K2828K4310
58558I25283K5548K6275K6222K4953K2409J9110J5447J1330O787K298j778n411
$$ plain form
58656 585691 586719 585928 583690 580988 578369 575241 570885 565559 559983 554327 548428 542528 537036 531964
58642 531964 527239 523142 519847 516995 514415 512784 512810 514152 515890 517737 519944 522444 524981 527819 531350
58627 531350 535098 538057 540012 541637 543239 544300 544444 544090 543867 544050 544826 546542 549388 553251 558073
58612 558073 563909 570456 576993 583077 588900 594725 600205 604547 607236 608531 609382 610771 612859 614772
58598 614772 615446 614636 612858 610455 607264 603306 599398 596727 595913 596648 598208 600251 603125 607425 613356
58583 613356 620644 628976 638227 648225 658664 669343 680156 690731 700490 709314 717745 726292 734921
58570 734921 743541 752512 762299 773082 785188 799455 816497 835866 856551 878145 900973 925283
58558 925283 950831 977106 1003328 1028281 1050690 1069800 1085247 1096577 1103364 1105662 1103884 1098473
58546A098473q238r506r187q452q432r078r816j0727j2359j4782j7505k0018k1933
58533I38440k2925k3018k2637k1989k0793j8928j6832j4845j2672j0043p440n584
58521G40734m509l712k916k174j534j084j064j492j952k144k284k580k728k458
58507G08103k143k242k498k352j924j874k334k712k600k310k295k506k550k214
58493F75549j559o47N45J876K906L191K875K745L511N088O730P809Q334Q891J0233
58478G38077J2680J5606J7803J8607J8382J7637J6248J3983J1214Q314M965R55
58466H94471k820n308o870q575j0177j0276q524o167m191k258M0K330M366O518
58452H42559Q725J0126J0384J0216R978Q866O318L025k91l953q151j1745j3450
$$ plain form
58546 1098473 1090235 1080729 1071542 1063090 1054658 1045580 1035764 1025037 1012678 997896 980391 960373 938440
58533 938440 915515 892497 869860 847871 827078 808150 791318 776473 763801 753758 746318 740734
58521 740734 736225 732513 729597 727423 725889 724805 723741 722249 720297 718153 715869 713289 710561 708103
58507 708103 705960 703718 701220 698868 696944 695070 692736 690024 687424 685114 682819 680313 677763 675549
58493 675549 673990 673343 673888 675764 678670 681861 684736 687481 690992 696080 702810 710619 718953 727844 738077
58478 738077 750757 766363 784166 802773 821155 838792 855040 869023 880237 888551 893516 894471
58466 894471 891651 886343 879473 870898 860721 850445 841921 835754 831563 829305 829345 831675 836041 842559
58452 842559 851284 861410 871794 882010 891988 900854 907172 910197 909906 905953 897802 886057 872607
58439H72607j3457j2843j2021j0784r262p745o006l749j324O84K188L295L903
58426H05486M333N572Q007J0551J1829J1736J0955R707P869N803L946K036l62
58413H97468k910m924o367p655q840r771j0561j1169j1056j0102r216r094q919
58400G86884p394m657k142p64k42N7N73J618L116M336M683M584M895N637N972
58385H07156N330L939K474J681K014L126L980L957L490L214L098K880K736K843
58371H51918K923K830L018L850N040O285P702R130R944J0181J0885J2512J4079
58358I50297J4728J5076J5854J6341J5453J3478J1390R172O352L530J880J502
58346A075053J512J428J350J294J419K358M243N991O759P334Q876J1004J2577
$$ plain form
58439 872607 859150 846307 834286 823502 814240 806495 800489 796740 795416 796100 798288 801583 805486
58426 805486 809819 815391 823398 833949 845778 857514 868469 878176 886045 891848 895794 897830 897468
58413 897468 894558 889634 883267 875612 866772 857001 846440 835271 824215 814113 804897 795803 786884
58400 786884 779490 774833 772691 771927 771685 771742 772315 773933 777049 781385 786068 790652 795547 801184 807156
58385 807156 812486 816425 818899 820580 822594 825720 829700 833657 837147 840361 843459 846339 849075 851918
58371 851918 854841 857671 860689 864539 869579 875864 883566 892696 902640 912821 923706 936218 950297
58358 950297 965025 980101 995955 1012296 1027749 1041227 1052617 1061789 1068141 1071671 1073551 1075053
58346 1075053 1076565 1077993 1079343 1080637 1082056 1084414 1088657 1094648 1101407 1108741 1117617 1128621 1141198
58333A141198J3610J4817J5878J5954J5478J5733J6712J7057J6076J4361J2446
58322A309320J0209P748N638M123K998K264K082K287K718L655N242O918Q213R401
58308A382816J0714J1757J2531J3846J5718J6701J6146J5735J7089J9175J9962
58297A552190J9469J9136J9191J8952J8893K0061K1896K2830K2735K2727K3034
58286A781114K3089K3314K4655K6681K8148K9120L0554L2223L3068L3258L3897
58275B099121L5106L6299L7772M0012M2085M2904M3385M5118M7668M9521N0941
58264B569932N3293N6252N8457O0338O3478O7545P0672P2548P4402P6303P7356
58253C300576P8131Q0071Q2801Q4889Q6797R0128R4517R8393J02222J07746J14522
$$ plain form
58333 1141198 1154808 1169625 1185503 1201457 1216935 1232668 1249380 1266437 1282513 1296874 1309320
58322 1309320 1319529 1327277 1332915 1337038 1340036 1342300 1344382 1346669 1349387 1353042 1358284 1365202 1373415 1382816
58308 1382816 1393530 1405287 1417818 1431664 1447382 1464083 1480229 1495964 1513053 1532228 1552190
58297 1552190 1571659 1590795 1609986 1628938 1647831 1667892 1689788 1712618 1735353 1758080 1781114
58286 1781114 1804203 1827517 1852172 1878853 1907001 1936121 1966675 1998898 2031966 2065224 2099121
58275 2099121 2134227 2170526 2208298 2248310 2290395 2333299 2376684 2421802 2469470 2518991 2569932
58264 2569932 2623225 2679477 2737934 2798272 2861750 2929295 2999967 3072515 3146917 3223220 3300576
58253 3300576 3378707 3458778 3541579 3626468 3713265 3803393 3897910 3996303 4098525 4206271 4320793
58242D320793J20666J26504J33971J42877J51455J60059J70419J81859J92228
58233E700831K02256K14646K29265K43575K57587K73931K93281L14173L37045
58224H066590L63726L93434M24108M57116M95506N38573N83906O33702O92646
58215A2649307P60507Q34002R15263J010931J123487J251790J399877J576604
58207B1521768J787098K034267K328581K685932L115792L622414M217211M917611
58199D6230674N735049O679574P776689R064483J0577364J2351724J4438372J6874375
58191A29728304J9644137K2703549K6005431K9351902L2110958L3176409L1459287
58184C24179977K6609034J9284834J0696138J880327o611440j4479513k1321547
$$ plain form
58242 4320793 4441459 4567963 4701934 4844811 4996266 5156325 5326744 5508603 5700831
58233 5700831 5903087 6117733 6346998 6590573 6848160 7122091 7415372 7729545 8066590
58224 8066590 8430316 8823750 9247858 9704974 10200480 10739053 11322959 11956661 12649307
58215 12649307 13409814 14243816 15159079 16170010 17293497 18545287 19945164 21521768
58207 21521768 23308866 25343133 27671714 30357646 33473438 37095852 41313063 46230674
58199 46230674 51965723 58645297 66421986 75486469 86063833 98415557 112853929 129728304
58191 129728304 149372441 172075990 198081421 227433323 259544281 292720690 324179977
58184 324179977 350789011 370073845 380769983 382650310 376038870 361559357 340237810
58177C40237810k6584385k9822749l0963580l0337844k8489205k5937322k3057534
58170A45045191k0098955j7245186j4632443j2334156j0364399q706482p332244
58163E4331326o202688n272339m502859l867146l340943k900109k527603k214435
58155B3503204j951556j727473j534682j371095j233262j114206j009097r17160
58147A2644673q36604p63133o94751o32896n77585n26216m78142m35725l99748
58138G299873l68087l39838l16410k97580k80594k64175k49521k36520k23019
58129D724129k08705j95798j84844j73572j61056j49385j39929j31370j22679
58120C256791j14772j07940j00717r2812q6292q2418p9745p6656p3441p0681o7789
$$ plain form
58177 340237810 313653425 283830676 252867096 222529252 194040047 168102725 145045191
58170 145045191 124946236 107701050 93068607 80734451 70370052 61663570 54331326
58163 54331326 48128638 42856299 38353440 34486294 31145351 28245242 25717639 23503204
58155 23503204 21551648 19824175 18289493 16918398 15685136 14570930 13561833 12644673
58147 12644673 11808069 11044936 10350185 9717289 9139704 8613488 8135346 7699621 7299873
58138 7299873 6931786 6591948 6275538 5977958 5697364 5433189 5183668 4947148 4724129
58129 4724129 4515424 4319626 4134782 3961210 3800154 3650769 3510840 3379470 3256791
58120 3256791 3142019 3034079 2933362 2840550 2754258 2671840 2592095 2515439 2441998 2371317 2303528
58109B303528o4392o1284n8978n6946n4906n3222n1672m9570m7249m5606m4188
58098A715515m1876l9299l8177l8185l7137l4544l2352l1618l1035k9434k7343
58087A334515k5327k3080k1017k0460k1426k2149k1655k0903k0756k0777k0636
58076A096329k0779k1018k0386j8986j8116j8046j7589j6403j5617j5574j5101
58065H98714j3766j2767j2725j2583j1664j0847j0728j0446r383q324p971p859
58053G69651p642p824q434q591q211q397r345r628q509p223o885o867o356n889
58039F59850o110o504o575o790p286p151o210n956p320q975r321q860r040r905
58025E53847j0502j0663j0758j0406q998p047n719n369n520n881o345o452n818
$$ plain form
58109 2303528 2239136 2177852 2118874 2061928 2007022 1953800 1902128 1852558 1805309 1759703 1715515
58098 1715515 1673639 1634340 1596163 1557978 1520841 1486297 1453945 1422327 1391292 1361858 1334515
58087 1334515 1309188 1286108 1265091 1244631 1223205 1201056 1179401 1158498 1137742 1116965 1096329
58076 1096329 1075550 1054532 1034146 1015160 997044 978998 961409 945006 929389 913815 898714
58065 898714 884948 872181 859456 846873 835209 824362 813634 803188 793805 785481 777510 769651
58053 769651 762009 754185 745751 737160 728949 720552 711207 701579 693070 685847 678962 672095 665739 659850
58039 659850 653740 647236 640661 633871 626585 619434 613224 607268 599948 590973 581652 572792 563752 553847
58025 553847 543345 532682 521924 511518 502520 495473 489754 484385 478865 472984 466639 460187 454369
58012D54369m829m147l928l974m207m348l870k838k172k481l247l751m039m381
57998D02157m497l992k964j623Q3J983L457M111M125L707K976K465K726L190K636
57983D20540J176L86Q77J221J78j374j882j387j048j268j601j929k472k909k643
57968D05865j784j079j012j475k039k175j569o44k68o38j026r19o53o13o04n06
57952C88861o54j069j184q51p52j183j316m06J063K174K782L292L921M743N800
57937D05221O676O811O641P361R005R990R376Q324Q190Q390P454N330L143J292
57923E03204p30k998m894o090o766p078p196p577q353q835q386p487p031p052
57909D12731o945o517n948n087l764k519k079k308k500k501k766l377l805l643
$$ plain form
58012 454369 449540 445393 441465 437491 433284 428936 425066 422228 420056 417575 414328 410577 406538 402157
57998 402157 397660 393668 390704 389081 389164 391147 394604 398715 402840 406547 409523 411988 414714 417904 420540
57983 420540 421716 422102 422979 424200 424378 423004 421122 419735 418687 417419 415818 413889 411417 408508 405865
57968 405865 404081 403002 401990 400515 398476 396301 394732 394088 393820 393182 392156 391237 390584 389971 389367 388861
57952 388861 388207 387138 385954 385103 384351 383168 381852 381446 382509 384683 387465 390757 394678 399421 405221
57937 405221 411897 418708 425349 432710 441715 451705 461081 469405 477595 485985 493439 498769 501912 503204
57923 503204 502474 499476 494582 488492 481726 474648 467452 459875 451522 442687 434301 426814 419783 412731
57909 412731 405786 399269 393321 388234 384470 381951 379872 377564 375064 372563 369797 366420 362615 358972
57895C58972l020k387k127k148j640J32K492L584K608R84N47J355K212K578K787
57880C66929K850K315J187L4p55j140j084q04r55j816k632k569j959j729k027
57865C55845k343k561k855k885k206j296j030j210p41O21J853K172J984J980K142
57850C49470K074J704J251Q63N29J92k32p42j197j563j969k392k557k436k365
57835C40630k381k024j233p53j040j406j045l64k73o53n45L43J315J708J434O47
57819C34360j90j55J211K957L617L032K277J892J281K5j350k393l477m980o349
57804C31758o710n912m542l171k109j513j377j354r62j03P20Q16J43m27m2J003
57788C06218J526J070N25P82J435J456P59L12Q85K286L762M671M837M590M314
$$ plain form
57895 358972 355952 353565 351438 349290 347650 347782 350274 353858 356466 357450 357997 359352 361564 364142 366929
57880 366929 369779 372094 373281 373315 372560 371420 370336 369532 368577 366761 364129 361560 359601 357872 355845
57865 355845 353502 350941 348086 345201 342995 341699 340669 339459 338718 339339 341192 343364 345348 347328 349470
57850 349470 351544 353248 354499 355362 355891 356083 355851 355109 353912 352349 350380 347988 345431 342995 340630
57835 340630 338249 336225 334992 334239 333199 331793 330748 330384 330111 329458 328913 329256 330571 332279 333713 334360
57819 334360 334170 334015 335226 338183 341800 344832 347109 349001 350282 350307 348957 346564 343087 338107 331758
57804 331758 325048 319136 314594 311423 309314 307801 306424 305070 304108 304005 304725 305541 305684 305257 305215 306218
57788 306218 307744 308814 309339 310121 311556 313012 313771 314083 314968 317254 321016 325687 330524 335114 339428
57773C39428L909L026J851J033O98L47m3R3M53l13k484m178l740k175j707k661
57757C33537l509l411k942k442j529l56K37K52P12J936K918K845K158J586J197
57742C33189Q73P18N79m4j149k070k438k542k543k210j713j751k461l035k840
57727C10563k180j595j079m60J35N03N55R2r63k012k232j696j292j411j634j791
57711B93503k313l188l650l345k897k822k792k537k540l145l787l814l395k966
57697B50312k428j523n07K63Q61J354J403Q35J17l10o32j063j204o67K22R66J744
57680B49743L056M898O901Q973J1320J4084J7423K1578K6425L1435L6491M2250
57668D74577M9063N5838O0394O0550N4678M2178K4406M650j3832k9560m2215n1038
$$ plain form
57773 339428 343337 346363 348214 349247 349945 350292 350249 350342 350795 350482 347998 343820 340080 337905 336198 333537
57757 333537 330028 326617 323675 321233 319704 319348 319585 319837 320549 322485 325403 328248 330406 331992 333189
57742 333189 334062 334780 335359 335315 334166 332096 329658 327116 324573 322363 320650 318899 316438 313403 310563
57727 310563 308383 306788 305709 305249 305384 305887 306442 306534 305571 303559 301327 299631 298339 296928 295294 293503
57711 293503 291190 288002 284352 281007 278110 275288 272496 269959 267419 264274 260487 256673 253278 250312
57697 250312 247884 246361 245854 246117 246978 248332 249735 250570 250687 250377 249745 248682 247478 246811 247033 247999 249743
57680 249743 252799 257697 264598 273571 284891 298975 316398 337976 364401 395836 432327 474577
57668 474577 523640 579478 639872 700422 755100 797278 821684 826334 812502 782942 740727 689689
57656F89689n5098n4820n1912m7541m1665l4410k7104k1303j7393j4676j2454
57645C11313j0501q762p105n405l752k494k035k341k652k054m46J257K096K005
57631B69124J639J426J185O20j07n71o92r45j844l326m690n178m652l765l313
57616B44911l363l170k217j064p08j228j744j757j667j737j432m41M90N65J31
57601B25569j25n04j615k801k745j581r41j617k608k904k902l312l757l491k733
57586A91933k344k630l144l368l066k320j632j513j689j378o55o67j886l046k744
57571A59851j401o41j109k053k742l172l366k938j771m02M76O06J31n83j041q80
57555A38965k14N02R16J009J032J370K239L303L830L473K606J708Q73J76j2L96
$$ plain form
57656 689689 634591 579771 527859 480318 438653 404243 377139 355836 338443 323767 311313
57645 311313 300812 292050 284945 279540 275788 273294 271259 268918 266266 264212 263766 265023 267119 269124
57631 269124 270763 272189 273374 273994 273887 273316 272624 271679 269835 266509 261819 256641 251989 248224 244911
57616 244911 241548 238378 236161 235097 234389 233161 231417 229660 227993 226256 224824 224383 224873 225438 225569
57601 225569 225444 224940 223325 220524 217779 216198 215257 213640 211032 208128 205226 201914 198157 194666 191933
57586 191933 189589 186959 183815 180447 177381 175061 173429 171916 170227 168849 168194 167527 165641 162595 159851
57571 159851 158450 157809 156700 154647 151905 148733 145367 142429 140658 140256 140732 141338 141469 140886 139845 138965
57555 138965 138751 139253 140169 141178 142210 143580 145819 149122 152952 156425 159031 160739 161612 161788 161776 162172
57539A62172P80N60R1J02N69P87M28j67o55r42q97m59j01m73j399j913j511p55
57521A56217l13K0P95J809K191J603Q53J029K211L301L195J945N97m6j65l32n33
57504A74377k75M30P64K7j421k554k878k822k874k858k402j758j562j812j807
57489A50575j248p43q26j065q11l76n92j481k184k194j889j683j447j008n85m36
57473A32007m94n76n96m66j73j0k31n05k89K65M55J36j00N6J97M7q9o4k24o71
57453A28675r06o77m37m65l12K97P60N10m5j80Q0K71K96K55k5n35o79r2N82N29
57433A27902pj80J32L16J33m9N0L50P43J112J096N34q7k04L2J48J82M05N05l4
57413A33079q99j189p11j65JJ13M79P95O85K59j81n69r70j313j433j232p28p7
$$ plain form
57539 162172 162952 163512 163603 163705 164274 165061 165489 165322 164667 163725 162828 162369 162268 161795 160396 158483 156972 156217
57521 156217 155904 155924 156719 158528 160719 162322 163175 164204 166415 169716 172911 174856 175453 175407 175242 174910 174377
57504 174377 174102 174532 175296 175323 173902 171348 168470 165648 162774 159916 157514 155756 154194 152382 150575
57489 150575 149327 148584 147758 146693 145882 145506 144914 143433 141249 139055 137166 135483 134036 133028 132443 132007
57473 132007 131513 130937 130341 129875 129702 129692 129461 128956 128667 128932 129387 129523 129423 129479 129676 129723 129634 129570 129346 128675
57453 128675 127769 127092 126655 126190 125878 126175 126935 127445 127400 127220 127300 127571 127867 128122 128097 127562 126883 126791 127373 127902
57433 127902 127895 127715 127847 128163 128296 128247 128297 128647 129390 130502 131598 132132 132045 131841 131873 132021 132203 132608 133113 133079
57413 133079 132180 130991 130280 130115 130116 130229 130708 131503 132188 132447 132266 131697 130727 129414 127981 126749 126021 125944
57395A25944N11J023J566J990J911J362R62J094J339J229J103J583K559L336L546
57380A51058L309K710J782Q15J68j86l72l00o5l07j349k358k167q03N64J084Q89
57363A54472M27j6j70Q6L98L09qL4N74J232J702J892J650J065P70J200J774J661
57345A69052J097J012J507J732J304P90O68P70R03J115J156N78l78q65o16j89
57329A79636J06O01J300J581J313J284J935K558K380J761J545J778J770J146K45
57314B00939l25j90N56J349J658J531J338J079M98j61k61K78Q74J341K109L111
57298B15724L375K398J116Q53J730K764L133K819K289K016K119K172J674Q54N53
57283B45589J107J919K394K679L024L087K494J605J084R58O83Ro78q40l24N06
$$ plain form
57395 125944 126455 127478 129044 131034 132945 134307 135269 136363 137702 138931 140034 141617 144176 147512 151058
57380 151058 154367 157077 158859 159674 159842 159656 159284 158984 158919 158612 157263 154905 152738 151935 152499 153583 154472
57363 154472 154899 154883 154713 154799 155197 155506 155498 155532 156106 157338 159040 160932 162582 163647 164417 165617 167391 169052
57345 169052 170149 171161 172668 174400 175704 176494 177162 177932 178835 179950 181106 181684 181306 180441 179825 179636
57329 179636 179742 180343 181643 183224 184537 185821 187756 190314 192694 194455 196000 197778 199548 200694 200939
57314 200939 200614 200424 200980 202329 203987 205518 206856 207935 208433 208272 208011 208289 209163 210504 212613 215724
57298 215724 219099 221497 222613 223466 225196 227960 231093 233912 236201 238217 240336 242508 244182 245036 245589
57283 245589 246696 248615 251009 253688 256712 259799 262293 263898 264982 265940 266623 266632 265954 265114 264790 265296
57267B65296J045J039R51J431K427L262L587L726L962M109M042M034M292M647
57253C07850N024N645O482P018O951O679O687O933P126P260P497P913Q457Q894
57239D06416Q768P968P314P816R236J0246J0238R988J0233J0576J0445J0144J0229
57226E29617J0580J0924J1594J2921J4403J5266J5408J5241J5020J5044J5829
57215F81847J7353J8689J9190J9450K0339K1584K2286K2355K2442K2816K3239
57204I11590K3707K4378K4982K5228K5571K6714K8510L0270L1901L3810L5854
57193A222515L7471L8790M0544M2780M4627M5539M5834M5748M4931M3314M1754
57182A693847M1208M1704M2528M3049M3109M2864M2556M2242M1745M0989M0283
$$ plain form
57267 265296 266341 267380 268331 269762 272189 275451 279038 282764 286726 290835 294877 298911 303203 307850
57253 307850 312874 318519 325001 332019 338970 345649 352336 359269 366395 373655 381152 389065 397522 406416
57239 406416 415184 423152 430466 438282 447518 457764 468002 477990 488223 498799 509244 519388 529617
57226 529617 540197 551121 562715 575636 590039 605305 620713 635954 650974 666018 681847
57215 681847 699200 717889 737079 756529 776868 798452 820738 843093 865535 888351 911590
57204 911590 935297 959675 984657 1009885 1035456 1062170 1090680 1120950 1152851 1186661 1222515
57193 1222515 1259986 1298776 1339320 1382100 1426727 1472266 1518100 1563848 1608779 1652093 1693847
57182 1693847 1735055 1776759 1819287 1862336 1905445 1948309 1990865 2033107 2074852 2115841 2156124
57171B156124L9965L9891L9709L9460L9442L9598L9594L9383L9254L9324L9473
57160B591217L9646L9735L9367L8398L7467L7375L8116L9214M0733M2927M5007
57149C029202M5440M3838M1473L9481L7455L4487L0721K7054K3851K0897J8402
57138C392301J7198J7911K0447K4277K8801L3338L7149L9734M1089M1652M1843
57127C735740M1572M0426L8605L7436L8407M1676M6154N1137N7090O4543P2850
57116D265636Q0693Q7306R2760R7531J02543J09314J19243J32830J50106J71696
57106E409658J98595K31105K69018L13396L67585M35857N21353O25474P48825
57097I120866Q92203J056775J243176J449855J671961J902448K134359K361220
$$ plain form
57171 2156124 2196089 2235980 2275689 2315149 2354591 2394189 2433783 2473166 2512420 2551744 2591217
57160 2591217 2630863 2670598 2709965 2748363 2785830 2823205 2861321 2900535 2941268 2984195 3029202
57149 3029202 3074642 3118480 3159953 3199434 3236889 3271376 3302097 3329151 3353002 3373899 3392301
57138 3392301 3409499 3427410 3447857 3472134 3500935 3534273 3571422 3611156 3652245 3693897 3735740
57127 3735740 3777312 3817738 3856343 3893779 3932186 3973862 4020016 4071153 4128243 4192786 4265636
57116 4265636 4346329 4433635 4526395 4623926 4726469 4835783 4955026 5087856 5237962 5409658
57106 5409658 5608253 5839358 6108376 6421772 6789357 7225214 7746567 8372041 9120866
57097 9120866 10013069 11069844 12313020 13762875 15434836 17337284 19471643 21832863
57089B1832863K575137K766095K923380L034751L082525L046339K920109K729800
57081D4910999K525932K346379K181572J978337J679975J264293P49474J73906
57073E7810867m24715j017489j583217k104669k564699k944408l225814l397228
57065D0548628l456753l412321l280242l082897k844578k586649k325256k071959
57057A7487973j834642j617562j421989j247933j095096r62358q47454p47880
57049G713059o61750n87571n23683m68339m19961l77193l39009l05048k75356
57040C755149k49651k27036k06522j87545j69824j52968j36506j20171j04118
57031B200808q8709p4046n9646m4787k9127j2766L789J8741K8079K7053J3859
$$ plain form
57089 21832863 24408000 27174095 30097475 33132226 36214751 39261090 42181199 44910999
57081 44910999 47436931 49783310 51964882 53943219 55623194 56887487 57636961 57810867
57073 57810867 57386152 56368663 54785446 52680777 50116078 47171670 43945856 40548628
57065 40548628 37091875 33679554 30399312 27316415 24471837 21885188 19559932 17487973
57057 17487973 15653331 14035769 12613780 11365847 10270751 9308393 8460939 7713059
57049 7713059 7051309 6463738 5940055 5471716 5051755 4674562 4335553 4030505 3755149
57040 3755149 3505498 3278462 3071940 2884395 2714571 2561603 2425097 2304926 2200808
57031 2200808 2112099 2038053 1978407 1933620 1904493 1891727 1895516 1914257 1942336 1969389 1983248
57020A983248q547l4906o1155q4829j03361j14184j16712j12741j04568r3718
57010A148527q1697p0458o1237n3708m6926m0632l5145l0569k6686k3376k0656
56999F57437j8538j7034j6120j5566j5046j4425j3571j2089r777p199n166l614
56987E09292j696R18L580N580O757O985N879L463N11k332n246q619j2107j4839
56973D98126j6295j6550j5895j4553j2700j0488q055n531k968l45K213M460O587
56960D08006R381J3213J7073J9241J8957J6720J3102Q204K402l353q460j3115
56948E01371j7325k0185k0755j9237j6721j4018j1240q332n458k815k89K603O319
56935C73918J0721J5074J8756K1744K4005K4812K3249J9211J3312O000k361j0741
$$ plain form
57020 1983248 1974701 1939795 1878640 1793811 1690450 1576266 1459554 1346813 1242245 1148527
57010 1148527 1066830 996372 935135 881427 834501 793869 758724 728155 701469 678093 657437
56999 657437 638899 621865 605745 590179 575133 560708 547137 535048 525271 518072 512906 509292
56987 509292 507596 508514 512094 517674 524431 531416 537295 540758 541269 538937 533691 525072 512965 498126
56973 498126 481831 465281 449386 434833 422133 411645 403590 398059 395091 394746 396959 401419 408006
56960 408006 417387 430600 447673 466914 485871 502591 515693 523897 526299 522946 514486 501371
56948 501371 484046 463861 443106 423869 407148 393130 381890 373558 368100 365285 364996 367599 373918
56935 373918 384639 399713 418469 440213 464218 489030 512279 531490 544802 550802 548441 537700
56923E37700j7810k3149k7227l0080l0977k9686k7073k4034k0722j7225j4156
56912B75561j1964j0409r185q396p977p381o445n775n716n656m997m085l436k697
56898A81442j273N34J905K770L849N630P910J0287J2573J4811J7238K0007K2647
56885C00330K4180K3945K1974J8376J3112O778P64l932p408r848j0689r620p583
56872C60379n690l639l91M017Q467J2446J6562K1359K6683L2255L8033M3676M8357
56859F02514N1200N1352M7750L9612K7475J3147j431j4825k5795l3283l6965l7238
56847F83513l4513k9091k1812j3992o355J492J0191J9669K9431L9262M9232N9203
56835G86230O8761P7324Q3704Q5583Q0147O6005M4656J9786n078k8143m8594o5021
$$ plain form
56923 537700 519890 496741 469514 439434 408457 378771 351698 327664 306942 289717 275561
56912 275561 263597 253188 244003 235607 227630 220249 213804 208029 202313 196657 191660 187575 184139 181442
56898 181442 180169 180703 182608 185378 189227 194857 202767 213054 225627 240438 257676 277683 300330
56885 300330 324510 348455 370429 388805 401917 408695 409459 405527 398119 388271 377582 367962 360379
56872 360379 354689 351050 350659 354676 363143 375589 392151 413510 440193 472448 510481 554157 602514
56859 602514 653714 705066 752816 792428 819903 833050 831619 816794 790999 757716 720751 683513
56847 683513 649000 619909 598097 584105 577750 579242 589433 609102 638533 677795 727027 786230
56835 786230 854991 932315 1016019 1101602 1181749 1247754 1292410 1312196 1307118 1278975 1230381 1165360
56823A165360p5463p9133p7186p1405o2754n1749l9529k7648j6821o635L520J3732
56811F74289K3831L3771M3471N2341N8975O1317N7456M6851L0805J1702q113k6769
56799A059927m2801n5239o3672o7880o7629o3188n5754m6972l8050k9569k1804
56788E07369j4792q224j682N005J1791J8483K4466K8656L0065K8287K3298J5296
56776F68018N082n830j6031k4888l2133l7234l9780m0126l9068l7058l4233l0842
56764C35877k7200k3428j9740j6648j4304j2084r473p021n686n442n369m940m455
56751A80087m203m001l596k997k331j806j725k074k244j705p86k67l42o30r61
56736A50419j487k093k321j882q62L85J142O36q54j762r94M82R51L51J49R56J805
$$ plain form
56823 1165360 1089897 1010764 933578 862173 799419 747670 708141 680493 663672 657037 660557 674289
56811 674289 698120 731891 775362 827703 886678 947995 1005451 1052302 1083107 1094809 1086696 1059927
56799 1059927 1017126 961887 898215 830335 762706 699518 643764 596792 558742 529173 507369
56788 507369 492577 484353 482671 487676 499467 517950 542416 571072 601137 629424 652722 668018
56776 668018 673100 667270 651239 626351 594218 556984 517204 477078 438010 400952 366719 335877
56764 335877 308677 285249 265509 248861 234557 222473 213000 205979 200293 194851 189482 184542 180087
56751 180087 175884 171883 168287 165290 162959 161153 159428 157354 155110 153405 152619 152352 152010 151380 150419
56736 150419 148932 146839 144518 142636 141774 142159 143301 143937 143083 141321 140327 140809 141760 142111 142260 143216 145021
56719A45021J931J754J673J237K81l19J23R95J361J316J496J890K026J924J969
56704A64678K071J787J183Q07P88N48k82j115r96R3R29K97j443k577j968k89J032
56687A65543J513J542J146mj375j577p6J907K694J840J92j163j672j506j262j289
56671A66453j186m63M49N65j70o32j25O83Q39M32J63K16K73K66M43R01J529K202
56653A72838K717K741K241J660J370J268J147J084J155J105P38K97J22K13M15
56638A91111P09J056J243J201J164J186R44L46j34j29k6l85j043j348j088p17
56622A94090p10j084j518j655j380r87r26j199j286q69l35k34n30p38n96k25J88
56605A80006M74L92j49p94j013o54p7K35R1l17n66m02JK43K13J57K31K81K14K26
$$ plain form
56719 145021 146952 148706 150379 151616 151897 151578 151701 152696 154057 155373 156869 158759 160785 162709 164678
56704 164678 166749 168536 169719 170526 171314 171862 171580 170465 169469 169562 170491 170788 169345 166768 164800 164511 165543
56687 165543 167056 168598 169744 169740 168365 166788 166712 168619 171313 173153 173345 172182 170510 169004 167742 166453
56671 166453 165267 164804 165253 165818 165648 165016 164891 165574 166413 166845 167008 167224 167497 167763 168206 169107 170636 172838
56653 172838 175555 178296 180537 182197 183567 184835 185982 187066 188221 189326 190064 190361 190483 190696 191111
56638 191111 191820 192876 194119 195320 196484 197670 198614 198960 198826 198697 198671 198286 197243 195895 194807 194090
56622 194090 193380 192296 190778 189123 187743 186756 185830 184631 183345 182476 182141 181907 181377 180639 180043 179818 180006
56605 180006 180480 180872 180723 179929 178916 178262 178185 178420 178511 178194 177628 177226 177227 177470 177683 177840 178071 178352 178566 178792
56585A78792M70P55Q11O41M07J97K4j04k38m37n32k33M42J096J437J602J838K117
56567A89085K258K255K326K731L595M806O118P461R003J0620J1535J0970R077
56554B71840O825M978L613K515J533N10n93j482j860j882j894j850j596j492j966
56539B77199k575k449j687j319j793k515l057l656m165l823k647j919k413l173
56525B40008l045k431k372k638k145q72J4q7n22n98m93o71j104j443j512j341
56509B18748j019p06o28r50j650k392k507j541M0J080R59J90m19p47j091j439
56493B05928j559j472j314r97m24J38L68L26K63K69L70P33J394K032K280K050
56477B10385J422O39K82Q52J971K567K159J326O65J35j90K75J555K517K178R50
$$ plain form
56585 178792 179262 180017 180828 181469 181876 182073 182097 181993 181755 181318 180786 180553 180995 182091 183528 185130 186968 189085
56567 189085 191343 193598 195924 198655 202250 207056 213174 220635 229638 240258 251793 262763 271840
56554 271840 278665 283643 287256 289771 291304 291814 291221 289739 287879 285997 284103 282253 280657 279165 277199
56539 277199 274624 272175 270488 269169 267376 264861 261804 258148 253983 250160 247513 245594 243181 240008
56525 240008 236963 234532 232160 229522 227377 226505 226519 226432 225910 225312 224819 224148 223044 221601 220089 218748
56509 218748 217729 217023 216395 215445 213795 211403 208896 207355 207395 208475 209434 209624 209205 208458 207367 205928
56493 205928 204369 202897 201583 200586 200162 200300 200668 200994 201257 201526 201896 202629 204023 206055 208335 210385
56477 210385 211807 212446 212728 213580 215551 218118 220277 221603 222268 222403 222213 222488 224043 226560 228738 229688
56461B29688j68r28j442j273j37J051J035j08j188j556j470j101l78L12M11J95
56445B22943M29R67Q26j52q34l42P77J467J487J296J158R06L89k77q16j004q55
56428B28365n92l92k70k85m79n24N8J028J401Q05J83N28J469J956J761J419J084
56411B37515N97K75N42R39O48l2L2R98J677J250L05k69m66o94r29q90n74j35L35
56392B41124O33M63k7k02L38J245J811J658J022O19J100K287L128K863J988J514
56376B61564J556J387O98j6l43l77k48M8L03K97M11J212K372K835K271J470J141
56359B76581J092R37Q08R24J150J404J888K515K655J910P48l4j23K76Q28J184
56343B94743J134Q95R26J300J615J665J758K169K743L246L677M037M144L916L518
$$ plain form
56461 229688 229520 228592 227150 225877 225740 226791 227826 227718 226530 224974 223504 222403 222025 222337 222748 222943
56445 222943 223372 224339 225165 225013 224179 223837 224614 226081 227568 228864 230022 230928 231317 231040 230224 229220 228365
56428 228365 227773 227381 227111 226826 226347 225823 225881 226909 228310 229115 229298 229826 231295 233251 235012 236431 237515
56411 237515 238112 238387 238929 239868 240516 240484 240516 241514 243191 244441 244746 244477 244011 243317 242388 241498 240924 240789 241124
56392 241124 241757 242220 242193 241991 242329 243574 245385 247043 248065 248684 249784 252071 255199 258062 260050 261564
56376 261564 263120 264507 265205 265189 264846 264469 264221 264269 264572 264869 265280 266492 268864 271699 273970 275440 276581
56359 276581 277673 278610 279418 280342 281492 282896 284784 287299 289954 291864 292612 292578 292455 292731 293559 294743
56343 294743 295877 296772 297698 298998 300613 302278 304036 306205 308948 312194 315871 319908 324052 327968 331486
56328C31486L038K415J765J416J430J463J323J286J632K158K409K212J769J321
56314C57123Q68K44m84p94j74J135K214K547K579K958L667M365N103O040O846
56299C94237P052O729O266N745N123M688M679M759M585M471M826N343N525N665
56285D69693O321P237P807Q285R322J0550J0843J0104R618J0402J2210J4287J6209
56272F02888J7749J8845J9904K1436K3249K4739K5919K7433K9588L2149L5036
56261H78935L8403M2176M6305N1276N7485O4480P1719P9680Q9045R9248J09220
56250A627972J19229J30401J42668J54772J66153J77020J86609J93335J96942
56241C095101J98489J97808J92892J82408J66981J47339J23222R5059O4755L3676
$$ plain form
56328 331486 334524 336939 338704 340120 341550 343013 344336 345622 347254 349412 351821 354033 355802 357123
56314 357123 357991 358235 357751 356957 356783 357918 360132 362679 365258 368216 371883 376248 381351 387391 394237
56299 394237 401289 408018 414284 420029 425152 429840 434519 439278 443863 448334 453160 458503 464028 469693
56285 469693 476014 483251 491058 499343 508665 519215 530058 540162 549780 560182 572392 586679 602888
56272 602888 620637 639482 659386 680822 704071 728810 754729 782162 811750 843899 878935
56261 878935 917338 959514 1005819 1057095 1114580 1179060 1250779 1330459 1419504 1518752 1627972
56250 1627972 1747201 1877602 2020270 2175042 2341195 2518215 2704824 2898159 3095101
56241 3095101 3293590 3491398 3684290 3866698 4033679 4181018 4304240 4399299 4464054 4497730
56231D497730J552l1311o2588r0125j14143j35540j53491j66456j74664j79720
56221C391244j82358j82124j78885j73220j65697j56851j47548j38346j28979
56212A937236j19306j10072j01842r3920q5483p7109p0007o4239n8923n3708m8888
56201A053739m4418l9990l5879l2681l0291k7981k5392k2721k0136j7732j5789
56190G40729j4405j3102j1376r394p628o178m994m338m383m644m425l655k820
56177F49387k272j973j690j237o98m14l87rJ042J928J706R92J347K995M594N399
56161F60710O079P087P874Q290R174J0805J2216J2911J3794J5588J7745J9818
56149H02091K2514K6333L0682L5276M0958M8029N5327O2255P0073P9676Q9514
$$ plain form
56231 4497730 4499282 4467971 4405383 4315258 4201115 4065575 3912084 3745628 3570964 3391244
56221 3391244 3208886 3026762 2847877 2674657 2508960 2352109 2204561 2066215 1937236
56212 1937236 1817930 1707858 1606016 1512096 1426613 1349504 1279497 1215258 1156335 1102627 1053739
56201 1053739 1009321 969331 933452 900771 870480 842499 817107 794386 774250 756518 740729
56190 740729 726324 713222 701846 692452 684824 678646 673652 669314 664931 660287 655862 652207 649387
56177 649387 647115 645142 643452 642215 641517 641103 640716 640707 641749 643677 645383 646375 647722 650717 655311 660710
56161 660710 666789 673876 681750 690040 699214 710019 722235 735146 748940 764528 782273 802091
56149 802091 824605 850938 881620 916896 957854 1005883 1061210 1123465 1193538 1273214 1362728
56138A362728R7311J02473J05198J04625R9889R2024Q2977P3516O3756N4736M7501
56127B286734M1269L4422K6828J9565J2817N801j586q636j5088k1291k7434l3865
56115B319536m1623n1446o2590p3581q3411r1089r5157r4993r1783q6874q0186
56104A466803p1494o2133n3669m5962l8241l1143k5821k1752j7482j2939r261
56093A076906o784m860l263k139j019N86K183L159M002N267O247O175N824O264
56079A098548P079P433P903R325J0850J1242J1143J2000J3524J4402J4735J5608
56067A233792J6840J7388J7415J7905J8737J9150J9505K0595K1862K2320K2436
56056A447945K3084K3521K2580K1009K0321K0203J9419J8384J8425J9277J9816
$$ plain form
56138 1362728 1460039 1562512 1667710 1772335 1872224 1964248 2047225 2120741 2184497 2239233 2286734
56127 2286734 2328003 2362425 2389253 2408818 2421635 2427436 2425850 2417214 2402126 2380835 2353401 2319536
56115 2319536 2277913 2226467 2163877 2090296 2006885 1915796 1820639 1725646 1633863 1546989 1466803
56104 1466803 1395309 1333176 1279507 1233545 1195304 1164161 1138340 1116588 1099106 1086167 1076906
56093 1076906 1070122 1065262 1061999 1059860 1058841 1059427 1061610 1064769 1068771 1074038 1080285 1086460 1092284 1098548
56079 1098548 1105627 1113060 1120963 1130288 1141138 1152380 1163523 1175523 1189047 1203449 1218184 1233792
56067 1233792 1250632 1268020 1285435 1303340 1322077 1341227 1360732 1381327 1403189 1425509 1447945
56056 1447945 1471029 1494550 1517130 1538139 1558460 1578663 1598082 1616466 1634891 1654168 1673984
56045A673984K0434K2156K4256K5335K5912K7244K8635K8723K8455K9684L1786
56034A966604L2892L3554L5763L9041M1186M2280M4285M7026M8389M8430M9486
56023B428936N2093N4408N5857N7838O0584O2785O4490O7087P0354P2871P5273
56012C122576P9535Q5117Q9486R2537R6683J02511J08063J12638J17610J23280
56002D130036J28548J33822J40734J49028J57140J65486J75417J85842J94914
55993E560967K04096K16104K29955K42968K56454K73915K94716L15520L37006
55984G931701L62773L92389M22406M53725M90822N34040N80003O29381O86493
55975A2483733P51702Q22512R01826R96332J107110J231619J374595J546595J752280
$$ plain form
56045 1673984 1694418 1716574 1740830 1766165 1792077 1819321 1847956 1876679 1905134 1934818 1966604
56034 1966604 1999496 2033050 2068813 2107854 2149040 2191320 2235605 2282631 2331020 2379450 2428936
56023 2428936 2481029 2535437 2591294 2649132 2709716 2772501 2836991 2904078 2974432 3047303 3122576
56012 3122576 3202111 3287228 3376714 3469251 3565934 3668445 3776508 3889146 4006756 4130036
56002 4130036 4258584 4392406 4533140 4682168 4839308 5004794 5180211 5366053 5560967
55993 5560967 5765063 5981167 6211122 6454090 6710544 6984459 7279175 7594695 7931701
55984 7931701 8294474 8686863 9109269 9562994 10053816 10587856 11167859 11797240 12483733
55975 12483733 13235435 14057947 14959773 15956105 17063215 18294834 19669429 21216024 22968304
55966B2968304J992193K276447K623873L046924L550737M147048M853637N680194
55958E1139357O633205P736388R027709J0538072J2297219J4354827J6755866
55951A28482643J9492974K2528565K5842620K9307345L2374529L3945866L2784575
55944C24759117K8261412K0775491J1473426J591832p968869j6614041k3834006
55937C38444362k9129201l2146402l2861421l1631023k9063973k5800594k2345299
55930A35466449j9025212j6027995j3438883j1261953r453338p960692o737602
55923E1560774n736040m907969m218472l646145l170146k767633k423614k131970
55915B2558785j885053j671377j484212j323143j185596j064719r56831q63204
$$ plain form
55966 22968304 24960497 27236944 29860817 32907741 36458478 40605526 45459163 51139357
55958 51139357 57772562 65508950 74536659 85074731 97371950 111726777 128482643
55951 128482643 147975617 170504182 196346802 225654147 258028676 291974542 324759117
55944 324759117 353020529 373796020 385269446 386861278 378892409 362278368 338444362
55937 338444362 309315161 277168759 244307338 212676315 183612342 157811748 135466449
55930 135466449 116441237 100413242 86974359 75712406 66259068 58298376 51560774
55923 51560774 45824734 40916765 36698293 33052148 29882002 27114369 24690755 22558785
55915 22558785 20673732 19002355 17518143 16195000 15009404 13944685 12987854 12124650
55907A2124650p83093p11936o47671n92172n45145n02644m62855m27629l97228
55898G054277l68935l41831l17772k96799k76408k56085k37892k22020k06341
55889D530194j90753j77311j65711j53298j39897j28129j18554j09101r9747r3113
55879C154580q9811q7591q5658q5473q6647q6529q4670q3381q3028q1055p6673
55868B224064p2357o9502o6524o2471n8732n5929n2695m8784m5911m4345m2119
55857A604695l8753l6395l5993l5675l4159l2627l1908l0930k9230k8046k7743
55846A243236k7050k5900k6000k7426k7743k5864k3774k3072k2688k1523k0510
55835I71686k0424k0211j9059j7770j6748j5063j2749j1487j1695j1540j0214
$$ plain form
55907 12124650 11341557 10629621 9981950 9389778 8844633 8341989 7879134 7451505 7054277
55898 7054277 6685342 6343511 6025739 5728940 5452532 5196447 4958555 4736535 4530194
55889 4530194 4339441 4162130 3996419 3843121 3703224 3575095 3456541 3347440 3247693 3154580
55879 3154580 3064769 2977178 2891520 2806047 2719400 2632871 2548201 2464820 2381792 2300737 2224064
55868 2224064 2151707 2082205 2015681 1953210 1894478 1838549 1785854 1737070 1691159 1646814 1604695
55857 1604695 1565942 1529547 1493554 1457879 1423720 1391093 1359185 1328255 1299025 1270979 1243236
55846 1243236 1216186 1190286 1164286 1136860 1109117 1083253 1059479 1036407 1013719 992196 971686
55835 971686 951262 931051 911992 894222 877474 862411 849662 838175 826480 814940 804726
55824H04726r484j0464j1491j1009j0086j0146j0489j0055r559r869j0105r340
55812F82629q473q584q920q309p112o129n036l421k070j638j329k67J068J987
55798F24396K852L970M635M421M030L765K705N55j356k134k719l876m589m082
55784F32573l702m983p215q776r644j0732j1766j1808j1050j0402r794q325n654
55771E18722k026K267O312Q381P595N114K511k40l947q318j2226j5185j7184j7704
55757D74072j6213j3333j0468q477p455p171p013o166m648l545l558m078m332
55744C77615m487m835m841m011k794j815j005l42m65j555k573k583k024j717j554
55729C41014j259j509l051n271o824p253p038o589o041n543m990m023k838k283
$$ plain form
55824 804726 795242 784778 773287 762278 752192 742046 731557 721502 711943 702074 691969 682629
55812 682629 674156 665572 656652 648343 641231 635102 630066 626645 624575 622937 621608 621341 622409 624396
55798 624396 627248 631218 635853 640274 644304 648069 650774 651329 649973 647839 645120 641244 636655 632573
55784 632573 628871 623888 616673 607897 598253 587521 575755 563947 552897 542495 532701 524376 518722
55771 518722 516696 518963 525275 533656 541251 546365 548876 548636 544689 536371 524145 508960 491776 474072
55757 474072 457859 444526 434058 425581 418126 410955 403942 397776 393128 389583 386025 381947 377615
55744 377615 373128 368293 363452 359441 356647 354832 353827 353485 353020 351465 348892 346309 344285 342568 341014
55729 341014 339755 338246 335195 329924 323100 315847 308809 302220 296179 290636 285646 281623 278785 276502
55715B76502k525k481j306N33K299M024N682O444N839M750M131L569K152j6k144
55700C07453l827m923n272n370o307q036q858p649n525m038l023j645l92k47p48
55685B41593o82m9L44P17J894L445M013L402K776K807L069L161L048K380Q58p37
55669B72039j228p93p23j454k080j988j671j647j644j284o91p0N83J163J433J465
55653B61410J555J706J677J396Q61r1j361k212k053j282p76q02j149j840l001
55638B54038m324n347n963o096n461m298l641l953m306l850l302l694m368l878
55624A91557k401j579k016k599k406j847j497j163n83j18k25r75k227l661m536
55609A63724m225l037j869j101n45k99o82j385j640j255p28l63j00j08o02j165
$$ plain form
55715 276502 273977 271496 270190 270723 273022 277046 282728 289172 295011 299761 303892 307461 309613 309597 307453
55700 307453 303626 298703 293431 288061 281754 273718 264860 257211 251686 247648 244625 242980 242588 242341 241593
55685 241593 240911 240862 241206 241923 243817 247262 251275 254677 257453 260260 263329 266490 269538 271918 272776 272039
55669 272039 270811 270018 269295 267841 265761 263773 262102 260455 258811 257527 256836 256766 257349 258512 259945 261410
55653 261410 262965 264671 266348 267744 268605 268514 267153 264941 262888 261606 260830 260028 258879 257039 254038
55638 254038 249714 244367 238404 232308 226847 222549 218908 214955 210649 206799 203497 199803 195435 191557
55624 191557 189156 187577 185561 182962 180556 178709 177212 176049 175466 175348 175123 174148 171921 168260 163724
55609 163724 159499 156462 154593 153492 152947 152648 151966 150581 148941 147686 146958 146595 146495 146387 145785 144620
55593A44620j159p51o18q05q51q73j360j944j689o41J56L32N90J208J515J286
55577A39016J324K015K559K392K241K842L666L931M050M805N703N399L647J711
55563A85301P27N75N30K89j20q27k003l347m170m164l785l701l973m118l837l294
55547A50083k630j712o12K33N75P23R75J145J033Q78R28R98R37J008J282J191
55531A57035L49o57j016q10n71k50M80J243J266M84n36j560k613l291l143k676
55515A43734k837l535l680k830j789j359j403j461j486j673k044k413k389j512
55501A13323L5J156R68nn33l34j02j35o5J30m3n54p29l79j18l61q36j211j367
55482A08840r97P8J122J062K2p24n29k9J95M26Q69J035N84r5o10j038j259q04
$$ plain form
55593 144620 143461 142710 142092 141287 140436 139563 138203 136259 134570 133929 134085 134417 135007 136215 137730 139016
55577 139016 140340 142355 144914 147306 149547 152389 156055 159986 164036 168841 174544 179943 183590 185301
55563 185301 186028 186603 187133 187422 187302 186475 184472 181125 176955 172791 169006 165305 161332 157214 153377 150083
55547 150083 147453 145741 145129 145362 145937 146660 147635 148780 149813 150691 151619 152617 153554 154562 155844 157035
55531 157035 157384 156727 155711 154901 154330 154080 154560 155803 157069 157553 157017 155457 152844 149553 146410 143734
55515 143734 140897 137362 133682 130852 129063 127704 126301 124840 123354 121681 119637 117224 114835 113323
55501 113323 113358 114514 115482 115477 114944 114610 114508 114373 114308 114438 114395 113841 113112 112733 112615 112254 111418 110207 108840
55482 108840 107843 107921 109043 110105 110127 109403 108874 108845 109040 109466 110335 111370 111954 111859 111249 110211 108952 108148
55464A08148J64O82L22j66q9K51L84M69O29L97l99r70o40J26M96M64M94M91R5
55445A11348m46m77Q7O34N53k19j193j633j260o84p17j212j250n26K76O89R86
55428A04956J212Q31j57p66m28J36J95J82O78J260J379J572K518L608L688K825
55412A23689K001J454O02n33j178j160j199j618j828j423r30r87j446j703j474
55397A12267q62j13L70J52p71j723j902j181k62Qm39q08l67N59R21K31q37j345
55379A03898j084m77P8M14M65L19J77N3k49o78p88l30M31J081J382J132K80n57
55361A05547m36O59J522J227L45L0M16O88L40l57r86j366j408j106o64k87J5J86
55343A04365k9p10j511k039k172j811q45L34R23P30N22Q43J159P68m4n58o82p14
$$ plain form
55464 108148 108312 108994 109316 109150 109061 109312 109696 110165 110794 111191 110792 109822 109182 109308 109804 110268 110762 111253 111348
55445 111348 110902 110425 110512 111146 111699 111480 110287 108654 107394 106710 105993 104781 103531 103005 103281 103970 104956
55428 104956 106168 106999 106842 106076 105648 105784 105979 106161 106839 108099 109478 111050 113568 117176 120864 123689
55412 123689 125690 127144 127746 127213 126035 124875 123676 122058 120230 118807 117877 116890 115444 113741 112267
55397 112267 111405 111292 111662 111814 111043 109320 107418 106237 105975 105983 105544 104736 104369 104928 105849 106080 105243 103898
55379 103898 102814 102337 102415 102829 103294 103613 103790 103843 103594 102916 102128 101798 102229 103310 104692 105824 106104 105547
55361 105547 105111 105770 107292 108519 108864 108894 109310 109998 110338 109981 108995 107629 106221 105115 104451 104164 104179 104365
55343 104365 104336 103626 102115 100076 97904 96093 95248 95582 96505 97235 97757 98600 99759 100527 100483 99925 99243 98529
55325I8529n15J22P19O54K08J66O54J148J407J498J217M04l77m64k26n40j246
55308A03358j337o35r4j80j62N52J410J648J377J069O92M8n81p11l90p4j01n71
55290A05318j397k083j913p79M42Q28M96L32P40J167R29J68l10l3N74Q04O01M97
55272A06381O15L67n46j382j263m31J53K26L56P07O84N3m71k60K99M72K67K29
55254A06456N17P29N08r5p98j236j120n12J36M75N98P08O92L60r2k96k75l53n54
55235A05848n01m5M12M65K77L42P66J104Q74Kj188k135k226j258J07O95R3p22
55217A02910m73P78J672J263J06n84l55K93P09O85M20K60L60M22qq07j212p65
55199A05674Q2O63R92J389J635J170M6j064j750k126k153j478j65R65J211P90
$$ plain form
55325 98529 98014 98136 98855 99509 99717 99883 100537 101685 103092 104590 105807 106211 105834 105370 105144 104604 103358
55308 103358 102021 101386 101292 101112 100950 101502 102912 104560 105937 107006 107698 107746 107165 106454 106064 105990 105889 105318
55290 105318 103921 101838 99925 99146 99588 100416 100912 101244 101984 103151 104080 104248 103938 103905 104479 105283 105884 106381
55272 106381 106996 107363 106817 105435 104172 103741 103894 104120 104476 105183 105867 105920 105449 105189 105488 105960 106227 106456
55254 106456 106973 107702 108210 108115 107317 106081 104961 104449 104585 105060 105658 106366 107058 107418 107326 107030 106755 106402 105848
55235 105848 105347 105302 105714 106179 106456 106798 107564 108668 109542 109544 108356 106221 103995 102737 102844 103539 103632 102910
55217 102910 102437 103215 104887 106150 106256 105672 105317 105610 106319 107004 107424 107684 108044 108466 108458 107651 106439 105674
55199 105674 105756 106419 107411 108800 110435 111605 111651 110587 108837 106711 104558 103080 102915 103880 105091 105881
55183A05881M36M88P46R36R54O87N7p14j155j015n49k32k04j91P2N16R17J215
55165A08845J429J375Q63J41j87J33P21J023Q53L26l88j035j322j234j070j008
55149A09465q84o07m30n30p06p90r79j391j592j085m3Q13R99N88nk69O4N94M90
55130A03702l73r11j16J506K484K229J523J206J177R00K53m98j095j358j168o44
55114A08817j09K72N70Q00Q21O18L91K34k2m66q57q05j57Q26J626J833J492R77
55096A16861N51J81j05m4M79J064J241J012P13N51N43O91Q73P75L03j74l19l13
55078A24883m21m53j17L64N33M33M63O59P03N57M41K70l11j257k004k137j694
55061A20912q99J5P08R72J017J094R20K7j313k064j554k43P54O48m59j728k316
$$ plain form
55183 105881 106317 106805 107551 108487 109441 110128 110185 109471 108316 107301 106752 106520 106316 106125 106197 106713 107630 108845
55165 108845 110274 111649 112512 112653 112466 112599 113320 114343 115196 115522 115134 114099 112777 111543 110473 109465
55149 109465 108581 107974 107544 107014 106308 105518 104539 103148 101556 100471 100428 101241 102240 102828 102823 102554 102618 103212 103702
55130 103702 103329 102418 102302 103808 106292 108521 110044 111250 112427 113327 113580 113082 111987 110629 109461 108817
55114 108817 108708 108980 109550 110350 111171 111789 112180 112414 112392 111926 111069 110264 110107 110933 112559 114392 115884 116861
55096 116861 117412 117593 117488 117444 117923 118987 120228 121240 121953 122504 123047 123738 124611 125386 125689 125515 125196 124883
55078 124883 124462 124009 123892 124256 124789 125222 125685 126344 127047 127604 128045 128315 128004 126747 124743 122606 120912
55061 120912 120013 120028 120736 121708 122725 123819 124739 124766 123453 121389 119835 119592 120346 120994 120535 118807 116491
55044A16491k112j637j217o90q9O4l27m02M98J699K034J395N49j23o82q22k05
55027A14424N93O38R4l4M76Q78Q81R28R98M90l85n38J88N47j30q57o69j67k81
55008A18074o26k62O56J243J348J488J707J526R33M49L01K22O5J4J42K19N9k29
54990A27329k60K98J267J815J263l2j062j408j376j067k51O67P47l0m89qN84M80
54972A28467J40K35L67l5n01l88j12l07m02N26J953K374J346j38j230j893k147
54955A28255j801j085n13m1P34J565J679R72J49l78p99j095q76j76M30P11R65
54938A28696J211J096P14O01P83O93K96K87Q32J075M64k83k00O58J599K385L253
54921A44160M239N134N859O403O563O185N487M859M510M465M555M263L007Q96
$$ plain form
55044 116491 114379 112742 111525 110835 110746 110810 110483 110081 110579 112278 114312 115707 116256 116133 115451 114629 114424
55027 114424 115017 115655 115749 115715 116191 117069 117950 118878 119876 120366 119981 119443 119631 120178 120048 119191 118522 118355 118074
55008 118074 117448 117186 117842 119085 120433 121921 123628 125154 126087 126536 126837 127059 127124 127138 127280 127499 127558 127329
54990 127329 127069 127367 128634 130449 131712 131680 130618 129210 127834 126767 126516 127183 127930 127900 127411 127403 127987 128467
54972 128467 128607 128842 129209 129174 128673 128285 128173 127866 127464 127990 129943 132317 133663 133525 132295 130402 128255
54955 128255 126454 125369 124856 124815 125549 127114 128793 129765 129914 129536 128737 127642 126766 126590 127020 127731 128696
54938 128696 129907 131003 131717 132318 133101 133794 134090 134377 135209 136284 136748 136465 136265 136923 138522 140907 144160
54921 144160 148399 153533 159392 165795 172358 178543 184030 188889 193399 197864 202419 206682 209689 210585
54907B10585j262k930m392n862o707o239m939m072m116m373m239m071m345m583
54893A48455l809j993l27J45k95n52r4O16R34P77N05M88R76J950K947L428L499
54876A57650L839M686N450N630N600N853O044N512M356L164J916J19k066l791
54862B03962m681n140n358m990m146l724m166m706m466l745l422l617l711l398
54848A44692k910k330j503o45l50p54j206j039l67J88K76L8k86o21r37j118j093
54831A30035r66q27n75p0N16P50M72J3k76m34o10o21k05M06N92J00o59j099j005
54812A25537n18Q3N00N39K84k4l18o93j055j073n65K32R45J402J626J670J524
54795A30096J115L89m86j039r14l18K23N23Q09J098R90L36k78j41O56J280J156
$$ plain form
54907 210585 209323 206393 202001 196139 189432 183193 178254 174182 170066 165693 161454 157383 153038 148455
54893 148455 144646 142653 142326 142471 142176 141624 141530 142146 143080 143857 144362 144850 145826 147776 150723 154151 157650
54876 157650 161489 166175 171625 177255 182855 188708 194752 200264 204620 207784 209700 209819 207753 203962
54862 203962 199281 194141 188783 183793 179647 175923 171757 167051 162585 158840 155418 151801 148090 144692
54848 144692 141782 139452 137949 137304 136954 136200 134994 133955 133588 133776 134052 134090 133804 133183 132246 131128 130035
54831 130035 129069 128242 127667 127597 128113 128863 129335 129348 129072 128638 128028 127407 127202 127608 128200 128300 127641 126542 125537
54812 125537 125019 125102 125602 126141 126425 126401 126083 125390 124335 123262 122697 122929 123874 125276 126902 128572 130096
54795 130096 131211 131600 131114 130075 129161 128843 129066 129589 130398 131496 132486 132822 132544 132403 133059 134339 135495
54778A35495O19M49R33J593J847J754J843K287K591K354K018K461L892N587O767
54763A72490P396P911Q451Q569P693N824L713K258J581Q79o37k838m955o472p393
54748B04470p727p348o396n349m560m039l774l790l822l402k499j684j352j232
54734A47496q73k83L00Q50J427J843J927J861J880J797J424J259K109L947N724
54719A72688O583O739O776O558N438L447J544M74j37j178k843m487n513n931o027
54704A84131n874n435m841m293l763l054k117j241q49j093j616j796j414r48r54
54689A44843j297j400j138r60j075j146r47o94n08j80J60j53j250k113j737m71
54673A29934N55Q68P67M82R0n9K21L59j77p21k01J029J474O71k34l68k73o06q87
$$ plain form
54778 135495 136114 136563 137496 139089 140936 142690 144533 146820 149411 151765 153783 156244 160136 165723 172490
54763 172490 179886 187797 196248 204817 212510 218334 222047 224305 225886 226765 226128 223290 218335 211863 204470
54748 204470 196743 189395 182999 177650 173090 169051 165277 161487 157665 154263 151764 150080 148728 147496
54734 147496 146623 146340 146640 147490 148917 150760 152687 154548 156428 158225 159649 160908 163017 166964 172688
54719 172688 179271 186010 192786 199344 204782 208229 209773 210247 210110 208932 206089 201602 196089 190158 184131
54704 184131 178257 172822 167981 163688 159925 156871 154754 153513 152664 151571 149955 148159 146745 145797 144843
54689 144843 143546 142146 141008 140048 138973 137827 136880 136186 135678 135498 135658 135505 134255 132142 130405 129934
54673 129934 130489 131357 132124 132606 132696 132637 132858 133217 133040 132319 132118 133147 134621 135292 135058 134690 134417 133811 132924
54654A32924m57K82N31L09J86K66K83K62L74M40K07j62l71m21k82L34J298J664
54636A37667P44p73j575j319o97k22K24O56P53M50J45Q5R4N2J15L19L58%n82r99
54616A35495j029p34m02l12m57n65m65j85L43J218K018J904P19m93p08k00M8j55
54598A36040j88K25P09J060J355J314M48q69j453p61L17N92j32j183j836j653
54582A33985o16O60J263R96O12P78J214J298R37M44n7n32p32n27k84l93p16q75
54564A37455q67q39n99O3Q48J279J345J264Q30k13j319j560r31m01m59m97K1N94
54546A36014N21Q9J66R07J611J730J437J168J033P85J69p17j322j054rR86J285
54529A44799J069P93M50j47o75o50k62j56l98m41j53m8k88l33K9J33m49j030p58
$$ plain form
54654 132924 132467 132749 133280 133589 133775 134041 134324 134586 134960 135400 135607 135445 135074 134653 134371 134705 136003 137667
54636 137667 138411 137638 136063 134744 134047 133825 134049 134705 135458 135908 136053 136138 136232 136284 136399 136718 137076 137076 136494 135495
54616 135495 134466 133732 133330 133018 132561 131996 131531 131346 131689 132907 134925 136829 137548 137055 136347 136147 136195 136040
54598 136040 135852 136077 136786 137846 139201 140515 140963 140094 138641 137880 138197 138789 138657 137474 135638 133985
54582 133985 133369 134029 135292 136288 136900 137678 138892 140190 141127 141571 141514 140982 140250 139723 139439 139046 138330 137455
54564 137455 136588 135749 135150 135213 136061 137340 138685 139949 140779 140566 139247 137687 136756 136355 135896 135399 135420 136014
54546 136014 136535 136624 136790 137697 139308 141038 142475 143643 144676 145461 145630 144913 143591 142537 142528 143514 144799
54529 144799 145868 146661 147111 146964 146289 145639 145377 145221 144823 144382 144229 144181 143893 143560 143589 143722 143273 142243 141485
54510A41485K8L18q1m06j84K55N28O18N00O1l95k90K89M76j42p73n22K48L61n47
54490A41827j469j318k38O74O80J34j07L06R75J381J397J185Q71N74M83O13O59
54473A48627M68M25R45J678J800J085K03k05k50l91p24r95j041q81n51q5M01P93
54455A51302R72P79K23k68j61M89J001Q84L72q2m11p59j019r79o78k92J96P99
54437A52368J192R73K14n42q98r58j026j179j201q71l27o7m31j055j083j23J230
54420A46216K065K140J956J938J894J466Q14N91J121J833J789Q01k89o60m90m80
54404A62705p03n58J80R12J040O42J65r0M6O11J232J261O37R4J86N01M02O9J40
54385A69472N97P03Q9p41j073p84l12j18l14o37o71k32M74J016J062O31J74K43
$$ plain form
54510 141485 141513 141831 141750 141344 141160 141415 141943 142561 143061 143122 142727 142437 142726 143202 143060 142287 141765 142013 142374 141827
54490 141827 140358 139040 138802 139476 140156 140290 140183 140489 141464 142845 144242 145427 146298 146872 147355 147968 148627
54473 148627 149095 149520 150465 152143 153943 155028 155231 155026 154776 154385 153661 152666 151625 150744 150193 150108 150509 151302
54455 151302 152274 153053 153276 153008 152847 153336 154337 155221 155593 155511 155100 154341 153322 152343 151665 151373 151569 152368
54437 152368 153560 154533 154747 154205 153307 152349 151323 150144 148943 148072 147745 147678 147247 146192 145109 144986 146216
54420 146216 148281 150421 152377 154315 156209 157675 158489 159080 160201 162034 163823 164624 164335 163675 163185 162705
54404 162705 162002 161444 161624 162536 163576 164218 164383 164293 164339 164950 166182 167443 168080 168174 168360 168861 169263 169332 169472
54385 169472 170069 170772 170861 170120 169047 168263 167951 167833 167519 166882 166211 165979 166453 167469 168531 169162 169336 169579
54367A69579Q30J178O98q5j81L89N96J8m66n2Q95J692K405L260L730L294K473
54350A90253K099K033J697J431K067L312L923L499K831K293J201p52k626l452
54336B09809l465l469l686l850l841l682l358l082l187l392k816j260J68L62m08
54321A70843j053j123r55p83n44m01n81p68l62N15R57M58l95o57j25N94Q27L55
54303A66802n77j474j787j206PJ058J218N20k74n66n30o18p27l36N10J048P77
54286A63845J65j6L92R83J410J548J304P48K65J65K47J16j45j18K65N56M27J3
54268A72170m29q31j102r36j95P31J260J274J142J097R52N54K90O53J433J742
54252A79805J055q0p04n84k94k76l27j12K29K48k38r76j543j615j130l21L33L96
$$ plain form
54367 169579 170409 171587 172285 172200 172019 172408 173004 173022 172556 172504 173399 175091 177496 180756 184486 187780 190253
54350 190253 192352 194385 196082 197513 199580 202892 206815 210314 213145 215438 216639 215887 213261 209809
54336 209809 206344 202875 199189 195339 191498 187816 184458 181376 178189 174797 171981 170721 170889 171251 170843
54321 170843 169790 168667 167712 166929 166385 165984 165403 164635 164273 164788 165745 166203 165808 165151 165026 165620 166447 166802
54303 166802 166225 164751 162964 161758 161765 162823 164041 164561 164287 163721 163191 162573 161846 161510 162020 163068 163845
54286 163845 164010 163994 164386 165369 166779 168327 169631 170379 170644 170809 171056 171172 171027 170909 171174 171730 172157 172170
54268 172170 171741 170910 169808 168872 168677 169408 170668 171942 173084 174181 175133 175687 175977 176630 178063 179805
54252 179805 180860 180780 180076 179492 179198 178922 178595 178483 178712 178960 178722 177746 176203 174588 173458 173137 173470 173866
54234A73866k29j141j597j096k3N90K19m75n72k04k09o75p37n5M95J73m32l30
54216A67568L29O30M42N38J151J515J082M41M49J014J273O76m91j504j773j240
54200A72100m68j55l79n07q0N06O05L12L07P41R35M04l67o17l94m12r60j514j544
54181A68513j135n98L4P64J216J029N20L99Q05J090P26om64m21j35J14K03Q7j57
54162A72584k79j85j32l48n45k66L21M33k97j239j483r06j67K18L94P06J075J091
54144A70975N64j20l21J92Q72Q72J7q25o40N21J538J513O92m4k17L5M34P70P49
54125A77577K03n37p93k61O91J413J461P56l31j096j090o39m16m49j32O91J312
54108A78360J144O03M90Q98J263J231R33N89K99J26kl24q05r28l52M51O87K71
$$ plain form
54234 173866 173637 172496 170899 169803 169780 170370 170589 170114 169542 169338 169129 168454 167717 167662 168157 168330 167898 167568
54216 167568 167897 168527 168969 169507 170658 172173 173255 173696 174145 175159 176432 177108 176617 175113 173340 172100
54200 172100 171632 171477 171098 170591 170511 171017 171622 171934 172241 172982 173917 174321 173954 173337 172943 172531 171571 170057 168513
54181 168513 167378 166780 166814 167578 168794 169823 170343 170742 171547 172637 173363 173357 172893 172472 172337 172451 172654 172741 172584
54162 172584 172305 172120 171988 171640 171095 170829 171150 171583 171286 170047 168564 167658 167491 167709 168103 168809 169884 170975
54144 170975 171539 171419 171098 171290 172162 173034 173051 172226 171586 172107 173645 175158 175850 175806 175589 175624 176058 176828 177577
54125 177577 177780 177243 176450 176189 176880 178293 179754 180510 180179 179083 177993 177354 176938 176489 176357 177048 178360
54108 178360 179504 180107 180597 181495 182758 183989 184922 185511 185810 185936 185934 185610 184805 183877 183525 183976 184663 184934
54090A84934j50r0L63R14J359J495J257R94J125J487J423O57k99p24l59N40J496
54073A96422K095K231K178K176K070J633J111J032J568K413L219L786M001M048
54059B29983M457N440O405O731O750P123P492O739M633K155ok158m382n724n414
54044B70224m039k688j561k99R09J594K043L088M849O502P343P477P368P220P038
54029C17068O867O812O876O835O220M720K767J391J145J467J410P87J08k98o30
54014C63545j154j941k983m201n297n980o341o678p022p157p091p094p183o949
54000B86474o060m759l696l243l202l124k914k890l194l377k917k006j358j262
53986B42472j305j177j154j458j682j340o59l04n16r35j142j072r30r68j200j249
$$ plain form
54090 184934 184784 184694 185057 185971 187330 188825 190082 191076 192201 193688 195111 195768 195469 194745 194386 194926 196422
54073 196422 198517 200748 202926 205102 207172 208805 209916 210948 212516 214929 218148 221934 225935 229983
54059 229983 234440 239880 246285 253016 259766 266889 274381 281120 285753 287908 287902 285744 281362 275638 270224
54044 270224 266185 263497 261936 261637 262546 264140 266183 269271 274120 280622 287965 295442 302810 310030 317068
54029 317068 323935 330747 337623 344458 350678 355398 358165 359556 360701 362168 363578 364365 364473 364175 363545
54014 363545 362391 360450 357467 353266 347969 341989 335648 328970 321948 314791 307700 300606 293423 286474
54000 286474 280414 275655 271959 268716 265514 262390 259476 256586 253392 250015 247098 245092 243734 242472
53986 242472 241167 239990 238836 237378 235696 234356 233697 233393 232877 231942 230800 229728 228798 227830 226630 225381
53970B25381o58M74J508K047K268K393K345K252K614L496M125L938L477L518L786
53955B62964L486K718K257K088J380N8p08j59R09J276R44Q29J276J807K192K905
53939B86222M222N482N807N260M781M927N195M857M088L740M158M770M999M977
53925C53485N119N499N979O579P267P754P908Q109Q772R779J0794J1867J3217
53912D62128J4634J5657J6282J6923J7744J8455J8703J8217J6595J3473R065M182
53900F42058l76m261p543j0491j3347j5969j7760j8276j7789j6970j6235j5677
53888D87364j5444j5599j5733j5246j4046j2629j1465j0609r899r095q028o846
53876C42725o017n711n453m870m416m711n416n530m828m111l959l990l651l061
$$ plain form
53970 225381 224723 225197 226705 228752 231020 233413 235758 238010 240624 244120 248245 252183 255660 259178 262964
53955 262964 266450 269168 271425 273513 274893 274951 274243 274084 274993 276269 277213 278042 279318 281125 283317 286222
53939 286222 290444 295926 301733 306993 311774 316701 321896 326753 330841 334581 338739 343509 348508 353485
53925 353485 358604 364103 370082 376661 383928 391682 399590 407699 416471 426250 437044 448911 462128
53912 462128 476762 492419 508701 525624 543368 561823 580526 598743 615338 628811 637876 642058
53900 642058 641682 637421 629878 619387 606040 590071 572311 554035 536246 519276 503041 487364
53888 487364 471920 456321 440588 425342 411296 398667 387202 376593 366694 357599 349571 342725
53876 342725 336708 330997 325544 320674 316258 311547 306131 300601 295773 291662 287703 283713 280062 277001
53862B77001k672k561k470k263k008j832j847k061k317k536k880l387l515k631
53848B42021j002K01Q9j051k148k366j702q42m82n70m17K88R12P99L46M27J059
53831B35562J439J165O09O6n14q94o25Q4M32K77M05J166J786J528Q13N18Q06J286
53813B45909J772K258K579K669K893L584M540N370N916O088N717N033M777N316
53799C04421O118O553O738P074P469P625P650P652P115N469L126J204K38j58m87
53784C77807q05j075j425j925k480l015l546l996m267m485m887n556o388p254
53770C26703p900p905p093n884m939m533m455m472m546m684m788m660m088l108
53756B53648k149j713j699j485q36l40o11j372j834j729j510j578j736j479o49
$$ plain form
53862 277001 274329 271768 269298 267035 265027 263195 261348 259287 256970 254434 251554 248167 244652 242021
53848 242021 241019 241220 241309 240258 238110 235744 234042 233200 232718 232148 231731 232019 232931 233730 234076 234503 235562
53831 235562 237001 238166 238775 238841 238327 237433 236808 236892 237324 237601 238006 239172 240958 242486 243299 243817 244623 245909
53813 245909 247681 249939 252518 255187 258080 261664 266204 271574 277490 283578 289295 294328 299105 304421
53799 304421 310539 317092 323830 330904 338373 345998 353648 361300 368415 373884 377010 378214 378452 378294 377807
53784 377807 377002 375927 374502 372577 370097 367082 363536 359540 355273 350788 345901 340345 333957 326703
53770 326703 318803 310898 303805 297921 292982 288449 283994 279522 274976 270292 265504 260844 256756 253648
53756 253648 251499 249786 248087 246602 245766 245426 244815 243443 241609 239880 238370 236792 235056 233577 232928
53741B32928L08P53O11N61J189K070K214J409M81O0j43n05p37m43J67P21J303
53724B42947K009K439K341K216K507K702K108J148Q70J400J910K007K130K499
53710B71233K664K354J915J652J452J381J893L046M111M380L961L452L147K897
53696C09538K471J826J248J218J873K663K924K723K614K640K276J428O89L21k14
53681C36238j265k179k157j444j012j260j710j902j929k008j934j355l83L09J62
53666C16171n97j146j005n65m21m56j02O22R34L52n78r76o66j92m8k22l54j02
53648C10649N79J348J752J676J330P83j17j181j661j026K87J270J450J269J382
53633C19790J936K608L084L295L305L135K779K343K044K025K231K558L011L556
$$ plain form
53741 232928 233236 233989 234600 235161 236350 238420 240634 242043 242524 242584 242441 241936 241199 240756 240923 241644 242947
53724 242947 244956 247395 249736 251952 254459 257161 259269 260417 261287 262687 264597 266604 268734 271233
53710 271233 273897 276251 278166 279818 281270 282651 284544 287590 291701 296081 300042 303494 306641 309538
53696 309538 312009 313835 315083 316301 318174 320837 323761 326484 329098 331738 334014 335442 336131 336452 336238
53681 336238 334973 332794 330637 329193 328181 326921 325211 323309 321380 319372 317438 316083 315700 316009 316171
53666 316171 315574 314428 313423 312858 312437 311981 311879 312501 313435 313787 313209 312233 311567 311375 311327 311105 310751 310649
53648 310649 311228 312576 314328 316004 317334 318117 318000 316819 315158 314132 314419 315689 317139 318408 319790
53633 319790 321726 324334 327418 330713 334018 337153 339932 342275 344319 346344 348575 351133 354144 357700
53619C57700L933L890L565L410L685M243M813N250N446N307M951M688M701M847
53605D20429M930M943M912M725M299L780L453L485L825M238M364L898K884J713
53591D75878Q47M67M41M31Q9o60j494k062k473l129m115m967n248n028m685m459
53575D39833m371m368m264l755k769j699j080j085j443j754j709j189m49q4m69
53560D09345j215j420o38O08J400J438J303J654K381K731K260J456J204J752K480
53545D26739K702K420K174K355K878L408L768M129M822N932P043P633P690P813
53531D91506Q562R923J1472J2782J3498J3436J2965J3045J4268J5944J6744J6343
53519F50488J5867J6444J7926J9477K0868K2419K3937K4702K4620K4561K5199
$$ plain form
53619 357700 361633 365523 369088 372498 376183 380426 385239 390489 395935 401242 406193 410881 415582 420429
53605 420429 425359 430302 435214 439939 444238 448018 451471 454956 458781 463019 467383 471281 474165 475878
53591 475878 476725 477192 477633 478064 478153 477493 475999 473937 471464 468335 464220 459253 454005 448977 444292 439833
53575 439833 435462 431094 426830 423075 420306 418607 417527 416442 414999 413245 411536 410347 409898 409814 409345
53560 409345 408130 406710 406072 406680 408080 409518 410821 412475 414856 417587 419847 421303 422507 424259 426739
53545 426739 429441 431861 434035 436390 439268 442676 446444 450573 455395 461327 468370 476003 483693 491506
53531 491506 500068 509991 521463 534245 547743 561179 574144 587189 601457 617401 634145 650488
53519 650488 666355 682799 700725 720202 741070 763489 787426 812128 836748 861309 886508
53508H86508K6150K6815K7375K8249K8997K8790K7823K7326K7871K8518K8057
53497A192479K6500K4815K3689K3074K2713K2415K1980K1266K0450J9898J9791
53486A439070K0051K0519K0946K1008K0566J9867J9201J8484J7412J5926J4255
53475A647305J2532J0625Q305N474K329o37l069n268p904j0947j3394j4578j5264
53462A615509j6722j8931k0540k0663j9986j9883k0970k2732k4157k4538k4055
53451A382332k3624k3916k4497k4445k3690k3049k2850k2324k0744j8454j6216
53440A138523j4154j1997r903q271o997n600m060k780j708k09J927L927M940N187
53426A088825N729P242R392J1450J3109J4521J5874J7278J9000K1301K3979K6363
$$ plain form
53508 886508 912658 939473 966848 995097 1024094 1052884 1080707 1108033 1135904 1164422 1192479
53497 1192479 1218979 1243794 1267483 1290557 1313270 1335685 1357665 1378931 1399381 1419279 1439070
53486 1439070 1459121 1479640 1500586 1521594 1542160 1562027 1581228 1599712 1617124 1633050 1647305
53475 1647305 1659837 1670462 1678767 1684241 1686570 1685933 1682864 1677596 1669692 1658745 1645351 1630773 1615509
53462 1615509 1598787 1579856 1559316 1538653 1518667 1498784 1477814 1455082 1430925 1406387 1382332
53451 1382332 1358708 1334792 1310295 1285850 1262160 1239111 1216261 1193937 1173193 1154739 1138523
53440 1138523 1124369 1112372 1102469 1094198 1087201 1081601 1077541 1074761 1073053 1072844 1074771 1078698 1083638 1088825
53426 1088825 1094554 1101796 1111188 1122638 1135747 1150268 1166142 1183420 1202420 1223721 1247700 1274063
53414A274063K8070K9484L1134L2854L4069L4832L6040L8389M1525M4562M7043
53403A672065M9123N1019N2757N4377N6016N7673N9158O0445O1846O3612O5466
53392B303557O6701O6874O6214O5319O4508O3644O2417O0590N8058N4954N1670
53381B984506M8413M4768M0088L4503K9033K4480K0497J6125J0881M972j154p106
53369C250006j2665j8104k4126l1042l8215m4778n0499n5471n9337o1683o2954
53358B791132o4126o5437o6163o5684o4090o1747n9054n6639n5007n3873n2541
53347B126771n1054n0119m9822m9375m8354m7187m6068m4458m2188m0049l8557
53336A619540l7058l4835l2257k9928k7525k4574k1741k0075j9307j8232j6562
$$ plain form
53414 1274063 1302133 1331617 1362751 1395605 1429674 1464506 1500546 1538935 1580460 1625022 1672065
53403 1672065 1721188 1772207 1824964 1879341 1935357 1993030 2052188 2112633 2174479 2238091 2303557
53392 2303557 2370258 2437132 2503346 2568665 2633173 2696817 2759234 2819824 2877882 2932836 2984506
53381 2984506 3032919 3077687 3117775 3152278 3181311 3205791 3226288 3242413 3253294 3258266 3257112 3250006
53369 3250006 3237341 3219237 3195111 3164069 3125854 3081076 3030577 2975106 2915769 2854086 2791132
53358 2791132 2727006 2661569 2595406 2529722 2465632 2403885 2344831 2288192 2233185 2179312 2126771
53347 2126771 2075717 2025598 1975776 1926401 1878047 1830860 1784792 1740334 1698146 1658097 1619540
53336 1619540 1582482 1547647 1515390 1485462 1457937 1433363 1411622 1391547 1372240 1354008 1337446
53325A337446j5241j4875j4967j4890j4634j4256j3479j2223j0844r470p648n097
53313A189822k357k44J044J975L101M686O703Q898J0992J2904J4678J6225J7422
53300A285849J8478J9904K1951K4249K6179K7496K8516K9720L1171L2333L2640
53289A578486L2272L2019L2146L1794K9957K6824K3616K1173J9213J7002J4199
53278A858701J0857P055K867j379n177q244j0847j3622j6914k0203k2506k3507
53266A757081k4013k5071k6899k8957l0754l2109l2886l3095l3132l3378l3603
53255A423184l3301l2622l2369l2916l3627l3633l2781l1626l0757l0395l0365
53244A068792l0289k9889k9190k8353k7399k6332k5373k4689k3958k2655k0796
$$ plain form
53325 1337446 1322205 1307330 1292363 1277473 1262839 1248583 1235104 1222881 1212037 1202567 1194919 1189822
53313 1189822 1187465 1187221 1188265 1190240 1193341 1198027 1204730 1213628 1224620 1237524 1252202 1268427 1285849
53300 1285849 1304327 1324231 1346182 1370431 1396610 1424106 1452622 1482342 1513513 1545846 1578486
53289 1578486 1610758 1642777 1674923 1706717 1736674 1763498 1787114 1808287 1827500 1844502 1858701
53278 1858701 1869558 1876613 1879480 1878101 1872924 1864680 1853833 1840211 1823297 1803094 1780588 1757081
53266 1757081 1733068 1707997 1681098 1652141 1621387 1589278 1556392 1523297 1490165 1456787 1423184
53255 1423184 1389883 1357261 1324892 1291976 1258349 1224716 1191935 1160309 1129552 1099157 1068792
53244 1068792 1038503 1008614 979424 951071 923672 897340 871967 847278 823320 800665 779869
53233G79869j8962j7509j6190j4668j3030j1626j0746j0597j1181j1987j2263
53222F31110j1838j1404j1647j2383j2926j3035j3073j3324j3538j3254j2339
53211D92349j1087r948r212q913q847q678q128p234o408o045o033n895n478n195
53197C85248n419n863n988n667n163m638m176m104m681n506n730m977l660k357
53183C17319j358q43r76j593k146k199j776j171p45q42j513k257k441k007j396
53168B94056q57l51p6l17o91l79N90J068L21r52j702j911k146k339k000j314r83
53151B80017j038q09j41K19k43j011j311j167j153j395j356o11N47J351J334P78
53135B74011L87N44R37R78M81k55q45j116r64l36N68J175R05k48j586k189j667
$$ plain form
53233 779869 760907 743398 727208 712540 699510 687884 677138 666541 655360 643373 631110
53222 631110 619272 607868 596221 583838 570912 557877 544804 531480 517942 504688 492349
53211 492349 481262 471314 462102 453189 444342 435664 427536 420302 413894 407849 401816 395921 390443 385248
53197 385248 379829 373966 367978 362311 357148 352510 348334 344230 339549 334043 328313 323336 319676 317319
53183 317319 315961 315118 314142 312549 310403 308204 306428 305257 304512 303670 302157 299900 297459 295452 294056
53168 294056 293199 292848 292772 292455 291764 291385 291975 293043 293364 292412 290710 288799 286653 284314 282314 281000 280017
53151 280017 278979 278170 278029 278248 278005 276994 275683 274516 273363 271968 270612 270001 270548 271899 273233 274011
53135 274011 274398 274942 275879 276857 277338 277083 276238 275122 274158 273822 274390 275565 276470 276222 274636 272447 270780
53118B70780m43O96J310J495J508J407J101N45j78q59j213j100p46n37n68o77
53102B72521q26j124j426j403j112j019j199j111m99N7M7oO93J812K209J525O51
53085B69790M10N88N84L09j4l97q86j114o00N88J881K764L047K705J827P24j98
53068B82008p51j047j266j388j225o81l2J27n05j430j721j032JO11P37P38N86
53051B73730n6r57j217l66Q40J184M10n71q89o29m29n55q12j073j414j707j597
53034B63892j062n91n83p91p63m85k39l4L12N88L82r8o9O86J276Q47j69n97r1
53015B62411N46N94K98L28Q32J394J598J345Q23M16M38P34P74L70N4L60R59J016
52997B75290L32l40k74L94J025J301J362J349J226J022R28J054J281J380J214
$$ plain form
53118 270780 270337 271033 272343 273838 275346 276753 277854 278399 278221 277362 276149 275049 274303 273766 273198 272521
53102 272521 271695 270571 269145 267742 266630 265611 264412 263301 262802 262859 262906 262900 263593 265405 267614 269139 269790
53085 269790 270200 270788 271372 271681 271667 271270 270384 269270 268670 269258 271139 273903 276950 279655 281482 282206 282008
53068 282008 281257 280210 278944 277556 276331 275650 275618 275745 275240 273810 272089 271057 271058 271669 272406 273144 273730
53051 273730 273674 272717 271500 271134 271974 273158 273568 272997 272108 271479 271050 270495 269683 268610 267196 265489 263892
53034 263892 262830 262239 261656 260865 260102 259617 259378 259344 259656 260244 260626 260528 260459 261145 262421 263268 263099 262502 262411
53015 262411 262957 263551 263849 264177 265009 266403 268001 269346 270169 270585 271023 271757 272531 272901 272955 273315 274274 275290
52997 275290 275622 275282 275008 275402 276427 277728 279090 280439 281665 282687 283615 284669 285950 287330 288544
52982B88544P84K00l26n50l19L20J105J643J587R57K76K83J233K464K852J970
52966C03023O87K89R79J633J316N44M86J243J682J028k08j160j719k249k704k745
52950C02125k360j857j419j154j307j894k298j954j256j134j713k104j618n84
52936B79473J94K58l44j231j806j731j350j234j286r50l31k59r39j464j146n24
52920B65330l80n04k55K36L60J66K17M78L53k30o36n67m33n41n91k99J02K48P6
52901B63130l20q25j100p43J01P63Q52O63N54M41K04J05L82P32O62K26K2M45J187
52882B67481J502R38j64r95j163j035r81o55L56J538J899J447J223J714K129J703
52866B76937P79J09j20O8Q97K111K552J537J13k34L18L17p32j802k049j769j455
$$ plain form
52982 288544 289328 289528 289202 288652 288333 288653 289758 291401 292988 293945 294221 294504 295737 298201 301053 303023
52966 303023 303710 303999 304978 306611 307927 308471 308957 310200 311882 312910 312702 311542 309823 307574 304870 302125
52950 302125 299765 297908 296489 295335 294028 292134 289836 287882 286626 285492 283779 281675 280057 279473
52936 279473 279667 279925 279581 278350 276544 274813 273463 272229 270943 269993 269662 269403 268464 267000 265854 265330
52920 265330 264950 264446 264191 264427 264787 264953 265170 265648 266001 265771 265135 264568 264135 263594 263003 262704 262806 263054 263130
52901 263130 262810 261985 260885 260142 260243 261006 261858 262521 263075 263516 263720 263825 264207 264939 265601 265827 265849 266294 267481
52882 267481 268983 269921 269757 268762 267599 266564 265583 264928 265284 266822 268721 270168 271391 273105 275234 276937
52866 276937 277716 277825 277705 277773 278670 280781 283333 284870 284983 284749 285067 285384 284652 282850 280801 279032 277577
52849B77577j145j024j642k905l821l782l342l142k934k258j387q51o46n76p80
52834B47342j211j190l62M66L37l66m47L78J263J621J641J469Q51j03o94n40q1
52817B50374J52K13L82N96O19M27K03J81N70J329J982K074J779J591J449Q23l08
52800B64436j181j266r52q85j138j384j461j381j131q37p68r72j141j002n11L98
52784B48824J682K622K163K37j801k513j724k29J180J931J590L79o36o85k56k88
52768B52476p25p39r1N95Q29P06L62k74j007j358j157p02j92M01Q78Q08J56m80
52750B50486n34k7N89Q88P27L48K56P14J462K144K734L227L244K624K012K115
52734B73009K549K263J112J20Q8P62J558K209K434J845O81n9J96P60N68n37j820
$$ plain form
52849 277577 276432 275408 273766 270861 267040 263258 259916 256774 253840 251582 250195 249344 248698 248122 247342
52834 247342 246131 244941 244579 245045 245382 245016 244569 244947 246210 247831 249472 250941 251792 251689 250995 250455 250374
52817 250374 250526 250739 251121 251717 252336 252763 252966 253147 253717 255046 257028 259102 260881 262472 263921 264744 264436
52800 264436 263255 261989 261037 260152 259014 257630 256169 254788 253657 252820 252052 251080 249939 248937 248426 248824
52784 248824 250506 253128 255291 255528 253727 251214 249490 249261 250441 252372 253962 254341 253705 253020 252764 252476
52768 252476 251751 251012 250921 251516 252345 253051 253413 253139 252132 250774 249617 248915 248723 249124 250002 250810 250966 250486
52750 250486 249952 249925 250514 251402 252129 252477 252733 253447 254909 257053 259787 263014 266258 268882 270894 273009
52734 273009 275558 277821 278933 279053 279141 279903 281461 283670 286104 287949 288630 288571 288767 289527 290095 289558 287738
52717B87738k610k841k839k894k878k262q40O08R86K59n64r05j188j669j640n29
52701B65932R35J512R69J51j37K58J002J555J503J044Q42J056J071N53Q2J85M24
52684B78937K34K8M42J021P88j52p22n85n30r99j333r51l92n18j254j725j371
52667B70918n06J89L93L70M96O78M68j53n37k39L58P25J028J600K026J698R74
52650B80486Q30J314J425O85k02n49o17q42j012p98m66m11m51j37N30J175J484
52633B82444J291O03p4K7J053K232K919L332L826L988L137J372n83k195l222l355
52617B96795k569j678j666k449k938k455j451p15m57m19l38q2M17J057J649K044
52601B84745K056J336j60j727k400j939q56M60J931L089L128K057R94P15N96k18
$$ plain form
52717 287738 285128 282287 279448 276554 273676 271414 270574 271182 272168 272427 271863 270958 269770 268101 266461 265932
52701 265932 266867 268379 269348 269499 269362 269620 270622 272177 273680 274724 275566 276622 277693 278246 278328 278513 278937
52684 278937 279171 279199 279641 280662 281450 281298 280576 279991 279461 278462 277129 276178 275786 275268 274014 272289 270918
52667 270918 270412 270601 270994 271364 271860 272538 273006 272853 272316 272077 272435 273160 274188 275788 277814 279512 280486
52650 280486 281316 282630 284055 284740 284538 283989 283372 282530 281518 280720 280254 279843 279392 279255 279785 280960 282444
52633 282444 283735 284338 284264 284291 285344 287576 290495 293827 297653 301641 304778 306150 305567 303372 300150 296795
52617 296795 294226 292548 290882 288433 285495 283040 281589 280874 280417 279998 279660 279578 279995 281052 282701 284745
52601 284745 286801 288137 287977 286250 283850 281911 281055 281515 283446 286535 289663 291720 292714 293429 294025 293807
52585B93807j243j297m04J12m16r96m02J146K308K218J142j07q89r83n63q5M4
52568B93392k45p22j066j003m57K53N63K23m41r09r37n63N7N52M20m36j353j432
52550B85896m39J018K074K252J670Q83L54l8p04j477j548o79J45o8q50r13k9P38
52532B88285P11M52N98P69K92o51j283j230p18k6P34J431J878J937J516O90j0
52515B95375J25J137K208K614K535K600K970L309L384L208K839K380J989J574
52501C28247P18p40k277l202l432l389l337l221k976k658k335k081j917j677j193
52486B94530p08o84j073j255r83o70m91O7J167J935J655J065J390K563L427L429
52470C05364L063K760K436K132K150K340K208J892K098K932L560L344K554J661
$$ plain form
52585 293807 292564 291267 290863 290975 290559 289563 289161 290307 292615 294833 295975 295868 294979 293996 293433 293348 293392
52568 293392 293147 292425 291359 290356 289899 290152 290715 290938 290497 289588 288651 288088 288145 288697 289117 288681 287328 285896
52550 285896 285457 286475 288549 290801 292471 293354 293708 293670 292966 291489 289941 289262 289407 289339 288489 287576 287547 288285
52532 288285 288996 289448 290046 290815 291107 290456 289173 287943 287225 287199 287933 289364 291242 293179 294695 295385 295375
52515 295375 295500 296637 298845 301459 303994 306594 309564 312873 316257 319465 322304 324684 326673 328247
52501 328247 328965 328225 325948 322746 319314 315925 312588 309367 306391 303733 301398 299317 297400 295723 294530
52486 294530 293822 293138 292065 290810 289827 289157 288666 288733 289900 291835 293490 294555 295945 298508 301935 305364
52470 305364 308427 311187 313623 315755 317905 320245 322453 324345 326443 329375 332935 336279 338833 340494
52456C40494O78m70j551k385l059l556l669l512l513l784l998m022m020l797k881
52441B96955j475n10l89m48r5K41o5p25r14l67M95J129J168N08l70o01O7Q37Q23
52422B96264J92k25q1K41M02N75J146K185L163L284K359J346J515K998M702N815
52406C25881O634P671Q752R499R949J0013Q991O460L199M17j619l440n170o317
52392C80920o680o695o813o991o839n918m094j931m25K2M9L59P94R77J204J921
52376C39860K646K524J781J613K570L975N050N760O266O397O038N441M793L929
52362C98643K783J634O95j48r16j336j308j210j445j939k266k025j073L28J506
52347C91923J907J775J888K510L057L002K684K879L840N096O055O527O768P144
$$ plain form
52456 340494 341172 340702 339151 336766 333707 330151 326482 322970 319457 315673 311675 307653 303633 299836 296955
52441 296955 295480 294970 294581 294133 294038 294279 294214 293489 292575 292208 292703 293832 295000 295508 295138 294537 294604 295441 296264
52422 296264 296456 296231 296150 296391 296793 297368 298514 300699 303862 307146 309505 310851 312366 315364 320066 325881
52406 325881 332515 340186 348938 358437 368386 378399 387390 393850 397049 397466 395847 392407 387237 380920
52392 380920 374240 367545 360732 353741 346902 340984 336890 334959 334534 334556 334605 334964 335758 336735 337939 339860
52376 339860 342506 345030 346811 348424 350994 354969 360019 365779 372045 378442 384480 389921 394714 398643
52362 398643 401426 403060 403755 403607 402691 401355 400047 398837 397392 395453 393187 391162 390089 390417 391923
52347 391923 393830 395605 397493 400003 403060 406062 408746 411625 415465 420561 426616 433143 439911 447055
52333D47055P731Q260Q561Q988J0097J1958J4100J6014J7383J7906J7528J6927
52321F02508J7149J8418J9810K0404K0265J9914J9325J8143J6634J5690J5807
52310H04067J6516J7046J7122J6939J6673J6282J5684J4907J4079J3354J2833
52299I75502J2407J1764J0699R429Q352P421N992L512L04k672m788o168p192q009
52285A016553q593q902q707p720o163m809m092l489k222k03K170M701P206Q967
52271I84697R373R034R339J0741J2287J3142J3655J4414J5063J4828J3738J2542
52259A132853J1656J0977J0572J0782J1596J2476J2991J3129J2899J2075J0637
52248A262643R031P700O551N159L330J204j028l191m940n904o209o519p287q084
$$ plain form
52333 447055 454786 463046 471607 480595 490692 502650 516750 532764 550147 568053 585581 602508
52321 602508 619657 638075 657885 678289 698554 718468 737793 755936 772570 788260 804067
52310 804067 820583 837629 854751 871690 888363 904645 920329 935236 949315 962669 975502
52299 975502 987909 999673 1010372 1019801 1028153 1035574 1041566 1045078 1045382 1042710 1037922 1031754 1024562 1016553
52285 1016553 1007960 999058 990351 982631 976468 971659 967567 964078 961856 961653 963823 968524 975730 984697
52271 984697 994070 1003104 1012443 1023184 1035471 1048613 1062268 1076682 1091745 1106573 1120311 1132853
52259 1132853 1144509 1155486 1166058 1176840 1188436 1200912 1213903 1227032 1239931 1252006 1262643
52248 1262643 1271674 1279374 1285925 1291084 1294414 1295618 1294590 1291399 1286459 1280555 1274346 1267827 1260540 1252456
52234A252456q022o874n434m617m524m564m275l595k563j242QP21R26J242K048
52219A211691K941L368L509M086N325O606P213P154O999P194P709Q259Q600Q689
52205A299343Q643Q573Q410P971P308O776O632O660O480O111N957O190O509O634
52191A398197O682O802O736O158N212M356L738L043J939L41j659l768n480o557
52177A425740p534r169j1282j2678j2494j1221r982r192q365p023n353l947l176
52164A314324k823k308j264L3J032J602K054K463K438J756P64j12q65j593k140
52149A315361k400k603k874k874k327j557j092r70j026j426k339l256l383k681
52135A284553j935j691j663j224j19J429L069M741O930J0191J4140J7400J9095
$$ plain form
52234 1252456 1244434 1237560 1232126 1227509 1222985 1218421 1214146 1210551 1207988 1206746 1206754 1207475 1208401 1209643 1211691
52219 1211691 1214632 1218000 1221509 1225595 1230920 1237526 1244739 1251893 1258892 1266086 1273795 1282054 1290654 1299343
52205 1299343 1307986 1316559 1324969 1332940 1340248 1347024 1353656 1360316 1366796 1372907 1378864 1385054 1391563 1398197
52191 1398197 1404879 1411681 1418417 1424575 1429787 1434143 1437881 1440924 1442863 1443204 1441545 1437777 1432297 1425740
52177 1425740 1418206 1409037 1397755 1385077 1372583 1361362 1351380 1342188 1333823 1326800 1321447 1317500 1314324
52164 1314324 1311501 1309193 1307929 1307962 1308994 1310596 1312650 1315113 1317551 1319307 1320071 1319959 1319094 1317501 1315361
52149 1315361 1312961 1310358 1307484 1304610 1302283 1300726 1299634 1298664 1297638 1296212 1293873 1290617 1287234 1284553
52135 1284553 1282618 1280927 1279264 1278040 1277921 1279350 1282419 1287160 1294090 1304281 1318421 1335821 1354916
52122A354916J9995K1482K3664K5467K6365K6998K7870K8460K8057K6821K5459
52111A635554K4358K3414K2236K0266J7149J3396J0259Q530P686O598M839L047
$$ plain form
52122 1354916 1374911 1396393 1420057 1445524 1471889 1498887 1526757 1555217 1583274 1610095 1635554
52111 1635554 1659912 1683326 1705562 1725828 1742977 1756373 1766632 1775162 1782848 1789446 1794285 1797332
$$ [...]
##END NTUPLES=NMR SPECTRUM
##END=
