##TITLE=AC1528_ROEFFECT0007_8202340_hqoOYKbWS1
##JCAMPDX= 6.0         $$ Bruker NMR JCAMP-DX V2.0
##DATA TYPE= NMR SPECTRUM
##DATA CLASS= NTUPLES
##ORIGIN= BRUKER
##OWNER= Administrator
$$ 1.72 TOPSPIN		Version 2.1
$$ 2013-09-27 00:30:46.075 -0700  Administrator@X
$$ Compression mode = diff/dup
##.OBSERVE FREQUENCY= 400.02188249412
##.OBSERVE NUCLEUS= ^1H
##.ACQUISITION MODE= SIMULTANEOUS (DQD)
##.ACQUISITION SCHEME= undefined
##.AVERAGES= 8
##.DIGITISER RES= 22
##SPECTROMETER/DATA SYSTEM= spect
##.PULSE SEQUENCE= zg30
##.SOLVENT NAME= COFFEE_meoh
##.SHIFT REFERENCE= INTERNAL, COFFEE_meoh, 1, 14.98509
##AUDIT TRAIL= $$ (NUMBER, WHEN, WHO, WHERE, PROCESS, VERSION, WHAT)
$$ ##TITLE= Audit trail, TOPSPIN		Version 2.1
$$ ##JCAMPDX= 5.01
$$ ##ORIGIN= Bruker BioSpin GmbH
$$ ##OWNER= Administrator
$$ $$ E:\/data/COFFEE/nmr/AC1528_ROEFFECT0007_8202340_hqoOYKbWS1/10/pdata/1/auditp.txt
$$ ##AUDIT TRAIL=  $$ (NUMBER, WHEN, WHO, WHERE, PROCESS, VERSION, WHAT)
(   1,<2013-09-27 00:30:38.981 -0700>,<Administrator>,<X>,<go>,<TOPSPIN 2.1>,
      <created by zg
	started at 2013-09-27 00:29:33.028 -0700,
	POWCHK enabled, PULCHK disabled,
       configuration hash MD5:
       C8 4E 4E 5D D3 5C D8 9E 9F 52 82 E0 59 8A DE 15
       data hash MD5: 64K
       99 7C 23 28 7A E4 EC 0F A8 98 52 F9 8D 12 A8 B8>)
(   2,<2013-09-27 00:30:41.950 -0700>,<Administrator>,<X>,<proc1d>,<TOPSPIN 2.1>,
      <Start of raw data processing
       efp LB = 0 FT_mod = 6 PKNL = 1 PHC0 = 0 PHC1 = 0 SI = 32K 
       data hash MD5: 32K
       9B C4 92 4B 21 C3 EE CF 54 38 EB 25 46 62 BD 42>)
(   3,<2013-09-27 00:30:42.356 -0700>,<Administrator>,<X>,<proc1d>,<TOPSPIN 2.1>,
      <pk PHC0 = 94.16382 PHC1 = 0 
       data hash MD5: 32K
       D3 50 62 35 A4 D4 D3 75 F5 1D B8 40 8F 53 40 AF>)
(   4,<2013-09-27 00:30:42.513 -0700>,<Administrator>,<X>,<proc1d>,<TOPSPIN 2.1>,
      <abs ABSG = 1 
       data hash MD5: 32K
       FA 27 C8 C2 55 DF 87 59 68 A1 B2 09 AC 75 A1 58>)
(   5,<2013-09-27 00:30:42.591 -0700>,<Administrator>,<X>,<proc1d>,<TOPSPIN 2.1>,
      <abs ABSG = 2 
       data hash MD5: 32K
       84 B4 09 C5 84 01 29 B3 21 B3 AA 05 90 6A C7 74>)
(   6,<2013-09-27 00:30:42.653 -0700>,<Administrator>,<X>,<proc1d>,<TOPSPIN 2.1>,
      <abs ABSG = 3 
       data hash MD5: 32K
       11 F0 E2 50 6E C3 0E 6F D0 18 9F FA 71 A8 00 A7>)
(   7,<2013-09-27 00:30:42.700 -0700>,<Administrator>,<X>,<proc1d>,<TOPSPIN 2.1>,
      <abs ABSG = 4 
       data hash MD5: 32K
       96 CE 13 96 A0 4A 25 AC EB C9 91 91 D7 A6 CF DB>)
(   8,<2013-09-27 00:30:42.747 -0700>,<Administrator>,<X>,<proc1d>,<TOPSPIN 2.1>,
      <abs ABSG = 5 
       data hash MD5: 32K
       CB 13 A2 B6 37 09 34 16 C8 A3 9A A9 2A 69 33 E1>)
$$ ##END=
$$ 
$$ $$ hash MD5
$$ $$ 25 AC 86 08 37 3C C0 8D 77 F4 F5 CE AF A4 14 D0
##$RELAX= 
##$RELAX= 
##$RELAX= 
##$RELAX= 
##$RELAX= 
##$RELAX= 
##$RELAX= 
$$ Bruker specific parameters
$$ --------------------------
##$DU= <E:\>
##$EXPNO= 10
$$ [...]
##$TP= (0..7)
150 150 150 150 150 150 150 150
##$TP07= 0
##$TPNAME0= <>
##$TPNAME1= <>
##$TPNAME2= <>
##$TPNAME3= <>
##$TPNAME4= <>
##$TPNAME5= <>
##$TPNAME6= <>
##$TPNAME7= <>
##$TPOAL= (0..7)
0.5 0.5 0.5 0.5 0.5 0.5 0.5 0.5
##$TPOFFS= (0..7)
0 0 0 0 0 0 0 0
##$TUNHIN= 0
##$TUNHOUT= 0
##$TUNXOUT= 0
##$USERA1= <user>
##$USERA2= <user>
##$USERA3= <user>
##$USERA4= <user>
##$USERA5= <user>
##$V9= 5
##$VALIST= <valist>
##$VCLIST= <CCCCCCCCCCCCCCC>
##$VD= 0
##$VDLIST= <DDDDDDDDDDDDDDD>
##$VPLIST= <PPPPPPPPPPPPPPP>
##$VTLIST= <TTTTTTTTTTTTTTT>
##$WBST= 1024
##$WBSW= 4
##$XGAIN= (0..3)
0 0 0 0
##$XL= 0
##$YL= 0
##$YMAX_a= 660464
##$YMIN_a= -560648
##$ZGOPTNS= <>
##$ZL1= 120
##$ZL2= 120
##$ZL3= 120
##$ZL4= 120
##$ABSF1= 14.98509
##$ABSF2= -5.573092
##$ABSG= 5
##$ABSL= 3
##$ALPHA= 0
##$AQORDER= 0
##$ASSFAC= 0
##$ASSFACI= 0
##$ASSFACX= 0
##$ASSWID= 0
##$AUNMP= <proc_prof1d_extract_pilot.lims>
##$AXLEFT= 0
##$AXNAME= <>
##$AXNUC= <1H>
##$AXRIGHT= 0
##$AXTYPE= 0
##$AXUNIT= <>
##$AZFE= 0.1
##$AZFW= 0.1
##$BCFW= 0
##$BC_mod= 0
##$BYTORDP= 0
##$COROFFS= 0
##$CY= 15
##$DATMOD= 1
##$DC= 0
##$DFILT= <>
##$DTYPP= 0
##$F1P= 0
##$F2P= 0
##$FCOR= 0.5
##$FTSIZE= 32768
##$FT_mod= 6
##$GAMMA= 0
##$GB= 0
##$INTBC= 1
##$INTSCL= 1
##$ISEN= 128
##$LB= 0
##$LEV0= 0
##$LPBIN= 0
##$MAXI= 10000
##$MC2= 0
##$MEAN= 0
##$ME_mod= 0
##$MI= 0
##$NCOEF= 0
##$NC_proc= -8
##$NLEV= 6
##$NOISF1= 0
##$NOISF2= 0
##$NSP= 0
##$NTH_PI= 0
##$NZP= 0
##$OFFSET= 14.98509
##$PC= 1
##$PHC0= 94.16382
##$PHC1= 0
##$PH_mod= 1
##$PKNL= yes
##$PPARMOD= 0
##$PPDIAG= 0
##$PPIPTYP= 0
##$PPMPNUM= 2147483647
##$PPRESOL= 1
##$PSCAL= 4
##$PSIGN= 0
##$PYNMP= <proc.py>
##$REVERSE= no
##$SF= 400.02
##$SI= 32768
##$SIGF1= 0
##$SIGF2= 0
##$SINO= 400
##$SIOLD= 32768
##$SPECTYP= <>
##$SREGLST= <1H.CDCl3>
##$SSB= 0
##$STSI= 32768
##$STSR= 0
##$SW_p= 8223.68421052631
##$SYMM= 0
##$S_DEV= 0
##$TDeff= 65536
##$TDoff= 0
##$TI= <>
##$TILT= no
##$TM1= 0
##$TM2= 0
##$TOPLEV= 0
##$USERP1= <user>
##$USERP2= <user>
##$USERP3= <user>
##$USERP4= <user>
##$USERP5= <user>
##$WDW= 1
##$XDIM= 32768
##$YMAX_p= 482971211
##$YMIN_p= -724596
##$CURPLOT= <Network HP LaserJet P1505>
##$CURPRIN= <$Network HP LaserJet P1505>
##$DFORMAT= <normdp>
##$LAYOUT= <+/1D_H.xwp>
##$LFORMAT= <normlp>
##$PFORMAT= <normpl>
##$SURQMSG= 1
$$ End of Bruker specific parameters
$$ ---------------------------------
##NTUPLES= NMR SPECTRUM
##VAR_NAME=  FREQUENCY,     SPECTRUM/REAL,   SPECTRUM/IMAG
##SYMBOL=    X,             R,               I
##VAR_TYPE=  INDEPENDENT,   DEPENDENT,       DEPENDENT
##VAR_FORM=  AFFN,          ASDF,            ASDF
##VAR_DIM=   32768,         32768,           32768
##UNITS=     HZ,            ARBITRARY UNITS, ARBITRARY UNITS
##FACTOR=    0.250966925370066, 1,           1
##FIRST=     8223.43324360094, -231339,      39093
##LAST=      0,             -35754,          102725
##MIN=       0,             -724596,         0
##MAX=       8223.43324360094, 482971211,    0
$$ Real data points
##PAGE= N=1
##DATA TABLE= (X++(R..R)), XYDATA
$$ [...]
19542h4466A85606a95327i2181p2217k584r482B02632f1284B2078J45741b42705
19530d7250J7824m4951E2457c445k84653a21180e8548q7635j02673P5677j92590
19519c65769a48222A09806a36098I8990b6965m6583M602k80713q687d0967j17181
19508a58148e7210j37129h4825q1104b3120n5381A4598a78118M7442r9164j17013
19497c46853R0995j6166A71654a98660K1434A51037L1357e3261k53871A422a4847
19485D56725d0376B29863r2263b68983D7121L59983C0454a861A19586b43471F6073
19473A51584L0390b00773I9224B6044a64579n7871A32116a32590C0273a50456
19462b72733L5520G9152B9670A2713b03464P4835l0491A40539e54957f9152A0703
$$ plain form
19542 -84466 185606 -195327 -92181 -164398 -166982 -176464 202632 -61284 22078 167819 -242705
19530 -47250 -29426 -74377 52457 -3445 -288098 -121180 -58548 -146183 -248856 -173179 -365769
19519 -365769 -148222 109806 -136098 98990 -26965 -73548 -68946 -349659 -358346 -40967 -158148
19508 -158148 -57210 -194339 -84825 -165929 -23120 -78501 14598 -178118 -130676 -229840 -346853
19497 -346853 -255858 -272024 171654 -198660 -177226 151037 182394 -53261 -307132 1422 -14847
19485 456725 -40376 229863 137600 -268983 47121 407104 30454 -1861 119586 -243471 66073
19473 151584 181974 -200773 99224 26044 -164579 -222450 132116 -132590 30273 -150456
19462 -272733 -237213 79152 29670 12713 -203464 -128629 -159120 140539 -554957 -69152 10703
19450a19360q9150F8734c5217A01307c6893r4456I5638l4982c48456h5998D9087
19438f2928B6440c97264A81156b27335m2920i6244M5076B14954a67934f3015j21121
19427a84136B33377J2754I1270B2692b90510o1422i4575j20261A33492b05497
19416a25325j11251B966J3606f3136r5356M3080j92624e8837A08916B4525C224
19404C0107b16627J8968M3911l7751M5466B7295a76552b3797j16101F6671e0711
19392C01083j33864b83273A06482b8393k74407i792j0901m60072e5547c662j7784
19381b1446r4225j45536i0188C15193f9585l3389A38495K49949a57123g6304B37338
19369c2818q379n4031r9827L9821e0085A9416J6559N6773i1649l9746c2280k9486
$$ plain form
19450 -119360 -208510 68734 -35217 101307 -36893 -131349 95638 60656 -348456 -85998 49087
19438 -62928 26440 -397264 181156 -227335 -270255 -96244 -51168 214954 -167934 -63015 -184136
19427 -184136 233377 246131 91270 22692 -290510 -351932 -94575 -214836 133492 -205497
19416 -125325 -236576 2966 16572 -63136 -158492 -115412 -308036 -58837 108916 24525 3224
19404 30107 -216627 -197659 -153748 -191499 -146033 27295 -176552 -23797 -139898 66671 -50711
19392 301083 167219 -283273 106482 -28393 -302800 -9792 -20693 -480765 -55547 -3662 -21446
19381 -21446 -115671 -261207 -90188 315193 -69585 -102974 138495 388444 -157123 -76304 237338
19369 -32818 -41197 -95228 -195055 -155234 -50085 19416 35975 92748 -91649 -131395 -32280 -61766
19357f1766j92447M6671k01570A47754a39172n7291b9395k4118m9188A95741k6569
19346A69172k4143B2937e5557l2368q5038j54743J05314D13102E4245e02526B67366
19334f9756B95145b973l1003E0241d6627J7827k34318I9383l2322c6826G8927
19322A37252a89801O6242n460L3262r1758A02507K62266a85845J5473A42034d73829
19310b58472g6499j53353b1948B661f0549k00267F8389J084O1150m3125c4401
19298B80537j35514d8208k9403o9503r9265F7299f506j56871j9657d4890j44386
19287a89276J0953A76581G042J68040o5430e0020G3258L1346b15105A47060F9874
19275A71246d7648r841K7637H9489h3880D8233c25593B91453j30555a54602D436
$$ plain form
19357 -61766 -254213 -207542 -409112 147754 -139172 -196463 -29395 -53513 -102701 195741 169172
19346 169172 145029 22937 -55557 -87925 -172963 -327706 -222392 413102 54245 -502526 267366
19334 -69756 295145 -2973 -33976 50241 -46627 -28800 -263118 99383 67061 -36826 78927
19322 137252 -189801 -123559 -129019 -95757 -187515 102507 364773 -185845 -170372 142034 -473829
19310 -258472 -76499 -229852 -21948 2661 -60549 -260816 68389 69473 130623 87498 -34401
19298 280537 145023 -48208 -77611 -147114 -246379 67299 -6506 -163377 -183034 -44890 -189276
19287 -189276 -178323 176581 7042 175082 109652 -50020 73258 104604 -215105 147060 69874
19275 171246 -47648 -57489 -29852 89489 -83880 48233 -325593 291453 160898 -154602 4436
19263C9556a97662f7063b0478k04609j5586c4289j86339i1076E486b85258A12898
19251c81918e661E1726j9611Q9033h2414A43263a53943k70964j10213a06225j57284
19240b63509J14686j08169c6588r8591B0814a96085A89517a90969P6796a1910
19229a90426J113m818g7925A18468a04004A36637a76434I3394K298j4360i014
19217H3818a59044j54887C1036b5808E2713i7791k01865P4527f2223k21276f0380
19205a72542j0344B16718b21799M6806N2612A05341K33943E3419A6415M1607c71863
19193E6176b9318A34447a88905H3429c00576c1540j40434a8357j79880n2434R5066
19182a55605o4896B7552e55747a1652C8924i4350F2437N4444D3238a80324P8161
$$ plain form
19263 39556 -197662 -67063 -20478 -225087 -240673 -34289 -220628 -91076 5486 -285258 112898
19251 -381918 -5661 51726 32115 121148 -82414 143263 -153943 -424907 -535120 -106225 -263509
19240 -263509 -148823 -256992 -36588 -135179 20814 -196085 189517 -190969 -114173 -11910
19229 -190426 -189313 -194131 -77925 118468 -104004 136637 -176434 93394 95692 81332 -9014
19217 83818 -159044 -313931 31036 -25808 52713 -97791 -299656 -225129 -62223 -283499 -60380
19205 -172542 -182886 216718 -221799 -174993 -122381 105341 339284 53419 16415 58022 -371863
19193 56176 -29318 134447 -188905 83429 -300576 -31540 -171974 -18357 -198237 -250671 -155605
19182 -155605 -220501 27552 -555747 -11652 38924 -94350 62437 116881 43238 -180324 -102163
19171a02163A1796a5305o736q9850j06309N464F0124b18952N4419j41675K6525
19160b79683j65734h2170B7343O3494C7427d5738j59709c3558k14016A5701O5174
19149H0875J30426h8396Nj48124f9382j35982Q2662D07817A80391a58476J1771
19138a46705m9338o5181a2172B9007h0227c4873l79758i4856A24357K30065b56434
19126G2674g8454k60022a45823C56954A7351J48798a04526H0216J25591b25138
19115a86960C36484A31034Q0167H9308a86940J7328F598K18893b63906D7053a18203
19103F3649K38764J2276i3722C14251a63542r9060A48614k1389d842C72499a6382
19091c662B51626C679a07790C24750B3460M5016J46377b98235I3226b4627E8410
$$ plain form
19171 -102163 11796 -15305 -22041 -111891 -218200 -212736 60124 -218952 -164533 -306208 -279683
19160 -279683 -445417 -82170 27343 90837 37427 -45738 -205447 -33558 -247574 15701 80875
19149 80875 211301 -88396 -88391 -236515 -69382 -205364 -122702 407817 180391 -158476 -146705
19138 -146705 -196043 -261224 -12172 29007 -80227 -34873 -414631 -94856 124357 354422 -256434
19126 72674 -78454 -338476 -145823 356954 17351 166149 -104526 80216 205807 -225138
19115 -186960 336484 131034 211201 89308 -186940 -169612 6598 225491 -263906 47053 -118203
19103 63649 302413 314689 -93722 314251 -163542 -262602 148614 127225 -4842 372499 -16382
19091 -3662 251626 3679 -107790 324750 23460 68476 214853 -298235 93226 -24627 58410
19079a95882f9465k6342k22312A25329e1957b2773k36234i1662C17623E7967a836
19067D09549A48125b64580a15365D9335c63249M2509m03856B64792a11790k91007
19057d02797A09592b56443b3184j13584J7861K4808G4390g5239j2605D0212K823
19046D3035g0597E9776h3611j54178A85245a08755n9560l5204l7356j81593a08097
19034B22488c85689b3218o771a586k4312g18B34893g9289h018j71172N0569A0906
19021A86004l0614E442P2438a14786j4471A68976a14288c3514C2087J03369e9993
19009A72201j8218a65863P2549i610F1487q355b82826c3014j17399I0812b5251
18997A58065B948J75633e0315A14602a77924L8608M6407j51954k37444A75226
$$ plain form
19079 -195882 -69465 -95807 -318119 125329 -51957 -22773 -259007 -91662 317623 57967 -1836
19067 409549 148125 -264580 -115365 49335 -363249 -320740 -724596 264792 -111790 -402797
19057 -402797 109592 -256443 -23184 -136768 -118907 -94099 74390 -75239 -87844 40212 43035
19046 43035 -70597 59776 -83611 -237789 185245 -108755 -168315 -203519 -240875 -422468 -108097
19034 222488 -385689 -23218 -29989 -1586 -25898 -718 234893 -79289 -8018 -179190 -128621 10906
19021 186004 155390 5442 77880 -114786 -129257 168976 -114288 -33514 32087 135456 -59993
19009 172201 153983 -165863 -93314 -9610 61487 53132 -282826 -33014 -150413 90812 -25251
18997 158065 2948 178581 -50315 114602 -177924 -139316 -92909 -244863 -482307 175226
18986d1986o8787B69475a93154G6836K18257F0608E153a74370j53502J34068C8127
18974A90268a45699O4791A63558b1858A81122p7565c0651m71861a90518A25152
18963C1901M7346b41395j563C3414J36462E3201Q2271b40991P9608O3595D3463
18951a86936i3388k91155e8107k86897A83897b49017A50020G1534b53660H2023
18940C55737h7976q2382q363D8356J38540b46114N6821G1123b3622A51645J6738
18929A68383J06660a13219O882p1178M9646k0257k5056B08203a41754m0602j23017
18918c05373a40261H6394b3761p9739F6503J47916F2460g1282A34908b1896m29839
18907d51735K22656k56731a40732j35421d8358D4661a95333A44619J0492h5758
$$ plain form
18986 -41986 -110773 269475 -193154 76836 295093 60608 5153 -174370 -327872 -193804 38127
18974 190268 -145699 -80908 163558 -21858 181122 103557 -30651 -502512 -190518 125152
18963 31901 79247 -241395 -242958 33414 169876 53201 135472 -240991 -161383 -97788 43463
18951 -186936 -93388 -384543 -58107 -345004 183897 -249017 150020 71534 -253660 82023
18940 355737 -87976 -170358 -178721 48356 186896 -246114 -189293 71123 -23622 151645 168383
18929 168383 275043 -113219 -106337 -177515 -127869 -148126 -173182 208203 -141754 -182356 -305373
18918 -305373 -140261 86394 -23761 -103500 66503 214419 62460 -71282 134908 -21896 -451735
18907 -451735 -229079 -485810 -140732 -276153 -48358 44661 -195333 144619 155111 -85758
18896b22812D5043a67807A58919K9738f0024C28077i6372K3423k37544a29114
18885a43008k8813e1971A49567e481n0706p3038h416j75347M5929j3030A86810
18873e71530J66114a81286K2058b2236j41222e2951b423D25735a32347A3308C966
18861C54972e4477A30840b1256G6220J8556a96609M71r961O7990B13702a3847
18849g6234C96170H9989L23460j41980o6439N7925G9782M4050b65490G2053b08850
18837G5477a64963j10638k5909A36660h5209k18277C550b23179F0807b2960j47925
18826a70885B40728e1915B79241b43513E4998K24580b9842B1005M922b19638i1157
18814a84772K3345c1060B88916A8037e2658K1980J5307I2K14103m3222E0979N2669
$$ plain form
18896 -222812 45043 -167807 158919 188657 -60024 328077 -96372 -72949 -310493 -129114
18885 -143008 -171821 -51971 149567 -5481 -56187 -129225 -8416 -183763 -137834 -150864 186810
18873 -571530 -405416 -181286 -159228 -22236 -163458 -52951 -2423 425735 -132347 13308 3966
18861 354972 -54477 130840 -21256 76220 94776 -196609 -196138 -206099 -138109 213702 -13847
18849 -76234 396170 89989 413449 271469 205030 262955 79782 123832 -265490 72053 -208850
18837 75477 -164963 -275601 -301510 136660 -85209 -303486 3550 -223179 60807 -22960 -170885
18826 -170885 240728 -51915 279241 -243513 54998 279578 -29842 21005 25927 -219638 -91157
18814 -184772 -161427 -31060 288916 18037 -52658 -30678 -15371 92 214195 170973 50979 103648
18802A03648L07352d80225C4462a15553E2211N9550a48851F9184L1868B5259f2740
18790a44902p0822R3597B53107b16366c3995A41709A5522K26595a45595B91404
18779C44633b78630A70897a18748j77670J31664p9247c0358C6139c0629K756A65564
18767d75328A36856B9362N9371O8320i5238j70477J7985i3731b1546k7837m17515
18756d66898b14554L3117A94705b12956a8356E4116c1809j71048B07086a0331
18745H4136d64023b21154g1015k57982D6299a87716D4624d7346F0385J41854h9659
18733i382j28954p9656i1846j82884A53389e3588i934k08430A67534b29927J08626
18722a21301A15901L08008a41567j5052k38843J54876h1464j35306J5830g3533
$$ plain form
18802 103648 411000 -480225 34462 -115553 52211 111761 -148851 69184 101052 25259 -62740
18790 -144902 -215724 -122127 253107 -216366 -33995 141709 15522 242117 -145595 291404
18779 344633 -278630 170897 -118748 -296418 -164754 -244001 -30358 36139 -30629 -27873 165564
18767 -475328 136856 29362 88733 157053 -95238 -265715 -247730 -93731 -21546 -49383 -466898
18756 -466898 -214554 -181437 194705 -212956 -18356 54116 -31809 -202857 207086 -10331
18745 84136 -464023 -221154 -71015 -328997 46299 -187716 44624 -47346 60385 202239 -89659
18733 -9382 -138336 -217992 -91846 -274730 153389 -53588 -9934 -218364 167534 -229927 -121301
18722 -121301 115901 423909 -141567 -156619 -395462 -240586 -81464 -216770 -200940 -73533
18711I8267J61818d0182A49808B0362p076c74281a42952A33403b11624e4414a9178
18699c8967A49559j8140l8498b45389N3375j97703B42334b94342e0158A24895
18688b18645Q3982L2456k37306E5506b8778k62029A46766b54117R7429A91903
18677c28492e1805J7947B16831f6063A23805d06485b02307k8992G6884a9453k07408
18666b26861A08565b16526E0792a768G9824J61457a47952B10340a81026j15336
18656b96362P7641A17760c01068A4825R3503A0418K5710a6631k38915j32767A88274
18644A51631b12858g1993M290B30459b25985e1074Q932k6953l3288J9615j22956
18633b05724a02121c0831j5053m13732J62651A70579B9433c30982a46971F0404
$$ plain form
18711 98267 260085 -40182 149808 20362 13286 -374281 -142952 133403 -211624 -54414 -19178
18699 -38967 149559 131419 92921 -245389 -192014 -389717 242334 -294342 -50158 124895
18688 -218645 -134663 -102207 -339513 55506 -28778 -290807 146766 -254117 -156688 191903
18677 -328492 -51805 -33858 216831 -66063 123805 -406485 -202307 -231299 76884 -19453 -226861
18666 -226861 108565 -216526 50792 -1768 79824 241281 -147952 210340 -181026 -296362
18656 -296362 -218721 117760 -301068 14825 108328 10418 36128 -16631 -255546 -388313 188274
18644 151631 -212858 -71993 -67703 230459 -225985 -51074 -42142 -69095 -102383 -82768 -205724
18633 -205724 -102121 -30831 -45884 -459616 -296965 170579 29433 -330982 -146971 60404
18622f3147A07283b15851E6154O7677b07136a5158p2615F1601f4969a2059o8695
18611h0754B46443q0928f9860j31458j4173h2775E6188b83219K2118a18486N3004
18600f5482j25668c1932B44396M8885j28878g5496C71679q1540a34846c8935k3001
18589f1936B40116h8487I6383a23665k87820a37826k91332A62251d87370A06146
18578b11332Q5631p152d8154m17454F0526Q065b69437e5973k91706h355D07097
18566E1671e5732D4626R2877d0330o3460j11040a6822n7830p0405E5813i399E9061
18553B15168a77996A75208l9465K11982A25115O1680P8343f4541j8422B0834a20125
18541a89282f5207A6666L138e581j29232p899c212p5178k7372K5900k37506a05215
$$ plain form
18622 -63147 107283 -215851 56154 123831 -207136 -15158 -87773 61601 -64969 -12059 -80754
18611 -80754 246443 165515 -69860 -201318 -215491 -82775 56188 -283219 -261101 -118486 -65482
18600 -65482 -191150 -31932 244396 293281 164403 -75496 371679 290139 -134846 -38935 -61936
18589 -61936 240116 -88487 96383 -123665 -411485 -137826 -429158 162251 -487370 106146
18578 -211332 -125701 -132853 -48154 -465608 60526 68591 -269437 -55973 -347679 -8355 407097
18566 51671 -55732 44626 137503 -40330 -103790 -214830 -16822 -74652 -145057 55813 -9399 59061
18553 215168 -177996 175208 135743 347725 125115 186795 265138 -64541 -82963 20834 -120125
18541 -189282 -65207 16666 19804 -5581 -134813 -142712 -3212 -78390 -105762 -79862 -317368 -105215
18528A8008b1166D152K48945B9225b37793h9947I1523a90163B39380a25661B27763
18516C2070M1299c2365k7860k77866N6163B50162A19638G831a6948C25790j61474
18505A64316c25595o0963C23735j58761h1648B73415A10222i9346r7978j1555
18495b08879A62186f4065F2730j2640J00205c24941b2148o7986L3636r8713h072
18483h7476A74135K36532A01554d8584B24698d2107q7075m01059C12074b32667
18472A9821d28897m8751b04017A69067Q228F8955J16925b23325b7972j17061A42469
18460b5937D1523J62627e4637D6243c1701a0155j37414k5564b1974j23866L2202
18449a13638l1493O5197L5091H683J2113a50587A39048g721o7777n7587H9640
$$ plain form
18528 18008 -21166 4152 253097 29225 -237793 -89947 91523 -190163 239380 -125661 227763
18516 32070 73369 -32365 -60225 -338091 -281928 250162 119638 7831 -16948 325790 164316
18505 164316 -325595 -386558 323735 164974 -81648 273415 110222 -99346 -197324 -208879
18495 -208879 162186 -64065 62730 50090 150295 -324941 -22148 -90134 -56498 -155211 -8072
18483 -87476 174135 410667 101554 -48584 224698 -42107 -129182 -530241 312074 -232667
18472 19821 -428897 -477648 -204017 169067 177295 68955 185880 -223325 -27972 -145033 142469
18460 -25937 41523 204150 -54637 46243 -31701 -10155 -147569 -173133 -21974 -145840 -113638
18449 -113638 -145131 -79934 -44843 8683 20796 -150587 139048 -7721 -75498 -133085 89640
18437a99306g7493m33287A75020a23058l70627a0578A33914Q4287a10313n2241
18427a62554D2866h1036o805K458L7404r8312E0832A8559e4242A42551a57059
18415a60003H5731i2189A96613G7155J06024a59932d7293j51447G2778J37284
18405B10062p8864b83173A69701G4798K37944a56770a9836C26757d07116h0926
18394c54243R0585J22930j8413A94735c50407D5004b7537j81907A981b21881A81371
18382A72005m3662a4246j16137F700e3405j9673B39963i6584j63427H3559a53068
18370B13930P1900c52624B07474A6923a47094K2950c3303A11394R7826a88656
18359f7626F2883g9331I0736b14275f7734j94368B08715N2695o1245a91261H1569
$$ plain form
18437 -199306 -77493 -510780 175020 -123058 -493685 -10578 133914 218201 -110313 -162554
18427 -162554 42866 -81036 -87841 -85383 -47979 -146291 50832 18559 -54242 142551 -157059
18415 -160003 85731 -92189 196613 77155 183179 -159932 -47293 -198740 72778 210062
18405 210062 131198 -283173 169701 74798 312742 -156770 -19836 326757 -407116 -80926
18394 -354243 -263658 -140728 -159141 194735 -350407 45004 -27537 -209444 1981 -221881 181371
18382 172005 128343 -14246 -130383 6700 -53405 -73078 239963 -96584 -260011 83559 -153068
18370 213930 285830 -352624 207474 16923 -147094 -124144 -33303 111394 209220 -188656
18359 -67626 62883 -79331 90736 -214275 -67734 -262102 208715 261410 200165 -191261 81569
18347c67491b1458o8369E8240a32654j4185A12614a9822k58804A31036a79242
18336a24512j02971A09376c34029a04781A9041a2695A60060a73054P6188m8789
18326a45655c157A16773K01824e1746j26178P5968G9453a62605F2096c0023k00191
18315b30214K1988N7066j78212C0346a94628n218B89155a16577j26872E1097J44154
18304A95251D4555N9686e62641J16632A45764b6845q4015L5810b9190B79603f4618
18292B27008h5230k1154l2792O8128G915a27958K4866J8937B41554e9789C86480
18280a68902A6714c59442A88530q3586b86069F0649j2377J89295O6419E5452f59948
18268A4468K62968b11862A37305K17071a49266F0812b30397B16305j9101a13759
$$ plain form
18347 -367491 -21458 -89827 58240 -132654 -146839 112614 -19822 -278626 131036 -179242
18336 -124512 -227483 109376 -334029 -104781 19041 -12695 160060 -173054 -96866 -145655
18326 -145655 -3157 116773 318597 -51746 -177924 -101956 79453 -162605 62096 -30023 -230214
18315 -230214 -208226 -151160 -329372 30346 -194628 -199846 289155 -116577 -243449 51097 195251
18304 195251 44555 104241 -562641 -446009 145764 -26845 -110860 -75050 -29190 279603 -64618
18292 227008 -85230 -106384 -139176 -71048 7915 -127958 -103092 -84155 241554 -59789 386480
18280 -168902 16714 -359442 188530 104944 -286069 60649 48272 237567 303986 55452 -659948
18268 14468 277436 -211862 137305 354376 -149266 60812 -230397 216305 197204 -113759
18257b88167M2522D9422K12283r7216b64796I3745g2426A753a30299j25805j32663
18246c88767N3921a26926B9771R8682K6343o922a46027j78842f82j63446N8863
18235a05265A55198b48810B49105a97009A08851a94580A065L5665a2972B7648
18224d2926l6014r778L2150I4145J5538c38251B43198J5012b89138a5485m0183
18213e5668A06844a16472A29704e4116A77112b4351p1995A80510c6982n919A72512
18201i5555o6886k4666m2022B9027P1994a11846I2774c50500g2458j5408j4276
18190a02142j38693N153J9111A41420i4682A73810B1964K23677b62969E8216k0095
18179C8121K73518A0439J72997b83478C73712a23746B679Q8924P7063i0919A81630
$$ plain form
18257 -288167 -245645 49422 261705 164489 -264796 93745 -72426 1753 -130299 -256104 -388767
18246 -388767 -334846 -126926 29771 128453 154796 147874 -146027 -324869 -682 -164128 -105265
18235 -105265 155198 -248810 249105 -197009 108851 -194580 1065 36730 -12972 27648
18224 -42926 -78940 -88718 -56568 94145 109683 -338251 243198 258210 -289138 -15485 -55668
18213 -55668 106844 -116472 129704 -54116 177112 -24351 -96346 180510 -36982 -42901 172512
18201 -95555 -162441 -187107 -229129 29027 101021 -111846 92774 -350500 -72458 -87866 -102142
18190 -102142 -240835 -235682 -216571 141420 -94682 173810 21964 245641 -262969 58216 38121
18179 38121 311639 10439 183436 -283478 373712 -123746 2679 91603 168666 -90919 181630
18167A90597d8424B9449f8198G7342J90599c52010a26573C304K56465d9259a9469
18155a01498m9270C914K60446b57609A94615p0374J84404f3629j81303A75818
18144g1159j09331d5355C0656R2855D874h6243A88292h6685g938G229h4603b9381
18131c48222A1642K5757f1169B76685H4232J16892a472k09623j8541B77415f4858
18119h0347d894j94509j2688b5389r8467A48296Q454a06268j14110E8641j2234
18108D6407c46355R757B50163a17471H1443g1766G5662B6522J48982F588i1766
18096b46032a02826G3896K39342e4207j40250H2444a50932A78855F3509L6713
18086A00222J11377f0734O944F8700L08909a54749k3392L3545c5180j16083A3667
$$ plain form
18167 190597 -48424 29449 -68198 77342 267941 -352010 -126573 3304 259769 -49259 -19469
18155 -101498 -150768 3914 264360 -257609 194615 124241 308645 -63629 -244932 175818
18144 -71159 -180490 -45355 30656 123511 4874 -86243 188292 -86685 -7938 7229 -84603 -29381
18131 -348222 11642 37399 -61169 276685 84232 201124 -1472 -211095 -229636 277415 -64858
18119 -80347 -4894 -199403 -212091 -25389 -123856 148296 156750 -106268 -220378 58641 46407
18108 46407 -346355 -336598 250163 -117471 81443 -71766 75662 26522 175504 6588 -91766
18096 -246032 -102826 73896 313238 -54207 -194457 82444 -150932 178855 63509 100222
18086 100222 211599 -60734 -53790 68700 377609 -154749 -178141 -144596 -35180 -151263 13667
18074b69432b7353a0054B48437A14053e6683b073A54243H39L21018a3255A413
18062A47618b9092q4117A05072h2935A70545e49178f2068B14081Q1140f9740K5291
18051d4449I3305a51943I1436J15957a14443A14040a6296j58114P2679B91030
18040F3911A6060K2075a36718a5197C1022b59112e5527A78988K2822d7257C0995
18028B58874f8737A6082P1465d0311A36338d99834a90648h2644J5087A71329a94035
18016a88747f7985l5128q415A41352a7552B0749O1559c07246I0281a66458q1167
18005b47625A33698b27966P0861m5979A43086d2487n1474m4264C97190q7942I8462
17993B44572h414H3405h2130a7502r8855C8614a80960l3273A10968f4100L1312
$$ plain form
18074 -269432 -27353 -10054 248437 114053 -56683 -2073 154243 839 321857 -13255 1413
18062 147618 -29092 -113209 105072 -82935 170545 -549178 -62068 214081 295221 -69740 -44449
18051 -44449 93305 -151943 91436 207393 -114443 114040 -16296 -174410 -101731 291030
18040 63911 16060 38135 -136718 -15197 31022 -259112 -55527 178988 201810 -47257 30995
18028 258874 -68737 16082 87547 -40311 136338 -499834 -190648 -82644 -67557 171329 -194035
18016 -188747 -67985 -103113 -111528 141352 -17552 20749 82308 -307246 90281 -166458 -247625
18005 -247625 133698 -227966 -157105 -203084 143086 -42487 -93961 -138225 397190 309248 98462
17993 244572 -8414 83405 -82130 -17502 -116357 38614 -180960 -214233 110968 -64100 -32788
17982c2788j7305F3380B9406P2804a59393C9598C42K28310a76929G1156a87427
17970h7637p8716k39673I8701c3569H0105J2432j4842a80624P8005k4828j8827
17959a46274C71008a10629d6765J7674B0165N4580b8138G7772c9770I4804C8791
17947G8934h6512m36G7283G374J02232f1361A485b96831j14387J74722H9889d01182
17934b07762F7034c0755A7865J00535b89691a04779A12426c52812D0711a18471
17923B76804a89900c1949G1387d2582q8284A93574a18177A54717m2848a64308
17912B94047a87377d278B6650P1780h5032k52532d2720q823k02786D9794a43376
17900B16003b80252J14461c8661j08935B24081e376k65760g2952j18435H0322
$$ plain form
17982 -32788 -50093 63380 29406 102210 -159393 39598 342 228652 -176929 71156 -187427
17970 -87637 -166353 -406026 98701 -33569 80105 92537 77695 -180624 -102619 -127447 -146274
17959 -146274 371008 -110629 -46765 -29091 20165 74745 -28138 77772 -39770 94804 38791
17947 78934 -86512 -86948 77283 7374 109606 -61361 1485 -296831 -411218 -236496 89889 -401182
17934 -207762 67034 -30755 17865 118400 -289691 -104779 112426 -352812 40711 -118471
17923 276804 -189900 -31949 71387 -42582 -130866 193574 -118177 154717 111869 -164308
17912 294047 -187377 -4278 26650 98430 -85032 -337564 -42720 -51543 -254329 49794 -143376
17900 216003 -280252 -165791 -38661 -147596 224081 -5376 -271136 -72952 -191387 80322
17889g665k58929a19441F661b29946B26688p2190Q4159h7013m26875H6167L282
17878H9449k880c3648A64970D3486e34022F9407P7029b3278A13862h0020K2330
17867e7690j7467B56952P4089c17180j00634E4062k5256b89024A16678b30471
17856A35050a80032H828N3091O4157O5745M833D6614Q9518K36228c25726B88058
17844a08115M0853C71441B6914i6387d1829l71404A56813A6939P0959a39753M0189
17833i9564j79969A40274D1326J7876M566b05016A55445a59202P2669B68J31402
17822A31670g8510c1633A1991L9514a50598A39432a06362j7927j61003a7726C5823
17810A1965i5661c584C74252N519a28458A42530b18955A48422n6052g546j6908
$$ plain form
17889 -7665 -266594 -119441 6661 -229946 226688 154498 238657 -87013 -513888 86167 89449
17878 89449 86569 -33648 164970 43486 -534022 69407 146436 -23278 113862 -80020 -57690
17867 -57690 -75157 256952 331041 -317180 -417814 54062 28806 -289024 116678 -230471
17856 135050 -180032 8828 61919 126076 191821 196654 46614 136132 372360 -325726 288058
17844 -108115 -67262 371441 26914 -96387 -41829 -413233 156813 16939 87898 -139753 -99564
17833 -99564 -279533 140274 41326 59202 63768 -205016 155445 -159202 -86533 268 131670
17822 131670 -78510 -31633 11991 51505 -150598 139432 -106362 -124289 -285292 -17726 35823
17810 11965 -95661 -3584 374252 379771 -128458 142530 -218955 148422 92370 -7546 -24454
17799b4454E43389F0686M329a02219j82935J41068k8772E4699d31100h029l39175
17788c47204A2876i0847j21742o5534A21983b16694l06535A70024J02766M8617
17778C21407C9252b24832e1311l0716j54331O277j6229H0331J41997h9817E5926
17766A32381J01999a02215b0707B28935M3988A8593d34817B35612H3463K1250
17756A04713i641A82663a73930c9210j61055e0385A67660m4863A1946K29415d425
17744b10448A84558E0023c742B01263a94303j77282B32922a9482B03397d3193
17733d6934A68796c80945a31038A55431b26224B77225J08611j08598a4170D1973
17722h9977j936A26580j2524d9721k10701C63587e871j54086C99042A65037c7630
$$ plain form
17799 -24454 543389 60686 65015 -102219 -285154 -144086 -172858 54699 -431100 -8029 -347204
17788 -347204 12876 -90847 -212589 -278123 121983 -216694 -523229 170024 272790 321407
17778 321407 39252 -224832 -51311 -82027 -236358 -230081 -246310 80331 222328 -89817 55926
17766 132381 234380 -102215 -20707 228935 272923 18593 -434817 235612 83463 104713
17756 104713 -9641 182663 -173930 -39210 -200265 -50385 167660 122797 11946 241361 -4425
17744 -210448 184558 50023 -3742 201263 -194303 -371585 232922 -19482 203397 -43193
17733 -46934 168796 -380945 -131038 155431 -226224 277225 385836 277238 -14170 41973
17722 -89977 -91913 126580 114056 -49721 -260422 363587 -5871 -159957 399042 165037 -37630
17710B81434A30428L0426p0787B7838J59027m7504a33034k3540j91115C51941
17699c6579A92001J78470b66623Q9773B38395d0513k75573B93632q6193b29043
17688A43565a21207B48242d9174m270a2849A73633p9173D0914c08699c2900j86140
17677b19040C55913J45946j85577a27444A69339b96367A19817Q1084p5912b7170
17666B04252b67398c9002A48904M5725h8759A13592a20663C9366L43006C5633
17655a04243B5688o021b00901O7153B87585a86842H0159a21187j92444a38803
17644a4740l48179G1216d3977k34453F2592a08416A38255A2091L13879O624G9866
17632A32077a0104B28478F9132J50823G5725a12597A64349b01854C0383b33537
$$ plain form
17710 281434 130428 160854 90067 27838 186865 139361 -133034 -156574 -347689 351941
17699 -36579 192001 370471 -266623 -176850 238395 -40513 -316086 293632 207439 -229043
17688 143565 -121207 248242 -49174 -53444 -12849 173633 94460 40914 -308699 -32900 -219040
17677 -219040 355913 501859 316282 -127444 169339 -296367 119817 200901 124989 -27170
17666 204252 -267398 -39002 148904 194629 -88759 113592 -120663 39366 382372 35633
17655 -104243 25688 19667 -200901 -133748 287585 -186842 80159 -121187 -313631 -138803
17644 -14740 -362919 71216 -43977 -278430 62592 -108416 138255 12091 325970 332594 79866
17632 132077 -10104 228478 69132 219955 75725 -112597 164349 -201854 30383 -233537
17621A15838e847a170l22417a52417e5135m72805e5648j57809A07029J1329f3064
17609a934k4603A26615C6664J19185b51135O1287A12641K5799L8080D1035A5237
17597C83709A2699a70616l8061B45760D0171e4006C04612A01431J68011C5453
17586B02231a04628B0231O6439g2794A58790m2016a86928j07238C81374b1509
17575A45379c2917j12168M723Q036c9212M562G2168a60801c9725F0317J15889
17564A76206N4075b6409A70355e74770B30096E0775P133b48195H7143J29354a58817
17552B70819G3165L397J23313J38515c4254m4744j13059a7322r9498C76205G8742
17540A97913A3764a0801B61928J8273j06459M178L77174B00270a04079M5213B27947
$$ plain form
17621 115838 -5847 -1170 -323587 -152417 -55135 -527940 -55648 -213457 107029 118358 -63064
17609 -1934 -26537 126615 36664 155849 -251135 -189848 112641 138440 176520 41035 15237
17597 383709 12699 -170616 -208677 245760 40171 -54006 304612 101431 269442 35453
17586 202231 -104628 20231 86670 -72794 158790 116774 -186928 -294166 381374 -21509
17575 145379 -32917 -145085 -140362 -132326 -39212 -34650 72168 -160801 -39725 60317 176206
17564 176206 230281 -26409 170355 -574770 230096 50775 57908 -248195 87143 216497 -158817
17552 270819 73165 76562 199875 338390 -34254 -78998 -192057 -17322 -116820 376205 78742
17540 197913 13764 -10801 261928 280201 173742 177920 555094 200270 -104079 -58866 227947
17528B44746k1643G80Q4478a58584D1663J26857b19857B25262J17344b5419A35534
17516C15957I1914K03683r6586l8957b55083A0913R2243J6009b024D0705J12905
17505A53610F3222c86736f0545A32002a15474o56N1391n7323A64807i0929O536
17494h4393B71343d110A04847M87626A58292a1765A28211b11763F8898J55403
17484B24301a39619J9344N8492b6420C31370a39497B91121o5952J58592A90933
17473D5621O3768l1623O0335J11029A03643P3916l4142B6226K76815H3250g4698
17461B11192H9300O3829o0820c81040a88261G8313J103K1320K29788P7520J01182
17450E09226q3811A96679M60029B53550b30545D54245r5918M2274A66230n889
$$ plain form
17528 244746 223103 780 85258 -158584 41663 168520 -219857 225262 342606 -25419 135534
17516 315957 91914 295597 199011 160054 -255083 10913 103156 119165 -2024 40705 153610
17505 153610 63222 -386736 -60545 132002 -115474 -116130 -64739 -122062 164807 -90929 -84393
17494 -84393 271343 -4110 104847 592473 158292 -11765 128211 -211763 68898 224301
17484 224301 -139619 -120275 -61783 -26420 331370 -139497 291121 225169 383761 190933
17473 45621 109389 77766 138101 249130 103643 177559 143417 26226 303041 83250 -74698
17461 211192 89300 153129 92309 -381040 -188261 78313 79416 100736 330524 408044 509226
17450 509226 425415 196679 656708 253550 -230545 454245 358327 400601 166230 160341
17440A60341a20384A72401J27398j16239L00919k10400n0183k313a3781q2741
17430i6522c9626C50166D5746J84286E0245M00801j3348o2831L01518A11542J8897
17419A30439N5130l2043L66730h0466B82395Q1790A08574K19001p8981j10086
17409A38508L22610j31667E7519J5483J6244J00209E1534E072J4133J36454C8297
17397A99439B5332K32177r0426J34077d307D2833K20541G9046J89116k6490N0742
17386B92414b69688B00013F6752N6533J4017A6079K0603h450C28234H0024h9433
17374F12983g1551D17635H8302b88160A66995A7244a09350a302B88948d9109C81085
17362B17394O9613a05837C97460j18085P5126n0810g8724A53648A5352K44901
$$ plain form
17440 160341 -120384 172401 299799 183560 484479 274079 223896 221583 -13781 -96522
17430 -96522 -39626 350166 45746 230032 50245 451046 437698 374867 676385 111542 130439
17419 130439 185569 153526 520256 -80466 282395 364185 108574 327575 248594 138508
17409 138508 461118 329451 57519 73002 89246 189455 51534 5072 19205 155659 38297
17397 199439 25332 257509 167083 301160 -4307 42833 263374 79046 268162 241672 292414
17386 292414 -269688 200013 66752 123285 137302 16079 36682 -8450 328234 80024 -89433
17374 612983 -71551 417635 88302 -288160 166995 17244 -109350 -1302 288948 -49109 381085
17362 217394 287007 -105837 397460 279375 354501 303691 -78724 153648 15352 260253
17352B60253f1174a0126D60571r2177a8568F9444a48728B43733R3786A62991L9270
17341B02261I6465A709J32812J12248A09474K50159q4767A7918d0815E08981A94187
17329B22699n4682P7544B6392Q1339R5880m361f8476I0605J38121r3719a72351
17317I6161b17081A55747J83406a47851B20157e8257A06689h4092C15743r1878
17307B23865n0640J74008b0121k04127A59206a10860C4177h6830k1740C44885
17296a31906B02076C2680L91411A75778K37731A72441o1523n5093Q2187k939J07409
17285B42482D6874K07328J134J7014b22546A37374c9124A90563K33057B03829
17274B62398O8695K6944a20158C01100L8250A14796M70344j93358j49185P5010
$$ plain form
17352 260253 -61174 -10126 460571 368394 -18568 69444 -148728 243733 337519 162991 202261
17341 202261 96465 1709 134521 246769 109474 359633 274866 17918 -40815 508981 194187
17329 222699 168017 245561 26392 107731 203611 199250 -68476 90605 228726 135007 -172351
17317 96161 -217081 155747 339153 -147851 220157 -58257 106689 -84092 315743 223865
17307 223865 173225 347233 -20121 -224248 159206 -110860 34177 -86830 -108570 344885
17296 -131906 202076 32680 424091 175778 413509 172441 110918 55825 138012 135073 242482
17285 242482 46874 254202 255336 272350 -222546 137374 -39124 190563 423620 203829
17274 262398 331093 358037 -120158 301100 339350 114796 585140 391782 242597 317607
17264C17607g205A63913l9709J92079j42313J2823J12853b69858A19716i7111
17253D49628A53242o1772k480j6594n311M1006L03445j37907K88144l8180o1259
17242D62334p3504A03516J18252r8495K04339J04327F6338B4643Q9028M1159G6211
17230B71689L9274f4174l3262I5220N0757P3390J44392f8066D0395b16431A27818
17218E16298j48480o3047g4757C59448J4857l9869j59910E9954L15319A73282
17207C00118o7618E5970K6316J82670J8708j147J8384A40295J08634K21120b1858
17195B11277Q2232H6242m077R2548n4333M64221B23837a9772A75561L46496A23888
17183B17482H4549K63878N9608A13151K69738l2259A7252K78362K51764B54815
$$ plain form
17264 317607 -7205 163913 124204 316283 173970 186793 299646 -269858 119716 -97111
17253 449628 153242 91470 88990 72396 67085 108091 411536 273629 561773 523593 462334
17242 462334 388830 103516 221768 123273 327612 431939 66338 24643 113671 154830 76211
17230 271689 310963 -64174 -97436 95220 145977 219367 363759 -68066 40395 -216431 127818
17218 516298 367818 304771 -74757 359448 374305 334436 174526 59954 375273 173282
17207 300118 232500 55970 82286 264956 283664 282517 300901 140295 248929 470049 -21858
17195 211277 293509 86242 82165 174713 120380 584601 223837 -19772 175561 522057 123888
17183 217482 84549 348427 408035 113151 382889 350630 17252 295614 547378 254815
17172A54860K16682k4251A29844K30946o4214m629r8375K57931j39850j12574
17162A99079M41113c10340F30089k49832p0160a15527B83251J60456N7520j76258
17152C24969P4506A71176j413O0646K19227A17688b4762B42521q2223K54876q8527
17141C26647M01050k34512O2082B76713K88564B05490G0769Q31867D41946o4090
17131C77856b6751E36573r634A93801P8467k9356M62700A95697K1088J53015r6155
17120B73645O0650c06125G5254J5737K17505J75059L9080M377j01881G7922R7406
17109A75328K52513j87433K89672j42413j5486Q7298L7595j60727P3117L1599
17099D41063K39458B14287j1407L58258F2974M60238A31185K67759M9604A65648
$$ plain form
17172 154860 371542 347291 129844 360790 296576 291947 193572 451503 311653 199079
17162 199079 640192 -310340 630089 380257 310097 -115527 283251 443707 501227 324969
17152 324969 399475 171176 169763 230409 449636 117688 -24762 242521 160298 415174 326647
17141 326647 727697 493185 555267 276713 565277 205490 70769 902636 441946 377856
17131 377856 -26751 536573 526939 193801 272268 242912 705612 195697 216785 369800 273645
17120 273645 334295 -306125 75254 90991 308496 483555 522635 527012 425131 77922 175328
17109 175328 427841 240408 530080 387667 372181 459479 497074 336347 409464 441063
17099 441063 680521 214287 202880 561138 62974 523212 131185 398944 448548 165648
17088D65002l8722q4298J48176J29156j43372j61664j0299l971J12790R3549B46896
17076E91030k43454k2274J17991r5143J75536Q8717j62553q1757J14005O9291
17066E51389M631q098o5777J59117j61879j63701J46605L09020B60174H4494L51816
17055D36310L63061j26407j80443Q3475B34317k8218K70483j52174N44964C99610
17044H83326l71971J0918K15474l12511L1272K60079C58217M52940l12820L70159
17034H68496D29762J56752J91896O4366l82674K10028N6131j38915j58045K42118
17024F71419k76164J75096n3302K88498k86839j0932J79736P3882J41981l01255
17014F02120K06865k94933J27861P4274k14856r131J79715J90462k14854M718
$$ plain form
17088 465002 426280 341982 490158 619314 475942 314278 303979 300008 412798 506347 246896
17076 591030 347576 325302 443293 348150 523686 612403 449850 368093 482098 551389
17066 551389 556020 547922 482145 641262 479383 315682 462287 771307 260174 84494 436310
17055 436310 799371 672964 492521 575996 234317 206099 476582 324408 869372 399610
17044 883326 511355 522273 737747 425236 456508 716587 358217 811157 498337 868496
17034 868496 429762 586514 778410 842776 460102 670130 726261 587346 429301 671419
17024 671419 395255 570351 517049 805547 518708 507776 687512 761394 903375 602120
17014 602120 808985 514052 641913 716187 501331 492200 671915 862377 647523 652241
17004F52241j19816M56235l09879k93155K10857K88283K73875D33912M46654M6870
16994I27436k30841L08970j84148j28412j53395L94293j64677k11232N12269j72846
16984H97417C98532N16382o9631Q7441k13680R1540J99609q5519J43878j28032
16974I40520m8356J13883P2674k3025D73776J84728J56415L69765k26483J37708
16964A095909J68510l74858J52370l2354k02587L47105l70317k23652M5121M08308
16954A013555J33651M0363l92118J39426l3129J91393r2367j67766L02527L0838
16944A166373k50868M05828l61192l7318R2208J27983Q0861k79533M9152L28144
16934A321638k56552K61054J41414o87067K40590K44516M21763m08849L22218
$$ plain form
17004 652241 532425 988660 678781 385626 596483 884766 1158641 433912 880566 927436
16994 927436 696595 1005565 821417 693005 539610 933903 769226 557994 1070263 897417
16984 897417 398532 914914 845283 932724 719044 810584 1010193 924674 1068552 940520
16974 940520 892164 1006047 1078721 1055696 473776 658504 814919 1184684 958201 1095909
16964 1095909 1264419 889561 1041931 1009577 806990 1154095 783778 560126 605247 1013555
16954 1013555 1147206 1187569 795451 934877 901748 1093141 1000774 833008 1135535 1166373
16944 1166373 915505 1321333 960141 922823 1015031 1143014 1223875 944342 993494 1321638
16934 1321638 1065086 1326140 1467554 780487 1021077 1265593 1687356 1278507 1600725
16925A600725n95759M14459j10661o5565j11865J25382J73364K17690k40873p9475
16915A327422K04662j40102j51702K3699J46782j54311J64107R3816j94856J36383
16905A455900o3493K19611o0235L652j10859Q3561J12267k3263K08223l43005
16895A482359P34091l40600l66413K03533J64556J87552n62189L53297j54029
16886A702157O6135j24507K61708K86307j45413j89070r6020L62988L435L12903
16876B440623k21806m9186k03694L39584J34827l32477K43416J67902M8680j14628
16866B453241L6805k59641L75482N1143j697j52338L61988l77197J16310K30361
16856B834457Q6479L21939o80079L24720P6458N6189K00381j21513O3832K06152
$$ plain form
16925 1600725 1004966 1419425 1308764 1243199 1131334 1256716 1430080 1647770 1406897 1327422
16915 1327422 1532084 1391982 1240280 1263979 1410761 1256450 1420557 1514373 1319517 1455900
16905 1455900 1392407 1612018 1551783 1555435 1444576 1528137 1640404 1617141 1825364 1482359
16895 1482359 2216450 1875850 1509437 1712970 1877526 2065078 1502889 1856186 1702157
16886 1702157 1768292 1643785 1905493 2191800 2046387 1857317 1761297 2124285 2127720 2440623
16876 2440623 2218817 2169631 1965937 2305521 2440348 2107871 2351287 2519189 2567869 2453241
16866 2453241 2490046 2230405 2605887 2657030 2655333 2502995 2864983 2487786 2604096 2834457
16856 2834457 2920936 3242875 2562796 2887516 2963974 3020163 3220544 3099031 3162863 3369015
16846C369015o1472K58717l40821l1164K54844p6262O62249k61783M1885J13626
16836C928834M5616j32028K20484q3995O0383L50453j51790O3887J62396k55065
16826D209175M62272k41569L96775L09189l65988L91954k79510M23983j70425
16817E135856j04511M70882J86968n855r6288J66810L17068K34909r8212M2395
16807F250022O5340L63750P9691J58381J86451L32010M09326M42723q21549M99050
16797G965195L00313J042J92647K79588K62438J36310L40419K7465M03564K83147
16787A0192128K59723L17037J37874K8257M30866P47698K56659J88868K94770
16778A2853880L69872M44036N10530J92698Q14720K18466N54711P39886L01302
$$ plain form
16846 3369015 3307543 3566260 3225439 3194275 3449119 3372857 4035106 3773323 3815208 3928834
16836 3928834 3974450 3842422 4062906 3978911 4039294 4389747 4237957 4301844 4464240 4209175
16826 4209175 4671447 4429878 4826653 5135842 4769854 5161808 4882298 5306281 5135856
16817 5135856 5031345 5502227 5689195 5683340 5587052 5753862 6070930 6305839 6207627 6250022
16807 6250022 6315362 6679112 6758803 6917184 7103635 7435645 7844971 8287694 7466145 7965195
16797 7965195 8265508 8266550 8459197 8738785 9001223 9137533 9477952 9505417 9908981 10192128
16787 10192128 10451851 10768888 10906762 10935019 11365885 12113583 12370242 12559110 12853880
16778 12853880 13223752 13667788 14178318 14371016 15185736 15404202 15958913 16698799 17000101
16769A7000101P67269J97810J110094M63867Q65064N93910O04456J301065O50506
16760B3554142R02181Q45370J256647J310834P43807J831535N94759K224441J268764
16751C4532480J313294J886484J846122J704186K523193K094859K060531L005955
16743E0967104K710243L004230L261014L774201L660251L692054M250134M917233
16735H0236464M788218N153935N968506N668625O444213O454073P392867P265036
16727A29371937P644800P932857P909143Q338878P963317P044855P350126O286097
16719A89842010N530055M331993K859400J785094L15372r47426k393175l889776
16711A97433547m937755n632911o639449p213347q127866p946589p984108q313662
$$ plain form
16769 17000101 17767370 17965180 19075274 19539141 20404205 20998115 21602571 22903636 23554142
16760 23554142 24456323 25301693 26558340 27869174 28612981 30444516 31039275 33263716 34532480
16751 34532480 35845774 37732258 39578380 41282566 43805759 45900618 47961149 50967104
16743 50967104 53677347 56681577 59942591 63716792 67377043 71069097 75319231 80236464
16735 80236464 85024682 90178617 96147123 101815748 108259961 114714034 122106901 129371937
16727 129371937 137016737 144949594 152858737 161197615 169160932 176205787 183555913 189842010
16719 189842010 195372065 199704058 202563458 204348552 204663924 203716498 201323323 197433547
16711 197433547 192495792 186862881 180223432 173010085 164882219 156935630 148951522 140637860
16703A40637860p795225p836907p410195o959346o888183o460502n710404n375151
16695H6201947n290740m506936m705303m376512l756907l175897l643942l455659
16687E3290051j941226l446614k378752k609061j785269k124864j862430j883289
16679C5258546j538315j458929j475548j373243j228390j393385o34034j136030
16671B5020672j194121r23935o09256j420110p98472l68925r47331p53860k37014
16662A7767648r70780p39642m46700k45566p64289m62106o47989l10444k92782
16653A2887350l31605j96001n62939j18648o84202q6262k41226l87554n76348
16644I702565k22391l27005q3417l19104j42150l79252J0448j17720m10331k4047
$$ plain form
16703 140637860 132842635 125005728 117595533 110636187 103748004 97287502 91577098 86201947
16695 86201947 80911207 76404271 71698968 67322456 63565549 60389652 56745710 53290051
16687 53290051 51348825 47902211 45523459 42914398 41129129 39004265 37141835 35258546
16679 35258546 33720231 32261302 30785754 29412511 28184121 26790736 26156702 25020672
16671 25020672 23826551 22902616 22293360 20873250 20074778 19705853 18758522 18004662 17767648
16662 17767648 16796868 16057226 15610526 15364960 14600671 14138565 13490576 13180132 12887350
16653 12887350 12555745 12359744 11796805 11678157 10993955 10907693 10666467 10278913 9702565
16644 9702565 9480174 9153169 9069752 8750648 8608498 8229246 8239694 8121974 7711643 7687596
16634G687596k65759k70922r6702K24531n21907k96661L5797r7579m31683j09482
16624E857229j97693r1725l33960L38303j28839q26463J02547K93357k79013k44295
16614D489448J88511K29748p07769O18630o36863J19260P8055k76910k54062L61661
16604D209709k17126j34599K0176k88057J00096k89425p4687J68817k64971J10304
16594C340237l60042L36160o4468j61083j3335j88667Q7386k40059J06021O2341
16584B904491j56932j78861J47118j7812J29776o5764l58836r0715K76283n39898
16574B048850L02712J11927k21499k15783J60991J64246R6712k98752K12964n30882
16564A831486J35711k6665j45062N69181j32257l69691j63088J37657j25143J22137
$$ plain form
16634 7687596 7421837 7150915 7054213 7278744 6756837 6460176 6495973 6398394 5966711 5857229
16624 5857229 5659536 5567811 5233851 5572154 5443315 4616852 4719399 5012756 4733743 4489448
16614 4489448 4677959 4907707 4199938 4818568 4181705 4300965 4379020 4102110 3848048 4209709
16604 4209709 3992583 3857984 3878160 3590103 3690199 3400774 3326087 3494904 3229933 3340237
16594 3340237 2980195 3316355 3251887 3090804 3077469 2888802 2976188 2736129 2842150 2904491
16584 2904491 2747559 2568698 2715816 2698004 2827780 2762016 2403180 2312465 2588748 2048850
16574 2048850 2351562 2463489 2241990 2026207 2187198 2351444 2448156 2149404 2362368 1831486
16564 1831486 1967197 1940532 1795470 2364651 2232394 1862703 1699615 1837272 1712129 1834266
16554A834266j28403k15830K93910K83920k42212j59363l6171l07378J49670M2661
16544A515070j02199K48373M7713j95460O5192j50332R8908m68442L12425q4981
16534A286267J95271j5664l29887l8285j04913K81639K08739p8860J77493n17436
16524A064364K02861M930L05055m13115K15132q0546Q5805k54714Q5136K59306
16514A474214l19409J5667J38929p251m09516L63931k67251j00950P9042K19267
16504A186673j54251k23398J05158J37754k4425J06357q3553K7546j74505j9032
16494H84324N37765m03333k59606J10162k72366L60877q8744l8081J61273l94381
16484E97890M75035D84682K52333N9491J30877D28633K24326L06741q5219l10831
$$ plain form
16554 1834266 1705863 1490033 1783943 2067863 1825651 1666288 1630117 1322739 1472409 1515070
16544 1515070 1412871 1661244 1708957 1513497 1578689 1428357 1527265 1058823 1371248 1286267
16534 1286267 1481538 1465874 1135987 1097702 992789 1274428 1483167 1404307 1581800 1064364
16524 1064364 1267225 1272155 1577210 1164095 1379227 1298681 1384486 1129772 1214908 1474214
16514 1474214 1154805 1170472 1309401 1302150 892634 1256565 989314 888364 967406 1186673
16504 1186673 1032422 809024 914182 1051936 1027511 1133868 1050315 1077861 903356 884324
16494 884324 1422089 1018756 759150 869312 596946 957823 869079 830998 992271 597890
16484 597890 1072925 484682 737015 796506 927383 428633 652959 959700 874481 563650
16474E63650k5458K92199j2631o4140j04916m2783j18885N9363K35133p0763j11521
16463E99248J34120m8598j43385K91700j76048k32863K26879m5727n8555k29229
16453C17542m4687K5985K51348J22141j25983n1803k01603L23552j35658j87421
16443B93413M67002k70021j02618N8409b82162G11939o8948n1721Q4441k40324
16433D35387j03424p638J18448M4069m7555B18162K52718L2251l9095O1403j1136
16422E14303l6234k05186K10796D1200K66897L39123j97073j45255L09312q6587
16412E27617B02571J22698K08306J33095j25965j70566j32919K45365A67794L08043
16402D75837r8488q5322q245K16714L613A31413K02992p3158J01168J01028A97513
$$ plain form
16474 563650 538192 830391 817760 753620 648704 605921 487036 546399 781532 710769 599248
16463 599248 733368 684770 541385 833085 657037 424174 651053 605326 546771 317542
16453 317542 272855 298840 550188 672329 546346 494543 292940 616492 480834 293413
16443 293413 760415 490394 387776 446185 -282162 711939 642991 591270 675711 435387
16433 435387 331963 324325 442773 486842 439287 218162 470880 503131 464036 525439 514303
16422 514303 478069 272883 483679 41200 308097 647220 450147 304892 614204 527617
16412 527617 202571 325269 533575 666670 540705 370139 237220 482585 167794 475837
16402 475837 377349 292027 283782 500496 504109 131413 334405 261247 362415 463443 197513
16390G68859B01081K54800k05989N81549A75285J7828J85486A36162o3342J64805
16380B37625P0680o4304j18059L34780r7300o7856K89397A16469J08404r263m799
16369B10811L21974K8629l1493j17481A06833J47109A07313Q5882G6940K03532
16359B80472K46669A86402O8059R7551m3124L05264A62678K21745A64344K5362
16349A89706L57647G2712K48298A35591R777J36124A8844L09419H5376K34114
16339C19490J8202H0168k6215M44790k48022F5180g6282B85712Q1137O8162j41844
16328B93167F8290K49862A38334f165B76902A1704M35516a5089B70527e3492C97451
16316a97588B13033r6345L54185j75145K3151k3185I4249K92476j35834I3653
$$ plain form
16390 768859 201081 455881 249892 831441 175285 193113 378599 136162 72820 237625
16380 237625 308305 244001 125942 460722 363422 295566 584963 116469 224873 215610 210811
16369 210811 532785 561414 529921 412440 106833 253942 107313 193195 76940 280472
16359 280472 527141 186402 254461 352012 308888 614152 162678 384423 164344 189706
16349 189706 547353 72712 321010 135591 145368 281492 18844 328263 85376 319490
16339 319490 337692 80168 53953 498743 250721 65180 -76282 285712 366849 435011 293167
16328 293167 68290 318152 138334 -6165 276902 11704 447220 -15089 270527 -53492 397451
16316 -197588 213033 116688 470873 295728 318879 295694 94249 386725 250891 93653
16305C97109A1188J63564a00062b9407C04282g9109B52832d1737B64327Q640A10605
16293b00363A53065O101m0516N1539o0850K49798j63998p9737J88116j11881m0073
16282A51564K12487k8657A58774d4092J4101C84065A15157a23396k89414B28677
16271A09660O9772Q3197L2626E4527J66032q150K96981E9184a05785D9151O5289
16260A14440K00124a41783j10564a15696B28444p9822b49963C37709a15522B13863
16249E8711J96221e2430E38790B54171K11004A12612J92007D6272k2549J46932
16239A70655a46684B80510M05159A4984J6146b79764C20515A31337b842A96357
16228a16905A20929J23527A01389J11204J8737h5994F3022J66239C0988K89867
$$ plain form
16305 397109 11188 174752 -100062 -29407 304282 -79109 252832 -41737 264327 272967 110605
16293 -200363 153065 159166 118650 170189 109339 359137 195139 115402 303518 191637 151564
16282 151564 364051 335394 158774 -44092 -29991 384065 115157 -123396 -412810 228677
16271 109660 179432 262629 295255 54527 220559 212409 509390 59184 -105785 49151 114440
16260 114440 314564 -141783 -252347 -115696 228444 148622 -249963 337709 -115522 213863
16249 58711 254932 -52430 538790 254171 465175 112612 304619 46272 23723 170655
16239 170655 -146684 280510 685669 14984 31130 -279764 320515 131337 -2842 196357
16228 -116905 120929 244456 101389 212593 231330 -85994 63022 229261 30988 320855
16218C20855d0932j51253C25460B0253a86515E5541c7090j81739A46093C434N4941
16207E8375j343J23701D2041K21013E0394J35815c8847l22429H807J76432B6919
16195A76099O3315a05737A70785M881K62162A44349J49255A14017b7281A44320
16184a2440q2898C36686a79513C6907L4400J70183F1593K49345b63036I7165h1857
16172e9310G0249j2417A9423J4536b14468q0188d9370j33710A06188k1465e0388
16160b3386F0363g3972I3688A4601J2338b25146f3319B63889r1360G9819J14625
16149A94444h739k23974A71935m8140N0201J35529q4787c61718B96027E7448l624
16138E3824e0814l6112F0987d05819B60938A16109e9328j55554L3282N4272B74637
$$ plain form
16218 320855 -40932 -192185 325460 20253 -186515 55541 -37090 -218829 146093 3434 58375
16207 58375 57032 180733 42041 263054 50394 186209 -38847 -361276 8807 185239 26919
16195 176099 239414 -105737 170785 175666 437828 144349 293604 114017 -27281 144320
16184 -12440 -95338 336686 -179513 36907 71307 241490 61593 310938 -263036 97165 -81857
16172 -59310 70249 57832 19423 33959 -214468 -294656 -49370 -183080 106188 84723 -50388
16160 -23386 60363 -73972 93688 14601 26939 -225146 -63319 263889 172529 79819 194444
16149 194444 -8739 -232713 171935 123795 173996 309525 224738 -361718 296027 57448 53824
16138 53824 -50814 -86926 60987 -405819 260938 116109 -59328 -214882 -181600 -127328 274637
16126B67679j17062r098a83027O8767k40002f8938A22050n5539j4181b04274R3701
16115a10573m3486e9971C18774A17426K56909a68023P3517K8682E5897d9373G0345
16103F1802K70878j63472m0510M2996G7586K49275C7783n312Q2160e240k62871
16092b68111a0716r3515d1750J9639f434m4822F89644l02889A3485c1383p6224
16081a07607L6469B57234a62317C3509a07756G0338J72525b69336N1669A31853
16070C5904e5806A93406m0633a2356A4079J14906n3591L717O5605c53456C58799
16058H4760c9829A36653c18712a29829G3054C6494g5568A84374f6501A19734C0144
16046E9760a00533m6314B17198a59983O1514H4707a95259D18999e5961A69704
$$ plain form
16126 267679 150617 141519 -183027 -114260 -354262 -68938 122050 66511 52330 -204274 -110573
16115 -110573 -154059 -59971 318774 117426 374335 -168023 -94506 -65824 55897 -49373 70345
16103 61802 332680 169208 128698 171694 77586 326861 37783 32471 114631 -5240 -268111
16092 -268111 -10716 -104231 -41750 -22111 -6434 -51256 689644 386755 13485 -31383 -107607
16081 -107607 -71138 257234 -162317 33509 -107756 70338 242863 -269336 -217667 131853
16070 35904 -55806 193406 152773 -12356 14079 128985 75394 79111 144716 -353456 358799
16058 84760 -39829 136653 -318712 -129829 73054 36494 -75568 184374 -66501 119734 30144
16046 59760 -100533 -146847 217198 -159983 -98469 84707 -195259 418999 -55961 169704
16035a00921B33247a28881N6402g791j36799C65684a87707A17922J25193b12483
16024h2125G2146d4207A01787b61034M3961J03232G8283j2429a41730B36325a88679
16012a59983a0512E7106Q6504c59600J53879A59725o0280b8942p2867l32522a54536
16000H8386a69634A572a11302h379k63719I0941e7751k47663G102a5077m0451
15989e5528j32969a6179k40021B5849J54955L40174j80335Q1317B02234J52326
15979C54560d1157A23676q696k8900d6552B95588G9356a71505D0663h3617j27527
15968b11144f5709F8751k3504J75619N2420c7953B3890r152Q8295b3164j86663
15957b09827B6089b12506J01414m2303D7503J58845G2268K06918b27138b126k57581
$$ plain form
16035 -100921 233247 -128881 -72479 -7791 -144590 365684 -187707 117922 243115 -212483
16024 -82125 72146 -44207 101787 -261034 -217073 -113841 78283 65854 -141730 236325 -188679
16012 -159983 -10512 57106 143610 -359600 -205721 159725 99445 -28942 -101809 -434331 -154536
16000 88386 -169634 1572 -111302 -8379 -272098 90941 -57751 -305414 7102 -15077 -55528
15989 -55528 -188497 -16179 -256200 25849 180804 520978 340643 421960 202234 354560
15979 354560 -41157 123676 114980 86080 -46552 295588 79356 -171505 40663 -83617 -211144
15968 -211144 -65709 68751 45247 220866 273286 -37953 23890 14738 103033 -23164 -209827
15957 -209827 26089 -212506 -111092 -153395 47503 206348 72268 279186 -227138 -2126 -259707
15946b59707E0947g1342J8973F5858a92045C91979c0287p872j81101j4790J875
15935b32175a6558k08416f4483A03446h0194l23608h1735J5382A89311f078A49580
15923A17338a10488C3626K16519I8357b2531A94527M233d3877j47704Q8142K5206
15912g8233D9395a02063p7361K8269B22692a15384C3625g0899A00943K80315b29427
15900b9717B82522a23251d1270B71298G1310c3617l00501B19193a44335k0541
15890a64876H8785b14296a5512K585j01174A19174a48984F5837b14378B60477
15879d3446n9760I6908D3357i4407A31211b99398a08639J4361B3521C436J8444
15868B1880J32523b38381a4247A3013b49303r3904A95558b96187C43072a98129
$$ plain form
15946 -259707 50947 -71342 -52369 65858 -192045 391979 -30287 -38159 -219260 -234050 -232175
15935 -232175 -16558 -224974 -64483 103446 -80194 -403802 -81735 -66353 189311 -6078 149580
15923 117338 -110488 33626 250145 98357 -22531 194527 198760 -43877 -191581 -103439 -78233
15912 -78233 49395 -102063 -179424 -151155 222692 -115384 33625 -70899 100943 381258 -229427
15900 -29717 282522 -123251 -41270 271298 71310 -33617 -334118 219193 -144335 -164876
15890 -164876 88785 -214296 -15512 -12927 -114101 119174 -148984 65837 -214378 260477
15879 -43446 -103206 96908 43357 -94407 131211 -299398 -108639 -94278 23521 3436 21880
15868 21880 154403 -238381 -14247 13013 -249303 -343207 195558 -296187 343072 -198129
15857C773a89693k2112f1851j14975A55842J61951E6080c83823a280o2066E2906
15845b98615A42859a63147r4116L54h2643j36030B14037E5139J80323c4529D1486
15833a47979L8972I7273B2764b48062B27654A6183R39g9613c7341J5027B23929
15821A12210a81597J1790A0209c99166H870a18397C670b18127c8258H3418c37944
15809f2314E0303b9868G2050c8375B09649i6833m613a1710k53136B60938A9875
15797e4415A13455C8578b76735C08202E7239b34987B05934E8777a3690p3503C5903
15785a07538n4807F6226c6011p2038C8956M414b52920o5215a28692M5834j09229
15774a92087D10480A08561L0425R5443a4285A22040C6738K4881b12520b7498A25087
$$ plain form
15857 3773 -189693 -211805 -61851 -176826 155842 317793 56080 -383823 -1280 -63346 52906
15845 -298615 142859 -163147 -257263 -256909 -82643 -218673 214037 55139 235462 -34529 41486
15833 -147979 -109007 97273 22764 -248062 227654 16183 17122 -79613 -37341 -22314 223929
15821 112210 -181597 -169807 10209 -399166 8870 -118397 3670 -218127 -38258 83418 -337944
15809 -62314 50303 -29868 72050 -38375 209649 -96833 -101446 -11710 -264846 260938 19875
15797 -54415 113455 38578 -276735 308202 57239 -234987 205934 58777 -13690 -87193 35903
15785 -107538 -162345 66226 -36011 -108049 38956 43370 -252920 -318135 -128692 -82858 -192087
15774 -192087 410480 108561 138986 234429 -14285 122040 36738 61619 -212520 -27498 125087
15762b18001G6406i4492R714o7221d5221G7941b63898A28136a49053A36138o4087
15751G2051J40839i4259C2267J38121C7011j2525Q4073H227c65397I4331e2344
15739a3559A72839f3885j22546e6978K32A30850O1453G6687K58107A26309a27254
15727c09434A13702b85736a05021h266A47277b93546B1805b29104b5127k29127
15717b54254A1965b49533r9401g1786b3224B71081a2295l43278A09724J21592
15707B31316C192O8694k1882h0049B27973D5332a73475b2109L566A91166G94K96415
15695B97209a26460c5334A03817N2429E3083A5161L8325r605a17596c0164B30743
15683A89279c27809B24680H0696C6624a20313B7195N6370c08521e1626G6742k5252
$$ plain form
15762 -218001 76406 -94492 -84778 -151999 -45221 77941 -263898 128136 -149053 136138 72051
15751 72051 212890 -94259 32267 170388 37011 24486 108559 8227 -365397 94331 -52344
15739 -13559 172839 -63885 -186431 -56978 -56746 130850 192303 76687 334794 126309 -127254
15727 -309434 113702 -285736 -105021 -8266 147277 -293546 21805 -229104 -25127 -254254
15717 -254254 11965 -249533 -348934 -71786 -23224 271081 -12295 -355573 109724 231316
15707 231316 3192 71886 50004 -80049 227973 45332 -173475 -22109 -18543 191166 794 297209
15695 297209 -126460 -35334 103817 156246 53083 15161 53486 43881 -117596 -30164 230743
15683 189279 -327809 224680 80696 36624 -120313 27195 83565 -308521 -51626 76742 51490
15672E1490f3255B16859i6167n0182A07058A0824O8828a33277F9032a48851b7962
15660d2701B94142b93635j15003B6026a59689a6763C29806g814n2166q0697M5376
15649i5301j66454A05720a81425j8628A26425j2089i3279A02500D5930b95302
15638A58767a15303B35724K5193a29566I7342O8977J07800A9794J07284K47117
15628C74195a18805H3716b68586J12060I9234N0012f4405r4584j00911A8831J92306
15617B11137a46701K7800j18224A66252d6654E229a10699l99015K45424A6913
15606H5657c43391J06618j84656a74632P883D6734J86447j05300n5259k429R8892
15595A69085f3780E2485b9208I1543J1666B6334c3591A53272l4122b54985e255
$$ plain form
15672 51490 -63255 216859 -96167 -146349 107058 10824 79652 -133277 69032 -148851 -27962
15660 -42701 294142 -293635 -408638 26026 -159689 -16763 329806 -7814 -59980 -140677 -95301
15649 -95301 -261755 105720 -181425 -200053 126425 114336 -93279 102500 45930 -295302
15638 158767 -115303 235724 260917 -129566 97342 166319 274119 19794 127078 374195
15628 374195 -118805 83716 -268586 -156526 99234 149246 -64405 -158989 -259900 18831 211137
15617 211137 -146701 -118901 -237125 166252 -46654 5229 -110699 -509714 -264290 16913
15606 85657 -343391 -236773 -421429 -174632 -166749 46734 233181 127881 72622 70193 169085
15595 169085 -63780 52485 -29208 91543 103209 26334 -33591 153272 119150 -254985 -5255
15583c07354A07950K3027D3108N8341F622d6101j87278K8111j43687I1946a48061
15571a32165b6416A16518m630m6635a37818f4987j65104A79985H6266N2454a71181
15559E24861A16123i8689e563B07500a58807k32864a46364p9560d5084k01446
15549b46530R0825A87488b91260A10155M9409P5047A0303b81789B97675a74063
15538a01690A48324c3640C6650c0869P561j3530C0865a42824O6607B20740H5173
15526g8692B17375K58771h9532J9418r4428d4089k23683C14337a39881A90745
15515B06655n469E7985b3324B98780B1246J84575H7264J86701a22847a096l00910
15504c02006B7247i2704A87123b57447H2478b5429j32227f3824G8153K38194A0133
$$ plain form
15583 -307354 107950 130977 43108 101449 6622 -46101 -233379 -205268 -348955 91946 -148061
15571 -132165 -26416 116518 111888 65253 -137818 -64987 -230091 179985 86266 138720 -171181
15559 524861 116123 -98689 -5563 207500 -158807 -391671 -146364 -225924 -45084 -246530
15549 -246530 -155705 187488 -291260 110155 159564 234611 10303 -281789 297675 -174063
15538 -101690 148324 -33640 36650 -30869 -23308 -36838 30865 -142824 -76217 220740 85173
15526 -78692 217375 476146 -89532 -70114 -164542 -44089 -267772 314337 -139881 190745
15515 206655 201186 57985 -23324 298780 21246 205821 87264 273965 -122847 -1096 -302006
15504 -302006 27247 -92704 187123 -257447 82478 -25429 -157656 -63824 78153 316347 10133
15492a91783A73298c8174A03126C1357g0009A62312c54966J54350j04607C3296
15481B77370j30425g4157k1269G393c9952B07901a01756C110g4797n319j99653
15470b79769J09678E8613a11437i264A77877D2557J54556f6468H7804l4626b94104
15458F64J67661f5006m6988D49131A10177A3341b08501I3507D3382Q7069J40226
15447B70677F2073E450b515k76829g8876l34325a71645A91956B194L73473j05393
15436B70274d02948A85263b15715B53055f0152J9826A31657P0382b50558m7729
15426b98287A4908e4126G5488L969g2667j16030B31571J74473A89032j8622b19736
15414a26263q2892D98442a28343A0425a28321G2030e2843F1042Q7906k8634b4797
$$ plain form
15492 -191783 173298 -38174 103126 31357 -70009 162312 -354966 -200616 -305223 33296
15481 277370 146945 -74157 -95426 7393 -39952 207901 -101756 3110 -74797 -80116 -279769
15470 -279769 -170091 58613 -111437 -9264 177877 42557 197113 -66468 87804 53178 -294104
15458 664 168325 -65006 -111994 449131 110177 13341 -208501 93507 43382 130451 270677
15447 270677 62073 5450 -2515 -279344 -78876 -413201 -171645 191956 2194 375667 270274
15436 270274 -402948 185263 -215715 253055 -60152 -40326 131657 202039 -250558 -298287
15426 -298287 14908 -54126 75488 79457 -72667 -188697 231571 406044 189032 170410 -219736
15414 -126263 -209155 498442 -128343 10425 -128321 72030 -52843 61042 148948 120314 -24797
15402F7428a23645h114j30789B9112d9355j57165o8772o6877N5858A06614O6012
15391A72626A6195b42133g6106B59223H8791J5183J34296B0766a85127A642K06408
15380B08050nH7418f6741E0295h7698B55417b56995E1880h2532L8844A11400J18687
15368B30087K06632f52A27347J09626e15546C24487H0944a40423C02704h1675
15357C09177e9911d205I668N8031L4163B3548b32685E129K06707J78047I2413
15345b5949B14022q4848a00379B70639H0037h4764j8977A8752Q3743i7831c6120
15333a09145q369H9475L80550A72685K2375p4602m4622J27730L0737a38925A45166
15321B77250A32174K47427a19139F3437P2594c33679A39815R7098n2760A3278
$$ plain form
15402 67428 -123645 -8114 -138903 29112 -49355 -206520 -275292 -342169 -286311 106614 172626
15391 172626 16195 -242133 -76106 259223 88791 103974 238270 20766 -185127 1642 208050
15380 208050 208045 87418 -66741 50295 -87698 255417 -256995 51880 -82532 -43688 111400 230087
15368 230087 436719 -652 127347 236973 -515546 324487 80944 -140423 302704 -81675
15357 309177 -59911 -4205 9668 67699 101862 23548 -232685 5129 211836 389883 92413
15345 -25949 214022 129174 -100379 270639 80037 -84764 -103741 18752 102495 -97831 -36120
15333 -109145 -117514 89475 470025 172685 195060 120458 75836 203566 234303 -138925 145166
15321 277250 132174 379601 -119139 63437 136031 -333679 139815 236913 184153 13278
15310a3181B34535a09270I3799N3028C1118J55334a45991a0569A06225m9072K78439
15299C35592j16522k8925c4237r3330e1362m1274A30481m706b28650D086a30270
15287A47491n9237A0996f7580D62707E7813a88199A46829Q5918A09307O7350Q1110
15276B57767n4885j488K39015A49809E0109d7678k3446B26218D9518a04310r8022
15265b02332D2696a4240B54410J64892b65608Q6134B87261D4707i4379G7372a39454
15253A42435c7271C57973a30197D42722L02175P80457L4890j81166M9804o06132
15243H22750l95377A88217o1509d4080k19623a9765B84859m8123g9791D26307
15232A15640g9512k4571K0457A59097a08889A3840N7065J05706a91528B51402
$$ plain form
15310 -13181 234535 -109270 93799 146827 31118 186452 -145991 -10569 106225 57153 335592
15299 335592 219070 190145 -34237 -127567 -51362 -92636 130481 125775 -228650 4086 -130270
15287 147491 88254 10996 -67580 462707 57813 -188199 146829 232747 109307 176657 257767
15276 257767 202882 201394 440409 149809 50109 -47678 -71124 226218 49518 -104310 -202332
15265 -202332 42696 -14240 254410 419302 -265608 -179474 287261 44707 -94379 77372 -139454
15253 142435 -37271 357973 -130197 442722 744897 1525354 1560244 1379078 1428882 822750
15243 822750 427373 188217 126708 -44080 -263703 -19765 284859 236736 -79791 426307
15232 115640 -79512 -104083 -83626 159097 -108889 13840 70905 176611 -191528 251402
15221c561E3258k628b3795B7534i6865C71044d2442j92484A40061c07257a15605
15209C90523f6927B20580b19814N5956C01501F113K32167m5149c0218l7774p0852
15198a38844C64175j40087M8670J2162a42357A24956a1032C74373A25732b6363
15187B87149F0994k1671Q3153Q685J93120a09501D82599C6731K5958j4248a62096
15175d9001a22C3L63486c0096H1992h9402A82548d7743B68350g1386A75676c3352
15162C42761d4513A04090b10789C20891h8485B02851l2690d5662C6392i9328j44893
15151b44221D56534j01787d2420a3912j25002B13131E0442a72531J8443A8384
15140c67422B27350n0917f0510N794I9723k5830h0929B48923A18467K75433A31556
$$ plain form
15221 -3561 53258 50630 -23795 27534 -96865 371044 -42442 -234926 140061 -307257 -115605
15209 390523 -66927 220580 -219814 -163858 301501 6113 238280 193131 -30218 -67992 -138844
15198 -138844 364175 224088 272758 284920 -142357 124956 -11032 374373 125732 -26363
15187 287149 60994 39323 122476 131161 324281 -109501 482599 36731 62689 48441 -162096
15175 -49001 -122 33 363519 -30096 81992 -89402 182548 -47743 268350 -71386 175676 -33352
15162 342761 -44513 104090 -210789 320891 -88485 202851 170161 -45662 36392 -99328 -244221
15151 -244221 456534 354747 -42420 -13912 -138914 213131 50442 -172531 -154088 18384
15140 -367422 227350 176433 -60510 -54716 99723 73893 -80929 248923 118467 393900 131556
15128H7703b60902B48102B3468J25131P8152d9813E8264K2815K77141E7851e248
15116c5448A18459C7414M32566b10573B44277j3503a25434e7924C49695j1509
15106C38186L58247A63491a59869A68841a21193j5162A76978p4875m0560a18827
15095A92919E2359a62933D32713j35477c5562A25360l5641o388K91119A65733
15084F3558B8759K37360g7084K5938B75826l0390J2332h4104D9331J93463a84844
15072B39867J18304m1718r5483c8446q8202A59254c0427D668P6125a17112F38407
15060A51203M1588o7391h549B19010K47954A29347E6692K55084P3572J12722a9376
15048b850I1179K74773I394J65654J23732E0430K76991I7808L9192e444B71325
$$ plain form
15128 87703 -260902 248102 23468 148599 226751 -49813 58264 81079 358220 57851 -5248
15116 -35448 118459 37414 469980 -210573 244277 230774 -125434 -57924 349695 338186
15106 338186 696433 163491 -159869 168841 -121193 -136355 176978 102103 61543 -118827
15095 192919 52359 -162933 432713 297236 -35562 125360 89719 83331 374450 165733
15084 63558 28759 266119 -77084 -51146 275826 245436 257768 -84104 49331 242794 -184844
15072 239867 358171 316453 220970 -38446 -126648 159254 -30427 4668 80793 -117112 638407
15060 151203 192791 125400 -8549 219010 466964 129347 56692 311776 385348 498070 -19376
15048 -2850 91179 365952 9394 175048 298780 50430 327421 97808 137000 -5444 271325
15036B59515J62171j12905n5636P8543j29650J2021D8526J68987K4911K0549a10568
15024B0755J50049p4130J84568C7352K17788n1532a939E98452k28357A05431B1330
15012E3953K03027D7212A1414J82083m8834L6115g753C35219n0725A36052a8897
15000A92632J51662j6227K27338a50422B60288J3939E569d1980A74683k9030J96814
14989C42467e4545A71060a4546A49706J12855b1704C92457c2210B1686R4404J07877
14978B23967A09703K54452A57649K34797A86095J15636I2042J11175J31681L39956
14968F74854B63987q0903O4656q0402E3041P7361J79709H8304D0536J75759P8928
14957B95223J4556d4127I0049L42267j79933o819I5390L34598B10623M96738j96989
$$ plain form
15036 259515 421686 308781 253145 331688 202038 214059 48526 217513 242424 262973 -110568
15024 20755 170804 96674 281242 37352 255140 203608 -1939 598452 370095 105431 21330
15012 53953 256980 47212 11414 193497 144663 180778 -7753 335219 284494 136052 -18897
15000 192632 344294 328067 555405 -150422 260288 274227 5569 -41980 174683 145653 342467
14989 342467 -54545 171060 -14546 149706 262561 -21704 392457 -32210 21686 116090 223967
14978 223967 109703 364155 157649 392446 186095 301731 92042 203217 334898 674854
14968 674854 263987 183084 247740 167338 53041 130402 310111 88304 40536 216295 295223
14957 295223 309779 -44127 90049 432316 252383 245564 95390 429988 210623 707361 510372
14946E10372A33662k9264J84440c3133H7155C638M9815N27501B38345B2611L70308
14935C92919j10408j8249L27664j63769N6750j10550n1378Q5006O277j73440J62830
14924D03652K38027A11216L53179A2299N48040A57119L34336B41111N3903a28864
14913E08448B30453p066j9081M6469N320K93645H1953N2152K61782G2991L42223
14902D15214j14795A18664J86280A15284K67527F6431M24670p4121j69598F2979
14891A80671J58403H1452L05421j68224K93975L927j07180A61735p5008J20825
14881B07552K52558K03549C07774J02217J52280A82200J57690P0535q8747K1908
14871C43586M07450B37815J72248Q1145A94164K95738L1653k33175H0559K50740
$$ plain form
14946 510372 133662 104398 288838 -33133 87155 3638 53453 580954 238345 22611 392919
14935 392919 282511 264262 591926 428157 484907 374357 322979 407985 414262 240822 403652
14924 403652 641679 111216 464395 12299 560339 157119 491455 241111 295014 -128864
14913 508448 230453 223387 204306 250775 256095 549740 81953 134105 395887 72991 415214
14902 415214 300419 118664 304944 115284 382811 66431 491101 416980 247382 62979
14891 180671 339074 81452 386873 218649 512624 516551 409371 161735 86727 207552
14881 207552 460110 663659 307774 409991 562271 182200 339890 410425 321678 343586
14871 343586 751036 237815 410063 491208 194164 489902 521555 288380 80559 331299
14861C31299O0637j47095K76438r0247O2440J04465K08921k97479J49234n8040
14851F00573m6152q2382j91488L78425j20153k04297K03140R5304e0452E78453
14840D47839R5082K544j0110B35045J32931R0660O3310J96426k57211J04526B35218
14828F39753N4673l02466j41836O1261J35334K82782k10129J53395k76731J1766
14818D07802J58998o2693R2670j88596P0076J17447k00878k2878K14519j16334
14808D70133j03044P4259j01095M36519C17711J25627Q2289J69165j6627j97444
14798D80721K93414C52776L71875j38316M16967m20809j15345L09973n2514A69947
14787C40195N06988j90135k71341I2969M90733J14063j96035L09818H9918O05423
$$ plain form
14861 331299 391936 244841 521279 431032 493472 597937 806858 509379 658613 600573
14851 600573 554421 472039 280551 658976 538823 334526 537666 632970 -50452 578453
14840 447839 542921 545465 535355 235045 367976 458636 521946 718372 461161 565687 235218
14828 639753 694426 391960 250124 311385 446719 729501 519372 672767 396036 407802
14818 407802 566800 504107 596777 408181 478257 595704 394826 371948 586467 470133
14808 470133 367089 441348 340253 776772 317711 443338 525627 694792 678165 480721
14798 480721 774135 352776 724651 586335 1003302 582493 467148 777121 724607 169947
14787 340195 847183 657048 385707 92969 583702 697765 501730 811548 89918 695341
14777F95341k74026K22521k43864J60511J16414K56786r743D51268N48185j92830
14767H06623j11772P8657R8883k13656l03787L33488k29342M39852m08401J64413
14757F54958r764R905o797J97173j5790j21477R0807r3263J09613J26076l53370
14746E88071j85536L46620k27560Q9650j86384M29597M4021k01726L1213J84428
14736I12394k27644K49117m05225K24301J87476j69677j48550L05526l6368k11162
14726F80188K56183K29431k21653M6281l21582K299L52619j9846K6246l75000
14716F55166K93716k61214P6137q0181J47757k6348k49626L25673k53244K21484
14706H49320L5305P0122k56472L38796j86836L05792l82162k21309L72330l15331
$$ plain form
14777 695341 421315 643836 399972 560483 676897 933683 923940 451268 999453 806623
14767 806623 694851 773508 872391 658735 354948 688436 459094 898946 490545 654958
14757 654958 645194 655099 648302 845475 829685 708208 799015 705752 815365 941441 588071
14746 588071 402535 749155 521595 611245 424861 854458 898479 696753 727966 912394
14736 912394 684750 933867 528642 752943 940419 770742 622192 927718 891350 680188
14726 680188 936371 1165802 944149 990430 668848 671147 1023766 1003920 1030166 655166
14716 655166 948882 687668 763805 683624 831381 805033 555407 881080 627836 849320
14706 849320 884625 954747 698275 1037071 850235 1156027 773865 552556 924886 609555
14696F09555J75424K19534j49517K21571k03981L9024j0073J65573l92271L33866
14686A008705k83981J98851J31013p6735k9807j46094J68700J86077k01617j67411
14676G87701K19482k78026M61344n23494P3829J93955L07471l31957N62698k34990
14666A238013q9443J7596j93540K20989j96731O7401K81190j99715K97062o05219
14656H37603K40125p5743J5381o8813L70459o3114m79409K26483L40345m9893
14646A293424J49314l82315q8806L7892K19186r1387K2868J98197Q1836K25097
14636A665306k91026k6359J18372N7563l86073L10456j25856j81653K03913K39868
14626A584511o05280J60526J78437J70557p2300K13157k55219J78342J94775k58172
$$ plain form
14696 609555 784979 1004513 854996 1076567 872586 911610 901537 1067110 674839 1008705
14686 1008705 724724 923575 1054588 977853 948046 801952 970652 1156729 955112 787701
14676 787701 1007183 729157 1190501 667007 740836 934791 1242262 910305 1473003 1238013
14666 1238013 1148570 1166166 972626 1193615 996884 1064285 1345475 1145760 1442822 837603
14656 837603 1077728 1001985 1017366 948553 1319012 1255898 776489 1002972 1343317 1293424
14646 1293424 1442738 1060423 971617 1009509 1228695 1137308 1160176 1358373 1440209 1665306
14636 1665306 1374280 1347921 1466293 1523856 1137783 1448239 1322383 1140730 1344643 1584511
14626 1584511 979231 1139757 1318194 1488751 1416451 1629608 1374389 1552731 1747506 1489334
14616A489334J9163P0498l83397L68311k3876J65295l425J09349k77698J63669
14606A697223k18835j53539N78528l36678L00546p27513N56638J15872j08043
14597A704199P1266J05250J60697o8345J02418k30411k2794n8762K13890l89084
14587A588324Q63792l45402j55240l5182K73460l50702J86778N3k19313K7410
14577A833978K42575j14568K01624p3152K69301o6363j13204p7431J72316j09173
14567B165903O8333J77127J1828n2939J9923P8635O26147m67296J36336J04926
14557B868923M67892l08880q6719Q14987K70384L54053R14668Q87583K398244
14548H581135M184683J0016602J5213630K285931j4378180A1212808E490421k232153
$$ plain form
14616 1489334 1508497 1578995 1195598 1563909 1540033 1705328 1701903 1811252 1533554 1697223
14606 1697223 1478388 1324849 1903377 1566699 1867245 1139732 1696370 1812242 1704199
14597 1704199 1775465 1880715 2041412 1973067 2075485 1845074 1822280 1763518 1977408 1588324
14587 1588324 2452116 2106714 1951474 1916292 2189752 1839050 2025828 2025881 1806568 1833978
14577 1833978 2076553 1961985 2163609 2090457 2359758 2293395 2180191 2102760 2275076 2165903
14567 2165903 2234236 2411363 2423191 2370252 2390175 2468810 3094957 2627661 2763997 2868923
14557 2868923 3336815 3027935 2941216 3756203 4026587 4380640 5295308 6182891 8581135
14548 8581135 12765818 22782420 37996050 40281981 25903801 11212808 5490421 3258268
14540C258268m79716k94899O2705k49813j54481K3772k26016P9784J80075K24
14530B199903K14462L15322q16202J20908L29511j2223J15405o1771p9149L21247
14520B647413k39929O0315J24743o7531J49384K1252K20677j85313L50328n61700
14510B519639L27174p2030j93792m4533M96955J36130p8860k97584K06978j83637
14500B816440K63017j71526J78072K04188K79586l58231J91984J87670l06405
14491C284795K50568l75259K30872M33100l70168j50150N55465l94448K36095
14482C700870J4395k22467P90144k82207M34414j09312m09429K26048J32018p4908
14472D199566l68736N36514j46680K23055k900J78840j43349K21028K986N1792
$$ plain form
14540 3258268 2778552 2483653 2546358 2296545 2142064 2165836 1939820 2019604 2199679 2199903
14530 2199903 2414365 2729687 1913485 2034393 2363904 2351681 2467086 2405315 2326166 2647413
14520 2647413 2407484 2467799 2592542 2525011 2674395 2695647 2916324 2731011 3081339 2519639
14510 2519639 2846813 2774783 2580991 2536458 3033413 3169543 3090683 2793099 3000077 2816440
14500 2816440 3079457 2907931 3086003 3290191 3569777 3211546 3403530 3591200 3284795
14491 3284795 3535363 3160104 3390976 3824076 3453908 3303758 3859223 3464775 3700870
14482 3700870 3715265 3492798 4282942 4000735 4435149 4325837 3916408 4142456 4274474 4199566
14472 4199566 3830830 4367344 4220664 4443719 4440819 4619659 4476310 4697338 4700324 4752116
14462D752116J60318k12133n0177J13674N16538J29101k58655L69296p26134N55684
14452E349628L87668m65312K56892j3290L59568k05288J94555j08042J50780K56150
14442F163309k87298Q4752J76508Q0420q2383O00389k52966L06109k30519K69824
14432F828145n637m893N46458k44119J31025J45590O7908Q9542J34714j52867
14422G535866K9944K53591p0751K20848O7061J37353M40214Q3694q5982O5042
14412H676880K89351p065L07733l07453Q07403j99779J18485O22807l387L72095
14402A0677070j64360j46031M74054L77742j35752Q0093J85357P5268K82675L19379
14392A2025495p0886L30565K98840J59196J42829M70165j76632P91380j61088
$$ plain form
14462 4752116 4912434 4700301 4650124 4763798 5280336 5409437 5150782 5520078 4793944 5349628
14452 5349628 5737296 5271984 5528876 5515586 5875154 5669866 5864421 5756379 5907159 6163309
14442 6163309 5876011 5960763 6137271 6217691 6135308 6735697 6482731 6788840 6558321 6828145
14432 6828145 6822508 6817615 7364073 7119954 7250979 7396569 7464477 7554019 7688733 7535866
14422 7535866 7565810 7819401 7748650 7969498 8036559 8173912 8614126 8697820 8611838 8676880
14412 8676880 8966231 8959166 9266899 8959446 9766849 9567070 9685555 10308362 10304975 10677070
14402 10677070 10512710 10366679 10840733 11218475 11082723 11162816 11348173 11423441 11706116 12025495
14392 12025495 11954609 12285174 12584014 12743210 12886039 13356204 13179572 13970952 13809864
14383A3809864K19039J66734M68699J14056P07778k5009L29604K48978K15946
14374A6255689P36616J73973M77444K54217J35685O51707J8097K53663N86969
14365A9544060M95004O62600K40197K64489N26428P21393N09183M46960N96659
14356B4006973J79853Q43890O09498P31836N21618K08295Q40431R61416N56104
14347B9459914R29416Q57120O74029P90791J059243R46685O90636R31850Q92408
14338C7232092J072704J410935P29941J342187J145242J161761J396884J642749
14330D7134495J414554J477893J714328J466665J839175J747747J986060K054120
14322F0835037J862307K462339K487473K083305K955252K473733K921878K924101
$$ plain form
14383 13809864 14028903 14195637 14664336 14778392 15486170 15461161 15790765 16039743 16255689
14374 16255689 16992305 17166278 17643722 17897939 18033624 18685331 18703428 18957091 19544060
14365 19544060 20039064 20701664 20941861 21206350 21732778 22454171 22963354 23410314 24006973
14356 24006973 24186826 25030716 25640214 26372050 26893668 27101963 27942394 28903810 29459914
14347 29459914 30389330 31246450 31920479 32711270 33770513 34717198 35407834 36339684 37232092
14338 37232092 38304796 39715731 40445672 41787859 42933101 44094862 45491746 47134495
14330 47134495 48549049 50026942 51741270 53207935 55047110 56794857 58780917 60835037
14322 60835037 62697344 65159683 67647156 69730461 72685713 75159446 78081324 81005425
14314H1005425L089258L346769L886667L671553L860423M483507M528100M549639
14306A12421341N161392N244257N589376N821012O948400O295039P267264P747190
14298A62495271Q330768Q455841R179825R681987J0199319J0880214J1597145
14291B30820370J2067916J2764554J3426045J3922695J4484565J5133750J5625384
14284C28245279J5855112J6302606J6146465J6044042J5726099J5054252J4403435
14277D37777290J2974736J1863304J0102867P298030K954984n08912k058510j523094
14269D78880695k862809q48618m646039q317628j1032464j1981946j4029007j4853960
14261D10308224j5665041j6070473j6599152j6709756j6555075j6080592j5213394
$$ plain form
14314 81005425 84094683 87441452 91328119 94999672 98860095 103343602 107871702 112421341
14306 112421341 117582733 122826990 128416366 134237378 141185778 147480817 154748081 162495271
14298 162495271 170826039 179281880 188461705 198143692 208343011 219223225 230820370
14291 230820370 242888286 255652840 269078885 283001580 297486145 312619895 328245279
14284 328245279 344100391 360402997 376549462 392593504 408319603 423373855 437777290
14277 437777290 450752026 462615330 472718197 480016227 482971211 482462299 480403789 478880695
14269 478880695 476017886 475169268 470523229 462205601 451173137 439191191 425162184 410308224
14261 410308224 394643183 378572710 361973558 345263802 328708727 312628135 297414741
14254B97414741j4347446j4041839j3788886j3101679j2230139j1315573j1167577
14247B07421602j0463547r641551q925222q268279q349187p653924p008331o931237
14239A40180324o391052n722865n463028n396342m857337n068807m191745m064562
14231I9024586m031466l596223l475953l556237l229309l086174k859509l036214
14223G2153501k481352k407881k301599k191851j904173k245505j795766j665638
14215E5159736k148178j461616j013253j802290j491411j472431j271607j309014
14207D3189936n56403j222669j495173j599893m01207j137212j118235o98959
14199C4960185o39059j671013p73466p05356o65936o55934q74756l78533j025285
$$ plain form
14254 297414741 283067295 269025456 255236570 242134891 229904752 218589179 207421602
14247 207421602 196958055 187316504 178391282 170123003 161773816 154119892 147111561 140180324
14239 140180324 133789272 128066407 122603379 117207037 112349700 107280893 103089148 99024586
14231 99024586 94993120 91396897 87920944 84364707 81135398 78049224 75189715 72153501
14223 72153501 69672149 67264268 64962669 62770818 60866645 58621140 56825374 55159736
14215 55159736 53011558 51549942 50536689 48734399 47242988 45770557 44498950 43189936
14207 43189936 42633533 41410864 39915691 38315798 37914591 36777379 35659144 34960185
14199 34960185 34321126 32650113 31876647 31171291 30505355 29849421 28974665 28596132 27570847
14190B7570847p56790m07500r00841n83013m60893j46315r17351o84046l06044
14181B2408054p01481k37356l36269o42950n84208J27051m20698j019535J62130
14172A8754738n29194k22198m00289l77513j13937l48493r04431L8749n24363
14163A5373069l901m39747O8898m79589J00799o67048q0617k69516j04963m07707
14153A3089678K7405m87560K25197l46010k34602l39043j24697o4504k52674j24238
14143A1368952l98946k18944j12792m8553j46275m23331q5046K25093o76789L3847
14133I517216l64912M04896j5520m78620L3491j29818k82906k09041R4520k62446
14123H306860K69895o17667M5815R541m36250L62419n73749J09138j74621J13541
$$ plain form
14190 27570847 26814057 26406557 25505716 24922703 24461810 24315495 23398144 22714098 22408054
14181 22408054 21706573 21469217 21132948 20489998 19905790 20032841 19612143 18592608 18754738
14172 18754738 18225544 18003346 17603057 17225544 17111607 16763114 15858683 15897432 15373069
14163 15373069 15369168 14929421 14998319 14518730 14619529 13952481 13871864 13602348 13497385 13089678
14153 13089678 13117083 12629523 12854720 12508710 12274108 11935065 11810368 11745864 11493190 11368952
14143 11368952 10970006 10751062 10638270 10589717 10443442 10020111 9935065 10160158 9483369 9517216
14133 9517216 9152304 9557200 9541680 9063060 9096551 8966733 8683827 8474786 8569306 8306860
14123 8306860 8576755 7959088 8004903 8014444 7578194 7940613 7366864 7476002 7301381 7414922
14113G414922k95621j66606J16274m5853j26679j79614o5689L46684k85740j72385
14103F539693J76468n61324J84429j32532J32664n44973L21689j87095r1658j98204
14093E639157J0684l21395M18100j76800J09606j65068k64889L7178l11745o2960
14083D911868K74910l02841K51666n63120K62854l62460M39006J97048o29460
14074D479471K05240j49275R9891j84167J59982l36935p758j27664n3231K85761
14064D371315k24233N9068L3942o6788j76646J55415K68708l77176l45375O10956
14054D309186k63617k6218l8299j8887n25767K58946r2958o9871L7259l8629k22899
14043C308246k7086K24780k86488k32421J29602j70139M50350k63182M3135j87080
$$ plain form
14113 7414922 7119301 6952695 7068969 7023116 6896437 6716823 6651134 6997818 6712078 6539693
14103 6539693 6716161 6154837 6339266 6206734 6339398 5794425 6116114 5929019 5837361 5639157
14093 5639157 5649841 5328446 5746546 5569746 5679352 5514284 5249395 5286573 4974828 4911868
14083 4911868 5186778 4883937 5135603 4572483 4835337 4472877 4911883 5108931 4479471
14074 4479471 4684711 4535436 4635327 4451160 4611142 4274207 4266449 4138785 4085554 4371315
14064 4371315 4147082 4206150 4240092 4173304 3996658 4152073 4420781 4043605 3698230 4309186
14054 4309186 4045569 4019351 3981052 3962165 3436398 3695344 3602386 3532515 3569774 3531145 3308246
14043 3308246 3281160 3505940 3219452 2987031 3116633 2946494 3396844 3133662 3176797 2989717
14033B989717L15110J43360M3385l63935O0695j81880j59614J51170k06391j12357
14023B679260L29526l03617n9858j86139K36767J60218m8341j95080k47561M7901
14013B413076L77660o01724J45036k4667r4900j80800J39975m2744j17845Q63157
14003B876224n95294J32189P4373m08052J7608k35665K64335L6532K6453n7975
13993B130728j25741M0558L07392P62681J871005K991535Q534835J5953999P416670
13984C9883662j0869677j4286649n879813k563833j527125m16992o64947n72430
13976C102196P7175M01369q84108q1761K68991j86013j89798j06499J73972L2829
13966B608353l72294N9792j82771R5724l49778N33437m73119Q634K05617L58193
$$ plain form
14033 2989717 3304827 3448187 3491572 3127637 3188332 3006452 2846838 2998008 2791617 2679260
14023 2679260 3008786 2705169 2645311 2459172 2695939 2856157 2807816 2612736 2365175 2413076
14013 2413076 2790736 2189012 2334048 2309381 2214481 2033681 2173656 2130912 2013067 2876224
14003 2876224 2280930 2413119 2487492 2079440 2097048 1861383 2125718 2162250 2188703 2130728
13993 2130728 2004987 2045545 2352937 3115618 4986623 7978158 16512993 32466992 39883662
13984 39883662 29013985 14727336 8847523 6283690 4756565 4339573 3674626 3102196
13976 3102196 3179371 3580740 2696632 2614871 2883862 2697849 2508051 2401552 2575524 2608353
13966 2608353 2236059 2295851 2113080 2208804 1859026 2392463 1919344 1927978 2133595 2491788
13956B491788m65774o9943m117R0011o3673k5141k8881J53401J10563K70172n32741
13945A925665n3535j36724j7312L38612L3380j90065j50369M35802j99583l64957
13935A620914J01490m11900L83005J8380k40369j39640M66597l53655P9589L47599
13925A872010k44305L29589m04914L2789q645n0009K23802J0113n0533r7757K81823
13914A893963m22761J49293k03249l1855J01733r2072o3888L59602k54883j3738
13904A422145j83048K64240N7166j29735J1829m01599J92761L37117j52929n3470
13894A364477l9464L53779Q7396n48325J15295j65380J98111k1267k83150n6713
13884A004759J30238K53127l78236O2872l2900K10738l4922r3694j93234L90962
$$ plain form
13956 2491788 2026014 1956071 1951954 2041965 1978292 1953151 1924270 2077671 2188234 2458406 1925665
13945 1925665 1872130 1735406 1718094 2056706 2090086 1900021 1749652 2185454 1985871 1620914
13935 1620914 1722404 1310504 1693509 1711889 1471520 1331880 1798477 1444822 1524411 1872010
13925 1872010 1627705 1957294 1552380 1585169 1576524 1526515 1750317 1760430 1709897 1612140 1893963
13914 1893963 1471202 1620495 1417246 1385391 1487124 1395052 1331164 1690766 1435883 1422145
13904 1422145 1239097 1503337 1560503 1430768 1442597 1040998 1233759 1570876 1417947 1364477
13894 1364477 1325013 1678792 1766188 1217863 1333158 1167778 1365889 1344622 1061472 1004759
13884 1004759 1134997 1388124 1009888 1072760 1039860 1250598 1215676 1121982 928748 1319710
13874A319710j65750L18643l45961M5656o8665K22454q1742J00400l3010j5406
13864A296329j58804k41331N59269n80913M07550k48631j7041k37632N86297l8
13854A365055k92352o9550p7984K88739p7925k88916J06547k38512K95639j09602
13844I01139j16559L95168l00045k73J4254K11491L43128l88140l63370k3655
13834F73138K40459k82693K90883l04202Q9395K61128r9252J83956J45224m6640
13824A151396l04618N408j62692J18656L03097n26024O57317k82349j99212P3542
13814H34521N2794j71439L48387k80439j2556J4885J21003P9248j68280j06130
13804G11994j2960L21698m25378L50595J21258K29950n52776J2202k73028M41167
$$ plain form
13874 1319710 1153960 1472603 1126642 1172298 1103633 1326087 1244345 1344745 1311735 1296329
13864 1296329 1137525 896194 1455463 874550 1282100 1033469 1016428 778796 1365093 1365055
13854 1365055 1072703 1003153 925169 1213908 1135983 847067 953614 715102 1010741 901139
13844 901139 784580 1179748 879703 879430 893684 1105175 1448303 1060163 696793 673138
13834 673138 913597 630904 921787 617585 706980 968108 868856 1052812 1198036 1151396
13824 1151396 846778 852186 689494 808150 1111247 585223 1242540 960191 760979 834521
13814 834521 887315 715876 1064263 783824 771268 786153 907156 986404 818124 711994
13804 711994 699034 1020732 595354 945949 1067207 1297157 744381 756583 483555 924722
13794I24722j07797L43533n12403J29587C09374L37585K25903J10795D34870M45144
13784H80014k27292J62642k6102k39793J34980K26184j08202k38333L47577C89958
13773A026825o3163m31260P008j8508k20061O14707m50334N3740k21979N00204
13763G97179j69515j14430l3754N0839K49559J40365k68229L536L4426k27454
13753D62522K02345L62123m51163j07179K58604J1860k61997K92464j59687j52726
13743D57166J87054j50704M5552n0264K1712j08992J55917N4025L3862P138N6473
13732G08939C05234L29651N4679J52114l08139k10599L95763K59167M3539m79832
13722E41577L26191l94855J84890j11008j76057J92813K25069j53512l0182l1647
$$ plain form
13794 924722 816925 1160458 648055 777642 309374 646959 872862 983657 434870 880014
13784 880014 652722 815364 789262 549469 684449 910633 802431 564098 911675 389958
13773 1026825 963662 532402 539410 520902 300841 915548 465214 518954 296975 797179
13763 797179 627664 513234 479480 530319 779878 920243 652014 655550 689976 462522
13753 462522 664867 1026990 575827 468648 727252 739112 477115 769579 609892 457166
13743 457166 644220 493516 539068 488804 510516 401524 557441 611466 645328 652466 708939
13732 708939 305234 634885 689564 841678 533539 322940 718703 977870 1021409 541577
13722 541577 867768 472913 657803 546795 370738 563551 788620 635108 604926 573279
13712E73279M3570j15038l429O2269M9641j42598A71381K48035J95346k91757
13702C23005J06684j68763K20490J45228j05790n8304m2173J88931J014A64483
13691E24895J46171o0417A97450M82967m0090k48493K89209B37621L46911o1819
13681E22713A90036J68190j35956o5371M7581L36908J83823p1794j95216m6928
13671D11273K08173k51317L95632D0807L54746j07135K14857L1476B48898R3602
13661C42500J69757Q5970J2313A45676m4669O06333j34994k34303P1749M19076
13651H28868l77034j96251L74948C03677j23443J11559J17578L1277k00191N8672
13641B99129N1345L0867K03642B54033A00315L56888r486j77307J96399M9951
$$ plain form
13712 573279 616849 501811 498382 560651 610292 467694 171381 419416 614762 323005
13702 323005 429689 260926 481416 626644 520854 462550 420377 609308 610322 164483
13691 524895 671066 610649 197450 680417 640327 391834 681043 237621 584532 522713
13681 522713 190036 358226 222270 156899 204480 541388 725211 653417 458201 411273
13671 411273 619446 368129 763761 40807 395553 288418 503275 534751 248898 342500
13661 342500 512257 598227 610540 145676 101007 707340 572346 338043 409792 828868
13651 828868 451834 255583 630531 303677 180234 291793 409371 440648 240457 299129
13641 299129 350474 381341 584983 254033 100315 457203 447717 270410 466809 516760
13631E16760n3304j1930n8399A49426L39816k975o8315K39689p805k05513Q4714
13620E29037I4768K10020K94712B39944J85838l4561A94955O15458B38064J95298
13610D33362K04924C08946b1387G99575l38463k28913J49824J09543j59012r2455
13600B40099J06983J23969j77882K80881H1026K55285m5974Q8994p4407A50638
13589B76355r5338L15224A38989N7046L8211J69179K91637B90858R3286J50110
13579E34254A07930D7725K51206K23281k31554p2232F2828J81814J16896J10292
13569D71830j54453J5913N0541N0464P6888j22847N7099P9507j31946l6584A66252
13557B38734L10112j98179K21838A71086L54699j60673M0989F5980J97380J36014
$$ plain form
13631 516760 463456 451526 393127 149426 489242 486267 417952 657641 649836 444323 529037
13620 529037 94768 304788 599500 239944 425782 391221 194955 810413 238064 433362
13610 433362 638286 308946 -21387 799575 461112 232199 382023 491566 332554 240099
13600 240099 347082 471051 293169 574050 81026 336311 290337 379331 304924 150638
13589 276355 181017 496241 138989 196035 234246 403425 695062 290858 384144 534254
13579 534254 107930 47725 298931 522212 290658 218426 62828 244642 361538 471830
13569 471830 317377 333290 383831 434295 511183 388336 445435 524942 392996 356412 166252
13557 238734 548846 350667 572505 171086 525785 365112 406101 65980 263360 399374
13547C99374j31986L21047k89713j08704N10483k63359k357j64416O01139m04025
13537D67483o7089I2717K04320n7118q6523l8964K19657K73261k17048j40606
13527B49696A00364O32302A74436L28991B4492J25458M08204G6633d9286C0609
13516A89594L93384j39160D1305J76667K48533A86116I2133K40525A28591R5149
13506B23740r0162C8035L60076j92712J54094Q4138j18611G4298J63720K48968
13496D86986A20000J37662J15461H1791J55649L51166I6163P4758K35506o7309
13486C39118p0891q796C3116K48586j8498R9404F1314J42863K8915p4302L89628
13475E48418B47094j2702j2883a93809A87291k2912o942J71329G863L42798j75069
$$ plain form
13547 399374 267388 588435 298722 190018 700501 437142 434785 270369 871508 467483
13537 467483 400394 92717 297037 239919 153396 114432 334089 607350 390302 249696
13527 249696 100364 732666 174436 503427 24492 149950 558154 76633 -49286 30609
13516 189594 582978 443818 41305 217972 466505 186116 92133 332658 128591 223740
13506 223740 133578 38035 398111 205399 359493 443631 325020 74298 238018 486986
13496 486986 120000 257662 373123 81791 237440 588606 96163 170921 406427 339118
13486 339118 268227 259431 33116 281702 263204 362608 61314 204177 233092 158790 548418
13475 548418 247094 234392 221509 -193809 187291 164379 157437 328766 7863 350661 175592
13464A75592J04313J686J3984q612K08879k25303k9333J7870J95400A19253B0396
13452D11317j82604J27516A71247J69502H64L72791j35299J07748a4847k16380
13442b31227j17952A08176D9497f4188A7229M12942A93365G3601a93989e3150
13431A99691a24589C15105J33142f7405F2317O8342L01067n0800m624E1113O9315
13420A20428J86767d7066A04729b05631C88883j75561a85287A36814K49268j67972
13410B18110j05334K56675A14380P5342J52350H4397K99610F090L79616A86593
13399C39077k2088f7747D63784m6141G317b26165B1903J04920J45763r187o8122
13388A95277i9293F07675B65950N0729h6805m1248C15975L3352A04229d8026B17047
$$ plain form
13464 175592 279905 281591 295575 286963 495842 270539 241206 259076 454476 119253 20396
13452 411317 228713 356229 171247 340749 864 373655 238356 346104 -14847 -231227
13442 -231227 -349179 108176 49497 -64188 17229 430171 193365 73601 -193989 -53150
13431 199691 -124589 315105 448247 -67405 62317 130659 431726 380926 376302 51113 120428
13420 120428 307195 -47066 104729 -205631 388883 213322 -185287 136814 386082 218110
13410 218110 112776 369451 114380 189722 342072 84397 384007 6090 385706 186593
13399 339077 316989 -67747 463784 417643 7317 -226165 21903 126823 272586 263399 195277
13388 195277 -99293 607675 265950 316679 -86805 -128053 315975 349327 104229 -48026 217047
13376F60209A33429K16454j49752K41969q0434i6170D82230B02723A8353L21171
13366C39524P9992M1806o9284j47392Q0175A59329J58974m582b55230B99577K17091
13355E16668d0058B78755I3531c2921C32608m0121p6366J96375h181A57521a11128
13343b1714C62089A15631J30639n519f2475A51494c1481C26222J09649A2182J58068
13332A70250b8226D29419I6897J15810K48759j32327A2266K82782A45601J54009
13322B99610a26547B42280a01884D69978F6164K18370o1396f1831A67071D4047
13311a71687H6002J5039a4861C09149l181m6280L6023b38487A77896N9995E7481
13299B73813j20734K01851A0194R0110J20141q959p0399d9173A18106R4605m5122
$$ plain form
13376 660209 133429 349883 200131 442100 361666 -96170 482230 202723 18353 339524
13366 339524 419516 461322 392038 244646 324821 159329 318303 313721 -255230 299577 516668
13355 516668 -40058 278755 93531 -32921 332608 292487 216121 412496 -8181 157521 -111128
13343 -21714 362089 115631 246270 240751 -62475 151494 -31481 326222 435871 12182 170250
13332 170250 -28226 429419 96897 212707 461466 329139 12266 295048 145601 299610
13322 299610 -126547 242280 -101884 469978 66164 284534 223138 -61831 167071 44047
13311 -171687 86002 101041 -14861 309149 305968 259688 295711 -238487 177896 237891 57481
13299 273813 153079 354930 10194 100304 220445 211486 141087 -49173 118106 212711 167589
13288A67589N3424m8267J08377f3353C31176j58897p6464M9873K0398B2444K83931
13277C06375L3635A09476A2068K78505C4757J66565J1932K05892f1608A08524
13266B76223j31581A6686a16588I7264d12293L8565Q7188B44829C609M8418K69042
13255C21069L9307I064L1329K30931A26849d456E1349i5582C3323J28886a03868
13243E5280c3529C75351B8018a54082A21205e5211B73262e3767A59425d09311
13232e6648n5914d54p9685A8839P6301a5298B14690a1814A79855a4067B5602P5287
13220A00889O9503P4870E5801M7986A9877L3867j1772h6988B06467L824k8018
13209A82273J47267a63705c2502m9431D7661j4953K03105j6497K2277J24455a25605
$$ plain form
13288 167589 221013 172746 281123 -63353 331176 172279 95815 145688 166086 22444 306375
13277 306375 340010 109476 12068 290573 34757 201322 213254 419146 -61608 108524
13266 276223 144642 16686 -116588 97264 -412293 -373728 -286540 244829 3609 52027 321069
13255 321069 360376 9064 40393 271324 126849 -4456 51349 -95582 33323 162209 -103868
13243 55280 -33529 375351 28018 -154082 121205 -55211 273262 -53767 159425 -409311
13232 -56648 -112562 -454 -80139 18839 95140 -15298 214690 -11814 179855 -14067 25602 100889
13220 100889 170392 245262 55801 103787 19877 53744 41972 -86988 206467 210291 182273
13209 182273 329540 -163705 -32502 -81933 47661 32708 235813 219316 241593 366048 -125605
13197h5692m2113A42093j783a86241B61125J9242M5482r2250P797D2317O1228
13186A03545L569J94417c849G2595b3840j31831B46449c6659D43268f8432A107
13174A81765b07400D4724a75147L9882C80843g6396j59199B66082A4886K58706
13164B73592a569A72185C7187J95281r2577L7411G4311b32745f868A70330o8745
13153A01585a05856C00027k0528A08743a0873j71404c3170H1826L3798K30436
13143C46060n7789c60227i9887k8637j0197a8647j94280j79768F4110J91307a64108
13131B15053p6228I663P2489h8338A22842K52059C7085i2049H8320J72077k9949
13120B30448a30355d8831B25958K0950j08660i8393d7084A138a4956k08210G9078
$$ plain form
13197 -85692 -127805 142093 140310 -186241 261125 280367 325849 233599 241396 42317 103545
13186 103545 107114 301531 -3849 72595 -23840 -155671 246449 -36659 443268 -68432 1107
13174 181765 -207400 44724 -175147 -135265 380843 -76396 -235595 266082 14886 273592
13164 273592 -1569 172185 37187 232468 139891 177302 74311 -232745 -6868 170330 101585
13153 101585 -105856 300027 279499 108743 -10873 -182277 -33170 81826 115624 346060
13143 346060 288271 -360227 -99887 -128524 -138721 -18647 -212927 -392695 64110 255417 -164108
13131 215053 138825 9663 82152 -88338 122842 374901 37085 -92049 88320 260397 230448
13120 230448 -130355 -48831 225958 246908 138248 -98393 -47084 1138 -14956 -223166 79078
13108A22200J25541H5644b56714d0421A57704M4307b31808h602o0860B33317A12245
13096B8121K48856A02908b29875A61121m0056K07981b55817B5152h9641B83559
13085B44933m2878H3495K17393J47427A98620b21273G1808Q2194b07333c0821
13074B96802h5851B51568G2538K57956a28860A1345J08305A6537O8085M56958
13064E41580c3667A64878J42937P6544a05671j2590e2762R353L511A87308c02789
13052A02274B8546K19176q0471f0951G2306a57159A24267b3763B0430Q8336K78791
13041C87557G6300P755O9951a65622d2414E6073e6567A50489a59882A06343a32287
13029a81462A65725O5335b76577c8078E1722a02682A75113D9749J44624q4015
$$ plain form
13108 122200 247741 85644 -256714 -40421 157704 202011 -231808 -8602 -69462 233317 112245
13096 28121 276977 102908 -229875 161121 121065 329046 -255817 25152 -89641 283559
13085 244933 202055 83495 300888 448315 198620 -221273 71808 154002 -207333 -30821
13074 296802 -85851 251568 72538 330494 -128860 11345 119650 16537 84622 541580
13064 541580 -33667 164878 307815 384359 -105671 -118261 -52762 -43409 -39898 187308 -302789
13052 102274 28546 247722 167251 -60951 72306 -157159 124267 -23763 20430 108766 387557
13041 387557 76300 84055 154006 -165622 -42414 56073 -56567 150489 -159882 106343 -132287
13029 -181462 165725 231060 -276577 -38078 51722 -102682 175113 49749 194373 110358
13019A10358a55858A17053n5347d0047A19358K20404j24339a6074I5186K7830
13009A23016K82146A56900A1982M13796a6797D4773K32224A38408M385J07435
12999B50228o6020b48432B8771O2667a13722A97920J51961f9634n1584K8124B03235
12987a39179k14663B5391k942O4672e2305C35607A58052b52371A51247a55896
12976g4342B37124j4674j07059M0306M3101a05836C3769J79454b6797A99195m2174
12965A57021c0379k35259D3700c08373C77084A05200g9191E9032L53918H2147
12954G0907i1149B28084E0323D723b2367D3153b54522A13546f3692A55299F4523
12942B23971Q3543H2973b06433J0629C87290a02333E2543J95535A03382m3931
$$ plain form
13019 110358 -155858 117053 61706 -40047 119358 339762 215423 -16074 95186 123016
13009 123016 405162 156900 11982 425778 -16797 44773 276997 138408 142793 250228
12999 250228 184208 -248432 28771 91438 -113722 197920 349881 -69634 -121218 -93094 203235
12987 -139179 -353842 25391 22449 87121 -52305 335607 158052 -252371 151247 -155896
12976 -74342 237124 222450 115391 155697 198798 -105836 33769 213223 -26797 199195 157021
12965 157021 -30379 -265638 43700 -308373 377084 105200 -79191 59032 412950 82147
12954 70907 -91149 228084 50323 4723 -22367 43153 -254522 113546 -63692 155299 64523
12942 223971 307514 82973 -206433 -195804 387290 -102333 52543 248078 103382 59451
12932E9451L5825a23427A2562P0168g052j15105k3860o4052B7718a8113j51557
12921a69670d6344j36196B34734C8752J08758B6805b56158A4980K16921C1498
12910H8563A7389J26107e9611B85552a00893A44274L6680m5806F1648L07894K0990
12899C90532j57641f271j02669c2459A58347a0298E2992J76617a99957I5274k13
12888I5061L2134N1087D9338e5573j00820B60596a01387A31076e9539j63720E7510
12876i5372j82327R5228H3814r329a09195o1929g875A51108a04243J1629A14114
12864A72623o6281e3635H3129K62785A34905D9567c60411J01665D6058J5065b8254
12852a3305j14547A18769R7835A2915g1837A04363e25327K57884J11355D4073
$$ plain form
12932 59451 95276 -123427 12562 82730 -7052 -122157 -146017 -210069 27718 -18113 -169670
12921 -169670 -46344 -182540 234734 38752 147510 26805 -256158 14980 231901 31498
12910 88563 17389 143496 -59611 285552 -100893 144274 180954 135148 61648 369542 390532
12899 390532 232891 -6271 -108940 -32459 158347 -10298 52992 229609 -199957 95274 95061
12888 95061 127195 178282 49338 -55573 -156393 260596 -101387 131076 -59539 -223259 57510
12876 -95372 -277699 -182471 83814 74485 -109195 -171124 -7875 151108 -104243 -92614 114114
12864 172623 106342 -53635 83129 345914 134905 49567 -360411 -258746 46058 61123 -28254
12852 -13305 -127852 118769 216604 12915 -71837 104363 -525327 -267443 -156088 44073
12841F05943E0492M7157K16532A04046h4770B44797b4724C906e6815B27357C6593
12829B57179h8017C25003B9591e19367A2390a79742C5200c32726A1840f4584m2844
12818a07428M3549F683K0595d6052j38384g9262l35471i5113H6300b43904C31374
12806A00273m2351J41396a85640G9783l4808a70153B41432k7723b83719A12400
12795C29636B7792a39051a8305j98637A20890a96069c245G4405B2851c79281J05683
12784b73598K3980c435j64871A81213a41843j39180O1642j7946a12959A27826
12773H0507M2571P3547E3578a47994C5480a62749j91427A78180a590B29313j04982
12762A24331j557M6065n3763f1683j15888D7672j1198J1661b5685B61094C1726
$$ plain form
12841 605943 50492 97649 314181 104046 -84770 244797 -24724 3906 -56815 227357 36593
12829 257179 -88017 325003 29591 -519367 12390 -179742 35200 -332726 11840 -64584 -107428
12818 -107428 -63879 6683 27278 -46052 -184436 -79262 -414733 -95113 86300 -243904 331374
12806 100273 57922 199318 -185640 79783 44975 -170153 241432 213709 -283719 112400
12795 329636 27792 -139051 -18305 -216942 120890 -196069 -3245 74405 22851 -379281 -273598
12784 -273598 -249618 -3435 -168306 181213 -141843 -281023 -219381 -237327 -112959 127826
12773 80507 123078 196625 53578 -147994 35480 -162749 -354176 178180 -1590 229313 124331
12762 124331 122774 168839 115076 -61683 -177571 47672 36474 48135 -25685 261094 31726
12750b30283C5496c16334B55141a81915l1938C07889G8435a10323a5412e050p7220
12739h2270A98950g8183A53701G6821K01965d5010D30751A16929n864l6555J23018
12728A97528f3150C8645J8857M99090j75423a30224A64388n9007J27908F8193
12717C1962L24567j42087H3112b55432h7710H9020R6132c0081A71341P4904A17480
12705A45858a85976e2084B39396C6160J88493p199l4706f3589j34664g5749B0325
12693b5955m9117d554C17741g3179C941J01127g4164H6061K5750N7844a11712
12681B7107J51890o6829I537J38044J6589K74043A78055b33319D6112A6215i3313
12669A04227a87854E7073N8621Q4409h7324o5715e0700C28795A11297L62116j86379
$$ plain form
12750 -230283 35496 -316334 255141 -181915 -213853 307889 78435 -110323 -15412 -5050 -82270
12739 -82270 198950 -78183 153701 76821 278786 -45010 430751 116929 111065 74510 197528
12728 197528 -63150 38645 57502 556592 381169 -130224 164388 105381 233289 68193
12717 31962 356529 214442 83112 -255432 -87710 89020 185152 -30081 171341 246245 117480
12705 145858 -185976 -52084 239396 36160 224653 217454 182748 -63589 -198253 -75749 20325
12693 -25955 -75072 -4554 317741 -73179 3941 105068 -74164 86061 111811 169655 -111712
12681 27107 178997 112168 9537 147581 164170 438213 178055 -233319 46112 16215 -93313
12669 104227 -187854 57073 115694 200103 -87324 -153039 -50700 328795 111297 473413 287034
12658B87034I4802j5433J9832J15580I8102k0498B1002K72010a29887C04402I5752
12646A96595D9170d83492E6945K4295B1207L31846a40996B62574G5911e5058D2833
12634h6096b3648A95553a30401B7478M97364k58715J02881d2839j6787B57101
12623A17158R6054K75785A07367a18344L3707J0719C63102j00466c25264f7436
12612i9299M5217j94925I5684J18542f4701A12333J66218b08964A04855J41889
12602B46744B3275b52465C89875E9909d0570B15336q8559k5215g3143L2062C91601
12590A65042i8318K0066E5976J36224D0596a91069A5901K06133C618f9961K2304
12579d7657G64b4213M236G6225b70918b445j9248I3552O6374K994j4527J14650
$$ plain form
12658 287034 94802 79369 99201 214781 98102 77604 21002 293012 -129887 304402 95752
12646 196595 49170 -483492 56945 81240 21207 353053 -140996 262574 75911 -55058 42833
12634 -86096 -23648 195553 -130401 27478 524842 266127 369008 -42839 -59626 257101
12623 117158 213212 488997 107367 -118344 -84637 -73918 363102 262636 -325264 -67436
12612 -99299 -54082 -249007 95684 214226 -64701 112333 278551 -208964 104855 246744
12602 246744 23275 -252465 389875 59909 -40570 215336 126777 101562 -73143 -41081 391601
12590 165042 -98318 -78252 55976 192200 40596 -191069 15901 222034 3618 -69961 -47657
12579 -47657 764 -24213 -19977 76225 -270918 -2445 -21693 93552 159926 162920 148393 263043
12567B63043H709a03192D1302N5223G089N5511N5027k4170a09700C6074d2727
12555B43100e1092C74878A38274R6302i6018k08339N2002A57182o7560K63401
12545C53023m9075a76191A20009B9348d5639n286A55323a67144b3312H8011B3501
12533B5532E201b08556A04247b3762a0566m3753K1473j27175G2039B7036K17098
12522B44134j02954I511a21728C01652P2000b94666a3360B70562a30257L9709
12512i0548g454A7179J13618b06706J8538O2005D4554P877J16804O0033p1436
12501A57832i6627k5612E3405d661C17867a56989d6478l5703A70362C1176Q0381
12490A11557a19353A03652l2409a18623B09749P5409f1550B89248a2690k38833
$$ plain form
12567 263043 8709 -103192 41302 96525 7089 62600 117627 93457 -109700 36074 -42727
12555 243100 -51092 374878 138274 234576 -96018 -304357 -252355 157182 89622 353023
12545 353023 303948 -176191 120009 29348 -45639 -50925 155323 -167144 -23312 88011 23501
12533 25532 5201 -208556 104247 -23762 -10566 -54319 -32846 -160021 72039 27036 244134
12522 244134 141180 9511 -121728 301652 373652 -294666 -13360 270562 -130257 -90548
12512 -90548 -7454 17179 130797 -206706 -188168 -126163 44554 52431 169235 229268 157832
12501 157832 -96627 -122239 53405 -4661 317867 -156989 -46478 -82181 170362 31176 111557
12490 111557 -119353 103652 71243 -118623 209749 285158 -61550 289248 -12690 -251523
12480b51523b207A97475b06291m9654A25284B3015a47667p1747A22954H502b72170
12468B59148D9009N2095J25507c08980A35619m834i9438L6764I9036a71246A53115
12456a10388F581O9420r529f6226o9907j27090b0326H323b3974l67694J34538
12445b57130A51578a75277L6264E571Q2591J42639f847l9749d574l94n3427A01810
12432a35655j89212A0509J61387p8377b28419R3952c3016o8482B78607c6249n5525
12421i1774D8620C821K23462c17489a3804A2893O6003J50685b04335j57561C1511
12409b91610E9519P327o401a83673H1852a75554L7979G1093b39629A97548a30209
12397e5489A99689a81512h2913q4225f1330A40919a0254B8228c3915A84855B2375
$$ plain form
12480 -251523 -2207 197475 -206291 -255945 125284 23015 -147667 -219414 122954 8502 -272170
12468 259148 49009 101104 226611 -308980 135619 130785 -99438 -62674 99036 -171246 153115
12456 -110388 6581 76001 66472 -66226 -136133 -263223 -20326 8323 -23974 -391668 -257130
12445 -257130 151578 -175277 -139013 5571 88162 230801 -6847 -46596 -4574 -4968 -58395 101810
12432 -135655 -324867 10509 171896 93519 -228419 -134467 -33016 -101498 278607 -36249 -91774
12421 -91774 48620 3821 227283 -317489 -13804 12893 78896 229581 -204335 -361896 31511
12409 -291610 59519 66846 60445 -183673 81852 -175554 -137575 71093 -239629 197548 -130209
12397 -55489 199689 -181512 -82913 -167138 -61330 140919 -10254 28228 -33915 184855 22375
12385h5052K082A38310a36716A70105H391K18791F2961O146a51017f8551A32884
12373a79927f019j43943A64282D645a3505d754j1633l38652A63869P7043a26792
12361d7504j23100A31251E9125a061r631j82549C06473a27156H4810A0800a75495
12349a2162B43619a04946k18247d7953j47622P6204B7515a85470a7728C6075b4542
12337a24288A05948k3126b45355A53217i6810l1729k3284d4172A92625B5354K63733
12326B89087a01806A82681q0767l0917b28102A17782M0801j0470m5024a49559
12315B61194A25303J65461e4772K6531A98380a68620I5854I13a56277b4995A20345
12303A91148h470m4739j12814C3359i6077j83776N0502A37688K65271A21052c70271
$$ plain form
12385 -85052 -82970 138310 -136716 170105 8391 227182 62961 69107 -151017 -68551 132884
12373 -179927 -6019 -149962 164282 4645 -13505 -4754 -16387 -355039 163869 240912 -126792
12361 -47504 -170604 131251 59125 -1061 -10692 -193241 306473 -127156 84810 10800 -175495
12349 -12162 243619 -104946 -323193 -47953 -195575 -119371 27515 -185470 -17728 36075 -24542
12337 -124288 105948 82822 -245355 153217 -96810 -128539 -151823 -44172 192625 25354 289087
12326 289087 -101806 182681 101914 70997 -228102 117782 158583 148113 103089 -149559
12315 261194 125303 290764 -54772 -28241 198380 -168620 95854 913 -156277 -24995 120345
12303 191148 -8470 -53209 -166023 33359 -96077 -279853 -229351 137688 402959 121052 -370271
12291a00056A45818g4592A26226J50499A23111b61531A31532Q669a24032R912
12281a14120A24441A7969J91409i9420A45127J46973F0224K8030c3383B94742
12270a89443C79034A79478J04585Q4714a96333d5519A78619n2864n5547l2461
12260C7747K18965o3466h9910B24189B4760e9210B24050a8600k55245A4237J12261
12249A26498L3040J40254L9964R9631j36413A44315K6811o8924d4595l7316K3938
12238e7973q0532d8361A94513A2364M6919b00876g9432B67331c51594B51968k5747
12227B26221K23150k14786L062L22885f032m1019D34927A51737M35302A4306K17384
12216B31690j3717p5109c03083B60842F6221L87140b76131B05529K42817B00781
$$ plain form
12291 -100056 145818 -74592 126226 276725 123111 -261531 131532 140201 -124032 -114120
12281 -114120 124441 17969 209378 -99420 145127 292100 60224 88254 -33383 294742
12270 -189443 379034 179478 284063 368777 -196333 -45519 178619 125755 70208 37747
12260 37747 256712 193246 -89910 224189 24760 -59210 224050 -18600 -273845 14237 126498
12249 126498 159538 299792 339756 439387 302974 144315 171126 102202 -44595 -81911 -57973
12238 -57973 -138505 -48361 194513 12364 59283 -200876 -79432 267331 -351594 251968 226221
12227 226221 449371 234585 237647 560532 -6032 -47051 434927 151737 587039 14306 231690
12216 231690 217973 142864 -303083 260842 66221 453361 -276131 205529 448346 200781
12205A69845l0986F5070J87372d4660C04318g4216A41966L58534j75611h4102
12194H0468N7844M9452q245p8305b71513D89445j18345b2932A43919c7340D97409
12182B7522J78927o4695L91806B51072G0818N1398J17997k5355H0871e43p8454
12171g8997C63072j05334p2478G2802f7148A56J76655E7550f3466G4497L8839
12160A13336K01344r1399e498m4163m9173m6065H9313L36411j51643F3195J6879
12149H0074P375a6457l71223B43323l1168h3444A62243b77484g7700j06518C30178
12137B44598Q8487A18009D6205J22576c13493a24022D8409a869G8764l2645N4890
12126A01009O5649o5227J7731J8240j9866c25383A42878a32214c6465B04431e5152
$$ plain form
12205 169845 138859 65070 252442 -44660 304318 -74216 141966 500500 324889 -84102
12194 80468 138312 187764 179519 101214 -271513 489445 371100 -22932 143919 -37340 497409
12182 27522 206449 141754 533560 251072 70818 122216 240213 214858 80871 -543 -78997
12171 -78997 363072 257738 185260 72802 -67148 156 176811 57550 -63466 74497 113336
12160 113336 314680 223281 -5498 -49661 -98834 -144899 89313 425724 274081 63195 80074
12149 80074 87449 -16457 -387680 243323 212155 -83444 162243 -277484 -77700 -184218 330178
12137 244598 333085 118009 46205 168781 -313493 -124022 48409 -1869 78764 46119 101009
12126 101009 166658 101431 119162 137402 117536 -325383 142878 -132214 -36465 204431 -55152
12114g1951c873j38366M5137j60101g9506C9740a05090D68994b786G2518d4572
12102E4716c62637J71065B92509a75397j46577A16882A710N8411a01109j47272
12092b48381A01679K3781I026K08832G8701k2004b78436B9703K70291a81333g2885
12080C44175A5379a35764J9065M1075F2070J69482H746g1105B22816R1833O79653
12069I94302O14085l83558E41224j92319A38271M37325k56226c2403A19944a839
12058b22467B72887a81689C54423a31735K3689I6294J3083c7614q2183M1197r3015
12047a71615a3357A43005a21925j64248a36390L0864A61637K77375C001c4929
12036B026R711c98752c9568j59815A74304G945d9059k1530B19594b11130c5642
$$ plain form
12114 -71951 -3873 -142239 -97102 -257203 -79506 39740 -105090 468994 -2786 72518 -44572
12102 54716 -362637 -191572 292509 -175397 -321974 116882 1710 60121 -101109 -248381
12092 -248381 101679 125460 9026 217858 78701 56697 -278436 29703 299994 -181333 -72885
12080 344175 15379 -135764 -116699 -75624 62070 231552 8746 -71105 222816 314649 994302
12069 994302 1608387 1224829 541224 348905 138271 575596 319370 -32403 119944 -1839
12058 -222467 272887 -181689 354423 -131735 -108046 96294 109377 -37614 -119797 -78600 -171615
12047 -171615 -13357 143005 -121925 -286173 -136390 -105526 161637 439012 3001 -34929
12036 2026 11737 -398752 -39568 -199383 174304 7945 -49059 -70589 219594 -211130 -35642
12024d3775A48655R5491r4758c25195l6208a29135B08323G7229b61583A67296
12013c4430j59125D7868a48831O3509D5061O5559a19637E3264b9840A57371d62580
12001g2911o8489j1372A3620K02587F9317K6899D054a82098B20942i7699k5169
11990a22868j03152A02419a61807J5863B01946a14115H4251a47261A8765b28306
11979E9732K6478R8617G9791b59765c3730k4009A13177J14989o4024O4211a37754
11967C8554J5234M4495b04844m0103B59484F6642a00742B08921c9367B13253r4544
11956A18709n6175c2410A18020g8457A48135n9066i2799j44418C53448C9485J33981
11945A73466G2644K85566A68846C3744p29f1150D6015h1701j51212h3127c8737
$$ plain form
12024 -43775 148655 244146 149388 -325195 -361403 -129135 208323 77229 -261583 167296
12013 -34430 -193555 47868 -148831 -85322 45061 110620 -119637 53264 -29840 157371 -462580
12001 -72911 -141400 -152772 13620 216207 69317 96216 4054 -182098 220942 -97699 -122868
11990 -122868 -226020 102419 -161807 -145944 201946 -114115 84251 -147261 18765 -228306
11979 59732 86210 184827 79791 -259765 -33730 -57739 113177 228166 164142 228353 -137754
11967 38554 53788 98283 -204844 -244947 259484 66642 -100742 208921 -39367 213253 118709
11956 118709 62534 -32410 118020 -78457 148135 89069 -92799 -237217 353448 39485 173466
11945 173466 72644 358210 168846 33744 33015 -61150 46015 -81701 -232913 -83127 -38737
11933A3869O4590a27396L1593j8950k3505C62227A54967a75332g5212l5082C4710
11921g9305j34558d4367J69k0091A9642c0531A39841D1323R7651k4577P4261d20164
11908C0295J43036o8419d9343q6106C98019A42456a12529E0938H988a27865E3620
11896b58053C9475J43569h8257q5594J2548l0178e3873n3162A82841C1749K37311
11885B69060a42994j75655j92694E2640a66277A17687e4891F7329P7598n0222
11875I4705b49455f3514m51123J43666a73988K0912c5195I1177b00344j64639
11865c64983N5969a45757A01196i954k00131e1477j7667j79178A16399b99083
11854A68216b04764E9337N1971f3652o1357D4724b57974G3719h993j21466A30957
$$ plain form
11933 13869 78459 -127396 -95803 -114753 -138258 362227 154967 -175332 -75212 -110294 34710
11921 -79305 -213863 -44367 -44198 -64289 19642 -30531 139841 41323 138974 114397 188658 -420164
11908 30295 173331 104912 -49343 -135449 398019 142456 -112529 50938 8988 -127865 53620
11896 -258053 39475 183044 -88257 -173851 -161303 -191481 -53873 -107035 182841 31749 269060
11885 269060 -142994 -318649 -511343 52640 -166277 117687 -54891 67329 144927 94705
11875 94705 -249455 -63514 -514637 -370971 -173988 -153076 -35195 91177 -200344 -364983
11865 -364983 -309014 -145757 101196 -9954 -210085 -51477 -69144 -248322 116399 -299083
11854 168216 -204764 59337 111308 -63652 -125009 44724 -257974 73719 -8993 -130459 130957
11842B14967b09416c3113k14094A20970K13662a38266C48334a50244e3140j64852
11832b17992A27712a92681h3675B7389a15692H0275a08773r0896C6961a93743
11821A29914h2323J717b5144H4237P7013a60549o7087f2809k03009I2491k2335
11810G0156b99227C11496b1568l44397g1835j24508A1464N637c2734j39615H8228
11798d8128E2596M63181b0965k49448B514J0112K2435h1338q7348c1370A44429
11786b82239I9054b44514J20256m2858I1498b9003D1865a79752A39164b80712
11775b32196g6348j6062j15457E6870b7191o2131k36312L0611a21295F3127a55010
11763a28360C5282b86535a7038D46571B1197J609J8666J66411b78853F4932M9493
$$ plain form
11842 214967 -209416 -33113 -247207 120970 334632 -138266 348334 -150244 -53140 -217992
11832 -217992 127712 -192681 -83675 27389 -115692 80275 -108773 -199669 36961 -193743
11821 129914 -82323 -80606 -25144 84237 161250 -160549 -227636 -62809 -265818 92491 70156
11810 70156 -299227 311496 -21568 -365965 -71835 -196343 11464 17101 -32734 -172349 88228
11798 -48128 52596 515777 -20965 -270413 2514 12626 35061 -81338 -168686 -31370 144429
11786 -282239 99054 -244514 -124258 -167116 91498 -29003 41865 -179752 139164 -280712
11775 -232196 -76348 -92410 -207867 56870 -27191 -89322 -325634 -295023 -121295 63127 -155010
11763 -128360 35282 -286535 -17038 446571 21197 22806 41472 207883 -278853 64932 114425
11752A14425b10388L5073M4398J727J4931A71666D487i2282A53531n5689a85388
11740d4475m7213k3425k57243a45826j7850B47511H1132b04334i9924A01754D4390
11728a17420R222E9292c5101A84262A5563O5180a46165M0550A04625b05985A07779
11716e681G6996e6451d572m300B3717b56706D9470a62459H3119J41045a37009
11704A72059b66800D06040A82577q0155a12053k74342B33569F7730K1453J58521
11694B47704a47231B66607f6221C10641A41899d0425B34227A14553d55014H8693
11683e1376F59498C00632h040k04445H8481L55520h8786B95981A1707a57616P1062
11672h6554k7763B16478b8707A4078L8071P2706a8417k1362C61836j36348a51046
$$ plain form
11752 114425 -210388 -175315 -130917 -129190 -114259 171666 4487 -92282 153531 97842 -185388
11740 -44475 -91688 -115113 -372356 -145826 -163676 247511 81132 -204334 -99924 101754 44390
11728 -117420 -108198 59292 -35101 184262 15563 80743 -146165 -105615 104625 -205985 107779
11716 -5681 76996 -56451 -4572 -8872 23717 -256706 49470 -162459 83119 224164 -137009
11704 172059 -266800 406040 182577 102422 -112053 -386395 233569 67730 89183 247704
11694 247704 -147231 266607 -66221 310641 141899 -40425 234227 114553 -455014 88693
11683 -51376 659498 300632 -8040 -212485 88481 444001 -88786 295981 11707 -157616 -86554
11672 -86554 -114317 216478 -28707 14078 52149 124855 -18417 -39779 361836 225488 -151046
11660B9359b5936j0801C13497G9309K6785J32777A19393K04680a9899g523F1805
11648C70605b57214e5269j37786C2070d00272Q9849g5187k0565E553i4601B41747
11636E9201c9735A35089D8667a36549B589P9245J53802a05934C32829j35653b22828
11624c0872G9076k7945j6882e3448C5951Q0431A9459J8277J48967a41294E6034
11612A02683f4387B35252J11947A40496a7571j09671b4387n05144C64022f3301
11601e9037J9120k62138c2170n7897B40514o0506M4780F6770e9958A2624L0317
11590D2941M3409l2013P7598N3802a56191f958A98457a2192E842J99593a78805
11578A06533K62851A84547k5313a79933A73620D1835O9178O5484h0349B89035
$$ plain form
11660 29359 -25936 -36737 313497 79309 106094 238871 119393 324073 -19899 -7523 61805
11648 370605 -257214 -55269 -193055 32070 -400272 -310423 -75187 -95752 5553 -94601 241747
11636 59201 -39735 135089 48667 -136549 2589 81834 235636 -105934 332829 197176 -222828
11624 -30872 79076 51131 34249 -53448 35951 116382 19459 37736 186703 -141294 56034
11612 102683 -64387 235252 347199 140496 -17571 -127242 -24387 -529531 364022 -63301
11601 -59037 -39917 -302055 -32170 -90067 240514 180008 224788 66770 -59958 12624 42941
11590 42941 86350 54337 131935 185737 -156191 -6958 198457 -12192 5842 205435 -178805
11578 106533 369384 184547 159234 -179933 173620 41835 111013 176497 -80349 289035
11567C49067k4824K0110k7480k8280o6498G9344a98303G9284b73105R2751B3613
11555A4342b85396B09131i1786A05148f6684C66430b47652G2496J16553c34491
11544A42097J17427o6474j612A966a64034g0849E74893a51913C72510A69241G5952
11532H4425c4904A1271M65136a15254A01478j1529R4806A9687J70047P3715E3015
11520D030a6282k71785D08127A40037D8986J44866i8322a047B17540J67857l0730
11509C54667I7319J58693j494a19005C07319L600f4500o6227C20963k1631a65104
11497d0732r5571d8243G9639K23528a00958J5799c6496D96549k17877b28325B90163
11485B33821J99644a3125A98015M5068q6718K13548C8868K44871j32527K19361
$$ plain form
11567 349067 324243 344353 316873 288593 222095 79344 -198303 79284 -273105 -180354 23613
11555 14342 -285396 209131 -91786 105148 -66684 366430 -247652 72496 189049 -334491
11544 142097 259524 193050 191438 1966 -164034 -70849 574893 -151913 372510 169241 75952
11532 84425 -34904 11271 476407 -115254 101478 89949 184755 19687 189734 263449 53015
11520 4030 -16282 -288067 408127 140037 48986 193852 -98322 -1047 217540 385397 354667
11509 354667 97319 256012 254518 -119005 307319 310919 -64500 -130727 320963 299332 -165104
11497 -40732 -136303 -48243 79639 303167 -100958 -85159 -36496 496549 278672 -228325 290163
11485 233821 433465 -13125 198015 243083 156365 369913 38868 283739 151212 370573
11475C70573j76294I486J22757g8961B58353p0599J61164A22009a95070A15559
11464a32529B03451a3597q7676b9768p0005a8619B02605j9614b02473B51120L3622
11453B84742b9514A6901b23909B35232O00g1630A70116e5974B75235p9056Q0507
11442B76686b78163F1750b16422A06241m3027L18736j03596p4294L1840e8949
11431A34294j7716n597K7768m9195g6707j52979a9973n9765b8016J900A71887
11419a7429A62014A1210a24717r453d9674B1241b06154B11840p7607C2092q53
11408C1239b8081D8653c5618B45782l4671d9901E5970J52106o9339m4503b9465
11396h0534A42953a2037B9793M48981A21246g6854j3406k6653J2361B8311d4484
$$ plain form
11475 370573 194279 9486 132243 -78961 258353 187754 348918 122009 -195070 115559
11464 -132529 203451 -13597 -101273 -29768 -99773 -18619 202605 182991 -202473 251120 284742
11453 284742 -29514 16901 -223909 235232 235832 -71630 170116 -55974 275235 196179 276686
11442 276686 -278163 61750 -216422 106241 63214 381950 278354 204060 235900 -58949
11431 134294 116578 110981 138749 89554 -76707 -229686 -19973 -79738 -28016 -26116 171887
11419 -17429 162014 11210 -124717 -134170 -49674 21241 -206154 211840 134233 32092 31239
11408 31239 -28081 48653 -35618 245782 211111 -49901 55970 208076 138737 94234 -29465
11396 -80534 142953 -12037 29793 478774 121246 -76854 -90260 -116913 -104552 28311 -44484
11384f27952C4042e6723B88631a92925o5970D16426p5832A49074l8738J65697
11374B76033d4942A19644K6592p851a5888j1785B66685a36450I7247a19714j20314
11363b40028H5421C6155g1397n7815j16060J0839Q4592K4355q3733B8358b4800
11351b80135A80184F8596k5189e7385A18395b5506p9385C89421f0q4426a916j86698
11339a88614B118J59097a43649C36716F6593B5972Q4883e6895j4175j57929B51189
11327D1319b84397C20976o758C1590h1333G1212c17018I1512a78190B52304R3050
11316C45354H8594b0592k03632b8756D371K18911b48949i9837A38498j7233a39229
11304f6111j66950l01361J70734a78912P4897b3801j24915G8347K28188a76994
$$ plain form
11384 -627952 34042 -56723 288631 -192925 -258895 416426 340594 149074 110336 276033
11374 276033 -44942 119644 146236 138385 -15888 -27673 266685 -136450 97247 -119714 -240028
11363 -240028 85421 36155 -71397 -129212 -245272 -234433 -149841 -125486 -209219 28358 -24800
11351 -280135 180184 68596 43407 -57385 118395 -25506 -104891 389421 -60 -84486 -1916 -188614
11339 -188614 2118 161215 -143649 336716 66593 25972 110855 -56895 -71070 -228999 251189
11327 41319 -284397 320976 314218 31590 -81333 71212 -317018 91512 -178190 252304 345354
11316 345354 88594 -20592 -224224 -28756 4371 223282 -248949 -99837 138498 121265 -139229
11304 -66111 -233061 -534422 -363688 -178912 -104015 -23801 -148716 78347 306535 -176994
11293a22899k1083D6051a99906I1187d3526j41127B18044j00469b98851k1522
11283c20373F920a52033B21586M4620a29670A08316b72998g9810m60244a59456
11272a05882d847k00016d5513D3414a54596B75378g7297n7660k69554l3809d6910
11260h6645B72191a2256B46885b29819F8142b84104A80561J16109f9201o3610
11250a32811B56412G4202a47888b2019l17971a32683j11751h6810c7374l3335
11240g0709j53995A86364H8266a7288n2504k7745A55026a13264F5030k3148J52587
11229A94469B3942b26047A84571b2350j14536A14265e3666b2350j36569K3428
11219a35491O2973C29700g759r283B76211G7625i4369n4544d278A71809j5471
$$ plain form
11293 -122899 -143982 46051 -199906 91187 -43526 -184653 218044 117575 -298851 -320373
11283 -320373 6920 -152033 221586 266206 -129670 108316 -272998 -79810 -540054 -159456
11272 -105882 -4847 -204863 -45513 43414 -154596 275378 -77297 -134957 -404511 -438320 -46910
11260 -86645 272191 -12256 246885 -229819 68142 -284104 180561 296670 -69201 -132811
11250 -132811 256412 74202 -147888 -22019 -339990 -132683 -244434 -86810 -37374 -70709
11240 -70709 -224704 186364 88266 -17288 -69792 -97537 155026 -113264 65030 41882 194469
11229 194469 23942 -226047 184571 -22350 -136886 114265 -53666 -22350 -158919 -135491
11219 -135491 -72518 329700 -7759 -17042 276211 77625 -94369 -148913 -4278 171809 156338
11208A56338f3775G9038j2383b09790G2355f7565G3116a96889A31842K5184a30755
11196c45771K3000a03464A45939b77110H4340a86470A5902b82983p305A11539
11185A46301c01826J22187A87705m989j9493J28619a45320F818e4736j10147L4861
11174a30022I3760a98796n2702G893K8970c74318A58699F3609M5K94319I247J29467
11162A38714D1269g7036j36996A3928K55415p3809a87277M1205L8333A37051i1482
11150B16323b4748G4174a1829C3634c8557C01444a83289A03614R9611r6431d684
11138B01612q3415E2781K7019a19484B67611j11323d0342A82718B8609E184J74576
11127A79760a12555A54325C5992J72727m2220a03948d2582B96073b70549m6182
$$ plain form
11208 156338 -63775 79038 66655 -209790 72355 -67565 73116 -196889 131842 157026 -130755
11196 -345771 -322771 -103464 145939 -277110 84340 -186470 15902 -282983 -290288 111539
11185 146301 -301826 -179639 187705 182716 163223 291842 -145320 6818 -54736 -164883 -130022
11174 -130022 93760 -198796 -251498 7893 36863 -374318 158699 63609 63654 357973 9247 138714
11162 138714 41269 -77036 -214032 13928 269343 195534 -187277 -146072 -107739 137051 -91482
11150 216323 -24748 74174 -11829 33634 -38557 301444 -183289 103614 203225 106794 -4684
11138 201612 118197 52781 79800 -119484 267611 156288 -40342 182718 28609 5184 179760
11127 179760 -112555 154325 35992 208719 166499 -103948 -42582 296073 -270549 -316731
11117c16731f8196G0142a29124A02393l9298Q6763f4205C23645b4824C49499q2085
11106B67414j12606M43928B39870J17633H077K37694j08156Q618o7439d7613B9778
11094B85044L8913A18066n0195P0952P773M1814p3044a34175C52228o2681H4606
11082C21674A07771M11660A13836N32403k83963L7410j92069j2337O3012M15147
11072F73439l05443q6669L6942q8357K41052J86210k92942Q8661A96673K82521
11062D79194J06005J79027j94016r3327J5802l9664N2975K3623L16483k27771
11052F18331j3260O1020M8522J95996k19397J27792j18637p6175l5475L14062
11042I02779j67298K24474k79421K10140j47179l01764M55439m43686L53950r6897
$$ plain form
11117 -316731 -68196 70142 -129124 102393 63095 149858 -64205 323645 -24824 349499 267414
11106 267414 154808 598736 239870 357503 8077 245771 137615 146233 78794 -47613 29778
11094 285044 323957 118066 67871 138823 146596 188410 115366 -134175 352228 289547 84606
11082 321674 107771 519431 113836 646239 362276 399686 207617 195280 258292 673439
11072 673439 367996 281327 318269 229912 470964 657174 364232 452893 196673 479194
11062 479194 585199 764226 570210 476883 492685 453021 505996 529619 846102 618331
11052 618331 605071 666091 714613 910609 691212 819004 700367 624192 588717 902779
11042 902779 735481 959955 680534 890674 743495 441731 897170 453484 807434 710537
11032G10537l2553R3753j43243K19910R2813k32324L08966J01492k23208j40094
11022G56049Q7548J55373l45845L73617D23949L69577j04891j72049K12409j43303
11012E85692J62618k92076J84924J39024C64811K81628K37609C93786l9443K42355
11002E96698Q9096K48642l52859J76470B92355M55585Q8495k35719M10389O2606
10992A073711k44718j37046O0021J23754q3085O2266M95915K938m12215K67639
10982A209180j52844n7095M90308K37460m16654Q0815M37657P52862K3180L75831
10972B980700K8776L4522k57589K3026j38394o90073p1395K4686K44682m5854
10962B133087J18416l22106L52059O074l59414J93743r2423l58938k7484l25584
$$ plain form
11032 710537 677984 771737 628494 848404 941217 708893 1017859 1119351 896143 756049
11022 756049 843597 998970 653125 1026742 423949 793526 688635 516586 728995 585692
11012 585692 748310 456234 641158 780182 364811 646439 884048 393786 354343 596698
11002 596698 685794 934436 581577 758047 292355 747940 836435 600716 1011105 1073711
10992 1073711 828993 691947 751968 875722 792637 854903 1350818 1353756 941541 1209180
10982 1209180 1056336 999241 1489549 1727009 1310355 1391170 1828827 2581689 2604869 2980700
10972 2980700 3009476 3043998 2786409 2809435 2671041 1980968 1909573 1934259 2178941 2133087
10962 2133087 2251503 1929397 2281456 2287530 1928116 2121859 2029436 1670498 1643014 1317430
10952A317430l95124O7314j75716j36602j62948p5813N5824A05483J34620P3684
10942C13787o2821K05580A89503N03F8230N13611B29627n1298Q8502f8896E61798
10930F3093J09082p9734K64727A72882M2651a28071O2694H7113b81002C13354
10919C91177b36515A26877K5213E6034r244c5204k1571A30784c17613a62k9090
10908b9252A16652M1093G174a91953A03664P0868E0926k4136b19480h7220B35430
10896B27463q3091h9086J809R683j42852P4755f0015C4549b12146h7920A30240
10884F5697h5590B4548L10737a7619B3763h6935A65664K14353A19308I076J0004
10873A9080a31045e8974n568a2729k28166B88293n5036E79a63550E34508k20362
$$ plain form
10952 1317430 922306 989620 813904 677302 514354 438541 494365 105483 240103 313787
10942 313787 250966 456546 189503 190006 68230 581841 229627 178329 266831 -68896 561798
10930 63093 172175 92441 357168 172882 215533 -128071 -65377 87113 -281002 313354
10919 391177 -236515 126877 152090 56034 46790 -35204 -56775 130784 -317613 -162 -29252
10908 -29252 116652 157745 7174 -191953 103664 174532 50926 26790 -219480 -87220 235430
10896 227463 144372 -89086 -87277 -77594 -220446 -145691 -60015 34549 -212146 -87920 130240
10884 65697 -85590 24548 335285 -17619 23763 -86935 165664 380017 119308 9076 19080
10873 19080 -131045 -58974 -64542 -12729 -240895 288293 233257 579 -163550 534508 314146
10862C14146j53069c6207H2578J19631e3392J562k02191B57964c43952a21793
10851C90727A11683c68839b2074o9557a5820E3936M5814B6110A0219d4059l62906
10840d06965e5034A354J76920a14971p6896B5792J40266C3823a6259k53564K7362
10829b42461B04499C6017J1408N8470b01707i2665A73513m6868J63871E3733b03193
10817i1354m31431D03903a54556I9411L30685d7858p2569A37319a45378A78804
10806i6589m3303h278l40677F8959b07707g3730A49435I846O0467b48934L5847
10795b13087k0767A10785b53514Q7859A24541f8934j776A32672Q2210a00776L3782
10784f6994A39931D4553b21962M2617M8289E0585K95832A33499A9728K14169A834
$$ plain form
10862 314146 161077 -36207 82578 202209 -53392 -51830 -254021 257964 -343952 -121793
10851 390727 111683 -368839 -22074 -91631 -15820 53936 99750 26110 10219 -44059 -406965
10840 -406965 -55034 1354 178274 -114971 -191867 25792 166058 33823 -16259 -269823 -242461
10829 -242461 204499 36017 47425 105895 -201707 -92665 173513 126645 290516 53733 -203193
10817 -91354 -522785 403903 -154556 99411 430096 -47858 -120427 137319 -145378 178804
10806 -96589 -139892 -8278 -348955 68959 -207707 -73730 149435 9846 70313 -248934 -213087
10795 -213087 -233854 110785 -253514 -165655 124541 -68934 -70710 132672 214882 -100776 -66994
10784 -66994 139931 44553 -221962 -179345 -131056 50585 346417 133499 19728 233897 1834
10772B4918C611M48297f2312m7312B0575d8586F3732a36826j90530A81806b2196
10760C44691A04922m1227b18640f4496k04289B07600F9864a55903C63773a6909
10749b938A50798e302j78376G471P9150i5617j26958a05607C50863b52277H2082
10737g2328K5128q1467A60180G0263c99559e1922j04834r1089E3239J69712e0961
10725a33761M7287k9026k45388A40606a74464a5808E8247d9721m6548c2703r4432
10714a27135I5801b68096h0142l68219h4413p4103B14691c7457n037A64729b2926
10702a062k1118I8899K6744B7340d7775j47081O9991k33418D516d13777B1197
10690c22949e9581j94717g9996j24431R8594D1189a85643G4312B5794h7763A1174
$$ plain form
10772 24918 3611 451908 -62312 -109624 20575 -48586 63732 -136826 -327356 181806 -22196
10760 344691 104922 63695 -218640 -64496 -268785 207600 69864 -155903 363773 -16909
10749 -2938 150798 -5302 -183678 7471 86621 -95617 -222575 -105607 350863 -252277 82082
10737 -72328 -47200 -128667 160180 70263 -399559 -51922 -156756 -247845 53239 222951 -50961
10725 -133761 -86474 -115500 -360888 140606 -174464 -15808 58247 -49721 -96269 -32703 -127135
10714 -127135 95801 -268096 -80142 -448361 -84413 -158516 214691 -37457 -42494 164729 -22926
10702 -1062 -22180 98899 125643 27340 -47775 -194856 -124865 -358283 4516 -413777 21197
10690 -322949 -59581 -254298 -79996 -204427 -105833 41189 -185643 74312 25794 -87763 11174
10678A39785k3885J07525c38924B6153K41256f8505a5215j33578B48587D4335
10667a47966A42441b39455g8558L0419j92456A98850d805n7934k11224F6282b65746
10655a07225j79462J37709d2175n5814k18304g0774A30132d89611J61348j1983
10645c40246a64502j76832D6949J56509A5136f6182o4200F8583c52720B42164
10634E332a85358C3327a20364L5506c5604m5537I2452J85926e9647C89i2793q5136
10622a77929B5257P0908k7269J8285Q2659C9930c74927J72132c1293j85717D9091
10610f9849B21076i9302L8703m85260b10331I7810a34505A44200l0240i6264l72931
10599d69195K33783j56762a36194p79A56664c11151i7052M8300l9793J9341A5016
$$ plain form
10678 139785 115900 223425 -338924 26153 267409 -68505 -15215 -148793 248587 44335
10667 -147966 142441 -239455 -78558 -48139 -240595 198850 -4805 -62739 -273963 66282 -265746
10655 -107225 -286687 -148978 -42175 -97989 -316293 -70774 130132 -489611 -328263 -340246
10645 -340246 -164502 -341334 46949 203458 15136 -66182 -130382 68583 -352720 242164
10634 5332 -185358 33327 -120364 -84858 -35604 -81141 92452 278378 -59647 389 -92793 -177929
10622 -177929 25257 96165 68896 87181 169840 39930 -374927 -202795 -31293 -217010 49091
10610 -69849 221076 -99302 -60599 -545859 -210331 97810 -134505 144200 113960 -96264 -469195
10599 -469195 -235412 -392174 -136194 -136973 156664 -311151 -97052 -48752 -88545 -69204 15016
10587A9937b22776i3881A02346l6209a78791p9089a7062A09250g317j26386Q233
10576a25470j59125P5879a5258A72556E0766F957e6599m6331n5288f8322n1253
10565a19575E8433j8003J35723b04202O1122K8949k9620A89195A95N0456b05213
10553a51263l1544B6566O2027a5704r2069b1982A01516O9878b12896O062j15884
10542c22718J04250A24422a60103A36626A9598J67490b81930B69057F8094b94116
10531b7830B87114b921l08863g6686A09176i9586k04366A23266J7458b6804I335
10519b45749b2596B79424h7944F3733i4789n3861F2852d7567A64978M085a27856
10507d25467B59421H3533J2050M4854a12227A05356f5918B8525a38719A05691
$$ plain form
10587 19937 -222776 -93881 102346 66137 -178791 -257880 -17062 109250 -7317 -133703 -125470
10576 -125470 -284595 -208716 -15258 172556 50766 6957 -56599 -102930 -158218 -68322 -119575
10565 -119575 58433 40430 176153 -204202 -143080 -114131 -143751 189195 195 50651 -205213
10553 -151263 -182807 26566 88593 -15704 -107773 -21982 101516 171394 -212896 -206834 -322718
10542 -322718 -218468 124422 -160103 136626 19598 187088 -281930 269057 68094 -294116
10531 -27830 287114 -2921 -311784 -76686 109176 -99586 -303952 123266 140724 -26804 9335
10519 -245749 -22596 279424 -87944 63733 -94789 -148650 62852 -47567 164978 169063 -127856
10507 -425467 259421 83533 95583 140437 -112227 105356 -65918 28525 -138719 105691
10496I0132f0715C2042a47152r7616a5949l28386Q780i8309E9242a93433D92096
10484c3586l3915A72357q2730K10193n5919J44391A11044J27687E1388d9977B1730
10472B20176j10011N1035a2225j24862J4647B4641b1479A46831c53622J75129
10462a78493j1386A00281g2361d438j41566m4892A97525d4451C7609j1705a9960
10450C16822A41941b36829B4104e3483A71575a26597E3540L17109B2047Q0546
10440A02593J52403G4377M2090h1565B02305E3618j6487d1840C5487d7057r02
10429d7959j27141I3763c5363m1645l5220r5042R391H2723P2754b54856B60070
10417B62031a00227B65004a93413G3272j9250J11040e6190q4896B77036r334a76002
$$ plain form
10496 90132 -60715 32042 -147152 -244768 -15949 -344335 -335555 -98309 59242 -193433 492096
10484 -33586 -67501 172357 89627 299820 243901 388292 111044 238731 51388 -49977 21730
10472 220176 110165 161200 -12225 -137087 -122440 24641 -21479 146831 -353622 -178493
10462 -178493 -189879 100281 -72361 -4438 -146004 -190896 197525 -44451 37609 25904 -19960
10450 316822 141941 -236829 24104 -53483 171575 -126597 53540 370649 22047 102593
10440 102593 254996 74377 116467 -81565 202305 53618 37131 -41840 35487 -47057 -47959
10429 -47959 -175100 93763 -35363 -77008 -112228 -207270 -197879 82723 155477 -254856 260070
10417 262031 -100227 265004 -193413 73272 54022 165062 -56190 -141086 277036 267702 -176002
10405a67858p7962A51139b67358J32105A60299a81851j1899j28066A62087N4078
10395B16165L31742B5682c3272B03005K33999A55346b24817F6476J52040Q9938
10385C08454b702j70886A62952c25603g5812B32285J10982l893A47798K10493
10375C58291A32360J02082o0149B2762O643K42466j3667K3129L86819j2976O8538
10364G23714k19676j6017K09346k70441l1768j05942J52786A58709K03026j13608
10354B48127K98368k69054Q3204r4845J93633r0240J46806H0254J38153J25584
10344C43991J62776R899K10157A36524O7697K29755l7718l5907A4861g2673B22013
10332G6110J68599J14765j44963A01284L1735l6564i7830r7969h9669o8850D3825
$$ plain form
10405 -167858 -245820 151139 -267358 -135253 160299 -181851 -193750 -321816 162087 216165
10395 216165 547907 25682 -33272 203005 437004 155346 -224817 66476 218516 308454
10385 308454 -2702 -173588 162952 -325603 -75812 232285 343267 339374 147798 358291
10375 358291 132360 234442 174293 22762 29405 271871 258204 281333 668152 655176 723714
10364 723714 504038 488021 697367 426926 395158 289216 442002 158709 361735 248127
10354 248127 546495 277441 360645 265800 459433 369193 515999 80254 218407 343991
10344 343991 506767 516666 726823 136524 204221 433976 396258 360351 14861 -72673 222013
10332 76110 244709 359474 214511 101284 133019 96455 -97830 -195799 -89669 -158519 43825
10320B3064L00210d9130B29989O4944h1355C3392b6673k43630N3884A23012b05444
10308a47060a7336B93902i8075k1832j78180J09383a2226k25306a6052m4297j59797
10297b20146F1743b19735D0978g9477H4416c02912a16268p101J908k007g113A16334
10284B70797c56420J25447c4037C14834b439B11816J83797C1324b06517B39320
10273C4170K18287j23683J07616b10477C34946l1383E9979M4221f6953A49292
10262A49516J92742N1225Q0947j28521o9013M46019A85768D0027J26562B6261
10251b3603H3878g2742B42567a40858f6D69852a29907A6291c7541C30554A62106
10239A3966e91945a69976A18583m4748c1394A11479J98618c5422j2604B80776
$$ plain form
10320 23064 323274 -49130 229989 294933 -81355 33392 -26673 -270303 -216419 123012 -205444
10308 -147060 -17336 293902 -98075 -119907 -298087 -188704 -12226 -237532 -16052 -60349 -220146
10297 -220146 61743 -219735 40978 -79477 84416 -302912 -116268 -123369 -121461 -123468 -7113 116334
10284 270797 -356420 -230973 -34037 314834 -2439 211816 395613 31324 -206517 239320
10273 34170 252457 128774 236390 -210477 334946 303563 59979 104200 -66953 149292
10262 149516 342258 393483 474430 345909 276896 722915 185768 40027 166589 26261
10251 -23603 83878 -72742 242567 -140858 -66 469852 -129907 16291 -37541 330554 162106
10239 13966 -591945 -169976 118583 73835 -31394 111479 310097 -35422 -48026 280776
10228c6274j58790j24118k5224a04076j17412A12545a65876C6494A2707h2560
10217a01939j76319p9619a5647j33174H3335a93721o4129P8805C25115h3110B64458
10205a70405D53244f3459l27193J70409A78235J3027b90396I3794a38077m4122
10195a82199e0949D1796b71395M4202L9585B43074d40260d761j16407M9768b9785
10183i7552L5050j73664b9875r4574A09230d1625r3572c1646k70969k722C1063
10171d44489h9285E9850J20131a02960l3714M7029F36f8937k07009A77557q4079
10160I3478Q859h8474j48410I1109a80458L2589k73735P1840o7942G6153J6370
10149I2523i663p0149A23323a22418J7366K9684H2120J0974f36l08320d239r3051
$$ plain form
10228 -36274 -195064 -319182 -344406 -104076 -221488 112545 -165876 36494 12707 -82560
10217 -101939 -278258 -357877 -15647 -148821 83335 -193721 -257850 -179045 325115 -83110 264458
10205 -170405 453244 -63459 -390652 -220243 178235 191262 -290396 93794 -138077 -182199
10195 -182199 -50949 41796 -271395 -227193 -187608 243074 -440260 -4761 -121168 -71400 -29785
10183 -97552 -62502 -236166 -29875 -124449 109230 -41625 -135197 -31646 -302615 -305337 31063
10171 -444489 -89285 59850 179981 -102960 -136674 -89645 636 -68937 -275946 177557 93478
10160 93478 102337 -88474 -236884 91109 -180458 -147869 -421604 -349764 -417706 76153 92523
10149 92523 -9663 -79812 123323 -122418 -105052 -75368 82120 93094 -636 -308956 -4239 -97290
10137i7290H6576a14522C55553a5059j51881g5055c4991B8215c8088A2524J22687
10126A35211D4577a41594q4088Q0795L3643k63132B10681K4612G3788L3639D0168
10114b0880A2911d362k86642i4984n5307A465c64049d8312k58740p101A05744
10102C31394c19975O1393R6125D1795K92385C659b90996J36260q0525D7796J49544
10091A97340n4702g699B03114H3237h5699C2180K41480b2905O830m2812j20504
10080a79391A18677b06353k09204b1383A2946b05290h5015p4137H9888a97132
10069c54647a28348D1215e3388k7066n8930N1490K2052A17869E7361P1175f3083
10057a67293B8514K44549d0096B43852h6949j39678D6027d304j34090n1135A12532
$$ plain form
10137 -97290 86576 -114522 355553 -15059 -166940 -75055 -34991 28215 -38088 12524 135211
10126 135211 44577 -141594 -225682 -144887 -111244 -374376 210681 235293 73788 107427 40168
10114 -20880 12911 -4362 -291004 -94984 -150291 1465 -364049 -48312 -307052 -314153 105744
10102 331394 -319975 -258582 -162457 41795 334180 3659 -290996 -154736 -235261 47796 197340
10091 197340 142638 -7699 203114 83237 -85699 32180 273660 -22905 -16075 -58887 -179391
10080 -179391 118677 -206353 -415557 -21383 12946 -205290 -85015 -159152 89888 -197132
10069 -354647 -128348 41215 -53388 -80454 -139384 -87894 -65842 117869 57361 128536 -63083
10057 -167293 28514 273063 -40096 243852 -86949 -226627 46027 -4304 -138394 -189529 112532
10045B0420K41191a32892A28210n2635M2301m1840b72369R5620A8655J08205d12324
10033g5697l08600e0285j3671B20209P9490f8708A28722b01523A83141a69172
10022A58317A555a75663M3777A9059b5031l4133o6903K6130q0652j0606C4673
10010A523i8367G0833d6263B3222b47157i54j45805D7663O9620l3575b60266K11
9998b60055J03227k3998F2840a35417M4417k48429A51492a94376j27660H7314
9987H1330b37955m879N0366n3966A96734a36091A67678c58847B85373n0628a3005
9975h0521K7315g727l32138a12745j09911A669c7923j15053E0052b00655A64480
9963G3154K1282K20770j01244a92884A73806C741c73973B31656c34443n7888J49908
$$ plain form
10045 20420 261611 -132892 128210 75575 117876 76036 -272369 -176749 18655 126860 -412324
10033 -75697 -384297 -50285 -63956 220209 299699 -68708 128722 -201523 183141 -169172
10022 158317 1555 -175663 -131886 19059 -25031 -59164 -126067 -99937 -180589 -191195 34673
10010 1523 -98367 70833 -46263 23222 -247157 -954 -146759 47663 117283 83708 -260266 -260055
9998 -260055 -156828 -180826 62840 -135417 -91000 -339429 151492 -194376 -322036 87314
9987 81330 -237955 -242834 -192468 -246434 196734 -136091 167678 -358847 285373 234745 -13005
9975 -80521 -53206 -7727 -339865 -112745 -222656 1669 -37923 -152976 50052 -200655 164480
9963 73154 94436 315206 213962 -192884 173806 3741 -373973 231656 -334443 -392331 -242423
9952b42423B78540a25820A24970b16264C5409n413M3808b33597J11008A74988
9941A0388d0770k55006i0681B13071a15506l60504b23994D8939O891A7010a48707
9929G8160k6673h1450m51535A15336b21440d1579j40704A73126D1602J85292E2860
9917c60956M5369d4988j60390k64659A69076c37586l5447a38451A44442A6057
9906d2962j81475A61883j0953G2457a77682r1575a7616B73237b77438A21454d72894
9894d58557a01987A18448K14957d87444A32690J42358a09725A83573a11482A22718
9883C34961E2948a30950e693q1902k00586A35978b00798O5812d7387K2902o89560
9872g14045A56976a40735b7386r1870C7804a67442h0242E452c67741J19428A39746
$$ plain form
9952 -242423 278540 -125820 124970 -216264 35409 29996 73804 -233597 -122589 174988
9941 10388 -40770 -295776 -90681 213071 -115506 -476010 -223994 48939 55830 17010 -148707
9929 78160 51487 -81450 -532985 115336 -221440 -41579 -182283 173126 41602 226894 52860
9917 -360956 -315587 -44988 -205378 -470037 169076 -337586 -373033 -138451 144442 16057
9906 -42962 -224437 161883 150930 72457 -177682 -269257 -17616 273237 -277438 121454 -472894
9894 -458557 -101987 118448 333405 -487444 132690 275048 -109725 183573 -111482 122718
9883 334961 52948 -130950 -5693 -87595 -288181 135978 -200798 -134986 -47387 -24485 -714045
9872 -714045 156976 -140735 -27386 -119256 37804 -167442 -80242 5452 -367741 -248313 139746
9860A48202b73032N4025A0784c44213h7458L8919L238a9583m570B32063b18523
9848a26469e6135p5889A06957h8569l10283a07602A05362a66842m2748m26293
9838f35883a16839A32662b04789i3731E5864a07890p9868A53406E898J05589a94575
9826c18207d8879B68456i0632B90539b07434g6765n8978A4075o969b43533P1699
9815a71834k54862B64070j15076e13942A28378a11544C7554b12341A84323N7055
9805B41378a92523n1143Q3253L8859B36703A0301J44167O6650c29095a25277B27047
9793C04249b98561C38335a33923c5911b575k75252e9737C47311C8247J85829a47075
9781B2247a30825k014N0040B95831b56354C06625a49722j52749J35095l8040h7483
$$ plain form
9860 148202 -273032 -219007 10784 -344213 -87458 -48539 -45301 -19583 -24153 232063 -218523
9848 -126469 -56135 -132024 106957 -88569 -398852 -107602 105362 -166842 -209590 -635883
9838 -635883 -116839 132662 -204789 -93731 55864 -107890 -187758 153406 5898 111487 -194575
9826 -318207 -48879 268456 -90632 290539 -207434 -76765 -135743 14075 7106 -243533 -171834
9815 -171834 -426696 264070 148994 -513942 128378 -111544 37554 -212341 184323 241378
9805 241378 -192523 -243666 -160413 -121554 236703 10301 154468 221118 -329095 -125277 227047
9793 304249 -298561 338335 -133923 -35911 -2575 -277827 -59737 347311 38247 224076 -147075
9781 22247 -130825 -132839 -82799 295831 -256354 306625 -149722 -302471 -167376 -205416 -87483
9769A01111B0847a82630A90796e1195A97727o7155n1708e05253J60931p129A20128
9757b07539n3974j54475G2778K65586a24797o5784J8818q484A73519a2742C027
9745a87822C7842b57367h8861j11289j6847h8523A28015a42789C4585d5634E39215
9733g4072G8210e00946h3360k39798E8239a10598j57465A19882a57751B19256
9722g1077B4775R4011c0867j31349H3356a70143j57943P9862m7590C9102a82333
9710A31344c81608g4183A01612a05941A8724d10455F1194c5929k62134H8260r203
9699G9057a4203r0042k50108A73304B5655d7461j37680C362d9013D0911N0895
9688I1806N7756A3579n491b20271G1146e0962K3786k72559R8935r3450D39632
$$ plain form
9769 101111 20847 -182630 190796 -51195 197727 130572 78864 -505253 -344322 -351451 120128
9757 -207539 -261513 -415988 72778 338364 -124797 -190581 -171763 -180247 173519 -12742 3027
9745 -187822 37842 -257367 -88861 -200150 -216997 -88523 128015 -142789 34585 -45634 539215
9733 -74072 78210 -500946 -83360 -323158 58239 -110598 -268063 119882 -157751 219256
9722 -71077 24775 118786 -30867 -162216 83356 -170143 -328086 -248224 -295814 39102 -182333
9710 131344 -381608 -74183 101612 -105941 18724 -410455 61194 -35929 -298063 88260 79057
9699 79057 -14203 -104245 -354353 173304 25655 -47461 -185141 3362 -49013 40911 91806
9688 91806 149562 13579 8088 -220271 71146 -50962 -27176 -299735 -200800 -294250 439632
9676A45680c72703A80378d719l786q0749l362A36794J57209H5472a03127B38821
9664h559I8030b12179M1093h2112k15354A30329b67136Q0142n1440J01510f5892
9652b1588A60283o9813c94711c1537l35194R9072j40255A12474a07803B0577b92343
9640a10525e0374A94683A2923b03266F1811i9546m4784o2833A26764b88063j94198
9629d82261a85812h74o6362C11244b11586I8837a00913H4230B6248b81530J18566
9618a62964A94478c45251a39325A75588a09298k3367G8572a40281j43280K333
9608b81228M34L6379f198A33026l3353R5394a41171a1429B61752b60439a15627
9596c7236j16604o2276a8198k64697Q7575b7607a1823j24352I9133b98734C23382
$$ plain form
9676 145680 -372703 180378 -4719 -8505 -89254 -92616 136794 294003 85472 -103127 238821
9664 -8559 98030 -212179 -171086 -82112 -297466 130329 -267136 -186994 -238434 -136924 -65892
9652 -21588 160283 90470 -394711 -31537 -366731 -267659 -407914 112474 -107803 20577 -292343
9640 -110525 -50374 194683 12923 -203266 61811 -99546 -144330 -207163 126764 -288063 -482261
9629 -482261 -185812 -874 -67236 311244 -211586 98837 -100913 84230 26248 -281530 -162964
9618 -162964 194478 -345251 -139325 175588 -109298 -132665 78572 -140281 -283561 -281228
9608 -281228 -280794 -244415 -6198 133026 99673 195067 -141171 -11429 261752 -260439 -115627
9596 -37236 -153840 -216116 -18198 -282895 -195320 -27607 -11823 -136175 99133 -298734 323382
9584A5541a22469B41797a27707B13176C333L2125a70715j86681A3812b06357k3403
9573b29760k1568g0709j37479A71533a26159K9612j53478F1045a33328N0640J2272
9562g0416j43856m265j00672D0148C817b3926j57950A33181J49685d48870c0161
9550a19881j85370E0254a36766O496M9451L6420A60399a29972K5900c5157k490
9539c7647B0167c18694r5791a85843A48161a15859k8511e6972k48256N5105J08567
9528a41556a905D2160a27211l38924A45931a3645D50112g4318l62314G1828B2045
9516a44842B2344a10481p2411E6955A6213h197I9668a54713E3284c82769A17316
9504a10375B6466c12289A40423h4734j72702A97858p0133b39623J16161M199A72476
$$ plain form
9584 15541 -122469 241797 -127707 213176 3333 35458 -170715 -357396 13812 -206357 -229760
9573 -229760 -251328 -70709 -208188 171533 -126159 -96547 -250025 61045 -133328 -82688 -70416
9562 -70416 -214272 -218537 -319209 40148 3817 -23926 -181876 133181 282866 -448870 -30161
9550 -119881 -305251 50254 -136766 -130270 -80819 -44399 160399 -129972 -104072 -35157 -37647
9539 -37647 20167 -318694 -414485 -185843 148161 -115859 -144370 -56972 -305228 -250123 -141556
9528 -141556 -1905 42160 -127211 -466135 145931 -13645 450112 -74318 -436632 71828 22045
9516 -144842 22344 -110481 -182892 56955 16213 -8197 99668 -154713 53284 -382769 117316
9504 -110375 26466 -312289 140423 -84734 -257436 197858 127725 -239623 -123462 -119263 172476
9492a30516M4378a0473M948B5343F024a10348n5975j80047N5605g9364a6882j08698
9480a25580A02358O8632c7289j87817C7161d4448B14422a80918k5099D0988a83122
9468B12417a89064p7288P7395i159j38673j11688J05645f0619B06613b21274a03549
9456g8391j69761A13059O4233b41121A24347a59679A64094o6887i1226B63138
9445G3248J67930A00024a33941j52796R4211j91191G7994l5245a71285p2594B0282
9433F1547J02739m9339e0846G0229a68597G9865k4917o714c00550g5857B1765
9421C20054i0464b7391A19078A7353D823R8647b01071A19131b24566a05541j4978
9410a20519J5022p354b6638k11893J3494C9032f9352j54781b3081B07386a54321
$$ plain form
9492 -130516 -86138 -10473 -5525 25343 6024 -110348 -166323 -346370 -290765 -79364 -16882 -125580
9480 -125580 102358 170990 -37289 -225106 37161 -44448 214422 -180918 -206017 40988 -183122
9468 212417 -189064 -266352 -188957 -9159 -147832 -259520 -153875 -60619 206613 -221274 -103549
9456 -78391 -248152 113059 177292 -241121 124347 -159679 164094 97207 -91226 263138
9445 73248 241178 100024 -133941 -286737 -192526 -383717 77994 42749 -171285 -243879 20282
9433 61547 164286 114947 -50846 70229 -168597 79865 54948 48234 -300550 -75857 21765
9421 320054 -90464 -27391 119078 17353 4823 103470 -201071 119131 -224566 -105541 -120519
9410 -120519 -105497 -112851 -26638 -238531 -225037 39032 -69352 -224133 -23081 207386 -154321
9398g5846E0003b50961A7468J02882D4775J77649a52719B5929c43667J34130C9036
9386b765q7400j89202i706n13217c9252A46652a63325J8474G4123O815b69932
9374A19237g7324f230j2262k5443a2132l15499N6582A6680i0364f740l8341C41019
9361c24817A54172E8634B256P5722b40566J12990j19332b6899j20061M3290B24012
9349a09465G1491a42994A09430a26533A83886q740q0568B7413a18863A54607F0878
9337A81169C4537e8216j03069P9839K5327j61705C8782R1868E3373a55893A7016
9325b2377p7010j04507i8009C4164b70906c3847E7155a87352H8267J34423b25020
9313B5650c72267e0208m9886K5826K810k14420J12591k2568f0397k5058F2931
$$ plain form
9398 -75846 50003 -250961 17468 120350 44775 222424 -152719 25929 -343667 -209537 39036
9386 -2765 -90165 -279367 -9706 -522923 -39252 146652 -163325 -144851 74123 80938 -269932
9374 119237 -77324 -6230 -18492 -43935 -12132 -327631 -271049 16680 -90364 -6740 -45081 341019
9361 -324817 154172 58634 2256 77978 -240566 -127576 -246908 -26899 -146960 -103670 224012
9349 -109465 71491 -142994 109430 -126533 183886 175146 94578 27413 -118863 154607 60878
9337 181169 34537 -58216 -161285 -81446 -56119 -217824 38782 130650 53373 -155893 17016
9325 -22377 -99387 -203894 -98009 34164 -270906 -33847 57155 -187352 88267 222690 -225020
9313 25650 -372267 -50208 -100094 -74268 -71458 -285878 -173287 -195855 -60397 -85455 62931
9301a36932j90648A43785b86846F0343j2586d7783H3935k5818M8271J20130a59868
9289b2460E3224i599k56779J00726b7091j00636e7481m06313D4847b13952A25972
9277B2343a09419C8869c80714B70436e648k02093C11205a21352K2389l7635A94519
9265a20970E5274i51k36824e8171p1066j06736N6349k36819a13110o5149I1207
9253C4400c36060J48065K3709M0100A59237i7090A42178i4736b8171j98198A76719
9241b60631A71993d8247j24865j86628a56622g1675j24667j84719b5178j60460
9231a85638a6698C8257a56366O3544l3655C16941c26862A12489c41791k9803k1856
9220c93450a31045j81265A13263G655N2529b85743g3036H5748a19067D3885b03257
$$ plain form
9301 -136932 -327580 143785 -286846 60343 47757 -47783 83935 58117 106388 226518 -159868
9289 -22460 53224 -9599 -266378 -165652 -27091 -127727 -57481 -463794 44847 -213952 125972
9277 22343 -109419 38869 -380714 270436 -5648 -207741 311205 -121352 -98963 -136598 194519
9265 -120970 55274 -951 -237775 -58171 -129237 -235973 -179624 -416443 -113110 -178259 91207
9253 34400 -336060 -187995 -164286 -124186 159237 -97090 142178 -94736 -28171 -226369 176719
9241 -260631 171993 -48247 -173112 -359740 -156622 -71675 -196342 -381061 -25178 -185638
9231 -185638 -16698 38257 -156366 -92822 -126477 316941 -326862 112489 -341791 -371594 -393450
9220 -393450 -131045 -312310 113263 7655 60184 -285743 -73036 85748 -119067 43885 -203257
9208B786M37936k10877a24238k14856K4758J05891j85506Q7325G8233j1176P547
9197G4604b15996B47525A04260b07221c0187k7211j74272J07814J1692C8286R5005
9186A33291E8489k6721a77270A07502h8444m4214J0435A46921K99046a03944q6092
9175a90036q2887A38815c028k20940j01136G330b29319B65624H8983a11255k11459
9164c22714J39393L7205A84981J28309h9921d2577j11480a9117k98922A75787
9153b64506O030a15167o1585h6549j29731m4894B72946a07829c0644A55983c5854
9141I4906K05441c2164A50270c38479A3084M2966M3272a18599r8004B09862c9116
9129a99446A14003b4903j6121k10416d0788j11666A37961L387b11850A69521q0361
$$ plain form
9208 2786 440722 229845 -124238 -339094 -314336 -208445 -393951 -306626 78233 67057 74604
9197 74604 -215996 247525 104260 -207221 -30187 -57398 -231670 -123856 -112164 38286 133291
9186 133291 58489 31768 -177270 107502 -88444 -132658 -122223 146921 445967 -103944 -190036
9175 -190036 -272923 138815 -3028 -223968 -325104 7330 -229319 265624 88983 -111255 -322714
9164 -322714 -183321 -146116 184981 313290 -89921 -42577 -154057 -19117 -318039 175787
9153 -264506 -258476 -115167 -176752 -86549 -216280 -261174 272946 -107829 -30644 155983 -35854
9141 94906 300347 -32164 150270 -338479 13084 56050 99322 -118599 -216603 209862 -39116
9129 -199446 114003 -24903 -41024 -251440 -40788 -152454 137961 141348 -211850 169521 89160
9118H9160a47570m3666o1615R7539l11616e5113p9931k5709B29426a23397A26793
9106c68007B22987a56915A09105a46367B6162b34012i8997j10703A42285c16949
9095I9566m1881i7853D60097a15248a2342B20194m7636M4879b34924j28992J77914
9084a86002q7868B99842o5153e02147d9176C8337R474L668J9049c34411A04521
9072a10804B6257e4009j91754k05593J52148i9750j36894N4394A66249M7952C0843
9060C67493a2202o7666a577k14659Q1122k53503a50910e916l01832E6620j7225
9049C9395R6299d3502B57006d6570j7236b0854H0506J26932k3061K37043p6975
9038C44445C738f6935n7176d5204D7589a07128A55484b26800h4751a8688m80349
$$ plain form
9118 89160 -147570 -191236 -252851 -155312 -466928 -55113 -135044 -160753 229426 -123397 126793
9106 -368007 222987 -156915 109105 -146367 26162 -234012 -98997 -209700 142285 -316949
9095 99566 57685 -97853 460097 -115248 -12342 220194 172558 217437 -234924 -363916 -186002
9084 -186002 -273870 299842 234689 -502147 -49176 38337 47811 51479 70528 -334411 104521
9072 -110804 26257 -54009 -245763 -451356 -299208 -99750 -236644 -182250 166249 214201 30843
9060 367493 -12202 -79868 -1577 -216236 -135114 -388617 -150910 -5916 -307748 56620 39395
9049 39395 135694 -43502 257006 -46570 -63806 -20854 80506 207438 184377 421420 344445
9038 344445 3738 -66935 -124111 -45204 47589 -107128 155484 -226800 -84751 -18688 -499037
9027d99037J11311J91982h5935H5971A2254J5028K35527i8138k14968G5612b77053
9015a19409j00126C0287e381m7576A93359J519g3723n0413N3234B134d24604i4637
9002a2320m58980c4461l86115a4225F1237e8771p9635A1785J11487i4874J1019
8991h3855E6966h6609k34615J12118C0845b77704B93696b66284R0170O8920j14941
8980b22135R3311a6982l4512j01077l8010j95711P2473c3952j93385e2843k08899
8969b61742j80809B50J30228h6110H0610a45246D7608r177d16282E8043c40780
8957b7758B77978B0983E843j821c19080P4497p9304a57175A71595j8954b66845
8945A94676c46073A17937D9556J00343b65460F1353d25456J97893A19707D6497
$$ plain form
9027 -499037 -387726 -195744 -85935 85971 12254 27282 262809 -98138 -313106 75612 -277053
9015 -119409 -219535 30287 -5381 -52957 193359 194878 -73723 -124136 -70902 2134 -424604 -94637
9002 -12320 -471300 -34461 -420576 -14225 61237 -58771 -138406 11785 123272 -94874 -83855
8991 -83855 56966 -86609 -321224 -209106 30845 -277704 293696 -266284 -176114 -107194 -222135
8980 -222135 -128824 -16982 -51494 -152571 -190581 -386292 -313819 -33952 -227337 -52843 -261742
8969 -261742 -442551 250 130478 -86110 80610 -145246 47608 38431 -416282 58043 -340780
8957 -27758 277978 20983 5843 4022 -319080 -244583 -323887 -157175 171595 152641 -266845
8945 194676 -346073 117937 49556 149899 -265460 61353 -425456 -227563 119707 46497
8934C23246p3665d1443k30719A38864K971K28510j50398E7240N62519P80095P13405
8923B113259N161785R449544l359409C791347A063665l76121k1352k48093m8350
8914C69749A39944J20524b6756j47358A05214L1792K81961A78578p1676M893b9741
8902A88398d9405G416i8643k38036a59132C4121f9202k00324i3094B08727M47
8891B09174f2696F5224b12298H7676l9254L05301A26447C3390a70733j6319h9396
8879a08442b2432j41760L7584A85676G0791M9478h0594F4638i1393k36086k2451
$$ plain form
8934 323246 249581 -41443 -272162 138864 141835 370345 219947 57240 619759 1399854 2113259
8923 2113259 7275044 16724588 13365179 3791347 1063665 687544 666192 418099 369749
8914 369749 139944 260468 -26756 -174114 105214 137006 418967 178578 106902 111795 -29741
8902 188398 -49405 7416 -98643 -336679 -159132 34121 -69202 -269526 -93094 208727 209174
8891 209174 -62696 65224 -212298 87676 48422 353723 126447 33390 -170733 -187052 -89396
8879 -108442 -22432 -164192 -126608 185676 70791 120269 -80594 64638 -91393 -327479 -349930
$$ [...]
##END NTUPLES=NMR SPECTRUM
##END=
