##TITLE=AC1528_ROEFFECT0007_8202340_hqoOYKbWS1
##JCAMPDX= 6.0         $$ Bruker NMR JCAMP-DX V2.0
##DATA TYPE= NMR SPECTRUM
##DATA CLASS= NTUPLES
##ORIGIN= BRUKER
##OWNER= Administrator
$$ 1.72 TOPSPIN		Version 2.1
$$ 2013-09-27 00:43:45.552 -0700  Administrator@X
$$ Compression mode = diff/dup
##.OBSERVE FREQUENCY= 400.02188249412
##.OBSERVE NUCLEUS= ^1H
##.ACQUISITION MODE= SIMULTANEOUS (DQD)
##.ACQUISITION SCHEME= undefined
##.AVERAGES= 64
##.DIGITISER RES= 22
##SPECTROMETER/DATA SYSTEM= spect
##.PULSE SEQUENCE= noesygpps1d.comp
##.SOLVENT NAME= COFFEE_meoh
##.SHIFT REFERENCE= INTERNAL, COFFEE_meoh, 1, 14.96073
##AUDIT TRAIL= $$ (NUMBER, WHEN, WHO, WHERE, PROCESS, VERSION, WHAT)
$$ ##TITLE= Audit trail, TOPSPIN		Version 2.1
$$ ##JCAMPDX= 5.01
$$ ##ORIGIN= Bruker BioSpin GmbH
$$ ##OWNER= Administrator
$$ $$ E:\/data/COFFEE/nmr/AC1528_ROEFFECT0007_8202340_hqoOYKbWS1/12/pdata/1/auditp.txt
$$ ##AUDIT TRAIL=  $$ (NUMBER, WHEN, WHO, WHERE, PROCESS, VERSION, WHAT)
(   1,<2013-09-27 00:43:40.365 -0700>,<Administrator>,<X>,<go>,<TOPSPIN 2.1>,
      <created by zg
	started at 2013-09-27 00:32:11.458 -0700,
	POWCHK enabled, PULCHK disabled,
       configuration hash MD5:
       C8 4E 4E 5D D3 5C D8 9E 9F 52 82 E0 59 8A DE 15
       data hash MD5: 64K
       53 87 A5 8F E2 34 D3 08 00 DD 2F A6 EA 20 DE 56>)
(   2,<2013-09-27 00:43:43.459 -0700>,<Administrator>,<X>,<proc1d>,<TOPSPIN 2.1>,
      <Start of raw data processing
       efp LB = 0.3 FT_mod = 6 PKNL = 1 PHC0 = 0 PHC1 = 0 SI = 128K 
       data hash MD5: 128K
       F8 E6 DA 6F 2B 35 1C 07 4A A2 62 25 8A D0 DF EE>)
(   3,<2013-09-27 00:43:44.521 -0700>,<Administrator>,<X>,<proc1d>,<TOPSPIN 2.1>,
      <pk PHC0 = -83.19946 PHC1 = 0 
       data hash MD5: 128K
       AE 60 F2 69 E2 75 F6 1D 1D 84 1D B9 F3 69 D3 40>)
(   4,<2013-09-27 00:43:44.974 -0700>,<Administrator>,<X>,<proc1d>,<TOPSPIN 2.1>,
      <abs ABSG = 1 
       data hash MD5: 128K
       43 3A B3 4B 00 DF BA F6 99 CE BC 89 6F 67 BD 53>)
(   5,<2013-09-27 00:43:45.068 -0700>,<Administrator>,<X>,<proc1d>,<TOPSPIN 2.1>,
      <abs ABSG = 2 
       data hash MD5: 128K
       B7 34 06 C2 FA 14 DC 44 3C BB 9A D7 E7 6C 19 FB>)
(   6,<2013-09-27 00:43:45.146 -0700>,<Administrator>,<X>,<proc1d>,<TOPSPIN 2.1>,
      <abs ABSG = 3 
       data hash MD5: 128K
       6B 4B 7E 37 CB CC 16 63 4D 21 F2 00 BF BA EF E7>)
(   7,<2013-09-27 00:43:45.240 -0700>,<Administrator>,<X>,<proc1d>,<TOPSPIN 2.1>,
      <abs ABSG = 4 
       data hash MD5: 128K
       E7 43 43 EE 6C 2F 1D 9C 1B EF 58 40 B7 26 7B BE>)
(   8,<2013-09-27 00:43:45.381 -0700>,<Administrator>,<X>,<proc1d>,<TOPSPIN 2.1>,
      <abs ABSG = 5 
       data hash MD5: 128K
       FF 8B 5B 0A 19 EB 1C 8E A3 7D 62 E0 54 11 8C 3A>)
$$ ##END=
$$ 
$$ $$ hash MD5
$$ $$ A0 07 31 8E BC B4 0D 75 0F 48 B4 E7 9D A4 C4 25
##$RELAX= 
##$RELAX= 
##$RELAX= 
##$RELAX= 
##$RELAX= 
##$RELAX= 
##$RELAX= 
##$RELAX= 
$$ Bruker specific parameters
$$ --------------------------
##$DU= <E:\>
##$EXPNO= 12
$$ [...]
##$TP07= 0
##$TPNAME0= <>
##$TPNAME1= <>
##$TPNAME2= <>
##$TPNAME3= <>
##$TPNAME4= <>
##$TPNAME5= <>
##$TPNAME6= <>
##$TPNAME7= <>
##$TPOAL= (0..7)
0.5 0.5 0.5 0.5 0.5 0.5 0.5 0.5
##$TPOFFS= (0..7)
0 0 0 0 0 0 0 0
##$TUNHIN= 0
##$TUNHOUT= 0
##$TUNXOUT= 0
##$USERA1= <user>
##$USERA2= <user>
##$USERA3= <user>
##$USERA4= <user>
##$USERA5= <user>
##$V9= 5
##$VALIST= <valist>
##$VCLIST= <CCCCCCCCCCCCCCC>
##$VD= 0
##$VDLIST= <DDDDDDDDDDDDDDD>
##$VPLIST= <PPPPPPPPPPPPPPP>
##$VTLIST= <TTTTTTTTTTTTTTT>
##$WBST= 1024
##$WBSW= 4
##$XGAIN= (0..3)
0 0 0 0
##$XL= 0
##$YL= 0
##$YMAX_a= 6914120
##$YMIN_a= -13520224
##$ZGOPTNS= <>
##$ZL1= 120
##$ZL2= 120
##$ZL3= 120
##$ZL4= 120
##$ABSF1= 14.96073
##$ABSF2= -5.597452
##$ABSG= 5
##$ABSL= 3
##$ALPHA= 0
##$AQORDER= 0
##$ASSFAC= 0
##$ASSFACI= 0
##$ASSFACX= 0
##$ASSWID= 0
##$AUNMP= <proc_prof1d_extract.lims>
##$AXLEFT= 0
##$AXNAME= <>
##$AXNUC= <1H>
##$AXRIGHT= 0
##$AXTYPE= 0
##$AXUNIT= <>
##$AZFE= 0.1
##$AZFW= 0.1
##$BCFW= 0
##$BC_mod= 0
##$BYTORDP= 0
##$COROFFS= 0
##$CY= 15
##$DATMOD= 1
##$DC= 0
##$DFILT= <>
##$DTYPP= 0
##$F1P= 0
##$F2P= 0
##$FCOR= 0.5
##$FTSIZE= 131072
##$FT_mod= 6
##$GAMMA= 0
##$GB= 0
##$INTBC= 1
##$INTSCL= 1
##$ISEN= 128
##$LB= 0.3
##$LEV0= 0
##$LPBIN= 0
##$MAXI= 10000
##$MC2= 0
##$MEAN= 0
##$ME_mod= 0
##$MI= 0
##$NCOEF= 0
##$NC_proc= -2
##$NLEV= 6
##$NOISF1= 0
##$NOISF2= 0
##$NSP= 0
##$NTH_PI= 0
##$NZP= 0
##$OFFSET= 14.96073
##$PC= 1
##$PHC0= -83.19946
##$PHC1= 0
##$PH_mod= 1
##$PKNL= yes
##$PPARMOD= 0
##$PPDIAG= 0
##$PPIPTYP= 0
##$PPMPNUM= 2147483647
##$PPRESOL= 1
##$PSCAL= 4
##$PSIGN= 0
##$PYNMP= <proc.py>
##$REVERSE= no
##$SF= 400.020009745061
##$SI= 131072
##$SIGF1= 0
##$SIGF2= 0
##$SINO= 400
##$SIOLD= 131072
##$SPECTYP= <>
##$SREGLST= <1H.CDCl3>
##$SSB= 0
##$STSI= 131072
##$STSR= 0
##$SW_p= 8223.68421052631
##$SYMM= 0
##$S_DEV= 0
##$TDeff= 65536
##$TDoff= 0
##$TI= <>
##$TILT= no
##$TM1= 0
##$TM2= 0
##$TOPLEV= 0
##$USERP1= <user>
##$USERP2= <user>
##$USERP3= <user>
##$USERP4= <user>
##$USERP5= <user>
##$WDW= 1
##$XDIM= 131072
##$YMAX_p= 405151832
##$YMIN_p= -13865
##$CURPLOT= <Network HP LaserJet P1505>
##$CURPRIN= <$Network HP LaserJet P1505>
##$DFORMAT= <normdp>
##$LAYOUT= <+/1D_H.xwp>
##$LFORMAT= <normlp>
##$PFORMAT= <normpl>
##$SURQMSG= 1
$$ End of Bruker specific parameters
$$ ---------------------------------
##NTUPLES= NMR SPECTRUM
##VAR_NAME=  FREQUENCY,     SPECTRUM/REAL,   SPECTRUM/IMAG
##SYMBOL=    X,             R,               I
##VAR_TYPE=  INDEPENDENT,   DEPENDENT,       DEPENDENT
##VAR_FORM=  AFFN,          ASDF,            ASDF
##VAR_DIM=   131072,        131072,          131072
##UNITS=     HZ,            ARBITRARY UNITS, ARBITRARY UNITS
##FACTOR=    0.0627417313425164, 1,          1
##FIRST=     8223.62146879497, 745,          -70717
##LAST=      0,             3100,            -71391
##MIN=       0,             -13865,          0
##MAX=       8223.62146879497, 405151832,    0
$$ Real data points
##PAGE= N=1
##DATA TABLE= (X++(R..R)), XYDATA
$$ [...]
67849 82842 81433 79929 78747 78005 77324 76440 75573 74971 74503 73984 73563 73487 73742 74224 75054 76404 78131 79852
67831 79852 81331 82602 83787 85027 86537 88563 91164 94159 97286 100470 103904 107794 111829 115025
67817 115025 116440 116138 115197 114530 114015 112983 111331 109685 108499 107392 105592 102800 99469 96320 93743
67802 93743 91661 89815 88058 86355 84679 83059 81645 80496 79348 77870 76225 74992 74402 74010 73358
67787 73358 72615 72133 71724 70964 70104 70026 71149 72893 74334 75004 74885 74109 72985 72016 71537 71487 71670 72022
67769 72022 72498 73043 73825 75147 76913 78562 79831 81146 82840 84482 85545 86433 88041 90356 92209
67754 92209 92555 91480 89886 88670 88271 88461 88435 87623 86485 85974 86089 85701 84130 82128 80791 80148 79560
67737 79560 78955 78774 78928 78787 78175 77542 77014 76133 74795 73747 73645 74063 73959 72816 70967 69029 67438
67720 67438 66418 66006 66079 66490 67103 67594 67506 66794 66128 66264 67144 67954 68054 67506 66634 65473 63973 62499
67702 62499 61722 61947 62802 63730 64598 65616 66759 67581 67710 67324 66965 66998 67405 67965 68371 68227 67256 65679
67684 65679 64233 63670 64223 65485 66734 67423 67594 67790 68352 68888 68706 67801 67004 67094 68081 69537 71185 72885
67666 72885 74407 75698 77122 78993 80985 82478 83337 83841 83928 83168 81701 80548 80536 81275 81717 81521 81320
67649 81320 81676 82276 82391 81774 80750 79607 78309 76891 75820 75571 75952 76175 75757 75015 74488 74165 73706
67632 73706 73221 73298 74164 75376 76546 77891 79624 81158 81525 80597 79411 79144 80063 81533 82745 83255 83068
67615 83068 82547 82256 82702 84020 85770 87098 87366 86850 86655 87588 89179 90149 89895 89114 88822 89168 89531 89429
67597 89429 88894 88058 86884 85378 83755 82281 81131 80442 80252 80342 80396 80430 80823 81759 82828 83368 83080 82102
67579 82102 80657 78902 77150 75937 75631 75984 76220 75719 74575 73383 72483 71643 70636 69833 69792 70355 70672
67562 70672 70310 69891 70286 71468 72548 72779 72163 71221 70524 70418 70823 71243 71203 70692 70011 69339 68744 68464 68678
67543 68678 68967 68543 67207 65655 64639 64166 63793 63350 63036 63086 63673 64898 66448 67461 67208 65896 64446
67526 64446 63534 63206 63364 64071 65205 66247 66725 66688 66503 66403 66466 66799 67374 67742 67350 66257 65234 64908
67508 64908 65014 64770 63951 63215 63214 63686 63746 62996 62005 61560 61727 61853 61417 60655 60354 61085 62651 64206 64933
67489 64933 64712 64160 64044 64581 65292 65495 65046 64630 65198 66986 69170 70669 71149 70987 70407 69191 67331
67472 67331 65455 64249 63782 63746 64070 64813 65616 65805 65194 64449 64452 65433 66811 67816 68235 68557 69315 70261 70450
67453 70450 69327 67522 66274 66184 66819 67438 67707 67684 67484 67139 66612 65867 65025 64411 64251 64359 64325 64021 63687
67434 63687 63542 63552 63576 63530 63422 63386 63646 64227 64863 65488 66568 68451 70498 71504 71074 69962 68885 67698
67416 67698 66154 64823 64553 65252 65908 65777 65147 64895 65623 67281 69314 71104 72310 72850 72631 71606 70161
67399 70161 69046 68603 68354 67662 66527 65371 64281 62981 61487 60296 59857 60179 60980 61896 62505 62509 61985
67382 61985 61307 60756 60386 60170 60049 59882 59626 59536 59931 60791 61828 62883 63938 64819 65315 65630 66299 67551
67364 67551 69053 70390 71417 71998 71826 70793 69255 67674 66210 64870 63806 63200 62999 63023 63200 63439
67348 63439 63460 63032 62348 61916 62089 62843 63939 65082 65920 66118 65592 64675 63991 64029 64708 65448 65845 66206 67151
67329 67151 68668 70033 70819 71568 73085 75423 77977 80301 82281 83653 83974 83220 81858 80207 78208
67314 78208 76058 74546 74275 74810 75084 74580 73761 73371 73645 74251 74701 74774 74709 75062 76154 77630 78697 78874
67296 78874 78415 78030 78407 79909 82339 84823 86295 86438 86019 85995 86423 86533 85725 84107 82118 80127 78519
67279 78519 77693 77685 78059 78461 78947 79506 79557 78488 76584 74922 74279 74476 74900 75279 75793 76716 78105 79672
67261 79672 80879 81407 81666 82521 84312 86385 87783 88182 87903 87285 86423 85415 84478 83744 83157 82588 81986
67244 81986 81522 81693 82952 84893 86065 85176 82519 79737 78140 77670 77565 77409 77237 77114 77146 77682 79027
67227 79027 81001 83028 84590 85414 85485 85144 84976 85280 85793 86196 86609 87203 87599 87272 86472 86148 86878 88346
67209 88346 89884 90980 91225 90457 89254 88676 89146 90078 90951 92070 93732 95257 95669 94985 94027 93166 92163
67192 92163 91166 90922 91710 92827 93519 93852 94279 94910 95597 96345 97167 97823 98097 98117 98088 97933 97544 97178 97225 97734
67172 97734 98461 99260 100176 101277 102692 104558 106642 108164 108442 107658 106713 106380 106846 107856 108862 109128 108203
67155 108203 106434 104701 103562 102972 102865 103548 105221 107344 108874 109215 108822 108781 109781 111472 112876 113366
67139 113366 113119 112641 112173 111779 111693 112207 113357 115022 117181 119716 122075 123576 124093 124090 124050 124189 124666 125572
67121 125572 126614 127256 127378 127486 128122 129354 130879 132269 133046 133014 132761 133390 135405 138116 140378 141650
67105 141650 142078 141960 141555 141165 140982 140898 140753 140685 140964 141676 142830 144570 146869 149081 150263 150056 149041
67088 149041 148179 148046 148607 149517 150563 151886 153763 156110 158344 159836 160449 160543 160617 161022 161848 162877 163856
67071 163856 164965 166812 169716 173130 176056 177927 178927 179659 180754 182525 184670 186454 187552 188571
67057 188571 190332 192794 195150 196879 198192 199351 200133 200251 199967 199971 200838 202706 205337 208289 211159 213791
67041 213791 216267 218787 221599 224840 228177 230868 232604 234109 236361 239256 241666 242939 243666 244685
67027 244685 245982 247089 248113 249689 252097 254967 257868 260790 264021 267799 272054 276304 279911 282715
67013 282715 285234 288045 291074 293846 296266 298794 301891 305645 309923 314524 319163 323657 328212 333173
66999 333173 338371 343077 346821 350024 353559 357892 362893 368297 373955 379629 384926 389651 394087 398723
66985 398723 403758 409007 414268 419585 425062 430577 435883 440956 446077 451545 457458 463774 470417 477194
66971 477194 483832 490300 496981 504315 512210 519976 526960 533254 539745 547409 556514 566501 576680 586834
66957 586834 597004 606917 616166 625020 634484 645207 656733 668256 679799 692034 705126 718416
66945 718416 731333 744030 756963 770375 784460 799557 815771 832689 849809 867017 884389
66934 884389 901865 919483 937673 956800 976546 996245 1015785 1035779 1056863 1079269 1103073
66923 1103073 1128270 1154367 1180397 1205797 1231093 1257372 1285223 1314423 1344491 1375134 1406214
66912 1406214 1437665 1469578 1502166 1535517 1569558 1604313 1640071 1677192 1715852 1756065 1797769
66901 1797769 1840771 1884657 1928963 1973497 2018503 2064506 2111974 2161004 2211218 2261969 2312740
66890 2312740 2363371 2413954 2464583 2515275 2565998 2616641 2666937 2716591 2765565 2814206 2863065
66879 2863065 2912560 2962653 3012629 3061188 3107056 3149720 3189532 3227017 3262214 3294759 3324348
66868 3324348 3350851 3374133 3394092 3410870 3424642 3435203 3442174 3445807 3447134 3446827 3444005 3436664 3423469
66855 3423469 3405007 3383220 3359753 3334856 3307714 3277640 3244851 3210051 3173431 3134417 3092587
66844 3092587 3048560 3003608 2958395 2912412 2864631 2814542 2762561 2709763 2657264 2605561 2554247
66833 2554247 2502530 2450115 2397472 2345278 2293848 2243166 2193158 2143805 2095183 2047527 2000989
66822 2000989 1955245 1909671 1864128 1819311 1776094 1734773 1695163 1657050 1620152 1583923 1547908
66811 1547908 1512202 1477210 1443083 1409803 1377577 1346552 1316248 1285983 1255976 1227386 1200880
66800 1200880 1175670 1150354 1124423 1098587 1073838 1050567 1028458 1006940 985703 964902 944857
66789 944857 925579 906765 888229 870049 852288 834841 817649 800776 784216 767990 752535
66778 752535 738503 725911 713866 701427 688470 675452 662769 650652 639269 628502 617929
66767 617929 607453 597555 588490 579611 570130 560200 550523 541170 531615 521817 512335 503296 494182 484929
66753 484929 476386 469222 462989 456770 450258 443728 437391 431291 425530 420073 414600 408896 403130 397430
66739 397430 391583 385596 380152 375908 372605 369483 366324 363342 360141 355657 349487 342665 336685 332109
66725 332109 328430 324975 321524 318188 315065 312042 308765 304860 300292 295502 291019 286982 283149 279384
66711 279384 275996 273499 272060 271272 270435 268981 266563 262992 258494 254010 250728 248901 247340 244557 240398
66696 240398 236180 233190 231439 229988 228131 225914 223740 221769 219800 217544 214980 212455 210388 208842
66682 208842 207438 205683 203372 200712 198183 196200 194725 193209 191127 188603 186268 184478 182933 181198
66668 181198 179284 177492 175945 174622 173652 173173 172902 172254 171017 169590 168463 167628 166691 165360 163690 162003
66652 162003 160700 159998 159659 159062 157769 156017 154509 153698 153340 152692 151126 148649 145982 144043 143190 142952
66636 142952 142641 142089 141603 141266 140633 139282 137403 135652 134556 134172 134127 133811 132778 131253 130158 130274 131343
66619 131343 132302 132415 131883 131254 130615 129669 128397 127187 126297 125510 124489 123268 122185 121431 120855 120246 119626
66602 119626 119168 118901 118646 118194 117460 116429 115135 113741 112532 111673 111049 110482 110056 110017 110308 110418 109796 108346
66584 108346 106424 104493 102959 102256 102732 104146 105426 105314 103498 100981 99092 98290 98144 98308 98952 100116
66568 100116 101198 101503 100995 100085 98953 97598 96338 95633 95391 95079 94601 94435 94696 94658 93653 91981 90564
66551 90564 90008 90363 91356 92363 92509 91446 89930 89110 89334 90111 91039 92091 93032 93324 92827 92049 91428 90827
66533 90827 89987 89010 88089 87164 86262 85820 86176 86884 86967 85896 84100 82577 82161 82952 84181 84716 84017 82566
66515 82566 81251 80449 79938 79504 79290 79553 80370 81589 82868 83851 84519 85268 86366 87411 87710 87115 86106
66498 86106 85085 84110 83400 83442 84187 84663 84017 82707 82039 82527 83279 83124 81841 80066 78455 77311 76702
66481 76702 76408 75866 74661 73237 72694 73610 75326 76653 77103 77067 76860 76169 74658 72773 71472 71276 71973
66464 71973 73222 74935 76872 78309 78589 77896 77102 76847 77016 77081 76611 75442 73765 72252 71802 72824 74807
66447 74807 76762 78044 78658 78950 79217 79511 79675 79532 79128 78656 78109 77177 75687 73951 72476 71516 71143
66430 71143 71515 72543 73387 72919 70955 68656 67382 67394 67969 68504 69083 70015 71245 72360 72996 73097 72861
66413 72861 72559 72401 72526 72946 73444 73608 73178 72346 71521 70850 70254 69957 70497 71934 73374 73734 72879 71633
66395 71633 70739 70182 69620 69048 68806 69067 69534 69678 69261 68681 68727 69840 71628 73191 73872 73642 72855 71954
66377 71954 71404 71560 72396 73431 74156 74539 75073 76267 78073 79760 80414 79602 77604 75090 72751 71188
66361 71188 70707 70948 70970 70112 68693 67542 66987 66752 66736 67260 68340 69271 69380 68878 68550 68783 69271 69546 69409
66342 69409 68899 68190 67593 67418 67702 68150 68335 67913 66797 65346 64288 64164 64802 65514 65791 65681 65564 65778
66324 65778 66435 67317 67928 67972 67836 68221 69148 69716 69167 67954 67297 67777 68813 69522 69630 69375 68968 68564 68563
66305 68563 69416 71023 72596 73277 72852 71800 70763 69992 69270 68354 67501 67444 68653 70689 72511 73494 73890
66288 73890 74183 74299 73769 72512 71079 70095 69743 69898 70466 71349 72215 72644 72567 72368 72409 72576 72467 72016 71705
66269 71705 72041 72950 73825 74148 73966 73777 74070 74909 75799 76027 75343 74327 73851 74151 74695 74981 75154 75600 76234
66250 76234 76489 75873 74332 72222 70150 68702 68072 68010 68307 69064 70239 71157 71008 69825 68560 68103 68540
66233 68540 69410 70348 71335 72550 74165 76106 77952 79232 79852 80087 80211 80348 80611 81038 81374 81275 80759 80192
66215 80192 79779 79424 79019 78482 77515 75874 73978 72670 72158 71777 71107 70672 70981 71498 71354 70715 70632 71617
66197 71617 73145 74610 76022 77499 78662 78987 78497 77795 77523 77832 78246 78012 76831 75358 74725 75486 77163
66180 77163 78767 79527 79218 78190 77225 77022 77543 78109 78254 78219 78438 78844 79038 78995 79178 79883 80722 80957 80270
66161 80270 79122 78337 78342 78842 79181 78888 77857 76200 74190 72335 71300 71590 73279 75898 78521 80180
66145 80180 80524 79990 79135 77960 76272 74570 73894 74601 75844 76624 76916 77329 78057 78760 79262 79729 80158 80286
66127 80286 80114 80054 80347 80824 81444 82583 84398 86246 87310 87634 88015 88866 89660 89718 89118 88527 88311 88183
66109 88183 87735 87017 86457 86270 86161 85683 84871 84291 84355 84741 84744 84191 83670 83798 84574 85687 87173 89313 91961
66090 91961 94335 95616 95596 94688 93559 92768 92589 92969 93656 94358 94770 94583 93668 92268 90842 89777 89367
66073 89367 89920 91463 93363 94666 95005 94941 95278 96287 97672 98889 99319 98518 96744 94993 94100 93873 93418
66056 93418 92185 90469 89072 88818 90168 92799 95563 97306 97845 97851 97857 97794 97523 97211 96907 96209 94818 93128
66038 93128 91859 91200 90771 90410 90557 91631 93308 94735 95435 95758 96341 97327 98298 98906 99281 99748 100409 101210
66020 101210 102249 103722 105601 107574 109374 110993 112593 114296 116104 117811 118988 119215 118490 117407 116837
66005 116837 117313 118556 119623 119769 119317 119489 121168 124007 127010 129773 132736 136343 140469 144747 148936
65990 148936 152718 155585 157316 158393 159550 160977 162226 162836 162754 162147 161117 159782 158456 157467 156739 155772
65974 155772 154148 151949 149496 146836 143843 140782 138275 136466 134699 132462 130284 129096 128836 128389 127007
65959 127007 125189 123936 123628 123923 124344 124587 124515 124247 124141 124500 125372 126712 128520 130649 132750 134587 136242
65942 136242 137906 139756 142107 145247 148828 151774 153231 153451 153402 153736 154492 155515 156677 157735 158511 159252
65926 159252 160467 162316 164431 166411 168197 169937 171715 173524 175340 177189 179239 181731 184649 187637
65912 187637 190503 193694 197841 202816 207642 211482 214366 216802 218981 220689 221809 222544 223131 223550 223613
65897 223613 223319 223018 223151 223729 224151 223658 221946 219241 215854 211889 207428 202718 198056 193608 189459 185670
65881 185670 182167 178677 174936 170918 166781 162684 158813 155485 152990 151254 149773 148068 146157 144459
65867 144459 143251 142425 141798 141407 141250 140954 140092 138831 137824 137342 136944 136268 135702 135799 136321 136486 136082 135671
65849 135671 135587 135356 134486 133365 132832 133103 133626 133966 134349 135196 136495 137900 139249 140688 142243 143537 144102
65832 144102 143996 143966 144870 146927 149580 152156 154602 157416 160884 164514 167471 169575 171691 174942 179588
65817 179588 184832 189736 194116 198442 202960 207108 209839 210512 209482 207793 206191 204465 201926 198471
65803 198471 194926 192207 190419 189012 187605 186280 185169 184106 182802 181152 179219 177086 174827 172589
65789 172589 170702 169740 170293 172388 175179 177506 178911 179906 181181 182893 185005 188032 192973 200329 209441
65774 209441 218973 227936 236120 243659 250460 256144 260351 262920 263798 262904 260102 255307 248687 240860 232694
65759 232694 224686 216658 208437 200740 194884 191438 189656 188629 188642 190847 195825 203000 211469 220874 231330
65744 231330 242922 255533 268929 282808 296922 311209 325642 339868 353178 364834 374185 380475
65732 380475 382918 381210 375789 367444 356809 344295 330262 315100 299291 283501 268392 254243
65720 254243 240982 228656 217528 207525 198040 188646 179793 172295 166295 161168 156394 152075 148507
65707 148507 145654 143245 141088 139098 137221 135542 134314 133650 133269 132733 131939 131253 131160 131833 133042 134409
65691 134409 135727 137035 138460 140029 141672 143330 144953 146465 147860 149306 151024 153016 155048 156951
65677 156951 158800 160798 163190 166403 171063 177600 185885 195449 206018 217674 230541 244652 260117
65664 260117 277089 295341 314140 332781 351046 368883 385810 401009 413888 424204 431716 436293
65652 436293 438544 439804 441120 442464 443337 443850 444768 446561 448930 451380 453781 456097 457751 457694 455170
65637 455170 450314 443825 436096 426750 415097 400918 384628 366735 347531 327450 307396 288358
65625 288358 270795 254622 239639 225706 212661 200513 189740 181006 174410 169239 164548 159811
65613 159811 155000 150379 146366 143357 141443 140350 139763 139559 139711 140097 140491 140617 140181 139098 137760 136872
65597 136872 136808 137223 137407 136919 135790 134286 132695 131355 130718 131240 133096 135956 139123 142007 144471 146656
65581 146656 148666 150646 153056 156485 161105 166573 172628 179650 188536 200060 214278 230396 247194
65568 247194 263817 280191 296580 312888 328624 343346 356713 368196 377191 383506 387248 388143
65556 388143 385481 378943 369076 356742 342589 327330 311948 297063 282332 267023 251147 235722
65544 235722 221994 210583 201153 192677 184280 176143 169393 164880 162274 160626 159427 158762 158745 159311 160391
65529 160391 161814 163132 163944 164327 164613 164889 164970 164591 163225 160116 155132 149440 144683 141482 139245 137310
65513 137310 135590 134061 132353 130182 127793 125783 124772 125211 127012 129268 130808 131165 130685 129845 129039
65498 129039 128974 130377 133000 135555 137034 137613 137950 138230 138427 138935 140316 142668 145755 149498 153879 158616
65482 158616 163346 167961 172340 176036 178652 180381 181720 182852 183672 184156 184169 183102 180379 176314 171946
65467 171946 167922 164033 159952 155887 152256 149078 146065 143121 140495 138461 136979 135620 133825 131333
65453 131333 128408 125643 123596 122650 123008 124517 126521 128180 129054 129328 129467 129786 130295 130866 131553 132764
65437 132764 134954 137998 141075 143424 145105 146839 149233 152390 156044 159672 162526 164015 164192 163629 162780
65422 162780 161677 160193 158292 155998 153467 151144 149554 148772 148325 147705 146801 145836 145153 145103 145825 146987
65406 146987 147997 148568 148811 148820 148531 148100 148006 148489 149238 149909 150658 151861 153561 155551 157804 160485 163650
65389 163650 167214 171006 174457 176433 175952 173233 169667 166580 164244 162179 160127 158495 157961 158766 160313
65374 160313 161465 161421 160474 159764 160183 161625 163328 164749 165872 166850 167785 169024 171283 175052 179864 184545
65358 184545 188352 191717 195695 200915 207267 214378 221942 229684 237450 245437 253847 262129 269010 273635
65344 273635 276352 278013 278872 278642 277315 275234 272374 268266 262866 256992 251532 246572 241544 235941 229577
65329 229577 222432 214610 206419 198269 190555 183776 178558 175241 173484 172463 171439 169998 167945 165301
65315 165301 162443 159968 158213 156999 155980 155138 154804 155099 155492 155119 153664 151705 150032 148811 147760
65300 147760 146973 146976 147818 148729 149078 149259 150112 151809 153980 156711 160523 165145 169055 170785 170374 169124 168143
65283 168143 167524 166742 165373 163373 161020 158753 156951 155773 155199 155104 155137 154702 153424 151706 150525 150460 151027
65266 151027 151195 150498 149418 148701 148551 148667 148878 149387 150346 151533 152687 153944 155568 157327 158545 158928
65250 158928 158969 159292 159839 160070 159829 159513 159321 158765 157262 154926 152400 150041 147665 145200 143132 142010
65234 142010 141725 141605 141175 140553 140157 140267 140871 141707 142400 142829 143356 144434 145913 147087 147501 147348 146929 146194
65216 146194 145135 144154 143525 142873 141805 140814 140801 141768 142765 143175 143295 143475 143531 143483 144069 145806 147995 149412
65198 149412 149698 149411 148981 148377 147708 147335 147223 146853 146014 145128 144557 144123 143694 143762 144857 146613 147997 148498
65180 148498 148671 149336 150578 151808 152622 153226 153958 154692 155003 154864 154787 155162 155699 155767 155125 154052 152879 151762
65162 151762 150907 150689 151358 152816 154821 157251 159983 162658 164871 166567 168077 169579 170754 171235 171378
65147 171378 172266 174744 178680 183410 188697 194795 201665 208727 215553 222318 229258 236136 242693 249299
65133 249299 256598 264598 272537 279597 285442 290164 294117 297717 301064 303795 305641 306944 308159 308988
65119 308988 308590 306683 303887 300868 297587 293575 288540 282557 276053 269702 263902 258185 251566 243685
65105 243685 235198 226904 218984 211350 204258 198137 193092 188903 185240 181669 177809 173793 170237 167442
65091 167442 165030 162700 160881 160099 160060 159937 159378 158699 158249 158163 158594 159661 161205 162966 164849 166548 167213
65074 167213 166236 164319 163031 163172 164187 165252 166152 166852 166988 166375 165522 165042 164835 164307 163152 161536 159818
65057 159818 158593 158719 160615 163526 166068 167618 168661 169676 170333 170175 169574 169292 169309 168785 167323 165656
65041 165656 164700 164383 163901 162913 161861 161125 160516 159785 159155 158939 158935 158600 157606 155913 153488 150405 147123 144310
65023 144310 142345 141265 141068 141686 142707 143581 144200 144922 145918 146887 147561 148122 148846 149671 150411 151196 152338
65006 152338 153883 155679 157863 160915 164987 169355 172837 174846 175941 177167 178906 180544 181341 181371 181406
64991 181406 182041 183269 184807 186429 187898 188948 189566 190106 190953 192227 193955 196304 199392 202919 206186
64976 206186 208491 209454 209043 207469 205072 202237 199343 196670 194217 191693 188834 185750 182790 180122 177671
64961 177671 175466 173709 172385 171136 169793 168754 168531 169023 169579 169679 169239 168294 166763 164730 162649 161043
64945 161043 160059 159503 159189 159093 159192 159425 159881 160800 162200 163589 164278 163964 162870 161421 160052 159263 159435 160405
64927 160405 161559 162556 163641 164939 165816 165452 163838 161717 159694 157960 156802 156639 157365 158216 158622 158774
64911 158774 159133 159806 160739 162106 164127 166763 169900 173590 177809 182206 186387 190211 193624 196537 199244
64896 199244 202649 207623 214244 221906 229923 237724 244824 251094 256955 262819 268489 273482 277776 281804
64882 281804 285816 289702 293258 296163 297812 297700 295922 292830 288373 282409 275589 269205 263949 259433
64868 259433 255065 250820 246974 243658 241005 239233 238222 237406 236343 235026 233443 231291 228382 224880
64854 224880 220886 216307 211442 207112 203744 200861 197911 195080 192676 190278 187309 184095 181487 179608
64840 179608 177832 175909 174224 172889 171514 170147 169595 170329 171650 172511 172715 172782 172930 172789 172110 171343 171331
64823 171331 172545 174627 176704 178208 179324 180525 181942 183525 185664 188985 193513 198612 203959 209972
64809 209972 216898 224137 231021 237907 245757 254771 264006 272375 279549 285800 291289 295582 297738 297039
64795 297039 293864 289604 285303 280560 274236 266142 257467 249556 242838 237102 232232 228302 225323 223239
64781 223239 222016 221531 221541 221925 222739 223967 225476 227297 229589 232178 234621 237040 240385 245403 251611
64766 251611 257871 263743 269678 276036 282693 289679 297416 305850 313932 320633 326203 331833 338052 344001
64752 344001 348477 351351 353653 356441 359845 363174 365682 367055 367258 366162 363526 359347 354012 347987
64738 347987 341399 334070 325965 317440 308937 300590 292367 284601 278097 273424 270177 267236 263868 260393
64724 260393 257707 256271 255729 255338 254589 253454 252305 251698 252107 253698 256246 259230 262092 264642 267327
64709 267327 270867 275378 280009 283739 286383 288394 289656 289129 285985 280680 274402 267730 260453 252599
64695 252599 244952 238274 232551 227417 223036 220048 218645 218104 217331 215707 213366 210880 208809 207466 207024
64680 207024 207748 209954 213556 217882 222261 226780 232052 238139 244236 249746 255340 262379 271386 281537
64666 281537 291656 301099 309493 316189 320603 322947 324021 324131 322547 318347 311617 303558 295488 288050
64652 288050 281450 276010 271997 269043 266299 263404 260907 259448 258916 258859 259414 261192 264324 268296 272853
64637 272853 278450 285569 294071 303574 314027 325525 337923 350998 364663 378609 392007 404001
64625 404001 414222 422378 427626 428984 426279 420235 411682 401179 389271 376539 363273 349550 335682
64612 335682 322205 309478 297695 287178 278162 270393 263500 257643 253076 249175 244887 240338 237030
64599 237030 235961 236389 236972 237315 237733 238224 238612 239187 240331 241841 243427 245549 248854 253042 257224 261250
64583 261250 265781 271127 276983 283335 290560 298375 305703 312041 318122 324704 331415 337328 342040 345598
64569 345598 347932 349011 349114 348283 345843 341128 334390 326441 317704 308260 298570 289330 280658 272078 263363
64554 263363 254891 247187 240662 235738 232537 230369 228180 225745 223857 223096 222974 222608 221799 221130 221396 223208
64538 223208 226619 230658 233697 234868 234885 234936 235032 234106 231626 228341 225303 222802 220562 218444 216502 214676
64522 214676 212918 211500 210793 210734 210762 210408 209825 209702 210657 212663 215023 216998 218527 220187 222369 224684
64506 224684 226400 227397 228441 230517 234061 238881 244607 251023 258073 265779 274253 283684 294062 304791
64492 304791 314691 322636 328291 332160 334809 336212 335943 333851 330321 325909 321007 315940 311167 307115
64478 307115 303854 301090 298509 296008 293496 290661 287112 282780 278023 273290 268808 264633 260780 257217
64464 257217 253999 251656 251118 252785 255749 258472 260262 261583 262862 263737 263838 263614 263722 264011 263852 263230
64448 263230 262782 262811 262981 263054 263272 263866 264768 266012 267897 270520 273678 277487 282562 289237 297073 305588
64432 305588 315090 326297 339446 354250 370625 389033 410228 434960 463751 496608 533206 573778
64420 573778 619723 672857 734092 803112 879070 960999 1047436 1136190 1224790 1311064 1393251
64409 1393251 1469875 1539614 1601120 1652815 1692955 1719916 1732519 1730368 1714205 1685733 1646648
64398 1646648 1597721 1539014 1470925 1394802 1312653 1226656 1138983 1051716 966747 885870 810829
64387 810829 742884 682237 628200 580070 537662 501027 470001 444116 422623 404490 388746
64376 388746 375031 363543 354221 346239 338577 330935 323824 317808 312878 308524 304194 299587 294599 289133
64362 289133 283104 276604 269925 263351 257107 251614 247504 245076 243942 243537 243817 245058 247126 249557 252370
64347 252370 256237 261553 267749 273752 278811 282723 285593 287620 288865 289028 287728 285085 281660 277698
64333 277698 272910 267227 261334 256040 251476 247362 243748 241062 239565 239110 239322 239721 239941 240125 240838 242248
64317 242248 243671 244382 244605 245197 246583 248558 250910 253526 255903 257280 257448 256825 255552 253041 248754
64302 248754 243029 236844 231098 226290 222562 219720 217453 215769 214971 214990 215058 214391 213043 211769 211200 211441
64286 211441 212402 214166 216893 220551 224847 229421 234082 238840 243732 248759 254111 260220 267228 274471
64272 274471 281019 286873 293148 300754 309268 317415 324244 329325 332206 332524 330759 328181 325816 323876
64258 323876 322343 321483 321429 321720 321807 321721 321657 321047 318679 313866 307087 299300 291045 282413 273526 264749 256597
64241 256597 249661 244377 240587 237545 234688 232282 230927 230521 230230 229559 228963 229130 229990 230822 231145 231144 231224
64224 231224 231456 231559 231268 230677 230243 230404 231056 231478 230964 229532 227880 226609 225669 224576 222994 220974 218767
64207 218767 216581 214563 212894 211797 211420 211656 212144 212524 212795 213337 214504 216228 218199 220399 223285 227301
64191 227301 232353 237986 244038 250890 259022 268607 279621 292048 305682 319929 334103 347807 360671
64178 360671 371772 379731 383595 383386 379739 373296 364583 354146 342488 329974 317061 304450 292817
64165 292817 282454 273344 265448 258683 252698 246979 241316 236057 231823 229026 227576 226935 226498 226055 225947
64150 225947 226651 228230 230272 232334 234355 236595 239264 242330 245583 248800 251792 254475 257053 260001
64136 260001 263507 266879 268871 268858 267443 265602 263566 261025 258162 255774 254312 253474 252880 252526 252446 252571
64120 252571 253294 255421 259073 263268 267309 272027 278788 287605 297218 306916 317286 328962 341521 353960
64106 353960 365627 376213 385363 392807 398689 403389 407178 410277 413048 415933 419343 423743 429615 437102
64092 437102 445767 454802 463318 470456 475503 478127 478413 476608 472919 467559 460713 452426 442725 431871
64078 431871 420270 408160 395708 383416 372057 362105 353520 346147 339935 334646 329819 325307 321507
64065 321507 318776 316899 315405 314096 312968 311996 311391 311778 313560 316209 318708 320776 323225 327015 332241
64050 332241 338217 344279 350287 356453 362963 369905 377530 386426 397225 410090 424580 439952 455486
64037 455486 470615 485063 498822 511649 522459 529696 532620 531892 528580 523030 515244 506028 496879
64024 496879 488597 480716 472674 465074 459251 455777 453877 452238 450008 446951 443046 438258 432512 425633
64010 425633 417388 407931 398183 389388 382057 375614 369311 363195 357801 353152 348642 343912 339299 335307
63996 335307 332155 330025 329191 329502 330153 330491 330790 331753 333497 335544 337711 340390 343912 348097 352658 357656
63980 357656 363357 369886 377166 385066 393447 402251 411600 421627 432137 442645 452895 463189 474083
63967 474083 485860 498515 512129 527040 543540 561504 580476 600224 621200 644407 670805
63956 670805 700930 735094 773828 817988 868543 926454 992771 1068724 1155705 1255113 1368100
63945 1368100 1495239 1636397 1791008 1958498 2138429 2330198 2532618 2743618 2960259
63936 2960259 3179005 3395996 3606984 3807060 3990841 4153372 4291038 4401574 4483300 4534570
63926 4534570 4553934 4540614 4494718 4417189 4309826 4175406 4017635 3840836 3649573 3448431
63916 3448431 3241887 3034013 2828239 2627563 2435028 2253639 2085455 1930949 1789615
63907 1789615 1661063 1545196 1441518 1349023 1266966 1195195 1133413 1080554 1035243 996524 963755
63896 963755 936141 912843 893306 877043 863247 850981 839629 828806 818068 807107 796075
63885 796075 785268 774614 763860 753193 743210 734410 727155 722048 719770 720527 724141 730719 740696
63872 740696 754095 770327 788918 809958 833544 859212 886268 914377 943432 973040 1002414
63861 1002414 1030741 1057449 1082275 1105185 1126146 1144855 1160755 1173238 1181708 1185608 1184759 1179652
63849 1179652 1171011 1159047 1143526 1124591 1102968 1079149 1052887 1023831 992270 958900 924234
63838 924234 888607 852478 816275 780131 744145 708772 674664 642249 611748 583375 557185
63827 557185 532939 510385 489513 470195 451929 434383 418016 403580 391059 379620 368597
63816 368597 358022 348191 339221 331130 323829 316839 309587 302244 295795 290897 287083 283549 280329 278054
63802 278054 276757 275583 273773 271398 268970 266774 264851 263243 261864 260337 258324 255985 253823 252135
63788 252135 250817 249667 248605 247625 246776 246236 246113 246107 245608 244279 242345 240224 238145 236292 235023 234584
63772 234584 234735 234940 234899 234657 234249 233521 232324 230712 228954 227442 226499 226109 225989 226083 226710 227859 228583 227715
63754 227715 225241 222516 220992 221067 222215 223706 225005 225905 226669 227801 229425 231050 232109 232538 232669 232906
63738 232906 233708 235559 238545 242107 245490 248314 250578 252297 253486 254378 255432 257145 259928 263899 268654
63723 268654 273450 277864 282099 286575 291490 296830 302345 307248 310532 312050 312891 314125 315567 316360 316356
63708 316356 316082 315592 314314 312129 309711 307617 305819 304447 304168 305302 307154 308807 310150 311573 313061
63693 313061 314181 314773 315106 315480 316198 317773 320593 324285 327852 330552 332361 333582 334369 334746 334764 334506
63677 334506 334114 333867 334023 334490 334898 335060 335141 335294 335444 335636 336312 337863 339967 341685 342316 341960 341176 340252
63659 340252 338978 337021 334350 331201 327733 323848 319420 314681 310258 306802 304582 303422 302888 302492 301888
63644 301888 301118 300664 301050 302327 304071 305901 307781 309781 311849 314051 316792 320486 325110 330395 336272
63629 336272 342709 349213 355097 360485 366556 374396 383859 393867 403625 413267 423503 435061 448367
63616 448367 463377 479637 496759 514869 534483 556007 579502 604771 631470 659283 688310
63605 688310 719073 751741 785384 818354 849299 877381 901588 920578 933538 940791 943250 941666
63593 941666 936765 929771 922192 914939 907780 899558 888882 874947 858033 839069 818526 795932 770741
63580 770741 743392 715122 686994 659651 633889 610701 590518 572901 557350 544029 533443
63569 533443 525776 520942 518996 519939 523210 527851 533238 539291 545987 553155 560924 569881 580353 591786
63555 591786 603278 614720 627060 641434 658346 677802 699842 724682 752507 783521 818222
63544 818222 857212 900332 945819 990455 1030782 1064344 1089931 1106975 1115146 1114834 1107768 1096690
63532 1096690 1084116 1071451 1059189 1047591 1036851 1026673 1015986 1003227 986955 966340 941275
63521 941275 912141 879424 843605 805434 766246 727764 691354 657432 625668 595818 568304
63510 568304 543856 522669 504087 487209 471634 457529 445167 434611 425688 417970 410841 403890
63498 403890 397236 391210 385769 380607 375826 372002 369405 367604 366127 365052 364588 364415 363966 363165 362396
63483 362396 361917 361810 362446 364429 367887 372210 376613 380696 384307 387234 389312 390751 392091 393751 395581
63468 395581 396883 396956 395696 393508 390705 387323 383695 380627 378457 376314 373063 368935 365495 363875 363754
63453 363754 364226 364937 365891 366832 367536 368491 370610 374309 379320 385345 392454 400756 410094 420217 431091
63438 431091 442989 456433 472107 490696 512706 538411 567859 600697 635844 671361 704778
63427 704778 733813 757105 774483 786728 795257 802002 809131 818350 830371 845324 863656 886262
63415 886262 913737 945864 981839 1020490 1060000 1097910 1131907 1160550 1183149 1199280 1208740 1211806
63403 1211806 1209261 1202329 1192738 1182364 1172294 1162217 1150953 1137385 1120653 1099913 1074585 1044874
63391 1044874 1011591 975417 936746 896283 855364 815451 777493 741920 709039 679267 652947
63380 652947 630027 610008 592440 577494 565799 557556 552143 548861 547711 549016 552596 557911 564861
63367 564861 573846 585052 598333 613794 631787 652149 674170 697726 723798 753257 785598 819538
63355 819538 854625 891513 930639 971202 1011656 1050654 1087182 1120024 1147571 1168390 1181954
63344 1181954 1188861 1190311 1187421 1181077 1172353 1162610 1152810 1142763 1131306 1117273 1100150 1079793 1055934
63331 1055934 1028210 996630 961830 924883 887010 849439 813336 779643 748882 721139 696442
63320 696442 675258 658499 646682 638894 632786 625890 616983 605978 592755 576686 557592 536679
63308 536679 515931 496591 478626 461640 445847 431937 420354 410986 403340 396773 390666 384702
63296 384702 379010 373979 369928 366944 364824 363089 361221 359048 356775 354607 352538 350563 348766 347046
63282 347046 345071 342779 340587 338765 336910 334514 331857 329823 328910 328894 329317 329766 329644 328397 326303 324530
63266 324530 324055 324766 325911 327052 328207 329274 329905 330038 330302 331653 334586 338710 343102 347131 350901
63251 350901 354910 359447 364488 369955 375737 381531 387107 392801 399336 407052 415622 424622 434017 443922
63237 443922 454292 465129 476679 489174 502657 517281 533393 550976 569332 587709 605928
63226 605928 624012 641586 658310 674727 691958 710461 729682 749004 768463 788273 808193
63215 808193 827755 846732 864985 882059 897250 909913 919423 925004 926044 922589 915234 904490
63203 904490 890455 873138 852973 831029 808855 788031 769541 753483 739493 727522 718051 711591
63191 711591 708257 707956 710767 716862 726223 738663 754060 772321 793175 816293 841582 869060 898361
63178 898361 928734 959652 991081 1022934 1054656 1085754 1116436 1147113 1177303 1205647 1231172
63167 1231172 1253967 1274262 1291229 1303194 1308911 1308207 1301383 1288360 1268616 1241809 1208321 1169278
63155 1169278 1126103 1080085 1032336 984036 936475 890736 847446 806922 769449 735286 704509
63144 704509 677032 652749 631489 612841 596244 581349 568224 557103 547955 540362 533806 528028
63132 528028 523043 518819 515082 511541 508272 505726 504357 504284 505295 507038 509216 511711 514595 517945 521655
63117 521655 525560 529636 533916 538210 542195 545837 549438 553184 556888 560331 563603 566830 569810 572209
63103 572209 573983 575322 576243 576583 576442 576324 576706 577589 578585 579383 580049 580838 581733 582294 582123 581397 580673 580119
63085 580119 579363 578283 577549 577930 579288 580751 581816 582840 584443 586915 590319 594694 599934 605761 612038
63070 612038 618836 626006 633034 639698 646642 654950 665204 677223 690615 705221 721092 738439 757710
63057 757710 779379 803396 829070 855792 883807 914038 947163 983071 1021235 1061316 1103247
63046 1103247 1146908 1191974 1238004 1284501 1330937 1376957 1422594 1468100 1513616 1559249 1605406
63035 1605406 1652569 1700502 1747957 1793550 1836771 1877702 1915793 1949325 1976227 1995130 2005444
63024 2005444 2006737 1998515 1980739 1954268 1920503 1880641 1835577 1786600 1735825 1685535 1637209 1591633
63012 1591633 1549901 1513726 1484485 1462452 1447327 1439149 1438195 1444332 1457137 1476592 1502969 1535946
63000 1535946 1574410 1617365 1664494 1715546 1769564 1825171 1881392 1937852 1994378 2050853 2107380
62989 2107380 2164156 2220970 2276936 2330774 2381196 2426966 2466735 2498962 2522054 2534549 2535181 2522898
62977 2522898 2497075 2457854 2406199 2343477 2271078 2190557 2104017 2014038 1923055 1832851 1744582
62966 1744582 1659129 1577451 1500685 1429849 1365292 1306527 1252800 1203682 1158897 1117795 1079586
62955 1079586 1044084 1011655 982195 954584 927542 900763 874952 850940 828996 808744 789453
62944 789453 770517 751946 734287 717953 702800 688536 675227 663073 651888 641219 630966
62933 630966 621541 613380 606518 600655 595465 590811 586752 583290 580124 576870 573674 571254 570007 569335
62919 569335 568327 566923 565816 565156 564045 561681 558528 555846 554208 552983 551312 549125 546944 544946
62905 544946 542612 539365 535250 530812 526477 522317 518366 514869 512110 510237 509323 509398 510262 511412 512347
62890 512347 512892 513147 513324 513656 514253 514885 515148 515028 515024 515528 516311 516929 517376 517959 518726 519433 520004 520629 521407
62871 521407 522202 522748 522613 521272 518678 515710 513532 512463 511925 511499 511403 511775 512063 511584 510373 509106 508332
62854 508332 508041 507859 507507 507121 507162 507847 508773 509367 509660 510173 511036 511750 511912 511612 510919 509568 507558 505493
62836 505493 503881 502491 500874 499043 497172 495125 493030 491880 492661 494984 497397 499077 500456 502139
62822 502139 504033 505761 507216 508356 509097 509780 511216 513759 516727 519173 520899 522357 523954 525980 528883
62807 528883 532968 537817 542500 546424 549694 552732 555922 559644 564292 570121 577252 585722 595286 605251
62793 605251 614960 624560 634940 646751 659859 674023 689848 708655 731404 758084 788250 821888
62781 821888 859498 901460 947691 998059 1052876 1112622 1177115 1245196 1315294 1386125 1456667
62770 1456667 1525679 1591464 1652065 1705514 1749955 1783806 1805961 1815869 1813498 1799298 1774103 1738899
62758 1738899 1694723 1642862 1585003 1522963 1458310 1392387 1326541 1261965 1199290 1138688 1080468
62747 1080468 1025293 973772 926171 882673 843543 808710 777465 748955 722842 699220 678064
62736 678064 659170 642548 628369 616452 606222 597366 590237 585365 582731 581678 581354 581140 580897 581065
62722 581065 582411 585417 589947 595621 602397 610562 620249 631243 643346 656731 671891 689332 709354
62709 709354 732033 757434 785901 818087 854600 895663 941309 991853 1047973 1110311 1179204
62698 1179204 1254702 1336563 1424140 1516574 1613278 1714024 1818356 1925032 2032072 2137009
62688 2137009 2236819 2328004 2407253 2472079 2520611 2551054 2561946 2552983 2525085 2479379 2416611
62677 2416611 2337969 2246238 2145617 2040285 1933232 1826287 1720785 1617934 1518800 1424267
62667 1424267 1335156 1252238 1176036 1106601 1043608 986730 935763 890289 849358 811841 777242
62656 777242 745931 718429 694550 673325 653662 635004 617504 601697 587848 575419 563280
62645 563280 550693 538122 526903 518080 511599 506549 502033 497795 494156 491457 489628 488334 487438 486974
62631 486974 486564 485281 482554 479058 476194 474595 473586 472246 470508 468869 467320 465167 461971 458354
62617 458354 455612 454598 455087 456238 457545 459186 461489 464420 467863 472199 478084 485546 493758 501901
62603 501901 509941 518343 527442 537588 549624 564559 582547 602627 623772 646038 670479 698014
62591 698014 728531 761054 794589 828586 862524 895307 925418 951813 974347 993074 1007331
62580 1007331 1015870 1017839 1013370 1003208 988062 968397 944628 917381 887626 856517 824963 793378
62568 793378 762013 731436 702477 675750 651499 629797 610527 593152 577003 561981 548613
62557 548613 537193 527266 518267 510306 503826 498711 494265 490017 486104 482790 480065 477823 476036 474607
62543 474607 473408 472697 473164 475197 478301 481563 484525 487278 489855 492038 493843 495762 498344 501790 506150
62528 506150 511657 518589 526979 536705 547726 559997 573402 588157 605219 625815 650471 678806
62516 678806 710390 745431 784481 827803 875274 926603 981323 1038744 1098159 1158864 1219698
62505 1219698 1278781 1333997 1383554 1425845 1459224 1482625 1496251 1501014 1497167 1484119 1461705 1431109
62493 1431109 1394342 1353419 1310420 1267745 1227604 1191301 1159300 1131782 1108870 1090650 1077460
62482 1077460 1069971 1068549 1072619 1081083 1093291 1109125 1128133 1149008 1170018 1189601 1206435 1219422
62470 1219422 1227896 1231679 1230640 1224246 1211741 1192733 1167527 1136900 1101693 1062636 1020536 976486
62458 976486 931780 887586 844814 804275 766747 732711 702184 674973 650973 630126 612301
62447 612301 597435 585664 576988 570974 567072 565117 565203 567127 570332 574415 579331 585055 591331 597836
62433 597836 604270 610221 615192 618849 620942 620990 618400 613034 605380 596115 585776 574899 563993 553155
62419 553155 542143 531095 520766 511743 503835 496660 490439 485622 481895 478179 473653 468371 462930
62406 462930 457986 454132 451703 450391 449328 447795 445747 443625 441919 441008 441141 442280 444026 445862 447506
62391 447506 449029 450735 452901 455592 458664 461977 465460 468917 471951 474384 476653 479557 483654 489135
62377 489135 496059 504224 512848 520958 528433 536328 545844 557203 569723 582765 596316 610789 626633
62364 626633 644115 663326 684366 707624 733762 763408 796973 834782 877125 924096 975683
62353 975683 1032093 1093420 1158569 1224836 1289083 1349236 1404285 1453130 1494165 1525986 1547969
62342 1547969 1560080 1562725 1556973 1544319 1525752 1501254 1470449 1433535 1391481 1345720 1297971 1250087
62330 1250087 1203636 1159567 1118334 1080090 1044692 1011904 981816 954819 930870 909142 888646
62319 888646 868867 849415 829490 808371 786226 763782 741202 717954 693960 670267 648277
62308 648277 628624 611084 595218 580796 567810 556400 546728 538770 532247 526863 522486 519060 516431
62295 516431 514371 512684 511325 510481 510516 511627 513594 515973 518442 520829 522975 524955 527322 530713 535167
62280 535167 540158 545255 550371 555448 560392 565386 570655 575802 580075 583590 587719 593805 601946 611472
62266 611472 622097 634030 647414 662427 679769 700364 724628 752535 784347 820688 861964
62255 861964 908220 959602 1016356 1078176 1143893 1211870 1280336 1347312 1410677 1468534 1519348
62244 1519348 1561742 1594535 1617042 1629041 1630458 1621415 1602533 1574730 1538618 1494527 1443255 1386422
62232 1386422 1325866 1263000 1198912 1134798 1072097 1012357 957006 906935 862201 822369 787187
62221 787187 756658 730491 707922 688246 671108 656124 642597 629929 618136 607766 599480 593684
62209 593684 590229 588316 587089 586499 587279 589938 594133 599245 605141 612108 620295 629503 639266 648950 658089
62194 658089 666864 675950 685623 695309 704194 711931 718582 724352 729717 735344 741354 746954 751303 754469
62180 754469 757096 759435 761333 763003 765140 768173 771866 775727 779546 783666 789055 796970 808161 822559
62166 822559 840159 861962 889402 922862 961350 1003652 1049081 1096830 1145195 1191924 1235046
62155 1235046 1273056 1304654 1328869 1345466 1354895 1357659 1353845 1343386 1326691 1304772 1278510 1247945
62143 1247945 1212706 1173333 1131759 1090226 1050059 1011824 976289 944530 917159 893966 874393
62132 874393 857953 844190 832713 823347 815919 809853 804336 798941 793762 789037 785108 782687 782543 784713
62118 784713 788423 792893 797753 802611 806789 809783 811490 811731 810123 806858 803104 799978 797366 794239
62104 794239 789930 784565 778364 771155 762764 753581 744545 736708 730763 726756 724222 722721 722339 723527
62090 723527 726485 730829 735915 741410 747510 754616 762827 771866 781585 792448 805240 820321 837396
62077 837396 856040 876160 897815 920898 945225 970717 997202 1024155 1050908 1077117 1102901
62066 1102901 1128544 1154245 1180204 1206931 1235334 1266319 1300088 1335752 1371732 1406479 1438758
62055 1438758 1467515 1491900 1511415 1525754 1534498 1537321 1534458 1526467 1513393 1494629 1469801 1439343
62043 1439343 1403919 1363726 1318852 1270044 1218701 1166218 1113626 1061715 1011149 962536 916637
62032 916637 874313 836025 801507 770203 741834 716279 693145 671912 652528 635454 621022
62021 621022 608879 598017 587259 575920 564254 553197 543416 534659 526174 517573 509079 501159 494199
62008 494199 488449 483942 480577 478472 478039 479382 481848 484562 487337 490640 494730 499215 503461 507077
61994 507077 509980 512315 514293 515914 516850 516847 516017 514421 511636 507295 501874 496278 490665 484410 477320
61979 477320 470145 463556 457370 451289 445842 441935 439782 438883 438796 439372 440331 441271 442162 443376 445066 446872
61963 446872 448377 449543 450560 451487 452253 452884 453543 454350 455241 456014 456522 456831 457248 458187 459982 462735 466220
61946 466220 470057 474174 479130 485700 494012 503377 513179 523736 535918 549984 565166 580494 595736
61933 595736 611332 627601 644243 660573 675982 690104 702710 713683 723127 731329 738409 744013
61921 744013 747469 748339 746743 743156 738084 732028 725617 719503 714136 709813 706982 706255 708015 712206 718675
61906 718675 727483 738528 750904 763111 774152 784216 793980 803386 811327 816458 818003 815876 810464
61893 810464 802438 792492 781005 768056 753850 738954 724058 709733 696481 684652 673981 663498
61881 663498 652303 640415 628650 617735 607760 598305 588811 578916 568774 559050 550379 542856 536276
61868 536276 530655 526192 522862 520558 519558 520282 522469 525206 528116 532048 538187 546815 557350 569246
61854 569246 582360 596636 612105 629262 648896 671276 695792 721588 748302 775945 804251
61843 804251 832460 859694 885272 908615 929024 945676 957759 964665 966289 963386 957518 950360
61831 950360 942977 935849 929480 924600 921690 920695 921540 924612 930340 938405 947787 957551 967170 976039 983137
61816 983137 987383 988044 984613 976605 963768 946336 924898 900191 873197 845170 817194 789776
61804 789776 763114 737698 714268 693167 674035 656330 639993 625401 612724 601555 591193
61793 591193 581252 571921 563722 557054 551850 547445 542811 537230 530985 525226 520863 517630 514489 510910
61779 510910 507439 504926 503562 502857 502328 501881 501622 501548 501510 501317 500858 500195 499545 499141 499080 499331 499837 500622 501813
61760 501813 503561 505947 508968 512557 516482 520233 523284 525602 527650 529659 531131 531470 530877 530123 529474
61745 529474 528452 526789 525002 523620 522282 520057 516494 512000 507368 503291 500235 498415 497777 498143 499242
61730 499242 500547 501362 501414 501267 501801 503278 505178 506984 508799 511071 513856 516588 518625 519969 521338
61715 521338 523434 526193 528865 530768 531752 532005 531773 531293 530632 529437 527211 524071 520839 518098 515512
61700 515512 512475 509092 505989 503361 500781 497899 494808 491668 488458 485214 482096 479125 476127 473017
61686 473017 469787 466217 462045 457587 453792 451355 449986 448762 447003 444654 442064 439649 437658 436076
61672 436076 434782 433780 433111 432514 431552 430211 429083 428642 428569 428101 426899 425295 423807 422803 422594 423406
61656 423406 424999 426523 427049 426312 424975 424179 424739 426559 428730 430342 431262 432047 433143 434417 435591 436845
61640 436845 438649 441081 443686 446081 448360 450639 452461 452970 451684 448879 445254 441464 437954 434928
61626 434928 432294 429723 426912 423799 420587 417672 415457 413972 412684 410938 408707 406746 405876 406201 406964
61611 406964 406966 405222 401655 397240 393159 389645 385988 381694 377115 372697 368182 363158 357948 353337 349642
61596 349642 346649 344255 342476 340881 338749 335949 333005 330136 326891 323045 319257 316400 314609 313428
61582 313428 312540 311891 311296 310477 309464 308578 307956 307365 306537 305503 304493 303618 302741 301738 300829 300502 300893
61565 300893 301377 301116 300052 299040 298927 299856 301544 303700 305812 306982 306616 305230 304123 304263 305717 307993
61549 307993 310459 312480 313688 314311 314868 315376 315223 314066 312540 311768 312331 314002 316260 318611 320454 321225
61533 321225 321013 320794 321631 323571 325583 326643 326677 326388 326415 326886 327537 327870 327215 325101 321855 318577 316231
61516 316231 314845 313861 313123 313095 314064 315600 317040 318228 319357 320242 320244 319058 317250 315799 315281 315623 316405
61499 316405 317114 317245 316539 315215 313819 312820 312402 312474 312616 312200 311009 309784 309688 311056 313030 314597 315602
61482 315602 316467 317356 318080 318584 318982 319224 319172 319035 319329 320383 322148 324454 327079 329554 331295 332075 332172
61465 332172 332039 332013 332284 332802 333178 333039 332534 332231 332483 333169 334013 334819 335349 335439 335333 335515 336040 336447 336503 336643
61445 336643 337420 338849 340469 341723 342113 341465 340397 340081 341099 342838 344451 346052 348371 351454 354399
61430 354399 356451 357793 359026 360290 361177 361302 360741 360000 359664 360109 361485 363856 367119 370769 374038 376514
61414 376514 378366 379783 380574 380625 380444 380650 381130 381234 380774 380221 379825 379177 377859 376044 374154 372389 370962
61397 370962 370366 370829 371681 371859 371051 369978 369446 369505 369663 369626 369528 369579 369788 370062 370389 370843 371447 372118 372711 373102
61377 373102 373262 373327 373599 374412 375934 378083 380665 383553 386671 389761 392296 393785 394282 394398 394653 394945
61361 394945 394907 394734 395194 396691 398747 400764 402897 405653 408907 412058 415181 419317 425286 432764 440819
61346 440819 448873 456722 464068 470684 476846 483020 489148 494663 499232 503144 506938 510927 515057 518938
61332 518938 522058 524265 526016 527793 529364 529974 529311 527879 526348 524937 523651 522730 522472 522797 523304 523788
61316 523788 524459 525698 527784 530921 535339 541148 548093 555626 563395 571673 581183 592476 605618 620346
61302 620346 636204 652417 667989 682224 694895 705688 713832 718718 720678 720584 718732 714605 707842
61289 707842 698895 688641 677772 666761 655999 645580 635248 624842 614619 604954 595994 587897
61277 587897 581116 576028 572361 569408 566830 565006 564527 565567 567759 570419 572830 574474 575239 575430 575593
61262 575593 576301 578009 580931 585017 590140 596323 603665 611940 620320 627675 633298 637389 640823 644347
61248 644347 647983 651139 653302 654548 655433 656403 657389 657978 657962 657580 657183 656814 656352 656028 656438 657859 659759
61231 659759 661240 661941 662362 663434 665921 670078 675583 681767 688132 694684 701703 709288 717275 725469 733674
61216 733674 741665 749505 757795 767137 777232 786918 795261 802223 808100 812817 816227 818789 821319 824124
61202 824124 826845 829235 831712 835056 839925 846759 855763 866680 878857 891850 905868 921284 937739
61189 937739 954079 969187 982604 994206 1003622 1010306 1014117 1015594 1015626 1014888 1013529 1011227 1007642 1002926
61175 1002926 997703 992394 986679 979854 971669 962561 953076 943332 933030 921769 909342 896045 882627
61162 882627 869649 856826 843393 829095 814378 799524 784237 768420 752879 738766 726649
61151 726649 716524 708364 702117 697435 693905 691412 689844 688632 687062 684875 682040 678135 672603 665564
61137 665564 657838 650181 643069 637168 633222 631298 630748 631220 633124 636854 642124 648513 656164 665483 676472
61122 676472 688896 702929 719137 737866 758947 781950 806456 832178 859044 887214 916821
61111 916821 947699 979403 1011414 1043272 1074670 1105512 1135750 1164996 1192376 1216832 1237577
61100 1237577 1254281 1266996 1275944 1281212 1282607 1279898 1273142 1262629 1248513 1230758 1209469 1185100
61088 1185100 1158286 1129703 1100112 1070282 1040727 1011639 983131 955391 928597 902836 878171
61077 878171 854679 832463 811696 792586 775151 759235 744872 732417 722040 713353 705891 699682
61065 699682 694891 691205 688189 686091 685571 686593 688326 690312 693141 697682 704059 711633 719685 727938
61051 727938 736765 746962 759115 773127 788609 805490 823869 843599 864648 887623 913188 941060
61039 941060 970392 1001043 1033614 1068277 1104522 1142172 1181667 1223157 1266312 1311243 1358663
61028 1358663 1408837 1461254 1515469 1571215 1627594 1683492 1739312 1797210 1859325 1926991 2001892
61017 2001892 2086265 2181290 2286894 2403946 2535177 2683550 2852073 3046403 3275323 3547211
61007 3547211 3868627 4248403 4700478 5240396 5882700 6646288 7560158 8659708 9980183
60998 9980183 11556362 13413762 15529658 17784148 19962057 21832687 23249628 24186077
60990 24186077 24695434 24867386 24828648 24748536 24783995 24980598 25225335 25310065 25050926 24359810
60980 24359810 23232954 21711656 19871846 17832854 15743196 13738335 11906721 10288359
60972 10288359 8892124 7708771 6716853 5889635 5202261 4633181 4161680 3768000 3436033
60963 3436033 3153833 2911689 2701295 2516323 2352124 2204973 2072598 1954698 1851413
60954 1851413 1761466 1682713 1613746 1553714 1501162 1454437 1412760 1375559 1341155 1307498 1274030
60943 1274030 1241613 1210890 1181891 1155007 1130962 1109703 1090295 1071964 1054489 1037835 1022235
60932 1022235 1008279 995929 983896 971113 958533 948170 940572 934472 928725 923261 918191 913425
60920 913425 909375 906718 905189 903785 902378 901976 903110 905205 907861 911511 916328 921609 926789 932020
60906 932020 937264 941952 946199 951239 957769 964688 970311 974112 976499 977697 977818 977476 977282 977003 975953
60891 975953 973902 970931 966725 960824 953404 945168 936606 927867 919105 910348 901175 891060 879971 868242
60877 868242 856026 843358 830628 818502 807416 797367 788096 779179 770158 760911 751769 743045 734738
60864 734738 726884 719871 713998 709077 704829 701361 698693 696088 692441 687354 681347 675096 668836 662504
60850 662504 656090 649784 644041 639348 635624 631927 627131 620898 613746 606282 598727 591082 583379 575673
60836 575673 568069 560739 553698 546638 539239 531611 524120 516888 509838 503203 497537 493021 489164 485449
60822 485449 482059 479649 478470 478034 477668 477145 476564 475777 474284 471880 469193 467266 466605 466835 467272 467515
60806 467515 467482 467223 466937 466931 467353 468076 468963 470061 471371 472647 473622 474231 474392 473726 471858 469063 466381 464887
60788 464887 464766 465076 464489 462395 459286 456034 453012 450114 447331 444728 441961 438492 434496 430977 428599
60773 428599 426908 425095 423087 421373 420080 418834 417415 416124 415541 416197 418197 420710 422149 421468 419369
60758 419369 417677 417487 418295 418945 418926 418543 418253 418175 418156 418130 418357 419249 420889 422913 424991 427167 429495 431597
60740 431597 433017 433838 434439 434739 434138 432179 428824 424102 418155 411779 406306 402502 399945 397811 395906
60725 395906 394451 393132 391010 387532 383236 379254 376282 374206 372553 371028 369520 367886 366052 364279
60711 364279 362992 362240 361599 360778 359992 359511 359117 358379 357266 356080 354960 353891 353130 353083 353686 354309 354417
60694 354417 354035 353550 353413 354002 355378 357051 358405 359425 360577 361990 363324 364651 366834 370574 375520
60679 375520 380790 385953 391022 395795 399872 403247 406350 409512 412744 416025 419377 422651 425585 428139
60665 428139 430420 432234 433053 432591 431195 429531 428064 426902 425981 425257 424781 424644 424797 424986 424950 424641 424213
60648 424213 423935 424222 425485 427620 429727 430730 430293 428877 426894 424210 420565 416090 411166 406073 401040
60633 401040 396457 392676 389684 387174 384915 382852 380986 379400 378428 378482 379571 381127 382485 383523 384681
60618 384681 386306 388067 389193 389306 388838 388478 388376 388233 388034 388198 388827 389288 389024 388473 388649 389861 391345
60601 391345 392216 392363 392335 392799 394245 396708 399424 401164 401427 401094 401475 402866 404464 405605 406476 407518
60585 407518 408600 409092 408524 406954 404888 402992 401771 401333 401547 402368 403865 405951 408388 411202 414841
60570 414841 419717 425776 432596 439775 447117 454630 462482 470832 479617 488628 497708 506436 513615 517698
60556 517698 518162 516066 512823 508792 503638 497670 491967 487179 483087 479607 477514 477616 479696 482864 486778
60541 486778 491938 498792 507061 516156 525957 536873 549173 562503 576119 589367 601713 612383
60529 612383 620386 625105 626683 625704 622733 618370 613431 608540 603599 598119 592085 586143 581006 577116
60515 577116 574889 574581 575657 576859 577387 577636 578342 579422 580296 581118 582916 586458 591678 598509 607706 620364
60499 620364 636924 657147 680949 708702 740623 776237 814681 855293 897581 940731 983398
60488 983398 1023920 1060445 1090824 1112857 1124960 1126571 1117776 1098810 1070255 1033602 991222 945613
60476 945613 898743 852068 806879 764466 725860 691366 660391 632064 606269 583806 565207
60465 565207 549654 535581 522220 510011 499477 490372 482190 474915 468776 463554 458584 453369 447915
60452 447915 442562 437689 433469 429785 426408 423257 420350 417557 414773 412281 410527 409450 408481 407294
60438 407294 406042 404661 402695 400234 398403 398187 399131 399866 399675 398907 398074 397279 396508 395848 395341 395043 395207
60421 395207 395917 396618 396572 395823 395239 395532 396636 398055 399327 400162 400657 401471 403269 405884 408436 410383 411969
60404 411969 413569 415151 416573 417908 419233 420482 421666 422852 423840 424379 424833 426017 428142 430540 432771
60389 432771 435301 438527 441734 443706 444158 444000 444398 446010 448846 452310 455533 458095 460351 462760 465208
60374 465208 467389 469506 472010 474858 477641 480239 482766 484918 486036 485870 484783 483227 481563 480379
60360 480379 480327 481383 482769 483834 484714 485982 488055 491028 494690 498554 502295 506347 511657 518631 526692
60345 526692 534996 543110 550683 556965 561187 563220 563425 562023 559037 554693 549453 543663 537526 531401
60331 531401 525742 520581 515353 509475 502994 496551 490776 485826 481518 477743 474570 472004 469822 467831
60317 467831 466120 464852 463949 463288 463167 464200 466601 469891 473490 477387 482076 488056 495597 504793 515649
60302 515649 528182 542553 558827 576393 593723 608951 620663 628171 631340 630434 625879 617907 606568
60289 606568 592330 576500 560719 546223 533763 523918 516884 512082 508541 505839 504220 503654 503254
60276 503254 501961 499528 496553 493717 491227 488826 486062 482599 478490 474148 469942 465890 461847 457971
60262 457971 454825 452962 452363 452273 451680 450097 447908 445912 444590 444014 444279 445589 447769 450117 452011 453482
60246 453482 454847 456015 456586 456624 456905 458152 460175 461956 462567 461888 460465 458841 457217 455761 454941 455201
60230 455201 456394 457895 459406 461267 463813 466790 469781 472908 476554 480542 484182 487219 490181 493627
60216 493627 497569 501908 506915 512774 519001 524987 530972 537857 545941 554437 562498 570282 578673 588228
60202 588228 598714 609389 619396 628128 635718 643069 650933 658922 665908 671394 675907 679857 682720
60189 682720 683854 683601 682820 681550 678989 674852 669973 665197 660277 654375 647332 639882 632783 626151 619689
60174 619689 613311 607463 602857 599715 597208 593985 589500 584610 580591 577835 575894 574452 573643 573436 573333
60159 573333 572874 572061 571082 569906 568322 566244 563946 562142 561684 562799 564691 566370 567804 569740 572309
60144 572309 574555 575683 576188 577309 579781 583535 588171 593134 597811 602091 606635 612076 618087 623781
60130 623781 628807 633463 637930 642108 646146 650320 654280 657207 659005 660592 662640 664686 666092 667274
60116 667274 669274 672424 676118 679747 683171 686299 688905 691023 693089 695426 697902 700158 701812 702269
60102 702269 700782 697054 691634 685445 679034 672537 666204 660545 655886 652044 648582 645269 642207 639699
60088 639699 638109 637646 638046 638518 638255 637079 635495 634146 633297 632821 632425 631821 630890 629767 628586 627036
60072 627036 624447 620422 615208 609256 602745 595808 588931 582667 576988 571372 565502 559579 553922 548700
60058 548700 544089 540279 537143 534207 531120 527968 525064 522771 521581 521951 523763 526234 528678 531151
60044 531151 534152 537908 542239 546938 551963 557323 563013 569015 575213 581355 587168 592393 596691 599737
60030 599737 601524 602283 602017 600413 597389 593356 588648 583078 576381 568797 560779 552416 543660 534936 526990
60015 526990 520177 514297 509057 504268 499660 495053 490706 487016 483818 480411 476377 472003 467851 464321
60001 464321 461650 459888 458761 457995 457895 459080 461468 464058 466025 467605 469532 472016 474703 477354 480059
59986 480059 482923 485992 489408 493211 496989 500038 501970 502970 503424 503457 502843 501262 498631 495256 491668
59971 491668 488231 484954 481649 478159 474520 471063 468409 467060 466885 467241 467684 468358 469591 471423 473697
59956 473697 476254 478744 480513 481081 480689 480122 480108 481009 482876 485438 488167 490703 493166 495856 498783 501768
59940 501768 504806 507907 510590 512045 511929 510740 509276 507913 506470 504581 502146 499527 497305 495674
59926 495674 494191 492384 490529 489467 489639 490730 492328 494488 497363 500697 504100 507619 511618 516180
59912 516180 521007 525956 531259 537012 542695 547444 550744 552635 553342 553004 551920 550740 550012 549575 548732
59897 548732 547149 545298 543896 543271 543543 545048 547987 551799 555497 558748 562142 566235 570824 575459 580124
59882 580124 584949 589627 593727 597464 601465 605768 609613 612525 615070 618120 621531 623984 624214 622185
59868 622185 618989 615653 612172 607749 601910 595122 588193 581425 574750 568532 563544 560010 557325 555087
59854 555087 553912 554652 557197 560779 565278 571458 579858 590114 601517 613469 625018 634655 641252
59841 641252 644974 646781 647291 646623 645147 643749 643200 643558 644234 644408 643418 641010 637293 632447 626655 620363
59825 620363 614250 608654 603311 597946 592762 587962 583206 578075 572773 567677 562485 556630 550488 545265
59811 545265 541601 539089 537343 536609 536862 537129 536362 534544 532407 530432 528608 526787 524801 522462 519814
59796 519814 517164 514627 512052 509623 508016 507555 507681 507664 507358 506765 505480 503293 500942 499529 499366 499905
59780 499905 500471 500423 499079 496409 493580 491921 491343 490569 488898 486969 485771 485659 486497 487995 489735 491453
59764 491453 493411 495946 498707 501094 503435 506763 511164 515335 518267 520574 523581 527758 532703 538083
59750 538083 543824 549674 555269 560548 565696 570840 576020 581182 585866 589297 591258 592613 594563 597559
59736 597559 601205 604910 608207 610702 612217 612914 613038 612712 612208 612079 612595 613325 613697 613762 613997 614566 615273
59719 615273 616091 617166 618330 619102 619273 619134 619008 618864 618510 617905 617186 616557 616205 616247 616704 617553 618743 620160
59701 620160 621679 623259 624833 626132 626990 627873 629670 632723 636432 640099 643772 647853 652138 655766 657978
59686 657978 658650 658212 657393 656837 656563 655924 654390 652175 649752 647004 643365 638715 633624 628716 624113 619519
59670 619519 614527 608856 602542 595867 589046 582233 576031 571432 568755 567073 565361 563894 563653 564573 565397
59655 565397 565422 565446 566600 569020 572154 575741 579878 584536 589493 594488 598985 602063 603018 602046 600009 597578
59639 597578 594795 591268 586652 581119 575551 571059 568073 566087 564437 563060 562184 561549 560352 558001 554686
59624 554686 551161 548068 545439 542794 539786 536654 533848 531271 528304 524667 520832 517367 514297 511424
59610 511424 508936 507232 506418 506413 507331 509261 511757 514073 515887 517358 518495 519060 519142 519262 519589 519577 518781
59593 518781 517668 517084 517107 516992 516173 514832 513411 512076 510884 510015 509425 508583 506973 504718 502277 499704
59577 499704 496808 494046 492466 492376 492608 491736 489690 487544 485879 484242 482314 480818 480679 481768 483115
59562 483115 484103 484839 485391 485420 484810 484139 484006 484196 484028 483404 483006 483385 484421 485901 488099 491321 495275
59545 495275 499475 504058 509469 515436 521075 526278 532285 540521 551489 565211 581856 600948 620327
59532 620327 636969 648971 656086 658522 656322 650292 642615 635748 630936 628146 627004 627280 628675 630763
59518 630763 633199 635754 638108 639794 640350 639415 636788 632493 626755 619847 612022 603516 594430 584674 574320
59503 574320 564045 554855 547227 540794 535028 529921 525810 522844 520920 519905 519643 519872 520370 521084 521977
59488 521977 522941 524050 525661 527953 530532 532808 534706 536755 539583 543557 548877 555700 564027 573577
59474 573577 583830 594206 604218 613496 621589 627854 631788 633545 633905 633614 632968 632091 631284 630921 631312
59459 631312 632912 636382 642056 649526 658066 667306 677242 687816 698918 710677 723330 736817 750837
59446 750837 765236 779834 793804 805575 813510 816508 814113 806629 795365 782347 769264 756633
59434 756633 744112 731462 719028 707397 696866 687306 678426 670038 662172 655122 649498 646030 645112
59421 645112 646592 650338 656946 667414 681908 699285 718195 738348 760427 785220 813241 844392
59409 844392 876751 905811 926260 935308 933869 924472 909070 889433 868548 850209 837235 830717
59397 830717 830403 834599 839722 841304 836291 824167 805969 783098 757337 730897 705477 681598 659482
59384 659482 640074 624467 612655 603720 597080 592708 590166 588430 586920 585961 585884 586428 587379 589064 591578
59369 591578 594202 596343 598615 602138 607029 612437 617920 623918 630765 638088 645475 653076 661217 669924
59355 669924 679172 689142 699903 711225 723028 735642 749344 764048 779781 796963 815659 834904
59343 834904 853404 870802 887723 904661 921315 936876 950358 960609 966689 968635 967408 963772
59331 963772 957501 948022 935552 921057 905223 887952 869097 849327 829862 811474 794077 777372
59319 777372 761595 747360 734969 724200 714745 706551 699656 693921 689046 684674 680425 676096 672033
59306 672033 669113 668116 669189 672059 676597 682952 691313 701855 714736 729648 745146 758721 767904
59293 767904 771408 769266 762117 750627 735674 718768 701849 686406 672842 660886 650500 642109
59281 642109 635954 631718 629065 628283 629945 634006 639601 645868 652738 660786 670484 681827 694630 708909
59267 708909 724705 741477 757875 772323 783879 792450 798323 801715 802737 801388 797426 790533 780899
59254 780899 769517 757602 745737 733737 721276 708489 696021 684714 675283 668094 663103 659995
59242 659995 658394 657955 658358 659289 660520 662087 664396 668005 673089 679135 685289 690993 696139 700736 704638
59227 704638 707549 709047 708702 706561 703386 699952 696041 690650 683420 675336 667718 660956 654647 648602
59213 648602 643210 639002 636270 635017 634848 634934 634446 633099 631182 629154 627328 625780 624363 622899 621478
59198 621478 620380 619685 619219 618944 618938 618818 617775 615614 613301 611964 611666 611650 611402 610921 610327 609937 610506 612626
59180 612626 615900 619337 622435 625280 627841 630045 632513 636223 641164 646228 650792 655626 661691 668798
59166 668798 676173 683854 692653 702890 713853 724581 734659 744109 752799 760149 765363 767943 767971 765841
59152 765841 761745 755683 747966 739347 730453 721337 711782 701775 691472 680994 670554 660594 651435
59139 651435 642919 634703 626780 619393 612483 605666 598849 592493 587083 582584 578659 575248 572624 570945
59125 570945 570057 569827 570408 572028 574688 578228 582567 587684 593493 599987 607463 616315 626551 637661
59111 637661 648899 659554 669150 677745 685912 693937 701111 706412 709901 712760 715739 718281 719571 719720
59097 719720 719326 718481 716969 715039 713156 711247 708946 706420 704198 702353 700605 699159 698550 698553 698018 696056
59081 696056 692810 688839 684310 679062 673074 666539 659778 653188 646999 641028 634922 628658 622487 616554
59067 616554 610912 605704 600849 595791 590240 584994 581185 578728 576327 573110 569442 566005 563034 560729
59053 560729 559495 559187 558858 557872 556703 556084 555950 555825 555677 555663 555416 554384 552738 551275 550407 549733 548598
59036 548598 546733 544378 542087 540440 539742 539987 541118 543145 545982 549441 553503 558331 563932 570114 576829
59021 576829 584202 592190 600638 609738 619884 630841 641557 651059 659089 665640 670452 673350 674650
59008 674650 674827 674117 672731 671042 669308 667670 666702 667451 670460 675204 680864 687156 693976 700806 707102
58993 707102 712921 718516 723636 727863 731429 735025 738806 742086 744026 744275 743022 740804 738256 735827
58979 735827 733743 732257 731683 732150 733712 736787 742037 749665 759344 770970 784800 800522 816921 832942
58965 832942 848512 863876 878824 893127 907024 920569 933068 943864 953073 960768 966071 967943
58953 967943 966342 961596 953195 940432 924022 905906 887499 869142 851183 834338 818750 803683
58941 803683 788616 773969 760611 749214 740172 733363 727855 722494 716947 711699 707136 703394 700921
58928 700921 700140 700366 700036 698410 696283 694662 693523 692328 691035 690031 689533 689536 689964 690480 690528 689966 689353
58911 689353 689331 690034 691324 693237 695978 699813 705119 712218 721004 731118 742541 755611 770380 786457
58897 786457 803509 821229 838704 854619 868583 881651 895096 909257 924012 939750 957082
58886 957082 975980 995892 1016553 1038006 1059813 1080757 1099447 1114969 1127104 1136197 1142678 1146317
58874 1146317 1146083 1141127 1131870 1119725 1105750 1089975 1072095 1052472 1032261 1012834 995246 979950
58862 979950 966644 954418 942419 930510 919092 908188 897003 884684 871322 857798 844686
58851 844686 831825 819008 806509 794597 783071 771701 760759 750589 740954 731421 722132 713591
58839 713591 705805 698229 690549 682937 675536 668301 661402 655197 649612 644107 638542 633633 630251 628553
58825 628553 628058 628342 629384 631339 634152 637452 640897 644711 649658 656218 663969 671999 679678 686628 692286
58810 692286 696233 698912 701365 704098 706685 708526 709474 709572 708710 706739 703606 699239 693680 687383 680956
58795 680956 674525 667746 660477 653010 645599 638308 631416 625447 620585 616511 612959 610058 608080 607315
58781 607315 608202 610941 614867 618915 622901 627638 633422 639134 643327 645582 646231 645354 642829 638996 634439
58766 634439 629133 622516 614445 605602 596837 588594 581118 574830 570087 566729 564151 561944 560342 559882
58752 559882 560706 562416 564632 567417 570933 574948 578977 582787 586513 590409 594738 599741 605416 611497
58738 611497 617934 625086 633061 641212 648838 656092 663538 670998 677533 682556 686263 689033 691161 693214
58724 693214 695892 699260 702695 705789 708755 711906 715341 719286 724088 729673 735543 741432 747417 753330
58710 753330 758724 763505 767911 771708 774175 775042 774623 772797 768750 762096 753401 743095 730672 715628
58696 715628 698589 680900 663542 646987 631540 617224 603698 590825 579040 568844 560257 553041
58684 553041 546913 541263 535266 528757 522513 517312 513203 509946 507463 505378 502915 499946 497565 496943
58670 496943 498125 500532 504085 509019 515030 521510 528461 536465 545843 556285 567094 577287 585739
58657 585739 591733 595202 596146 594374 590309 585428 581046 576932 571936 565767 559366 553619 548524 543693
58643 543693 538965 534266 529432 524530 520130 516967 515318 514755 514549 514461 515080 517177 520742 524968 529078
58628 529078 532694 535426 536840 537096 536991 537028 537026 536939 537380 538851 541047 543485 546313 549975 554518 559774 565794
58611 565794 572539 579510 586238 592801 599317 605259 609815 612703 614219 614775 614755 614490 613985 612972 611455
58596 611455 609740 607722 604797 600907 596979 593855 591511 589921 589912 592310 596803 602528 609287 617324 626320
58581 626320 635618 645241 655792 667401 679403 690967 701461 710488 718219 725523 733180 741189 749348
58568 749348 758166 768558 780895 795068 811223 829748 850657 873696 898922 926573 956254 986660
58556 986660 1016048 1042774 1065657 1084198 1098256 1107393 1111060 1109711 1105092 1098934 1091893 1084176 1076420
58543 1076420 1069226 1062342 1055002 1046602 1036427 1023397 1006900 987478 965993 942675 917710 892162
58531 892162 867337 843665 821099 800310 782558 768562 758118 750510 744700 739675 735296 732343
58519 732343 731082 730425 729239 727724 726536 725352 723461 721174 719339 717839 715798 712970 709787 706355
58505 706355 702541 698778 695688 693113 690542 688143 686280 684497 682231 680128 679253 679192 678432 676607 674983
58490 674983 674657 675560 677389 680234 683985 688213 692948 698731 705732 713669 722625 733113 745330 759200
58476 759200 774962 792712 811439 829494 845959 860572 872499 880460 884136 884355 881750 876286 868227
58463 868227 858605 848557 839020 831064 825558 822422 821007 821223 823553 828203 835071 844286 855712 868145
58449 868145 880002 890579 899624 906054 908403 906391 900867 892419 881258 868218 854485 840481 826352
58436 826352 813355 803234 796223 791134 787456 785876 786600 788722 791607 795562 800861 807316 815024 824329
58422 824329 834861 845723 856650 867692 877767 884997 888657 889510 888182 884606 879113 872520 864900
58409 864900 855711 845335 835019 825102 814872 804434 795098 787488 780836 774597 769293 765278 762101
58396 762101 759669 758668 759266 760592 762018 763764 765886 767858 769535 771284 772858 773351 772558 771168 769433
58381 769433 766928 763811 761000 758968 757732 758025 760919 766125 772261 778961 787113 796907 807410 818275
58367 818275 830049 842447 854190 865019 876146 888268 900824 913600 927333 942264 957744
58356 957744 973542 989797 1005468 1018770 1029480 1038867 1047059 1052635 1055261 1056567 1057847 1058980 1060129
58343 1060129 1062211 1065015 1067177 1068870 1072360 1078953 1087504 1096755 1107074 1118990 1132116 1146389 1162402
58330 1162402 1179696 1196764 1213390 1230806 1248919 1265710 1280062 1292731 1303847 1312105 1317307 1321039
58318 1321039 1323949 1325103 1324968 1326003 1329084 1332379 1335095 1339228 1346045 1353984 1361866 1371155 1382950 1395656
58304 1395656 1407842 1420739 1435716 1451857 1468170 1485604 1504565 1522980 1539281 1555076 1572589
58293 1572589 1591579 1610964 1631276 1653266 1676093 1698941 1722469 1746937 1771175 1795060 1820536
58282 1820536 1848400 1876725 1904285 1932762 1963640 1995755 2027929 2061161 2096138 2131580 2167182
58271 2167182 2205134 2246562 2289595 2333077 2378833 2428002 2478755 2530146 2584515 2643381 2704659
58260 2704659 2766814 2832002 2902035 2974964 3048741 3124391 3202383 3279968 3355618 3432164 3512042
58249 3512042 3593564 3675495 3760914 3852580 3948791 4047946 4152810 4266017 4385781 4510515
58239 4510515 4643158 4786502 4938927 5099310 5271183 5457190 5654696 5861949 6083189
58230 6083189 6322310 6577201 6846060 7133376 7443507 7774540 8125134 8501214 8909036
58221 8909036 9348181 9818684 10328381 10885579 11491537 12148320 12866791 13658649 14528817
58212 14528817 15484896 16545805 17731963 19056891 20539443 22214769 24123125 26300741
58204 26300741 28795694 31681599 35043369 38964757 43545870 48917594 55224014 62614513
58196 62614513 71279330 81476197 93504379 107687913 124420331 144187874 167485803
58189 167485803 194691390 225929763 260753282 297565250 333276097 363876046 385827766
58182 385827766 397225102 397847346 388435832 370190604 344844080 314751437 282494777
58175 282494777 250253614 219492023 191071209 165473049 142910168 123368168 106665772
58168 106665772 92519696 80591745 70536341 62044681 54855587 48741825 43509360
58161 43509360 39008215 35125119 31762573 28833982 26272127 24025423 22045139 20285943
58153 20285943 18714981 17308513 16041694 14891094 13843502 12891889 12025347 11231755
58145 11231755 10506421 9848330 9250682 8703899 8204798 7753835 7345894 6972143 6628343
58136 6628343 6313171 6020913 5744019 5480954 5234103 5002096 4781395 4573094 4380615
58127 4380615 4202403 4033849 3874596 3727083 3589673 3458118 3332345 3215150 3105469
58118 3105469 2999450 2897094 2801607 2713145 2629064 2549343 2475934 2407585 2340926 2275935 2215067
58107 2215067 2157964 2102245 2048491 1999051 1952778 1906250 1859435 1814978 1772697 1730087 1687676
58096 1687676 1648508 1612534 1576604 1539996 1505083 1472561 1440768 1409910 1382362 1358377 1335599
58085 1335599 1313058 1291731 1271159 1249539 1227280 1206598 1187434 1167502 1146377 1125903 1106585
58074 1106585 1087272 1068297 1051134 1034955 1017304 998368 980888 965659 950791 935625 921649
58063 921649 909102 896288 882952 870955 860843 850823 839814 828617 817500 805477 792566
58052 792566 780111 768442 756677 744992 734493 724817 714698 704965 698022 694064 690645 686279 681654
58039 681654 676987 671165 664137 657448 651753 646215 640727 636163 631982 626170 618156 609473 601125 592544
58025 592544 583486 574483 565141 554443 543135 533395 525754 518766 511997 506716 503128 499556 495153 490980
58011 490980 487586 483823 478903 473576 468488 463418 458764 455691 454124 452512 450250 448437 447747 447520 447518
57996 447518 448572 450911 453739 456923 461115 465714 468785 469684 469818 470194 470186 469360 468521 468096 467250 465405 463039
57979 463039 460343 456712 452168 447680 443596 439345 435034 431681 429443 427349 425134 423532 422433 420705
57965 420705 418303 416620 416211 416100 415833 416250 417543 418509 418486 418200 417962 416906 414819 412927 411936 410981 409354
57948 409354 407673 406510 405473 404537 404750 406744 409838 413352 417438 422096 426819 431863 438384 446732 455973
57933 455973 465555 475932 487111 498162 508551 518331 526668 532016 534205 534528 533279 529177 521843
57920 521843 512840 503503 493721 483674 474647 467073 459643 451440 443208 435629 428249 421179 415886 413083
57906 413083 411531 410037 408804 407748 405551 401760 397951 395285 392729 389218 385726 383441 381596 379099
57892 379099 376793 376131 376837 377871 379570 382801 386810 389921 391787 393294 394810 396123 397521 399361 400972
57877 400972 401371 400673 399568 397878 394935 391003 387211 384305 382289 380746 378785 375422 370954 367276 365920
57862 365920 366385 367185 367698 368090 368388 368706 369677 371613 373839 375684 377397 379320 381040 382192 383251 384626
57846 384626 385903 386735 387413 387718 386516 383581 380566 378805 377378 374739 371163 367888 364816 360950 356547
57831 356547 353001 350857 349487 348605 348665 349772 351350 352871 354095 354812 355174 355903 357427 359303 361233 363886
57815 363886 367733 371842 374952 377076 378772 379483 377988 374220 369346 364235 358926 353423 347951 342539
57801 342539 337274 332781 329713 327977 327053 326671 326556 326112 325171 324459 324590 325200 325790 326578 327652 328224 327857
57784 327857 327604 328657 330580 332197 333575 335674 338548 341407 344200 347697 352089 356786 361489 366296
57770 366296 370784 374042 375665 375861 374772 372531 369731 366898 363740 359756 355255 350940 346909 342995
57756 342995 339611 337224 335426 333625 332270 332276 333548 335232 337052 339223 341345 342705 343564 344906 346893
57741 346893 348656 349591 349880 349750 349225 348580 348085 347300 345501 342764 339855 337249 335041 333570 333143 333387
57725 333387 333765 334465 335834 337278 337822 337547 337310 337174 336286 334279 331755 329337 327145 325156 323109 320197
57709 320197 315834 310685 305985 301941 297819 293476 289689 286937 284888 283240 282140 281759 282240 284010 287230
57694 287230 291002 293976 295630 296138 295356 293102 290249 288177 287012 285633 283551 281633 280762 280932 282069
57679 282069 284735 289517 296520 305872 318158 334118 354415 379760 410656 447122 489411 538815
57667 538815 596554 661285 728021 789423 837868 867147 874023 859004 825323 777224 719578 658320
57655 658320 599423 546701 501118 462207 429357 401829 378729 359472 343775 331161 321057
57644 321057 313248 307510 302945 298578 294557 291857 290796 290633 290608 290512 290323 290148 290420 291283 291907 291320 289733
57627 289733 288066 286391 284064 281224 278799 276945 274758 271772 268550 265532 262464 259235 256202 253331
57613 253331 250112 246641 243798 242020 240839 239897 239425 239377 239090 238173 236932 235650 234254 232858 231755 230764
57597 230764 229467 228109 227227 226406 224605 221797 218968 216359 213138 209209 205840 203851 202476 200695 198527
57582 198527 196307 193848 191122 188774 187186 185860 184301 182591 180532 177362 173071 169042 166555 165432
57568 165432 164818 164379 164010 163261 161945 160575 159506 158378 157056 156215 156224 156308 155661 154662 154136 154153 154419 155113
57550 155113 156388 157686 158532 159520 161538 164391 167052 168944 170193 170990 171482 172044 172936 173896 174573 175113
57534 175113 175833 176709 177597 178500 179154 178898 177564 176015 175188 175054 175105 175303 175883 176604 176975 177019 177307 178342
57516 178342 180266 182793 185204 186883 188149 189927 192250 193895 194045 193527 193631 194345 194684 194269 193703 193573
57500 193573 193825 194004 193562 192135 189948 187682 185588 183172 180092 176853 174121 171948 170165 168902 168054
57485 168054 166845 164751 162378 160691 159757 159037 158419 158038 157461 156055 154036 152172 150580 148758 146838
57470 146838 145709 145568 145273 143786 141686 140531 140898 141759 141924 141574 141839 143085 144273 144257 143143 141887
57454 141887 140984 140243 139611 139377 139630 140212 141182 142613 143980 144577 144585 144859 145567 146016 145973 146072 146603 146914 146511
57435 146511 145797 145252 144800 144475 144744 145562 145975 145356 144243 143352 142632 141956 141873 142907 144751 146793 148659
57418 148659 149753 149277 147548 146318 146836 148426 149840 151050 152571 153946 154307 153895 153699 153907 153859 153284
57402 153284 152498 151650 150689 149907 149628 149626 149577 149735 150388 151124 151456 151680 152260 152924 153344 154163 156246 159318 162480
57383 162480 165670 169419 173397 176436 177982 178515 178583 178327 177896 177438 176700 175382 173687 171853 169545 166589
57367 166589 163905 162687 162924 163662 164379 165047 165226 164364 162885 161827 161489 161474 161856 163109 165038 166999 169104
57350 169104 171907 174897 176707 177113 177530 179114 181435 183479 185005 186442 188205 190488 193096 195303 196516
57335 196516 197135 198016 199161 199853 199993 200209 200537 200199 199032 198047 198134 199100 200421 202048 203925 205477 206162
57318 206162 206085 205758 205676 206240 207490 208879 209968 211280 213597 216443 218371 218960 219370 220549 222026 223077
57302 223077 223960 225186 226337 226560 225732 224376 222856 221319 220122 219633 219825 220509 221728 223514 225471 227065
57286 227065 228207 229246 230454 231689 232486 232445 231653 230623 229632 228318 226202 223359 220097 216337 212001
57271 212001 207821 204972 203906 204281 205968 209210 213725 218591 223354 228491 234376 240498 246102 251080
57257 251080 255814 260598 265520 270534 275377 279685 283274 286153 288443 290728 294119 299240 305305 310973
57243 310973 315979 321081 326606 332146 337721 343984 350949 357564 363037 367671 372036 376264 380590 385628
57229 385628 391526 397699 403923 410841 418770 426862 434262 441405 449388 458531 468337 478440 488879 499746
57215 499746 511129 523188 535867 548837 562043 575908 590636 605770 620810 635821 651045
57204 651045 666386 681666 697044 712794 729010 745795 763285 781301 799469 817901 837151
57193 837151 857255 877544 897753 918595 940661 963409 985850 1007801 1029894 1052826 1077053
57182 1077053 1102800 1129779 1157188 1184402 1211441 1238593 1266040 1294024 1322800 1352161 1381676
57171 1381676 1411693 1443366 1477236 1512533 1548300 1584373 1620618 1656141 1690355 1724425 1760766
57160 1760766 1801241 1846317 1895472 1947712 2002070 2058332 2117139 2179045 2243948 2311876 2383659
57149 2383659 2460060 2540568 2623602 2707371 2790040 2869949 2946806 3022187 3097649 3172165 3242050
57138 3242050 3303244 3353347 3392326 3422634 3448538 3474153 3501642 3531662 3565158 3603817 3648861
57127 3648861 3700368 3758051 3821940 3891940 3967065 4045241 4123798 4200517 4274896 4348371 4423112
57116 4423112 4500986 4583956 4674473 4774250 4882983 4999500 5124225 5259759 5409507 5577242
57106 5577242 5768243 5989588 6248885 6553772 6913221 7338712 7844181 8446084 9164042
57097 9164042 10020224 11037128 12236201 13638095 15261949 17122549 19228347 21582035
57089 21582035 24180551 27012497 30056762 33284815 36660517 40131319 43618446 47021081
57081 47021081 50234793 53165143 55722547 57809827 59325029 60183592 60341268 59800596
57073 59800596 58602235 56812083 54510086 51781589 48713546 45396827 41929253 38412267
57065 38412267 34941695 31599328 28448905 25534414 22879300 20488455 18353425 16457882
57057 16457882 14781138 13300726 11994885 10843754 9828903 8933121 8141390 7441280
57049 7441280 6821638 6271375 5779954 5338426 4939445 4576923 4246305 3944652 3669677
57040 3669677 3418888 3189991 2981574 2792716 2622301 2469288 2333352 2214534 2112470
57031 2112470 2026564 1956729 1903161 1865530 1843412 1837888 1851298 1883412 1926942 1967648 1990240
57020 1990240 1985011 1949478 1885440 1796768 1690214 1575628 1462609 1356734 1259832 1172991 1097420
57009 1097420 1032747 976743 927466 884442 847246 814404 784512 757292 732718 710050 688574
56998 688574 668505 650322 633835 618569 604435 591410 579238 568127 559098 552977 549553 548286
56986 548286 549267 552937 559389 568261 578459 587532 592381 591533 586070 577622 566243 551193 533005 513642
56972 513642 494984 478064 463379 451019 440760 432733 427697 426081 427297 430658 436414 445131 456678
56959 456678 470701 487468 507080 528079 547720 563439 573440 576425 571866 560458 543633 522783
56947 522783 499449 475691 453376 433368 416065 402181 392215 385749 382285 382350 386779 395398 407512
56934 407512 423365 443882 469062 497577 527647 557040 582258 599149 605023 599840 585434 564285
56922 564285 538870 511153 482354 453514 426095 401456 380014 361557 346061 333448 322891
56911 322891 313266 304161 295754 288010 280898 274947 270630 267432 264619 262684 262902 265467 269183 273006
56897 273006 276896 281159 286040 292086 299888 309292 319737 331518 345802 363246 383449 405828 429925
56884 429925 454459 476921 494608 505673 509237 505367 495311 481107 464645 447427 431070 417291
56872 417291 407173 400966 398637 400212 405727 415507 430384 451085 477581 509582 547390 591465
56860 591465 641336 695352 750773 803053 845814 873355 883655 878222 859462 829558 791673 750382
56848 750382 710090 673877 643934 621866 608145 602370 604553 615422 635352 664119 702074 750516
56836 750516 810536 882292 965243 1057267 1152467 1240862 1311604 1356854 1373142 1360659 1322329
56825 1322329 1263041 1188859 1106645 1023683 946172 877350 817720 767379 727392 698819 681604
56814 681604 675140 679111 693222 716887 749967 793247 847304 910612 978488 1043327 1096214 1129713
56802 1129713 1140262 1128126 1095569 1045889 983890 915574 846403 780153 719367 665790 619995
56791 619995 581620 550614 527591 512680 504920 503280 507572 518081 535061 558832 589178 623906
56779 623906 658585 688202 708665 716901 711066 691600 661335 623779 581669 537378 493615 452850
56767 452850 416414 384572 356941 332642 310886 291841 276207 263701 252882 242859 234154 227406
56755 227406 222177 217597 213248 208834 203987 199096 195437 193646 192795 191658 190101 188514 186788 184771
56741 184771 183051 182264 182035 181400 179950 177966 175872 174114 173144 173008 173285 173732 174416 174996 174736 173697 173047
56724 173047 173656 175107 176636 178172 179877 181505 182913 184432 186073 187182 187575 188125 189435 190740 191015
56709 191015 190457 189988 189985 190393 191459 193318 195347 196817 197835 198923 200043 200782 201085 201196 201215 201182 201146 200750
56691 200750 199432 197458 195978 195533 195400 194982 194820 195431 196122 195945 195039 194140 193508 193213 193604 194453 194488 192972
56673 192972 191065 190463 191225 192052 192190 191978 191990 192685 194443 196916 198850 199521 199853 201086 203005 204597 205841
56656 205841 207497 209600 211541 213335 215494 217767 219299 219953 220363 220728 220658 220161 219735 219468 219014 218457 218290
56639 218290 218570 218957 219493 220519 221889 223110 224173 225420 226715 227539 227839 227945 227762 226835 225233 223591
56623 223591 222269 221076 219785 218328 216585 214467 212103 209578 206813 204069 202044 200969 200209 199313 198774
56608 198774 199066 199574 199388 198556 197744 197277 197346 198397 200268 201608 201324 200086 199290 199120 198876 198656 199265 200746
56590 200746 202351 203787 205245 206381 206579 206123 205940 206204 206351 206361 206874 208000 209109 209856 210440 210883 211020
56573 211020 211172 211869 213005 214175 215730 218473 222366 226530 230475 234436 238570 242855 247865 254764 264295
56558 264295 276153 289092 301197 310671 317132 321727 325339 327428 327477 326501 325767 324827 322372 318525 314653
56543 314653 311311 307975 304552 301572 299000 296339 293787 291853 289990 287136 283492 280253 277678 274993
56529 274993 272199 270292 269516 268969 268120 267327 266667 265699 264532 263759 263211 262167 260822 260021 259495 258019 255479
56512 255479 253089 251285 249220 246767 245200 245093 245174 244157 242367 240712 239248 237678 236235 235259 234680
56497 234680 234491 234956 235891 236580 236686 236447 235850 234642 233338 233016 233855 234887 235467 235892 236432 236901 237381 238238
56479 238238 239228 239752 240091 241090 242565 243468 243689 244108 244699 244332 242994 242445 243911 246548 248894 250484 251338
56462 251338 251279 250583 250196 250606 251453 252630 254503 256652 257795 257579 257146 257339 257661 257513 257159 256852 256293 255575
56444 255575 255335 255445 254917 253633 252734 252695 252600 252031 252108 253692 255956 257647 258527 258732 258083 256934 256430 257006
56426 257006 257788 258161 258678 259713 260692 261441 262772 264793 266175 266146 265756 266075 266576 266510 266437 267054 267761 267761 267514
56407 267514 267827 268520 269184 270205 271885 273540 274622 275732 277434 279096 280034 280746 281865 282918 283334 283727
56391 283727 284965 286780 288362 289520 290319 290502 290180 290187 290906 291773 292687 294542 297431 299763 300355 300121 300441
56374 300441 301130 301355 301329 301681 302219 302672 303607 305286 306675 306951 306967 307921 309558 311008 312301 313677 314485
56357 314485 314229 313784 314169 315002 315519 316123 317536 319314 320586 321396 322112 322491 322565 323343 325305 327321 328389
56340 328389 329206 330693 332367 333779 336044 340025 344344 347262 349350 352143 355254 357199 358278 360145
56326 360145 362997 365524 367392 369573 372319 374826 376929 379347 382200 384843 387144 389498 391784 393599
56312 393599 395259 397252 399210 400761 402778 406210 410242 413304 415485 418316 422558 427846 434145 441774
56298 441774 450099 457836 464676 471353 478197 484799 490825 496123 500410 503912 507778 512784 518291 523523
56284 523523 528982 535407 542375 549329 556956 566006 575820 585685 596633 609998 625088 640204 655183
56271 655183 671107 688324 706724 727196 750661 776273 802561 829872 859837 893176 929956
56260 929956 971169 1017850 1069364 1124873 1185929 1255274 1333618 1420021 1514995 1620703 1738241
56249 1738241 1867203 2007866 2161346 2327389 2504158 2690270 2884881 3085552 3288015
56240 3288015 3488237 3682939 3868109 4038827 4190616 4319392 4420526 4489958 4526175 4529499
56230 4529499 4500073 4438548 4348103 4233375 4097765 3944014 3776873 3602449 3424821 3245627
56220 3245627 3066832 2891377 2721167 2556982 2400559 2254275 2118537 1991844 1873612
56211 1873612 1764682 1664896 1572702 1487488 1409994 1340028 1276061 1217436 1164700 1117344 1073456
56200 1073456 1032164 994441 961028 931356 904729 880711 858280 836576 816471 799432 784959
56189 784959 771284 758356 747713 739485 732049 724730 718402 713287 708581 704369 701503 699539 697272
56176 697272 695250 695086 696256 696422 695160 694555 695728 697598 699494 702233 706009 709832 713596 718272 723703
56161 723703 728737 733702 740138 747968 755803 764087 774824 787949 801344 814968 831570 852493 876057
56148 876057 901068 928793 960441 995780 1035468 1081978 1137075 1200908 1274170 1358203 1452144
56137 1452144 1552688 1657221 1764181 1869952 1969055 2058510 2138932 2210739 2272922 2326438
56127 2326438 2374770 2419384 2457891 2488088 2510386 2524901 2529908 2525114 2513210 2496165 2472737 2441017
56115 2441017 2400358 2349399 2285611 2208693 2121649 2027318 1927146 1824544 1725575 1634253 1550495
56104 1550495 1474364 1408563 1354626 1310241 1272741 1242112 1218366 1199188 1182605 1169168 1159519
56093 1159519 1152645 1148192 1147273 1149233 1151042 1151731 1153890 1158847 1164179 1168148 1172718 1179551 1186782 1192605
56079 1192605 1198673 1207011 1216657 1226068 1235889 1246729 1257164 1266422 1276223 1287769 1299826 1311745 1325119
56066 1325119 1340558 1356270 1371738 1389150 1409245 1429635 1449216 1470125 1493289 1516340 1538152
56055 1538152 1560861 1585038 1607655 1627484 1647600 1669689 1690870 1709321 1727955 1749145 1770858
56044 1770858 1791528 1813730 1839260 1865644 1891322 1919136 1950716 1982709 2012832 2044343 2080050
56033 2080050 2117272 2153426 2191262 2233506 2277560 2320697 2365379 2414197 2464698 2514566 2566777
56022 2566777 2624065 2683386 2741489 2800935 2865013 2931840 2999196 3069766 3145816 3224126 3302297
56011 3302297 3384403 3474165 3568221 3662619 3760187 3864830 3974510 4086673 4204608 4331472
56001 4331472 4464217 4600500 4745051 4901968 5067699 5239278 5422062 5621020 5832034
55992 5832034 6050577 6281232 6529466 6792181 7066277 7358272 7675068 8013659 8370852
55983 8370852 8754351 9172757 9623715 10104165 10622991 11190866 11807550 12472766 13199308
55974 13199308 14001230 14880369 15840257 16902012 18090354 19416927 20895858 22563156
55966 22563156 24462396 26627293 29101687 31963253 35305846 39216555 43796232 49183856
55958 49183856 55533334 62991705 71738417 82026614 94153975 108431729 125236953
55951 125236953 145058722 168416443 195725787 227195049 262543936 300367548 337608092
55944 337608092 369965722 393325617 405151832 404820778 393063460 371450759 342303073
55937 342303073 308560325 273239259 238787063 206805460 178154994 153147104 131697332
55930 131697332 113491456 98142557 85257142 74438685 65316784 57591466 51027819
55923 51027819 45420554 40592990 36417092 32800331 29654572 26897832 24474719 22348091
55915 22348091 20474615 18808300 17320551 15995465 14810201 13738309 12766845 11891932
55907 11891932 11101550 10378682 9716638 9115301 8566331 8056877 7583978 7151055 6753852
55898 6753852 6383364 6038975 5725340 5439289 5172386 4923540 4696924 4490050 4295592
55889 4295592 4112692 3945334 3791673 3645655 3507205 3380761 3265632 3157310 3055988
55880 3055988 2964134 2877801 2789837 2699964 2612781 2527944 2441476 2354786 2273095 2196245 2119948
55869 2119948 2044897 1975970 1913311 1852523 1792964 1737939 1687469 1638545 1591812 1550384 1512747
55858 1512747 1474185 1434687 1398252 1365052 1331514 1297651 1267093 1239965 1212614 1184342 1157845
55847 1157845 1132999 1106709 1079047 1053255 1029495 1004578 978162 953459 931550 910502 890191
55836 890191 872559 856957 840468 822948 806760 791736 775552 758852 744731 733255 721685
55825 721685 709933 700485 692915 683814 672462 661488 651601 640591 627884 615334 603234 590192
55813 590192 577164 566931 559367 551780 544003 538513 535495 532633 529898 529548 531091 531387 530414 531941
55799 531941 537510 544426 550659 557149 564158 569851 573760 577534 581076 581934 579589 576395 573265 568440
55785 568440 561671 555540 551239 546701 540286 532795 524673 514721 502906 491196 480508 470017 460436
55772 460436 454680 454284 458217 465747 476874 489113 497708 500370 498613 493565 484150 470526 455561
55759 455561 441293 427278 413835 403379 396791 391740 386454 382093 379548 376899 372147 365924 359570
55746 359570 352854 345411 338261 332260 326906 321960 318175 315427 312368 308994 307168 307434 307719 306385 304199
55731 304199 302048 299115 294704 289680 284756 279377 273368 267665 262507 257098 251814 248272 246346 243803
55717 243803 239971 236962 236025 235596 234624 235009 238682 244655 250939 257184 263395 268144 270366 271266 272394
55702 272394 273178 272173 269376 265598 260847 254972 248721 242689 236324 229315 222789 217900 214335 211261
55688 211261 208601 206465 204592 203308 203749 206250 209753 213425 217421 221539 224910 227727 231386 236019
55674 236019 239823 241773 243051 244713 245924 245794 245017 244264 242772 240039 237258 235550 234283 232693 231707
55659 231707 232528 234641 236748 238632 240812 243292 245800 248295 250310 250964 250449 250191 250690 250585 248777 245984
55643 245984 243236 240324 236817 233088 229234 224428 218481 212589 207482 202278 196266 190294 185222 180521
55629 180521 175621 171146 167565 164097 160254 157041 155333 154437 153530 153047 153338 153399 152371 150964 150069 149201
55613 149201 147607 145587 143523 140951 137889 135594 134701 134079 132765 131379 130261 128121 124325 120779 119486
55598 119486 119681 119475 118940 119350 120500 121123 121141 121302 121218 119906 117792 116291 115813 115864 116590 118476 120980 123109
55580 123109 124930 127001 128891 129941 130928 133247 136804 140430 144084 148989 155774 163986 173294 183614
55566 183614 194051 203081 209927 214761 217652 218342 216920 213822 209331 203822 198051 192417 186387 179442
55552 179442 172014 164755 157635 150727 145041 141439 139332 137555 135919 134891 134366 133867 133418 133271 133290 133417
55536 133417 133993 134851 135031 134348 134149 135412 137139 137842 137607 137379 137249 136847 136458 136241 135237 132680 129454
55519 129454 126748 124206 121035 117988 116322 115512 113953 111462 109166 107319 105096 102369 99942 98120
55505 98120 96603 95599 95472 95519 94610 92875 91324 90131 88780 87537 87090 86992 86144 84712 83950 84231 84776
55488 84776 85156 85460 85213 83923 82675 83359 86095 89018 90782 91685 92217 92259 92093 92546 93568 94053 93514
55471 93514 92637 91848 90676 88986 87498 86526 85400 83722 82129 81292 81129 81485 82606 84413 86155 87261
55455 87261 87831 87980 87518 86601 85916 85854 86080 86139 85868 85155 83966 82821 82560 83517 85340 87501 89424 90360
55437 90360 89934 88707 87542 86655 85963 85874 86726 87799 88024 87501 87236 87584 88060 88515 89248 90001 90123 89861
55419 89861 90350 92115 94517 96814 98866 100710 102362 104099 106133 108024 109197 109805 110177 109720 107558
55404 107558 104107 100825 98449 96566 94801 93235 91707 89922 88233 87136 86080 84043 81242 78985
55390 78985 77860 77426 77690 79282 81950 84364 85803 86672 87066 86340 84579 82993 82149 81186 79547 78218
55374 78218 78327 79541 80793 81757 82756 83886 85062 86438 88087 89650 90771 91500 91975 92141 92004 91739
55358 91739 91463 91319 91648 92413 92650 91431 89289 87777 87589 88110 88796 89855 91353 92734 93553 93838 93583
55341 93583 92798 92074 91983 91859 90374 87586 85170 84321 84635 85366 86484 87916 88978 89302 89327 89259 88511 86868
55323 86868 85268 84747 85261 86071 86616 86600 85990 85337 85377 86003 86426 86482 86761 87255 87114 86241 85867 86817 88223
55304 88223 88810 88521 88141 88089 88374 89052 89983 90708 91085 91485 91939 91786 90691 89314 88553 88739 89911 92040
55286 92040 94563 96538 97743 98845 100139 101014 101141 101183 101731 102407 102672 102643 102478 101796 100410 98936 97952
55269 97952 97227 96350 95500 95004 94870 95238 96463 98150 98991 98341 97265 97176 98076 98862 98897 98490 98188 98204 98386
55250 98386 98380 98043 97727 97732 97634 96936 96222 96556 97715 98287 97782 97230 97345 97528 97337 97433 98196 98791 98590 98278 98475
55229 98475 98523 97786 97034 97204 97777 97731 97264 97194 97391 97224 96923 97120 97447 96965 95729 94662 94119 93694 93259
55210 93259 93181 93553 94047 94402 94477 94172 93912 94625 96494 98291 98751 98079 97302 96796 96318 95820 95216 93945 91835
55191 91835 89876 89123 89365 89808 90405 91318 91794 91023 89700 89326 90207 91482 92818 94606 96574 97688 97661
55174 97661 97266 96998 96562 95936 95781 96455 97511 98490 99384 100128 100442 100424 100581 101026 101306 101191 101044 101263 101863
55155 101863 102711 103666 104481 104982 105306 105578 105631 105476 105622 106303 106883 106802 106641 107285 108417 108922 108586 108225 108244
55136 108244 108165 107638 106851 105856 104561 103504 103579 104669 105548 105472 105008 104941 105207 105336 105247 105137 105135 105383 105975 106560
55116 106560 106523 105783 104868 104099 103323 102626 102593 103461 104628 105434 105975 106759 107926 109186 110268 111067 111547 111790
55098 111790 112081 112790 114146 116007 117733 118520 118190 117468 117135 117105 116745 115887 114983 114397 114165 114392 115276 116591
55080 116591 117688 118114 117881 117083 115796 114501 114118 115263 117596 120061 121651 121978 121284 119995 118279 116163
55064 116163 114016 112547 112114 112431 113167 114363 115903 117033 117007 115972 114732 113833 113260 112802 112264 111531 110823
55047 110823 110637 111113 111774 112223 112618 113050 113014 112151 111037 110537 110668 110784 110585 110254 109905 109560 109495 110004 111003
55028 111003 112313 113922 115490 116157 115613 114831 114906 115573 115769 115203 114342 113181 111232 108702 106597 105556
55012 105556 105353 105526 105700 105409 104502 103683 103827 104869 106124 107496 109330 111227 112130 111757 110970 110598 110712
54995 110712 111148 111796 112263 112172 112022 112885 115017 117506 119453 120760 121634 122154 122486 122790 122779 122043 120876 120051
54977 120051 119717 119381 118963 118998 119676 120514 121143 121561 121539 120723 119484 118750 118767 118915 118933 119341 120379 121524 122481
54958 122481 123660 125185 126297 126314 125576 124871 124433 123913 122980 121700 120653 120630 121707 122813 122948 122614 123080
54941 123080 124422 125494 125854 126344 127504 128788 129798 130989 132483 133375 133027 132096 131549 131594 132221 133775
54925 133775 136156 138405 140076 142171 145744 150245 154368 158031 162411 168238 174993 181750 188083 194102
54911 194102 199912 205028 208240 208515 206152 202444 198045 192454 185416 177892 171026 164924 159143 153715
54897 153715 148971 144952 141665 139387 138082 137071 135950 135183 135179 135458 135512 135842 137181 139158 140709 141500
54881 141500 142147 143264 145089 147746 151140 154830 158702 163448 169620 176521 182851 188262 193456 198856
54867 198856 203986 208045 210329 210157 207260 202412 196970 191535 185609 178746 171577 165363 160807 157536
54853 157536 154647 151591 148517 145793 143390 140977 138439 135906 133327 130607 128195 126764 126115 125194 123647
54838 123647 122572 123048 124525 125472 125215 124344 123594 123105 122673 122085 121203 120188 119558 119688 120348 121056 121658 122278
54820 122278 123030 124113 125738 127580 128706 128564 127674 126861 126276 125750 125664 126648 128607 130737 132374 133241 133103
54803 133103 131948 130511 129871 130333 131137 131382 130870 130041 129441 129340 129601 129812 129700 129371 129126 129155 129427 129618
54785 129618 129163 127851 126418 126002 126823 128074 129305 131138 134058 137268 139532 140680 141551 142812 144628
54770 144628 147154 150526 154451 158416 162311 166454 171237 177138 184703 193900 203706 212825 220595 226784
54756 226784 230946 232619 231832 228869 223847 217112 209645 202330 195181 187971 181251 175895 171825 168057
54742 168057 163907 159451 154996 150948 148041 146788 146600 146232 145177 143985 143220 142912 143096 144074 145926 148354
54726 148354 151152 154290 157453 160170 162537 165226 168652 172687 177250 182498 188269 193921 198953 203208
54712 203208 206296 207420 206144 202864 198282 192828 186871 180934 175306 169799 164250 158975 154382 150427
54698 150427 146909 144096 142543 142196 142113 141327 139829 138442 137785 137689 137678 137630 137610 137360 136567 135540 134979 134960 134771
54679 134771 133895 132568 131120 129517 127959 127225 127757 128846 129295 128571 126940 125014 123644 123600 124653 125475
54663 125475 125163 124373 124205 124549 124550 124253 124601 125895 127326 128068 127985 127247 126125 125261 125290 126062 126883 127473 127973
54644 127973 128143 127519 126467 126084 126798 127826 128367 128572 128981 129682 130409 131013 131456 131757 132112 132711 133350 133636
54626 133636 133602 133552 133334 132464 131079 130032 129715 129510 128824 128030 127915 128575 129389 129806 129772 129510 129224 128983 128741
54607 128741 128491 128348 128417 128668 129074 129693 130347 130533 130022 129271 128813 128514 127992 127534 127866 129085 130416 131135
54589 131135 131222 131175 131630 132992 134884 136159 136103 135446 135487 136414 137296 137520 137263 136612 135369 133941 133348 133894
54571 133894 134709 135015 135072 135433 136032 136539 136987 137503 137928 138119 138146 137844 136734 134843 133078 132298 132343 132416 132088
54552 132088 131547 131156 131103 131304 131436 131280 131115 131471 132484 133845 135347 137003 138623 139959 141335 143457
54536 143457 146321 148930 150371 150636 150201 149396 148474 147709 147100 146438 145899 145935 146350 146125 144656 142630 141238
54519 141238 140879 140964 140648 139525 138039 137355 138334 140443 142162 142548 141834 140550 138968 137635 137341 137982 138334
54502 138334 137612 136575 136429 137360 138815 140523 142326 143558 143617 142914 142410 142388 142365 142012 141416 140554 139235 137639
54484 137639 136383 135966 136446 137566 138843 139665 139709 139248 138810 138689 138992 139856 141295 143006 144621 145957 146826
54467 146826 146967 146424 145662 144944 144020 142816 142056 142592 144296 146098 147081 147160 146807 146474 146317 146247 146189 146259 146508
54448 146508 146624 146241 145566 145200 145232 145108 144476 143595 142648 141397 139885 138757 138306 137822 136642 135329 135043
54431 135043 136035 137537 138956 140387 141988 143535 144749 145594 146109 146267 146093 145727 145332 145096 145228 145839 146913
54414 146913 148406 150151 151691 152587 152916 153065 152961 152082 150407 148792 148092 148419 149498 151163 153108 154718
54398 154718 155629 156023 156041 155462 154388 153661 154051 155471 157399 159520 161476 162681 163041 163319 164066 164703 164408
54381 164408 163429 162667 162376 162151 161954 162205 162939 163701 164299 165026 166115 167511 169100 170703 171932 172565 172881
54364 172881 173257 173695 174202 175201 176952 178916 180394 181506 182776 184012 184453 183968 183420 183824 185700 189076
54348 189076 193454 197851 201471 204299 206638 208442 209664 210754 211929 212318 210864 207944 205009 202674
54334 202674 200172 196819 192965 189197 185539 181878 178471 175633 173451 172043 171558 171758 172091 172298 172383 172068
54318 172068 171036 169757 169168 169321 169235 168415 167644 167745 168327 168335 167277 165374 163068 161026 160091 160500 161390 161663
54300 161663 161131 160362 159724 159139 158609 158301 158117 157686 156915 156222 156049 156327 156543 156281 155718 155606 156624 158607
54282 158607 160482 161144 160444 159337 159086 160238 162259 164084 165121 165717 166661 168313 170285 171879 172673 172761
54266 172761 172572 172448 172356 172040 171441 170802 170356 170199 170483 171302 172263 172630 172204 171649 171513 171429 170786 169890 169739
54247 169739 170722 172121 172881 172480 171098 169370 167945 167000 166293 165873 166340 167910 169654 170297 169639 168536
54231 168536 167691 167143 166792 166657 166587 166371 166240 166637 167438 167981 167961 167735 167685 167844 168194 168707 169061 168919 168632 168974
54211 168974 170039 171051 171459 171569 171790 171939 171705 171270 171010 170931 170779 170476 170133 169897 169944 170336 170724 170535 169665
54192 169665 168617 167828 167236 166667 166211 165922 165504 164694 163714 163078 163046 163432 163847 164091 164438 165476 167385 169402
54174 169402 170400 170028 168994 168227 168101 168473 169026 169421 169494 169402 169314 168973 167911 166183 164492 163562 163673 164758
54156 164758 166471 168113 168997 169076 168915 169017 169495 170336 171436 172339 172432 171575 170228 168934 168026 167710 167927 168203
54138 168203 168183 168229 168858 169706 169818 169025 168147 167678 167194 166470 166262 167308 169185 170820 171723 172161 172452 172717
54120 172717 173124 173844 174830 175890 176903 177788 178461 178976 179528 180198 180903 181605 182271 182714 182859 183144 184069 185348
54102 185348 186105 186044 185784 185881 186126 186054 185554 184682 183468 182201 181401 181200 181284 181619 182649 184428 186207 187283
54084 187283 187741 188020 188337 188880 189937 191324 192276 192397 192218 192374 192848 193504 194711 196740 199051 200928 202407
54067 202407 203899 205328 206450 207727 210056 213694 218109 222829 227883 233483 239877 247380 256006 264993
54053 264993 273146 279638 284235 286878 287535 286375 283723 279871 275247 270642 266884 264299 262798 262366 263145
54038 263145 265131 268156 272168 277307 283659 291106 299337 307899 316269 323990 330707 336272 340976 345489
54024 345489 350099 354193 357006 358802 360580 362562 363782 363430 361826 359696 357278 354612 351942 349117
54010 349117 345198 339405 332107 324367 316921 310082 304012 298366 292203 285072 277904 272112 268041 264920
53996 264920 261978 258934 255753 252690 250330 248867 247534 245464 242931 241015 240194 239952 239630 238933 237684
53981 237684 235846 233815 232127 230874 229902 229352 229362 229509 229250 228781 228665 228840 228845 228941 229996 232146 234563 236770
53963 236770 239216 242201 245223 247963 251110 255372 260187 264219 266912 268874 270852 272963 274992 276877
53949 276877 278576 279729 279838 278878 277604 277072 277820 279661 282249 285578 289742 294451 299149 303563 307902
53934 307902 312536 317659 323124 328419 332923 336507 339885 344113 349635 355882 361884 367240 372539 378778
53920 378778 386347 394767 403581 413122 423900 435525 447081 458546 470916 484754 499587 515097
53908 515097 531831 549975 568395 585817 602208 617786 631255 640360 644003 642659 636824 626375
53896 626375 611737 594509 576348 557863 539040 520253 502393 486244 471891 458522 444885
53885 444885 430344 415500 401470 388710 376958 366079 356317 347746 340090 333116 326708 320574 314462
53872 314462 308670 303801 299964 296668 293452 290145 286599 282693 278656 274896 271529 268420 265500 262605
53858 262605 259297 255518 252219 250596 250767 251783 252708 252989 252082 249775 246868 244539 242916 241212 239303
53843 239303 238082 237966 238123 237669 236737 235805 234841 233729 232847 232542 232549 232517 232638 233157 233638 233356 232231 230952
53825 230952 230298 230581 231590 232876 234235 235860 237763 239285 239818 239907 240847 243050 245651 247937 250235 253002
53809 253002 255973 258839 262038 266068 270558 274766 278686 283018 288346 294881 302610 311081 319319 326594
53795 326594 333145 339668 346310 352635 358331 363343 367470 370409 372217 373348 374198 374861 375209 374872 373329
53780 373329 370390 366551 362507 358407 353865 348606 342784 336732 330720 324930 319328 313508 306965 299700
53766 299700 292482 286358 281812 278385 275191 271823 268571 265693 262844 259600 256284 253631 251685 249712
53752 249712 247383 245415 244597 244566 244073 242280 239487 236648 234497 233169 232515 232524 233237 234243 234750 234523 234358
53735 234358 235086 236426 237502 238245 239328 240683 241178 240199 238733 238301 239338 241169 243100 245006 247117
53720 247117 249698 252774 255930 258541 260333 261433 261952 262029 262286 263518 265717 268040 270017 272115 274842
53705 274842 278018 281324 284823 288385 291316 293218 294663 296392 298370 300308 302549 305641 309341 312801
53691 312801 315545 317638 319173 320264 321321 322695 324121 325056 325450 325745 326297 327165 328163 328684 327838 325433
53675 325433 322545 320549 319773 319626 319640 319648 319196 317725 315478 313514 312612 312596 312808 312786 312369 311552 310360 308737
53657 308737 306593 304161 302020 300514 299448 298742 298954 300544 302885 304731 305540 305715 305659 305332 304778 304437
53641 304437 304707 305642 307111 308877 310552 311977 313580 315809 318298 320259 321706 323527 326149 328888 331059
53626 331059 333065 335803 339406 343147 346434 349347 352219 355168 358203 361496 365356 369950 375151 380605
53612 380605 385942 390974 395783 400621 405616 410533 414960 418816 422504 426382 430314 434087 438062 442839
53598 442839 448289 453456 457561 460627 463022 465032 467044 469464 472001 473624 473730 472877 471862 470582 468385
53583 468385 465101 461091 456580 451616 446460 441492 436861 432613 428838 425282 421343 417020 413348 411180
53569 411180 410006 408826 407659 407187 407224 406768 405509 404171 403281 402700 402559 403483 405432 407298 408258 408802 409851
53552 409851 411464 413039 414272 415348 416483 417773 419319 421177 423354 426006 429329 433112 436842 440444
53538 440444 444568 449869 456390 463785 471683 479582 486929 493815 501313 510658 522109 534852 547843
53525 547843 560613 573443 587017 601799 617627 634000 650717 668005 686109 705096 725106
53514 725106 746349 768715 791785 815350 839585 864608 890338 916925 944833 974115 1003998
53503 1003998 1033551 1062497 1091000 1118904 1145674 1171041 1195385 1219372 1243268 1266598 1288482
53492 1288482 1308530 1327439 1346578 1366846 1388044 1409358 1430235 1450764 1471431 1492557 1513770
53481 1513770 1534050 1552592 1569682 1586372 1603149 1619206 1633172 1644266 1652568 1658442 1661974 1662842
53469 1662842 1660581 1654976 1646285 1635018 1621512 1605888 1588383 1569517 1550000 1530574 1511781 1493491
53457 1493491 1474760 1454547 1432632 1409548 1385739 1361279 1336418 1311815 1287971 1264799 1242022
53446 1242022 1219711 1198221 1177839 1158682 1140800 1124311 1109533 1096905 1086553 1078055 1070937 1065254
53434 1065254 1061239 1058543 1056473 1054982 1054802 1056469 1059828 1064617 1070827 1078231 1086328 1095240 1106066 1119744
53420 1119744 1135946 1153618 1172271 1192185 1213713 1236976 1262101 1289207 1318166 1348793 1381259
53409 1381259 1415987 1453191 1492696 1534116 1577068 1621408 1667496 1715992 1767143 1820507 1875629
53398 1875629 1932671 1992031 2053493 2116137 2178979 2241547 2304054 2367223 2431648 2496906 2561565
53387 2561565 2624399 2685385 2745103 2803424 2859346 2911995 2961186 3006884 3048618 3085645 3117472
53376 3117472 3144062 3165704 3182702 3194973 3201936 3202920 3197642 3186116 3168207 3143610 3112255 3074487
53364 3074487 3030835 2981865 2928357 2871343 2811820 2750458 2687663 2623850 2559709 2496232 2434405
53353 2434405 2374749 2317214 2261618 2208017 2156456 2106501 2057348 2008392 1959507 1910813 1862542
53342 1862542 1815145 1769178 1724818 1681753 1639846 1599716 1562338 1528077 1496519 1467260 1440391
53331 1440391 1415936 1393292 1371807 1351691 1333617 1317333 1301410 1284761 1267857 1251930 1237412
53320 1237412 1223812 1210833 1198814 1188126 1178853 1171232 1165748 1162558 1161274 1161515 1163308 1166760 1171868
53307 1171868 1178820 1187972 1199162 1211513 1224365 1238166 1253981 1272312 1292764 1314763 1338214 1363451
53295 1363451 1390763 1419974 1450429 1481485 1513005 1545197 1577960 1610690 1642784 1673942 1703786
53284 1703786 1731591 1756740 1779162 1799019 1816170 1830220 1840896 1848083 1851650 1851544 1847977 1841285
53272 1841285 1831685 1819243 1803924 1785582 1764165 1740126 1714388 1687660 1659991 1631148 1601174
53261 1601174 1570372 1539002 1507285 1475454 1443496 1411070 1377953 1344438 1311097 1278331 1246355
53250 1246355 1215316 1185118 1155356 1125651 1095910 1066114 1036207 1006482 977646 950115 923547
53239 923547 897477 872060 847674 824155 801122 778942 758661 740899 725342 711387 698711
53228 698711 687112 676281 666005 656200 646558 636483 625573 613896 601606 588588 574668 560010
53216 560010 545070 530324 516153 502850 490524 479045 468193 457883 448193 439268 431189 423927
53204 423927 417396 411521 406195 401193 396265 391286 386176 380647 374362 367478 360713 354653 349264 344299
53190 344299 339870 336221 333230 330567 328180 326074 323740 320453 316275 312227 309244 307333 305976 304923
53176 304923 304255 303932 303672 303168 302228 300858 299394 298363 297876 297328 296087 294470 293563 293871 294555 294394 293275
53159 293275 292202 291849 291649 290653 288801 286893 285456 284253 282890 281440 280242 279476 279104 278967 278728 277998
53143 277998 276795 275681 275184 275216 275260 275062 274877 275042 275473 275694 275407 274978 275164 276205 277428 278051 278104 278075 277908
53124 277908 277116 275913 275325 275799 276488 276494 276141 276288 276851 276923 276150 275197 274763 274822 274988 275152 275516 276219 277031 277269
53104 277269 276225 273940 271399 269586 268545 267733 267017 266749 266974 267208 267071 266630 266026 265218 264289 263565 263255
53087 263255 263248 263380 263611 263885 264114 264411 265041 266054 267199 268220 268946 269126 268607 267807 267628 268626 270498 272506
53069 272506 274169 275422 276337 276918 277082 276743 276012 275281 274871 274539 273603 271682 269180 266964 265695 265500 265989
53052 265989 266470 266372 265673 264909 264687 265204 266194 267205 267878 268090 267863 267168 265898 264138 262261 260638 259355
53035 259355 258407 258006 258362 259217 259918 260040 259756 259545 259714 260182 260596 260688 260639 261049 262362 264342 266240 267412
53017 267412 267684 267296 266729 266508 266902 267777 268794 269603 269821 269171 267929 266930 266802 267346 267957 268391 268768 269119
52999 269119 269422 269874 270639 271464 272023 272499 273289 274293 275105 275801 276860 278295 279579 280532 281612 283110 284662
52982 284662 285803 286445 286552 285947 284750 283535 282754 282509 283163 285513 289817 295040 299606 302625 304041 304094
52966 304094 303213 302098 301190 300203 298780 297459 297272 298327 299484 299715 299196 298724 298497 298026 297027 295816 294759
52949 294759 293764 292544 291129 289790 288570 287178 285408 283434 281600 280048 278595 276913 274838 272602
52935 272602 270683 269225 267759 265880 264088 263404 263981 264780 264852 264361 263897 263488 262981 262826 263500 264478 264729
52918 264729 264138 263514 263185 262605 261582 260932 261441 262870 264420 265587 266171 266050 265452 264936 264661 264081 262801
52901 262801 261312 260399 260204 260356 260728 261532 262846 264508 266338 268157 269724 270928 271888 272617 272839 272414
52885 272414 271693 271185 271051 271169 271378 271393 270757 269256 267212 265143 263388 262287 262323 263677 265911 268446 271081
52868 271081 273675 275692 276629 276716 276675 276878 277153 277310 277325 277112 276599 276078 276016 276492 277145 277692 278057 278032 277305 275995
52848 275995 274695 273666 272241 269440 265167 260587 257205 255549 254780 253606 251550 249225 247464 246465 245905
52833 245905 245544 245430 245639 246116 246712 247267 247739 248372 249479 250874 251753 251432 250066 248389 247003 246222 246335
52816 246335 247401 248817 249627 249426 248703 248265 248708 250461 253772 258273 262805 266090 267622 267768 267147 266054
52800 266054 264445 262272 259791 257535 255909 254791 253678 252299 250951 250066 249566 248931 247917 246904 246363
52785 246363 246298 246550 247433 249470 252420 255121 256679 257356 257863 258210 257922 257185 256935 257633 258606 258937 258499 257819
52767 257819 257346 257203 257280 257168 256286 254519 252613 251604 251870 252882 253773 254057 254010 254459 255931 257865 259007
52750 259007 258763 257821 257247 257373 257880 258531 259301 260040 260539 260848 261165 261578 262252 263648 266106 269352 272770
52733 272770 276015 278906 281028 282041 282351 282800 283653 284422 284805 285175 285874 286497 286282 284957 282939 280918
52717 280918 279440 278711 278520 278402 277994 277167 275883 274180 272384 270999 270198 269631 268957 268326 268068 268093 268005 267793
52699 267793 268051 269271 271176 273004 274354 275508 276868 278346 279488 280030 280125 280076 280078 280217 280495 280760 280717 280097
52681 280097 278758 276775 274603 273054 272749 273411 273995 273731 272851 272166 272073 272186 271887 271075 270345 270448 271479
52664 271479 272712 273306 273108 272544 271968 271539 271640 272769 274785 276776 277990 278575 279167 280122 281497 283329
52648 283329 285427 287082 287486 286479 284610 282566 280713 279104 277691 276576 276113 276514 277314 277611 277097 276482
52632 276482 276663 277861 279842 282511 285778 289244 292600 296063 299799 303122 304955 305015 303955 302341 300141
52617 300141 297323 294340 291739 289656 287889 286232 284591 282993 281597 280527 279700 279018 278625 278723 279195 279716
52601 279716 280173 280691 281320 282047 283004 284251 285343 285628 285103 284566 284732 285460 286103 286380 286608 287198 288123 289040
52583 289040 289845 290910 292545 294290 295161 294808 294074 294129 295233 296696 297826 298531 299069 299562 299801 299358 298004
52566 298004 296077 294198 292511 290646 288616 287185 286780 286578 285448 283513 281983 281540 281720 281890 282018 282268
52550 282268 282553 282854 283439 284405 285345 285789 285712 285436 285242 285227 285280 285148 284745 284408 284511 284899 285055 284872 284836 285389
52530 285389 286451 287655 288663 289213 289214 288912 288658 288445 287957 287096 286164 285458 285045 284903 285037 285460 286388 288295
52512 288295 291409 295248 299057 302576 305970 309236 312271 315345 318735 321937 323997 324702 324669 324166 322644
52497 322644 319685 315687 311341 307118 303507 300987 299332 297654 295564 293694 292684 292377 292470 293179 294543
52482 294543 295782 296245 296530 297771 300063 302410 304109 305383 306682 308108 309639 311332 313106 314756 316304
52467 316304 318018 320013 322203 324694 327794 331398 334644 336468 336600 335913 335647 336174 336591 335741 333540 330955
52451 330955 328658 326204 322834 318667 314664 311606 309484 307753 305841 303493 300941 298767 297401 296696
52437 296696 296045 294902 293184 291342 290034 289522 289352 288884 288142 287811 288352 289504 290777 292039 293398 294902
52421 294902 296586 298472 300273 301441 301750 301592 301502 301772 302704 304750 307986 311807 315586 319395 323799 329244
52405 329244 335973 344118 353381 362929 372112 380981 389560 396787 400846 400600 396341 389256 380674 371848
52391 371848 363867 357344 352199 347833 343569 339207 335312 332727 331605 331158 330633 330259 330873 332837 335717
52376 335717 338854 341847 344588 347255 350301 354157 358905 364350 370277 376396 382259 387512 392101 395976
52362 395976 398816 400324 400606 399978 398609 396669 394531 392489 390515 388732 387801 388244 389598 390889 391881
52347 391881 393194 395136 397140 398609 399835 401719 404850 409130 414056 419202 424535 430392 437003 444056
52333 444056 450963 457664 464950 473818 484622 496891 509925 523494 538069 554331 572508 592202
52321 592202 612802 633808 654729 675090 694745 713903 732518 750001 765902 780665 795242
52310 795242 810086 824953 839593 854188 869047 884250 899591 914635 928875 942127 954757
52299 954757 967251 979628 991518 1002622 1012677 1021067 1026960 1029904 1029993 1027505 1022790 1016506 1009445
52286 1009445 1001963 993841 984897 975482 966267 957826 950560 944885 941348 940498 942521 946917 952706 959185
52272 959185 966370 974578 983841 994050 1005395 1018161 1032123 1046538 1060748 1074477 1087671 1100434
52260 1100434 1113081 1125808 1138327 1150166 1161319 1172248 1183293 1194467 1205782 1217260 1228587
52249 1228587 1239181 1248657 1256820 1263241 1267373 1269141 1268928 1266872 1262773 1256834 1249968 1243056 1236360 1229939
52235 1229939 1224111 1219104 1214621 1210243 1205982 1202115 1198713 1195734 1193326 1191571 1190101 1188450 1186775 1185834
52221 1185834 1186218 1187920 1190717 1194620 1199649 1205324 1210758 1215419 1219731 1224717 1230973 1238155 1245632 1253396
52207 1253396 1261974 1271450 1281041 1289856 1297823 1305579 1313497 1321122 1327615 1332661 1336840 1341180 1346394 1352613
52193 1352613 1359705 1367542 1375853 1384072 1391621 1398345 1404446 1410065 1415054 1419076 1421737 1422679 1421718 1418826
52179 1418826 1413857 1406537 1396982 1386037 1374730 1363470 1352175 1341075 1330895 1322122 1314509 1307505
52167 1307505 1300905 1294940 1289972 1286250 1283829 1282597 1282474 1283561 1285962 1289451 1293438 1297189 1300007 1301415
52153 1301415 1301471 1300722 1299532 1297654 1294761 1291216 1287813 1284956 1282610 1280873 1279903 1279311 1278374 1276974 1275630
52138 1275630 1274412 1272589 1269676 1266201 1263033 1260542 1258904 1258615 1260055 1262977 1267087 1272877 1281256 1292599
52124 1292599 1306756 1323827 1344251 1368035 1394365 1422024 1449921 1477378 1504404 1531630 1559478
52113 1559478 1587325 1613863 1638269 1660566 1680870 1698899 1714463 1727919 1739766 1750082 1758697
52102 1758697 1765643 1771122 1775276 1778423 1781353 1784853 1788819 1792194 1793956 1793861 1792125 1788690 1783115 1774965
52088 1774965 1764029 1750365 1734522 1717709 1701312 1686074 1671998 1659053 1647706 1638624 1632149 1628193
52076 1628193 1626402 1626350 1627860 1631226 1636757 1643981 1651895 1660307 1670378 1683235 1698470 1714610 1730711
52063 1730711 1746668 1762219 1776632 1789501 1800998 1811092 1819308 1825586 1830644 1834993 1838187 1839575
52051 1839575 1839300 1837947 1835563 1831616 1825710 1817690 1807191 1793724 1777339 1758732 1738534 1716884 1693867
52038 1693867 1670074 1646479 1623877 1602622 1582826 1564596 1548008 1532966 1519291 1507073 1496769
52027 1496769 1488691 1482300 1476258 1469304 1461046 1451782 1441709 1430560 1418155 1405168 1393050 1382888
52015 1382888 1374321 1365799 1356046 1345014 1333271 1320888 1307439 1292887 1277797 1262482 1246438 1228930
52003 1228930 1209833 1189595 1168575 1146744 1124004 1100538 1076765 1053068 1029762 1007430 987083
51992 987083 969582 954756 941458 928769 916808 905976 895787 885088 873274 860682 847699
51981 847699 834161 819812 804883 789932 775333 761017 746489 731145 714974 698908 684099
51970 684099 670936 659272 649424 642137 637515 634857 633893 635314 639579 645916 653140 660882 669245 677659
51956 677659 684960 690495 694391 696659 696641 693626 687753 680124 672152 664845 658547 653246 648970 645851 644044
51941 644044 643932 646285 651731 660014 670212 681717 694470 708181 721916 734662 745699 754197 759196
51928 759196 760416 758573 754403 747895 738861 727621 714555 699646 683200 666519 650989 636817
51916 636817 623423 610748 599372 589560 581096 574018 568735 565407 563989 564919 569001 576394 586345 598155
51902 598155 611806 627335 644027 660504 675426 688015 698044 705317 708964 707523 700178 687711
51890 687711 671844 653908 634676 615123 596314 578531 561487 545670 532601 523325 517414 513940
51878 513940 512745 514059 517424 521850 526918 533013 540497 549088 558069 566690 574285 580298 584339 586127
51864 586127 585479 582509 577688 571523 564341 556595 549235 543394 539733 538355 539246 542290 546774 551424 555374
51849 555374 558856 562505 566085 568376 568326 565889 561649 556148 549941 543805 538189 532562 525920 518152 510490
51834 510490 504430 500434 497816 495607 493429 491804 491714 493627 496853 500037 502221 503167 502779 500901 497770
51819 497770 494038 489986 485254 479726 474236 470002 467706 467410 468800 471031 472878 473774 474500 476217 479009
51804 479009 481863 483828 484537 483820 481619 478429 475307 473192 472347 472348 472290 471295 469263 466977 465089 463260
51788 463260 460751 457550 454267 451179 448179 445562 444011 443690 444000 444336 444551 444635 444582 444717 445499 446860 448278
51771 448278 449623 451378 453959 457488 462360 469206 477968 487681 497592 507892 518910 530139 540521
51758 540521 549263 555882 559871 560827 558701 553532 545335 534711 523180 512397 503112 495209 488458 482760
51744 482760 477935 473818 470554 468367 467141 466642 467117 469197 473150 478561 484835 491776 499487 507857 516252
51729 516252 523681 529307 532933 535056 536413 537442 538084 538018 537049 535294 532986 530051 526066 520802 514727
51714 514727 508739 503444 498917 495002 491473 487958 484120 480009 475994 472406 469659 468622 470225 474406
51700 474406 479858 485050 489180 492052 493642 494178 494249 494364 494631 495154 496332 498305 500418 501764 502065 501534
51684 501534 500024 496950 492124 486204 480154 474634 470010 466566 464427 463470 463555 464764 467208 470657 474465
51669 474465 478005 481188 484581 488956 494640 501303 508315 515171 521415 526335 529082 529282 527381 524229
51655 524229 520343 515797 510875 506534 503955 503753 505928 510418 517194 525559 533830 540093 543176 542788 539179
51640 539179 533083 525619 517632 509151 499954 490495 481796 474500 468541 463674 459746 456390 453130 450030
51626 450030 447756 446763 446758 447112 447322 446918 445481 443155 440754 439030 437991 437188 436307 435232 433845 432132
51610 432132 430332 428680 427210 425958 425180 425207 426242 428364 431426 434863 438026 440923 444272 448628 453845
51595 453845 459647 466244 474047 483088 493055 503446 513243 520894 525289 526687 526194 524425 521186 516377
51581 516377 510735 505571 502060 500759 501533 503978 508153 514849 524851 538016 553385 570145 588191
51568 588191 607828 629261 652346 676501 700834 724686 748265 772563 798621 827070 858421
51557 858421 893499 933204 977715 1025865 1075129 1122131 1163355 1195865 1217830 1228588 1228169 1216770
51545 1216770 1194863 1163728 1125500 1082350 1035847 987264 938125 890018 844142 801539 763433
51534 763433 730587 702395 677419 654864 634843 617151 600840 585342 571152 558781 547763
51523 547763 537367 527669 519170 511818 505177 499196 494056 489563 485417 481899 479475 477836 476124 474117
51509 474117 472523 471963 472289 473017 473840 474494 474599 474004 473050 472306 472111 472349 472493 471964 470728 469433 468702 468421
51491 468421 468015 467259 466371 465446 464292 462853 461357 459955 458539 456926 454951 452361 448975 444985 440817
51476 440817 436702 432590 428424 424208 419940 415819 412321 409632 407113 403872 399864 395922 392673 389984
51462 389984 387532 385372 383634 382184 380921 380096 380017 380704 382085 384288 387359 390867 394154 397078 400260
51447 400260 404439 409716 415630 422065 429808 439906 452511 466784 481890 497483 512849 526232
51435 526232 535802 541173 543417 543743 542725 540634 537658 533598 527984 520811 512740 504350 495579 486206
51421 486206 476594 467668 460256 454578 450233 446668 443795 442053 441665 442086 442604 443277 444748 447210 450186
51406 450186 453291 456498 459562 461957 463755 465884 469075 473062 477193 481277 485354 489184 492651 496328
51392 496328 500972 506659 512962 519888 528018 537796 549243 562487 578181 597307 620849 649614 684012
51379 684012 723961 769248 819922 876065 937273 1002667 1071208 1141336 1210103 1273230 1326479
51368 1326479 1366925 1392946 1403677 1399060 1380227 1349186 1307941 1258168 1201615 1140313 1076142
51357 1076142 1010571 945155 881970 823078 769584 721609 679157 642509 611642 585736 563721
51346 563721 545090 529797 517481 507165 497768 488635 479583 470750 462503 455342 449731 445962 443996
51333 443996 443257 442672 441223 438557 435008 431135 427398 424086 421211 418494 415721 413133 411166 409801 408447
51318 408447 406578 404275 402071 400469 399669 399566 399925 400656 401911 403799 406116 408560 411061 413579 415777
51303 415777 417286 418269 419238 420344 421363 422382 423896 425938 427714 428473 428309 427717 426755 425123 422767 419951
51287 419951 416927 414003 411707 410341 409516 408695 408156 408877 411323 414879 418624 422239 425833 429257 432051
51272 432051 433858 434563 434073 432410 430156 428485 428430 430041 432394 434495 436125 437741 439633 441374 442195
51257 442195 441758 440363 438438 436082 433252 430163 427176 424320 421234 417722 414127 410933 408167 405562
51243 405562 403242 401883 401990 403254 404792 405822 406034 405540 404724 404005 403516 403073 402579 402256 402254 402272 401918 401321
51225 401321 400973 400976 400861 400256 399429 398999 399309 400205 401182 401613 401094 399900 399000 399343 400979 402982 404370 405128
51207 405128 406186 408328 411295 414252 416992 420172 424183 428351 431762 434474 437279 440441 443365 445528
51193 445528 447049 448090 448338 447432 445470 442749 439440 435978 433398 432558 433074 433539 432917 431348 429517 427679
51177 427679 425606 423232 420951 419277 418427 418255 418371 418259 417581 416581 416032 416487 417629 418701 419533 420731
51161 420731 422759 425378 428326 432012 436872 442227 446462 448492 448614 447844 446882 445921 444992 444059 442919 441340
51145 441340 439313 437094 435028 433394 432393 432135 432571 433365 433928 433830 433271 432897 433019 433222 432933 431997 430491
51128 430491 428399 426032 424372 424216 425032 425394 424674 423637 423197 423263 423216 423023 423409 425102 428205 432110 435842
51111 435842 438724 440893 442986 445254 447271 448635 449606 450843 452816 455600 458925 462249 465088 467501
51097 467501 469968 472602 474830 476041 476232 475730 474657 473070 471381 470173 469641 469510 469449 469386 469455 469790 470237
51080 470237 470178 468939 466604 464292 463323 464095 465898 467676 468840 469472 470077 471256 473489 476992 481611 486903
51064 486903 492615 499168 507362 517375 528506 540252 553151 567783 583201 597346 609111 619151
51052 619151 628538 637638 646776 657109 669962 685620 703286 721786 739783 755787 768676 778119
51040 778119 784062 786117 783993 778309 770387 761326 751572 741105 729569 716387 701277 684543 666575
51027 666575 647420 627490 608406 592331 580236 571275 563992 557742 552873 550014 549486 551213 554892
51014 554892 560160 566596 573643 580774 587935 595614 604248 613680 623318 632703 641768 650738 659944 669550
51000 669550 679293 688765 698079 707927 718749 730159 741481 752476 763168 773326 782596 790962 798608
50987 798608 805480 811355 816246 820435 824273 828237 832915 838551 844813 851372 858402 866123 874202 882236
50973 882236 890665 900586 912713 927011 943363 962126 984041 1009931 1040437 1075602 1114748 1157099
50961 1157099 1202432 1250837 1302066 1355614 1411211 1468601 1526878 1584720 1641422 1697140 1751855
50950 1751855 1804588 1853980 1899410 1941263 1980278 2016943 2051631 2085148 2118749 2153296 2188485
50939 2188485 2223272 2257003 2289533 2320209 2347555 2370294 2388026 2400526 2407261 2408269 2404584 2396668
50927 2396668 2383011 2361469 2331576 2294343 2250158 2198446 2139442 2074742 2005687 1932624 1856470
50916 1856470 1779817 1705471 1634536 1566693 1501740 1440096 1382309 1328949 1280719 1238041 1200564
50905 1200564 1167481 1138085 1111715 1087516 1064854 1043824 1024927 1008319 993615 980272 967911
50894 967911 956418 945955 936767 928906 922305 917056 913272 910608 908440 906634 905673 905803 906548 907347 908215
50879 908215 909463 911221 913631 917095 921858 927577 933743 940293 947536 955716 964984 975532 987335 999964
50865 999964 1013043 1026875 1042395 1060610 1082131 1106923 1134362 1163867 1195707 1230868 1270002
50854 1270002 1313015 1360052 1412290 1471075 1536593 1608100 1685345 1769113 1860302 1959012 2064676
50843 2064676 2176586 2293996 2415983 2541487 2669458 2798834 2928326 3056137 3179873
50834 3179873 3296830 3404533 3501127 3585513 3657519 3718083 3768997 3812298 3849966 3884155 3917276
50823 3917276 3951603 3988988 4031039 4079191 4134172 4195369 4260689 4326807 4389590 4444727 4488259
50812 4488259 4516356 4524851 4509822 4469150 4403083 4313009 4200254 4066569 3915109 3750054 3575415
50801 3575415 3394882 3212537 3032744 2859104 2694032 2539461 2397279 2268805 2154271
50792 2154271 2053112 1964594 1888055 1822942 1768755 1724799 1689851 1662287 1640560 1623389 1609531
50781 1609531 1597820 1587544 1578448 1570153 1561827 1552668 1542486 1531575 1520106 1507833 1494366 1479550
50769 1479550 1463590 1446870 1429655 1411887 1393306 1373796 1353626 1333299 1313108 1292875 1272233
50758 1272233 1251272 1230869 1212224 1196062 1182382 1170851 1161163 1153101 1146686 1142523 1141630 1144542 1150736
50745 1150736 1159230 1169559 1181935 1196711 1214239 1235216 1260678 1291409 1327566 1368896 1415007
50734 1415007 1465280 1518914 1575445 1635111 1698328 1764646 1832409 1899681 1965515 2030202 2094266
50723 2094266 2157406 2218587 2276929 2332128 2383944 2431693 2474434 2511405 2542003 2565543 2581396
50712 2581396 2589478 2590555 2586211 2578757 2570984 2565627 2564724 2569374 2579991 2596747 2619840 2649301 2684336
50699 2684336 2722760 2761302 2796652 2826075 2846916 2855966 2849937 2826746 2786232 2729716 2659154 2576732
50687 2576732 2484963 2386804 2285531 2184373 2086189 1993444 1908323 1832542 1766915 1711330 1665336
50676 1665336 1628624 1600866 1581436 1569631 1565042 1567405 1576161 1590435 1609335 1631989 1657344 1684257
50664 1684257 1711732 1738830 1764473 1787718 1808299 1826597 1843109 1858243 1872619 1887065 1902149
50653 1902149 1918049 1935048 1953732 1974404 1996645 2019938 2044660 2072034 2103024 2137607 2175341
50642 2175341 2216450 2262129 2313618 2371003 2432915 2497412 2563091 2629323 2695647 2761334 2825722
50631 2825722 2888614 2949989 3009503 3066699 3121624 3174464 3223902 3265999 3295249 3307151 3299961
50620 3299961 3274478 3232959 3178581 3115524 3048808 2983500 2923798 2872400 2830376 2797602 2773515
50609 2773515 2757511 2748610 2744908 2743722 2742433 2739105 2732206 2719871 2699670 2669281 2627565 2575067
50597 2575067 2513378 2443957 2367705 2285738 2200268 2114335 2030587 1950520 1874805 1803983 1738515
50586 1738515 1678447 1623408 1573184 1528109 1488627 1454504 1424789 1398678 1376115 1357167 1341098
50575 1341098 1326682 1313461 1302031 1292992 1286319 1282072 1280912 1283217 1288284 1295222 1304223 1316014 1330356
50562 1330356 1346085 1362686 1380871 1401504 1424793 1450696 1479226 1509986 1542166 1575415 1610071
50551 1610071 1646101 1682491 1718128 1752656 1785943 1817339 1846207 1872954 1898859 1925075 1952210
50540 1952210 1980730 2011451 2045812 2085750 2132886 2187507 2248829 2316516 2391412 2474436 2565520
50529 2565520 2664288 2771167 2887007 3011968 3145533 3287129 3435767 3589202 3744451 3899140
50519 3899140 4051498 4199058 4338364 4466204 4580298 4678396 4757575 4815061 4849271 4859562
50509 4859562 4845512 4807243 4746334 4665689 4568354 4456993 4334790 4206472 4077819 3953972
50499 3953972 3838417 3733691 3642613 3568317 3513147 3477981 3462651 3466385 3487511 3523101 3569206
50488 3569206 3621058 3672707 3717013 3746872 3756759 3743225 3704509 3640358 3552098 3442467 3315359
50477 3315359 3175817 3029594 2881749 2735496 2592721 2455378 2325726 2205325 2094548
50468 2094548 1993246 1901328 1818553 1744348 1678177 1619796 1568901 1524850 1486930 1454661 1427711
50457 1427711 1405768 1388684 1376537 1369387 1367057 1369168 1375203 1384493 1396337 1410154 1425410 1441433
50445 1441433 1457493 1473063 1487872 1501792 1514823 1527086 1538619 1549295 1559067 1568047 1576095 1582611
50433 1582611 1587133 1589974 1591944 1593657 1595566 1598372 1602741 1608574 1615176 1622266 1630396 1640353 1652619 1667561
50419 1667561 1685607 1707029 1731911 1760562 1793703 1832054 1875986 1925632 1981017 2041865 2107469
50408 2107469 2176922 2249355 2323909 2399639 2475406 2549673 2620478 2685991 2745192 2797795 2843440
50397 2843440 2881105 2909232 2926171 2930536 2921377 2898184 2860794 2809596 2746028 2672588 2592016 2506652
50385 2506652 2418807 2331367 2247537 2170206 2101917 2044919 2000418 1967967 1946409 1935389 1935136 1944822
50373 1944822 1962017 1983893 2008074 2031974 2052199 2065284 2068682 2060831 2040941 2009302 1967423 1917344
50361 1917344 1860912 1799865 1736112 1671459 1607260 1544597 1484491 1427626 1374055 1323478 1275646
50350 1275646 1230434 1187851 1148257 1112384 1080903 1054052 1031663 1013317 998533 987130 979387
50339 979387 975502 975012 977228 982107 990085 1001135 1014796 1031171 1050898 1073793 1098400 1123368 1148360
50326 1148360 1172874 1194952 1212176 1223656 1230254 1233105 1232773 1229807 1225242 1220199 1215276 1210427 1205221
50313 1205221 1199236 1192506 1185580 1179023 1173018 1167496 1162347 1157337 1152254 1147397 1143501 1140791 1138532 1136044
50299 1136044 1133817 1133072 1134422 1137542 1141934 1147422 1153920 1161300 1169599 1178979 1189438 1200820 1213111
50286 1213111 1226476 1241090 1257145 1274666 1292803 1309435 1322059 1329252 1331076 1328240 1321395 1311325
50274 1311325 1299250 1286596 1274508 1263603 1253976 1245460 1238031 1231932 1227239 1223484 1220025 1216698 1213754
50261 1213754 1211117 1208086 1203877 1198312 1191943 1185691 1180285 1175861 1172113 1168915 1166621 1165541 1165394 1165751
50247 1165751 1166904 1169819 1175161 1182768 1192157 1203129 1215745 1230087 1246332 1264827 1285740 1308690
50235 1308690 1332786 1356936 1380019 1401001 1419230 1434652 1447672 1458806 1468497 1477060 1484505 1490320
50223 1490320 1493531 1493126 1488472 1479344 1465654 1447328 1424514 1397828 1368300 1337155 1305693 1275272
50211 1275272 1247145 1222301 1201448 1185030 1172922 1164087 1156734 1148986 1139353 1126686 1110127 1089498
50199 1089498 1065721 1040600 1015973 992943 971741 952161 933987 917052 901166 886303 872815
50188 872815 861038 850565 840399 830043 819982 810636 801399 791482 781370 772466 765268 758859 752416
50175 752416 746274 741035 736509 732257 728557 725940 724073 721971 719276 716665 714913 714134 714063 714593 715796
50160 715796 717722 720449 724118 728689 733726 738755 743996 750545 759537 770995 783704 796173 807430
50147 807430 816872 824054 829175 833246 836923 839450 839604 837587 834977 832794 830739 828729 828030 830058 834870
50132 834870 841662 850171 860680 873103 887054 902643 920403 940463 962499 986569 1013458 1043996
50120 1043996 1078314 1115661 1154668 1193967 1232939 1271856 1311114 1350592 1389978 1429295 1468593
50109 1468593 1507367 1544713 1579858 1612047 1640076 1662372 1677485 1684265 1681919 1670401 1650615 1623868
50097 1623868 1591326 1554310 1514655 1474127 1433604 1393432 1354517 1318556 1287223 1261435 1241292
50086 1241292 1226197 1215103 1207020 1201328 1197519 1194899 1192833 1190940 1188835 1186191 1183468 1181921 1182118 1182910
50072 1182910 1182688 1181275 1179678 1178287 1176403 1173461 1169594 1164735 1158203 1149620 1139544 1128761 1117555
50059 1117555 1106081 1094890 1084603 1075288 1066526 1057912 1049451 1041694 1035517 1031392 1028938 1027565 1027487 1029513
50045 1029513 1033785 1039439 1045762 1053110 1062278 1073305 1085353 1097605 1110022 1123244 1137763 1153069
50033 1153069 1167668 1180192 1190460 1199268 1207281 1214452 1220351 1224589 1227003 1227828 1227614 1226560 1223998 1219040
50019 1219040 1211709 1202939 1193591 1184005 1174378 1164792 1154787 1143663 1131480 1119207 1107721 1097286
50007 1097286 1088243 1081451 1077563 1076371 1077400 1080844 1087473 1097911 1112348 1130731 1152837 1178265 1206534
49994 1206534 1237006 1268596 1299830 1329504 1357169 1382846 1406389 1427204 1444361 1456794 1463485
49983 1463485 1463560 1456202 1440597 1416287 1383586 1343654 1298371 1250278 1202116 1155735 1111489 1069242
49971 1069242 1029813 994798 964907 939198 916133 894966 875890 859433 845914 835076 825928
49960 825928 817304 808819 801077 794823 790239 787118 785362 785174 787033 791537 798967 808966 820867 834204
49946 834204 848525 862930 876372 888333 898707 907196 913592 918564 923217 927531 929966 928901 923861
49933 923861 915169 903207 888502 871883 853956 834776 814428 793558 773064 753645 735957 720725
49921 720725 708346 698693 691501 686544 683289 680954 679216 678416 678821 680144 682044 684528 687619 691188
49907 691188 695500 701340 709169 718549 728751 739483 750787 762803 776030 791225 808517 826886
49895 826886 844850 861248 875216 886133 894041 899578 903018 903902 901948 897543 890837 881134 868030
49882 868030 852540 836273 819869 803068 785863 768632 751374 733810 716346 700150 686191
49871 686191 674668 665364 657957 651913 646631 641958 638333 636341 636208 637705 640499 644699 650887 659256
49857 659256 668874 678555 688479 700022 713670 728153 742268 756552 772139 788683 804537 818495
49845 818495 830226 839340 845303 848312 849227 848461 845654 840484 833080 823653 812460 800178 787586 774826
49831 774826 761637 748374 736175 726019 718132 712271 708012 704865 702705 702082 703541 706815 711409
49818 711409 717741 726737 738358 751502 765446 780349 796032 811365 825412 838295 850315 860973
49806 860973 869621 876505 882360 887243 890454 891404 890018 886467 881009 874004 865632 855706 844114 831305
49792 831305 817929 804092 789458 774163 759223 745806 734342 724540 716099 709079 703555 699186
49780 699186 695392 691853 688557 685380 681984 678368 675219 673414 673294 674654 677286 681191 686339 692592
49766 692592 699899 708347 717945 728492 739581 750534 760449 768630 775009 779996 783928 786836 788585
49753 788585 788951 787516 783733 777262 768216 757101 744535 731041 717117 703580 691546 681741 673829
49740 673829 666895 660576 655209 650827 646733 642491 638715 636368 635723 636521 638630 641899 645700 649300 652553
49725 652553 655729 659004 662669 667524 674345 683170 693626 705639 719101 733172 746834 759969 772997
49712 772997 785493 796131 804070 809518 812763 813542 811698 807681 801959 794561 785624 775868 766106 756655
49698 756655 747498 738672 730265 722406 715369 709255 703493 697278 690799 685457 682479 681699 682128 683341 685834
49683 685834 690195 696371 703741 711721 720255 729758 740616 752923 766787 782530 800123 818595 836513
49670 836513 852965 867616 879985 889343 895352 898294 898685 897259 895247 893876 893481 893800 895088 897852
49656 897852 901148 902144 898222 889000 875814 859875 841714 821977 801825 782463 764721 749048
49644 749048 735560 724098 714419 706253 699188 692920 687820 684841 684498 686184 688652 690821 691922 691437
49630 691437 689408 686517 683407 680018 675870 670781 665050 659128 653391 647953 642526 636723 630778 625698
49616 625698 622362 620667 619753 618841 617680 616496 615798 615985 616922 618076 619146 620221 621269 621981 622340 622813
49600 622813 623654 624515 625012 625166 624919 623930 622441 621691 622620 624555 626062 626832 627820 629578 631507 632952 634155
49583 634155 635737 637837 640239 642858 645614 648138 650118 651830 653910 656600 659566 662515 665718 669747
49569 669747 674925 681291 689046 698634 710221 723347 737335 751725 765935 778725 788641 795129 798750
49556 798750 800171 799389 796138 790607 783454 775453 767393 759969 753480 747958 743807 741806 742036 743270 744089
49541 744089 744397 745172 746815 748502 749333 749515 750054 751684 754565 758766 764499 771819 780501 790547 802549
49526 802549 817107 833894 851818 870297 889833 910864 932470 952883 971057 986983 1000579
49515 1000579 1011281 1019075 1025118 1030804 1036732 1043052 1050214 1058776 1068690 1079252 1089413 1097756 1102567
49502 1102567 1102553 1097432 1087531 1073107 1054451 1032369 1008111 983076 958879 937184 918814 903231
49490 903231 889418 877005 866018 856044 846586 838101 831654 827417 824318 821484 819230 818245 818454 819268
49476 819268 820465 822176 824205 825957 827137 828173 829840 832617 836385 840611 844702 848319 851470 854429
49462 854429 857595 861279 865496 869917 874088 877644 880266 881548 881065 878566 874077 867918 860718 853255
49448 853255 846097 839366 832828 826118 818951 811472 804555 799355 796273 794596 793471 792949 793640 795637 798479
49433 798479 802201 807671 815528 825281 835976 847498 860743 876634 895471 917282 942227 970476
49421 970476 1002096 1037377 1076550 1118209 1158035 1190183 1210721 1219509 1218703 1210269 1195660 1177184
49409 1177184 1158309 1142365 1131544 1127097 1129545 1138328 1151896 1168577 1187127 1206529 1225913 1244849
49397 1244849 1263071 1279786 1294027 1305951 1316905 1327660 1337291 1344425 1348900 1351432 1352158 1350380 1345469
49384 1345469 1337270 1325816 1311389 1294787 1276970 1258506 1239765 1221403 1204063 1187874 1172844
49373 1172844 1159586 1148951 1141020 1135101 1130780 1128374 1128192 1129832 1132269 1134360 1135165 1134139 1131107 1125946
49359 1125946 1118522 1109148 1098733 1088037 1077001 1065304 1053297 1041768 1031027 1020930 1011679 1003768
49347 1003768 997041 990672 984456 979455 976775 976030 975554 974066 971751 969566 967813 965710 962437 958194
49333 958194 953788 949438 944739 939902 936040 933685 931832 929317 926629 925356 926133 928147 930557 933400
49319 933400 936964 941194 946001 951438 957272 962989 968500 974299 980713 987534 994586 1002065 1010014 1017974
49305 1017974 1025558 1033018 1040904 1049518 1059005 1069684 1081943 1095910 1111392 1128049 1145598 1164028
49293 1164028 1183486 1203566 1222644 1238327 1248762 1253448 1253048 1248851 1242348 1234671 1226173 1216836 1207094
49280 1207094 1197833 1189513 1181749 1173992 1166251 1159003 1152730 1147723 1144070 1141710 1140598 1140808 1142315 1144853
49266 1144853 1148330 1153069 1159106 1165466 1170833 1174996 1178952 1183434 1187895 1191153 1192696 1193331 1194975 1199659
49252 1199659 1208122 1219392 1232270 1246909 1263869 1281648 1296476 1305142 1307159 1303594 1294861 1280591
49240 1280591 1261135 1238144 1213772 1189930 1168034 1148777 1132148 1118037 1106748 1098711 1093979 1092378
49228 1092378 1093779 1097817 1103554 1109870 1116060 1121924 1127592 1133583 1140598 1148737 1157157 1164904 1171921 1178990
49214 1178990 1186903 1196068 1206622 1218432 1231016 1243722 1255994 1267486 1278301 1289296 1301693 1316007
49202 1316007 1331635 1347742 1364151 1381049 1398229 1415146 1431441 1446971 1461539 1474997 1487413
49191 1487413 1498826 1509083 1518217 1526691 1534920 1542891 1550569 1558274 1566172 1573914 1581518 1590298 1602118
49178 1602118 1617748 1636535 1657658 1681047 1707097 1736300 1769486 1807966 1852877 1904211 1960221
49167 1960221 2017420 2071230 2117189 2152074 2174351 2184158 2183321 2175051 2162965 2150031 2138349 2129449
49155 2129449 2124213 2122503 2123263 2125179 2127187 2128653 2129435 2129751 2129779 2129500 2129103 2129195 2130348 2132782 2136828 2143260
49139 2143260 2152517 2163953 2176512 2189948 2204641 2220472 2236746 2253327 2270959 2290278 2311219
49128 2311219 2333549 2357145 2381397 2405182 2428020 2450733 2474328 2498650 2522700 2545991 2569059
49117 2569059 2592871 2618281 2645866 2675775 2707766 2741801 2778640 2819723 2866734 2921715 2987207
49106 2987207 3065365 3156234 3256722 3361293 3464328 3563160 3659579 3757254 3855733 3946593 4016968
49095 4016968 4057942 4069277 4056026 4022197 3968973 3897745 3812309 3717460 3616949 3513633 3410597
49084 3410597 3311150 3218202 3134233 3061209 2999757 2948793 2906648 2872271 2844821 2822772 2804450
49073 2804450 2789153 2776753 2766275 2755905 2744476 2732089 2719200 2706094 2693475 2682521 2673714
49062 2673714 2666297 2659379 2652961 2647410 2642593 2638143 2634054 2630372 2626819 2623373 2620846 2620131 2621107 2622851
49048 2622851 2624657 2626330 2627805 2629244 2631407 2635270 2641202 2648992 2658529 2669985 2683489 2699191 2717519
49035 2717519 2738590 2761209 2782963 2801552 2815775 2825361 2830476 2831579 2829329 2824300 2816945 2807838 2797685
49022 2797685 2787066 2776470 2766544 2757896 2750599 2744287 2738829 2734633 2732184 2731582 2732563 2734653 2737309 2740282
49008 2740282 2743928 2748792 2754739 2760876 2766438 2771381 2775905 2779919 2783421 2787064 2791699 2797233 2802321 2805431
48994 2805431 2806043 2804749 2802393 2799426 2795974 2792113 2787726 2782304 2775369 2767270 2759187 2752130 2746135 2740671
48980 2740671 2735654 2731698 2729454 2728995 2729901 2731748 2734409 2737904 2741946 2745751 2748593 2750604 2752671 2755407
48966 2755407 2758585 2761838 2765384 2769611 2774303 2778887 2783247 2787698 2792316 2797017 2802365 2809553 2819278 2831090
48952 2831090 2844130 2858098 2873239 2889802 2907925 2927846 2949839 2973946 3000027 3028082 3058351
48941 3058351 3090998 3125730 3161770 3198359 3235395 3273518 3313564 3356135 3401771 3451118 3504441
48930 3504441 3561188 3620515 3682220 3746700 3813993 3883312 3953671 4024618 4096258 4168893 4242760
48919 4242760 4317722 4393062 4467806 4541394 4613710 4684341 4752118 4815570 4873732 4926585 4975106
48908 4975106 5020909 5065256 5108095 5148358 5185358 5219411 5250907 5279440 5304549 5326941 5348124
48897 5348124 5368800 5388170 5404981 5418691 5429497 5437801 5444090 5448974 5452756 5454848 5453961 5449009 5439721
48884 5439721 5426384 5409292 5388554 5364328 5336974 5306959 5274758 5240847 5205582 5168933 5130394
48873 5130394 5089145 5044337 4995314 4941855 4884296 4823179 4758694 4690696 4619530 4546640 4474006
48862 4474006 4403053 4334313 4268016 4204539 4144202 4087055 4033149 3982763 3936075 3892796 3852567
48851 3852567 3815745 3783361 3756041 3733107 3713030 3694770 3678462 3664837 3654377 3647251 3643665 3643817
48839 3643817 3647521 3654328 3664089 3677023 3693119 3711774 3732158 3753653 3775803 3798194 3820682 3843570
48827 3843570 3867270 3891892 3917189 3942748 3968082 3992803 4016920 4040806 4064774 4088893 4113253
48816 4113253 4137995 4162876 4187217 4210578 4233148 4255218 4276744 4297850 4319288 4341766 4365073
48805 4365073 4388505 4411948 4435921 4460732 4486305 4512824 4540813 4570356 4600795 4631452 4662142
48794 4662142 4692707 4722437 4750326 4775718 4798526 4818944 4837206 4853563 4868379 4882088 4894811
$$ [...]
##END NTUPLES=NMR SPECTRUM
##END=
