##TITLE=AC1529_ROEFFECT0007_8213873_tsFLEEnnBh
##JCAMPDX= 6.0         $$ Bruker NMR JCAMP-DX V2.0
##DATA TYPE= NMR SPECTRUM
##DATA CLASS= NTUPLES
##ORIGIN= BRUKER
##OWNER= Administrator
$$ 1.72 TOPSPIN		Version 2.1
$$ 2013-10-04 19:27:06.871 -0700  Administrator@X
$$ Compression mode = diff/dup
##.OBSERVE FREQUENCY= 400.02188249412
##.OBSERVE NUCLEUS= ^1H
##.ACQUISITION MODE= SIMULTANEOUS (DQD)
##.ACQUISITION SCHEME= undefined
##.AVERAGES= 8
##.DIGITISER RES= 22
##SPECTROMETER/DATA SYSTEM= spect
##.PULSE SEQUENCE= zg30
##.SOLVENT NAME= COFFEE_meoh
##.SHIFT REFERENCE= INTERNAL, COFFEE_meoh, 1, 14.98509
##AUDIT TRAIL= $$ (NUMBER, WHEN, WHO, WHERE, PROCESS, VERSION, WHAT)
$$ ##TITLE= Audit trail, TOPSPIN		Version 2.1
$$ ##JCAMPDX= 5.01
$$ ##ORIGIN= Bruker BioSpin GmbH
$$ ##OWNER= Administrator
$$ $$ E:\/data/COFFEE/nmr/AC1529_ROEFFECT0007_8213873_tsFLEEnnBh/10/pdata/1/auditp.txt
$$ ##AUDIT TRAIL=  $$ (NUMBER, WHEN, WHO, WHERE, PROCESS, VERSION, WHAT)
(   1,<2013-10-04 19:27:00.636 -0700>,<Administrator>,<X>,<go>,<TOPSPIN 2.1>,
      <created by zg
	started at 2013-10-04 19:25:54.902 -0700,
	POWCHK enabled, PULCHK disabled,
       configuration hash MD5:
       C8 4E 4E 5D D3 5C D8 9E 9F 52 82 E0 59 8A DE 15
       data hash MD5: 64K
       1D 7D 1B EB 07 6F 81 DC 68 21 42 96 9F 38 11 58>)
(   2,<2013-10-04 19:27:03.496 -0700>,<Administrator>,<X>,<proc1d>,<TOPSPIN 2.1>,
      <Start of raw data processing
       efp LB = 0 FT_mod = 6 PKNL = 1 PHC0 = 0 PHC1 = 0 SI = 32K 
       data hash MD5: 32K
       4F B2 30 17 23 68 14 31 C6 0E A1 1E 33 F7 3E 44>)
(   3,<2013-10-04 19:27:03.777 -0700>,<Administrator>,<X>,<proc1d>,<TOPSPIN 2.1>,
      <pk PHC0 = 95.67993 PHC1 = 0 
       data hash MD5: 32K
       41 F8 A4 54 E1 90 AF 23 7C 50 AD 10 C8 21 99 1D>)
(   4,<2013-10-04 19:27:03.871 -0700>,<Administrator>,<X>,<proc1d>,<TOPSPIN 2.1>,
      <abs ABSG = 1 
       data hash MD5: 32K
       54 A8 28 EC BA 7E D5 5E 31 41 F3 2E E6 C8 69 75>)
(   5,<2013-10-04 19:27:03.949 -0700>,<Administrator>,<X>,<proc1d>,<TOPSPIN 2.1>,
      <abs ABSG = 2 
       data hash MD5: 32K
       6D 4C 74 AE 38 A0 58 40 08 BD 88 1F E6 A1 A6 70>)
(   6,<2013-10-04 19:27:03.996 -0700>,<Administrator>,<X>,<proc1d>,<TOPSPIN 2.1>,
      <abs ABSG = 3 
       data hash MD5: 32K
       06 4A 85 81 95 27 2B 0B B1 88 4A CE C1 9C C8 CA>)
(   7,<2013-10-04 19:27:04.043 -0700>,<Administrator>,<X>,<proc1d>,<TOPSPIN 2.1>,
      <abs ABSG = 4 
       data hash MD5: 32K
       A9 9F BE 61 1D BA 51 AE 9E 47 C1 CF 43 9C EF 2C>)
(   8,<2013-10-04 19:27:04.090 -0700>,<Administrator>,<X>,<proc1d>,<TOPSPIN 2.1>,
      <abs ABSG = 5 
       data hash MD5: 32K
       EC DB 5C 03 91 40 CC 1D B0 8B BD 09 0B D0 77 FB>)
$$ ##END=
$$ 
$$ $$ hash MD5
$$ $$ 0D 84 25 79 36 CB 19 C3 A5 C2 BF A4 FB 59 37 52
##$RELAX= 
##$RELAX= 
##$RELAX= 
##$RELAX= 
##$RELAX= 
##$RELAX= 
##$RELAX= 
$$ Bruker specific parameters
$$ --------------------------
##$DU= <E:\>
##$EXPNO= 10
$$ [...]
150 150 150 150 150 150 150 150
##$TP07= 0
##$TPNAME0= <>
##$TPNAME1= <>
##$TPNAME2= <>
##$TPNAME3= <>
##$TPNAME4= <>
##$TPNAME5= <>
##$TPNAME6= <>
##$TPNAME7= <>
##$TPOAL= (0..7)
0.5 0.5 0.5 0.5 0.5 0.5 0.5 0.5
##$TPOFFS= (0..7)
0 0 0 0 0 0 0 0
##$TUNHIN= 0
##$TUNHOUT= 0
##$TUNXOUT= 0
##$USERA1= <user>
##$USERA2= <user>
##$USERA3= <user>
##$USERA4= <user>
##$USERA5= <user>
##$V9= 5
##$VALIST= <valist>
##$VCLIST= <CCCCCCCCCCCCCCC>
##$VD= 0
##$VDLIST= <DDDDDDDDDDDDDDD>
##$VPLIST= <PPPPPPPPPPPPPPP>
##$VTLIST= <TTTTTTTTTTTTTTT>
##$WBST= 2048
##$WBSW= 25
##$XGAIN= (0..3)
0 0 0 0
##$XL= 0
##$YL= 0
##$YMAX_a= 637715
##$YMIN_a= -541845
##$ZGOPTNS= <>
##$ZL1= 120
##$ZL2= 120
##$ZL3= 120
##$ZL4= 120
##$ABSF1= 14.98509
##$ABSF2= -5.573092
##$ABSG= 5
##$ABSL= 3
##$ALPHA= 0
##$AQORDER= 0
##$ASSFAC= 0
##$ASSFACI= 0
##$ASSFACX= 0
##$ASSWID= 0
##$AUNMP= <proc_prof1d_extract_pilot.lims>
##$AXLEFT= 0
##$AXNAME= <>
##$AXNUC= <1H>
##$AXRIGHT= 0
##$AXTYPE= 0
##$AXUNIT= <>
##$AZFE= 0.1
##$AZFW= 0.1
##$BCFW= 0
##$BC_mod= 0
##$BYTORDP= 0
##$COROFFS= 0
##$CY= 15
##$DATMOD= 1
##$DC= 0
##$DFILT= <>
##$DTYPP= 0
##$F1P= 0
##$F2P= 0
##$FCOR= 0.5
##$FTSIZE= 32768
##$FT_mod= 6
##$GAMMA= 0
##$GB= 0
##$INTBC= 1
##$INTSCL= 1
##$ISEN= 128
##$LB= 0
##$LEV0= 0
##$LPBIN= 0
##$MAXI= 10000
##$MC2= 0
##$MEAN= 0
##$ME_mod= 0
##$MI= 0
##$NCOEF= 0
##$NC_proc= -8
##$NLEV= 6
##$NOISF1= 0
##$NOISF2= 0
##$NSP= 0
##$NTH_PI= 0
##$NZP= 0
##$OFFSET= 14.98509
##$PC= 1
##$PHC0= 95.67993
##$PHC1= 0
##$PH_mod= 1
##$PKNL= yes
##$PPARMOD= 0
##$PPDIAG= 0
##$PPIPTYP= 0
##$PPMPNUM= 2147483647
##$PPRESOL= 1
##$PSCAL= 4
##$PSIGN= 0
##$PYNMP= <proc.py>
##$REVERSE= no
##$SF= 400.02
##$SI= 32768
##$SIGF1= 0
##$SIGF2= 0
##$SINO= 400
##$SIOLD= 32768
##$SPECTYP= <>
##$SREGLST= <1H.CDCl3>
##$SSB= 0
##$STSI= 32768
##$STSR= 0
##$SW_p= 8223.68421052631
##$SYMM= 0
##$S_DEV= 0
##$TDeff= 65536
##$TDoff= 0
##$TI= <>
##$TILT= no
##$TM1= 0
##$TM2= 0
##$TOPLEV= 0
##$USERP1= <user>
##$USERP2= <user>
##$USERP3= <user>
##$USERP4= <user>
##$USERP5= <user>
##$WDW= 1
##$XDIM= 32768
##$YMAX_p= 446502441
##$YMIN_p= -712318
##$CURPLOT= <Network HP LaserJet P1505>
##$CURPRIN= <$Network HP LaserJet P1505>
##$DFORMAT= <normdp>
##$LAYOUT= <+/1D_H.xwp>
##$LFORMAT= <normlp>
##$PFORMAT= <normpl>
##$SURQMSG= 1
$$ End of Bruker specific parameters
$$ ---------------------------------
##NTUPLES= NMR SPECTRUM
##VAR_NAME=  FREQUENCY,     SPECTRUM/REAL,   SPECTRUM/IMAG
##SYMBOL=    X,             R,               I
##VAR_TYPE=  INDEPENDENT,   DEPENDENT,       DEPENDENT
##VAR_FORM=  AFFN,          ASDF,            ASDF
##VAR_DIM=   32768,         32768,           32768
##UNITS=     HZ,            ARBITRARY UNITS, ARBITRARY UNITS
##FACTOR=    0.250966925370066, 1,           1
##FIRST=     8223.43324360094, 81233,        -14027
##LAST=      0,             -35185,          -15986
##MIN=       0,             -712318,         0
##MAX=       8223.43324360094, 446502441,    0
$$ Real data points
##PAGE= N=1
##DATA TABLE= (X++(R..R)), XYDATA
$$ [...]
23846 -410 43829 46257 -200998 -20541 -147017 -86756 57870 -7635 186511 100845 -280943 -79204
23833 -127801 87948 13220 130556 -162740 51979 438 4584 -227218 -78644 281009 33366
23821 188719 -200335 102654 -225622 -95239 357545 112418 -385205 166343 -88 108999
23810 -58413 -167687 394899 -98693 -35282 104265 22147 -337331 -161689 -143616 -176894 138624
23798 -167649 131921 202705 313375 -259906 138168 -262594 161544 16519 41107 178742
23788 178742 121507 -107364 -79278 -125466 3059 145306 -45809 140532 -237956 -62264 -233891
23777 -233891 116036 -165934 -131674 -126832 208377 103160 173581 -176310 -54801 -194926
23767 -194926 2073 -371358 85248 188246 62914 -371782 77879 55571 70041 -244228 16462
23755 -139256 -165799 -17115 -3910 132238 -154099 -9935 -112781 -125344 -24350 -32867 -70716
23744 -70716 193131 126560 232309 134005 162800 279012 9369 -129173 259409 -314390 -9360
23732 89676 7204 -277318 -407312 137109 -143439 -172573 371055 83527 -287963 -59691 40097
23720 -87632 -151075 -281767 190757 -153902 -140676 -134664 158468 -153965 -159324 -139130 -239217
23709 -239217 -217728 -37639 64273 142126 263977 -196304 -149956 92852 123504 -61451 198313
23697 44639 43575 -15489 20817 -244298 79853 -3727 51371 57375 -12055 -63308 -193096 -167098
23685 -167098 230132 115677 307485 -157330 -82476 66549 141785 -82308 -243213 65940
23674 -54802 -119969 -70106 -66432 247679 -37611 -105682 -99510 -102562 -275503 223437 182684 -16569
23661 310000 -129470 -293362 96949 122895 121370 -282583 47161 -110569 -167680 -78774 -77825
23650 -77825 -348737 67421 -207067 -412886 80423 54647 -120171 -69938 -91516 236748 -211921
23638 -64328 -134352 -3257 108365 -281430 -40705 -124682 -96557 103082 -130469 202204 -116111
23626 -119543 -106660 -114446 234368 31975 -257455 353708 -51930 -45760 -229984 163899 45542
23614 -389762 1920 -86107 162596 -61460 -88182 162922 -80951 -96845 182963 65031 -80372
23602 223467 279544 -307474 123738 38065 182917 -25574 -51636 103881 98320 -2618 -102754
23591 -102754 -119391 -118538 50194 247683 -169980 15568 109697 36535 126413 4448 218504
23580 218504 187569 99993 -34066 378462 -333592 -155499 -243782 87439 -98638 108333 18735
23568 -15283 -68171 -2007 89320 188474 9839 -57307 401003 17213 -21927 -61780 69224 143939
23556 143939 183061 99366 53676 34300 -188742 -12924 5621 -199998 -171900 46130 -420409
23544 54735 256672 -156257 282722 187106 28291 52855 -31910 -113571 155080 63275 -194912
23532 -390124 -84483 111826 12215 39944 51082 155714 -70901 19426 -357312 -131586 -28307
23520 -62524 -113615 -29584 24618 -144437 -11344 -113248 -30586 29918 -84899 325401 236637
23509 236637 -246269 -66935 -357491 354985 -238575 79871 -317861 -23884 -57452 -407888
23499 -407888 100686 78057 64270 69820 -110936 142133 110681 305523 -92955 -55930 -125169
23488 -125169 12713 44289 178513 -19082 -242017 62021 289039 63636 99172 -63846 -105911
23477 -105911 308223 17596 -108177 -167143 -77837 -19618 -100456 126886 -32356 -166931 -32281
23465 -182854 31795 81842 -15972 246485 42484 232601 -99235 -35346 76293 -178499 -102239
23454 -102239 -106518 98818 -225893 -135461 -38423 103352 -67750 123879 314158 -42254 66895
23442 128502 -61384 -264256 -60211 97650 390344 30581 -203276 -219719 50637 199854 272098
23431 272098 372069 -13635 -148505 -172942 -35703 -84532 124666 69727 -240097 72863 120638
23420 120638 -95561 294596 297570 52036 444674 -152686 210558 -178045 -114860 193019
23409 -158797 -190496 -158846 41086 -13695 -63358 46139 22722 75175 325745 -248741 -116563
23397 -49072 205716 48696 -13239 -206683 67094 17089 260788 -206381 -421945 17294 -189899
23385 -26222 -305481 -13231 138519 131209 155241 25854 -191893 276746 80995 159847 -62275
23373 -96275 -87123 -136596 -94930 323229 216523 -396758 191245 278337 -14983 -180119 -76209
23361 -62523 -261292 266931 -280903 29021 -54764 26315 21105 -184723 -228228 76974 -412783
23349 22703 -44912 -9813 -57047 -3103 -60851 -163841 93087 224521 11318 -88696 -313515
23338 -313515 -175139 -25717 76954 -82188 48652 -34157 -137447 -33012 56539 -65552 -92540
23327 -92540 -136455 15338 -150059 -48740 -94845 -12266 -92489 -80805 73120 -344879 57927
23315 97614 20700 30914 -90188 -123898 -240538 -187147 -64838 94322 48472 259315 370902
23304 370902 -132742 94658 -5538 -211636 -13814 -190099 93847 -144557 -279457 -329880 -41611
23292 157422 -109326 112653 -82497 -15681 -314448 392232 115086 198423 -213154 -286591
23282 -286591 13086 72902 -18018 265339 338983 47673 -171761 -148611 170751 -303539 454415
23270 266080 5411 23789 -71519 -115789 -57082 43326 34005 1992 98644 -94427 -127342 -142774
23258 -142774 -88697 -198414 472 90393 -26698 -316132 -226890 258576 -40800 -136707 145168
23246 -111467 -164191 -70719 63076 39162 -123633 -171443 316397 408631 -334368 60833 266831
23235 266831 269068 11776 -27822 -283737 224796 -96247 157868 80183 -45262 -163405 -162690
23224 -162690 -178271 -476838 -257899 89339 -296313 -13495 56896 -145083 190074 -61527
23213 60814 -233930 29533 36011 -167038 147261 -252754 100919 -140875 -147019 263968 -134133
23201 -253992 85306 -51649 -180716 -15019 -97580 326107 -343828 -33834 180245 -73474 -2541
23189 177927 -67578 134837 -36595 -228520 -102944 -19853 -304418 -167396 -4172 -14250 -110183
23178 -110183 -55469 -152527 112786 -140630 138204 139322 -225958 -117227 -116742 111104 119271
23167 119271 20079 -288710 96076 -375351 -53311 -257041 -221958 -151221 -78657 -234778 -365600
23156 -365600 -170640 -427157 55217 -141421 -75384 371053 -146269 27727 85559 -171386
23145 -152780 -84849 119308 -77863 -452384 -312638 -201123 46072 283741 -87299 549550
23134 -292239 -217574 53083 -23139 -72195 209919 -78773 23053 115683 140216 150711 145723
23123 145723 145361 61516 -231934 14982 255521 208254 -293075 268044 63835 -4821 -330040
23112 -330040 -57446 144182 156850 7255 -134661 72631 -192550 67969 5861 -165366 -501505
23101 -501505 -96921 -24526 40919 -90496 291028 291199 -17275 92684 -98198 210741 65383
23089 91664 -173915 273154 -106710 -26879 -176671 53712 380313 156944 32049 144902
23079 144902 -102769 -116778 135487 295508 -111205 -25531 427762 135273 -132072 183380
23068 189510 101124 47936 193954 99571 101783 -56510 12412 89984 15666 -55726 -175228
23057 -175228 39421 113858 248454 79203 157906 72591 117992 -244976 -127891 -21779 -9846
23045 -82361 205971 226670 16321 -251878 -127360 -186854 84218 40630 35437 -71451 175578
23033 -203166 -107875 168338 30137 -281071 -388142 -46139 77325 222539 65275 98487 -296646
23021 106965 94533 158046 -92254 -212494 -28557 308535 -26922 22707 7200 210196 -127295
23009 33321 42793 33359 254021 -130889 48392 298221 -273432 96373 133084 182495 -191545
22997 66040 94957 66798 -387683 -101118 -29872 -232575 -122607 -51809 189954 -26949 -89392
22986 -89392 -112075 244716 157969 -1266 -34946 28670 153201 -61665 -385455 -190386 90250
22974 -12385 74063 94540 -40993 59706 -50549 -134201 -230999 495442 231999 -235517 -41660
22962 -31084 -151267 30707 -65161 64676 -2458 175962 -71056 -142655 -228670 -67323 48768
22950 59200 229686 -2374 -3114 356368 169646 90281 -110074 415106 -48293 -342329 -139074
22938 -177730 3393 39099 -35409 -14301 -13247 133061 16060 -212532 -110203 321910 -219417
22926 -218220 -35483 275616 187884 -63490 229084 -174945 -214283 -60034 -208081 19939 2971
22914 -171034 230189 21768 124667 102342 -115503 -144553 36383 -260175 -30326 46565 181785
22903 181785 -101045 27148 -249998 -93349 42669 319879 -37 -189658 -63557 -29373 -73692
22892 -73692 292857 190466 -196369 -128381 75231 -336689 -85271 190279 -43478 -223144
22882 -223144 -4962 26139 -30 -149154 -23544 -156463 82124 16608 -88562 -338350 -116337
22870 -162926 -388774 57673 -269946 -55071 -19065 -325504 48378 -265919 -272738 74063 33020
22858 -45285 13660 -221378 66083 -156988 -62481 -95669 -35034 -125821 -246440 250636 3466
22846 183176 -21932 -67294 -191468 -117794 240443 -280763 62542 -101386 -286856 31044
22835 92420 201020 99840 -197344 -278694 31265 -185399 116968 46374 -220697 14604 -137099
22823 -16022 -1976 62991 -187458 -127619 -88682 94209 156108 3000 -333315 90972 150359 -121355
22810 1908 -74207 89687 112593 304991 102197 144160 108931 87110 233090 110032 174634
22799 174634 -260237 288133 -129337 -293998 -107703 -11810 158305 -218137 -117489 68931
22788 123521 137866 -417505 -24015 -71341 -62902 -157140 202759 372913 -291676 185430 -251213
22776 13729 198779 236574 52134 310222 -14590 -299063 81114 -258411 -204795 -193415 -151488
22765 -151488 -69885 60806 -344159 98747 226757 365159 317754 -31106 50246 114075 -99287
22753 -54580 -57003 151081 119025 -15040 -205412 -353068 -66036 -106313 -181391 338569 91206
22741 -124037 -46270 -19493 19355 -114453 -108824 9172 -25020 -366705 319745 22370 -182575
22729 76819 201228 -90564 -52696 85670 50628 -71278 23020 -90325 52614 -77735 -330420
22718 -330420 -198521 -13092 90612 8012 328002 -145391 22886 -91825 -72308 -32997 -162704
22707 -162704 -170288 -21641 28049 107066 84860 -178940 -32418 267066 -288392 -147152 -103987
22696 -103987 229589 -7260 -225344 119720 -247922 237894 -150877 -63019 -37651 -45689 -34609
22685 -34609 -174843 -14707 -67829 -348472 278214 -88132 -89422 -150546 23384 -161754 -96253
22674 -96253 -99742 -264123 -192712 -38606 -214758 -107017 -232420 -177439 17357 -35967 -52271
22663 -52271 19024 150336 171154 -17645 153286 -86175 -235946 -34786 17815 109024 161885
22652 161885 65088 -68731 -185655 36321 -140681 -34948 194847 17178 231507 11965 332418
22641 332418 -140449 61649 -55377 -99640 -326677 153281 -236615 -409215 -159546 42178
22630 214703 381267 183658 -55306 27768 -267844 -6440 -206000 -177815 171332 -91415 -50224
22619 -50224 -203043 -224557 69844 -25209 160545 -79484 184855 -103572 -14775 -93877 -155217
22608 -155217 208844 20457 -264491 275544 -84145 76765 130438 164445 126601 -176898 90257
22596 59576 -112220 -357818 -55983 -266428 -72458 -313899 104008 -124935 -340557 -3761
22585 122998 -47701 -218145 149743 92246 128172 -89879 41190 -119881 -7538 139277 -355227
22573 -112988 -43664 29321 324533 -349027 161506 -256956 236307 35501 165364 -3488
22562 176001 107427 -22749 -1764 -68839 39221 -106817 -193096 68062 45912 160620 -176287
22550 -186356 53843 86825 173847 -191755 3278 -83129 -205044 -52345 -60257 -23504 -78282
22539 -78282 82146 358015 -36863 -80665 -84349 -43719 -37337 -39084 -92342 -462716 98908 34918
22526 -131026 13458 -128052 195274 -511517 -312806 143624 159751 -243180 249710 -163117
22515 -226330 -122058 -276709 4875 -127541 -140514 107468 -100479 120929 -124493 -87935
22505 -87935 226794 87704 -269305 420339 -176999 145378 199675 8799 346990 -365384
22494 -196290 189625 -61974 37239 -212691 32011 416516 -160235 30476 10765 -5333 315116
22482 270259 -28870 12082 -179720 -134849 111866 -153146 -201452 233183 -128685 96039
22471 -280953 16307 -205666 -208815 119289 -171164 -177293 27061 104304 152020 -487030 -144023
22459 -38512 11077 57239 -223738 253717 74701 -125467 85149 -81359 -8938 124329 -243992
22447 -141194 69977 447783 145593 -212075 -64858 -157194 -87745 -552197 -84786 -152125 48076
22435 -316340 -364272 79201 -8949 56531 94839 -191578 -519446 -21136 -129927 124740 -29062
22423 118127 -108922 31253 62422 186305 -338752 -262964 86898 -203434 -151777 28821 -91370
22411 12625 -238029 204531 -20892 -79642 4466 163465 -244535 321682 -26088 263577 -101429
22399 190771 -236042 96872 88832 -74059 -143377 159102 -142836 -79372 -110494 -208301 -300958
22388 -300958 -190605 -108066 141091 302561 107683 -86603 82419 -187965 29549 -345910
22377 -79698 -207633 -123665 -64264 19723 -164045 -107442 -65163 -85537 9515 -251570 -94400
22365 -228710 -8770 165895 -87266 115058 180430 185407 -5151 -216113 45025 121502 -152547
22353 296211 -115309 -364350 -55097 -103874 156110 49028 -106778 163622 -150451 25456
22342 135213 -49886 -159452 -71765 244771 65043 27204 184254 172594 175271 130641 -50085
22330 20929 -65276 -114328 -298185 -38441 -83334 297340 49580 -122563 -36349 -208140 76856
22318 -126059 311732 -106697 20748 -27069 450204 -59602 -206835 -123635 70117 -248090
22307 172974 59068 -300493 62834 -307969 -7521 -211712 18494 -185422 185588 -283070
22296 -106252 3628 166478 -243884 -83430 235718 -144839 -11361 358522 300543 -172797
22285 412 70301 43552 159053 -330204 -21760 192827 62464 26833 43759 48655 -77672 -123879
22273 -123879 205192 -55392 34876 -143327 -209172 57827 -96783 -341205 170962 -10861 -132525
22262 -132525 -96069 65856 -50676 -208593 -17801 -270131 -8588 -350864 131628 9338 362334
22251 362334 -372426 193753 -30467 -58378 190503 -50852 -26543 -291617 116242 59951
22241 59951 -58295 159940 -287944 -78704 -70007 175302 -75992 -229511 20277 -347058 -7166
22229 -337569 312818 112429 -60707 -174306 -231451 100724 45398 -243333 -12222 -96815
22219 -96815 -6056 64191 -13925 323230 -36822 -180201 195225 -143379 13399 -27434 -274321
22208 -274321 109323 -204959 -135224 193856 125551 -233055 -353049 -52110 -136984 57007
22197 -151818 -173291 169671 -251754 -290708 30491 -58584 -43132 -51529 202774 -209703 -116031
22186 -116031 44246 49800 -404048 -131824 -90840 -30298 480 109485 360978 215224 -60135
22174 -245552 85597 -316687 -49415 236007 -115945 -104034 -129928 187533 -27646 63537 92550
22163 92550 -238581 -214179 -30238 -64995 -190236 80692 130384 -181 -34750 -84760 -3562 169996
22150 49224 57527 -34667 -255435 -186580 74986 155742 122652 192398 167792 -143682 -117975
22139 -117975 152982 297812 77820 -146725 118883 -186242 -10578 -88662 -197935 3564
22128 -35666 237595 -13641 -133658 206616 -328844 116696 43771 -184461 -21002 -218580
22118 -218580 -303011 -147112 -366666 52007 -246056 -14282 -283982 -49013 59438 -92860 -13937
22106 -32440 91251 -1809 -181019 -367136 -43502 -124477 -42752 395457 -104343 -84689 -258283
22095 -258283 104630 -116203 -3389 -363101 -80023 -144461 -226679 217369 54912 120394 96167
22084 96167 -209200 4734 -47123 -282056 294864 146244 -167017 -72353 187314 222766 -14695
22072 -163741 361476 -497078 6716 -47442 -396626 -219129 -137128 -266585 -169829 -94429 -348810
22061 -348810 249973 75550 -10264 -186594 -182323 -29776 -57331 -9160 -90 -23310 -113641 -59453
22049 -59453 98263 -41321 -111958 -127225 116706 147939 -171382 335240 339481 67623 338978
22038 338978 287409 58794 300309 -151968 -114496 94334 12638 -21814 91624 -38008 124736
22026 105719 2644 -414661 -56336 59825 119642 133668 108027 -129082 -51064 391738 -117187
22014 -118304 -125056 -27960 8606 252123 116735 126146 -272038 47035 -235458 -212804 148661
22002 36957 -159143 -140273 -106951 -369863 149332 -303736 -8411 36639 -89792 71848 101835
21991 101835 -258049 -22102 -59268 233338 218417 107405 -60785 169616 127731 39473 44992
21980 44992 440687 -128242 84845 2798 -23103 122313 20793 -5394 4640 -26614 97088 72368
21968 72368 74211 -85033 29023 -30282 55185 210524 -166525 -307985 -171781 41292 -104214
21956 -134149 -103694 126655 89406 -172632 -65111 97572 -366608 44826 -59126 1362 -18758
21944 -467252 -445100 143973 418488 154074 -108165 -32285 -104413 -241239 -77235 -158127
21934 -158127 -52815 -140320 259320 -67127 -78336 278555 -30920 -77429 -68184 -48300 10703
21922 12861 34650 -89775 -110534 138820 -195178 -118155 58680 46688 -260819 26785 -68518
21910 -28216 132302 134420 -72462 -144045 -290691 -21462 27366 -247697 -22320 -321504 19599
21898 -187329 84972 -205656 -73854 -144106 146940 66233 267309 -160474 -285089 -94875
21887 -96393 -98819 -404117 204681 -75528 -138460 182016 -133787 69879 -375927 -98800 -77234
21876 -77234 -108716 180438 -60046 -257038 35058 -121535 -37883 7038 144870 52204 -82329
21864 -3678 -321248 233815 -5566 -198701 -38099 -248893 412848 157431 11304 -83084 249475
21852 175143 242951 19666 -100464 146078 -347951 338905 -129919 -226343 -200860 77199
21841 -102139 -469790 -346921 2088 -216326 -91171 -224274 -211627 -129534 -76843 -11704 -146340
21830 -146340 -154600 54448 147592 -192306 -197595 -238396 -50053 -331685 -88787 266090 6395
21818 16299 407303 -195413 180077 172239 -192475 200462 -280430 48976 -197346 -284460
21808 -284460 266191 -208111 -222236 -168828 -112729 164502 -168474 -353283 23471 -4782 195399
21796 -235409 -145930 79100 -103967 219641 -96851 170978 167585 41334 -205015 97972 257539
21785 257539 -37149 181248 167006 47076 155716 -133846 -388407 -142685 -31273 -347198
21775 -347198 216467 142227 97134 -1975 -55886 -139937 -47232 139901 -207867 -270383 -96020
21763 -167465 -17600 10796 -175678 -128573 -41544 -175968 206345 -101259 -397500 157572
21752 66856 -239196 -142973 -208910 -307322 -200450 -15191 -73968 176 -201175 -189332 -25530
21740 -1416 61259 26361 318022 -188496 55383 260012 224549 118470 150292 -142731 -73030
21729 -73030 236187 227441 -155614 -15614 64798 -157507 -283682 -311229 -273816 39455 -10597
21717 -167795 -249845 -36527 166200 92679 18688 -358026 140896 162491 183872 96385 132153
21706 132153 94827 -72994 140691 -51623 88092 -30959 -62511 -173796 115448 160098 -432801
21694 -24708 -88057 130638 -255298 -259057 -41686 -56113 -320510 108073 251258 -8830 -232896
21683 -232896 52595 171650 232547 -68554 -52492 33420 173102 -137811 33146 -386941 100641
21671 -84335 -140051 -206571 -42491 -119713 73781 -32035 24305 -94534 -222089 233810 -4235
21659 239011 111646 220700 -5656 164183 -343953 60957 -118889 -124322 -219545 342723 21859
21647 -190552 4738 -104249 -198114 66081 -228036 234648 -80330 6587 -93982 -390704 -30080
21635 -39057 174595 -51173 204004 -176877 218562 169453 -318197 -225779 161312 -218661
21624 238855 -98997 35772 -24192 174652 299928 93485 -67185 188886 -117991 -17057 -156779
21613 -156779 4293 -294898 -170858 -71008 -262667 8333 157094 -547310 253128 -330644
21602 -107895 -47674 17344 56277 138751 150267 -199795 -39133 101875 -131374 32544 158982
21591 158982 237458 -90122 41482 -36372 -460074 -186152 -285067 275572 -309295 103919
21580 -163432 289433 174666 -158724 -52182 185268 -67781 -88684 71660 -71666 -8648 -30835
21569 -30835 -334317 147526 35098 16510 142031 90199 -71292 -183092 -57897 197536 -256927
21557 176890 -169257 -6765 103513 -161124 -194634 305718 32962 -112453 -21253 -359384
21547 -359384 -240170 183759 -60504 -56378 -224309 131564 -205482 29944 340123 -154707
21536 87624 -185655 231306 141130 -2178 210397 -98841 -88144 -310395 -332571 102351 -77724
21524 -75768 232186 -96883 74253 -117278 -99656 42367 66060 95562 280397 -55976 142586
21512 -179404 -242970 -24546 -118942 -74174 -131259 -386835 -89724 279290 -28954 -22160 -176815
21501 -176815 88927 -92675 222371 -193781 -22702 -310396 176780 77501 -71513 -263518
21491 -263518 -39698 -33206 -162418 -83475 -207709 14335 -305941 -144330 89761 312767 -338779
21479 114512 -341891 18889 29939 101421 -234151 -93426 -380366 94776 32592 -143155 24344
21467 -117907 124725 64788 14138 21822 -20864 60674 -126615 117261 81175 190474 161703
21456 161703 -67963 -162348 -72727 -13225 -128419 132004 -198256 84152 -47492 173097 -12095
21444 221383 148045 -36745 88154 389188 199840 274857 659014 126333 -111905 -134622
21434 -134622 312677 243575 76952 -6266 -132442 -332965 -92501 -228508 -246662 -352752 -89478
21422 -111868 58854 -176538 -103627 92549 21791 -170141 -48809 -148650 197393 265741 19449
21410 50216 112400 -52021 205236 -241064 156993 65038 39054 40212 -409956 -72414 -34037
21398 -364834 198970 -155044 -199677 -169748 -53920 -193574 259101 -68308 -9546 85616 -179587
21386 -229514 -198790 -247204 -247089 -324006 -244171 116885 -159246 -156360 13722 116560 28334
21374 139261 -42858 69954 38646 279589 182235 172458 -292282 15338 -330379 279030 9512
21362 -138578 -156876 -532327 110413 -94305 127902 -383557 65925 -334305 -100538 -55737
21352 -55737 40680 -302868 5766 -16315 51021 -78562 304232 -102950 -180145 70204 273144
21341 273144 84482 -548395 -24707 -145448 -294043 -2805 105683 17252 -34614 -240859 -63689
21329 -209842 -15101 -43827 -61040 -20804 -137596 -161094 16700 -32617 -272815 44354 -270253
21317 38088 1430 -42486 78188 100016 6746 192916 -63558 -55385 -139408 -69907 125022 159208
21305 159208 122175 -176316 -133919 137929 -26398 -215082 -168850 -193998 -39021 -113860 -139167
21294 -139167 253680 -79024 -107904 -10923 146887 -72731 -114038 277547 -220799 -7696 -263455
21283 -263455 -256794 97313 -205743 -116553 -128391 -128482 -133018 -227910 -338713 -240277 -19940 -21303
21271 -21303 -141296 -216127 -244345 99200 -296952 -283663 -308150 -201081 -137057 -72552 28392
21259 -55257 -120648 -379745 78173 -11673 -56789 140527 -255171 144007 265253 -124372
21248 115735 -176041 -66858 42251 -284284 143970 -78922 -115809 282567 -141466 -185923
21238 -185923 -206966 -15538 -166662 25830 33968 39146 -181903 89306 121047 -324055 -101493
21226 314963 -308446 150641 35919 138988 -200873 -281255 -50590 -282687 -134589 -41317
21215 63892 147851 -411848 -44708 197573 -459189 10160 -165879 -85394 -114429 -76358 -3623
21203 159525 -7429 61077 181085 -5646 127683 25109 -161586 -166213 72160 -266781 259247
21191 109753 -1269 -137934 273495 51231 -105875 87034 44920 -58058 80031 -216387 -194160
21180 -194160 -144167 -5649 -490306 37063 -20219 72380 13584 -123870 -95547 232534 -333703
21168 -110260 -339767 15582 -34907 -271860 145953 57 -266078 -88901 -9197 -153332 5283
21156 -19370 32675 -211427 -226122 9862 260368 75046 -46123 -280757 146468 -104324 -132441
21145 -132441 -42493 19570 -165569 -247612 -193275 178061 -76578 4948 -40472 14563 24583
21134 24583 -321322 -363458 110493 -22235 35210 268008 -95080 81453 93436 -288384 -79578
21122 -154988 145653 -372628 -116300 -28460 190474 -242454 164502 -100873 -83612 -338508
21112 -338508 -137504 -8076 -290145 -175626 131002 111299 -63651 -150043 43057 -13673 199724
21100 -24174 -24655 -367700 52831 -34647 -228863 -48069 111161 -214419 -339235 -297927 -266124
21089 -266124 -128602 -131876 -454807 -70229 -25765 -96123 71030 -158815 257284 16888 -161931
21077 143741 8704 -153028 -217750 -280633 261410 136769 -170868 -164705 145318 21556 64483
21066 64483 -17161 -225227 82681 70102 -31235 -210077 -18326 12775 -2997 -410992 -59828
21054 -157138 -51901 123549 65552 -88559 -34417 217624 13312 204076 -53134 -57242 282438
21042 -292692 -111995 -224011 105219 -74190 -62877 119154 41164 -169457 -173571 -50582 -471695
21031 -471695 13167 -151288 27750 -42921 21511 -301051 -74991 -71440 -327850 252379 205924
21020 205924 -134286 121223 -19765 128559 186587 -58542 137477 45131 264584 -225632
21009 -113644 -87242 -517502 -8673 217107 -63010 34218 132676 90149 3878 -25018 305194
20997 -257213 -397264 89983 -254387 -302796 -301303 83459 -306397 -202047 -99728 -134663 -43280
20985 -8911 -197899 12269 5583 -335081 -247989 -209142 -8689 84028 58049 -281426 -246787 88733
20972 50494 74026 -320446 -104428 33253 -80815 -17352 -169151 71424 -20726 81263 2511
20960 -16213 -98791 -44457 100111 101679 -214639 -214717 24161 -32315 -171495 53768 -21759 98350
20947 144014 -216851 144297 -5830 23971 -360662 -73692 234819 -130629 -29139 108132
20936 -98257 -25842 152609 161975 -121108 -203065 -150721 -158622 -68443 -387051 75169 -116777
20924 5820 588 -190930 -125086 86155 -4365 31433 -193220 -312036 -123385 -154937 -81566 -251361
20912 -251361 -36866 -21555 333283 -62530 -101916 -123389 -85470 -83796 -177335 309850 -63983
20900 -208127 80580 -146226 -154475 -157876 -149937 294899 -229232 -217027 30868 -333574 -102170
20888 -146225 -12116 363997 -283544 -238575 -176968 -217454 15916 -228105 -54025 -125052 -63252
20877 -63252 -161847 184876 43236 182552 -72212 5936 72450 -30204 -322865 -142405 216623
20865 -460394 -138855 120480 -279305 -61407 113371 20099 207409 -52736 67903 -150271
20854 204156 -284201 80399 -133980 -284297 108483 -76378 -390059 148944 -152969 33477
20843 47902 242720 -82664 202623 49153 17611 -256445 255970 -12998 -182324 -85076 17744
20831 171258 -111595 82816 130844 225581 -94873 -54160 -61123 -96967 -167480 -21119 -35683
20820 -35683 33577 -153172 -7795 -63036 -69092 -207607 325784 169192 219606 130772 280432
20809 280432 34013 86594 -193689 66753 374937 144512 170402 156580 -219041 77988 68512
20798 68512 -59850 241211 -178055 92466 -110959 106185 21281 -31226 -224956 -201903 -222351
20787 -222351 94292 333249 -108571 -172948 255181 -255157 -253855 -134373 66808 -96286 -157645
20776 -157645 181345 -80817 -84171 -22314 182106 45953 -1456 -121416 128536 -164505 -157561
20765 -157561 68698 -229526 -215140 47184 110298 88944 -239923 -157445 -86905 -105081 180267
20753 91609 72056 -316504 -105138 -137438 5464 58754 -78910 255613 -120890 -268742 -237091
20742 -237091 -166645 135445 147085 -198650 84475 -161493 134561 33617 -49881 154629
20731 -91622 -64876 1156 -17135 -340105 -21472 11310 242558 -109160 -61295 -40337 -197040
20720 -197040 132439 73549 -101462 -347041 45783 -277826 -379465 241896 -224792 118520
20709 71298 -113227 -1363 -37399 -23071 115851 -97207 108381 -203649 -332659 -190046 72074
20697 -41230 61339 135270 -130617 -55635 127716 82372 39570 -10535 12797 59610 142806
20686 142806 -93423 8829 243870 88738 -119221 -94895 121177 4879 61866 -73581 -35448
20674 131113 -181092 -209599 118240 -92519 7939 -296388 -312285 -990 11884 -147562 312894
20662 -106044 -3372 -301295 -202012 -97655 -23690 217591 -52325 -104352 49556 -98246 -9665
20650 39400 3771 -145483 413977 -70402 -270296 -109977 139777 -241087 -55641 -173817
20640 -173817 -226795 -205548 16623 -24757 59327 -103579 -61837 383290 -380833 71145 17633
20628 -221453 199134 106973 -379216 57432 33226 238989 -226812 66294 -30101 -24683 -363901
20617 -363901 368986 19044 -142495 242716 60795 -120476 26555 82411 -154582 260136
20606 -33801 52644 -89941 -291401 -54114 -500160 -77305 90460 -456130 -254533 -186741 -341843
20595 -341843 -28196 -35292 99598 1473 33020 -193921 137292 -438560 -153824 364308 -107387
20583 -385087 283112 105872 -166398 -132075 -64354 113305 -248045 431383 -278366 -254282
20573 -254282 38744 -69108 213127 343121 433271 -5739 34639 102774 -131282 -10537 -34341
20562 -34341 15339 66616 189770 -53574 -49184 -110924 -284814 256847 -261057 -178205 -29791
20550 108178 -253442 102802 -50234 121862 6884 121387 -120532 -187285 71526 31870 -244378
20538 61421 78900 48621 119411 169929 -36945 -83400 -112088 224123 -11060 -120582 -46579
20526 -289957 222005 -964 249572 -206263 -321737 -176384 -89010 -44912 177036 -50632 -182170
20515 -182170 -235422 -335061 22921 32296 -16780 -43118 -416704 -255538 -3117 76028 -24370
20503 -27662 -209255 -260632 -201649 54833 -2457 -109988 -202636 -20042 208883 -106286 -125610
20492 -125610 7496 -308251 -61011 110071 -401615 -12506 69405 -157216 -176489 222441 82943
20480 -99106 -141216 316585 -273496 -145214 -250095 -139329 116083 120331 64455 -114405
20469 8867 -192412 46074 -129484 -73662 -17935 79150 127062 11601 256824 -84259 163755
20457 64858 271211 560062 211953 200293 307417 -46493 -113737 -50023 113976 253068
20447 253068 -53844 -175097 -93721 -70561 2549 -165219 -191514 51087 30452 -191871 389767
20435 74516 -175129 -260256 261275 48882 -119880 30851 -189898 -406180 -278998 -19589
20424 61622 -304479 -174024 -240793 264771 -447321 -230935 74217 -83986 -274095 9166 31963
20413 31963 -151861 49556 130612 -181016 28450 -57057 20903 112843 -192466 -158240 -79316
20402 -79316 -105591 -123415 -235319 210071 -118227 -8195 -40067 95057 -78984 -247406 90651
20390 195182 -150032 80152 -134931 222566 -103061 112204 -146969 -131124 -187427 -137799
20380 -137799 -329720 -465038 -143976 -18439 11637 -91170 317992 41871 -38360 -167899
20370 -167899 -20816 -67122 -143746 -242439 -132807 14986 66712 73812 49954 -57449 39032
20358 -124789 -149046 69828 -121848 78295 -387783 88670 -147926 -79469 70568 -128467 -150997
20347 -150997 42645 -280402 -50429 -219402 70203 -208347 -178774 -247753 103463 -223817
20336 -82526 -117691 206432 -178916 -137909 103793 123336 -230777 -141087 -283516 64083 -30234
20324 -286774 -207990 -62442 149279 -33055 -29513 -249910 28057 -279289 -373805 102194 -57662
20312 -412733 53314 -204789 56385 -68205 169079 5558 -257016 93657 -36927 112401 -154566
20300 -305608 -258009 -115872 71673 56244 209251 -432604 -130568 15191 -84188 -303331
20290 -303331 53582 284644 98795 -251745 465879 151842 -126354 -342853 10231 37442
20280 37442 67215 201604 131122 -270332 70918 -292257 -189575 45857 -205261 3015 89716
20269 89716 192057 -361944 -50271 -30127 240883 -160209 -449009 35054 317825 -179962
20258 -244241 -127475 28343 -199232 -52377 118806 131427 -123431 -124622 -225255 -21717 -61673
20247 -61673 73086 326585 242315 -387668 -118336 6600 430081 -77280 159700 10880 -107426
20235 60217 107091 -53400 -74796 85886 170662 -443081 -155656 -163536 -160588 -58004 -124668 -229865
20223 -229865 -132550 155328 -107255 -241353 37366 -50799 -10042 -52712 -20534 248522 -83830
20211 -76128 -22527 -253485 11541 -100362 -131727 -125190 -97849 113212 -277926 375059 -313453
20199 -46528 60096 86129 -276484 52536 -213783 65403 227434 -251411 -210825 227064 -243498
20187 -182837 -261724 110910 -280123 -20299 136036 -59139 5472 1772 276228 269356 -132927
20175 228904 20790 -108723 -5658 -116583 -187233 74887 -10036 -143644 -33807 124949 82925
20164 82925 -142679 -29194 -124521 123206 29946 -110571 -255729 -10277 -36606 -182919 -155745
20153 -155745 -94791 -306752 -207777 -117040 50993 90750 -83524 28531 -135346 -239677 -429427
20142 -429427 -55791 252572 235812 163734 155853 -155717 89034 104303 151126 -169554 12539
20130 -48256 18667 209061 -105148 -229939 -41914 230928 -128675 -222834 -251822 -95901 -79332
20119 -79332 109051 94888 -174469 -127821 -68298 -72811 -207295 297589 -134743 -32080 25913
20107 -304575 -15182 -37464 8928 113424 -27237 -152497 -9483 71360 127714 -97528 56389
20095 -88086 -18005 -39474 -429769 28496 -128904 -51668 -34446 207488 -129520 -191619 22293
20083 150497 -131539 80554 229016 -57046 -310037 -496160 185852 42374 -315396 -88797
20072 -2005 321504 -260428 -68805 44077 -44251 -111726 43254 63615 -146764 -63540 -159351
20061 -159351 -25907 -96575 -141227 -87280 -191042 -1215 -174076 272869 -220382 -239038 -137449
20050 -137449 -7211 -372809 24520 -151888 -75307 164279 -110722 -164738 -356062 -80554 -61934
20039 -61934 -218583 56139 -173600 189164 133602 69220 -7539 -53326 109327 -7257 -227106
20028 -227106 -172491 173812 169968 -2409 16245 77470 -27097 -300621 -295716 104747 -248642
20016 460742 -269238 66223 4313 46563 254695 -283649 124549 71662 -88766 249790 63923
20004 23740 -97683 114978 -130065 44452 250161 103100 -304802 -256790 62443 13135 90517
19993 90517 -167176 -92193 7220 -128046 -101212 -179143 -270823 -114005 5133 -58860 216114
19981 -137002 -310187 -215643 82533 -31453 -9424 173446 3929 162517 -71607 -64817 131437
19969 44914 41125 294933 -221516 -110512 -28820 -259342 178446 -74615 -172780 -136385 -59006
19957 -291052 117240 -118387 -67803 -62211 127914 -144173 89536 164481 -33368 45984 205207
19946 205207 78630 -108355 -107850 -5734 -115071 73366 -58495 -93668 268 -712318 259781 -31471
19933 -113258 -110191 -256010 -205323 131920 143765 -120020 -286178 -86219 95010 -414200 15276
19921 -44968 -30229 -123001 -201923 113784 -61365 -135607 -270934 351677 149612 -55988 245081
19909 290644 69209 -238124 -187318 134329 98612 -225580 -114443 -27485 129829 25615
19898 -177653 203074 81279 15249 -45293 -414811 30786 92501 -39395 -137407 41555 -205903
19886 -41620 138227 -296311 -130426 -167297 -209286 36132 10577 -52996 -163153 -95305 67755
19874 66306 9905 -126776 -277036 -312134 13368 -35996 -134283 246077 -263715 -63494 -248803
19863 -248803 99516 -238770 407749 -407626 -320101 -51361 -78286 -171488 -232707 174769 -40434
19851 -308636 -52338 -167982 -151168 -186868 -50850 285775 -136420 92845 -60990 -216540 -136158
19840 -136158 -348979 -363070 -244674 195627 -26589 -163097 274169 -632 -2373 -70919 155701
19828 58005 -107893 -25716 -153754 165065 -401128 -125544 -109963 -311922 127554 -223892
19817 81231 138058 -112148 -257386 -131103 -176849 -271311 168500 -195997 146522 -122407
19806 -228805 193671 -324846 -31943 6657 -77413 -62211 -260524 -270961 96697 -83925 48901
19794 -314263 34307 -184175 -154403 -111347 -108200 -439128 -122927 -407210 -350790 175596 -178011
19782 -170726 263 42409 111362 -350349 -564627 -350808 -216292 126466 200800 -253355 -47879
19770 294273 27311 113479 -264622 189801 -26181 269283 158084 5447 -246349 -46987 40299
19758 431540 97513 -112721 104611 368817 -158103 61582 -71724 22145 -309266 154170
19747 -63347 259 -232 131876 -172222 -100133 -137397 -356291 -245041 -229676 -47960 -212010
19736 -212010 -123163 -32672 -86501 -253345 -307415 -219952 95349 161190 318771 39758 -87415
19724 -252152 152632 -76112 196834 -95816 70111 -16114 158492 -51111 -12034 133966 -77637
19712 -35426 75145 -356235 -256099 26777 278278 197312 1651 377747 97404 -24731 -83549
19701 -83549 126433 8152 109145 351857 -361718 123579 -193198 -617710 2354 -326562
19690 96346 70808 35278 -67132 61182 -95313 -195962 232299 -54447 -68528 -3495 26489
19678 -152611 -102677 102343 13093 -161343 52933 107861 -76245 -116888 195958 -191617 319809
19666 111590 137681 -25154 205257 -115487 -273832 -126590 55332 -423228 190061 -106048
19655 314098 -195328 -73400 -18762 25309 97616 58636 -31933 204901 -14351 147944 -367831
19643 -164854 -197367 36309 -74739 -281959 -298154 -80852 -156069 -91179 123284 -72543 -34017
19631 -66 -122223 -158414 -38299 -239105 -81489 -206843 -95061 -91818 -224478 -119139 215281
19619 -100743 10962 -120341 -68709 -94552 -287224 193503 185960 -157336 -205117 -53193 158149
19607 -39632 -133568 -31262 -119606 24080 -262323 -112598 -68662 114139 -91881 -58927 149328
19595 -60579 -220206 -79410 170507 -242805 -326118 37251 -144681 86104 12966 -32657 87542
19583 -60007 -79942 -106631 -338936 -36664 -266724 -219904 150548 -69539 28347 -109641 109032
19571 69476 66315 105536 47126 -462005 -14762 111066 -115772 -91507 -75542 -37610 24311
19559 -236039 -142962 -300746 28089 -43666 -101158 140877 -43874 56605 1842 -73258 -263587
19548 -263587 -156406 90161 440560 -72285 32752 -20539 -53218 -62558 42143 43853 -105863
19536 -375175 -169365 -202587 220674 -190811 167954 -219423 254374 -127320 -318160 -87594
19525 -271548 -64432 -125531 -254925 97278 -256635 -251712 -61198 -117092 -11866 -69326 98782
19513 -376705 -76264 -360445 -180350 -149437 -273312 10613 -247082 -79361 -228371 -161252
19503 -161252 108419 -111097 -133571 -9564 41823 -72626 -356520 -189048 -170127 -20098 201390
19491 125004 -100653 -14974 9920 125333 -75796 204047 -50962 40140 -213837 101889 -260505
19479 125800 -66588 -202994 29422 127419 240558 -9803 -59190 37626 -10709 200176 -251808
19467 -15071 21642 -19680 53804 -182746 -77583 -278021 197514 125909 104846 278337 168548
19456 168548 93074 -427441 -339538 -462054 -40692 124314 238652 -157774 26412 -280688
19445 9590 24619 32778 50337 -138359 -5473 -234868 -161912 -372411 -143048 -176964 -148086
19434 -148086 -66748 -226624 -213363 -65876 574386 -45763 -573762 -72587 -455080 -237399
19424 -237399 4035 -324503 -73523 427058 -4740 -105943 -130167 -216560 -19129 -92854 -101591
19413 -101591 37189 -168583 -187967 44455 -189482 70401 72467 29765 64035 -22348 -303203
19402 -303203 134034 -230227 -164106 -290111 -274254 48847 162730 358595 -92212 -248640
19392 -248640 154586 -124654 23884 15293 -243243 -343792 -171843 39357 45108 -137422 292921
19380 233045 243726 71853 -301869 -83011 -217958 -142857 -196645 -52242 -79144 116276 7768
19368 -81758 -184656 79584 24758 -364829 -6168 33416 -2151 409210 -89726 -375327 -93825
19356 -97238 -44655 -254895 29453 -110268 -376700 -123888 269591 197719 -135068 68026
19345 -321196 -192646 -101708 -91998 13599 -91213 213380 257639 -196644 194232 228925 -277643
19333 -307849 -110522 47138 150843 322567 -74211 -76766 -231086 -384363 125347 -136406
19322 -145102 101292 27541 -133180 -219498 -28071 -109246 -378798 -264366 -38361 30265 -149546
19310 -187133 -226793 -135846 120980 -141047 -223316 -459684 7403 -346484 221030 18207 -133924
19298 268804 -176213 70440 -129862 40827 -204374 57456 38403 361117 -44518 -80477 -226878
19287 -226878 -213824 -128361 119380 -274183 343807 59527 206298 -267728 43665 -31521
19276 70244 113314 -173855 -106730 140711 -154528 170557 138456 -83958 -284962 139561
19265 -241653 -141974 -46046 -353629 -160024 81982 8366 31428 -76958 -59791 98744 -419490
19253 -43380 -533001 59123 171584 -216989 -140339 288874 -40301 18782 -215426 78358 -95907
19241 -2182 -328873 -417774 82810 68982 308085 -5041 -152220 23966 217603 -358479 103473
19229 -170839 -425240 -222616 -489494 59975 -28888 180264 165488 80337 -121040 434451
19218 -8607 -251963 102966 193853 -76764 -234275 330870 -76361 -202636 48965 2441 -12378
19206 -55464 -167583 -391558 31549 -254666 248251 -250992 127515 -32364 -150077 275228
19195 -150241 -80449 -141357 298624 -284712 -1086 -268820 26110 -287225 57926 -27986 147814
19183 248984 -31368 -204952 -106947 -21331 327119 -183783 -174532 -161745 187909 245864 -122390
19171 -222840 -61367 163215 -6647 186445 -47584 -181346 22749 -67095 -265792 -5266 -120018
19160 -120018 -224870 -111185 -47841 -265251 14388 56212 -101240 286139 -228739 -212191
19150 -212191 -139207 -181875 -198819 -370655 237881 -193744 206991 7517 -405924 230367
19139 -298385 171246 -52791 168270 24320 92769 86593 -91282 64721 -83803 -43754 -105393
19128 -105393 -126063 -14139 -428133 -165695 -202961 143301 1846 48658 83183 -10813 -112294
19117 -112294 -107520 -354977 59292 40215 -213513 188459 -163124 -66992 -57089 -234397 -319244
19106 -319244 -119349 -6748 -94665 -311765 -152100 17193 96469 -156491 -212515 -460409 -343940
19095 -343940 -32806 167956 -155642 125941 132288 238828 21651 -158821 93251 -288013
19084 -231057 16488 -114907 -246292 -187464 -176000 -100460 -68319 -217164 -81821 -203196 -56632
19072 -92310 176624 -152617 -21606 -297740 -108567 -15994 -201278 -98733 -457833 -94462
19061 182966 462549 -210112 112354 158249 -240444 -20219 -126483 -56035 132778 -59698
19050 -208600 101813 116516 -131723 -35062 216422 -58708 116868 121983 -284776 77291 105653
19039 105653 190389 78009 77635 319690 -22810 87835 -133680 -240384 -72889 -221477 -152747
19028 -152747 -47629 126590 -10892 -148782 175824 -216655 258614 332556 -364556 -120702
19017 116734 -129503 -439741 -153931 -192883 -153162 120349 -152319 112473 -192066 238992
19006 273370 -174001 -248922 -280503 -251865 -172571 -29406 385045 -176361 88939 -79674 173238
18994 -421960 -62745 38817 -222088 152212 180877 -323674 -272522 42884 57363 110341 -232155
18982 -41678 75805 52745 76460 -138352 57422 148760 -83683 -316544 -111338 -19082 -141688
18971 -141688 -279059 -93137 -290378 120786 18412 148627 189136 -191205 65859 -32421
18960 394029 -57136 98737 -92965 135860 -23058 -294813 -174769 -97672 -31839 -57242 151962
18948 41082 -200391 -87697 -220903 283052 -186209 -225037 -545709 47043 -113528 -207655
18938 -207655 85412 -278030 -24091 273586 369778 15971 -172685 -78790 19924 -53280 -178720
18927 -178720 -49502 70448 99205 -143946 -39783 333640 -226569 76958 226163 -259308
18916 71433 142328 -52041 29338 47896 177443 -85259 62743 64479 -233980 -188396 247392
18904 -258840 -73131 -178512 155079 55911 -171883 232770 23939 236148 -324107 100658
18893 -110790 -21786 -30434 23287 -80128 -181535 314523 -101875 90212 -261945 37050 -266356
18881 59991 54041 -59838 157059 36476 -47075 9701 11602 -16690 -75101 5579 325694 59179
18868 37124 -62868 -137140 -288868 -213976 -117119 -357456 -73517 -386716 -184537 -73253 74504
18856 -133892 -112289 263816 -194442 -8734 -355824 -1283 132662 90716 116487 -107158 -15466
18844 29269 69083 163130 -241249 -130039 54100 221592 -37995 45682 -85485 -37712 73836
18832 38170 53980 -179768 -101100 -356768 50700 -10563 167671 -21709 -151694 288909 -207531
18820 118231 272616 123976 -217893 25755 369294 -200668 -165830 61224 -44369 428744
18809 124723 -138357 82539 -53164 74944 -62516 276482 -14683 -292609 -203709 -125400 100666
18797 -172005 12391 225825 -252369 263979 283507 -134404 89487 -49973 -25682 -83659 -81990
18786 -81990 77284 62620 -141243 -329859 74585 -66269 -169471 -203379 104382 -280876 -67770
18774 167362 103293 -58004 -304347 -42093 141420 -40547 -337322 -107180 228628 111642
18763 -110732 -346276 -241998 -82660 -62025 -489062 -362275 -213194 61963 -118078 -73507
18753 -73507 -235084 10565 34882 -91552 1627 -255928 -37176 -244566 -119180 -134295 -232635
18742 -232635 -294125 -93392 223978 -111525 -179648 -365496 -146505 124909 142033 -113667
18731 -224483 17005 -208034 -74945 -181790 -119638 -180222 -389963 41249 -216508 -22283 -315026
18720 -315026 60569 -49255 13382 -279434 -194541 77705 -121068 -139422 -99337 51321 -34849
18708 -184076 -270144 87875 3332 -61241 -219988 -105551 51834 -14266 299171 53666 87949
18697 87949 -44107 -1633 217158 -10436 -106830 -5611 17558 152559 117446 6600 -152781 -112709
18685 -112709 -228401 101729 -212402 -39643 -8594 -159679 -137719 -36490 -141358 -113064 92435
18673 -290460 -223119 -263602 -72034 33684 -112725 -45129 -58776 28614 -131668 60825 -80632
18661 64424 -118136 -54738 -209857 -158035 -118978 -172861 84567 126136 -219708 -219922 -9657 -145823
18649 -145823 -74369 -106750 155564 -241945 -227702 -101277 20225 -338789 143648 110118
18639 110118 -155778 51599 -221532 158115 -33453 152367 -155977 59932 -182256 -189835
18629 -189835 -36848 -153990 37722 72729 203152 158406 -51166 90745 166466 -86856 114472
18617 267752 -51258 -18764 43033 14872 -138536 -110456 17002 -136317 157797 26253 -14172
18605 151587 -32306 -34454 243038 -150690 -170350 69345 163769 20531 57577 76610 24840
18593 52763 168308 -166970 23105 -85049 -134331 -318901 140418 -113395 -47796 128237
18582 -101843 70055 -232747 -133483 88184 45570 17820 -429619 -18415 16850 41006 -258327
18570 -16409 -105183 -65803 155693 -83019 -38184 190743 -175364 -31285 -79525 110257 51371
18558 -38235 -87674 5707 -93120 -25275 -51535 22812 131967 31749 117100 -176260 16613
18546 49351 -105540 -111095 -12603 -41293 -458215 -117620 -58801 97846 112490 63747 73928
18535 73928 49999 -7874 -86248 -59892 74656 -1404 142648 -112733 491487 -121087 -58570
18523 -183122 -190860 144244 23331 -300569 -69701 -60906 -176535 202446 -43068 -394090 -316888
18512 -316888 -204336 84326 309080 -239403 -248239 -64043 185504 -180041 253367 -146623
18501 15678 -257325 182277 66995 -222164 153714 -4091 -261016 -209409 -33579 128844 -86948
18489 -420586 -308733 89829 -323925 -82287 -76491 -4908 -236581 16264 -118702 102130 -274191
18477 159959 -186694 30694 -215052 -84319 -54345 41139 -78535 -226529 -338115 -79122 -194190
18466 -194190 29877 47198 -70571 -239019 -26171 -9767 -352914 -90240 -222307 -321108 -672414
18455 -672414 -223808 18155 -191266 -157370 -242869 -411190 -83397 -227401 -316890 -591610
18445 -591610 -161963 135084 63804 23292 -63865 -71130 -8784 -143038 -90333 -183523 135096
18433 169027 -60682 -16173 116111 -98556 109453 292389 -249593 -213577 125845 -190388
18422 -301598 -166971 -31510 -200556 142223 -203077 -47048 -16656 -15766 -54921 59979 66606
18411 66606 124309 -136707 -73078 90492 -312424 129447 131164 -204450 25987 -89869 2460
18399 -149373 48910 283309 246006 -128278 97998 -76908 26533 -264279 -40700 -189485 52029
18387 38251 392177 -300581 -302388 42881 -20137 144541 149381 70545 -78371 107327 114450
18376 114450 -151403 -107684 11429 -34354 14595 58649 2462 372313 -65567 36591 193460
18365 193460 -128967 -141180 142419 61563 -65110 -263780 14504 360968 -352797 211690
18354 -181284 134097 -115391 -186165 88877 -85713 166920 156634 30234 325920 -611064
18343 186517 318229 174516 -14251 100815 43768 33523 190974 -164027 -254794 -36902
18332 -243382 -224607 19316 17184 -58591 87350 -362735 -227539 165292 213381 57680 52370
18321 52370 -488458 -118624 272741 -305935 6558 -348200 75367 78163 -282113 43924 -212397
18309 -53672 75664 -358076 46491 181858 -215741 -295029 967 -131574 191661 -66559 -331515
18298 -331515 38076 290026 -49817 64980 72119 224598 18857 -210084 109291 -224842 90941
18286 63770 -151394 -71940 38846 -228612 73899 -309508 277320 -20436 247940 -220599
18275 -189241 -40255 235500 -68233 -406774 293050 -212627 80031 -62195 314063 104964
18264 -178303 -135603 49053 -160223 34125 -74557 -419449 -223616 46677 60346 -462451 -393768
18253 -393768 67030 199047 70929 -81978 -102223 -57279 88669 -113520 -145768 199963 -425321
18241 73849 -38935 8537 -37628 -168482 33331 16090 -178360 -315238 -311324 -51165 -159203
18230 -159203 -87663 -159540 245621 -39705 62168 35956 140407 -200091 120153 73155 54956
18219 54956 -88410 -265984 19485 -35080 56598 -249401 105063 -145509 390 -288361 -174044
18208 -174044 -211819 -18987 16196 -78182 -437679 -219877 -140934 70015 -70797 -214842 -171297
18197 -171297 -61567 -108501 -389273 -286656 -389833 -86973 -55999 -246606 -111276 -223355
18187 -223355 -331054 -276376 94528 24049 117042 287805 -54439 23277 69834 83887 49980
18176 49980 76629 -301896 284817 -217406 -49343 178183 50044 233769 -88173 92393 35974
18164 145488 -5181 -246960 238020 -89721 451471 -26264 -247240 29816 -129676 -80516 43863
18152 -384158 -87272 -248558 -87459 -191421 71638 -161547 299477 -286719 -34682 248746
18141 63906 -7114 323359 392096 23938 -388931 -239905 -261020 147523 -51972 260090 85974
18129 134920 55913 112168 -46023 145081 59984 -27604 -157137 126306 -176106 81562 -97531
18117 -442054 390165 -42514 125273 6728 -101358 -369451 -256235 76675 -371262 201782
18106 -202522 -87251 -329470 -208962 21559 15817 -105385 234824 -260207 22239 15778 21923
18095 21923 -21840 -4282 -83512 -209625 -243436 -119325 105837 -92157 81361 20766 153772
18084 153772 -130925 -81222 -16891 -181421 116235 -124477 -17444 -245789 50971 -160288
18073 154853 80534 284837 -76387 262951 352190 138764 -227053 79412 -280297 -82955
18062 -157592 -134338 -55549 -85 -98226 -3392 186882 61390 181469 146765 -194368 -85050 245624
18049 -324900 -135788 182133 29883 187756 -206485 -37653 68213 -164467 -124161 263658
18038 -353587 11623 189302 -131234 -50059 -62085 89056 218734 -185894 163557 346878
18028 346878 315284 82841 363802 4097 -173244 -292995 73896 -177783 583525 -7367 35036
18016 131895 -14576 -46736 -58099 260923 118611 -65624 145696 14724 43344 -129811 -272603
18005 -272603 -74101 -6943 70711 -332751 84436 126450 -158278 -49897 -147762 168452 13608
17993 200940 -120629 46217 108205 35154 103611 153341 -101219 -177885 -250953 -11839 180289
17981 -52373 126017 -134909 330304 9535 -60280 -252414 -79497 -163102 59459 -13093 36336
17969 -78957 -38630 -115021 -352714 -81558 201377 -458491 16926 -26860 185057 -312936 292063
17957 -336479 105415 12923 97630 81591 243779 418403 -165453 34765 237049 82610
17946 90255 -105765 94129 -21626 -104253 -199709 -44077 -61442 -129316 52933 -37949 -61850
17935 -61850 -112437 44349 -86821 24764 -327702 64918 131771 97685 211222 -337202 -70878
17923 235211 -191298 31911 14311 146956 -176948 269499 -228840 185392 21279 -125867
17912 215578 -108997 -221396 -41220 217770 -312886 215558 -169319 63582 -85159 81810
17901 73654 -81801 -262144 24298 135775 52598 161651 176964 -76159 -132101 -1602 -132029
17890 -132029 215991 -177044 -197324 -49781 -114844 -162017 -167268 -125414 -125069 172592 -90898
17878 -169058 -180442 -115122 326681 87009 -137325 -31618 230669 49715 -248170 -45683 -82603
17867 -82603 -77513 93862 -197512 114261 -33791 -108527 -98069 -288540 106112 40395 -204274
17855 148429 -82424 93562 193990 133191 367587 241524 44596 32101 -10219 -178581 123467
17843 41785 30664 398033 18018 -41631 81743 334671 -37523 142745 132702 289901 76258
17831 433257 114625 -20852 296014 -372279 -16129 28566 -40915 -126178 -40549 -163924 -53697
17819 229425 -99041 -20999 133881 -51539 68196 165379 -185881 -154027 -6804 -61955 -879 178858
17806 186204 274032 91390 -60231 -116791 18011 -157422 162525 -79504 -29412 -36233 -303629
17795 -303629 -111091 -18381 -27218 177288 386851 -198362 -60083 263296 52542 21539 39742
17784 39742 -104764 -38792 115728 -7598 -96352 125723 85969 270879 -58931 118825 -205985
17772 155373 24512 102717 -224015 228547 -126439 -208520 -158059 230012 -46796 -148112
17762 -148112 48912 -257962 106359 -76687 109556 225720 249564 77449 39119 -42687 -222825
17751 -222825 -81361 -13634 43719 14039 146631 -20332 16442 -244730 -24775 -412539 -13092
17739 115633 -204636 40136 54793 -69152 63657 -235774 62755 -294859 239671 -248315
17728 5371 285036 29070 -320007 -359238 176998 -15984 1470 -92327 -43958 40533 -107989
17716 -101751 159807 38982 166795 -269776 -49491 -17984 -48445 75978 264408 -93444 18424
17704 87012 181842 -239557 -262538 -279989 180319 94725 66196 245436 -66218 -10148 -176501
17693 -176501 33777 52855 27897 41200 -26777 74570 245936 -105744 236521 -22280 274029
17681 170416 158783 -152735 -38819 18808 173009 423123 -125670 -5441 98320 129799 361894
17670 361894 62274 -49746 31645 269390 -470041 20702 -103045 195419 278793 -227182
17659 87466 -30321 -42867 202674 155106 -205989 -1137 236083 268971 -11928 109192 -42601
17647 -180659 -37896 -365751 -159564 -49683 112573 -115731 25453 -50305 -318448 282653
17636 -37250 90124 -208655 -5235 -152975 -45958 117679 159534 -278094 32369 6910 100097
17625 100097 289757 -158874 134566 -72548 -49820 -498295 -4454 -242940 126500 145660
17615 145660 416473 144671 178012 98115 26965 -247555 121375 111978 401461 -190900
17604 11463 -203597 78902 -183310 -223908 237917 214429 -81281 -143487 108442 180226 206976
17593 206976 133095 9916 -128946 181141 87277 129463 14502 51306 -288825 -95486 -16685
17581 -68584 -76799 273239 -47289 213620 17509 -57955 353577 141805 17497 216132 2259
17569 -64743 3174 114816 -172567 96317 140514 -161274 13230 110150 262393 205818 91831
17557 214286 -84682 -70614 -140647 71158 -33387 102500 -78470 38801 -3456 2054 158834
17546 158834 225914 362589 95740 -9909 29855 172637 -262404 105965 220459 154730 57905
17534 318368 243869 224127 116707 94265 -36482 -1169 144995 169357 415 367653 280956
17523 280956 -97033 17849 250879 168284 12982 -205979 448531 169525 12601 85184 451201
17512 451201 17910 26563 -36076 182729 -174125 36314 -172859 5945 -55953 -140042 281514
17500 276280 -83333 43184 -201266 -40573 90646 -247655 -144138 244685 60688 -103130
17489 253182 24318 20673 27528 98837 -60871 78293 -103972 285209 179593 108340 353457
17478 353457 189010 152009 284022 120425 -13964 168391 144764 265507 -82019 276378
17467 108138 25046 440849 116292 -84896 491658 175797 217234 -7900 -12907 -11025 167913
17455 43247 374553 335087 363820 300934 213965 28680 250657 326148 372907 -8133 290425
17443 447570 48995 287990 165212 127891 169095 315137 312227 222885 212717 282745 231146
17432 231146 193599 218292 48391 166734 216110 612796 222804 97231 385329 192030
17421 466813 -69195 219684 270661 116692 147343 -27168 73865 151412 176630 23754 107633
17410 107633 265075 305896 55999 -47010 105283 88376 113199 247766 297905 16634 448322
17399 448322 -21044 -88005 -136386 -122248 352468 216397 259672 250182 -5013 -43604 -132558
17388 -132558 142413 214262 170098 112717 -151299 354311 292047 131086 -51585 8577 -8907
17376 159402 -202408 -73378 60102 -315282 -14484 -15611 317702 1522 81939 495967 136696
17364 -185895 -22990 57371 270126 -120594 153313 183563 -9764 241364 195622 -70679 223610
17352 -42052 368455 184143 160065 -141843 -112301 393699 -26769 73076 168598 335524 22694
17340 24317 272035 323156 260021 57707 157667 254501 22127 336525 -30563 183989 -69731
17328 -8018 -129963 21537 35971 -27605 314717 247408 410340 146690 107061 242858 157244
17317 157244 92510 83099 30504 268443 -75108 441016 265563 129680 125433 205772 194123
17306 194123 31044 -220820 -32713 258679 57865 255248 -37569 -195914 -16360 9439 207860
17295 207860 91717 28801 166023 348261 -18961 24633 34946 461351 234465 217591 -24394
17283 23342 12430 317938 -55025 438651 133436 10895 104539 65800 114693 192832 60093
17271 299042 159360 -231264 158377 264153 182809 389692 -12431 89484 55878 80357
17261 80357 -43058 285089 359454 229463 69860 238200 194997 178627 8255 -102736 159539
17249 520976 -96199 42743 379482 170035 160524 100459 441773 409077 145531 192003 34320
17237 25803 177184 201674 168466 130766 -127142 213189 -56695 400625 244055 191443 351650
17226 351650 290184 119301 67350 252467 233261 280511 68550 509298 83680 165630 72757
17214 119975 344295 346459 90430 82602 122198 220856 28367 460651 230949 195305 -3981
17202 -88672 296228 193989 454533 -56656 464331 -45518 -6045 309273 105535 -17896 277004
17190 116506 344763 274934 201593 197779 246466 167692 419233 -23345 259479 230760 69077
17178 15232 301012 -2916 -73673 -33302 -131247 187974 272392 217454 241164 179457 52809
17166 356420 404859 21789 -219106 267504 438197 295527 185737 491934 232086 181469
17156 181469 418891 233568 47001 198324 373117 404700 405907 547866 535681 28244 275813
17145 275813 377819 373376 232174 413725 242954 418217 545737 439928 327599 269069
17135 269069 679484 413605 207120 443666 498790 283604 -75258 437763 242768 248653
17125 248653 48916 312487 400675 437437 585063 217720 618700 602118 -15252 249926
17114 247091 533926 212751 506620 334933 476734 540339 29235 18102 198830 433050
17104 433050 648110 585893 100638 378905 755150 419312 282830 179539 238652 238474
17094 238474 94035 655999 399920 470744 598842 454153 303637 459978 527127 197687
17083 264231 569035 260986 434805 636164 327641 329772 347573 306976 248378 446371
17073 446371 407876 562257 -104623 242030 374007 100255 326881 229852 527189 397347
17063 397347 748348 544257 1028 368675 468793 361772 475168 368834 314598 394631
17053 394631 582661 660409 401008 678369 450675 357620 415938 501730 388276 463316
17043 463316 1093567 494597 138195 490678 221228 513496 518352 474353 315068 553807
17033 553807 547158 552817 721403 789720 338014 591161 464288 546806 787709 791005 606358
17022 606358 889492 721070 322846 577961 555934 753500 436740 740583 508985 423953
17012 423953 502035 470332 682349 600989 553958 440647 313042 533194 477761 790461
17002 790461 837220 364702 485199 897339 388804 833112 828505 663601 875167 785582
16992 785582 532072 551933 472744 722054 537112 399697 591988 782146 903609 745898
16982 745898 631368 695123 420264 923979 939131 807743 512161 938107 507943 1000716
16972 1000716 703510 1054476 897151 931973 782022 863524 1042990 624945 787568 1054764
16962 1054764 855321 754269 856857 1043004 1020999 818794 642888 969855 817705 970713
16952 970713 1143068 952895 876890 1127974 1111523 1036176 969109 1035965 1093993 1043210 1031610
16941 1031610 1253209 1126192 1156725 1141863 958929 1158101 1218648 999311 1301311 967704
16931 967704 1144275 819888 1070260 1351150 1156451 1315917 1034668 1259774 1050633 1247673
16921 1247673 1051025 1444325 1577951 1447725 1179037 1234860 1347506 1045472 1170277 1111812
16911 1111812 1421149 1382440 1335732 1290993 1376728 1440211 1237639 1374665 1354320 1252941
16901 1252941 1566672 1695003 1846487 1647186 1767247 1467376 1639393 1548611 1495166 2031663
16891 2031663 1648357 1897726 1905505 2015068 1789944 2140466 1985662 2078092 1921388 2230329
16881 2230329 1820697 2125259 1991244 2126021 1847510 2121713 1857352 1956832 1903265 2406140
16871 2406140 2227808 2360073 2280220 2370905 2246475 2251331 2518023 2628955 2467443 2615872
16861 2615872 2090319 2598744 2521162 2726197 2784849 3100101 2680948 3017907 3060770 3114848
16851 3114848 3104251 3076575 3020487 3118152 3528002 3246038 3374986 3321520 3232656 3571360
16841 3571360 3583127 3268581 3517606 4005619 3368346 3666210 3448721 3742487 4125670 4043063
16831 4043063 4028899 4326953 4353417 4467973 4290363 4424252 4402226 4653214 4912704 4821815
16821 4821815 4732613 4706564 5194622 5031927 5247579 5314470 5367621 5893901 5574548 5501969
16811 5501969 5788386 6290607 6277072 6123849 6933873 6470972 6904107 6878577 7326794 7216047
16801 7216047 7417485 7714280 7752560 7980276 8245332 8470901 8261772 8887632 9159061 9189773
16791 9189773 9845648 9668418 9814029 10210433 10285491 10821414 11005455 11130565 11376814 12180196
16781 12180196 12281862 13009900 13102313 13751883 13919201 14305523 14608924 15350629 15692899
16772 15692899 16177106 16699082 17600252 17864727 18744295 19249087 20018051 20793598 21812887
16763 21812887 22288700 23375676 24400545 24889630 25988620 27216052 28599263 30078599
16755 30078599 31088659 32721328 34011040 35438248 37233060 39011170 41235382 42847655
16747 42847655 45438044 47852666 50360031 53141229 55694583 59139706 62169335 66328921
16739 66328921 69823258 74061076 78574733 83177429 88561023 93914029 99583284 106118970
16731 106118970 112492250 119498333 126609088 134022592 141507256 148907201 156388545 164119805
16723 164119805 171039550 177214864 183118411 187869439 191424405 193582935 194992570 194795847
16715 194795847 193418622 190531484 186388955 181514531 175604967 168741567 161523549 153898483
16707 153898483 146617705 138852618 131144396 123733617 116477812 109649804 103287395 97225587
16699 97225587 91367967 85948152 80688046 76303507 71903198 67340051 63660578 60028393
16691 60028393 57025646 53918308 51110561 48335600 45373390 43261052 41624460 39079048
16683 39079048 37084953 35424291 33744263 32294332 30807238 29668657 27954032 26744819
16675 26744819 25749613 24964183 23987888 22723585 21941758 20943340 20248019 19413004 18656452
16666 18656452 17789334 17314273 16717080 15968857 15871257 14940399 14600488 14244950 13531955
16657 13531955 13349355 12901811 12385786 12334346 11415894 11635406 11126267 10566367 10307854
16648 10307854 10095955 9903356 9431204 9366572 8642487 8754256 8401942 8263693 8198856 7613915
16638 7613915 7385310 7710806 6980845 7027569 6863799 6821412 6515386 6664323 6336645 6148406
16628 6148406 5997005 6055766 5767860 6025145 5391132 5207636 5538590 4909167 4930381 4815849
16618 4815849 4935031 4978780 4798508 4954174 4495156 4612511 4171696 4113402 4340516 4087668
16608 4087668 3816517 3928583 3578336 3596809 3439976 3615542 3539873 3332914 3678568 3519635
16598 3519635 3386682 2939072 3322303 3118465 3219040 2971375 2778873 2874807 3249035 2763144
16588 2763144 2610517 2700953 2576699 2462363 2625576 2301942 2746795 2270823 2323901 2278277
16578 2278277 2602865 2362062 2428926 2263910 2113628 2594499 2185349 1993610 2013605 2113773
16568 2113773 1958630 2048836 2042760 1726391 2189075 2016517 1703756 1760304 1775213 1749360
16558 1749360 2003318 1647480 2010842 1641911 1901241 1763932 1423324 1715785 1406913
16549 1406913 1653455 1434346 1624494 1359921 1531387 1744018 1839533 1392006 1447651 1412367
16539 1412367 1495002 1317727 1172727 1428013 1369397 1074692 1271490 1015908 966369 1464859
16529 1464859 1423383 1411627 924266 1247424 1219758 1142326 788174 1262257 1229646 1290188
16519 1290188 1274289 775816 835858 1247724 1212546 1103523 1076825 1323468 1047766 979669
16509 979669 1333362 1202996 993053 1061960 697803 1097587 678816 787003 1064771 886466
16499 886466 1084659 842991 672493 1165614 939201 808948 776646 832342 849767 738379
16489 738379 971531 1189347 930537 836262 721025 597351 680424 865909 876183 966683
16479 966683 900724 1041496 717858 623137 675407 699762 780220 701892 468425 571699 637930
16468 637930 690430 890994 502096 501603 821679 595652 534496 571532 95077 653034 423742
16457 423742 703691 598728 605638 847068 162410 484566 624116 830585 490272 824423
16447 824423 408105 677454 815261 743599 389588 608105 643090 693950 553029 201839
16436 502593 906326 253521 916654 472340 644392 600948 503673 504831 524844 406439
16426 406439 434932 241269 441723 378293 333772 47941 551534 744642 532940 406118
16416 406118 596230 411846 146994 584596 233311 397315 524403 164956 516874 448272
16406 448272 404626 620892 441121 445162 389381 354516 428559 360858 448753 505519 92981
16394 767718 374867 195972 199815 217599 162417 422870 96121 459946 500175 546193 254261
16382 347259 604062 103151 285413 263610 274566 422372 360438 754105 36969 305904
16372 305904 228976 361875 325944 291418 299763 290431 235873 323335 187725 135904 352668
16361 352668 765000 153662 307603 367670 444431 352813 399761 54889 132530 222342 125067
16350 125067 143240 93830 431635 538806 395494 233483 631999 498782 70927 363374
16340 363374 221525 253853 199668 390764 349625 319060 342587 262416 333640 420371 166999
16328 226019 246302 468848 291050 60534 122917 -5955 -7034 202377 469816 466024 409997
16317 409997 387009 179196 383388 363206 75201 248154 -118684 269982 185007 -19107
16306 271637 160084 140583 291779 -9140 501997 106606 83637 608275 384216 222372
16296 222372 251224 267000 274772 503145 290915 241896 274545 70670 122827 59899 58117
16285 58117 -38373 -30120 202673 40988 225763 9745 382753 391426 116589 -165383 -98751
16274 -98751 -50099 65852 314248 470248 117173 -65113 -16131 278507 141440 267240
16264 267240 -329800 -241181 -58852 236768 262654 233632 -35689 272750 116952 280762
16254 280762 31137 237784 199976 -21580 77078 155605 160567 117138 199416 260066 39360
16242 25601 295599 -298810 59766 118077 347818 222547 -71462 109375 -32461 115509
16231 153598 -17214 57488 74677 247059 -80681 86609 104917 99116 -106537 162661 267730
16220 267730 -384807 255701 211690 44793 266610 72230 -53110 138593 307163 42240
16209 129863 132237 368962 100562 134610 19323 131590 37425 123625 174895 206836 36737
16197 107382 102454 11509 364043 52716 29171 -32873 280556 293926 -42855 -6045 156653
16185 -99480 -201914 -186822 240815 331057 228407 -27162 -77399 -74623 82145 -17306 76743
16173 177285 149596 51641 -35577 68396 65995 134787 312327 24397 -33551 -34001 16327 201663
16161 201663 212693 -71801 -23338 -80633 -171358 33117 -265583 73198 -13815 60479 84683
16150 84683 -166651 212830 43273 -240072 -87289 -165514 37883 80926 373687 139152 10028
16138 39899 -193872 -161618 -49694 19625 -34458 -92886 61793 88290 -71915 -78697 -72870 -12718
16125 -60377 111023 -113353 -103506 -36129 138791 8592 -4705 109656 -286805 172887 -3555
16113 398612 -250705 240789 -1536 54561 84303 -183173 112212 194994 182607 92053 -86275
16101 -17502 -45415 212035 -194445 476834 -217885 -191345 -33972 -136705 -211583 -345477
16091 -345477 234267 195096 215252 -71020 -94788 -262458 -78009 -11826 218107 -49305 20353
16079 33382 -227586 52197 238675 -21874 -92858 -184387 101808 167493 -25784 225927 18379
16067 16784 101042 204848 -63452 -178726 62550 -190993 58504 100240 309357 -65324 -66229
16056 -66229 -74635 128426 -31044 -140541 -10431 337973 47455 26449 61691 -145531 26687
16044 -66753 -94196 321908 3813 197540 117943 -229165 42020 -214174 514955 -40892 66193
16032 117475 -123463 -106545 59554 -102469 -42843 21122 101736 -218139 251986 -100244
16021 -91445 116276 -171055 258529 -321076 123282 89960 222576 -116181 -228057 -123106
16011 -123106 161047 -187197 -122195 303163 200661 -190930 -165433 -343338 136523 130757
16001 130757 -229807 -431644 -1460 -35897 101041 -169554 17941 -319394 -22746 158405
15990 -143889 -185469 180347 185115 145990 81252 -135969 83052 -45467 -250999 361751 35709
15978 116191 96394 -115245 -165377 -65666 -253975 -357269 -102226 -288624 54408 29567
15968 29567 -224278 160636 287288 -19466 64318 142285 90005 50239 174289 -35674 -140296
15957 -140296 -27343 -214827 -183783 -228361 110604 34569 -50314 -126120 -71904 -135293 -95087
15946 -95087 -42718 -66674 27015 -78626 -69190 -302703 -52994 331404 138701 272957 210779
15935 210779 -126910 -93728 124271 38398 -126392 -134600 -114655 52375 -340149 -24047 -158183
15924 -158183 -55739 -276510 30951 219284 10343 -111281 -67541 89184 -12465 33792 -22022
15912 -9115 61659 -152572 -14268 -105033 -286622 58165 -264724 -1764 -25292 244024 -154181
15900 -111997 -111385 152911 -128188 -129399 191166 -50210 65055 343300 -325292 -420873 -101821
15888 -43297 -136011 -74670 -231852 -26606 -40868 -103251 193580 -122443 -154195 -158696 127577
15876 -63566 -74791 -122576 -167050 -67129 -25759 -39072 -95983 -223711 223605 -146473 191665
15864 106126 300002 -10790 -62765 -140188 -27929 -137222 213480 296200 -178989 -68988 -194008
15853 -194008 263415 7327 217452 -22845 49602 61209 -383730 -261492 -80504 13332 66600
15842 66600 -54644 17998 130933 105614 -205661 178311 -62391 9371 -234842 164762 -96236
15830 -156606 -213448 -139253 116772 -159059 -72558 -96709 -36990 55873 24600 -175966 -248576
15819 -248576 -15214 56316 109810 8451 188719 -195587 -131929 329117 27460 -205926 -110129
15808 -110129 11594 349326 -296287 -29728 -328046 -248439 -17145 223749 61677 133277 -223321
15796 140247 -230772 -65401 313900 143412 237516 213606 -229401 340912 -152138 -92203
15786 -92203 -100319 -122168 -295453 129667 250661 -121695 -187685 7957 -154575 137542 -152889
15774 -165259 -193378 -176237 65548 -161410 -260489 -275535 -318154 3336 -75708 -196555 -139754
15763 -139754 276540 -57529 -96270 -164847 42550 -68962 62178 -510200 72608 57748 5748
15751 -384472 16013 -47131 -68448 -86034 355078 -29779 12537 316528 -89307 -90130 -110360
15740 -110360 -202701 -26679 255714 -36302 79273 295340 -39085 -259471 128127 17434 -44977
15728 -19003 -168352 125474 -104547 316473 -65905 -141284 42681 27907 -126753 -175557 108082
15716 -89035 -138194 -185994 -262963 -141708 -208938 15300 -169940 -51074 -271641 -20477 -166470
15705 -166470 -125405 -115614 -37495 39200 -176139 -311587 37258 -62711 -68410 -130131 69958
15693 -119793 -77162 59324 -108132 -158246 68092 -48580 27660 374669 17722 286131 62278
15681 -110304 -49525 -62050 -264830 74520 124622 -29236 268182 23039 852 114527 98889
15670 98889 230981 108064 -145017 -133662 -150044 -143221 -133343 207721 191193 -289626 -358813
15659 -358813 21399 -89426 -156775 -98037 -57491 -247953 -60308 -80018 54287 -151620 -111856
15648 -111856 62049 -15382 -342162 71612 56536 -28349 -49813 120073 -254264 -151232 -128705
15637 -128705 145603 -10604 -16211 136409 248677 -190876 345184 -191713 119476 -291206
15626 -236257 -116088 -18806 140382 -231960 79505 -7253 142698 -203834 253495 -62996
15615 297794 18642 -51603 107894 144803 98659 10118 61713 -112680 171118 -215371 136260
15603 -45453 130822 107083 31382 110362 -294390 -148015 268319 95947 -144645 -255537
15593 -255537 422957 -132049 197753 -49955 -383715 121637 -60635 58595 -101256 146307
15582 21524 44019 -75187 -22027 -119631 664233 -100681 117305 -134256 -227989 -105821 118995
15570 86409 -28368 -143283 -130572 339129 -323847 18527 -125756 126561 70248 2257 300799
15559 300799 122896 -32581 -181530 32514 164173 47385 257752 69204 -11217 55415 -210419
15547 235459 -434909 104193 -35215 6570 239972 127715 -47754 146018 295015 254833
15537 254833 5092 288750 -141405 -235635 -221787 174037 192863 8339 83437 -170104 -108349
15526 -108349 53037 -53562 91230 -125793 -39688 -210808 58387 181646 -123934 16537 126032
15515 126032 142805 173056 -351402 31106 -51191 -261805 46049 -105109 -123974 26502 103898
15504 103898 -51525 74693 -377745 -127034 -88105 78749 166671 113711 152168 288002 87889
15492 -41125 -191371 170283 -132409 -599 17914 -38338 -6103 24072 -273126 193366 446 -222938
15479 152074 163747 54840 -422953 169382 -257484 -27187 -142872 64678 -15389 290038
15468 -396383 -6942 -171799 59779 -21145 -248373 -88226 250547 3414 167577 245461 132457
15457 132457 203538 -315577 -78221 -62179 436564 -174158 240689 74043 -56033 -24444 -39316
15446 -39316 -176143 67292 78586 -392962 -34500 72375 27359 127260 83616 -214985 -141831
15435 -141831 130558 167446 137756 -179264 -197251 -13737 20861 227371 -164352 15432 -126695
15423 -439929 -107994 -43077 202661 5608 -256985 32996 37138 264902 11341 344824 4352
15411 -271633 -53739 154064 -242562 99058 -329508 36457 37856 178158 125924 26780 -225659
15399 -242533 292876 -75373 106200 83357 307111 -29332 82398 222019 -149877 -154468 -49056
15387 105236 -156934 -306520 110565 117342 45129 158252 -486679 135146 199291 -299367
15376 94308 10187 -382909 -18017 68861 16339 199699 48180 313800 -58709 139319 356222
15365 356222 34074 -31163 15224 -23509 222168 149380 60626 -127110 145264 -29886 110881
15353 -207518 57416 -212620 446483 6848 112886 -173094 88690 -297822 -138460 -111053
15343 -111053 128774 -156808 86919 119000 -49635 -25552 158831 51766 199388 111392 -84200
15331 -7842 87365 -23886 35678 -6183 29724 -184916 -71095 274936 129235 69863 -105772
15319 219607 -59644 -81126 328376 -53715 375990 -257451 373434 457841 115332 -95501
15308 216121 62429 154634 55577 -189696 9098 -199578 -200666 230351 -55563 -11168 117898
15296 73713 53371 42346 162874 -57313 194534 -182733 127235 24523 11504 -59350 -17542
15284 -20730 257316 -303045 183305 -82952 302490 81147 205374 -102785 361627 86565
15273 167524 -104107 169464 -247463 296339 282157 -146371 -175139 -198951 -235798 -171211
15263 -171211 66446 42154 -63876 -80421 16661 130367 -17884 104296 19022 -19092 409180
15251 374410 267522 531882 1532379 1092350 934264 1217484 381460 188061 -17845 54563
15240 109011 388041 -156831 308759 312936 130066 40838 -28492 -8229 12077 -83169 48406
15228 -20952 246170 76259 55634 -429724 -70523 -38986 -33608 6442 -202892 5873 199069
15217 199069 -126196 235973 176256 190866 197896 195622 136402 71105 -24170 12993 100131
15206 100131 128445 10128 181404 -22245 70795 198225 372195 45880 -221400 170193
15195 90931 -150402 34294 110724 -6247 300068 30895 281073 -365217 -304194 -169394 -30356
15183 -40999 -131674 -250455 -62070 188157 18730 -95683 252602 -12117 -197629 335729 311826
15172 311826 186733 48635 386825 133383 49944 145172 80262 319397 151564 262223
15162 262223 239317 -77998 -80162 235014 290362 54105 14978 -14065 -29495 112962 225352
15151 225352 175191 -93917 66677 238902 445581 78144 42453 2713 -17512 108031 -56534
15139 336318 49200 352239 125150 -140073 -15647 -116054 145357 412867 144073 107917
15129 107917 79888 74200 227686 408749 -50649 155628 57346 -93230 87609 145734 -147232
15117 291200 -30857 -6233 208871 43404 -288352 39052 180290 -21183 145143 243178 59783
15105 259130 -51037 84833 271874 83377 201546 454566 170523 54051 177493 76062
15094 154219 66214 179259 237764 259068 422800 259917 175351 193555 166668 445318 125146
15082 552615 180088 65953 -76755 -97274 271346 72089 124616 227784 184211 -13158 263500
15070 121094 -216557 545059 265815 106723 350572 317148 308307 -58168 133574 -32847
15059 -180366 66151 67706 244587 118037 10937 46196 214664 10892 206790 16754 322902
15048 322902 543947 86953 -124700 197969 -93910 321651 -208356 517886 145505 281065
15038 281065 278414 78873 -78745 -268 -76844 -91883 133223 228548 -7645 187616 -33109 -19012
15026 -19012 -10895 334679 -98748 191989 254794 62375 364648 325635 -29966 568960 -128499
15014 208581 141643 174045 188704 470105 228808 155485 246557 -87722 288819 36390 170368
15003 170368 3496 242554 -207086 642412 257986 361164 211457 342763 -29124 120206
14992 173586 102123 539103 308557 300605 286534 500477 373394 375594 288660 145968 253198
14981 253198 521445 -41417 145944 164701 177511 44949 501931 168037 552513 156941
14970 362189 96289 155664 -5121 228663 62099 218839 241303 262852 214735 88236 68388
14959 68388 204920 219201 190936 462486 184482 116810 413467 46702 130670 4544 475828
14948 475828 101350 376102 284546 219062 120195 177534 272736 223828 187106 245058 290228
14937 290228 266911 307196 363612 200795 96499 229358 -94706 213042 322279 73060 710731
14926 710731 138796 283309 430998 -1281 235700 279108 141142 70237 64013 127610 272049
14915 272049 189512 413060 252923 275228 112925 181055 380610 473692 101517 418861
14905 418861 464181 242345 293244 294369 517399 407635 384933 375594 212687 288900 393358
14894 393358 253969 506720 487582 301699 333633 426906 320242 140659 294816 306846
14884 306846 24912 508784 434596 445498 386359 -90423 374062 537109 166876 158629 145981
14873 145981 255691 634289 433108 595272 505715 276084 637204 557523 286243 181299
14863 181299 626510 414038 338889 387568 497952 213682 287187 599292 228130 78020
14852 496318 543337 504533 226778 311220 486571 226109 334590 497897 186724 138679
14842 138679 589933 438367 429972 581934 386969 221836 411278 340392 813199 140685
14831 382459 512378 312512 988674 514199 421318 249368 418133 342432 222732 396575
14821 396575 535868 546083 461853 233633 691817 527666 567606 947015 401476 846038
14811 846038 413259 324814 514874 898582 608925 551060 755294 522272 515307 356777
14801 356777 521941 751565 522953 333417 611798 329552 549135 379377 623906 581280
14791 581280 469966 630064 533727 590199 438021 668223 390161 314974 552182 611705
14781 611705 515296 570350 716833 581690 785453 492106 662262 581969 521458 507356
14771 507356 677367 791738 777025 483532 927280 414636 436309 550331 255282 548740
14761 548740 409434 409740 803014 412994 793032 566617 822475 713746 748612 738350
14751 738350 609658 509536 787606 568227 668617 635092 858551 755968 1138983 855921
14741 855921 809158 574704 560635 634063 415350 560747 822357 468353 768508 888181
14731 888181 755362 551432 741285 605538 717185 483886 672300 790504 905341 815637
14721 815637 486069 851769 968453 709879 1139482 906201 869675 881776 719994 575792
14711 575792 529082 565065 699786 1032263 816861 756199 753326 1171734 777669 969423
14701 969423 844303 972894 691547 932285 840913 704283 789739 925125 934289 862415
14691 862415 759363 916711 722663 926385 1031059 822614 984322 717671 737443 999642
14681 999642 1223580 875438 638878 1006976 1052883 757781 822903 1070236 779637 818259
14671 818259 1005833 849503 907292 1081456 964508 859054 1302994 969353 1089784 887991
14661 887991 940203 1079466 1079760 1112455 1140118 1268713 1219926 1356883 886148 1178937 1223391
14650 1223391 1312457 1114486 1053972 1383554 1072529 815984 1341813 1210841 1267001 1345254
14640 1345254 1113202 1291566 1200709 1629831 1355516 1534097 1486267 1300439 1331820 1159320
14630 1159320 1212348 1523590 1596936 1172219 1316950 1407722 1508608 1344222 1347924 1416329
14620 1416329 1470656 1424205 1425326 1627277 1266559 1350800 1326875 1444710 1554283 1555911 1526001
14609 1526001 1445162 1406813 1383376 1589585 1549323 1773984 1609967 1489771 1630705 1823794
14599 1823794 1791747 1594147 1503180 1897546 1769462 1613967 1969019 1558773 1709869 1863953
14589 1863953 1607773 1624659 1662354 2035917 1768290 1680384 1794163 1941189 1756414 1982839
14579 1982839 2340517 2340135 2042724 2132754 2098983 2226095 2209775 2126257 2286353 1980516 2121733
14568 2121733 2107430 2302788 2423489 2074941 2393284 2366152 2938283 2456779 2666941 2546095
14558 2546095 2494147 2977701 3060875 3245990 3771129 3922873 4179927 5076310 5994115 7981888
14548 7981888 12838201 21402003 34056933 42474912 23685619 9505892 5037022 3507876
14540 3507876 2654144 2342728 2187143 1990752 1847695 2079400 2294494 2451754 2222990
14531 2222990 2071557 1898190 2509891 1915592 2614901 2071901 2122252 2639364 2404110 2407224
14521 2407224 2418448 2863834 2641906 2600464 2558965 2607774 2660072 2427336 2881749 2920329
14511 2920329 3063496 2687240 2863280 3084016 2903363 3018589 2932344 3105131 3167531 3310269
14501 3310269 3035246 3056515 3103277 3445904 3095062 3488168 2949495 3338519 3260575 3748895
14491 3748895 3027018 3631134 3558781 3634818 3503877 3741366 3580112 3814631 3844465 3654190
14481 3654190 4099562 3764402 4114380 4226470 4022453 4117312 4199622 4012472 4174708 4672761
14471 4672761 4476293 4476260 4252699 4181762 4438136 4410694 4598195 4643496 4638880 4806840 5111026
14460 5111026 4932694 4759190 4858661 5258474 5209516 5106679 5406138 5112552 5350924 5563796
14450 5563796 5670140 5482057 5584390 5580832 5580975 5549431 5949638 6020604 6075690 5922354 5817934
14439 5817934 6233643 6285421 6348205 6523115 6616251 6774067 6985861 6940222 7119497 7122984
14429 7122984 6921831 6861739 7153145 7538280 7097807 7479926 7951144 8019309 7725320 8085073
14419 8085073 8117453 8072541 8463614 8526898 8621596 8814196 8996140 9034592 8919326 9473835
14409 9473835 9325336 9514227 9428248 9540541 9699420 10158789 10169803 10345379 10663401 10544454
14399 10544454 10604188 11012901 11191320 11187303 11570464 11806636 11594867 12263179 12270488 12697693
14389 12697693 13011974 12971206 13341696 13575073 13704685 13976129 13836772 14546072 14766445
14380 14766445 14809286 15243654 15406068 15774321 15915111 16528405 16993624 16847037 17218177
14371 17218177 17899944 17782311 18345717 19159431 19058700 19588378 19961099 20428067 20640265
14362 20640265 21148544 21740349 22332669 22228492 23244227 23675620 24478082 24890764 25137474
14353 25137474 25947890 26291866 27145220 27722852 28502541 29081426 30026702 30570552 31319633
14344 31319633 32161441 32950233 34036425 34835850 35357503 36564777 37690289 38823325 39751600
14335 39751600 40872972 42297986 43577421 44514272 46125345 47334813 48825499 50467155
14327 50467155 52278410 53781221 55396613 57299578 59364532 61002808 63147060 65473974
14319 65473974 67991005 70473594 72826018 75747433 78214446 81822050 84284067 87551088
14311 87551088 91415933 94937453 99109521 102977802 107489533 112366968 117087783 122692411
14303 122692411 127809776 133588076 139691364 146341609 153136724 160746821 168752545 176632221
14295 176632221 185521998 194590011 204594959 214729643 225392714 237185920 248435974
14288 248435974 260952053 274236739 287229663 301113945 315403165 329455125 344120497
14281 344120497 358507437 372371395 386003826 399038773 410934952 421657046 431166213
14274 431166213 438773213 444233699 446502441 445746398 444314949 444254350 444096817 440612498
14266 440612498 434552248 426150545 416003348 404880667 392760481 379885969 365882324
14259 365882324 351605723 336663635 321838405 307971431 294105902 280342399 266771308
14252 266771308 254079065 241640373 230079983 218975449 208192211 198058641 188661356
14245 188661356 179893489 171331952 163511874 155713591 149126013 141674062 135467186 129732565
14237 129732565 124415520 119309220 113612595 109006718 104353342 100557643 96840533 92536260
14229 92536260 89217764 85754726 82077027 79379599 76310014 73347674 71074410 68107337
14221 68107337 65995198 63908375 61595045 59284403 57641069 55560010 53951544 52212827
14213 52212827 50845497 49492091 47717991 45889287 44763300 43988911 42425404 41987666
14205 41987666 40170826 38948776 37761981 36889066 36242050 35334622 34580242 33424553 32353577
14196 32353577 31359978 31026352 30244044 29493159 28701224 27924274 27138678 26596240 25989923
14187 25989923 25235874 24873913 24097999 23549371 22883738 22609517 22101862 21381630 21371297
14178 21371297 20616774 20072759 19922697 19599512 19187060 18847046 18538197 17764629 17599350
14169 17599350 17191638 17232413 16518439 16113281 16125101 15784437 15307957 15050979 14717044 14606601
14159 14606601 14581214 13981748 13917874 13591161 13161499 12893590 12679774 12769205 12410945 12676880
14149 12676880 12055908 11698426 11931080 11626482 11201550 11045296 10894341 10536778 10631772
14140 10631772 10420396 10402480 10334073 10185433 10042588 9595996 9526652 9402587 9284350 9094301
14130 9094301 9076610 8984009 9010723 8733888 8841894 8561120 8414271 8376814 8091637 7931110
14120 7931110 7706518 7853191 7825936 7384001 7211928 7594087 7474987 7120327 7117365 6968690
14110 6968690 6874855 6654279 6838847 6499343 6598674 6720171 6580978 6541614 6240197 6265823
14100 6265823 6149451 6365149 5738429 5881134 5693364 5654216 5668448 5610449 5573275 5481469
14090 5481469 5715041 5441938 5214051 5145913 4981664 5428343 5210802 4898451 4956595 4823805
14080 4823805 4829471 5063907 4475351 4606742 4802120 4809195 4339714 4682319 4537176 4335693
14070 4335693 3873103 4416893 4529216 4770843 4244456 3961238 4363949 4085851 4119354 4030566
14060 4030566 4136839 4086816 4309142 4182292 4143967 4137638 3820514 3832211 3698118 3725111
14050 3725111 3807549 3630852 3466476 3341642 3790303 3577396 3271259 3364732 3597734 3500051
14040 3500051 3226641 3202448 3316567 2930365 3040664 3248572 3119617 3147848 3131372 3045807
14030 3045807 2738434 2983987 3133168 2848638 2785537 2572814 2572239 2502113 2573106 2599586 2971700
14019 2971700 2733977 2819435 2481952 2161743 2867609 2502347 2225975 2331879 2499361 2497804
14009 2497804 2321091 2325754 2630443 2224571 2581716 2112722 2416707 2364692 2193997 2076787
13999 2076787 2371886 2268656 1818971 2172905 2115706 2302826 2153572 2239217 2626358 3242572
13989 3242572 3993912 7383442 14824155 28067043 39992875 28729650 14501916 9041881
13981 9041881 6506194 5173140 4572170 3859898 3786588 3103665 2834301 2880109 2688471
13972 2688471 2562712 2565941 2485268 2475404 2645438 2526616 2646036 2350986 2256124 2443236
13962 2443236 2282387 2650525 2182749 2137303 2278410 2146950 2102079 2327724 1696353 1961842
13952 1961842 2038497 2046778 1691747 1748109 1994706 1919255 2115097 1647129 1812482 1711053
13942 1711053 1572445 1654580 1984713 1635018 1783951 1335227 1605040 1746635 1754387 1834168
13932 1834168 1860949 1576516 1778667 1761214 1543219 1520775 1707295 1719067 1464415 1587381
13922 1587381 1695658 1406883 1445980 1735353 1481678 1395164 1253000 1693185 1526197 1446728
13912 1446728 1568987 1386291 1354672 1187851 1396699 1347772 1306689 1335146 1634227 1187228
13902 1187228 1230996 1278187 1255057 1502405 1339514 1276755 1420758 1381875 1065902 1281876
13892 1281876 925352 1191432 1326473 1402316 1183127 1431367 1037910 1102366 976150 1233149
13882 1233149 1201190 1530448 1272854 1215824 1308849 1310382 1315420 938156 1034397 935160 1276050
13871 1276050 1118266 1322464 849121 894578 1409033 1106661 1115618 932206 1238764 1068757
13861 1068757 824327 1099345 1310709 1091189 1341817 1108418 1073172 1462941 1166572 1049130
13851 1049130 1256694 1307537 968990 1103103 838742 879589 1143925 957237 1022545 978842
13841 978842 1162832 889648 1015403 889210 959399 817644 727573 855742 1080126 1037600
13831 1037600 843883 960325 1038856 994930 1124637 926171 773774 681714 759489 639205
13821 639205 494026 769934 745631 876173 926925 921674 931948 903007 862491 1005990 1150812
13810 1150812 838767 745776 768041 890055 853780 1170836 868891 434446 667943 1027614
13800 1027614 845483 1051355 1032204 300478 1123816 817214 609237 908540 619929 789466
13790 789466 766913 972795 867782 686118 824261 1276213 743256 672090 779654 966438
13780 966438 616926 759947 752159 520151 733471 805393 765168 994125 1049969 421322
13769 812282 675309 742133 502519 730223 985962 632926 186994 500988 576427 669592
13759 669592 938707 831300 866127 568312 255641 658842 702462 471643 900247 812847
13749 812847 446670 561212 867731 667547 293326 607829 521515 701890 646697 845493
13739 845493 744171 694645 525996 392759 428646 572236 476455 655213 48809 548705
13729 548705 837532 680121 806468 787613 485819 388614 646321 749509 917440 643110
13719 643110 576399 545712 419024 619023 494018 504178 514018 665274 552163 778033
13709 778033 459841 366408 623149 285232 483763 436192 335434 402236 445994 423975
13699 423975 939891 566058 517371 323734 643945 356866 549524 199549 295577 484971
13689 484971 514958 455918 512765 531456 632167 368210 109897 456971 770152 258047
13678 429784 777967 831974 357763 575141 620469 622049 810984 670219 296947 393399
13668 393399 647655 405127 375849 364021 628322 326935 328574 842593 486939 409019
13658 409019 631543 463964 417763 443674 675614 195444 220370 258183 363747 -81238
13647 408476 604808 527425 475459 606349 487704 471402 674440 702154 39552 340316
13637 340316 421916 348489 281114 248387 476617 405532 408445 529402 427303 557437 672090
13626 672090 477848 497663 21232 304694 310741 568252 381612 102105 188430 272830 217714
13615 217714 373928 202262 383238 56510 -144362 468090 345421 535125 376444 483409
13605 483409 466757 476922 305317 108025 321086 328927 258061 444113 337959 422447 425986
13594 425986 126030 388545 364187 291164 342715 457705 253329 93303 208589 334885
13584 334885 137042 166885 233728 245048 137613 263225 392532 48655 193496 539606
13574 539606 628345 355398 367196 273065 177269 247012 236178 331560 438601 337687 194185
13563 194185 491659 225319 345850 235350 351826 322135 355880 303918 472217 232807
13552 358652 315186 571975 452120 371717 303814 631846 -201996 574836 223590 553006
13542 553006 173124 426812 385232 464880 165899 5857 285978 123817 48102 417690
13532 417690 385123 369514 286655 350794 239758 156691 546572 128032 280832 360595 520610
13521 520610 527415 17163 340531 69927 363396 256790 369190 260321 375960 408161
13511 408161 499671 247114 111321 280756 232739 325172 255372 93231 322238 205371
13501 205371 209146 126025 58507 163685 436952 130955 140276 155150 400397 603636 116261
13489 288740 382628 266575 238920 340757 121652 454533 203083 -203 318958 243368 193547
13478 193547 26404 167618 264537 418225 226416 237825 686677 53862 437495 28442
13467 437770 345736 14375 236386 37517 11347 300108 366380 286197 215926 171179 73507
13455 49066 176750 121934 395878 379511 198392 179748 255995 424088 282955 430055
13445 430055 366741 155293 202106 16439 257870 -70127 27297 508055 61251 -34839 425719
13433 -53798 1837 -199731 160442 197642 103234 275051 318082 419990 96301 -829 209391
13421 173782 113701 -71168 101737 279919 211653 248853 425598 153225 282431 -14704
13410 181009 352676 -28172 -81499 126875 -3291 186882 285665 273786 265669 242189 -27174
13398 20608 125366 195713 128935 64627 327184 283135 235885 130140 137402 377126 92623
13386 157526 390310 66546 143699 170148 152744 -114872 337622 126693 340222 184453
13376 184453 380166 283309 445014 113122 40449 195261 553891 268836 473647 25793
13365 488912 354584 177603 46673 -125538 524443 -93491 438199 8213 -168712 -34292
13354 221812 140410 103756 106561 142363 336837 -92264 -158908 437206 248865 -58033 512720
13342 84754 276185 291528 548570 482840 296442 274814 -141710 189816 259542 160397 213032
13331 213032 335162 163940 212334 217096 501562 -48266 187482 457329 232187 -154078
13320 111457 487095 443392 265787 99627 261387 152114 4160 338320 381064 111844
13309 111562 215403 419122 202650 145255 228374 183845 445250 101770 216864 -102508
13298 173590 363748 320559 185806 -2297 -128309 419793 119713 218460 234561 -147517
13287 408968 262108 54090 176669 100294 111935 528663 216819 97766 -94990 321059
13276 -42885 12330 209528 142392 73979 184171 96366 195569 277395 133829 223501 75781
13264 53621 355036 46551 315496 184599 184027 307762 6955 76108 77333 351154 203727
13253 203727 976 191349 -160107 155538 -60183 241100 27076 -297169 -210344 2305 75400
13242 75400 -54523 -158683 -37665 185982 478513 -1028 225699 475654 36523 -70714 228165
13230 38298 -121617 217147 66405 -139809 209945 40729 -77918 -266761 -259237 237591 -67692
13218 202695 -55671 31220 -38323 -123704 229418 555905 191101 -10209 141842 34057 77071
13207 77071 215160 17268 264303 104917 149077 6411 -25930 2078 17671 210743 36321
13195 45011 -116149 -5869 114258 -15498 -113667 218705 76320 -238092 -47054 59161 399516
13184 399516 327335 80635 -430284 -258483 -59959 51538 5322 159034 -180025 2042 -88604
13172 -147291 -243362 530074 28252 -38598 325476 -28224 181601 408087 5581 96672 154805
13161 154805 -117983 171601 16499 29251 235446 -88510 291332 362871 -417015 -114839
13150 -17515 -410 208391 44372 101427 145766 333391 -30799 -17245 -124943 42763 312869
13139 312869 92729 -136669 45794 -47855 -49336 170289 237758 106720 -172693 189426 278817
13128 278817 -12799 159926 112014 -164869 -87202 -208339 390478 142972 -78838 -46273
13118 -46273 -307580 13312 46055 228420 146258 14243 210943 280608 137407 112815 39699
13106 271284 -240144 213026 190335 -56742 -209911 213017 -753 241135 176806 -305722 -238971
13095 -238971 211462 105909 158947 267695 235203 214163 -106878 -70556 -58215 81118 166490
13084 166490 -256203 197369 -15183 104930 2561 349488 188560 -163108 36701 139937
13074 139937 75574 -282295 602810 -107662 -43968 85661 96335 -369339 59613 -84110 241011
13062 153185 97063 111200 290332 76113 -132861 -76560 -3296 61695 104234 202887 238621
13051 238621 116868 433174 101221 264909 389815 222736 249052 193063 279039 -34113
13040 88011 -48483 114885 205973 81328 404878 6577 55439 -188354 215717 421081 46775
13028 51193 236867 -28496 269280 205410 117539 -72232 81135 87555 -10715 209467 121796
13017 121796 345698 366572 255725 -112613 361885 351358 -54603 205940 -167750 309702
13006 147671 390098 71332 -114688 167451 195471 -95582 271446 48989 -165571 301458
12995 148084 -95287 56238 -359571 13405 132510 -184044 60024 28810 -78921 12268 55071
12984 55071 139899 185808 27106 35787 -152654 -26203 78684 -319694 300598 179082 -147120
12972 195777 163192 134333 17676 140625 37385 66958 223768 201301 -265401 -42052 243936
12960 -106674 -212324 -259613 182851 94409 80015 57551 -178585 232884 126826 -88737
12949 146880 -45381 -2139 -60107 135742 102958 -118128 -2414 151413 149517 -334321 258417
12937 246023 20916 140637 121575 -12960 103690 276341 300051 -186854 -27128 -67991 -199890
12926 -199890 -133059 -112994 358546 541866 -94438 -105540 83631 43038 65154 -213476 -46053
12914 -31062 64267 117893 95448 -58340 310737 271484 -30570 138530 -184044 -100868 -320798
12903 -320798 261631 -9299 163212 300977 -61129 377372 -197254 -195128 -39405 373822 60979
12891 -81290 95191 -36300 -42799 149886 119868 -207306 204753 206015 -22389 270684 87437
12879 -152390 68125 99039 -39125 276324 -51921 -353617 19346 163119 -242489 -452843
12869 -452843 76332 -72691 -177506 35020 174905 28090 56157 -25252 -44321 -2150 -105366
12858 -105366 66247 11180 298716 -18734 298290 69239 -172716 68777 96339 143389 162179
12847 162179 129117 -108374 221773 32602 192768 269461 -207230 -297272 19447 -263266
12836 403154 -445609 -2030 -61381 52073 -144957 -157139 -316121 -24118 -96551 83579 81843
12825 81843 -31828 230573 11439 -160910 401596 297317 -26455 166013 292834 58757
12814 -76620 -86296 17305 -82507 -12354 66258 74844 -210684 117404 -143351 46555 136154
12803 136154 -159801 164241 36763 -5558 85908 13955 -71194 86060 106954 36603 57261
12792 57261 -46044 76460 348467 -277007 190382 -25528 -73192 -1766 -28123 389954 -69016
12780 -63470 -35521 -288603 -318614 -68756 -60219 153224 -71660 -53238 -112312 82174 101449
12769 101449 69916 -284022 -119873 86665 85929 248337 327312 -134398 54040 -2544 272992
12757 -145061 104328 -3428 324405 14755 315167 -83531 -204616 -66251 -284794 162197
12746 34353 -98010 -228275 -109430 -114899 214017 43228 -104706 171069 67297 -128519 425444
12734 1738 135370 196991 247923 260997 142452 86489 -459041 -28468 -387015 115404 199743
12723 199743 3790 -203180 365167 -71723 -88091 26557 140125 -96384 -235754 106420 -292524
12711 -47270 186845 173656 120158 121989 70153 87501 247167 118473 383405 236081 71046
12699 331970 -71130 311916 -26882 398855 117778 -26297 305314 273252 -7772 305311 14942
12687 180380 62298 219500 -116726 -20021 -220564 -95074 -1465 37591 170219 -5231 -14392
12676 -14392 270756 36747 -153954 217350 183085 13977 194848 65904 -298857 -22031 9380
12664 -203330 39158 27733 220436 161192 -27030 136644 -62141 434621 226751 178516 95215
12653 95215 13794 267999 240989 -85019 52580 245342 57867 -23685 38212 179245 -171412
12641 -36983 272066 -307493 -417134 25127 -21811 183959 273001 -71389 151858 32421 228357
12630 228357 108486 102609 291929 -201596 145913 17290 293444 442969 375793 158244
12619 333196 -38423 343534 -88762 -69450 245751 55360 -229884 -64569 119809 -6810 133862
12607 -96658 86593 -39282 107587 47999 95242 160448 121145 45191 239576 270288 1875
12595 171603 558036 218267 -88268 121179 84786 -136319 66603 285868 188351 -87641
12584 89713 197668 -189993 115747 38127 307937 -25845 185077 -58323 -151330 -63829 95908
12572 271279 78846 -225720 213473 -241975 271987 31687 -259986 143814 -299464 -105112
12561 167869 142799 183186 -38376 57387 -76598 87568 96777 -78351 149387 -23455 -47769
12550 -47769 -14387 32549 181192 144394 -141876 -325 63173 -134355 -71576 248513 132607
12539 132607 22630 -158540 -108426 186421 -21045 -66033 -47460 242172 16428 68331 -127859
12527 -268981 130185 91736 139943 188671 -114306 141486 -42346 -32005 36188 -369713 -24796
12515 -40377 -84061 -301702 -102888 -57683 97163 136204 19825 316388 337553 -170612 59739
12503 -53999 -181936 118015 -1381 128534 163361 273082 149399 -150235 -218242 182763
12492 -35222 -170116 18863 45679 -184465 -160701 -193150 44854 -124765 232846 -200665 163858
12480 36008 -211318 100284 -134563 156488 -193691 320657 37192 152242 18753 8460
12469 229346 -308765 -221723 128025 55943 -428266 162128 -190089 24068 250193 -132914
12458 -230907 -58103 -22479 -70008 -227106 -33512 64493 104509 141555 41714 -16193 -194798
12447 -194798 -225630 -222079 48389 -110774 2152 128819 59706 25887 37807 5832 -138709
12435 50079 -220559 235457 -115123 -583214 -244576 -433356 -38576 28896 -144046 -7385
12424 -374571 141292 -198236 -243482 103461 -66264 -359883 58579 -13533 -56294 -231428
12414 -231428 51176 105361 205634 19256 93529 -29764 -115413 170973 -2232 -120372 309786
12402 -5895 -184764 -87067 317804 74324 -165826 47379 104709 -270120 -40033 -131086 60343
12390 -195681 139467 67294 185280 -19686 -93617 165767 24665 -200118 44762 -166137
12379 -85345 -75357 123286 158111 89153 -189453 -16851 56207 10458 38412 -274138 -123118
12367 145254 211584 234911 -50770 177944 35593 -150496 191251 24778 50944 -105354 -12582
12355 -37358 -58515 -178899 -118174 -119334 -160351 117689 89449 -198799 -94048 109114 106947
12344 106947 276081 -304724 75975 -161719 -148735 -105181 -816 -78625 -130986 -85193 409719
12332 92482 -301860 -167344 -247554 136260 209768 -106048 -89817 -16063 55410 56037 -159664
12320 50868 -40639 148111 245344 78811 19853 -69863 5176 141534 196518 60417 21355
12308 -110945 315783 -151573 -103057 -88360 218716 76837 235619 -135582 100847 205327
12298 205327 63409 167202 -125011 -145742 -40775 431217 -45791 269008 147049 129591
12288 129591 447271 181579 -295401 230159 -5730 808 208382 -150479 216585 319972
12278 319972 -129968 -47852 193811 117321 116227 -180940 136277 11432 319145 -57502 41787
12266 -236551 325127 236447 286777 -48190 -86036 232853 377204 119546 106073 81581 -14084
12254 104091 -56685 111239 -650 74533 83600 -55788 62487 -196973 268539 -63541 111620
12242 134569 164751 120453 331487 229095 251678 -16747 260735 152670 156519 63110 348937
12231 348937 91208 136038 94116 65354 180059 456460 -32723 167468 194235 136760 43095
12219 165694 72579 380383 179621 11216 217377 388302 296633 -141115 70390 -50556
12208 269669 -217652 355399 67262 67375 120668 242225 37521 110072 -18836 -62583 316684
12196 -108518 419818 76660 151165 190352 -81819 234309 297906 283136 22471 331375 46203
12184 119335 82196 -120395 -128776 183698 -60893 288771 134903 92881 18430 119157 75643
12173 75643 287667 438791 278746 101820 122688 103038 250802 123198 184233 88406
12162 -101534 -140519 -99622 338542 -85383 -9427 173585 250642 -127553 -358695 208809 -288311
12150 52959 33852 -74496 -22590 192426 -165252 191678 6194 -182022 15047 312841 123724
12138 137672 -59222 40836 113593 170026 53823 7925 167497 131953 21527 195512 18454
12126 -260215 261699 -68078 164056 189982 27125 303247 -198128 -1957 -156243 158886
12115 -228155 -180297 -23011 191073 147126 55787 -94476 -154980 12336 -11929 -202387 175571
12103 49531 46377 81103 215829 -19492 -59283 -69985 -234273 258696 63021 -23902 14210
12091 138694 -127791 -346256 221731 104318 -116966 -184284 202166 28247 -67367 205876
12080 -214391 77725 171767 50023 73811 71542 -31949 -343594 -493560 189075 89351 492494
12069 492494 747210 1617107 942327 -17173 392124 -355817 49013 -151992 34989 -96225
12058 -45086 -973 43841 -31404 146796 65286 -31464 -250366 -29183 -33169 -198427 -296730 -343695
12046 -343695 34118 168420 -175591 -171547 -46196 182140 -6877 -102011 354932 -57036 258442
12034 -71975 -77007 47079 61321 -188708 -250781 2209 391137 -88878 -207426 -110584 70715
12022 11869 41505 -332992 236684 -328775 -26899 50672 -184589 -77247 29891 -111230 -20268
12010 38745 -232976 -29970 -3374 20127 62016 28774 16364 -291010 153520 -11737 -110868
11999 -110868 -453635 -156134 -12749 82498 76759 -175826 -98989 -35217 -192196 47095 -160308
11987 100002 46388 -26466 -6588 18796 -180103 231896 -138809 -152697 -50624 -259138 -3046
11975 -349946 -47664 37967 -150360 30830 -117244 -245700 31737 -299245 -402918 -246944
11965 -246944 151294 215558 37473 30940 166127 129635 259198 201438 91946 -129045 -59088
11953 -370316 186631 -223895 -104039 13724 64525 197554 62791 209576 313921 -30467
11942 48336 196665 -42137 56433 -230545 -280023 -141375 73697 -65581 129464 -327039 37186
11930 251075 46342 -114081 -283142 136157 -12157 -89004 -46146 -43184 142162 222410 79151
11918 -42300 219305 47438 146364 -79657 -149786 -61977 -125067 -166057 -100655 -193763 31656
11906 254664 -182237 18378 -290563 276353 96368 156653 75369 109673 -99573 302533 -89306
11894 267787 192281 -127089 -167262 -48314 18306 -246468 -9835 -218022 75562 -303769 259801
11882 429800 -131949 60854 -106956 5736 236479 135848 22835 -23326 -24024 -386400 -301038
11871 -301038 10995 -70520 -123247 17916 172517 112666 -21699 -199117 -247384 -62051 43125
11859 -331572 18078 37597 -199697 -29954 -405577 89910 81700 -54667 -196644 16217 -59302
11847 2468 -188682 -59486 -40907 -109294 -314070 -23313 -91636 -23913 159645 -190877 -28712
11835 -168204 66788 -139695 46547 169628 -52167 91980 72593 -244397 2739 -167489 86503
11823 8415 101345 -61853 149486 -129871 -229563 -1877 153273 -65586 239520 -58152 -72854
11812 -72854 126762 -150954 110474 -231652 105419 82460 194793 -284359 -309319 42228
11801 -278733 -41589 49276 -184695 -121697 -43347 -137017 -186484 -102330 321275 -113246 -87554
11790 -87554 61849 161054 -478163 206666 -56460 -119579 41773 4898 -301098 -154018 -83130
11779 -83130 -150061 -145233 433668 -266896 226160 -514221 108207 -193001 125705 -145136
11768 325250 -184713 306731 -340744 110811 -32138 101116 48678 166898 -341529 -119016
11757 -23934 -130487 -30791 -165702 -221980 8877 85721 -38444 165491 -245028 100118 88132
11746 88132 281689 -96499 -149039 74528 -192921 -277009 -109187 50869 64119 -9049 40013
11734 192610 149360 281420 87428 52264 -176575 -27710 -125879 60326 75298 -168677 -72558
11722 46938 298489 118269 169550 271812 -247250 -107384 115783 -95118 384098 -115615
11711 88933 32490 181455 -1247 161366 204882 -33045 241120 111991 305972 -33497 -32494
11700 -32494 -68598 230362 61238 -86302 -298937 101690 208984 -103684 -56446 117063
11689 -56074 -152697 211446 232732 334930 188190 -24211 281109 173317 380950 454739
11679 454739 -39222 -441646 -156883 -40287 89428 219506 174919 -78825 -163436 41096 46953
11668 46953 -266355 286083 -184280 -129905 -119758 -240334 -24753 -119828 -47724 209012 -5780
11656 77473 142417 12429 -72160 -28641 42996 -148693 30099 291036 -251811 237326 201977
11645 201977 -132259 -109262 23192 188396 69419 -209040 -107115 184436 163166 187097
11635 187097 -189793 -11617 -292664 228756 91641 18740 137283 190198 -7097 18642 -101095
11623 228188 241776 -16224 -22210 -289490 -198369 -20807 -33535 -230673 205947 -245043 191147
11611 -66168 -6851 56483 167835 -335332 164247 -92779 7542 394092 -131445 34796 -25440
11599 267480 319043 129781 233850 -184825 212036 57723 -52351 280698 55389 157874
11589 157874 90450 -56752 316332 64184 190002 190996 126724 44695 -236151 -127179 16283
11577 -203131 476949 56675 -99648 23265 31847 -21710 237141 -110131 71977 -42752 -29733
11566 -29733 123184 -233429 -140392 68335 328459 66370 193974 -14926 160488 -265955
11555 -155693 -280699 24425 -25922 39254 -131541 172097 179783 38342 47293 281515 121533
11543 62120 435183 31492 462490 -10392 -4054 118714 149369 -33968 211564 115349 -54485
11531 44006 240553 -100026 -81248 -74726 88808 112531 148938 298101 402959 274888 -235360
11519 462846 194918 -12348 116877 205178 -55777 73233 31158 129551 121268 352290 34608
11507 -37428 326389 361438 122060 244645 42767 193834 -106468 -167498 -126796 215337
11496 50236 -49648 -118342 144258 296512 58938 51125 73708 204179 -106993 -64814 -207421
11485 -207421 282077 291941 34704 96998 66111 313634 -32799 352530 220301 -16710 73230
11473 282767 414101 13506 -114046 -72180 329546 -58734 147492 251724 389816 -12545
11462 250590 135714 -97567 92966 146109 231385 109651 400360 96919 76934 -230961 151221
11450 74336 107922 187023 -21901 302716 411256 144932 -4795 237954 13482 -14070 -139838
11439 -139838 165301 236855 -82618 20704 16913 -82002 161826 70682 208130 171923 351707
11428 351707 -152482 391007 124868 -53438 -139752 331266 125931 -161431 113933 -514159
11417 -14389 -1180 15115 41150 15656 -165897 137245 74313 231071 289 -141996 528720
11405 -128460 125008 166700 33919 75233 194578 -546535 312341 247175 137230 -420542
11394 -123155 -186532 152419 -164312 -152655 -47883 -83581 91755 155671 -313543 -85477 -226836
11383 -226836 207656 -38725 62556 31412 38362 -162764 184134 -20818 -129641 120480 420296
11372 420296 -353352 264505 108035 -51111 -52556 -103141 151458 331361 191810 70852
11361 5267 3524 -459696 215116 -98513 -65352 -42882 -46744 100557 6581 171156 -279238
11349 45577 -8602 -55635 75207 -204650 153645 -147668 -74220 -42251 -4092 -101696 -219968
11338 -219968 79293 -126612 278302 86389 -154488 -58467 122004 254879 -43882 -226018
11328 -226018 -51568 62412 -202516 -234136 -222669 -158515 95205 66762 301570 -1139 84498
11316 -150002 203467 -139792 -107168 134863 -117429 144214 26789 24824 -73435 44959 -58150
11304 -184635 112268 39602 -352095 238778 -77403 -231640 163879 -121511 24912 -31454
11293 -269315 92443 -185181 -153561 -23249 134838 -222863 94232 -104400 32484 44928 219159
11282 219159 53818 -104199 20565 -251011 -191409 -329904 -3709 -234068 188389 -312277
11271 -207902 -435526 -217859 -86378 -14404 -3694 -300315 -31389 -168915 -247175 25298 -417
11259 -185120 -95756 -169511 80496 -94847 -395477 47423 -37196 -196127 132603 -86171 -251426
11248 -251426 -302687 -67032 196595 -85173 113227 53068 132567 91975 45405 -11324 -3461
11236 42146 -137037 324038 -324142 53856 -198288 -47349 88920 -340703 -182567 63840
11225 -166461 80835 -324146 386248 209477 14779 147666 -39485 254092 -41339 -112522
11215 -112522 18532 248523 14566 -162401 -151775 -381182 -128593 70721 -83706 -212896
11205 -212896 -262050 -339332 -341435 17354 321957 -57077 -194756 -172922 64536 -93645 -130168
11194 -130168 86032 -10530 -247930 342170 97015 3822 51606 -165361 -171605 195794 -42063
11182 -96544 -88544 -181559 36814 -252476 164253 -167263 -269226 52091 -108127 -118448 302084
11170 -336378 41154 -94959 -78996 -72029 -165410 253506 -6259 -415205 147170 112739 -82718
11158 303703 107618 317340 -57174 -420406 184373 -249484 76050 273505 -125212 -41490
11147 -213394 157137 -61805 -226148 -111951 -18654 71938 -233405 -86928 71683 -252235
11136 -171614 134115 170891 108418 -31425 286936 -59570 -167384 11083 294177 208083 167707
11125 167707 145231 -132030 16974 41595 291739 277915 17891 289449 126209 17944 -69875
11113 56630 -186784 145579 79111 181913 -188918 65539 -113489 -104714 280028 233452 75167
11101 -171536 320364 266727 -174256 241525 3902 74627 340814 -223053 -117903 226121
11090 444405 54588 -179707 395723 96463 352349 352968 245206 9852 30201 50503 122484
11079 122484 134389 -1524 124681 89000 333692 501477 188012 399884 173490 369002
11069 369002 301955 345784 437763 463647 407588 50938 283219 567683 675087 495846 327882
11058 327882 525147 484735 525766 766510 550534 600141 899559 738646 477348 709341
11048 709341 619714 695302 901321 531220 369884 212962 669296 644667 627018 757208
11038 757208 746202 456273 621515 696504 180066 379999 666754 584886 796242 718182
11028 718182 886696 540348 722077 704452 676749 722775 660830 568024 589511 405474 512676
11017 512676 403300 468033 320187 544083 614122 756732 534472 727035 692555 719832
11007 719832 427532 764969 544285 911825 609750 318826 555887 726945 522504 588848
10997 588848 686332 498482 613832 785069 635075 755104 664551 631094 782807 1071298
10987 1071298 554299 1130385 984627 978556 948518 1363322 1155114 1101462 1353795 1488136
10977 1488136 1772256 2317873 1789183 2197427 2470582 2609007 2633237 2388353 2272240 2216183
10967 2216183 1996100 1777199 1728108 1564660 1548314 1705642 1849508 1921092 1919175 2055853
10957 2055853 1620146 1577599 1620378 1358904 1165688 1100912 877321 688065 730715 633834
10947 633834 360635 350480 272129 406346 231571 58241 304055 319347 241380 8376 14924
10936 14924 7906 244239 -41569 96933 -50946 210315 -77887 218599 304 77680 -25290 11118
10923 -10180 158631 -181626 -74558 136289 -20019 286867 -174658 -365456 -264170 18373
10912 99188 205414 112805 17954 -127545 123941 130272 5875 -267306 104383 -57882 -89854
10901 -89854 120309 -158497 370230 -159477 157458 -127771 -10962 -56436 -49802 118531
10890 -159008 99437 82233 95513 -256308 -88257 298456 -228459 110032 111468 -351509 -101273
10878 252485 -200281 21892 23507 -116691 244109 -279874 -101319 -44767 -258420 -153585
10868 -153585 -15641 -179902 -220579 259884 240655 -27839 -116095 111241 -130058 42807 -140440
10856 -94252 -120297 -184556 111988 -90664 -41376 49777 147186 -299448 68921 188052 -90797
10844 -226892 100799 -436954 -142175 -67376 183412 52883 32075 -16868 19494 -167959
10833 202768 215498 -142105 -34661 -258122 -128388 41289 -224716 -177077 -208010 142665
10822 -195362 223542 142883 -195012 -106299 -82187 -385275 -206421 15864 -268081 -58942
10811 -43670 -103846 168996 -252422 149855 -124525 39784 356537 65625 188226 9224 -80757
10799 359416 -11478 -190240 -133263 17708 -95953 -395235 174383 -26625 -7043 -344824 -155874
10787 -146835 9616 63695 23853 26181 -168041 89160 -80805 -87625 -46835 -429726 31462 81932
10775 81932 37388 59465 -136520 310853 -406397 -86877 -428461 -30068 14316 230411 -109012
10763 -140187 -105706 65987 -30126 76529 -138855 164995 210049 -33213 -24753 367054 -137012
10751 -11438 -351476 -72483 244342 -280598 -205215 -84329 -101478 38286 109328 -122220 -24682
10739 -134129 -17521 181993 107169 -167612 138030 2998 -288965 68991 -6878 -19294 86755
10727 195943 -341587 -18015 -46095 -137635 -236263 149469 140016 -211926 70535 -113415 101279
10715 167491 129344 -83942 -184954 35013 76750 -63949 -54554 51096 -32237 340259 141167
10703 92288 -108736 326855 -200053 -52920 45914 144165 76222 -220856 -194737 -156079 -185677
10692 -185677 -494250 101220 2478 -205486 -199977 237658 -88729 79751 105153 173880 206313
10681 206313 -67635 -376879 -350993 26166 50817 196732 -88666 -236154 -159148 -300193 165037
10669 62910 58619 -208399 -164084 8947 33334 -59090 54403 -98572 -62627 -181747 -210941 -130302
10657 -130302 -193777 225470 57507 108734 275731 -65600 119452 -139109 -186411 134047
10646 -16246 -113307 -73774 134772 171940 293020 -59721 171083 25320 53723 204014 -6884
10634 -242468 -26301 161254 134305 72914 302008 305775 -12754 -172407 -257996 -60994 22022
10622 -164266 50923 70550 264430 -326124 85379 -26965 233745 503455 221799 -112493
10611 -6095 -97730 18423 -191011 -51930 -201490 -64244 102011 850 -304428 -70659 -32409
10599 -108508 -42760 391321 100120 -366300 -113101 260880 -391289 -180842 -238833 136290
10588 -239999 96026 226320 24739 -829 -157746 236962 -377880 -351618 -90082 -44148 -296619
10577 -296619 75486 68618 -113009 -96156 -48772 -20048 16247 -119482 -122539 257341 -89985
10565 63761 -22150 -72732 -248116 -1838 125378 345267 -45152 -14190 -75920 -30043 -111658
10554 -111658 -13404 -54044 33093 -183323 240523 -1007 -253854 -188193 114388 -24608 99729
10542 -103228 280155 -255391 71357 -46301 -114601 104856 -136121 -127670 -237798 -75393 -70218
10531 -70218 -67127 8508 -172702 -418816 -69870 216484 -158362 -6121 136393 -80300 177688
10519 -105311 104303 44952 345524 -332229 89108 -97971 188006 36830 -40424 239077
10508 87458 113734 -223979 -242691 102245 -47483 -277932 -251632 -180439 -42315 12708 -460799
10496 -105466 -60508 -238403 -185991 -268733 206523 380165 265905 50730 -78103 -204350
10486 -204350 190199 121982 -17847 254679 147093 307694 325111 173358 -85633 122163
10475 159725 -176281 248738 233286 -211401 -86469 -272171 904 182317 19686 139355 -223222
10463 -138927 -109710 -207568 39263 128523 -91242 -213125 52496 232404 -226105 145944 -87436
10451 -21681 25855 108780 -194151 276500 154761 25136 -139933 68555 308912 5241 -41932
10439 -177747 45606 288774 -69629 332333 152849 -175480 -88076 53416 -65459 2584 226107
10428 226107 -6419 -247242 24120 -292337 21989 52509 19533 104188 252624 -242369 -70492
10416 13297 58985 163724 -81958 -128240 114053 -81194 -388845 -6251 235930 43909 -88248
10404 -225011 -45154 385010 371666 295031 -88542 285491 -330544 213761 -315664 -77076
10393 390227 106499 -45711 80764 379843 -66907 13751 -8786 369573 174695 14677 -89543
10381 -83195 -65077 185789 -11499 277109 13153 438460 231109 113770 230455 518245
10371 518245 491534 551208 89165 664898 224115 541784 344941 166075 547341 -66988
10360 75988 610137 -100257 153938 33410 366732 451060 25775 224630 343503 177749
10350 177749 400488 552728 421232 311687 389408 199554 357857 316674 279867 516762
10340 516762 102571 179841 -110482 105447 -147012 228769 -25650 414236 71440 130676
10330 130676 -225421 122631 166046 -31302 103807 194397 14030 135676 242382 104988
10319 -34034 -50832 -47924 -74895 86801 106301 127008 -169654 162605 -84112 4748 -36990 -63464
10307 -63464 -55851 145686 111455 27258 146257 131518 109677 30104 -274499 -2666 48396
10295 271112 153544 471277 173427 -25180 -182258 -186534 22544 139865 -14614 -75547 177122
10283 -173261 -25043 -175352 -85389 -20332 113409 -271884 -171707 70930 15264 316547
10273 316547 -218151 -154742 -52142 251170 117394 -294486 159296 159077 280841 368588 283614
10262 283614 306677 422746 330104 333945 280096 138782 502583 71819 136335 126030 -92580
10250 -41819 -137127 -160506 513844 -77662 -72494 -78376 45226 32608 -156337 -81397 42423 -124386
10237 117378 -118790 139003 -63942 -184746 65637 390611 70864 -14023 -90208 28043 -99173
10225 -430208 -140313 -18178 97481 -84344 -57977 -168604 -17004 740 -63184 -237796 -281729
10214 -281729 6665 -12935 2482 64972 -152122 93618 -263031 244811 -71999 -304586 -81378
10202 -112522 235514 -208043 66662 -181941 -202722 -48591 -249545 94154 -225020 -161342
10192 -161342 -217883 -67136 -16759 -90048 -252392 -280180 291690 -27290 168989 -140169 28851
10180 -30554 13701 34441 263820 -217218 -81743 41499 107623 -143318 -135582 -180715 221826
10168 -269782 -211337 121280 141993 -124389 -206313 -156120 -128749 66285 -222991 -211887 -196363
10157 -196363 8190 79393 -110284 -23177 -145052 -65641 47482 -528925 -143811 -317549 94638
10145 -341370 -97214 -85189 -199368 -19388 122790 32411 213831 55007 -121927 -34125 65514
10133 -44023 -200112 106119 66209 208005 -500791 -15810 -97417 -135330 -993 61603 -73881
10121 -86267 -230664 110974 66211 -226452 -141596 -152575 -284316 177404 62390 -116926
10110 -149601 -97869 -211261 343582 58461 136933 -9826 -230768 -134929 172881 -217452 -185871
10099 -185871 -274203 -8434 -45915 -126785 -10087 -60590 366239 31027 216438 -924 16377 -198440
10086 -23105 79758 -91195 -141865 -352205 -60550 -72810 -44502 -59631 96289 -72674 397172
10074 -7837 81150 117035 -70995 54616 -42402 -154155 77852 -2619 36012 -14939 -243866 80833
10061 -166387 -246848 -328365 15361 343502 -47638 -4944 -132805 -39219 125741 -239329 15090
10049 -205745 -59491 -215201 354702 59552 -286498 -75610 107734 25558 -52115 -181513
10039 -181513 -291549 -90506 -51992 -120167 -257013 -96655 81355 206102 70193 -219993 92247
10027 -272312 -66792 298915 92069 15796 125465 74674 -275457 248981 -27501 -157025
10017 -157025 126673 140070 65204 139769 56485 139904 -369602 61281 218199 84765 88543
10006 88543 -180177 -41073 -129975 -144625 -47013 -16198 -164706 31222 -264386 -314131 53928
9994 -353270 -199807 -133303 88428 52652 -134202 131666 -44797 -197380 -97312 8812 -158032
9982 147173 -90702 41589 52500 -70375 -163088 190096 147984 143138 -86128 -228096 -65417
9970 -39669 -384404 -103858 149052 -33799 -362236 -67951 93556 38249 -355800 -475543 -49231
9958 -80479 120607 -318382 60720 -193675 99011 -160725 -460563 121811 -285321 3937 -50184
9946 -234467 62073 -231251 -154 77607 -121605 -67838 30877 -21588 10555 215406 59806
9934 87998 -131293 48215 -35133 -100088 249688 52322 55798 84537 -135755 154602 -275065
9922 445463 -249408 -55359 -7229 -43023 -214983 298843 44136 47269 -341992 -32526 16195
9910 -150853 -15889 16982 -677159 -12801 50349 -93524 282771 -289727 -94919 -19326 273266
9898 26421 -459506 -110581 -375276 -201217 -165066 -76626 -63532 -317049 -79515 146506 -107272
9886 -172535 75011 -31425 98538 222831 -188933 -198700 -178230 134499 -120979 -272572 26851
9874 -7753 -399370 -326281 91201 253937 -76837 -196907 -116175 82169 139142 -80077 -566613
9863 -566613 5359 -416215 -166988 -61575 -310085 -165323 -21416 -121955 -412112 -303284
9853 -303284 -87979 -9644 59532 -68132 89156 -285006 -80664 264203 -22608 -160862 -32125
9841 -208974 -182553 -3078 140890 -133516 42289 -107930 -54843 133601 29158 41553 7196
9829 -135433 -189754 -80202 210538 -297061 -67874 -57819 124092 -66723 -323199 -413695 -21011
9817 40335 -109055 -204326 -21361 -118010 -410816 205021 107060 -338301 -94423 97566 -70920
9805 -193870 104089 -21136 21077 -131321 -210800 365518 205422 -129675 476630 51009
9794 -7958 115110 -15382 47599 -347118 231071 188039 -228183 210248 105469 -109285 -101320
9783 -101320 -62229 -522264 48703 -74673 -220202 -96608 -315638 -168831 142360 421852
9773 421852 -363847 -168465 -125127 45426 -105540 148305 -152980 -317630 -46981 62084
9762 -573433 150608 210126 -210466 -51007 -276749 -52853 -245380 -99703 276841 79371 -172747
9750 163355 75478 -94967 -262122 -17864 73725 -99501 -57333 143998 17758 -197369 -45405
9738 -80908 -93945 -88229 -376218 201504 -141062 -17095 -235073 4603 -156842 121183 -76666
9726 195209 -184424 -76164 -6283 -19778 -88900 -99985 -226894 -53136 42355 30539 -26747
9714 -412942 -115421 125441 -16597 -95099 -111131 -173005 38267 130738 -52673 51997 -94466
9702 -477923 54589 -117772 -122233 -225809 -372035 57926 -20107 -26903 -249255 -210075 -98 -47232
9690 -47232 -148523 194856 -32232 -253743 -239628 -280881 274092 -211772 -112145 55983 -178600
9678 188456 -112278 31607 22021 -4149 12654 26232 -164084 -50328 324241 -10154 -318453
9667 -318453 -205885 -73388 98897 84622 -367835 -352216 -140944 -173532 273949 133300 -361269
9655 10018 -118262 -99532 174733 16143 -157286 17467 -21088 -48843 -9916 12145 -20633
9643 -50223 88910 111 26165 16128 75784 -209099 -188625 -327000 167098 -74982 -66366 -124440
9631 -124440 123095 23260 -234198 103005 -370092 -30996 -48961 -171385 185702 -98553
9620 -159191 197037 -414103 205669 -138734 186355 -56072 -41891 -306805 -115565 -27482
9609 -40136 -10155 165757 -76153 -58490 -183656 59869 -142955 267546 33536 16431 48646
9598 48646 -170363 -8052 261581 -186832 -212903 -136118 -66997 -92587 -191648 -145034 42070
9586 -302072 -74787 -314788 -92856 -150188 -6419 378 69100 -7967 14152 -205305 -157344 -174256
9574 -174256 121232 -62548 -75269 -356533 -194058 129489 8797 183375 195816 101459 -78154
9562 -7789 23742 107427 160673 284317 -102730 -57564 -71236 -181883 12710 -55007 -2168 158638
9549 -131419 -437170 52585 -125395 55716 -188633 -262541 49523 -96793 -127022 242031 -102917
9537 -244688 -174990 -109363 -275168 -160170 45839 -162344 -52494 168328 -255761 23277 -146101
9525 -18139 19071 -359079 38221 283221 176435 -22163 2557 -132587 -245303 -35381 -373918
9514 -373918 -106363 -25596 -22576 134561 229196 -180551 -259926 -159895 224163 15115 -50805
9502 -91624 -99535 -310125 21755 -244745 -172516 -257823 8271 -160579 211700 -53152 -192548
9491 -192548 -2095 -77266 -69690 69462 -239944 191363 365206 -53211 154837 -310210 48572
9479 -365590 80827 -217830 -37871 -39402 51301 -339386 114312 105629 -90310 24588 -81793
9467 -445628 -119210 29986 -17873 31960 -188957 -229310 -238485 92855 -49013 -131142 -272241
9456 -272241 23269 -105477 -98640 -210977 69711 -435009 158299 -57974 85381 -122566 151042
9444 -70427 -20723 -177268 7029 -84389 158758 -250784 -233248 -84469 -200769 -115841 160300
9432 -146033 -178009 -200532 -157258 -201591 -17295 -250420 -148591 -287744 -12957 9789 22449
9421 22449 -145238 -99765 -136504 -161878 196780 -137418 -43170 -369986 -109934 83023 17889
9409 111358 -41514 -99734 91582 116562 -307539 30157 156047 27183 -108089 33903 -147730
9397 39284 219811 -190667 282015 297358 -103621 -143417 196143 -242384 -217470 -197090 -58865
9385 149542 -26866 -114281 -113264 218160 -58382 124607 -172746 -210016 -2232 -132614 -329733
9374 -329733 -64504 -79173 -111703 -151031 -262931 -206971 -93856 76931 28441 -306582 107908
9362 152358 -159069 -155174 84068 -144893 295231 -82203 -43351 -69445 -121477 -100129 -217028
9351 -217028 -128479 -155127 38100 -98351 -130773 11510 87827 -116344 -256503 211347 -159415
9339 4594 45448 2682 105510 205461 -256333 -31164 43670 -8374 450441 -313062 141064
9327 -96358 -170498 -52786 -66817 -132475 -196766 -29187 -105739 -48447 122291 84674 -125963
9315 -227638 19700 -244652 -264570 -33323 127971 -236401 -61763 26125 -97754 104725 492315
9304 492315 68052 -79027 -5758 -120747 -118528 135502 -125950 -109689 -35059 178291 -179471
9292 -138980 392043 -111217 855 -66666 -55998 -72772 -319709 32936 -39865 41317 -377174
9280 131549 -16953 -194139 -101501 -218911 -50792 -70463 -267330 -155899 40098 232081 322241
9269 322241 -277162 140166 -44325 -25116 167911 -209331 -45123 138390 -180935 -196814
9259 -196814 -15197 -117432 -130083 -225965 13431 181183 1894 148642 -237781 264292 -97045
9247 -151847 293872 -93498 -415235 -189382 -63519 -69554 68365 -91604 -110168 -18861 -169621
9236 -169621 -21313 155799 -50244 42619 -7181 76133 -19166 155664 28327 -11269 54764
9224 -391289 161218 -335369 -118717 -248679 249638 160199 -36588 -257743 -155002 -25606
9213 30357 212924 63312 28029 -205478 -53955 -28269 -55565 -194866 176138 269562 -222234
9201 -74101 -324752 -512261 -42246 -231707 -226049 -169506 -160588 1405 -187179 54283 -11205 -55260
9189 -55260 99336 -247770 251069 -12736 -386076 297838 -127473 -119978 -113556 -48571 -121893
9178 -121893 -384150 -81496 -238949 163345 -197886 -285551 -227450 -254717 -69867 -42464 -169155
9167 -169155 -417598 68477 -115219 -90528 23414 -399902 -169136 444297 182368 -82511
9156 81465 -131089 268875 85440 -397519 -203173 -252994 80585 -120618 -131875 -277492 -96905
9144 -4601 -108318 43308 141652 -156096 34431 255645 -241980 2018 -10864 -3677 -117577
9133 -117577 46889 -75375 -90834 163331 -388718 -193998 17630 -32389 15819 118380 135161
9122 135161 132169 236624 -62806 -120588 31040 -187715 -44608 -210517 -11979 -23612 -299657
9111 -299657 -94129 70268 -63475 -82305 -69552 -316945 -151017 -235894 -50903 -27383 285985
9099 -315093 194105 -231365 -95779 -107091 -246278 63534 -56967 205353 81667 17647 -129278
9087 115786 125650 -244514 111800 31230 255722 -32804 -188269 154280 -129308 -108441 125685
9075 -3929 -51803 -165380 -189480 -39281 -97769 -180569 -180631 -87648 -149889 -44905 -67463 -28575
9062 -5867 120432 40998 -181130 271979 -193015 -118625 -240547 116483 174015 115046 -34093
9050 39523 -6164 -86916 100466 -5416 29000 65003 110725 -5501 -137950 -48803 -298139 -27728
9037 -24738 -184828 76274 56494 -117668 -211259 -337428 98027 266462 -163991 -144456 -171307
9026 -171307 -139420 -413937 -92754 -293822 -25143 -305440 97173 161522 83280 88037 -64698
9014 -552227 -36719 -215375 -196800 -98337 -304680 -163173 -86235 -360507 -40430 55653 -193848
9002 -164147 93221 -168478 -336325 84490 -46487 86383 -79692 58247 -188532 257264 -51444
8990 -7431 167694 84161 136787 -16730 -219772 -37424 100871 208540 11620 -29394 107386
8978 272018 -431558 78819 -139586 172059 -21182 -30549 112156 -62091 -85092 25875 -186234
8966 25202 -65024 39181 -163154 -30918 -168729 -79454 -42113 -300671 -199127 -237085 35275
8954 96878 -28765 -9979 -154083 -193659 -63695 -28829 -4121 70499 -360066 11214 26591 -253420
8941 195786 53924 -134274 -223331 -45510 -45569 363193 350630 420276 193708 159189 -32967 -126641
8929 -126641 -30343 365356 118505 407218 1056871 2664657 6651215 15331337 11854645
8920 11854645 2871239 1077122 470127 561078 381392 214960 78851 -197444 -96604 -342710
8910 -342710 73843 218155 124428 195944 66220 132861 141133 -197720 50459 -96546 -59474
8899 -59474 195264 -82648 -8439 3573 40332 223362 -104919 -18167 108583 56446 -111043
8887 -64771 -201091 -384660 99185 -127815 -164517 173948 -28514 -42273 -271443 -142288 -5839
8875 215213 99339 57174 154936 -109640 -73570 -29701 -415456 -116234 149863 69653 175349
8864 175349 125737 -68685 -83151 -193844 -121717 -39244 -415696 105161 207301 298224 -118803
8852 -183971 140110 -319661 -116167 -25350 -19156 -192595 -380119 -164709 -299188 -415707
8842 -415707 142612 217963 16720 -214172 -140221 -190070 -59621 -164230 -200415 -180358 -230632
8831 -230632 -182167 -207061 -191090 -351853 -34491 -95176 359870 28020 -159595 106695 144979
8820 144979 64833 143958 -11195 -67469 -119274 60941 -98198 -171159 -224261 -168800 9581 161971
8808 161971 181314 196351 92348 -68848 -343692 -133995 -48069 137299 58129 65534 274175
8797 274175 -141416 22943 13309 75700 132147 -30816 -309631 17503 -47947 32587 -94050
8785 -58032 65996 167212 59390 78002 136550 -28207 51430 136970 -104515 -335475 206079
8773 108380 -33901 -73631 -47904 45578 -158932 97120 -45510 -151163 -127570 -371698 144808
8761 128427 -13059 -389 -60699 206484 -16852 -298147 163459 42904 -172035 47296 -149103
8749 -123956 -23550 68914 151549 -113297 -205447 -17170 17880 -63131 145285 -247154 -155393
8738 -155393 -324214 -248404 -175068 -180498 -80080 -45202 -54599 -418393 -14337 101651 -84119
8726 -7203 248779 110030 180622 -250708 -126268 -219533 -33137 -420591 -136279 -97134 43085
8714 -21021 -16946 -8456 -180067 -169783 -27947 -101932 -178875 97319 -78781 -200290 -220306 -329523
8702 -329523 110333 -141595 189678 -203709 98115 -72351 145797 -47644 -132447 170669
8691 -80592 -185079 250782 -121282 17054 -92051 -227279 -6962 188721 234226 -137656 -280299
8680 -280299 -533514 -60331 -140478 -170408 -128037 154540 -412854 -96691 -88673 4316 145303
8669 145303 -68937 -143757 90476 -46354 50664 220064 327308 -106578 -267225 -304397 -59318
8657 -77692 -95497 -50792 -21282 -212000 -118855 91375 101394 -63567 33040 -126717 -162961
8646 -162961 -167116 62983 -147493 106018 14707 -173925 -1291 46385 32516 -4138 3230 -31671
8633 120864 26225 -63785 136815 -309752 -99957 95279 -92506 -29718 -40784 124122 106637
8622 106637 -275194 -165311 210264 -131 -17377 26096 229572 96517 -110768 390595 -561590
8610 63615 212026 -20481 -338341 -72752 -75130 87055 -61776 62133 21819 63658 -63074 -37900
8598 -37900 106668 -123427 -335509 121411 -117868 -183910 -423836 -15979 -47916 -53266 41314
8586 -186071 -86082 -424839 33225 -119458 113620 -81864 52936 -201261 106049 187411 48466
8574 -102824 128034 57617 -147662 143015 -42338 -112355 -3206 78254 30791 -95404 -96709
8563 -96709 558741 31377 -83549 -275207 -136554 -104248 -23608 74618 -231089 -160954 -45929
8551 -12279 -244642 -152978 70606 174957 6242 247836 171271 -220536 148232 -91830 -71153
8540 -71153 -94543 -275195 15732 -191428 -192618 146703 58499 218353 357065 -270500 -173444
8529 -173444 -54984 -463037 65384 -264607 377323 -18761 221894 -379775 124084 172017
8519 172017 171262 122204 -134220 -52212 -449511 -70024 46688 -151348 98184 -273244 -217359
8508 -217359 -262701 61063 -464098 -167504 -5518 -206967 -203020 -189643 155019 316718 43807
8496 -121499 8074 126427 -200 -326394 -124115 361638 -68093 -98339 -88255 -177798 -165921
8485 -165921 -249068 71424 -15181 50721 -17262 51536 -267359 -144447 -41332 -119617 -83193
8474 -83193 -222480 41928 -68490 91505 -323688 183515 69344 -131337 242518 34329 42678
8463 42678 -177559 -110616 50541 3825 54330 91374 -159764 -113801 -49150 192844 -168771
8451 -156860 -102159 -108664 -186855 -190965 44208 -360020 -102682 -128433 -142692 25227 1705 -53999
8438 -204753 227555 89021 -284382 83205 -39319 141984 20327 9947 -126657 156433 344622
8427 344622 -41087 176528 -226799 53559 65899 187778 236869 -105490 -310537 7723 115800
8416 115800 69609 96247 -73323 -106568 -168745 280917 29186 -6052 1094 111579 -149088
8404 189931 -93567 -19810 41984 -24245 56141 68437 45650 -14529 13152 -344655 146090
8392 -186431 -195826 -327169 -62365 -342001 -165617 -213901 4428 -28594 81739 88138 -331658
8380 -301262 64964 -224268 -525130 -238697 -59217 -510590 -601433 -290198 -300782 27148 -202942
8368 -79146 50082 211536 21419 88731 -52913 -117697 21577 95530 40477 -247167 -262874
8357 -262874 55968 -316133 239631 94228 71813 47230 -178128 -262522 -18387 -253357 -322943
8346 -322943 -29780 -225140 151804 -33212 20192 -270617 -188200 -297969 134435 104081 83058
8335 83058 -292632 162359 194569 122172 371001 47486 -158454 41591 176725 276052 -48810
8323 -40320 -19540 -477073 -269006 -178710 41285 -238204 -51520 -152275 -452137 -75653 -319886
8312 -319886 126908 333284 202242 -21865 -154085 -101068 -129104 -439280 -235717 -111359
8301 209457 85966 -116843 132655 -136948 -298373 -200296 -317712 -78177 -153800 -69372 9387
8289 -246406 187648 185066 -234795 -83923 -190637 -240565 -169991 -165610 -97278 -328765 -68471
8277 -53675 -9622 -118548 265742 127552 -299662 250733 -80910 -31512 111587 -91806 -371882
8266 -371882 68919 -263908 60828 185428 -119611 -67583 -61608 113681 -92919 87035 -235216
8254 -114881 -3752 -261781 226324 -221584 140611 2680 -26895 -301211 -117662 -275532 35231
8242 -191994 101750 4392 -346018 26433 90658 -41021 258142 -108354 -85502 -236125 227572
8230 -69549 -79453 65339 -205999 -47565 -194725 478112 -99332 -345542 83346 -56864 279757
8218 -138646 -298478 -61505 -98054 220504 -217643 -84379 -134728 -57338 -100845 -347316 37738
8206 -62722 110840 -43977 -50869 -22131 156409 -66483 7673 85145 -104397 44389 259126
8195 259126 -70628 -296106 185154 -50848 215332 -77692 -204658 31813 57722 95321 -153945
8183 213763 -220645 -100961 -73217 63184 36961 -106028 -7467 16618 -238218 28207 -27563
8171 -54389 -108060 -88741 -347054 -117724 -66411 -248668 -271459 -207753 -38913 -424047 411780
8159 -216878 -288984 -260168 129574 191464 -118531 -78361 297877 423448 -171951 -58429 -64832
8148 -64832 259715 -86914 -386386 -109073 136609 109452 72444 -26571 -28095 319572 132350
8136 139156 -296721 -279469 872 -404161 97760 -72238 229148 77951 -69306 -86403 -13778
8124 -87201 -3066 32279 40323 133924 101310 35892 -334824 213526 -220543 -148093 -155780 155498
8111 -181386 -123289 -422226 -68924 304229 142787 -252196 210593 -228862 34645 75996
8101 75996 -73160 135789 48324 -103969 -59911 124538 40290 -45168 16992 -199460 61665
8089 -5567 270908 32769 -249844 8294 -203378 -87749 -1391 -198633 -70640 84841 -35642 80349
8076 -96281 -179752 -178194 63055 -425375 27239 -12311 -88375 -381467 72205 -405277 13098
8064 -408740 156995 -109569 -194565 -113997 115123 -235196 -135378 -108089 -162000 146573 -274914
8052 86848 -243863 53922 217112 130250 302023 -235261 -86104 -271674 -184281 158673 -325702
8040 100566 -182917 -71876 55642 -166379 -22641 -166772 225842 270123 -236234 34694 -179911
8028 63740 -423894 -162259 160623 193646 -300176 106049 -184998 -71452 -35928 120582
8017 -118366 -236721 69618 -299797 149012 -149686 -17563 -40725 -152423 -101374 -49417 -181925
8006 -181925 -187706 221215 -120155 162872 -80324 -227809 -295843 138039 108494 -51006 -188564
7995 -188564 56492 -218451 -31912 -102217 -370394 -65862 -78896 54581 27889 -297005 185309
7983 -231542 30616 -45632 103600 56599 96976 -293169 -56414 144390 -10213 -151480 152816
7971 -72411 -154958 -39631 -37482 -81168 -234582 -77646 -146030 79585 -222847 -137780 35551 -3413
7958 -171753 45308 -200655 -90891 -454451 -145961 -333871 241541 32977 -148608 -135307
7948 -135307 -178570 -17368 57448 -67941 256742 15741 163185 8339 22306 132036 -136337
7936 -169817 30752 83218 51928 18118 32135 -34613 -111413 99274 -71556 -140598 23682 -103473
7923 -107951 63069 -207636 160186 -144153 37805 193386 15524 306335 -4366 325676 -166425
7911 -45032 51531 253782 -151565 -110316 -50897 -397372 217782 98254 -153359 -269906 -366586
7900 -366586 -389299 -129490 -290039 428270 37472 -193684 7042 142832 -69157 246017 30459
7888 -114109 -5459 -429224 292399 247529 11121 39082 9045 54663 -229042 -83474 -11591
7876 158155 56185 -161418 -16249 220143 -304420 -164623 -184253 172615 -21372 -21969 233630
7864 -165538 134695 7985 89207 135325 -221136 -242052 -223456 -60652 244642 69156 56128
7853 56128 -183155 -143772 63400 -59507 -31081 -211696 29846 56709 193356 61618 -188736
7841 -48025 21023 34790 -241612 220775 181390 -331017 -120908 -120919 147503 -370113 -298808
7830 -298808 103985 109844 -45977 -104385 141820 168008 211680 137729 -55601 69541 -91678
7818 -26911 18702 -166575 173916 26882 -249311 -208044 -258815 94891 153512 -55240 105570
7806 -119702 -241354 25275 -112443 48882 239762 -111065 -145808 85750 32904 -319391 -12078
7794 162587 -142418 -171319 248521 -38404 -125206 317557 -130592 -193545 57463 -81267 -313824
7783 -313824 -58880 -7997 -112025 21565 -114167 -262281 157670 -206054 -118559 -12391 -255277
7772 -255277 -104418 -160848 416868 -34789 -53262 187480 -117932 19616 380433 -117074
7761 -126606 54998 31344 98878 148411 85062 70083 -16518 -141409 -77220 203370 96219
7749 -96768 87569 -106258 -37597 -118888 116901 -59400 -50241 16123 -108152 -79685 -244464
7738 -244464 -281710 -14372 -185376 30179 -47568 210318 -253873 -47224 258342 42117 96533
7727 96533 -413749 219440 54392 -129452 -34546 -6800 -98365 -97951 -219667 -311894 -458335
7716 -458335 -149220 -86580 -161295 -120082 -167202 79663 91584 -355832 -183505 -113909 -182311
7705 -182311 -239552 416721 -67630 104858 -167497 -114730 -74714 21297 68520 -4066 -60625
7694 -60625 236378 -153026 186496 169742 -106960 -296239 -130819 -50866 144456 -94323
7683 -37428 99707 -95077 198573 114465 70309 -104016 258157 29435 -344762 -42582 104977
7671 -108730 68349 -185198 -181181 76442 54394 122059 198442 19038 152425 -108115 -239008
7660 -239008 -7655 -211632 42471 89274 -227276 99806 148747 -110485 -28885 -8045 -1894 -529646
7648 -529646 -91706 77679 -133792 115568 -133229 -365484 -207620 -31576 54847 217016
7638 217016 -276887 88363 -14402 264639 -350589 -19871 -62373 -198703 -269225 -12796 2154
7626 -51650 -18493 -155784 153857 460564 163383 -315299 -479013 -125031 -155347 -184848
7616 -184848 103237 82528 -82664 187079 115093 252027 20166 81178 -239650 30010 252828
7605 252828 52947 217872 -33740 -475499 24516 99517 -278150 -117517 -79048 -333646 -28499
7593 -162033 -64522 93403 -76754 151548 -112089 195295 50140 -155395 -9534 82501 209984
7582 209984 156047 -325215 -294600 75051 -23424 47139 -284569 -132549 -175310 -258023 17134
7570 82577 -57364 -191037 -71649 -513391 -306251 48229 -155178 -99089 -41720 79278 -191121
7558 -405160 38703 173924 61310 -167924 27807 133007 14352 -38697 254719 -154435 40911
7546 -82198 239668 138713 -15366 21654 -117509 -281001 -64540 84818 -36175 -448483 -155434
7534 -468772 429503 33618 9808 -288766 -329631 -52004 409309 108098 207030 -172386 -140515
7523 -140515 -238438 76977 -132899 -113225 124688 -177236 119598 -15113 318284 -30336 -14613
7511 61921 57986 306764 -364610 -23457 -33093 241691 -27244 -5345 208241 89946 91216 54995
7499 54995 -299887 56614 -124480 -131525 171003 -57390 216929 -22625 30192 210600 63116
7487 78448 -186836 -93906 -46527 33681 34836 -125904 -87459 -285222 -62940 -185821 421996
7475 -35046 -119448 -49359 -182027 85978 26633 127054 97027 -55067 265988 196622 263206
7464 263206 -273406 214324 -18125 -253519 80110 -36220 -188874 113687 -10871 -59701 -6413
7452 142016 60489 -585692 -5079 64439 24152 -154533 -123763 -132017 54657 108091 -75426 11977
7439 171616 -93232 -180779 -218132 115048 -183699 -84759 -316692 180905 -142450 80935 14687
7427 44475 17503 80272 -86866 -241107 -254904 -308022 -74481 -70513 196099 -112210 -166366
7416 -166366 -280970 21152 151288 121935 96784 -112752 -368659 -23183 -120263 303538 123237
7404 -32113 137848 -197563 -7739 322030 -139652 116301 -224637 -29068 -178372 224508
7393 -11039 -173071 113330 -83913 96021 -381446 248316 -184150 400755 -75042 -318116
7383 -318116 11647 -408447 160141 -125533 -17652 -6716 -62733 6247 -141427 -250078 83268
7371 -236465 -70936 -130371 291420 -127436 34457 -111269 -54342 -101646 -124892 -74012 49953
7359 -91545 416343 -57488 93735 93582 140177 348391 -276306 168604 -147505 -223357 79450
7347 174644 -408043 -302580 -78432 -43855 -57781 -32573 -89185 -226571 173922 -149649 -41684
7335 75401 -34640 -113053 139090 -145756 -53568 -65911 107252 81673 -24471 -45543 19844
7323 -284020 284020 -49984 -32948 129747 -277003 65667 -467880 -174501 -477289 13334
7312 -91510 -99597 202911 149925 91212 72545 82368 208599 -233797 -135314 -159587 33102 365980
7300 365980 -85937 98472 -89985 -106236 22258 187380 50196 13597 -245597 -146731 224270
7288 11138 71679 -89793 70265 -336287 186056 59813 80555 -61579 34904 -68989 24114
7276 -186335 -70145 281729 -2697 63696 287571 87093 -184055 -78346 -21504 70326 -347255
7264 -91346 -105628 261020 107762 149256 -110474 151678 -34250 129644 16092 -139529 -183955
7253 -183955 20465 69818 -68027 -111972 -33932 -231557 40417 -135305 -66925 40899 205676
7242 205676 82309 -25467 -216737 17402 -16066 104976 -273197 47341 153857 -251765 -13733
7230 -33246 171102 179150 -58185 269936 77199 119463 -145309 -185573 -323799 270077 67980
7218 86961 -201755 -179115 56845 -40115 1403 112678 -4536 174738 1441 292545 73608 -106784
7205 -16114 -232100 36234 -249313 4907 -73694 -48423 132672 -314832 6075 -56718 170671
7193 -50020 265288 -243883 -169094 -163099 -200347 -127518 -92977 103085 7769 -165608 115086
7181 15352 -18925 35929 -164056 -178948 -66980 -163321 252212 -66856 -185375 4076 -57651
7169 -285584 67303 199494 106498 139458 81256 -21756 -264528 248115 -316875 -91148 187951
7157 23287 150675 63054 224306 -209181 191144 86962 30128 52639 175942 -239493 297588
7145 -21839 -16038 -98142 10000 61381 85014 212507 176447 104118 444432 -22406 12882 29427
7133 29427 -96853 -176626 114218 -171081 210263 -131044 -196973 -125691 193628 63660 -185612
7121 -99154 186641 54203 -233634 -99924 -130022 -237972 92866 -19483 -467246 -203932 -18034
7109 93256 93390 -330614 9356 -178674 197273 -94284 106560 77999 211656 29531 141634
7098 141634 345970 -6949 -158633 -112139 -190510 -36498 48602 241953 -67358 25408 55666
7087 55666 -100484 -486268 12668 -42376 -67265 100294 -200826 336421 -70910 -109872 67474
7075 -315713 187140 -358336 27389 -148039 216195 176388 -268027 -151863 -275285 153643
7064 212729 272662 -187178 101244 82050 -225076 -238201 -199591 -226823 170843 43261 -31184
7052 -16702 -44199 65141 -130951 -95596 -189811 36015 131551 207777 -81501 -1157 120114 -530354
7039 140837 -100798 162054 -119846 67026 -29047 -14238 -8456 28259 24001 92669 19645
7027 -201905 133353 -144650 138095 30068 213870 -174547 -87115 -288343 -297795 -182887
7017 -182887 -82676 -467504 -171469 -33046 322253 154950 15021 -41685 268351 -11638 -417164
7006 -417164 62526 -54118 144183 -91717 62405 -255032 -178503 261396 -438685 94932 -58702
6994 119979 169084 -149339 62438 200979 -101911 -122514 -41649 -31462 9175 -19520 177543
6982 -165265 219935 261516 -196015 -171166 134947 -184629 184020 -60540 -24729 49450 44417
6971 44417 -288027 138028 84107 270607 -252373 -99719 -136842 -54748 191804 -311432 -188745
6960 -188745 280244 6634 276351 155456 29924 -48383 12951 -12103 -142666 88725 38883
6948 -37363 9487 245402 275752 -97935 126577 -102259 -147600 175218 72177 29072 -315502
6936 -185225 -322490 -64144 -92862 200 -32488 -62881 -213225 175919 -85192 -228520 -164263
6925 -164263 -155253 -254045 64768 -154001 270102 -87679 -51988 -291101 -234480 -302153 68770
6913 259170 -53071 -18106 -11153 -121093 -19783 99383 -215926 100109 -149200 149187 151755
6902 151755 -55754 204273 -154107 144553 -238139 8043 -12669 109952 -218855 -337298
6892 -337298 -206254 24933 -100740 -134309 189665 -150265 -80041 38738 -31933 128483 -46098
6880 -198268 -88157 37817 -228020 78398 197493 289340 -256361 -278076 -205796 -162314 49678
6868 6811 -87759 -79270 -224539 -56493 33111 16406 201017 -362309 -61892 -13432 -265787
6857 -265787 170145 -326935 -5169 -35307 223788 44643 109525 -276999 -317501 192211 3951
6845 76230 281319 11255 -143908 428931 125330 109947 293951 -313624 -178869 410117
6834 -256950 -12858 98215 211940 254 -108914 -22196 39399 -127512 -34809 -163460 197508
6822 120548 -19372 303799 -75168 44841 94692 204420 -309925 83193 14101 226365 25630
6810 -215593 41430 89463 227157 -67441 -97299 -9476 306970 481862 210780 1339 -298537
6798 -21650 -251913 241206 265642 -332362 -72458 -80900 2463 -96498 -34244 -213290 12930
6786 -82305 -69330 190462 -75532 -168316 31459 15376 -69113 -17054 30924 142140 255842
6775 255842 -210397 -111131 66123 7691 326743 175830 -54089 241628 44463 -275389 51536
6763 318345 29519 -233581 -397568 347584 -69243 -158046 -33431 -52251 -371882 -205000 -479625
6752 -479625 -181972 -116974 -43880 -131794 82700 -175777 -284976 -315588 196253 -66977 -91371
6741 -91371 62319 -220365 41219 -11075 -281805 44569 -46517 187953 68277 -241511 165079
6729 -176278 25833 318355 8289 240938 -88538 89632 -9536 309684 -167456 -6993 113823
6717 -421109 -119774 185804 -308919 94997 -259611 -48516 190332 22482 148112 -102523
6706 17778 -128475 -38778 172884 -177514 66197 -173286 89940 -77200 -288005 8425 -128787
6694 -55065 80610 -347375 -68719 114550 -30303 -170341 61935 179127 -155188 117349 -9265
6682 -351075 29392 37885 -32775 327444 -30888 -147175 -102895 -279745 43101 -176328 -865
6670 -24898 147443 3986 -8270 18245 275080 -507013 -128298 -76747 53787 69407 -132329
6658 -40378 -93818 -151004 -181029 -7891 229041 -11295 -96554 185025 -61599 22229 -14531 -134136
6646 -134136 29473 -132706 -161988 237999 352349 -30917 115560 -127182 119030 232076
6636 232076 -15545 -36480 253889 -201164 101889 185344 -168274 165445 179964 -157675
6625 241684 108974 -288864 -111028 -116210 -163395 -48631 49476 72405 450033 -356841 167448
6613 177827 -144988 -442797 46277 -81310 279351 150590 -235081 198210 -128142 -223389
6603 -223389 -398364 -210302 -145056 122882 167080 -59574 99013 137885 41794 -207133 -183065
6592 -183065 288242 -277813 -17173 31467 -68413 -68615 4174 54767 21679 82305 -141253 -92512
6580 -92512 16331 -112132 5894 73242 -68115 57868 6492 934 -330824 194568 145004 -146765
6567 -156005 -258424 265024 -118581 90437 143610 66105 225337 157250 -121817 94528 -182205
6555 -65717 282129 -38488 205294 -157883 79137 -379425 -257847 -153903 -42833 84429 -50821
6543 57158 147496 -51437 157549 148517 -280953 203484 -55771 -93491 -42730 297134 -116293
6531 -60522 -32349 -63110 230746 -100940 -100893 61010 -29719 -66864 -108404 -136631 -128282 133146
6518 -68976 -122834 162892 -16499 209670 -111007 220422 -247656 -134505 224506 -234677
6507 -155848 -159190 120988 -241160 44715 -229515 -10315 -19208 115408 122448 -233492 -213870
6496 -213870 -140084 217855 -14628 -240705 15807 -58172 -21445 118026 243789 -171825 -43156
6484 221382 -378152 68293 117581 90328 -156000 6766 59714 97369 30918 243375 1335
6472 396563 -272936 -433119 -294962 -117577 14089 185473 -201749 -228658 -63408 121938
6461 19134 384465 -1977 -495697 -204610 569792 24824 132699 -222000 -84452 -139814 136858
6449 -235384 53088 -69254 128219 -243043 110016 -96089 -32080 -38683 46012 140272 -148442
6437 -297680 141929 355516 59188 219465 23021 -153978 -3433 6803 137657 103021 -313297
6425 -49649 -215551 12720 133963 171584 -269741 -143788 136188 -256301 -67294 -332069
6415 -332069 -57182 -70969 122734 153904 17199 -66561 214813 90616 -284098 7275 6112
6404 6112 -165340 -35660 73095 363624 -236840 123534 151672 -142235 -362963 376828 -241024
6392 43554 -137029 17657 210651 -2911 -302 441591 191878 232746 163917 -33119 55343 235512
6380 235512 -127517 341891 -261975 15765 -137296 72292 -214006 232960 82552 139390
6370 139390 -166008 101403 -57501 -149690 177142 136565 -38494 231500 -248677 172309
6359 175901 -136738 -203549 -259470 20426 -161904 -53486 -83867 -78382 -138229 -163377 -118914
6348 -118914 287415 -14006 -67339 -326581 -202472 -322887 -228654 123566 5369 76472 -141721
6336 378171 -69357 121089 133519 -296810 -120787 -336226 -123598 -237882 -95778 131734
6325 -33576 -104961 136370 84121 79657 -63520 180752 104755 -379629 -197615 128120 -38619
6313 23946 -4758 -37992 -149262 -51633 29489 -63640 -49544 -7595 24202 -155189 207954 -46099
6300 182742 221117 -318143 -34157 -183974 53119 -325947 26479 -80577 -191875 109896 -222432
6288 271642 -250963 -62133 -124819 37091 -8247 -53460 -195377 401130 -105672 -104525 241156
6276 -153180 -68456 232965 183923 -131811 81194 12127 -116461 146082 269286 -37995 -69724
6265 -69724 141687 -94445 241492 -97473 -86109 -14843 -175233 -76359 196940 4764 -130276
6253 -311728 -278190 195378 106489 383537 -146636 -208698 -100713 -9931 -234140 148216 -417051
6241 -66739 -240669 -11266 252712 -80171 -141083 -91794 -332484 204052 -149128 16765 249849
6230 249849 116143 -82631 173904 111491 162415 -47106 -231398 105896 -413317 -210937
6220 -210937 14576 33921 -70289 -275387 -241698 153727 -49176 130612 178480 53945 204883
6209 204883 -130330 -59613 321271 -41020 -230122 295305 -1007 358822 234540 -169663
6198 133438 48247 -138894 -123145 54333 -89307 146901 -64485 -271955 -139889 -317357 168553
6186 222477 255262 -40476 230 -183279 -74696 397028 -168777 -165989 -167283 -82772 -53321 189613
6173 83912 -115085 -171722 -127153 -5482 -214512 124471 -26817 -80509 228351 33662 -47839
6161 73265 344560 -54661 -118729 -306486 95829 141549 -54080 122887 234543 -158421 151032
6149 124124 -5594 127663 56103 -38672 26483 -87198 78560 -301394 17894 28143 45203
6138 45203 -49682 -107186 -201223 160017 -249708 62775 -109050 -135251 61117 -145011 -73440
6127 -73440 -178610 -74158 -28284 338562 45913 -214752 221786 130928 101594 62426 -192437
6115 73100 -178026 11072 27302 93118 179762 239792 106147 249544 -42033 -74417 52361
6103 232359 -441581 62758 -277848 -138824 -321181 -87786 -188810 157471 -122716 95354
6092 32944 135456 -211398 -64056 18226 -335008 169697 -33964 -94164 -190477 -102867 -285403
6081 -285403 -518421 -71115 12015 170510 -2415 -52844 41602 15650 -28650 -133826 189551
6069 86646 3800 -163992 -290577 173015 204768 -123688 -272225 18700 220029 44063 268098
6058 268098 -93914 -105583 15397 163166 -201700 -40030 412434 -205402 107919 -134707
6047 -376240 480752 -168538 127006 -79649 -130153 93949 127709 274138 -197005 12011 60829
6036 60829 126452 -157180 -249323 197337 51012 75956 -31589 -494794 -294774 -178665 -20024
6024 88373 47377 -191129 254694 -201277 -80509 -92988 70607 -41668 478199 51516 93181
6013 93181 79474 -204746 32955 -133548 40842 -292690 86877 218876 -55186 4375 -125951
6001 -139458 267855 165198 21699 -26208 175160 -73323 232361 -79071 3642 -131655 -166027
5990 -166027 -171471 309497 103052 -118045 11242 -123971 -57045 -2372 -96124 -299149 116529
5978 -226444 -208200 -386757 -244255 10033 245310 165394 -286423 49143 -425345 -109912
5967 -1938 -249504 -70401 -95787 71239 -163858 231426 -22936 -209954 74328 -59922 -238847
5956 -238847 62420 332097 -266241 174851 -145095 71055 -26805 -77336 217823 246673 -62116
5944 9937 62147 -64158 -20682 -59071 -179385 -7111 201110 -158200 108892 -42859 -108284
5933 -108284 183694 207346 -77922 -125753 -4039 -218956 -20439 324984 -409999 12195 -122711
5921 -276591 -71454 -106795 -74404 255982 -163653 -21739 -232676 176129 -155649 330374
5910 -237972 -242306 -27720 86923 9927 -256715 26024 -15695 -1656 -757 45152 -44023 7145 8092
5897 8092 4705 312941 -105680 19943 -145606 37326 119611 117826 -30744 -40050 2549 -17839
5884 -159040 -77480 -175489 87235 129501 -65943 114447 78275 -110069 -89289 163591 -71323
5872 99472 -114369 -403935 201488 -18765 73882 46987 311153 656241 -16327 -392324 -248145
5861 -248145 -22483 -16198 -39698 -48958 179663 64848 50080 229028 52140 194030 -299830
5849 84517 8714 -56348 -118346 75728 48518 119293 171377 81030 78809 -230314 291318 -25966
5836 2856 -331218 -35107 -42029 -201291 346596 -66804 -82691 168869 124749 130531 158749 -118400
5823 20617 -60343 -363506 7373 100234 145036 -57109 87166 158369 33446 157872 -83745 16297
5810 286934 -178455 400428 34163 107637 25709 -173861 163738 -67003 -58299 23376 -274455
5798 342134 47273 99991 223655 -158280 10959 -376339 192070 -62608 133233 -1211 143625
5786 -15777 -301622 29127 -48401 -44031 78677 116079 125952 16894 -41646 -224963 121952 153628
5774 153628 52329 -121414 -170775 68024 -69743 -170538 -51914 29889 -158398 -107595 -182128
5763 -182128 36250 -54290 -126461 -158580 -160804 -28340 117290 23105 -138151 -38944 74490
5751 -19959 -184606 199899 334411 -100077 6857 44142 65318 52312 -2889 -140827 333172
5739 -82442 -3652 -77562 39835 -20359 -247246 -7090 134082 115248 -7583 -20781 18777 228444
5727 228444 219188 156906 183973 -17596 148015 -286850 -161761 151897 -31507 27530 -60303
5715 -240739 -92840 64703 -180264 -159127 155183 39139 -170002 -130417 -49810 182576 144414
5704 144414 220066 -111446 -30704 -57690 -99303 137288 -93772 -101911 -303066 -50154 -12570
5692 -12990 427473 -303690 102582 408866 -13143 -264479 53558 -217527 -209112 49277 -254203
5680 92575 -97859 74534 263854 -43529 -54954 82407 -410544 50554 -474566 -232901 -68070
5668 -84814 -23207 -163559 137162 -152138 -253784 26437 -103565 203475 16895 -213217
5657 -121291 158490 31459 -45869 -193302 -59297 148052 29318 54537 -112236 -134259 73392
5645 161449 3552 -52433 -214822 -71979 33983 -47213 57183 -24264 -201760 165069 104883
5634 104883 236155 105712 -2542 -7909 227714 -33175 46273 -293199 -116688 -76596 -108133
5623 -108133 316069 45574 13231 -88666 -1682 -46086 -63509 -175669 -17746 137997 -5812
5611 -236750 214272 113179 -34384 338529 126875 -168537 -97120 459509 23944 -9188 -6976
5600 -6976 226605 59333 -851 -124987 24125 -150463 -255222 -42721 120234 -209068 -44483
5588 317851 -6509 350973 -68843 -170406 268741 262442 81159 -239389 -59504 190939 -103309
5576 135797 42997 117838 115891 -348159 -40526 161011 169120 -16506 -264766 122539 -46716
5564 -49158 -326580 -340704 186003 -60030 -248317 -61874 -314281 151201 -204959 94005 209968
5553 209968 42488 35270 106169 -17497 179363 204563 -297591 396130 98139 -56102 215547
5541 196987 -128787 126946 -42289 170070 333688 -84277 -250090 125074 286034 152702
5531 152702 -31903 -129534 -171598 -158924 -190533 405557 -63143 305212 335275 72858 100723
5520 100723 20072 -64004 117427 58458 -222730 -131153 -6442 11976 115969 -154669 -201693
5509 -201693 47386 61771 -213893 69862 -136172 94551 142358 136193 469967 -19523 82214
5497 -174109 -106220 112435 -15017 -87214 -40707 7014 -99740 17836 -31299 -82974 22286 128675
5485 128675 -14234 -29271 -85828 118009 -31700 -44758 -83661 -38588 238278 329705 -216961
5473 103036 166443 61965 125706 220211 118791 -225023 -228085 -142936 -94130 -89394 64180 325045
5461 325045 19955 48635 82792 99266 316026 -287657 201223 -17085 223221 -245852 -98077
5449 196860 -52097 -196176 -111339 -170316 -18870 155799 121990 137230 -410569 -72976 390904
5437 21057 -182437 91934 -62100 137673 53340 -158713 406974 133 -46025 32968 195088
5426 195088 -2425 -198236 52326 31653 256027 -377923 -242202 101699 135551 157516 154976
5415 154976 -50761 -56662 249011 127361 -58211 48794 -17440 -128515 49464 19689 467472
5404 467472 -114807 145638 32898 287978 -216403 -407180 101278 141231 55058 262511
5394 262511 -59638 -69976 181476 13924 222036 70591 387814 17042 241979 262424 295594
5383 295594 -304432 181039 27818 -462503 100163 157417 -309343 -324567 212500 121158
5373 121158 106923 417287 -135753 -318520 -108427 -266254 -176352 -230232 -61800 74601 -245121
5361 121107 -136139 119556 184973 -132542 87527 119882 171901 -187643 -2965 -68672 -190008
5350 -190008 -150673 -222304 -283785 30612 63567 -133814 33536 -90056 64853 32180 -182841
5338 188545 -182173 49565 -172310 64340 -23684 5044 -240587 210609 168716 32068 147235
5327 147235 27342 38228 49347 -128100 -87187 521127 119877 -3723 30396 -55920 347825
5315 24364 -106875 22152 134434 55378 28693 30197 228571 -82995 -609449 -27164 175671
5303 -208861 -266342 102381 -45357 223625 89662 -76782 -141273 -129036 -101929 -84093 -113889
5292 -113889 254291 -311185 -85922 32819 155406 116201 -114165 -372525 -191095 75281
5281 176268 39 110428 -33749 -99202 -104254 -104659 148735 129508 -121673 226531 36102 -12472
5268 -314627 -125258 -8931 -276069 -90651 -49697 -17915 -182700 -12687 -41388 83050 77582
5257 77582 275236 -301399 -359574 170845 -138229 -32953 -2739 36400 103783 76253 -62633
5245 -11201 252934 46857 165518 -168027 -106866 -169511 -41956 -60023 76525 -49721 122504
5233 -122437 -50504 -29996 -77416 -54236 257477 -2015 -75397 -192233 -81355 132320 -100057
5221 -110008 37814 -118093 -32160 -176493 -104150 -43835 -303768 135251 -17763 3687 305223
5210 305223 66934 141900 -164823 81322 63375 177306 164314 -14814 -195749 322337 134373
5198 -215965 237650 -129444 -153287 -20539 2038 -182467 -103604 -18371 -142367 386655 -33759
5186 346199 4876 3287 30351 -77355 -189478 -49081 5962 -165565 -98957 -88383 -85953 -206288
5174 -206288 49673 -88092 129759 146585 18969 -279383 -130456 -117161 -33104 -23611 -138108
5163 -138108 -163466 119159 47430 24253 62656 55661 -35419 -34372 19664 -87912 156915 -312632
5150 -11938 461888 306567 -188583 54606 -208456 -170735 -175852 -135107 -183179 -316095 56514
5138 -42434 -6279 192617 135913 -69640 -83837 -347558 -246786 192250 149252 293079 -199501
5126 -26167 -19174 51519 -197348 -12454 91410 43994 -226942 284094 -23822 -76169 -64831
5115 -64831 -258094 -58332 87091 44508 66683 -32567 85610 -152502 79470 -154789 -193085
5104 -193085 -66375 -173529 190505 -343584 269117 356902 106021 -184986 66819 27025
5093 -113962 41194 75697 -40636 300602 -135072 -45987 -157814 56022 155660 245257 -24047
5081 -141708 38748 -142203 183313 345303 -129015 -49131 20066 59532 114025 7771 -265101
5069 148758 -149066 -33615 -89703 143947 -269394 -236506 -21742 295555 164759 -46855 -233057
5058 -233057 -151701 126177 66699 112597 219447 54555 -252153 11348 -307690 163520 30274
5046 37293 116703 245502 -460482 -163351 -56862 -91639 -2513 -140193 -1489 43490 355908
5035 355908 19589 164849 181348 58937 247436 -103917 58436 -128389 109331 192223 63038
5023 61867 -44245 209212 191912 134991 59685 -34960 49052 179661 -306489 153666 -8099
5011 -45002 -131695 171218 -87989 -8915 -36304 -30825 -109074 -137020 -77477 -148116 219131 -104666
4998 135950 -83346 83744 350618 -132228 4299 13731 112948 -90819 -350049 24571 -26682
4986 -329020 -167520 -164277 -214353 -199475 202309 102412 -220181 244135 103863 77706 -155431
4974 273665 -10566 -33615 -31157 142961 313101 -147099 117842 -120035 302218 410748
4964 410748 -283236 -166082 -335336 -33058 205532 24125 -92515 263649 -49955 -354637
4954 -354637 -385280 39071 -161531 -84281 6187 -284267 26602 -331834 199213 -74974 -106467
4943 -106467 19992 70218 45422 133049 164596 2956 -71970 -230220 38932 -318673 45596
4931 -277075 368402 -246420 81069 266696 131471 84333 72896 -30756 110091 -150501
4920 -92684 85116 -134591 126604 -79987 -79486 223980 -314655 -73972 -137978 -48773 -57427 48521
4907 -265515 -44028 210504 -28879 88033 -67346 -218746 -234101 -174843 96373 23110 -258187
4895 -63082 174645 -35045 80428 -163297 4418 155096 79394 139548 200248 -23652 182209
4883 4683 -3688 135225 11310 -62237 98830 291120 166279 161012 7698 222586 -147793 86510
4870 -346799 244939 226013 -51529 370856 199863 -432252 279462 49805 -57122 210553
4859 -75450 162189 110401 -232207 67786 -267288 6556 -39119 -388052 216193 129122 439920
4848 439920 115169 -34076 127840 -192792 -25490 154842 21072 343426 -166647 356156
4837 -353745 -204878 -270415 -155406 -175082 -158381 -150828 -282925 -32891 307331 -100904 251306
4825 113214 -70592 -36627 -20245 -91060 -1090 -20931 -91482 -77580 -114023 11932 105178 92089
4813 92089 -148054 -621 172688 5073 394266 -33475 -194565 91225 -108337 -18701 120960
4801 -308386 86818 -92468 -49989 69932 68816 16280 -154847 -5503 346012 176844 47805
4789 480996 107118 83709 -121216 93128 299376 -159767 -288885 -12533 -164216 93305
4778 158461 311354 -13760 128961 213957 -108853 6157 -248735 -11183 27827 22934 -9308
4766 -110272 111201 89430 -55563 18197 315631 71253 16515 223438 126599 152493 36676
4754 -242260 223524 141340 442374 -116385 -239468 32784 188904 -25325 108075 170301
4744 170301 -115420 394909 -318389 -46961 209773 72532 63757 -243795 -385770 -264410
4734 -264410 254365 -58184 158929 -44194 10304 63307 -109702 2346 -105177 42379 -291265
4722 -113298 70768 93871 -168741 26714 -11766 -189886 154905 -203168 147546 -65016 131713
4710 -360619 377140 281195 114026 238530 -2705 128532 -400822 -46253 -31959 272753 -256098
4698 204598 158241 -305848 106547 187511 260856 -47629 404 196081 -274324 -162574 189000
4686 158088 -220614 -74177 181558 213529 154266 84716 68077 -186139 321686 -65899 344151
4674 68615 84892 -266938 105255 -6280 -170310 -28115 101511 127851 -229532 106909 18308
4662 51674 76664 -351363 -214560 -48197 182833 149428 -199968 8613 151860 -222148 43091
4650 70985 -258741 -265568 199987 -105969 -236460 103443 333174 218121 -94691 28038 38551
4639 38551 346126 -211230 -118084 -87348 -69385 241390 -17862 -34709 124404 -80493 12609
4627 134628 -311387 -148537 99594 -101638 17944 13553 276716 9570 -303711 113800 155441
4616 155441 258197 40417 -130207 38321 -91265 176207 -76902 103356 371180 105425
4605 12139 233618 198937 -8529 -8063 75613 158033 -94436 -18427 147492 -22416 76536 184277
4593 184277 -283540 -130138 -204013 -76535 244770 -14802 -30096 -183388 -27750 -101988 -172535
4582 -172535 47535 83329 65885 -168623 -55498 32903 280409 -277601 7052 241349 -87225
4570 216230 118539 -295534 -91623 -321108 -35282 247083 24684 -268999 -131075 -65558 59734
4558 4403 111513 129178 188033 -92044 -165366 139091 70089 -236284 -39481 -56711 -73297
4547 -73297 -82087 -29465 -276474 140979 -331581 204274 -171466 26884 107394 -242326 48768
4535 -392879 -10818 -5364 -92793 -54491 -98185 -242984 45409 -36300 15768 -37783 256193
4523 319188 206810 -293423 115960 -117582 -231224 -197219 245559 -110530 295118 351027
4513 351027 139615 -50649 -124199 212891 -65815 -148124 255153 135917 -1246 -196411 -99670
4502 -99670 145113 85230 202597 -3355 60641 209397 173815 219617 79612 -396652 48288
4490 65936 -210980 140549 33199 280835 -31628 147744 -85602 346438 -76077 32020 124805
4479 124805 -79358 -50142 66401 182915 84464 377144 -204749 250090 -77229 164171 5423
$$ [...]
##END NTUPLES=NMR SPECTRUM
##END=
