##TITLE=AC1529_ROEFFECT0007_8213873_tsFLEEnnBh
##JCAMPDX= 6.0         $$ Bruker NMR JCAMP-DX V2.0
##DATA TYPE= NMR SPECTRUM
##DATA CLASS= NTUPLES
##ORIGIN= BRUKER
##OWNER= Administrator
$$ 1.72 TOPSPIN		Version 2.1
$$ 2013-10-04 19:40:05.277 -0700  Administrator@X
$$ Compression mode = diff/dup
##.OBSERVE FREQUENCY= 400.02188249412
##.OBSERVE NUCLEUS= ^1H
##.ACQUISITION MODE= SIMULTANEOUS (DQD)
##.ACQUISITION SCHEME= undefined
##.AVERAGES= 64
##.DIGITISER RES= 22
##SPECTROMETER/DATA SYSTEM= spect
##.PULSE SEQUENCE= noesygpps1d.comp
##.SOLVENT NAME= COFFEE_meoh
##.SHIFT REFERENCE= INTERNAL, COFFEE_meoh, 1, 14.96077
##AUDIT TRAIL= $$ (NUMBER, WHEN, WHO, WHERE, PROCESS, VERSION, WHAT)
$$ ##TITLE= Audit trail, TOPSPIN		Version 2.1
$$ ##JCAMPDX= 5.01
$$ ##ORIGIN= Bruker BioSpin GmbH
$$ ##OWNER= Administrator
$$ $$ E:\/data/COFFEE/nmr/AC1529_ROEFFECT0007_8213873_tsFLEEnnBh/12/pdata/1/auditp.txt
$$ ##AUDIT TRAIL=  $$ (NUMBER, WHEN, WHO, WHERE, PROCESS, VERSION, WHAT)
(   1,<2013-10-04 19:40:00.652 -0700>,<Administrator>,<X>,<go>,<TOPSPIN 2.1>,
      <created by zg
	started at 2013-10-04 19:28:30.808 -0700,
	POWCHK enabled, PULCHK disabled,
       configuration hash MD5:
       C8 4E 4E 5D D3 5C D8 9E 9F 52 82 E0 59 8A DE 15
       data hash MD5: 64K
       0B 18 BD 0F 71 A3 43 39 9E D6 6F 38 D3 99 CC D1>)
(   2,<2013-10-04 19:40:03.511 -0700>,<Administrator>,<X>,<proc1d>,<TOPSPIN 2.1>,
      <Start of raw data processing
       efp LB = 0.3 FT_mod = 6 PKNL = 1 PHC0 = 0 PHC1 = 0 SI = 128K 
       data hash MD5: 128K
       81 47 90 C4 7C 71 53 01 3F C9 0D 11 C0 7D B0 24>)
(   3,<2013-10-04 19:40:04.418 -0700>,<Administrator>,<X>,<proc1d>,<TOPSPIN 2.1>,
      <pk PHC0 = -82.35352 PHC1 = 0 
       data hash MD5: 128K
       8C 9C BE 82 88 89 AD 79 DB 68 38 C5 62 17 07 08>)
(   4,<2013-10-04 19:40:04.777 -0700>,<Administrator>,<X>,<proc1d>,<TOPSPIN 2.1>,
      <abs ABSG = 1 
       data hash MD5: 128K
       6B D5 23 35 3A C8 27 18 54 24 24 2C F6 FD C0 24>)
(   5,<2013-10-04 19:40:04.871 -0700>,<Administrator>,<X>,<proc1d>,<TOPSPIN 2.1>,
      <abs ABSG = 2 
       data hash MD5: 128K
       97 91 A7 46 79 DA 9C D8 49 37 52 8E 8D 1E D3 3C>)
(   6,<2013-10-04 19:40:04.933 -0700>,<Administrator>,<X>,<proc1d>,<TOPSPIN 2.1>,
      <abs ABSG = 3 
       data hash MD5: 128K
       D2 FF 9C 0C 42 E6 43 23 CB 3B AA 66 3A F6 32 49>)
(   7,<2013-10-04 19:40:05.027 -0700>,<Administrator>,<X>,<proc1d>,<TOPSPIN 2.1>,
      <abs ABSG = 4 
       data hash MD5: 128K
       FF 7A 53 D7 39 F3 AD 3B 12 80 DB A1 BC CD AF E7>)
(   8,<2013-10-04 19:40:05.090 -0700>,<Administrator>,<X>,<proc1d>,<TOPSPIN 2.1>,
      <abs ABSG = 5 
       data hash MD5: 128K
       5B 9B 50 A6 E4 87 06 13 2F 4D EE FC 95 66 4E 91>)
$$ ##END=
$$ 
$$ $$ hash MD5
$$ $$ 6E 19 27 6B D3 E7 00 40 E4 B1 4A F8 B9 60 D3 62
##$RELAX= 
##$RELAX= 
##$RELAX= 
##$RELAX= 
##$RELAX= 
##$RELAX= 
##$RELAX= 
##$RELAX= 
$$ Bruker specific parameters
$$ --------------------------
##$DU= <E:\>
##$EXPNO= 12
$$ [...]
##$TP07= 0
##$TPNAME0= <>
##$TPNAME1= <>
##$TPNAME2= <>
##$TPNAME3= <>
##$TPNAME4= <>
##$TPNAME5= <>
##$TPNAME6= <>
##$TPNAME7= <>
##$TPOAL= (0..7)
0.5 0.5 0.5 0.5 0.5 0.5 0.5 0.5
##$TPOFFS= (0..7)
0 0 0 0 0 0 0 0
##$TUNHIN= 0
##$TUNHOUT= 0
##$TUNXOUT= 0
##$USERA1= <user>
##$USERA2= <user>
##$USERA3= <user>
##$USERA4= <user>
##$USERA5= <user>
##$V9= 5
##$VALIST= <valist>
##$VCLIST= <CCCCCCCCCCCCCCC>
##$VD= 0
##$VDLIST= <DDDDDDDDDDDDDDD>
##$VPLIST= <PPPPPPPPPPPPPPP>
##$VTLIST= <TTTTTTTTTTTTTTT>
##$WBST= 2048
##$WBSW= 25
##$XGAIN= (0..3)
0 0 0 0
##$XL= 0
##$YL= 0
##$YMAX_a= 6582802
##$YMIN_a= -11931133
##$ZGOPTNS= <>
##$ZL1= 120
##$ZL2= 120
##$ZL3= 120
##$ZL4= 120
##$ABSF1= 14.96077
##$ABSF2= -5.597412
##$ABSG= 5
##$ABSL= 3
##$ALPHA= 0
##$AQORDER= 0
##$ASSFAC= 0
##$ASSFACI= 0
##$ASSFACX= 0
##$ASSWID= 0
##$AUNMP= <proc_prof1d_extract.lims>
##$AXLEFT= 0
##$AXNAME= <>
##$AXNUC= <1H>
##$AXRIGHT= 0
##$AXTYPE= 0
##$AXUNIT= <>
##$AZFE= 0.1
##$AZFW= 0.1
##$BCFW= 0
##$BC_mod= 0
##$BYTORDP= 0
##$COROFFS= 0
##$CY= 15
##$DATMOD= 1
##$DC= 0
##$DFILT= <>
##$DTYPP= 0
##$F1P= 0
##$F2P= 0
##$FCOR= 0.5
##$FTSIZE= 131072
##$FT_mod= 6
##$GAMMA= 0
##$GB= 0
##$INTBC= 1
##$INTSCL= 1
##$ISEN= 128
##$LB= 0.3
##$LEV0= 0
##$LPBIN= 0
##$MAXI= 10000
##$MC2= 0
##$MEAN= 0
##$ME_mod= 0
##$MI= 0
##$NCOEF= 0
##$NC_proc= -2
##$NLEV= 6
##$NOISF1= 0
##$NOISF2= 0
##$NSP= 0
##$NTH_PI= 0
##$NZP= 0
##$OFFSET= 14.96077
##$PC= 1
##$PHC0= -82.35352
##$PHC1= 0
##$PH_mod= 1
##$PKNL= yes
##$PPARMOD= 0
##$PPDIAG= 0
##$PPIPTYP= 0
##$PPMPNUM= 2147483647
##$PPRESOL= 1
##$PSCAL= 4
##$PSIGN= 0
##$PYNMP= <proc.py>
##$REVERSE= no
##$SF= 400.020009729376
##$SI= 131072
##$SIGF1= 0
##$SIGF2= 0
##$SINO= 400
##$SIOLD= 131072
##$SPECTYP= <>
##$SREGLST= <1H.CDCl3>
##$SSB= 0
##$STSI= 131072
##$STSR= 0
##$SW_p= 8223.68421052631
##$SYMM= 0
##$S_DEV= 0
##$TDeff= 65536
##$TDoff= 0
##$TI= <>
##$TILT= no
##$TM1= 0
##$TM2= 0
##$TOPLEV= 0
##$USERP1= <user>
##$USERP2= <user>
##$USERP3= <user>
##$USERP4= <user>
##$USERP5= <user>
##$WDW= 1
##$XDIM= 131072
##$YMAX_p= 409923349
##$YMIN_p= -17022
##$CURPLOT= <Network HP LaserJet P1505>
##$CURPRIN= <$Network HP LaserJet P1505>
##$DFORMAT= <normdp>
##$LAYOUT= <+/1D_H.xwp>
##$LFORMAT= <normlp>
##$PFORMAT= <normpl>
##$SURQMSG= 1
$$ End of Bruker specific parameters
$$ ---------------------------------
##NTUPLES= NMR SPECTRUM
##VAR_NAME=  FREQUENCY,     SPECTRUM/REAL,   SPECTRUM/IMAG
##SYMBOL=    X,             R,               I
##VAR_TYPE=  INDEPENDENT,   DEPENDENT,       DEPENDENT
##VAR_FORM=  AFFN,          ASDF,            ASDF
##VAR_DIM=   131072,        131072,          131072
##UNITS=     HZ,            ARBITRARY UNITS, ARBITRARY UNITS
##FACTOR=    0.0627417313425164, 1,          1
##FIRST=     8223.62146879497, -2167,        -63364
##LAST=      0,             164,             -63888
##MIN=       0,             -17022,          0
##MAX=       8223.62146879497, 409923349,    0
$$ Real data points
##PAGE= N=1
##DATA TABLE= (X++(R..R)), XYDATA
$$ [...]
61797E55030j6123j4204j2433j1096j0193r353q236o855n506m512m077m204m654
$$ 555030 538907 524703 512270 501174 490981 481628 473392 466537 461031 456519 452442 448238 443584
61784D43584n083n202m836l950k745j638j012r62j344j947k551k888k778k323
$$ 443584 438501 433299 428463 424513 421768 420130 419118 418156 416812 414865 412314 409426 406648 404325
61770D04325j833j529j344j004l41M97J166J481J584J693J775J663J406J251J325
$$ 404325 402492 400963 399619 398615 398274 398771 399937 401418 403002 404695 406470 408133 409539 410790 412115
61755D12115J569J981K631L327L509K727J164m09j175r51l63l41j155k129k470
$$ 412115 413684 415665 418296 421623 425132 427859 429023 428614 427439 426488 426125 425784 424629 422500 420030
61740D20030k174j767j377p31NJ22o32j542j769j244m15M17J109J430J345J232
$$ 420030 417856 416089 414712 413981 413986 414108 413476 411934 410165 408921 408506 408923 410032 411462 412807 414039
61724D14039J410J646J522J066O38M03L77O63J275J878K201K476K983L326K816
$$ 414039 415449 417095 418617 419683 420321 420724 421101 421764 423039 424917 427118 429594 432577 435903 438719
61709D38719J524L06k95o04j067j515j530j234j251j965l033l684l433k483j553
$$ 438719 440243 440549 440254 439650 438583 437068 435538 434304 433053 431088 428055 424371 420938 418455 416902
61694D16902j255j647k320k768k704k283k130k817m072m784m173k678j380p36
$$ 416902 415647 414000 411680 408912 406208 403925 401795 398978 394906 390122 385949 383271 381891 381155
61680C81155m14j98l41r06j384j371j192j403j901k034j544r96j107j866k584
$$ 381155 380741 380543 380202 379296 377912 376541 375349 373946 372045 370011 368467 367471 366364 364498 361914
61665C61914k676k147j346n55K3J33k28n51k61M82R14O74K51K29N66R01J119J170
$$ 361914 359238 357091 355745 355190 355213 355346 355118 354567 354306 354788 355702 356376 356627 356856 357422 358323 359442 360612
61647C60612P47k19r89o45P15J986K369K152K132K590L115L110K369J234L19j16
$$ 360612 361359 361140 360151 359506 360221 362207 364576 366728 368860 371450 374565 377675 380044 381278 381597 381481
61631C81481m32j107k045k722k952l109l501l817l462k318j045n42j066j848j813
$$ 381481 381049 379942 377897 375175 372223 369114 365613 361796 358334 356016 354971 354429 353363 351515 349702
61616C49702p95K22K53o24j609k177k249j806j011n94j307k869m110m346m007
$$ 349702 348907 349129 349382 348758 347149 344972 342723 340917 339906 339312 338005 335136 331026 326680 322673
61601C22673l698l331k647k035k188l091l953m113l675l150k816k559k260k109
$$ 322673 318975 315644 312997 310962 308774 305683 301730 297617 293942 290792 287976 285417 283157 281048
61587B81048k421l144l789l938l676l287k735j839p95j11Q8J59L48L96K2o32j170
$$ 281048 278627 275483 271694 267756 264080 260793 258058 256219 255424 255313 255401 255560 255908 256304 256326 255694 254524
61570B54524j348j148p06l43l94q25j172j015l89L22P43O92K95n9p7N9k8k38k0
$$ 254524 253176 252028 251322 250979 250585 249760 248588 247573 247184 247506 248249 248941 249236 249177 249100 249159 249131 248893 248873
61551B48873Q36J810K317K406K474K595K493K021J332O12p0o44r34q15l69M8J0
$$ 248873 249709 251519 253836 256242 258716 261311 263804 265825 267157 267769 267699 267055 266121 265306 264937 264985 264995
61534B64995n51j168j266p83j70K51O08J109J641J880J608Q43j39q76j035p93
$$ 264995 264444 263276 262010 261227 261057 261308 261916 263025 264666 266546 268154 268997 268858 267982 266947 266154
61518B66154o07o95r12j187j593j918j689q45L8M92O95R79J193R71L54l11q64
$$ 266154 265547 264852 263940 262753 261160 259242 257553 256708 256746 257238 257933 258912 260105 261076 261430 261119 260255
61501B60255j335j628j580j258q80n33j96P4K62M63O54N59L2o13r80j019q51m15
$$ 260255 258920 257292 255712 254454 253574 253041 252845 252919 253181 253644 254298 254857 254889 254276 253296 252277 251426 251011
61483B51011L06R47J120R56Q43Q36P61P29R71J280J220R22J000J563J924J537
$$ 251011 251317 252264 253384 254340 255183 256019 256780 257509 258480 259760 260980 261902 262902 264465 266389 267926
61467B67926P04L8l01n15o79p58q42j029j228j330j351j219o87K61J157J551J514
$$ 267926 268630 268668 268367 267852 267173 266415 265573 264544 263316 261986 260635 259416 258729 258990 260147 261698 263212
61450B63212J417J381J331J306J315J075L50n08q35m56K38R00J462J730J423Q34
$$ 263212 264629 266010 267341 268647 269962 271037 271387 270879 270044 269588 269826 270726 272188 273918 275341 276175
61434B76175P84J508K155J917J207J053J647K235K273J966J569R95L68K24P60
$$ 276175 276959 278467 280622 282539 283746 284799 286446 288681 290954 292920 294489 295484 295852 296076 296836
61419B96836J354J364J039J071J565J979J990J884J962K073J854J164J81p66j365
$$ 296836 298190 299554 300593 301664 303229 305208 307198 309082 311044 313117 314971 316135 316316 315550 314185
61404C14185j501j368j269j303j325j223j108j187j476j687j391m98M83Q69N82
$$ 314185 312684 311316 310047 308744 307419 306196 305088 303901 302425 300738 299347 298849 299332 300201 300783
61389C00783K22K34L86K94J22K52N81O30L21Q6J90M22N38N94P46J002J313J601
$$ 300783 301005 301239 301625 301919 302041 302293 302874 303504 303825 303911 304101 304523 305061 305655 306401 307403 308716 310317
61371C10317J685J483J244J265J328R14M6n16k28N34R86R07P50R93J682K541L282
$$ 310317 312002 313485 314729 315994 317322 318236 318282 317766 317538 318072 319058 319965 320715 321708 323390 325931 329213
61354C29213L753L960M022M182M702N630O548O879O557O055N612M805L341J846
$$ 329213 332966 336926 340948 345130 349832 355462 362010 368889 375446 381501 387113 391918 395259 397105
61340C97105J259J589K053K246K466K871L146L203L400L795L824L162K252J660
$$ 397105 398364 399953 402006 404252 406718 409589 412735 415938 419338 423133 426957 430119 432371 434031
61326D34031J356J016M90l50j609k848l115k068n18O24J431K382L250L436L084
$$ 434031 435387 436403 436893 436543 434934 432086 428971 426903 426385 427009 428440 430822 434072 437508 440592
61311D40592L065L899N348P036Q789J0349J1274J1445J1256J1222J1484J1735
$$ 440592 443657 447556 452904 459940 468729 479078 490352 501797 513053 524275 535759 547494
61299E47494J1483J0481Q975P425N882M011J796k65j921l540n309o668p143p236
$$ 547494 558977 569458 578433 585858 591740 595751 597547 597282 595361 591821 586512 579844 572701 565465
61285E65465p747q539q769q207p470p087o956o784o370n506m232l124k707k567
$$ 565465 557718 549179 540410 532203 524733 517646 510690 503906 497536 492030 487798 484674 481967 479400
61271D79400j792l25Q82J194R60P12M72K35L34Q92J479J863K505L732M893N112
$$ 479400 477608 477283 478165 479359 480319 481031 481503 481738 482072 482964 484443 486306 488811 492543 497436 502548
61255E02548M495L923L786L693L391L233L481L764L621L181K844K510J691L78
$$ 502548 507043 510966 514752 518445 521836 525069 528550 532314 535935 539116 541960 544470 546161 546539
61241E46539o91r18o09n13q54j276j592j988k390k304j593q31m02J73J393K754
$$ 546539 545848 544930 544321 543808 542954 541678 540086 538098 535708 533404 531811 530980 530578 530751 532144 534898
61225E34898L365L405L946N354O798P536P782P881P547O670O137O892Q491R497
$$ 534898 538263 541668 545614 550968 557766 565302 573084 580965 588512 595182 601319 608211 616702 626199
61211F26199R284Q569Q110P719O901N823N021M556M042L359K848K822L287M198
$$ 626199 635483 644052 652162 659881 666782 672605 677626 682182 686224 689583 692431 695253 698540 702738
61197G02738N512O898P801Q061Q207Q834R893J0856J1318J1153J0296Q839P143
$$ 702738 708250 715148 722949 731010 739217 748051 757944 768800 780118 791271 801567 810406 817549
61184H17549N443L461R72j380k524k345j946k281l178m032m782n612o225o253
$$ 817549 822992 826453 827425 826045 823521 821176 819230 816949 813771 809739 804957 799345 793120 786867
61170G86867o015o209o932p614p906q061q469r232j0187j0981j1181j0726j0197
$$ 786867 780852 774643 767711 760097 752191 744130 735661 726429 716242 705261 694080 683354 673157
61157F73157j0214j0707j1142j1248j1011j0201q649o908n798n241m366l010k246
$$ 673157 662943 652236 641094 629846 618835 608634 599985 593077 587279 582038 577672 574662 572416
61144E72416k954m565n858o472o899p348p424o949o290n735n029l804k195o95
$$ 572416 569462 564897 559039 552567 545668 538320 530896 523947 517657 511922 506893 503089 500894 500199
61130E00199M31J349K336L463M615N757O976Q284R478J0373J1117J2166J3800
$$ 500199 500630 501979 504315 507778 512393 518150 525126 533410 542888 553261 564378 576544 590344
61117E90344J5783J7583J8925K0000K1162K2490K3773K4795K5490K5812K5654
$$ 590344 606127 623710 642635 662635 683797 706287 730060 754855 780345 806157 831811
61106H31811K5079K4419K3940K3459K2431K0438J7492J4041J0738P979N429K296
$$ 831811 856890 881309 905249 928708 951139 971577 989069 1003110 1013848 1021827 1027256 1029552
61094A029552j563n137p446q970j1071j4075j6834j8388j9207k0302k1790k2921
$$ 1029552 1027989 1022852 1015406 1006436 995365 981290 964456 946068 926861 906559 884769 861848
61082H61848k3111k2382k1174k0098j9491j8953j7740j5908j4438j3881j3590
$$ 861848 838737 816355 795181 775083 755592 736639 718899 702991 688553 674672 661082
61071F61082j2808j1784j1051j0285q835o894n208l889k451q84K51Q09J340K312
$$ 661082 648274 636490 625439 615154 606319 599425 594217 590328 587877 586993 587244 588053 589393 591705
61057E91705L552M609N261N699O413P674Q980R558R620J0395J2396J4570J5875
$$ 591705 595257 599866 605127 610826 617239 624913 633893 643451 653071 663466 675862 690432 706307
61044G06307J6829J8463K0646K2637K4649K7448L0784L3638L5757L7746L9889
$$ 706307 723136 741599 762245 784882 809531 836979 867763 901401 937158 974904 1014793
61033A014793M2064M4535M7531N0319N2058N3235N4898N6898N8534O0545O4570
$$ 1014793 1056857 1101392 1148923 1199242 1251300 1304535 1359433 1416331 1474865 1535410 1599980
61022A599980P0745P7782Q5454R4877J06167J18013J30172J44490J63096J87687
$$ 1599980 1670725 1748507 1833961 1928838 2035005 2153018 2283190 2427680 2590776 2778463
61012B778463K20927K66145L25034L97933M86703N94227P20334Q61756J017090
$$ 2778463 2999390 3265535 3590569 3988502 4475205 5069432 5789766 6651522 7668612
61003G668612J187131J367986J548336J714075J843867J889684J774247J439158
$$ 7668612 8855743 10223729 11772065 13486140 15330007 17219691 18993938 20433096
60995B0433096R16395L44962j03566l28385l37112k01480l288J70573K12957K6173
$$ 20433096 21349491 21694453 21590887 21262502 20925390 20723910 20720622 20891195 21104152 21130325
60985B1130325m05035r74805j507902j862350j993327j938941j767302j539702
$$ 21130325 20725290 19750485 18242583 16380233 14386906 12447965 10680663 9140961
60977I140961j301768j083107q96101p40037o10716n05505m21169l52430k95228
$$ 9140961 7839193 6756086 5859985 5119948 4509232 4003727 3582558 3230128 2934900
60968B934900k48755k12771j84963j62420j43807j28654j15910j04525r4360q5426
$$ 2934900 2686145 2473374 2288411 2125991 1982184 1853530 1737620 1633095 1538735 1453309
60958A453309p7028o8541o0220n2569m5739m0068l6324l4686l4149l3521l2357
$$ 1453309 1376281 1307740 1247520 1194951 1149212 1109144 1072820 1038134 1003985 970464 938107
60947I38107l0577k8001k4767k1476j8506j5739j3254j1455j0274r157q132p915
$$ 938107 907530 879529 854762 833286 814780 799041 785787 774332 764058 754901 746769 738854
60935G38854q551r021q733q376q642r034q800q169p795p632p303o943o794o469
$$ 738854 730303 721282 712549 704173 695531 686497 677697 669528 661733 654101 646798 639855 633061 626592
60921F26592n526m439m064m381m513l907k791j612n94J10L90M58P67J634K957
$$ 626592 621066 616627 612563 608182 603669 599762 596971 595359 594765 594875 595265 595723 596490 598124 601081
60906F01081M237M799M407L735L852N000O348P140P534Q024Q584Q922R097R321
$$ 601081 605318 610117 614524 618259 622111 627111 633459 640599 648133 656157 664741 673663 682760 692081
60892F92081R459R253Q822Q508Q322P932P054N648L984K670K277K612K738K030
$$ 692081 701540 710793 719615 728123 736445 744377 751431 757079 761063 763733 766010 768622 771360 773390
60878G73390Q87Q3k19l85o20q54j040j212j371j618k209l126l923m264m369m568
$$ 773390 774277 774360 774141 773756 773136 772282 771242 770030 768659 767041 764832 761706 757783 753519 749150 744582
60862G44582m750m704m707n250o298p239p586p416p207p410q088q779q862q272
$$ 744582 739832 735128 730421 725171 718873 711634 704048 696632 689425 682015 673927 665148 656286 648014
60848F48014p654p626q152q786r256r518r544r309q872q218p340o611o761q112
$$ 648014 640360 632734 624582 615796 606540 597022 587478 578169 569297 561079 553739 547128 540367 532255
60834E32255j0029j1419j1631j0796r507q332p361o184m608l326l249m136m645
$$ 532255 522226 510807 499176 488380 478873 470541 463180 456996 452388 449062 445813 441677 437032
60821D37032m120l432l572m195m334l922l601l464l023k261j709j494j191p39
$$ 437032 432912 429480 425908 421713 417379 413457 409856 406392 403369 401108 399399 397905 396714 395975
60807C95975o68j185j706j669j236q61n97j93L86Q91J159J277J422J525J194J62
$$ 395975 395307 394122 392416 390747 389511 388650 388053 387860 388246 389137 390296 391573 392995 394520 395714 395876
60791C95876j135j753j313n98o70j551k266k109j336o31l38l78n54p36r42j321
$$ 395876 394741 392988 391675 391077 390407 388856 386590 384481 383145 382514 382176 381798 381244 380508 379566 378245
60775C78245j905k442k636k518k353k274k161j886j419q38l72k90n53p56o63n17
$$ 378245 376340 373898 371262 368744 366391 364117 361956 360070 358651 357813 357441 357151 356598 355842 355179 354662
60759C54662n42n32k97k02o72j455j939k002j891j484m81P24J253J017R26J576
$$ 354662 354120 353588 353291 353089 352417 350962 349023 347021 345130 343646 343165 343889 345142 346159 347085 348661
60743C48661K427K675K328J865J442R04K83k90q96j673k486l129l619m027m186
$$ 348661 351088 353763 356091 357956 359398 360302 360585 360295 359399 357726 355240 352111 348492 344465 340279
60728C40279l909l291k561j811j100n88l85m80r52j892k884l084k228j155q28
$$ 340279 336370 333079 330518 328707 327607 327019 326634 326154 325202 323310 320426 317342 315114 313959 313131
60713C13131j187j496j508j568j776j845j766j883k189k166j593q85m93m47p22
$$ 313131 311944 310448 308940 307372 305596 303751 301985 300102 297913 295747 294154 293269 292776 292329 291607
60698B91607j412k204k277j271J23R72J172J111Q21J48m53k29P63J597J717J612
$$ 291607 290195 287991 285714 284443 284566 285538 286710 287821 288642 288790 288337 288108 288871 290468 292185 293797
60682B93797J967K757L478L814L699L097K188J472J363J789K442L157L761L922
$$ 293797 295764 298521 301999 305813 309512 312609 314797 316269 317632 319421 321863 325020 328781 332703
60668C32703L527L004K743K423J432r3j169j065q3Q63J155Q18K90K4J60M36N06
$$ 332703 336230 339234 341977 344400 345832 345739 344570 343505 343422 344285 345440 346258 346548 346572 346732 347168 347674
60651C47674L38J87K46N08Q93J254J323J017P06Q48J277J330O84l39j404k614
$$ 347674 348012 348199 348445 348953 349846 351100 352423 353440 354146 354994 356271 357601 358285 357946 356542 353928
60635C53928m002n039n099m229l121k392k161k202k219j991j542j099p78l97K22
$$ 353928 349926 344887 339788 335559 332438 330046 327885 325683 323464 321473 319931 318832 318054 317657 317879
60620C17879Q36R50M35k53n09j59L83N08k7q54j289r49p5P19R04M42j83l05K70
$$ 317879 318715 319665 320100 319847 319338 319179 319562 320070 320043 319189 317900 316951 316876 317595 318499 318941 318758 318453 318723
60601C18723R90J143P41M66P23J184J413J531J898K422K629K347J863J487J225
$$ 318723 319713 320856 321597 322063 322786 323970 325383 326914 328812 331234 333863 336210 338073 339560 340785
60586C40785Q85K21r47k464l648l813l025k023j267m96N70J526J839J886K644
$$ 340785 341670 341891 340944 338480 334832 331019 327994 325971 324704 324208 324778 326304 328143 330029 332673
60571C32673M253N586N739N333N719P158Q632R335R439R155Q034N777L093Q93
$$ 332673 336926 342512 348251 353584 359303 366461 375093 384428 393867 403022 411056 416833 419926 420819
60557D20819q58k729m589n623n525m816l984l081k180j482p31O80K758M712N980
$$ 420819 419961 417232 412643 407020 401495 396679 392695 389614 387434 385952 385221 385901 388659 393371 399351
60542C99351O843P784Q740R470R958J0177R934R345Q904Q621P695N573K829M04
$$ 399351 406194 413978 422718 432188 442146 452323 462257 471602 480506 489127 496822 502395 505224 505628
60528E05628j578l517n333o445o559n829m440k724j458j338k050k527k133j152
$$ 505628 504050 500533 495200 488755 482196 476367 471927 469203 467745 466407 464357 461830 459697 458545
60514D58545j74M56N92K94J5L11J200K220L163M321N944P946J0279J3168J6690
$$ 458545 458371 458827 459419 459713 459728 460039 461239 463459 466622 470943 476887 484833 495112 508280 524970
60499E24970K0485K4090K7360L0302L2733L4359L5147L5406L5406L4862L2828
$$ 524970 545455 569545 596905 627207 659940 694299 729446 764852 800258 835120 867948
60488H67948K8299K1058J1846J670q827j9085k8152l4972l9151m1053m1205l9986
$$ 867948 896247 917305 929151 930821 921994 902909 874757 839785 800634 759581 718376 678390
60476F78390l7822l5201l2290k8949k5280k1867j9198j7125j5150j3079j1119
$$ 678390 640568 605367 573077 544128 518848 496981 477783 460658 445508 432429 421310
60465D21310r424p957o860o592p220p776o937m654k587k292l288l648k503j062
$$ 421310 411886 403929 397069 390477 383257 375481 368544 363890 361303 359011 355723 352075 349572 348510
60451C48510q73j913k961l234k893k326j735j333j345j647j868j764j348p83m28
$$ 348510 347637 345724 342763 339529 336636 334310 332575 331242 329897 328250 326382 324618 323270 322487 322059
60436C22059o95j457j932j600r67q46j132r70r2P91R76N90K30K68O23R25P47L6
$$ 322059 321364 319907 317975 316375 315408 314562 313430 312460 312368 313159 314135 314725 314955 315223 315846 316771 317518 317554
60418C17554o66o81N4R41J414J401J242J367J913K450K305J471Q12R47J328J072
$$ 317554 316888 316207 316261 317202 318616 320017 321259 322626 324539 326989 329294 330765 331577 332524 333852 334924
60402C34924L01j25P4M20P02J176J647J406L96m00j65P87J663K208K633K995L099
$$ 334924 335225 335100 335174 335594 336296 337472 339119 340525 340921 340521 340356 341143 342806 345014 347647 350642 353741
60385C53741K753J898P40j64l60j02PMN65J827K940L151K763K586K863L179L015
$$ 353741 356494 358392 359132 358968 358608 358506 358513 358517 359082 360909 363849 367000 369763 372349 375212 378391 381406
60368C81406K197J064M10P44J460J357K12q00o00N20J526J881J688J237R78J416
$$ 381406 383603 384667 385077 385821 387281 388638 388850 388050 387450 387970 389496 391377 393065 394302 395280 396696
60352C96696K467L382L821M416N626O675O521N390M380L819L020J611P8j140k237
$$ 396696 399163 402545 406366 410782 416408 423083 429604 434994 439374 443193 446213 447824 447902 446762 444525
60337D44525l430m492n207n757o277o406n671m140k445j289r88j380k059k720
$$ 444525 441095 436603 431396 425639 419362 412956 407285 403145 400700 399411 398423 397043 394984 392264
60323C92264l206l346l057k676k657k799k284r62R8Nn11m2J432K599K952L632
$$ 392264 389058 385712 382655 379979 377322 374523 372239 371277 371375 371380 370869 370827 372259 374858 377810 381442
60307C81442N658Q336J0235J1053J1703J2860J4203J4923J4416J2542R679O601
$$ 381442 387100 395436 405671 416724 428427 441287 455490 470413 484829 497371 507050 513651
60295E13651L783Q79k765p095j1192j4145j5673j5777j4370j1664q625o414n293
$$ 513651 517434 518313 515548 508453 497261 483116 467443 451666 437296 425632 417007 410593 405300
60282D05300m502l335k012j204j045j052r54j027j435j725j353n35j28o37j699
$$ 405300 400798 397463 395451 394247 393202 392150 391196 390169 388734 387009 385656 385121 384993 384356 382657
60267C82657k563k906k916k871k770k490k083j795j757j769j577j270j202j433
$$ 382657 380094 377188 374272 371401 368631 366141 364058 362263 360506 358737 357160 355890 354688 353255
60253C53255j511j037j95N42J152K027L138L655K861J225J26L81J343J793J385
$$ 353255 351744 350707 350512 351054 352206 354233 357371 361026 363887 365112 365238 365619 366962 368755 370140
60238C70140Q62Q54J051P84Q1l79j97K69M83L89L29N17Q48J168J497J896K195
$$ 370140 371002 371856 372907 373691 373772 373393 373196 373465 373948 374337 374666 375183 376031 377199 378696 380592 382787
60221C82787K033J346O80P41J552K367K660K853L690N076O074O061N435N052N293
$$ 382787 384820 386166 386846 387587 389139 391506 394166 397019 400709 405785 411859 417920 423355 428407 433700
60206D33700N812O077N950N853O254O980P267O710N836N416N510N703N925O298
$$ 433700 439512 445589 451539 457392 463646 470626 477893 484603 490439 495855 501365 507068 512993 519291
60192E19291O356N379L546J972J286J019N67k7o83j769l340m615m924m670m657
$$ 519291 525647 531026 534572 536544 537830 538849 539416 539389 538706 536937 533597 528982 524058 519388 514731
60177E14731m926m989m769m517m089l206k318k309l260m196m248l510k610j939
$$ 514731 509805 504816 500047 495530 491441 488235 485917 483608 480348 476152 471904 468394 465784 463845
60163D63845j552j447j649k070k396k173j213k4N00O6o01o32M5R22J645K098K122
$$ 463845 462293 460846 459197 457127 454731 452558 451345 451321 451821 451887 451286 450654 450699 451621 453266 455364 457486
60146D57486J744J370J259J058M72K8M04J342K066K527L281M205M450L888L530
$$ 457486 459230 460600 461859 462917 463389 463417 463821 465163 467229 469756 473037 477242 481692 485580 489110
60131D89110M076M930N107M474L482K358J174K61RM10J144J877K284K155J766
$$ 489110 493186 498116 503223 507697 511179 513537 514711 514972 514981 515391 516535 518412 520696 522851 524617
60116E24617J639J793J714J333J299J894K330J874J049R28J609K198K107J544
$$ 524617 526256 528049 529763 531096 532395 534289 536619 538493 539542 540470 542079 544277 546384 547928
60102E47928Q03j39j237k218k912l272l073k151j020o84j574l056m120m202l342
$$ 547928 548731 548592 547355 545137 542225 538953 535880 533729 532709 532025 530451 527395 523275 519073 515731
60087E15731k018r25m98m33p3O99J295J286Q33K54l42p68p76p03j324k634l473
$$ 515731 513713 512788 512290 511857 511784 512483 513778 515064 515897 516151 515809 515041 514265 513562 512238 509604 506131
60070E06131l108k553l325n284o805p002o547o208n737m771l779l383l358l132
$$ 506131 503023 500470 497145 491861 485056 478054 471507 465299 459562 454791 451012 447629 444271 441139
60056D41139k779k747l010l188l238l319l185k434j183J19J397K693L522L399
$$ 441139 438360 435613 432603 429415 426177 422858 419673 417239 416056 416175 417572 420265 423787 427186
60042D27186K909L197M264M818M194L356L387L991M251M092L987L783K961J731
$$ 427186 430095 433292 437556 442374 446568 449924 453311 457302 461553 465645 469632 473415 476376 478107
60028D78107Q69M16m07j910l386m122m307m594n224n932o375o422o174n862n583
$$ 478107 478976 479392 478985 477075 473689 469567 465260 460666 455442 449510 443135 436713 430539 424677 419094
60013D19094n187m624m211m158m028l225j988j263j494k134k499k480k199j637
$$ 419094 413907 409283 405072 400914 396886 393661 391673 390410 388916 386782 384283 381803 379604 377967
59999C77967j030j016j780k518k346j408m97J48R31J903K558K672K700K983L152
$$ 377967 376937 375921 374141 371623 369277 367869 367372 367520 368451 370354 372912 375584 378284 381267 384419
59984C84419K727J932J453J540J787J731J341R39Q03Q75O97k21j757k988l028
$$ 384419 387146 389078 390531 392071 393858 395589 396930 397869 398672 399547 400244 400023 398266 395278 392250
59969C92250k018r65n79o80q50j150j754k237j893p41L24N85K80J23L93P67Q67
$$ 392250 390232 389267 388688 388008 387158 386008 384254 382017 380124 379383 379707 380292 380572 380695 381088 381855 382722
59952C82722O58L78K76M46P80J097J368J668J961K126K234K514K881K815K026
$$ 382722 383380 383758 384034 384480 385260 386357 387725 389393 391354 393480 395714 398228 401109 403924 405950
59937D05950J007N26O49O84J22p36j254j258j091j039j002q28o40o16n80j54N62
$$ 405950 406957 407483 408132 408816 408938 408202 406948 405690 404599 403560 402558 401730 401090 400474 399894 399740 400302
59920D00302R18O24L43Q87J966K511K227K078K867M100M803M825M656M339L507
$$ 400302 401220 401844 402187 403074 405040 407551 409778 411856 414723 418823 423626 428451 433107 437446 440953
59905D40953K291J341Q33K42o93j404j297n67J05L68L35K04J15K33O43J171J547
$$ 440953 443244 444585 445418 445660 444967 443563 442266 441699 441804 442172 442507 442711 442826 443059 443702 444873 446420
59888D46420J680J719J900K365L022L523L645L604L808M163M020L063J932J572
$$ 446420 448100 449819 451719 454084 457106 460629 464274 467878 471686 475849 479869 482932 484864 486436
59874D86436K077K568K212J082j30r71j570k265l127l920m346m238l549k432j293
$$ 486436 488513 491081 493293 494375 494245 493274 491704 489439 486312 482392 478046 473808 470259 467827 466534
59859D66534o22n20m70J84J566L160M376N109N722O580P670Q489Q311O768M256
$$ 466534 465912 465392 464922 465106 466672 469832 474208 479317 485039 491619 499289 507778 516089 522857 527113
59844E27113J759Q1o94r26q03k35N55P12n85l205o050q063r003r160q713p637
$$ 527113 528872 528953 528259 527333 526530 526295 526850 527562 526977 523772 517722 509659 500656 491496 482783 475146
59828D75146o083m433l042k158j936k156k115j295j96K9j056k617l520l484l018
$$ 475146 469063 464630 461588 459430 457494 455338 453223 451928 451732 451761 450705 448088 444568 441084 438066
59813D38066k628k446k342k023j262k52M18M06ol53n95r42j361j602j589j501
$$ 438066 435438 432992 430650 428627 427365 427113 427531 427937 427931 427578 426983 426041 424680 423078 421489 419988
59797D19988j534j725j939j870j325n95k39l59m31j41Q3l13j181j884k042j736
$$ 419988 418454 416729 414790 412920 411595 411000 410761 410402 409971 409830 409913 409600 408419 406535 404493 402757
59781D02757j247r38j094j466j389p11k06n17j149j208p08l34j71L28J169J549
$$ 402757 401510 400572 399478 398012 396623 395912 395706 395189 394040 392832 392124 391790 391619 391947 393116 394665
59765C94665J013J61j60K53J079K002K804L272L360L176K799K325K048K284K957
$$ 394665 395678 395839 395679 395932 397011 399013 401817 405089 408449 411625 414424 416749 418797 421081 424038
59750D24038L706M351M893N223N244N205N380N463M867L644K573K188K257K296
$$ 424038 427744 432095 436988 442211 447455 452660 458040 463503 468370 472014 474587 476775 479032 481328
59736D81328K156J929J684J447J189P88L05J00L40N71K78k85m84l00k63m46l63
$$ 481328 483484 485413 487097 488544 489733 490521 490826 490926 491266 491837 492115 491830 491346 491046 490783 490337 489974
59719D89974J18N36O35O39O12L09k19n70p39j078j382r74L9O15L26Q5O17J226
$$ 489974 490092 490628 491263 491902 492514 492823 492604 492034 491295 490217 488835 487861 487900 488515 488841 488926 489543 490769
59701D90769R19K7k90L22J168J606J588J356J282J781K772L406K971J835R31N33
$$ 490769 491688 491715 491425 491747 492915 494521 496109 497465 498747 500528 503300 506706 509677 511512 512443 512976
59685E12976J76m16j029j520j962k169j733p28P2kp86j541j846k103l029m654
$$ 512976 513152 512736 511707 510187 508225 506056 504323 503595 503667 503665 502879 501338 499492 497389 494360 489706
59669D89706n981n986m842l753l504l714l659l204k585j830q95QO47J031J109
$$ 489706 483725 477739 472897 469144 465640 461926 458267 455063 452478 450648 449753 449761 450408 451439 452548
59654D52548P20J76L73J703L319M127M083L822L477K682J536N98m6p95j593j817
$$ 452548 453268 453444 453817 455520 458839 462966 467049 470871 474348 477030 478566 479164 479118 478323 476730 474913
59638D74913j393j204j920l012l437k899j982j313j046j057j201j325j304j230
$$ 474913 473520 472316 470396 467384 463947 461048 459066 457753 456707 455650 454449 453124 451820 450590
59624D50590j420k045k740k815k085j360j747l314m838n084m108k975k429k273
$$ 450590 449170 447125 444385 441570 439485 438125 436378 433064 428226 423142 419034 416059 413630 411357
59610D11357j978j485j095q92n38K53J255J964K219K286K178J439rj227j200k60
$$ 411357 409379 407894 406799 405907 405369 405622 406877 408841 411060 413346 415524 416963 416954 415727 414527 414267
59594D14267K54k08q07o77m2M85Q84J383J682J300L50o17j283j662j809j917k363
$$ 414267 414521 414313 413506 412829 412787 413272 414156 415539 417221 418521 418871 418254 416971 415309 413500 411583 409220
59577D09220l154l677l438k763k257j982j622j148o79j08N40O62j39j157j248
$$ 409220 406066 402389 398951 396188 393931 391949 390327 389179 388500 388392 388932 389594 389455 388298 387050
59562C87050l74L69K67k11l33o0K15L94P10J292J917K201J975J572J538J938K312
$$ 387050 386676 387045 387312 387101 386768 386708 386923 387317 388027 389319 391236 393437 395412 396984 398522 400460 402772
59545D02772K475K923L962N000N404N691O954R279J1626J3361J4954J6841J8240
$$ 402772 405247 408170 412132 417132 422536 428227 435181 444460 456086 469447 484401 501242 519482
59532E19482J7620J3979P545k95p433j1963j3166j1721q938n978l529j711j47
$$ 519482 537102 551081 558626 558331 550898 538935 525769 514048 505110 499132 495603 493892 493745
59519D93745J517K999L611L139K109J110K79n12j300k056k782l438m045m848o061
$$ 493745 495262 498261 501872 505011 507120 508230 508509 507997 506697 504641 501859 498421 494376 489528 483467
59504D83467p423q336q498q073p303o333n457m990m749m160l069k018j451j061
$$ 483467 476044 467708 459210 451137 443834 437501 432044 427054 422305 418145 415076 413058 411607 410546
59490D10546l10P09J410J494J244J003P83M76K30L56R73J871K788L615M297M704
$$ 410546 410236 410945 412355 413849 415093 416096 416879 417355 417585 417941 418914 420785 423573 427188 431485 436189
59474D36189M848N082N713O426O502N691M474L284K022O48k37l8R04J591J484
$$ 436189 441037 446119 451832 458258 464760 470451 474925 478209 480231 480879 480642 480604 481508 483099 484583
59459D84583R33O25J047K368M291O035O977P313P739Q465R000Q962Q599Q357Q237
$$ 484583 485516 486141 487188 489556 493847 499882 506859 514172 521911 530376 539376 548338 556937 565294 573531
59444E73531P889P079N880M374K334o24m406q014j0143j0353r448q574q204q147
$$ 573531 581420 588499 594379 598753 601087 600463 596057 588043 577900 567547 558099 549525 541321 533174
59430E33174q030p529o449m979l594k417j085M94J810K579L416N077P414R748
$$ 533174 525144 517615 511166 506187 502593 500176 499091 499585 501395 503974 507390 512467 519881 529629
59416E29629J1877J4097J6480J8809K1003K2972K4376K5068K5197K4113J9785
$$ 529629 541506 555603 572083 590892 611895 634867 659243 684311 709508 733621 753406
59405G53406J0784j170j1833j7928j9225j7291j3472q581l433J146M371N121K138
$$ 753406 764190 763020 751187 733259 714034 696743 683271 674690 671257 672403 676774 681895 684033
59392F84033m705j3563k1557k6511k7810k6176k2961j9314j5660j2009q699o394
$$ 684033 679328 665765 644208 617697 589887 563711 540750 521436 505776 493767 485068 478674
59380D78674n332m905m284l156j851r15o26o22j62J021K297K890K839K755K948
$$ 478674 473342 468437 464153 460997 459146 458231 457605 456983 456821 457842 460139 463029 465868 468623 471571
59365D71571L338L905M537M720M169L623M081N329O167O132N979O340O879P207
$$ 471571 474909 478814 483351 488071 492240 495863 499944 505273 511440 517572 523551 529891 536770 543977
59351E43977P655Q668J0086J1505J2724J3542J3736J3574J3710J4268J4644J4479
$$ 543977 551632 560300 570386 581891 594615 608157 621893 635467 649177 663445 678089 692568
59339F92568J4078J3597J2560J0716Q655O946N262K922j52l369o063p795q613
$$ 692568 706646 720243 732803 743519 752174 759120 764382 767304 767152 763783 757720 749925 741312
59326G41312r300j0749j2801j4271j4497j4075j3686j3014j1626j0119r470r569
$$ 741312 732012 721263 708462 694191 679694 665619 651933 638919 627293 617174 607704 598135
59314E98135r324q015n878l494j319L03J314K148L368N097P110R267J1457J3163
$$ 598135 588811 580796 574918 571424 570105 570408 571722 573870 577238 582335 589445 598712 610169 623332
59300F23332J3505J1701P424J084n934j1668j4738j5242j4286j2874j1459j0209
$$ 623332 636837 648538 655962 657046 651112 639444 624706 609464 595178 582304 570845 560636
59288E60636r184q250p128n709m187k933k156j649r05K91J478K052K030J985K256
$$ 560636 551452 543202 536074 530365 526178 523245 521089 519440 518535 518826 520304 522356 524386 526371 528627
59273E28627K774L554M833O493P946Q810R264R646J0072J0507J0750J0217Q425
$$ 528627 531401 534955 539788 546281 554227 563037 572301 581947 592019 602526 613276 623493 631918
59260F31918N810L485J931M50j755m501o911q365q876q903r034r516r927r632
$$ 631918 637728 641213 643144 643594 641839 637338 630427 622062 613186 604283 595249 585733 575806 566174
59246E66174q513o896m991l018j664j505j942j692m48R17J848K668L418L454K718
$$ 566174 557661 550765 545774 542756 541092 539587 537645 535953 535505 536422 538270 540938 544356 547810 550528
59231E50528K215K441K432J345n9m85L2L98j3j036k416l846m682m590m183m300
$$ 550528 552743 555184 557616 558961 558902 558417 558449 558847 558834 557798 555382 551536 546854 542264 538081 533781
59215E33781m885n277n221m876m219l120j861q84k79Q7K36K31L01L72K5o71r89
$$ 533781 528896 523619 518398 513522 509303 506183 504322 503438 503159 503246 503482 503713 504014 504386 504411 503740 502751
59198E02751o27k48k90j58O41J397J259O65N23O25J16p70q44K37J430J722J206
$$ 502751 502124 501876 501586 501428 502069 503466 504725 505390 505913 506538 506654 505884 505040 505277 506707 508429 509635
59181E09635O49P15J611K872L511K989J938J406J598J953K167K405K750L116L520
$$ 509635 510284 510999 512610 515482 518993 521982 523920 525326 526924 528877 531044 533449 536199 539315 542835
59166E42835L960M231M415N063O360P559P965P897P894P590O301M266K305O29
$$ 542835 546795 551026 555441 560504 566864 574423 582388 590285 598179 605769 612070 616336 618641 619270
59152F19270j012k407l196l740m553n230n145m889n606p061p753p115o236o130
$$ 619270 618258 615851 612655 608915 604362 599132 593987 589098 583492 576431 568678 561563 555327 549197
59138E49197o470o442n846m988m259m041m295m226l160j698j038j241j303r21
$$ 549197 542727 536285 530439 525451 521192 517151 512856 508630 505470 503772 502734 501493 500190 499269
59124D99269q74j405j557o07R24K290L477M582N239N298N340N816O368O559O620
$$ 499269 498395 496990 495433 494826 495750 498040 501517 506099 511338 516636 521976 527792 534160 540719 547339
59109E47339O884P044O653N876N253N052N182N335M985L727J947O57L27M17K60
$$ 547339 554223 561267 567920 573796 579049 584101 589283 594618 599603 603330 605277 605934 606261 606678 606938
59094F06938o8j60l0m9n06j427k514l129k750j652p22n26r69j780k758l569m011
$$ 606938 606870 606710 606680 606631 606125 604698 602184 599055 596305 594653 593931 593405 592436 590656 587898 584329 580318
59077E80318m472n448o558o928o595o490o847o751n699m555m269m536m508m029
$$ 580318 575846 570398 563840 556912 550317 543827 536980 530229 524530 519975 515706 511170 506662 502633
59063E02633l467k944k499k471k933l223k784k077j883k138k140j676j125p17
$$ 502633 499166 496222 493723 491252 488319 485096 482312 480235 478352 476214 474074 472398 471273 470556
59049D70556m14l16n48q07o52j64K72O30J033J094K29j213k031j676r77r01j212
$$ 470556 470142 469826 469278 468471 467819 467655 467927 468557 469590 470684 470913 469700 467669 465993 465016 464115 462903
59032D62903j002j94L64K97L73J358K850L831M055M210M818N701O567P442Q242
$$ 462903 461901 461707 462071 462368 462741 464099 466949 470780 474835 479045 483863 489564 496131 503573 511815
59017E11815Q597Q452Q307Q402Q191P137N505L893K460J211M55L02J62m32r64
$$ 511815 520412 528864 537171 545573 553764 560901 566406 570299 572759 573970 574425 574727 574889 574457 573493
59002E73493p32l8M55J050K472M238M967M419L867M140M549M204L287K383J615
$$ 573493 572761 572723 573178 574228 576700 580938 585905 590324 594191 598331 602880 607084 610371 612754 614369
58987F14369J055J083J568J508L27j114j588j111o47o41o48k24O03J728L206N002
$$ 614369 615424 616507 618075 619583 619910 618796 617208 616097 615450 614809 614161 613937 614540 616268 619474 624476
58971F24476O874Q544R805J0570J1031J1593J2391J3005J2956J2366J1863J1823
$$ 624476 631350 639894 649699 660269 671300 682893 695284 708289 721245 733611 745474 757297
58959G57297J1906J1401R985P978N857L647J127j502l712n527p639j0263j2506
$$ 757297 769203 780604 790589 798567 804424 808071 809198 807696 803984 798457 790818 780555 768049
58946G68049j3538j3821j4404j5407j6022j5701j4478j2462r938p773o724o365
$$ 768049 754511 740690 726286 710879 694857 679156 664678 652216 642278 634505 627781 621416
58934F21416n742m903m687n045m858l675k407j867j689j184l81L10P26Q16N12
$$ 621416 615674 610771 606084 601039 596181 592506 590099 588232 586543 585359 584978 585288 586014 586830 587342
58919E87342J32K21O86Q28M69K36M80P12N48L47N25R87J610K563L770M787N559
$$ 587342 587474 587695 588381 589209 589678 589914 590394 591106 591654 592001 592526 593513 595123 597686 601456 606243 611802
58902F11802O550P868R092J0175J1554J2983J3381J2423J1233J0880J1075J1082
$$ 611802 618352 626220 635312 645487 657041 670024 683405 695828 707061 717941 729016 740098
58890G40098J0926J0997J1311J1974J3517J5901J7964J8712J8491J8001J6955
$$ 740098 751024 762021 773332 785306 798823 814724 832688 851400 869891 887892 904847
58879I04847J4692J1544Q476N746K847m13l572o137p921r091j0194j1763j3469
$$ 904847 919539 931083 939559 945305 948152 947739 944167 938030 930109 921018 910824 899061 885592
58866H85592j4299j3959j3335j3064j2552j1229r783r175r108q697q002p750p907
$$ 885592 871293 857334 843999 830935 818383 807154 797371 788196 779088 770391 762389 754639 746732
58853G46732p802p450p574q320r022r280r412r613r532q920q118p609p463p369
$$ 746732 738930 731480 723906 715586 706564 697284 687872 678259 668727 659807 651689 644080 636617 629248
58839F29248p018o431o024o118o427o378o003n912o184o055n046l724k798k187
$$ 629248 622230 615799 609775 603657 597230 590852 584849 578937 572753 566698 561652 557928 555130 552943
58825E52943j487o84K12J486K980L792L561L244L796M776N206N134N193N243M700
$$ 552943 551456 550772 550984 552470 555450 559242 562803 566047 569843 574619 579825 584959 590152 595395 600095
58810F00095L840L461L509L219K530K133K168J970J156%j331k940m536n544n989
$$ 600095 603935 607396 610905 614124 616654 618787 620955 622925 624081 624081 622750 619810 615274 609730 603741
58795F03741o371o646o284n479n253o001o822o750n911n025m289l356k049n98
$$ 603741 597370 590724 584440 578961 573708 567707 560885 554135 548224 543199 538910 535554 533505 532907
58781E32907O64J582K252K881L519L944M043M080M239M135L158J327o61k282l691
$$ 532907 533571 535153 537405 540286 543805 547749 551792 555872 560111 564246 567404 568731 568070 565788 562097
58766E62097n268o902p934p808o742n608m983m522l713k948l089l962m235l138
$$ 562097 556829 549927 541993 534185 527443 521835 516852 512330 508617 505669 502580 498618 494383 491245
58752D91245j420j68N06R86J302J494K052L057L562K882J899K049L369M677N388
$$ 491245 489825 489657 490163 491149 492451 493945 495997 499054 502616 505498 507397 509446 512815 517492 522880
58737E22880N919O422O368N630M934M845M996M722L917L005K488K665L481M378
$$ 522880 528799 535221 541589 547219 552153 556998 561994 566716 570633 573638 576126 578791 582272 586650
58723E86650M645M012K896K036J945K497K986K890K620L092M446N751O191N883
$$ 586650 591295 595307 598203 600239 602184 604681 607667 610557 613177 616269 620715 626466 632657 638540
58709F38540N291M560L873L649L815L539K307N72j200l328n959q216r313r901
$$ 638540 643831 648391 652264 655913 659728 663267 665574 666146 664946 661618 655659 647443 638130 628229
58695F28229j1121j2846j3936j3941j3443j2833j1891j0526r091p859o860o148
$$ 628229 617108 604262 590326 576385 562942 550109 538218 527692 518601 510742 503882 497734
58683D97734n721n307m696m077l615l131k599k420k623k537j825j126q87m36Q81
$$ 497734 492013 486706 482010 477933 474318 471187 468588 466168 463545 461008 459183 458057 457170 456734 457615
58668D57615K461L420M041N026O050O395O491P312Q587R027Q125O434M317J742
$$ 457615 460076 463496 467537 472563 478613 485008 491499 498811 507398 516425 524550 530984 535301 537043
58654E37043p85k519l634m842n960o094n221m284l771l411l216l452l577k647
$$ 537043 536258 533739 530105 525263 519303 513209 507988 503704 499933 496522 493306 489854 486277 483630
58640D83630j004j82q12j811k053j627j038l09N87J295J617J769J811J561J234
$$ 483630 482626 482444 481632 479821 477768 476141 475103 474794 475381 476676 478293 480062 481873 483434 484668
58625D84668J421K079K422K042J444J187J187J137J039J078J394K046K837L304
$$ 484668 486089 488168 490590 492632 494076 495263 496450 497587 498626 499704 501098 503144 505981 509285
58611E09285L322L442M098M880N197N204N205M720L213J291Q1l09n68q35p83o93
$$ 509285 512607 516049 520147 525027 530224 535428 540633 545353 548566 549857 549938 549629 549061 548226 547443 546750
58595E46750j059j401r29k09n27j631j817m63J161K050K809M209N783O718P055
$$ 546750 545691 544290 543361 543152 542625 540994 539177 538714 539875 541925 544734 548943 554726 561444 568499
58580E68499P248P337P305P484Q007Q445Q396P961P353O632N973N656N739O248
$$ 568499 575747 583084 590389 597873 605880 614325 622721 630682 638035 644667 650640 656296 662035 668283
58566F68283P488R499J1521J2858J4007J5876J8213J9948K0901K1834K2872K3155
$$ 668283 675771 685270 696791 709649 723656 739532 757745 777693 798594 820428 843300 866455
58554H66455K2144K0104J7272J3661R822O517L674O91k270m519o120p566q331
$$ 866455 888599 908703 925975 939636 949458 955975 959649 960340 958070 953551 947431 939865 931534
58541I31534p485n765n310o951r405j1536j3669j6133j8149j9004j9107j8975
$$ 931534 924049 918284 912974 906023 896618 885082 871413 855280 837131 818127 799020 780045
58529G80045j8325j6821j4784j2625j0501q824q003p414n850l350j396r02j201
$$ 780045 761720 744899 730115 717490 706989 698165 690162 682748 676898 673548 672152 671250 670049
58516F70049j370j281r26r8P55O11o35j915k593l119l672l546k472j353j016j309
$$ 670049 668679 667398 666472 666374 667129 667740 667105 665190 662597 659478 655806 652260 649788 648435 647419 646110
58500F46110j799k235k090q97N51P97j41o49pO78N63M52J187K199K675K855L259
$$ 646110 644311 642076 639986 639089 639640 640437 640296 639647 639640 640318 640881 641333 642520 644719 647394 650249 653508
58483F53508L676L849M139M797N581O592Q374J0637J2213J2848J3608J4844J5220
$$ 653508 657184 661033 665172 669969 675550 682142 690516 701153 713366 726214 739822 754666 769886
58470G69886J3696J1018Q301N460K105j162l551n168o376o872o351n250m026k491
$$ 769886 783582 794600 802901 808361 810466 809304 805753 800585 794209 787337 780986 775736 771710 769219
58456G69219m69J660L601N494P139P946Q004Q196Q787Q998Q248O674M190M97l639
$$ 769219 768750 770410 774011 779505 786644 794590 802594 810790 819577 828575 836823 843497 847687 848184 844545
58441H44545o573p813q470r251r531q932q156p559o418m401k312o82Q94K464L309
$$ 844545 837972 830159 821689 812438 802907 793975 785819 778260 771842 767441 765129 764447 765341 767805 771114
58426G71114L504M243N846P099P335P513Q401R271R304Q690P596N620L116J296
$$ 771114 774618 778861 784707 791806 799141 806654 815055 824326 833630 842320 849916 855536 858652 859948
58412H59948K45j419m040o010o324o163o736p366p041o148n407m528l200j990
$$ 859948 860193 858774 854734 848724 842400 836237 829501 822135 815094 808946 803539 799011 795811 793821
58398G93821j280o54j00j96n26K81K207L518L528L465L883L627K453K027K954
$$ 793821 792541 791887 791787 791591 791065 791346 793553 797071 800599 804064 807947 811574 814027 816054 819008
58383H19008L420K315J240J686K656K893L106M018M525L893L601M848O342O623
$$ 819008 822428 824743 825983 827669 830325 833218 836324 840342 844867 848760 852361 857209 863551 870174
58369H70174O557P311P976P465O887P608Q769Q996Q943R831J1151J1953J2703
$$ 870174 876731 884042 892018 899483 906370 913978 922747 931743 940686 950517 961668 973621 986324
58356I86324J3776J3940J2530J1209J1304J1304R485P068O067N841M573K727K129
$$ 986324 1000100 1014040 1026570 1037779 1049083 1060387 1069872 1076940 1083007 1088848 1093421 1096148 1098277
58343A098277K888L798M759O277P691Q162Q395R336J0355J0641J1002J2387J4084
$$ 1098277 1101165 1104963 1109722 1115999 1123690 1131852 1140247 1149583 1159938 1170579 1181581 1193968 1208052
58330A208052J5180J6131J7173J7214J6086J5696J6840J7325J5447J2868J1582
$$ 1208052 1223232 1239363 1256536 1273750 1289836 1305532 1322372 1339697 1355144 1368012 1379594
58319A379594J0655Q706O991O971P270O271N388O508Q396Q956Q900R832J0952
$$ 1379594 1390249 1398955 1405946 1412917 1420187 1426458 1431846 1438354 1446750 1455706 1464606 1474438 1485390
58306A485390J1120J1906J4916J8153J8865J8078J8501J9859K0099J9476J9615
$$ 1485390 1496510 1508416 1523332 1541485 1560350 1578428 1596929 1616788 1636887 1656363 1675978
58295A675978K0153K0006K0205K1897K3460K3203K2821K4397K6296K6116K5305
$$ 1675978 1696131 1716137 1736342 1758239 1781699 1804902 1827723 1852120 1878416 1904532 1929837
58284A929837K6503K8523K8697K8077K9441L1928L2540L1516L1523L2982L4722
$$ 1929837 1956340 1984863 2013560 2041637 2071078 2103006 2135546 2167062 2198585 2231567 2266289
58273B266289L7561M2612M7769N0542N2519N6331O0247O0921N9457N9474O0972
$$ 2266289 2303850 2346462 2394231 2444773 2497292 2553623 2613870 2674791 2734248 2793722 2854694
58262B854694O1567O1971O4634O8537P0920P2611P6182Q0531Q2859Q4163Q7154
$$ 2854694 2916261 2978232 3042866 3111403 3182323 3254934 3331116 3411647 3494506 3578669 3665823
58251C665823R0724R2363R3869R8500J04623J08529J11356J16602J23209J28090
$$ 3665823 3756547 3848910 3942779 4041279 4145902 4254431 4365787 4482389 4605598 4733688
58241D733688J33155J42349J53859J62940J70468J80903J93758K05154K15910
$$ 4733688 4866843 5009192 5163051 5325991 5496459 5677362 5871120 6076274 6292184
58232F292184K29875K46040K60668K75260K94000L15528L35940L57455L84927
$$ 6292184 6522059 6768099 7028767 7304027 7598027 7913555 8249495 8606950 8991877
58223H991877M16478M47251M79547N18951N63668O08741O57493P16968P85369
$$ 8991877 9408355 9855606 10335153 10854104 11417772 12026513 12684006 13400974 14186343
58214A4186343Q56753R34738J028098J136311J254096J386825J545741J731370
$$ 14186343 15043096 15977834 17005932 18142243 19396339 20783164 22328905 24060275
58206B4060275J938550K174865K457007K793379L190372L672136M273118N015385
$$ 24060275 25998825 28173690 30630697 33424076 36614448 40286584 44559702 49575087
58198D9575087N916685P016255Q366878J0006334J1962511J4271502J6945117
$$ 49575087 55491772 62508027 70874905 80881239 92843750 107115252 124060369
58191A24060369J9919301K3070302K6264523K9326411L1951393L3703506L4067920
$$ 124060369 143979670 167049972 193314495 222640906 254592299 288295805 322363725
58184C22363725L2389434K7802187J9558634P809369n862175j8888742k8943313
$$ 322363725 354753159 382555346 402113980 409923349 404061174 385172432 356229119
58177C56229119l4923694l7019091l6136159l3343297k9596744k5619365k1843923
$$ 356229119 321305425 284286334 248150175 214806878 185210134 159590769 137746846
58170A37746846j8461491j5538084j3082897j1052475r369856p970470o813621
$$ 137746846 119285355 103747271 90664374 79611899 70242043 62271573 55457952
58163E5457952n856903n052583m371372l803291l332461k932668k588061k296786
$$ 55457952 49601049 44548466 40177094 36373803 33041342 30108674 27520613 25223827
58155B5223827k052361j839812j651201j487770j345619j214844j093547r87940
$$ 25223827 23171466 21331654 19680453 18192683 16847064 15632220 14538673 13550733
58147A3550733q97726q14952p37557o70717o14234n61489n11725m71175m40682
$$ 13550733 12653007 11838055 11100498 10429781 9815547 9254058 8742333 8271158 7830476
58138G830476m13338l85641l60558l38506l15320k90581k68729k50788k33309
$$ 7830476 7417138 7031497 6670939 6332433 6017113 5726532 5457803 5207015 4973706
58129D973706k16096k02565j92027j79893j66069j55080j47511j39251j29661
$$ 4973706 4757610 4555045 4363018 4183125 4017056 3861976 3714465 3575214 3445553
58120C445553j22550j18296j12773j05082r9027r5782r1980q6285q1359p8220
$$ 3445553 3323003 3204707 3091934 2986852 2887825 2792043 2700063 2613778 2532419 2454199
58110B454199p4735p0655o8179o6832o3625n8892n6197n5849n4305n0611m7659
$$ 2454199 2379464 2308809 2240630 2173798 2110173 2051281 1995084 1939235 1884930 1834319 1786660
58099A786660m6326m4075m0231l7171l5298l2177k7680k4905k4950k5506k5456
$$ 1786660 1740334 1696259 1656028 1618857 1583559 1551382 1523702 1498797 1473847 1448341 1422885
58088A422885k6191k7613k7654k6466k6482k7613k7046k4539k3072k3534k3446
$$ 1422885 1396694 1369081 1341427 1314961 1288479 1260866 1233820 1209281 1186209 1162675 1139229
58077A139229k1967k1361k2313k2413k0729j9567k0149k0466j9065j7283j6341
$$ 1139229 1117262 1095901 1073588 1051175 1030446 1010879 990730 970264 951199 933916 917575
58066I17575j5495j4367j3891j3960j3151j1581j0965j1309j0832r541r498j0924
$$ 917575 902080 887713 873822 859862 846711 835130 824165 812856 802024 792483 782985 772061
58054G72061j1552j0563r788j0282j0888j0903j1027j1083r899p941o995p049
$$ 772061 760509 749946 740158 729876 718988 708085 697058 685975 676076 668135 661140 654091
58042F54091o557n793o439p853p583n857n479o821p087n506m919o869r008r152
$$ 654091 647534 641741 635302 627449 619866 614009 608530 601709 594622 589116 584197 577328 568320 559168
58028E59168q335q048p700o722o301p224q411q966r353r518q418o390n344n677
$$ 559168 550833 542785 535085 528363 522062 514838 506427 497461 488108 478590 470172 463782 458438 452761
58014D52761n660m720m407n174n222l785k629k905l334k860k476k910l067k246
$$ 452761 447101 442381 437974 432800 427578 423793 421164 418259 414925 412065 409589 406679 403612 401366
58000D01366j607j991k461k214j884j821j236rO69L33j48n84j746l144l145j938
$$ 401366 399759 397768 395307 393093 391209 389388 388152 388143 388812 389145 388997 388413 386667 383523 380378 378440
57984C78440j655k777l355k625k348l380m052l354k745l210l393k392j645k163
$$ 378440 376785 374008 370653 368028 365680 362300 358248 354894 352149 348939 345546 343154 341509 339346
57970C39346k508j515n47r44j539q57K49L38j16LL58K67L83J334K138J711O69
$$ 339346 336838 335323 334776 333832 332293 331436 331685 332023 331907 331910 332268 332535 332918 334252 336390 338101 338770
57953C38770J20r4n18q61q40r68j374j278n53j98k88N70K749M576M976N135O153
$$ 338770 338890 338796 338278 337417 336577 335609 334235 332957 332404 332206 331918 332488 335237 339813 344789 349924 356077
57936C56077P158P206P065P506P731P139O733P110O943N262L329K418J504p51
$$ 356077 363235 370441 377506 385012 392743 399882 406615 413725 420668 425930 429259 431677 433181 432430
57922D32430l442m968n663o720p831p956p438p275p299o917o674p246p764p009
$$ 432430 428988 424020 418357 411637 403806 395850 388412 381137 373838 366921 360247 353001 345237 338228
57908C38228n430m389m072l712l122k588j988j284j089j587j884j468j200j685
$$ 338228 332798 328409 324337 320625 317503 314915 312927 311643 310554 308967 307083 305615 304415 302730
57894C02730j989j268l12n9P6Q72J633J545J347K002K784K588J937J930K138J495
$$ 302730 300741 299473 299161 299102 299178 300050 301683 303228 304575 306577 309361 311949 313886 315816 317954 319449
57878C19449L25l25o36j395k202k102j474j489k158k522k333k115k016k045k727
$$ 319449 319774 319449 318813 317418 315216 313114 311640 310151 307993 305471 303138 301023 299007 296962 294235
57863B94235m089m733l473j274K2K48O00J372J781J661J640J905K185K658L518
$$ 294235 290146 285413 281940 280666 280688 280936 281536 282908 284689 286350 287990 289895 292080 294738 298256
57848B98256M005L298J952J086O23k37j241j448j073j366k657l934m313l792k646
$$ 298256 302261 305559 307511 308597 309220 308983 307742 306294 305221 303855 301198 297264 292951 289159 286513
57833B86513j292n74j018j888k009j364q31o79m00J88P83J328J976K556K896L373
$$ 286513 285221 284647 283629 281741 279732 278368 277537 276858 276458 276646 277429 278757 280733 283289 286185 289558
57817B89558M228M820M434L319K035L98j854l989n091n374n520n339m357l183
$$ 289558 293786 298606 303040 306359 308394 308792 306938 302949 297858 292484 286964 281625 277268 274085
57803B74085k888l289l311k753k315k120j581o99k12l51n46m43k77k60l59o10
$$ 274085 271197 267908 264597 261844 259529 257409 255828 255129 254917 254566 254020 253577 253300 253040 252681 252071
57787B52071r24q67l12J46J91N57J877L385L858L320K728K483K466K906L921M635
$$ 252071 251147 250280 249968 250114 250305 250862 252739 256124 259982 263302 266030 268513 270979 273885 277806 282441
57771B82441M119K918K256K116J417j12j611k469k793k642k066j679j990k410
$$ 282441 286560 289478 291734 293850 295267 295155 293544 291075 288282 285640 283574 281895 279905 277495
57757B77495k131j608j790k250j709l00M42n4o28l17M52R67J200J233R39O29Q85
$$ 277495 275364 273756 271966 269716 268007 267707 268149 268095 267467 267150 267602 268569 269769 271002 271941 272570 273455
57740B73455J414J180M2q68q41n15o45r44r00p32q62j100j070q96r00r59o97o1
$$ 273455 274869 276049 276091 275223 274382 273867 273222 272278 271378 270646 269784 268684 267614 266718 265818 264859 264162 264101
57722B64101O27R61P15O6m08k96N1q7q77j776k245k237k046k016k286k585k447
$$ 264101 264728 265689 266404 266470 266062 265766 265817 265730 264853 263077 260832 258595 256549 254533 252247 249662 247215
57705B47215j928j647j863j987j510p84k81L00J340K283K269J456P28L57j69j150
$$ 247215 245287 243640 241777 239790 238280 237496 237215 237515 238855 241138 243407 244863 245591 245948 245779 244629
57689B44629k309l323l984m014l372k521j813r85J44J075J480K142M031O907R839
$$ 244629 242320 238997 235013 230999 227627 225106 223293 222308 222452 223527 225007 227149 231180 238087 247926
57674B47926J2630J5763J9314K3074K7409L2860L9022M4831M9688N3190N3905
$$ 247926 260556 276319 295633 318707 346116 378976 417998 462829 512517 565707 619612
57663F19612M9585L8793K1789M03k1897m0481n1807n5591n4078m9466m2950l5649
$$ 619612 669197 707990 729779 730182 708285 667804 615997 560406 506328 456862 413912 378263
57651C78263k8830k3125j8607j5552j3963j2632j0112o703m121l171k917k345
$$ 378263 349433 326308 307701 292149 278186 265554 255442 248739 244618 241447 238530 236185
57639B36185j510p79j23M95R73J487K213K650K149J054K55j77q03j443j384q68
$$ 236185 234675 233896 233773 234268 235241 236728 238941 241591 243740 244794 245049 244872 244069 242626 241242 240374
57623B40374q96j510j784j609j949k992l667l430l054l072k960k473k389l016
$$ 240374 239478 237968 236184 234575 232626 229634 225967 222537 219483 216411 213451 210978 208589 205573
57609B05573l289k302o60N63J242J679J645R17K2m70p90j343j826j782j503j625
$$ 205573 202284 199982 199322 199885 201127 202806 204451 205368 205390 204920 204130 202787 200961 199179 197676 196051
57593A96051k226k940l623m251m503m040l069k246k083k568l175l228k501j500
$$ 196051 193825 190885 187262 183011 178508 174468 171399 169153 167070 164502 161327 158099 155598 154098
57579A54098q01l55R2K96p2o19p43p60j423k462k744k037j391j513j871j761j343
$$ 154098 153297 152942 153034 153330 153258 152639 151896 151136 149713 147251 144507 142470 141079 139566 137695 135934 134591
57562A34591j085j040j071j088q41r4Q22J298J384J544J600R48j00l69N17J575
$$ 134591 133506 132466 131395 130307 129466 129372 130194 131492 132876 134420 136020 136968 136868 136499 137016 138591
57546A38591J892J573R80J77n02l81N36J345J468J245J070Q23N00L61K72j68o39
$$ 138591 140483 142056 143036 143213 142711 142330 142866 144211 145679 146924 147994 148817 149317 149678 149950 149782 149143
57529A49143l87L39M05l37o32K27J369J800J608J149M01k72K3J260K116J798J097
$$ 149143 148756 149095 149500 149163 148531 148758 150127 151927 153535 154684 155085 154813 154836 156096 158212 160010 161107
57512A61107Q95Q97O87P59J405J774J146J55k70k77m34o88r13j513k496k954k447
$$ 161107 162002 162899 163586 164345 165750 167524 168670 168825 168555 168278 167844 167156 166243 164730 162234 159280 156833
57495A56833j873j981k139j717j434k054k847k805k366k398k415j508k63N3l62
$$ 156833 154960 152979 150840 149123 147689 145635 142788 139983 137617 135219 132804 131296 131033 131086 130724
57480A30724l01L16M83Pl33l99p73j289j129m62m33j301j996j806j193o69j03
$$ 130724 130423 130739 131222 131229 130896 130497 129724 128435 127306 126844 126411 125110 123114 121308 120115 119446 119343
57463A19343M92O61L78J82J69k24j026j387q02J12N72N39L35Q9l8K55Q20R96M98
$$ 119343 119835 120496 120874 121056 121225 121001 119975 118588 117786 117898 118470 119009 119344 119433 119395 119650 120470 121466 121964
57444A21964o6l1M57P48N13j8m34m63j40K14L53L95N81Q32Q62O57M76M45M55L98
$$ 121964 121898 121867 122324 123072 123585 123567 123133 122670 122530 122744 123097 123492 124073 124905 125767 126424 126900 127345 127800 128198
57424A28198K06j93o75q16l99J58K48r2k81j9L12J73m89j081q31L99J747K097
$$ 128198 128404 128211 127536 126720 126321 126479 126727 126635 126354 126335 126647 126820 126331 125250 124419 124818 126565 128662
57406A28662J321L44q4j26j64j16P3l1o50j200j077n50k00N5N98J141J028L34
$$ 128662 129983 130327 130243 130117 129953 129837 129910 129879 129229 128029 126952 126402 126202 126257 126855 127996 129024 129358
57388A29358j54M3O86J339J740J869K079K827L799L791K184Q7q54m75K1j25m88
$$ 129358 129204 129247 129933 131272 133012 134881 136960 139787 143586 147377 149561 149648 148794 148319 148340 148215 147727
57371A47727n51m86o72j138j693k106k064j426n42P7L66N09M77K76L82J228K400
$$ 147727 147176 146690 146018 144880 143187 141081 139017 137591 137049 137126 137492 138001 138478 138754 139136 140364 142764
57354A42764L064L015K634K040J092J36r9M54J025J020N91J12k98n79n61k68K9
$$ 142764 145828 148843 151477 153517 154609 154745 154646 155100 156125 157145 157736 157848 157550 156971 156410 156142 156171
57337A56171J19O9R8M28J020J313O90m43p21L80J467R15q26j752r09O56J533J429
$$ 156171 156290 156359 156457 156885 157905 159218 159908 159465 158744 159124 160591 161506 160680 158928 158019 158675 160208 161637
57319A61637P68m4o45p43n41n50p88p88m34j20O3M77J073J229P72M71R47J747
$$ 161637 162405 162361 161716 160973 160432 159882 159094 158306 157872 157752 157815 158292 159365 160594 161366 161837 162784 164531
57301A64531J984J565J206J441K000K201J718R41M78L65J21l25l17M82J337J431
$$ 164531 166515 168080 169286 170727 172727 174928 176646 177587 178065 178430 178551 178226 177909 178391 179728 181159
57285A81159J142J341J832J641P24J86N41R70P66M54P58J309J207L81l10j50Q63
$$ 181159 182301 183642 185474 187115 187839 188025 188566 189536 190302 190756 191514 192823 194030 194411 194101 193951 194814
57268A94814K260L462M026L865L242K481J866J756K333L126L263K449J394R54
$$ 194814 197074 200536 204562 208427 211669 214150 216016 217772 220105 223231 226494 228943 230337 231291
57254B31291J222J676K009K374K901L322L243K718K360K661L310L526L131K790
$$ 231291 232513 234189 236198 238572 241473 244795 248038 250756 253116 255777 259087 262613 265744 268534
57240B68534K988L293L127K706K658L007L289L398L641M069M358M344M115L715
$$ 268534 271522 274815 277942 280648 283306 286313 289602 293000 296641 300710 305068 309412 313527 317242
57226C17242L295L397M392N777O594O565O325O577P545Q985J0188J0243R020P661
$$ 317242 320537 323934 328326 334103 340697 347262 353587 360164 367709 376694 386882 397125 406145 413806
57212D13806P355P852P889O902N516M557M415N223O667P771P809P387P712Q926
$$ 413806 421161 429013 436902 443804 449320 453877 458292 463515 470182 477953 485762 493149 500861 509787
57198E09787J0153J0995J1839J2696J3073J3078J3394J3926J3791J2932J2493
$$ 509787 519940 530935 542774 555470 568543 581621 595015 608941 622732 635664 648157
57187F48157J3100J3960J4265J4279J4525J4934J5436J6345J7599J8610J9413
$$ 648157 661257 675217 689482 703761 718286 733220 748656 765001 782600 801210 820623
57176H20623K0781K2597K3382K2262K0308J8925J8079J7109J6227J5921J5764
$$ 820623 841404 864001 887383 909645 929953 948878 966957 984066 1000293 1016214 1031978
57165A031978J5270J5192J6595J9079K1232K2474K3206K3544K3287K2912K3248
$$ 1031978 1047248 1062440 1079035 1098114 1119346 1141820 1165026 1188570 1211857 1234769 1258017
57154A258017K4123K4590K4595K5189K6844K8626K9522K9674K9839L0281L0707
$$ 1258017 1282140 1306730 1331325 1356514 1383358 1411984 1441506 1471180 1501019 1531300 1562007
57143A562007L0798L0381K9455K8342K7651K7843K8917L0438L1730L2288L2302
$$ 1562007 1592805 1623186 1652641 1680983 1708634 1736477 1765394 1795832 1827562 1859850 1892152
57132A892152L2544L3392L4223L4305L4038L4608L6488L8966M1185M3046M4830
$$ 1892152 1924696 1958088 1992311 2026616 2060654 2095262 2131750 2170716 2211901 2254947 2299777
57121B299777M6491M7674M8202M8315M8576M9621N1852N5270N9680O5048P1494
$$ 2299777 2346268 2393942 2442144 2490459 2539035 2588656 2640508 2695778 2755458 2820506 2892000
57110B892000P9113Q7995R8340J10358J24172J39965J58102J79033K03273K31707
$$ 2892000 2971113 3059108 3157448 3267806 3391978 3531943 3690045 3869078 4072351 4304058
57100D304058K65663L06586L55869M15144M86113N69504O64414P69112Q82231
$$ 4304058 4569721 4876307 5232176 5647320 6133433 6702937 7367351 8136463 9018694
57091I018694J002594J128018J254648J377309J490060J586742J661872J711139
$$ 9018694 10021288 11149306 12403954 13781263 15271323 16858065 18519937 20231076
57083B0231076J730662J716359J665354J578011J456531J299283J096634Q34873
$$ 20231076 21961738 23678097 25343451 26921462 28377993 29677276 30773910 31608783
57075C1608783N07210J23022k92266p05601j085741j408501j658294j828569j921385
$$ 31608783 32115993 32239015 31946749 31241148 30155407 28746906 27088612 25260043 23338658
57066B3338658j945140j911372j832789j722646j593790j456849j319143j185307
$$ 23338658 21393518 19482146 17649357 15926711 14332921 12876072 11556929 10371622
57058A0371622j058416r40469q32479p34833o47642n70645n03146m44240l93084
$$ 10371622 9313206 8372737 7540258 6805425 6157783 5587138 5083992 4639752 4246668
57049D246668l48983l11433k79979k53661k30800k09925j90810j73987j59274
$$ 4246668 3897685 3586252 3306273 3052612 2821812 2611887 2421077 2247090 2087816
57040B087816j45603j32230j19198j06408r3250p9559o6018n3088m0363k7493
$$ 2087816 1942213 1809983 1690785 1584377 1491127 1411568 1345550 1292462 1252099 1224606
57030A224606j4807k633Q586J6324J5468K033k2208m9822p2600q5984q9592q5529
$$ 1224606 1209799 1207166 1215752 1232076 1247544 1249577 1227369 1177547 1104947 1018963 929371 843842
57018H43842p6963o7087n8007n0228m3333l6970l1334k6940k4040k2112k0110
$$ 843842 766879 699792 641785 591557 548224 511254 479920 452980 428940 406828 386718
57007C86718j7501j4807j2828j1640j0755r935r255q618p822o970o248n435m239
$$ 386718 369217 354410 341582 329942 319187 309252 299997 291379 283557 276587 270339 264904 260665
56994B60665k992k368k460k689k614k269j720r02J11J131K200L366M199M142L291
$$ 260665 257673 255305 252845 250156 247542 245273 243553 242651 242762 243893 246093 249459 253658 257800 261091
56979B61091K175O91j880n581r200j1399j1961j1482j0380q690o590m531k841
$$ 261091 263266 263957 262077 256496 247296 235897 223936 212454 202074 193384 186794 182263 179422
56966A79422j499l09R11K261L765N426P279R326J1374J3054J4036J4135J3209
$$ 179422 177923 177614 178525 180786 184551 189977 197256 206582 217956 231010 245046 259181 272390
56953B72390J1032P414K474l084q083j1531j3254j3739j3396j2313j0718r143
$$ 272390 283422 290836 293310 290226 282143 270612 257358 243619 230223 217910 207192 198049
56941A98049p736n857k962M38L233N126P010R812J3379J6680J8827J9642J9338
$$ 198049 190313 184456 181494 181932 185165 190291 197301 207113 220492 237172 255999 275641 294979
56928B94979J7877J4810R867L477l455j0231j6431k1350k3965k3773k1397j8110
$$ 294979 312856 327666 337533 341010 337555 327324 310893 289543 265578 241805 220408 202298
56916B02298j5011j2711j1315j0354r136p487n879m649l587k596k102k298k476
$$ 202298 187287 174576 163261 152907 143771 136284 130405 125756 122169 119573 117471 115173 112697
56903A12697j827n33N31R28R07P61O07O86J288K420L921N724P679R383J0675J1941
$$ 112697 110870 110337 110868 111796 112703 113464 114071 114757 116045 118465 122386 128110 135789 145172 155847 167788
56887A67788J3439J4669J5024J4698J4164J3019J0265N736N61l934p225r406j0587
$$ 167788 181227 195896 210920 225618 239782 252801 263066 268802 269363 265429 258204 248798 238211
56874B38211j0662r373o675l197j04K000L818O585J0696J5524K0176K4080K7185
$$ 238211 227549 218176 211501 208304 208200 210200 214018 220603 231299 246823 266999 291079 318264
56861C18264L0094L3557L7176L9126L7822L3384K6707J7788O284o551j7916k5667
$$ 318264 348358 381915 419091 458217 496039 529423 556130 573918 580202 573651 555735 530068
56849E30068k9529l0177k8205k4228j8937j2695n691J474Q106J4283K0627K7252
$$ 530068 500539 470362 442157 417929 398992 386297 380606 382080 390186 404469 425096 452348
56837D52348L3889M0827M8448N5769O0746O2274O0556N5151M4233K6853M954j7643
$$ 452348 486237 527064 575512 631281 692027 754301 814857 870008 914241 941094 946048 928405
56825I28405l7481n2205o0378o1970n8601n2388m4686l6298k8114k0641j3432
$$ 928405 890924 838719 778341 716371 657770 605382 560696 524398 496284 475643 462211
56814D62211n838K003R515J6573K3355K9642L5007L9348M2496M3414M0429L2371
$$ 462211 456373 458376 467891 484464 507819 537461 572468 611816 654312 697726 738155 770526
56802G70526J9345K755j5002l1176m3603n1214n3810n1935m7067m1144l5251k9216
$$ 770526 789871 792626 777624 746448 702845 651631 597821 545886 498819 457675 422424 393208
56790C93208k2731j6292j0590n660j247K647O235J0308J5201J9814K2535K2833
$$ 393208 370477 354185 343595 337935 336688 339335 345570 355878 371079 390893 413428 436261
56778D36261K1099J7249J0674J587q475j7792k5389l0776l3490l3431l1172k7664
$$ 436261 457360 474609 485283 486870 478395 460603 435214 404438 370948 337517 306345 278681
56766B78681k3794k0312j7746j6069j4703j3074j1161r379q030p020o084n193
$$ 278681 254887 234575 216829 200760 186057 172983 161822 152443 144413 137393 131309 126116
56754A26116m585m329m126l771l519l609l579k744j315l39k84m47o6O11R07P11
$$ 126116 121531 117202 113076 109305 105786 102177 98598 95854 94539 94200 93916 93469 93403 94014 94921 95632
56738I5632L25j99q14j020m00N44Q30K13n59p46l20K33M24L9o50r71m69N59J401
$$ 95632 95957 95758 94944 93924 93524 94068 94898 95111 94552 93806 93486 93719 94143 94182 93532 92561 92092 92651 94052
56719I4052J705J595J296R73Q05P82N81M0l46L7R63J484J163O56P60J281J311
$$ 94052 95757 97352 98648 99621 100426 101208 101789 101829 101483 101520 102483 103967 105130 105786 106546 107827 109138
56702A09138N45j83K6Q14R04k41j621j923j057J00J014J694J894J214J27k48K34
$$ 109138 109683 109500 109526 110340 111244 111003 109382 107459 106402 106502 107516 109210 111104 112318 112445 112197 112431
56685A12431M63j36o14o5Q46R74M18ol43j101j733j071P10K010J965J361J012
$$ 112431 112894 112758 112144 112079 112925 113899 114317 114311 113968 112867 111134 110063 110773 112783 114748 116109 117121
56668A17121N48n05j524j642j091p04n48p7O69J020Q28P66J188J480R96J92J61
$$ 117121 117669 117164 115640 113998 112907 112203 111655 111578 112247 113267 114095 114861 116049 117529 118525 118717 118878
56651A18878J271K717L423L019J919Q52M09O77J146J182P35L72M70P71R05Q88
$$ 118878 120149 122866 126289 129308 131227 132079 132488 133165 134311 135493 136228 136600 137070 137841 138746 139634
56635A39634Q12M82j48o09n39m01q07j441j412n68L57Q17Q70N61j72r13j064p96
$$ 139634 140446 140928 140780 140171 139632 139231 138424 136983 135571 135003 135360 136177 137047 137608 137436 136523 135459 134663
56617A34663q50j216j078k98K01k2k28N4N6q93k045k262j565p10J5O06O77P6l89
$$ 134663 133813 132597 131519 131221 131422 131400 131172 131226 131282 130389 128344 126082 124517 123807 123822 124428 125105 125181 124792
56598A24792P0R25J069L93l58r06j459j725j102J92J106J056M54K0J72R11J667
$$ 124792 124862 125787 126856 127249 126891 125985 124526 122801 121699 121891 122997 124053 124507 124527 124699 125610 127277
56581A27277J570M91n11m47L82J153J821K681L173K490J107L43N71R87J166J503
$$ 127277 128847 129338 128827 128380 128762 129915 131736 134417 137590 140080 141187 141530 142101 143088 144254 145757
56565A45757K153K693L029L611M505N300N961O829P745Q112P883P466O672M913
$$ 145757 147910 150603 153632 157243 161748 167048 173009 179838 187583 195695 203578 211044 217716 222629
56551B22629K503O00l22p37q80n38k15q83k266k810k004j281j888l157l793l667
$$ 222629 225132 225732 225410 224673 223793 223255 223040 222157 219891 217081 215077 213796 211908 208751 204958 201291
56535B01291l378l035k539k257k413k464j942j257q90n23K10P91N60j57n55n68
$$ 201291 197913 194878 192339 190082 187669 185205 183263 182006 181116 180593 180803 181594 182154 181997 181442 180874
56519A80874p70j399k175k734k720j897o69M0o0k02K12O88N96K22P5m1m08n64
$$ 180874 180104 178705 176530 173796 171076 169179 168510 168550 168490 168288 168500 169188 169784 170006 170081 170040 169632 169068
56501A69068j28K24k49r41p30J43M09k36p69n62j88k34m49m20k77k28j06J98L66
$$ 169068 168940 169164 168915 167974 167244 167387 167796 167560 166791 166229 166041 165807 165358 164938 164661 164433 164327 164525 164891
56482A64891J63j39j36K04O39R24Q82M99N4r9rm9l39m64L8J127K229K672K201
$$ 164891 165054 164915 164779 164983 165622 166546 167428 167927 167981 167882 167873 167824 167485 167021 167059 168186 170415 173087 175288
56463A75288J174K37k59l38j0P99J730J998J318M26J44K96J42l71n57j22L51L11
$$ 175288 176462 176699 176440 176102 176092 176891 178621 180619 181937 182363 182507 182803 182945 182574 182017 181895 182246 182557
56445A82557J9J31P83J434J477Q57J01k52j88j50m14p60q31n56j45J37P8l18o31
$$ 182557 182576 182707 183490 184924 186401 187258 187359 187107 186919 186769 186355 185595 184764 184208 184063 184200 184278 183960 183329
56426A83329l49M31R77Q32L95K98O21R93J156J027N58qj25L85R00P87L06K00N74
$$ 183329 182980 183411 184388 185220 185615 185913 186534 187527 188683 189710 190268 190260 190135 190520 191420 192207 192513 192713 193287
56407A93287Q68P85O12N39L37o6k26K13Q49Q83J60m54O9J706L269L559K575J319
$$ 193287 194155 194940 195552 196091 196428 196362 196136 196349 197198 198081 198241 197787 197856 199562 202831 206390 208965 210284
56389B10284O49O01P19O46L35O8J96N79M69n39j616j499j81J079J450J356J362
$$ 210284 210933 211534 212253 212899 213234 213302 213498 214077 214546 214007 212391 210892 210711 211790 213240 214596 215958
56372B15958J294R84Q76J244J562J455J540K453L638L940L082J741N41k82n99
$$ 215958 217252 218236 219112 220356 221918 223373 224913 227366 231004 234944 238026 239767 240308 240026 239427
56357B39427m20l7M41J282K368K884K384J602J354J252M49p97j417j075l59K73
$$ 239427 239007 238970 239411 240693 243061 245945 248329 249931 251285 252537 252986 252189 250772 249697 249338 249611
56341B49611Q20J116R80Q03J138J738J967J958K348L051L323L097L068L392L388
$$ 249611 250431 251547 252527 253330 254468 256206 258173 260131 262479 265530 268853 271950 275018 278410 281798
56326B81798K754K105K007K374L004L774M135L442K088J283J298J026j72j307
$$ 281798 284552 286657 288664 291038 294042 297816 301951 305393 307481 308764 310062 311088 310916 309609
56312C09609j183j32O80R26J122J423J505J412J628K266K916L406M083N112O013
$$ 309609 308426 308294 308974 309900 311022 312445 313950 315362 316990 319256 322172 325578 329661 334773 340786
56297C40786O151N460M464L744L537L728M039M208M103L834L775M293N370O506
$$ 340786 346937 352397 356861 360605 364142 367870 371909 376117 380220 384054 387829 392122 397492 403998
56283D03998P148P160O863O756P147P992R010J0075J1347J2776J3718J3624J3067
$$ 403998 411146 418306 425169 431925 439072 447064 456074 466149 477496 490272 503990 517614 530681
56270E30681J3368J5006J7071J8568J9562K0650K2048K3773K6110K9204L2655
$$ 530681 544049 559055 576126 594694 614256 634906 656954 680727 706837 736041 768696
56259G68696L6093L9706M3689M7828N2258N7898O5367P4047Q3066R2535J02911
$$ 768696 804789 844495 888184 936012 988270 1046168 1111535 1185582 1268648 1361183 1464094
56248A464094J13740J24231J34483J44934J54953J63297J69596J74024J75737
$$ 1464094 1577834 1702065 1836548 1981482 2136435 2299732 2469328 2643352 2819089
56239B819089J73132J65806J54796J40719J22943J00999P5600M7848J8514j1382
$$ 2819089 2992221 3158027 3312823 3453542 3576485 3677484 3753084 3800932 3819446 3808064
56229C808064m0223o6631r0055j10257j26905j39873j49266j54981j57013j56162
$$ 3808064 3767841 3701210 3611155 3500898 3373993 3234120 3084854 2929873 2772860 2616698
56219B616698j53633j49743j43931j36179j27576j19214j11280j03441r5364q6799
$$ 2616698 2463065 2313322 2169391 2033212 1905636 1786422 1675142 1571701 1476337 1389538
56209A389538p7982o9954o3705n8935n4514n0017m5808m1836l7639l3561l0512
$$ 1389538 1311556 1241602 1177897 1118962 1064448 1014431 968623 926787 889148 855587 825075
56198H25075k8339k5803k2536j9622j7835j6622j5361j4251j3302j1788r551p669
$$ 825075 796736 770933 748397 728775 710940 694318 678957 664706 651404 639616 630065 622396
56186F22396o952o761o193n412m939m538l794l048k833k891k582j780p40L76J315
$$ 622396 615444 608683 602490 597078 592139 587601 583807 580759 577926 575035 572453 570673 569933 570309 571624
56171E71624J681J570J639K100K428K462K925M256N743O512O633O651O753O982
$$ 571624 573305 574875 576514 578614 581042 583504 586429 590685 596428 602940 609573 616224 622977 629959
56157F29959P668Q922J0269J1274J2005J2640J3331J4672J7405K1239K4943K8050
$$ 629959 637627 646549 656818 668092 680097 692737 706068 720740 738145 759384 784327 812377
56145H12377L1473L6028M1466M7497N4564O2715P0648P6758Q0402Q1462P9593
$$ 812377 843850 879878 921344 968841 1023405 1086120 1156768 1233526 1313928 1395390 1474983
56134A474983P4662O7274N8340M8856M0423L4786L2081L0500K8234K4842K0314
$$ 1474983 1549645 1616919 1675259 1724115 1764538 1799324 1831405 1861905 1890139 1914981 1935295
56123A935295J4235O821n18o624j1769j6663k1525k6920l4146m3585n3711o2736
$$ 1935295 1949530 1956351 1955833 1949209 1937440 1920777 1899252 1872332 1838186 1794601 1740890 1678154
56111A678154p0121p5503p7473p4970o8995o1631n3955m6116l8479l1581k5477
$$ 1678154 1608033 1532530 1455057 1380087 1311092 1249461 1195506 1149390 1110911 1079330 1053853
56100A053853k0223j6222j3271j0216o623l731k610k330j274N96K092K691K882
$$ 1053853 1033630 1017408 1004137 993921 987298 983567 980957 978627 977353 977949 980041 982732 985614
56087I85614L204L983N379O843P281O606O213P055Q305Q789Q627Q518Q620R077
$$ 985614 988818 992801 998180 1005023 1012304 1018910 1025123 1032178 1040483 1049272 1057899 1066417 1075037 1084114
56073A084114J0383J2165J2949J2338J1955J3034J4570J5202J5357J5933J6425
$$ 1084114 1094497 1106662 1119611 1131949 1143904 1156938 1171508 1186710 1202067 1218000 1234425
56062A234425J6150J5960J6898J8300J8981J9219J9841K0561K0840K1319K2604
$$ 1234425 1250575 1266535 1283433 1301733 1320714 1339933 1359774 1380335 1401175 1422494 1445098
56051A445098K3895K4280K4162K3992K3188K1812K1429K2551K3269K2441K2070
$$ 1445098 1468993 1493273 1517435 1541427 1564615 1586427 1607856 1630407 1653676 1676117 1698187
56040A698187K3999K6462K6869K6108K6882K9321L1545L3351L5952L9069M1483
$$ 1698187 1722186 1748648 1775517 1801625 1828507 1857828 1889373 1922724 1958676 1997745 2039228
56029B039228M3590M6414M8945M9497M8875M9151N0204N0537N0579N2040N4751
$$ 2039228 2082818 2129232 2178177 2227674 2276549 2325700 2375904 2426441 2477020 2529060 2583811
56018B583811N7243N9671O3075O6711O9248P1693P5849Q0847Q4550Q7360R1232
$$ 2583811 2641054 2700725 2763800 2830511 2899759 2971452 3047301 3128148 3212698 3300058 3391290
56007C391290R5975J00038J03951J09356J15602J20966J26126J32781J40170J46820
$$ 3391290 3487265 3587303 3691254 3800610 3916212 4037178 4163304 4296085 4436255 4583075
55997D583075J54245J64608J76285J86295J95603K07187K20398K32520K44578
$$ 4583075 4737320 4901928 5078213 5264508 5460111 5667298 5887696 6120216 6364794
55988F364794K59979K78464K97157L16609L39888L66607L93940M22788M56643
$$ 6364794 6624773 6903237 7200394 7517003 7856891 8223498 8617438 9040226 9496869
55979I496869M95177N35389N78297O27875O84307P45282Q12909Q91974R82663
$$ 9496869 9992046 10527435 11105732 11733607 12417914 13163196 13976105 14868079 15850742
55970A5850742J082998J197152J332774J491708J672904J883126K134764K435035
$$ 15850742 16933740 18130892 19463666 20955374 22628278 24511404 26646168 29081203
55962B9081203K789224L213613L733077M367799N136495O071605P216184Q606538
$$ 29081203 31870427 35084040 38817117 43184916 48321411 54393016 61609200 70215738
55954G0215738J0271918J2242538J4529017J7088541J9829081K2635925K5351994
$$ 70215738 80487656 92730194 107259211 124347752 144176833 166812758 192164752
55947A92164752K7722309K9384409K9892655K8680204K5029767J8322018Q610095
$$ 192164752 219887061 249271470 279164125 307844329 332874096 351196114 359806209
55940C59806209k943003j4316882k3518551k9414997l1937408l1726259k9668937
$$ 359806209 356863206 342546324 319027773 289612776 257675368 225949109 196280172
55933A96280172k6609310k3210342j9898435j6887840j4261529j2035716j0181398
$$ 196280172 169670862 146460520 126562085 109674245 95412716 83377000 73195602
55926G3195602q641582p360951o298753n417650m679303m055916l532465l093608
$$ 73195602 64554020 57193069 50894316 45476666 40797363 36741447 33208982 30115374
55918C0115374k719656k397310k122466j889299j686644j507305j351215j216672
$$ 30115374 27395718 24998408 22875942 20986643 19299999 17792694 16441479 15224807
55910A5224807j097180r89113q94264q12375p38702o71028o11850n61511n15838
$$ 15224807 14127627 13138514 12244250 11431875 10693173 10022145 9410295 8848784 8332946
55901H332946m72686m34511m02358l73115l44757l18895k96274k74820k53807
$$ 8332946 7860260 7425749 7023391 6650276 6305519 5986624 5690350 5415530 5161723
55892E161723k35100k18820k02482j85753j71382j60076j49156j37749j28840
$$ 5161723 4926623 4707803 4505321 4319568 4148186 3988110 3838954 3701205 3572365
55883C572365j24339j22270j20436j19020j17878j14984j09431j02863r6549q9928
$$ 3572365 3448026 3325756 3205320 3086300 2968422 2853438 2744007 2641144 2544595 2454667
55873B454667q3102p7643p3946p0677o7676o6290o6154o4813o1451n7885n5059
$$ 2454667 2371565 2293922 2219976 2149299 2081623 2015333 1949179 1884366 1822915 1765030 1709971
55862A709971n1684m7305m3486m0910l8182l4658l1627k9670k7590k5011k3358
$$ 1709971 1658287 1610982 1567496 1526586 1488404 1453746 1422119 1392449 1364859 1339848 1316490
55851A316490k3233k3419k3465k4597k7059k9032k9393k9141k9121k8613k7179
$$ 1316490 1293257 1269838 1246373 1221776 1194717 1165685 1136292 1107151 1078030 1049417 1022238
55840A022238k5737k4780k3601k2069k1099k0683j9592j7678j6309j5873j5111
$$ 1022238 996501 971721 948120 926051 904952 884269 864677 846999 830690 814817 799706
55829G99706j3553j2355j2013j1444j0107q944q598q717r452j1362j3456j3835
$$ 799706 786153 773798 761785 750341 740234 731290 722692 713975 704523 693161 679705 665870
55817F65870j2709j2246j2952j2932j1485j0383j0562j0451q981p495p071o573
$$ 665870 653161 640915 627963 615031 603546 593163 582601 572150 563169 555674 548603 542030
55805E42030n037l651l512l529k403p86J81Q08J629J998J484J035J284J205j2
$$ 542030 536993 533342 529830 526301 523898 523112 523293 524101 525730 527728 529212 530247 531531 532736 532724
55790E32724j283j289l47O29J558K256J734j57j906k607l561o159r645j2474j4388
$$ 532724 531441 530152 529805 530434 531992 534248 535982 535825 533919 531312 527751 521592 511947 499473 485085
55775D85085j5539j5076j2460r054o610m987k926k77J887K672J614j502n830r295
$$ 485085 469546 454470 442010 432956 426346 421359 418433 418156 420043 422715 424329 422827 416997 407702
55761D07702j0454r872q847p767o584n723n314m618l287k209k146k652l304m638
$$ 407702 397248 387376 378529 370762 364178 358455 353141 348523 345236 343027 340881 338229 334925 330287
55747C30287o729q207q087p346p295p521o908n652m727m178l458k697k319k102
$$ 330287 323558 315351 307264 299918 292623 285102 278194 272542 267815 263637 260179 257482 255163 253061
55733B53061j795j856k420k532j657q74j240j983j878j444k023l486m531m739
$$ 253061 251266 249410 246990 244458 242801 241927 240687 238704 236826 235382 233359 229873 225342 220603
55719B20603m699m475l582k212j092l03O14J631K407L103L988M620M450L786L227
$$ 220603 215904 211429 207847 205635 204543 204240 204854 206485 208892 211995 215983 220603 225053 228839 232066
55704B32066K621J552K66q63k098l621m796n220n615o523p068o308m908m016l331
$$ 232066 234687 236239 236505 235642 233544 229923 225127 219907 214292 207769 200701 194393 189485 185469 182138
55689A82138k033p15o19j359j345k06R35J415J589J569J133Q41J534K631K552
$$ 182138 180105 179390 178771 177412 176067 175861 176796 178211 179800 181369 182502 183343 184877 187508 190060
55674A90060J039m18p83o16o84r00j004j129j195q25k57k74q56j040m59P6K5O2
$$ 190060 191099 190681 189898 189282 188598 187698 186694 185565 184370 183545 183288 183014 182158 181118 180659 180735 180760 180822
55656A80822Q43J786J900J255P87R52J317J360J149R76P19r7j429k268j667j60
$$ 180822 181665 183451 185351 186606 187393 188345 189662 191022 192171 193147 193866 193769 192340 190072 188405 188245
55640A88245O23n7j244j910k337l161m061m406m532n097n733n584m813m324m162
$$ 188245 188868 188811 187567 185657 183320 180159 176098 171692 167160 162063 156330 150746 145933 141609 137447
55625A37447l532k290j154m21K80Q63O08n23j447j324n83k00n94j455k165k194
$$ 137447 133915 131625 130471 130050 130330 131193 131801 131278 129831 128507 127924 127724 127130 125675 123510 121316
55609A21316j579j053j240j789j919j606j475j654j697j555j714k147k082j160
$$ 121316 119737 118684 117444 115655 113736 112130 110655 109001 107304 105749 104035 101888 99806 98646
55595I8646q3K94j5l62k30L77R87R41N5r69j179m38N50J165J380J397J345J438
$$ 98646 98563 98857 98842 98480 98250 98627 99614 100555 100610 99641 98462 98024 98574 99739 101119 102516 103861 105299
55577A05299J899K664L376L778L894L927M246N177O522P543P720P226O372N025
$$ 105299 107198 109862 113238 117016 120910 124837 129083 134260 140782 148325 156045 163271 169643 174668
55563A74668L008N77j867m090n745o387o297o459p138p289o149m551l667l307
$$ 174668 177676 178253 176386 172296 166551 160164 153867 147408 140270 132981 126832 122281 118614 115307
55549A15307k627j785j558j844j910j748j841j922j411p35p75j184q51O8K71m54
$$ 115307 112680 110895 109337 107493 105583 103835 101994 100072 98661 97926 97151 95967 95116 95184 95455 95001
55533I5001p36K50J644K363K387K078J475Q49P89J204J168K73p99j423j797k207
$$ 95001 94265 94515 96159 98522 100909 102987 104462 105311 106100 107304 108472 108745 107946 106523 104726 102519
55517A02519k480k547k671k768k424j815j598j714j410p24o72j507k133j802j128
$$ 102519 100039 97492 94821 92053 89629 87814 86216 84502 83092 82368 81696 80189 78056 76254 75126
55502G5126q02n43j34k19j072j710j329o35o65j125j067m51P2L39M96K11p57j665
$$ 75126 74324 73781 73647 73428 72356 70646 69317 68682 68017 66892 65825 65374 65446 65785 66281 66492 65735 64070
55484F4070j557o86o7O4K98P82J010Q92R90J508J841J409L49p76j481j504r18
$$ 64070 62513 61827 61760 61824 62122 62904 63914 64806 65796 67304 69145 70554 70903 70127 68646 67142 66224
55467F6224j80K65L89L53P8n29j107j127o13j66k18o51j041j017m64L15P25N29
$$ 66224 66044 66309 66698 67051 67129 66600 65493 64366 63753 63587 63369 62718 61677 60660 60196 60511 61236 61765
55449F1765K13L60P89Q13K64k40j85J90L80L86N17O65L17n50j122p60k8m0p90
$$ 61765 61978 62338 63127 63940 64204 63964 63779 63969 64349 64735 65252 65917 66234 65684 64562 63802 63774 63734 62944
55430F2944j042r0J139J415Q91O14Q29Q56N24N53J313K155K287J643O31k84n83
$$ 62944 61902 61812 62951 64366 65257 65871 66700 67556 68080 68633 69946 72101 74388 76031 76662 76378 75795
55413G5795L7J138J877J998J827J296p4j938k992k607j748j580j959k033j677
$$ 75795 75832 76970 78847 80845 82672 83968 83894 81956 78964 76357 74609 73029 71070 69037 67360
55398F7360j472j604j621j159l34M54P46L34l82o58l30M3J76N45J386J949J471
$$ 67360 65888 64284 62663 61504 61170 61624 62370 62704 62322 61664 61334 61377 61553 62098 63484 65433 66904
55381F6904L90k18l6L70N57N53L92J5m06o44q17j128j330j032m02%Kj37l80r43
$$ 66904 67294 67076 67040 67410 67967 68520 68912 68927 68521 67877 67060 65932 64602 63570 63168 63168 63170 63033 62653 61710
55361F1710j615j689q62K62Q67Q38P10Q68J058P82Ko71o31kN13N23L34L65N02
$$ 61710 60095 58406 57544 57806 58673 59511 60221 61089 62147 62929 62931 62260 61629 61627 62140 62663 62997 63362 63864
55342F3864L49j36n81p00o08o30r00j207j154o13M9L49K22M6J54N42R23R28M55
$$ 63864 64213 64077 63496 62796 62188 61558 60658 59451 58297 57684 57733 58082 58304 58350 58504 59046 59969 60897 61352
55323F1352L9M46J440J574l3k089k463q96Q28J454J497J611J268K7j268j707j766
$$ 61352 61391 61837 63277 64851 64818 62729 60266 59370 60198 61652 63149 64760 66028 66055 64787 63080 61314
55306F1314k221k439j310N90J433O63l26k90L89Q48J153J779K376K081Q14m28
$$ 61314 59093 56654 55344 55934 57367 58030 57704 57414 57803 58651 59804 61583 63959 66040 66854 66426
55290F6426p28k17K51J89r4r3J75L12J33k21o83j178j243l70J054J846J486Q25
$$ 66426 65698 65481 65732 65921 65827 65734 65909 66221 66354 66133 65450 64272 63029 62659 63713 65559 67045 67870
55272F7870Q35J229J036Q4q55j217j199j175j162r51l59O17J544J713Q69l02r04
$$ 67870 68705 69934 70970 71054 70199 68982 67783 66608 65446 64495 64136 64753 66297 68010 68879 68577 67673
55255F7673p91m00P2O78J031M77q58j862j667o70K1q4m53l38K90P80O82L46M51
$$ 67673 66882 66482 66554 67232 68263 68740 67882 66020 64353 63683 63704 63620 63167 62829 63119 63899 64581 64927 65378
55236F5378J058J459J077J97l98l68j35l59j229k164k295j344kQ42J033R58P22
$$ 65378 66436 67895 68972 69169 68771 68403 68268 67909 66680 64516 62221 60877 60875 61717 62750 63708 64430
55219F4430K00k18J60J120J565J096O29Q55J029K28r80j262m51L80O23P37J117
$$ 64430 64630 64412 64572 65692 67257 68353 68982 69837 70866 71094 70114 68852 68401 68781 69404 70141 71258
55202G1258J395J164O41K14r6m29o95p20n10k46k10o05j233j461r05p2J47l69
$$ 71258 72653 73817 74458 74672 74576 74147 73452 72732 72222 71976 71766 71161 69928 68467 67562 67490 67637 67268
55184F7268p55k31R60J805J537L09r91j567j394j055r03o94j65M51P56P59P35
$$ 67268 66513 66282 67242 69047 70584 70893 69902 68335 66941 65886 64983 64289 64124 64575 65331 66090 66825
55167F6825P46O52M53K89J74J4k01m15n77n98m07j71k05n11p65q37r09r47o17
$$ 66825 67571 68223 68676 68965 69139 69153 68952 68537 67960 67362 66955 66784 66579 66068 65303 64466 63557 62610 61993
55148F1993K6L91K58J89N80R35P21L73P12J651K312K153J406M76m18j106j444
$$ 61993 62019 62410 62668 62857 63437 64372 65093 65466 66178 67829 70141 72294 73700 74176 73758 72652 71208
55131G1208j384q43K04J274J528Q15Kk18k30o52j222j324j057q31m23N47J503
$$ 71208 69824 68981 69185 70459 71987 72802 72804 72586 72356 71704 70482 69158 68101 67270 66847 67394 68897
55114F8897J452M30n09p53o25m49n7N68J023J046Q00N05L17M81J035J496J421
$$ 68897 70349 70779 70270 69517 68892 68443 68386 68954 69977 71023 71823 72328 72645 73126 74161 75657 77078
55097G7078J071R53R49O45J75k9j6PM00J424K231J714K72o02m96m28q81r94k00
$$ 77078 78149 79102 80051 80696 80871 80842 80826 80833 81233 82657 84888 86602 86874 86272 85776 85348 84467 83473 83273
55078H3273P14R24Q27J111J498J321O83J47k36q17j507j750j248l06M29M43j83
$$ 83273 83987 84911 85738 86849 88347 89668 90351 90498 90262 89445 87938 86188 84940 84634 85063 85506 85323
55061H5323o96m37K99N89J15n53q47p76n06j34K6l35q31p36j98j71q34j082j83
$$ 85323 84627 84190 84489 85078 85193 84640 83793 83017 82511 82377 82403 82068 81237 80501 80303 80132 79298 78216 78033
55042G8033J004J155K17p99j176r19k67M80Q88P67M85M58N73M89K47R9K8j61l61
$$ 78033 79037 80192 80409 79610 78434 77515 77248 77728 78616 79383 79868 80326 80899 81388 81635 81734 81762 81601 81240
55023H1240k40K20N45K02q06j757j830j038k77j31m4O80J559J533O71J52N09J029
$$ 81240 81000 81220 81765 81967 81161 79404 77574 76536 76259 76128 76084 76764 78323 79856 80527 80679 81188 82217
55005H2217J128J116J194Q67m5p82p34l77l20l55j05J00o8j58L20R03Q78M32K44
$$ 82217 83345 84461 85655 86522 86477 85695 84961 84584 84264 83909 83804 83904 83836 83678 83998 84901 85779 86211 86455
54986H6455L53L06Q5J0N1k3o0J23J84k43p77q26n25l88l39RM04K52k60l22K59
$$ 86455 86808 87114 87199 87209 87260 87237 87177 87300 87484 87241 86464 85638 85113 84725 84386 84395 84799 85051 84791 84469 84728
54965H4728Q82J199J429J557J156K52l78k16L43O40N27J98k10n30n09j58J26O9
$$ 84728 85610 86809 88238 89795 90951 91203 90825 90609 90952 91592 92119 92317 92107 91577 91068 90910 91036 91105
54947I1105q0N2M26N95K04o63j491j696j154l42J68K73K32J90J17P5K00M73P86
$$ 91105 91025 91077 91503 92098 92302 91639 90148 88452 87298 86956 87124 87397 87629 87819 87936 88011 88211 88684 89470
54928H9470J166J578J647J049J36k86J15R58J850K808L753M197L946L741M481
$$ 89470 90636 92214 93861 94910 95046 94760 94875 95833 97683 100491 104244 108441 112387 116128 120609
54913A20609N834O364N326L748L107L265K638M83j893k848k562k599l672m897
$$ 120609 126443 132807 138133 141881 144988 148253 150891 151374 149481 146633 144071 141472 137800 132903
54899A32903n273m911m498m311m174l765k692r10O52O66q92k361k343j284m97
$$ 132903 127630 122719 118221 113910 109736 105971 103279 102369 103021 103687 102795 100434 98091 96807 96310
54884I6310k70N8O42R58R03J001J480J984K330K769L285L449L228L269L974M786
$$ 96310 96040 96098 96740 97698 98601 99602 101082 103066 105396 108165 111450 114899 118127 121396 125370 130156
54868A30156M857M117L259K875K839K479J307m25j908k679l132l861m694m923
$$ 130156 135013 139130 142389 145264 148103 150582 151889 151464 149556 146877 143745 139884 135190 130267
54854A30267m408l837l711l700l286k644k364k546k680k368j824j520j614j867
$$ 130267 125859 122022 118311 114611 111325 108681 106317 103771 101091 98723 96899 95379 93765 91898
54840I1898k001j920j575q25K85J233J309M54m88o35l7N17N27K69K03L26K97m0
$$ 91898 89897 87977 86402 85577 85862 87095 88404 88858 88370 87735 87698 88215 88742 89011 89214 89540 89837 89797
54822H9797m76o88n18m7M30N73K71k14n29n89n50m07P2Q70J407J139L30j46J28
$$ 89797 89321 88633 88115 88068 88498 89071 89342 89128 88599 88010 87460 87053 87125 87995 89402 90541 90871 90725 90853
54803I0853O97R44Q43O88N39K60j17m71p74r24o89j64N6k89o47m19Q9K22Q8K19
$$ 90853 91550 92494 93337 94025 94564 94824 94707 94236 93462 92538 91849 91685 91741 91452 90805 90386 90475 90697 90785 91004
54783I1004M47J26n80p40r5N84Q35J153J874K411K240J815J861K331K711K815
$$ 91004 91451 91577 90997 90257 90162 90746 91581 92734 94608 97019 99259 101074 102935 105266 107977 110792
54767A10792K695K275J715J658K520L798M619M725M522M450M654M938M812L879
$$ 110792 113487 115762 117477 119135 121655 125453 130072 134797 139319 143769 148423 153361 158173 162052
54753A62052K453J215J63j458l819n909o729o440n800n091m245l367k536j628
$$ 162052 164505 165720 165883 164425 160606 154697 147968 141528 135728 130637 126392 123025 120489 118861
54739A18861q79r80j951k670k377j867k215k900k425n74J150J385L34p71r00J18
$$ 118861 117982 117002 115051 112381 110004 108137 105922 103022 100597 100023 101173 102558 102892 102121 101221 101339
54723A01339J593K525K473J881J391J288J845L389N455O617O041M652L876L770
$$ 101339 102932 105457 107930 109811 111202 112490 114335 117724 123179 129796 135837 140489 144365 148135
54709A48135L312K044L13j659l750n220n335m560m052l975l496k474j866k153
$$ 148135 151447 153491 153804 152145 148395 143175 137840 133280 129228 125253 121757 119283 117417 115264
54695A15264k587k397j837j508j432j279r82o68l32L9L43M08P2o90j428j378m49
$$ 115264 112677 110280 108443 106935 105503 104224 103242 102574 102242 102281 102624 103032 103104 102414 100986 99608 99159
54678I9159M01L57j82m58o37j257j870j579o56j96k73O9Q83R62r9j000n85O27
$$ 99159 99560 99917 99735 99277 98640 97383 95513 93934 93278 93082 92809 92878 93761 94723 94624 93624 93039 93666
54660I3666J487J700J432N43q20j690j363m86j68m65n83k68n0l37r24j386j396
$$ 93666 95153 96853 98285 98828 98008 96318 94955 94469 94301 93836 93253 92985 92935 92598 91674 90288 88892
54643H8892q22J07P92Q43N49M63O71P70N42K71L59P68J002O87O7l39m66o36p30
$$ 88892 88070 88177 88969 89812 90361 90824 91495 92265 92807 93078 93437 94205 95207 95894 95961 95622 95156 94520 93790
54624I3790j70Q81J190J18j127j035OL86j96m16L60J092Q05l5m94m50j86L13R08
$$ 93790 93620 94501 95691 95809 94682 93647 93653 94039 93843 93427 93787 94879 95684 95649 95155 94705 94519 94832 95740
54605I5740R78K39o75j001o97j56L37N62M69N36J215J911J457n9j147r67l77l42
$$ 95740 96718 96957 96282 95281 94584 94428 94765 95327 95796 96332 97547 99458 100915 100856 99709 98742 98365 98023
54587I8023n41l76j44k09o5O79J260R14K17J23L41j2o79o22K64J038J117P54K36
$$ 98023 97482 97106 96962 96753 96688 97367 98627 99541 99758 99881 100222 100210 99531 98909 99173 100211 101328 102082 102318
54568A02318k84m39r7N2o17j432j209r4N74K09m27o30n80m85j06M17L15n94j258
$$ 102318 102034 101595 101498 101550 100933 99501 98292 98198 98772 98981 98554 97924 97344 96859 96753 97170 97485 96891 95633
54549I5633n91J115K581K874K008N92o31j139r30l58L40J115J683J565P15j61
$$ 95633 95042 96157 98738 101612 103620 104212 103581 102442 101512 101154 101494 102609 104292 105857 106572 106411
54533A06411k79M42J342J669J234N51L06M87K64r00k294k660j735m67K94N74N97
$$ 106411 106132 106574 107916 109585 110819 111370 111676 112163 112427 111527 109233 106573 104838 104371 104665 105239 105836
54516A05836J43q49j610j257n4P31L06p59j276p92O9M52J79k12j77K29N28M13
$$ 105836 105979 105130 103520 102263 102209 102940 103246 102487 101211 100419 100488 100940 101119 100907 100730 100959 101487 101900
54498A01900O8j21rK23L67M17M80N81O59P08P27N91J73l60o04m07j11r1k75l43
$$ 101900 101968 101847 101838 102061 102428 102845 103325 103906 104565 105273 106000 106591 106764 106404 105800 105393 105282 105191 104916 104573
54478A04573j84J09N18J006J272R38L5r39j429j170l30N39R06Q17P32O96K55m83
$$ 104573 104389 104498 105016 106022 107294 108232 108267 107328 105899 104729 104399 104938 105844 106661 107393 108089 108344 107861
54460A07861m84P64K155K294J417Q38Q40N16m04j057j005q85j112j164p26l51
$$ 107861 107377 108141 110296 112590 114007 114845 115685 116201 115797 114740 113735 112850 111738 110574 109848 109497
54444A09497l75k60K58M29k32q98n94K97O65J96n40j031j059m77M47R33O06R7
$$ 109497 109122 108862 109120 109549 109317 108419 107825 108122 108787 108983 108443 107412 106353 105876 106323 107256 107862 107959
54426A07959J09M75O69O61N63J27o52j005l99N47R70J034J407J961K028J514Q29
$$ 107959 108068 108543 109212 109873 110436 110563 109911 108906 108507 109054 110024 111058 112465 114426 116454 117968 118797
54409A18797P5q21j489j574j398j361j121k64O48P60L14K21O11Q89J006J467K125
$$ 118797 118872 118051 116562 114988 113590 112229 111108 110844 111492 112252 112566 112787 113398 114287 115293 116760 118885
54392A18885K179J428N62O9k39n18n43k33K05O23Q68O28r8o32n23l10n49o48J64
$$ 118885 121064 122492 123054 123123 122884 122366 121823 121590 121795 122418 123286 123914 123816 123184 122661 122351 121802 121154 121318
54373A21318J256J345M86j51k47m32n94J55J566K157J487Q83J180J447Q03K8J80
$$ 121318 122574 123919 124405 124254 124007 123575 122981 123136 124702 126859 128346 129229 130409 131856 132659 132687 132867
54356A32867Q73J136J006J046J058N73J9K10R66J345J070P84J050J801K728L540
$$ 132867 133740 134876 135882 136928 137986 138559 138578 138788 139754 141099 142169 142953 144003 145804 148532 152072
54340A52072L873L457K428J137j64j304k092k526k768k771k337j708j568k111
$$ 152072 155945 159402 161830 162967 162803 161499 159407 156881 154113 151342 149005 147297 145729 143618
54326A43618k687k733k491k349k037j182j66K42m0l97m28l65n69r78j173q51k03
$$ 143618 140931 138198 135707 133358 131321 130139 129973 130215 130175 129778 129350 128985 128416 127438 126265 125414 125211
54309A25211J72p4n62o93n03n44r19j117r17p00o39l38L44P79M69q7q0M88R68
$$ 125211 125383 125309 124747 124054 123551 123007 122088 120971 120054 119354 118715 118377 118721 119500 119969 119882 119802 120290 121258
54290A21258R97Q02P05P69Q20N66n1n33l11L71O02J33k33P1M02o5j037j569j385
$$ 121258 122255 123057 123762 124531 125351 125917 125866 125333 125022 125393 125995 126128 125895 125966 126368 126303 125266 123697 122312
54271A22312r09l76K04N00J55m58n75j43J90J82L42R71J590J664J334J071R60
$$ 122312 121403 121027 121231 121731 121886 121428 120853 120710 120900 121082 121424 122395 123985 125649 126983 128054 129014
54254A29014P65M55L00M59P30Q37P82P52P05L11n11j242j276o87j14P8O6J5j86
$$ 129014 129779 130234 130534 130993 131723 132560 133342 134094 134799 135110 134599 133357 132081 131394 131280 131358 131424 131439 131253
54235A31253m88n98n08n92q64p74q6N52M79q3n15o93p61m87K97R63O92k32o46
$$ 131253 130765 130167 129659 129067 128203 127429 127343 127895 128374 128291 127776 127083 126322 125835 126132 127095 127787 127555 126909
54216A26909r6O25P46N55P14J121J054K65o53r72o27k00k50p49j188j169p83l66
$$ 126909 126813 127438 128184 128739 129453 130574 131628 131893 131240 130268 129641 129441 129191 128442 127254 126085 125302 124936
54198A24936p1J28J73l6l76n17k75J87N91Q34R99J104R71L65o98j800k408k277
$$ 124936 124865 124993 125166 125130 124754 124237 123962 124149 124740 125574 126573 127677 128648 129013 128315 126515 124107 121830
54180A21830j597p38K1N75R34J114J032O48J99R4L81N75L41M0K03O23N83m9o08
$$ 121830 120233 119495 119516 120091 121025 122139 123171 123819 124018 124112 124493 125068 125409 125449 125652 126275 126858 126809 126201
54161A26201n84k06R3K38K06j55o53o19K22J090R69p9r95j015m55j09k92o15n24
$$ 126201 125617 125411 125504 125742 125948 125793 125140 124521 124743 125833 126802 126723 125728 124713 124258 124149 123857 123242 122718
54142A22718J22R75J569J679J373Q56M02K21K45J70r1k93l27m48o58l68O95J616
$$ 122718 122840 123815 125384 127063 128436 129292 129694 129915 130160 130330 130239 129946 129619 129171 128513 128145 128840 130456
54124A30456J290R0n01P3P60N43k95r42j188j094m33Q46K067K469K004J093O5
$$ 130456 131746 131836 131335 131408 132168 132711 132416 131474 130286 129192 128759 129605 131672 134141 136145 137238 137303
54107A37303p20p43J8P77Q02K57k58n12n56l17J18L12J35Q4L62K44q77k263k572
$$ 137303 136583 135840 135858 136635 137437 137694 137436 136924 136368 136051 136169 136481 136616 136700 137062 137306 136429 134166 131594
54088A31594j496Q2J306J942K003J619J245J320J736K085K215K066J412L47l59
$$ 131594 130098 130180 131486 133428 135431 137050 138295 139615 141351 143436 145651 147717 149129 149476 149117
54073A49117k20P7m00j247j151K12J729K346K122J586R62L39m0l1L35J077K109
$$ 149117 148897 148974 148574 147327 146176 146388 148117 150463 152585 154171 155133 155472 155432 155401 155736 156813 158922
54056A58922K870K795K170J893K284K891L514M570O157P592Q276Q448Q591Q641
$$ 158922 161792 164587 166757 168650 170934 173825 177339 181909 188066 195658 203934 212382 220973 229614
54042B29614Q279P565O725N644M082K260Q43L77R30K131L369M085M088L672L323
$$ 229614 237893 245458 252183 257827 261909 264169 265012 265389 266319 268450 271819 275904 279992 283664 286987
54027B86987L348L605L513K517P73p52j208p73l52m99r93j368j487j556j905k715
$$ 286987 290335 293940 297453 299970 300743 299991 298783 298010 297658 297159 296166 294798 293311 291755 289850 287135
54011B87135l767m549m848n034n524o230o850p277p310o489m890l607l552m146
$$ 287135 283368 278819 273971 268937 263413 257183 250333 243056 235746 229257 224367 220760 217208 213062
53997B13062m154l560l392l780l571k273j038j042j817k091j590j067r73r63o20
$$ 213062 208908 205348 201956 198176 194605 192332 191294 190252 188435 186344 184754 183687 182714 181751 181131
53982A81131j06O7m42j434k272k412j905j133k21P96J437J103J28l63J54R44J121
$$ 181131 181025 181092 180650 179216 176944 174532 172627 171494 171273 172069 173506 174609 174737 174374 174528 175472 176593
53965A76593P02K03j53k35K75J298K012J718P34r1l76k31L02J172J981K382K527
$$ 176593 177295 177498 177345 177110 177385 178683 180695 182413 183147 183056 182680 182449 182751 183923 185904 188286 190813
53948A90813K651K605K355K476L327M128L828K806K648M095O076P132P007O439
$$ 190813 193464 196069 198424 200900 204227 208355 212183 214989 217637 221732 227808 234940 241947 248386
53934B48386O025N872N982O396P013P633Q075Q205P929P356O774O356O046N752
$$ 248386 254411 260283 266265 272661 279674 287307 295382 303587 311516 318872 325646 332002 338048 343800
53920C43800N471N119M591M090M170N145O567P607P853P644P572P813P938P335
$$ 343800 349271 354390 358981 363071 367241 372386 378953 386560 394413 402057 409629 417442 425380 432715
53906D32715N874M144K985K668K753K761K850L575N037O552P178O464M576J870
$$ 432715 438589 442733 445718 448386 451139 453900 456750 460325 465362 471914 479092 485556 490132 492002
53892D92002j482n562j0393j5538j9922k2316k2235k0386j8003j5826j3876j2061
$$ 492002 490520 484958 474565 459027 439105 416789 394554 374168 356165 340339 326463 314402
53880C14402j0549r402q278o880n533m936n346o234o748o388n347m283l726l555
$$ 314402 303853 294451 286173 279293 273760 268824 263478 257244 250496 244108 238761 234478 230752 227197
53866B27197l232k659k396k776l179k772j791j358j965k835l026k554k017j623
$$ 227197 223965 221306 218910 216134 212955 210183 208392 207034 205069 202234 199208 196654 194637 193014
53852A93014j245j107j610k480k714j709m0J155J349Q54J51o36j466k019j918
$$ 193014 191769 190662 189052 186572 183858 182149 182109 183264 184613 185467 185618 184982 183516 181497 179579
53837A79579j213m02P1K40M69R99J601J676P57q60k096j953n39J009J655J342
$$ 179579 178366 177964 178035 178275 178744 179743 181344 183020 183777 182917 180821 178868 178329 179338 180993 182335
53821A82335P69N75R24J543K028K140K062K131K430K788L166L630L939L712L167
$$ 182335 183104 183679 184603 186146 188174 190314 192376 194507 196937 199725 202891 206521 210460 214172 217339
53806B17339L081L664M170M059L925M552N603O156O093O038O146N989N602N498
$$ 217339 220420 224084 228254 232313 236238 240790 246393 252549 258642 264680 270826 276815 282417 287915
53792B87915N552M936L524K318K012J999J409M36k00n35j258k569l877m605m805
$$ 287915 293467 298403 301927 304245 306257 308256 309665 310101 309901 309366 308108 305539 301662 297057 292252
53777B92252m942n378n997o258n755m875m438m566m457l658k944l263m269m761
$$ 292252 287310 281932 275935 269677 263922 259047 254609 250043 245586 241928 238984 235721 231452 226691
53763B26691m346l731l468l244k759k427k695l223l352k997k582k253j817j313
$$ 226691 222345 218614 215146 211902 209143 206716 204021 200798 197446 194449 191867 189614 187797 186484
53749A86484j125j375j656j569j152n77J97J111J688J452O33k7r5K35O42J029
$$ 186484 185359 183984 182328 180759 179607 179030 179227 180338 182026 183478 184111 184084 183989 184224 184866 185895
53733A85895J321J354J140R20P52M83J90K08N29P27P17J034J925K676K525J749
$$ 185895 187216 188570 189710 190630 191382 191865 192055 192263 192792 193519 194236 195270 197195 199871 202396 204145
53717B04145J250J276J321J104R13J079J598K269K748K622K005J736K355L117
$$ 204145 205395 206671 207992 209096 210009 211088 212686 214955 217703 220325 222330 224066 226421 229538
53703B29538K861J686Q71J149J944K409K332J862J233R63J550K577L015K655K432
$$ 229538 232399 234085 234956 236105 238049 240458 242790 244652 245885 246848 248398 250975 253990 256645 259077
53688B59077K855L048K047K74j018j321j148j109j439k081k735k956k633k153
$$ 259077 261932 264980 267027 267301 266283 264962 263814 262705 261266 259185 256450 253494 250861 248708
53674B48708j743j115j12P22P44J28m31n81m81l37k65m20p63r12o37l21n21j173
$$ 248708 246965 245850 245738 246460 247204 247332 246901 246320 245839 245502 245237 244817 244054 243142 242505 242184 241663 240490
53656B40490j683j610r55M7J063J719J859J679J434J155Q54O84P06P84R01J242
$$ 240490 238807 237197 236242 236289 237352 239071 240930 242609 244043 245198 246052 246736 247442 248226 249127 250369
53640B50369J698J797J410J047J044R92N09Q8N09J685K747L156L078K842K555
$$ 250369 252067 253864 255274 256321 257365 258357 258866 258954 259463 261148 263895 267051 270129 272971 275526
53625B75526K358K429K734L037L189L211L174L175L217L071K582K267K942M440
$$ 275526 277884 280313 283047 286084 289273 292484 295658 298833 302050 305121 307703 309970 312912 317352
53611C17352N392M893L821L627M357M793M335L647L432L552L634L696L770L511
$$ 317352 322744 327637 331458 335085 339442 344235 348570 352217 355649 359201 362835 366531 370301 373812
53597C73812K672J655J149J391J954K187J829J279J140J358J106k07k047l366
$$ 373812 376484 378139 379288 380679 382633 384820 386649 387928 389068 390426 391532 391325 389278 385912
53583C85912l865m123m531m756m383l595k998l000l434l704l290k335j550j354
$$ 385912 382047 377924 373393 368637 364254 360659 357661 354661 351227 347523 344233 341898 340348 338994
53569C38994j376j069n26k34k84l50l03k74k26j2J71p9p52j376j572j247l84Q42
$$ 338994 337618 336549 336023 335789 335505 335155 334852 334578 334352 334340 334511 334432 333680 332304 330732 329485 329101 329943
53551C29943J820J976J567J433J949K670L069L134L062K923K780K809L129L729
$$ 329943 331763 333739 335306 336739 338688 341358 344427 347561 350623 353546 356326 359135 362264 365993
53537C65993M547N375N828N838O016O991Q473R522R796R941J0636J1778J2793
$$ 365993 370540 375915 381743 387581 393597 400588 409061 418583 428379 438320 448956 460734 473527
53524D73527J3374J3650J3935J4402J4909J5233J5594J6595J8235J9494J9578
$$ 473527 486901 500551 514486 528888 543797 559030 574624 591219 609454 628948 648526
53513F48526J9198J9701K1185K2541K3222K3872K4926K5828K6115K6171K6313
$$ 648526 667724 687425 708610 731151 754373 778245 803171 828999 855114 881285 907598
53502I07598K6038K4950K3640K2836K2287K1365K0213J9458J9120J8737J8323
$$ 907598 933636 958586 982226 1005062 1027349 1048714 1068927 1088385 1107505 1126242 1144565
53491A144565J8324J8647J8625J8001J7301J7106J7423J7906J8244J8247J7925
$$ 1144565 1162889 1181536 1200161 1218162 1235463 1252569 1269992 1287898 1306142 1324389 1342314
53480A342314J7546J7244J6598J4990J2452R686P160M652J948n33k291l657n567
$$ 1342314 1359860 1377104 1393702 1408692 1421144 1430830 1437990 1442642 1444590 1444057 1441766 1438109 1432542
53467A432542q384j1426j3836j5501j6766j7574j7532j6822j6370j6794j7717
$$ 1432542 1424158 1412732 1398896 1383395 1366629 1349055 1331523 1314701 1298331 1281537 1263820
53456A263820j8566j9543k1107k2795k3443k2653k1311k0404j9971j9564j9057
$$ 1263820 1245254 1225711 1204604 1181809 1158366 1135713 1114402 1093998 1074027 1054463 1035406
53445A035406j8545j7849j6726j5340j4004j2596j0698q227n651l561k290j839
$$ 1035406 1016861 999012 982286 966946 952942 940346 929648 921421 915770 912209 909919 908080
53433I08080j853j704q97N27K123L587M959O357P773R204J0786J2653J4643J6291
$$ 908080 906227 904523 903626 904153 906276 909863 914822 921179 928952 938156 948942 961595 976238 992529
53419I92529J7225J7614J8117J9261K0964K2774K4503K6310K8278L0203L1966
$$ 992529 1009754 1027368 1045485 1064746 1085710 1108484 1132987 1159297 1187575 1217778 1249744
53408A249744L3722L5516L7044L8098L9063M0594M2842M5379M7851N0352N2951
$$ 1249744 1283466 1318982 1356026 1394124 1433187 1473781 1516623 1562002 1609853 1660205 1713156
53397A713156N5191N6449N6742N6802N7191N7608N7414N6604N5857N5535N5120
$$ 1713156 1768347 1824796 1881538 1938340 1995531 2053139 2110553 2167157 2223014 2278549 2333669
53386B333669N3874N1763M9317M6870M4289M1360L8109L4644L0973K6956K2404
$$ 2333669 2387543 2439306 2488623 2535493 2579782 2621142 2659251 2693895 2724868 2751824 2774228
53375B774228J7313J2025O916J796l915j0201j6163k1250k6277l2376l9229m5222
$$ 2774228 2791541 2803566 2810482 2812278 2808363 2798162 2781999 2760749 2734472 2702096 2662867 2617645
53363B617645m9397n2311n4756n6579n7227n6744n5663n4359n3045n1994n1192
$$ 2617645 2568248 2515937 2461181 2404602 2347375 2290631 2234968 2180609 2127564 2075570 2024378
53352B024378n0056m8123m5890m4386m3940m3792m3070m1790m0718m0414m0591
$$ 2024378 1974322 1926199 1880309 1835923 1791983 1748191 1705121 1663331 1622613 1582199 1541608
53341A541608m0392l9246l7310l5097l2853l0509k8064k5669k3366k1107j9089
$$ 1541608 1501216 1461970 1424660 1389563 1356710 1326201 1298137 1272468 1249102 1227995 1208906
53330A208906j7693j7003j6704j6495j6322j6120j5674j4937j4122j3334j2390
$$ 1208906 1191213 1174210 1157506 1141011 1124689 1108569 1092895 1077958 1063836 1050502 1038112
53319A038112j1163r778q315o649m830l223j983o22J426L927N932O815P015P607
$$ 1038112 1026949 1017171 1008856 1002207 997377 994154 992171 991549 992975 996902 1002834 1009649 1016664 1024271
53305A024271R169J1243J3014J4356J5872J7854J9766K1088K2198K3796K5729
$$ 1024271 1033440 1044683 1057697 1072053 1087925 1105779 1125545 1146633 1168831 1192627 1218356
53294A218356K7195K7962K8561K9215K9428K8857K7846K6744K5408K3721K1950
$$ 1218356 1245551 1273513 1302074 1331289 1360717 1389574 1417420 1444164 1469572 1493293 1515243
53283A515243K0167J7978J5316J2840J0927Q836N631J461k724o407r636j2281
$$ 1515243 1535410 1553388 1568704 1581544 1592471 1601307 1606938 1608399 1605675 1599268 1589632 1577351
53271A577351j4002j4995j6028j7649j9795k2177k4535k6528k7816k8376k8401
$$ 1577351 1563349 1548354 1532326 1514677 1494882 1472705 1448170 1421642 1393826 1365450 1337049
53260A337049k8036k7533k7489k8311k9495k9990k9413k8418k7799k7677k7723
$$ 1337049 1309013 1281480 1253991 1225680 1196185 1166195 1136782 1108364 1080565 1052888 1025165
53249A025165k7663k7311k6533k5513k4732k4404k4173k3650k3005k2633k2457
$$ 1025165 997502 970191 943658 918145 893413 869009 844836 821186 798181 775548 753091
53238G53091k1991k1075k0055j9115j7772j5470j2535j0145r204r460r839r557
$$ 753091 731100 710025 689970 670855 653083 637613 625078 614933 605729 596269 586430 576873
53226E76873q805q417q966j0165j1103j1178j0780j0822j1611j2511j2874j2851
$$ 576873 568068 559651 550685 540520 529417 518239 507459 496637 485026 472515 459641 446790
53214D46790j2908j2907j2183j0494q444o947o494o868p234o750n473m453m549
$$ 446790 433882 420975 408792 398298 389854 382907 376413 369545 362311 355561 350088 345635 341086
53201C41086n385n957n918n578n012m127l459l775m762n170m574l942m030m273
$$ 341086 335701 329744 323826 318248 313236 309109 305650 301875 297113 291943 287369 283427 279397 275124
53187B75124l871l099k662k534k278j959j898j934j752j525j483j282n49K26K44
$$ 275124 271253 268154 265492 262958 260680 258721 256823 254889 253137 251612 250129 248847 248298 248524 248768
53172B48768m70j229j767k297k686k532j997j702j710j449p86l58n57q76o32J23
$$ 248768 248298 247069 245302 243005 240319 237787 235790 234088 232378 230929 230143 229785 229228 228352 227720 227843
53156B27843P93R77O76J10m77r01j171j375j525j590j646j705j524r25k03J12
$$ 227843 228636 229613 230289 230399 229922 229021 227850 226475 224950 223360 221714 220009 218485 217560 217357 217469
53140B17469k4j39J28N98Q82Q20N43L11L40O07Q25P58N35M32M69L91O6l42o21
$$ 217469 217445 217306 217434 218032 218914 219734 220277 220588 220928 221535 222360 223118 223653 224085 224554 224945 225011 224669 224048
53121B24048p38q62j136j386j182l57N67Q20L02l77p86j045j194q81j00L71j10
$$ 224048 223310 222448 221312 219926 218744 218387 218954 219774 220076 219699 218913 217868 216674 215793 215693 216064 215954
53104B15954j115j622j172j32Q13J033L03p22q61K40J514J774J078J99n93j377
$$ 215954 214839 213217 212045 211913 212726 213759 214062 213340 212479 212719 214233 216007 217085 217284 216691 215314
53088B15314j769j343n27p4P1M07P05L67k50j36O99J129P17L29N47P24J94n97
$$ 215314 213545 212202 211675 211601 211672 212079 212784 213151 212901 212765 213464 214593 215310 215639 216186 216910 217104 216507
53070B16507q53o04l72l66n47r75j483j551j020m69l99n28l52K6K30K95M63N91
$$ 216507 215654 215050 214678 214312 213765 212790 211307 209756 208736 208267 207868 207340 206988 207014 207244 207539 208002 208593
53052B08593L37k15n82m94j60Rk14o35p57l46J27K5n27q05n46k12j06K6K31O1
$$ 208593 208930 208715 208133 207639 207479 207488 207274 206639 205882 205536 205663 205688 205161 204356 203810 203598 203492 203518 203749 203810
53032B03810n06o77K3Q69R01K58k28l10l77n22l39L24J086J527J491R93K47k86
$$ 203810 203304 202627 202650 203519 204420 204678 204450 204140 203763 203241 202902 203226 204312 205839 207330 208323 208570 208284
53014B08284l69l56o73j073r06r2O75P41R1p97j276q40M14J583J698Q03r4j75
$$ 208284 207915 207559 206886 205813 204907 204815 205490 206231 206322 205525 204249 203409 203823 205406 207104 207907 207813 207638
52996B07638M38J137J515J457R57J90m32n74k42L93J199J919K029J193j26q70
$$ 207638 208076 209213 210728 212185 213142 213332 212900 212326 212084 212477 213676 215595 217624 218817 218691 217821
52980B17821m45O01J189R60N88Q33J578K075J926J444J116J110J368J817K241
$$ 217821 217376 217977 219166 220126 220714 221547 223125 225200 227126 228570 229686 230796 232164 233981 236222
52965B36222K240J610O72k5k32p7L01Q18J150P18p13k462l368k949j912j228r88
$$ 236222 238462 240072 240744 240719 240487 240410 240711 241529 242679 243397 242684 240222 236854 233905 231993 230765 229777
52948B29777n95j3k0r56j935j942j252r86j512k111k215k117k199k223j787j009
$$ 229777 229182 229169 229149 228193 226258 224316 223064 222078 220566 218455 216240 214123 211924 209701 207914 206905
52932B06905k76K66O40P13L56k46p88j173j412j351p82J31Q35Q20J34n73o55j83
$$ 206905 206629 206895 207535 208248 208604 208358 207570 206397 204985 203634 202852 202983 203818 204638 204772 204199 203544 203361
52914B03361J14j68m85j03P86J332J255J094J083O39o54k093k532j666k31Q93
$$ 203361 203475 203307 202822 202719 203505 204837 206092 207186 208269 208908 208254 206161 203629 201963 201732 202625
52898B02625J321J096M13m62j137j136j70J412K605K584J532L85k63m95m55k8
$$ 202625 203946 205042 205455 204993 203856 202720 202550 203962 206567 209151 210683 211068 210805 210310 209855 209827
52882B09827O98J202J075M34l37r32j088p21j87K0k6J88P03J022J067J397K105
$$ 209827 210525 211727 212802 213236 212899 211967 210879 210158 209971 209991 209965 210153 210856 211878 212945 214342 216447
52865B16447K310J345k20j327j617j349p63j40O4j89k56J58L37l72j359j607j244
$$ 216447 218757 220102 219882 218555 216938 215589 214826 214686 214750 214561 214305 214463 214800 214428 213069 211462 210218
52848B10218j200j595j674j214q93j119j513j789k191k722k803k119j165n45k73
$$ 210218 209018 207423 205749 204535 203642 202523 201010 199221 197030 194308 191505 189386 188221 187676 187403
52833A87403j19j12k41j40M45J159J425J152P43M95L29Pn56j176j540j488j129
$$ 187403 187284 187172 186931 186791 187236 188395 189820 190972 191715 192210 192539 192546 191990 190814 189274 187786 186657
52816A86657o33j3O95J234J389J288J168J013Q18R47J700K597K764K038J113M81
$$ 186657 186024 186011 186706 187940 189329 190617 191785 192798 193616 194563 196263 198860 201624 203662 204775 205256
52800B05256j32j030j869k146j905j537j262j189j529k265k808k533j624q87p03
$$ 205256 205124 204094 202225 200079 198174 196637 195375 194186 192657 190392 187584 185051 183427 182540 181837
52785A81837n59K14J548K719L162K982K607K204J609Q14K08J00K27L5m99p49k70
$$ 181837 181278 181492 183040 185759 188921 191903 194510 196714 198323 199137 199345 199445 199672 199707 199208 198459 198189
52768A98189N27Q51M61j73n94p91q81p49l72j87n82j121q49L94J507J422M64k19
$$ 198189 198716 199567 200028 199855 199261 198470 197589 196840 196468 196281 195699 194578 193729 194123 195630 197052 197516 197297
52750A97297k39k33n65p07j79O48J181J440J724J853J441P22M12Q32J548J927
$$ 197297 197058 196825 196260 195553 195374 196022 197203 198643 200367 202220 203661 204383 204795 205627 207175 209102
52734B09102J706J132P56R40J430J641J503J532J784J499L41o95n57K02J82o76
$$ 209102 210808 211940 212696 213636 215066 216707 218210 219742 221526 223025 223366 222671 222114 222316 222498 221822
52718B21822j011k37M97N5j108j825j799j474j013l24K37J43n34j186j477j493
$$ 221822 220811 220574 221071 221126 220018 218193 216394 214920 213907 213583 213820 213963 213429 212243 210766 209273
52702B09273j279p67j42L15P41J503K426K719J868K58j188j760j260m2J051J166
$$ 209273 207994 207227 207085 207400 208141 209644 212070 214789 216657 216915 215727 213967 212707 212665 213716 214882
52686B14882K27q75j159n09M01R35R69O46J12m32p07o32l99j91N0L26K96l41j252
$$ 214882 215109 214234 213075 212566 212967 213902 214871 215517 215629 215197 214490 213858 213459 213268 213318 213644 213940 213599 212347
52667B12347j577q33N36J615J842J319N29j02m32n96p28o71j06R61K070K728K839
$$ 212347 210770 209937 210473 212088 213930 215249 215778 215676 215244 214648 213920 213249 213143 214104 216174 218902 221741
52650B21741K554J968J099R1p91j344j538j582j783k194k354j742n41M03O28O03
$$ 221741 224295 226263 227362 227453 226662 225318 223780 222198 220415 218221 215867 214125 213584 213987 214615 215218
52634B15218R64J573J753J265N84L04O50J415K115K305K029J796J866J796J023
$$ 215218 216182 217755 219508 220773 221357 221661 222311 223726 225841 228146 230175 231971 233837 235633 236656
52619B36656l27j637k439k569j978j032o14j192j987j844q50j70l24n56k15K67
$$ 236656 236329 234692 232253 229684 227706 226674 226060 224868 222881 221037 220187 220017 219693 219137 218922 219189
52603B19189K13k31m78l43O3P35J449J550P88n5qP90J400J431J316J276R14N5
$$ 219189 219402 219171 218693 218350 218413 219148 220597 222147 222935 222880 222872 223662 225062 226493 227809 229085 229999 230054
52585B30054p29q22l59R1K56K47K24L55Q40J567J927J443N05j6J09K58k7m15n73
$$ 230054 229325 228503 228144 228235 228491 228738 228962 229317 230157 231724 233651 235094 235599 235583 235692 235950 235923 235508 234935
52566B34935r20j932l015k987j684k66L56N76J081J554J190L4j011j449j561j546
$$ 234935 234015 232083 229068 226081 224397 224131 224487 225063 226144 227698 228888 228922 227911 226462 224901 223355
52550B23355j087o7R49J338J125P20L65P8j21k67m60n71k74L66O76J89o05p84
$$ 223355 222268 222201 223150 224488 225613 226333 226698 226776 226655 226388 225928 225357 225083 225449 226125 226314 225709 224925
52532B24925j89M39M81J41rK27O39J010J232J173P25L6n92j027j416j884k243
$$ 224925 224736 225175 225656 225797 225788 226015 226654 227664 228896 230069 230794 230830 230238 229211 227795 225911 223668
52515B23668k097j202L06J891K857K878K394K302L005L927M269L975L562L131
$$ 223668 221571 220369 220675 222566 225423 228301 230695 232997 236002 239929 244198 248173 251735 254866
52501B54866K205O12j073k226k816l036k803k117j526j574j942j782q97l4P9m37
$$ 254866 257071 257683 256610 254384 251568 248532 245729 243612 242086 240512 238570 236788 235891 235857 235936 235499
52485B35499r23j006q37p19o62m23R9O25Q34Q32R57J101Q24K60L18J454K788L133
$$ 235499 234576 233570 232733 232014 231352 230929 231028 231653 232487 233319 234276 235377 236201 236461 236779 238233 241021 244154
52467B44154K529K024K148K378K157J611J132Q98J021J589K284K436J744N67o34
$$ 244154 246683 248707 250855 253233 255390 257001 258133 259031 260052 261641 263925 266361 268105 268672 268038
52452B68038j758k806l547l692l229k447j817j783k333k820k619j927j486j571
$$ 268038 266280 263474 259927 256235 253006 250559 248742 246959 244626 241806 239187 237260 235774 234203
52438B34203j767j713j457r99k10O20Q52L81j39k58k37k48J16J020J767J704J194
$$ 234203 232436 230723 229266 228267 228057 228677 229529 229910 229771 229513 229276 229028 229144 230164 231931 233635 234829
52421B34829R34Q53N16K06N65J337J560J104R65J786L024L966M745N736O688P206
$$ 234829 235763 236616 237132 237338 237903 239240 240800 241904 242869 244655 247679 251645 256390 262126 268814 276020
52405B76020P643Q560R574R570Q032N399K139j633n342p723q103p284o431n660
$$ 276020 283663 292223 301797 311367 319399 324798 326937 325304 319962 312239 304136 296852 290421 284761
52391B84761m499l250k716k737k257j066k98o42j151n92Q15J915K213J997J453
$$ 284761 280262 277012 274296 271559 269302 268236 267938 267296 266145 265553 266368 268283 270496 272493 273946
52376B73946O88L51J077K406L262L498L933M782N175M632M043M504N732O305N217
$$ 273946 274634 274985 276062 278468 281730 285228 289161 293943 299118 303750 307793 312297 318029 324334 329551
52361C29551K809L79r09r27n81p54j317j494r74j60N65J161J537J587J629K082
$$ 329551 332360 332739 331830 330903 330322 329568 328251 326757 325783 325623 326188 327349 328886 330473 332102 334184
52345C34184K593K350J463J152K152L686M614M921N393O376P543Q595R549J0429
$$ 334184 336777 339127 340590 341742 343894 347580 352194 357115 362508 368884 376427 385022 394571 405000
52331D05000J1174J1787J2315J2873J3749J5163J6770J7885J8395J8944K0009
$$ 405000 416174 427961 440276 453149 466898 482061 498831 516716 535111 554055 574064
52320E74064K1243K2081K2362K2085K1044J9264J7296J5626J4171J2781J1742
$$ 574064 595307 617388 639750 661835 682879 702143 719439 735065 749236 762017 773759
52309G73759J1284J0926J0008Q554P180O303N903N739N472M752L630K619K077
$$ 773759 785043 795969 805977 814531 821711 828014 833917 839656 845128 849880 853510 856129 858206
52296H58206J825J590J357R95J0j813l923n601o673p275p352o889o177n377m259
$$ 858206 860031 861621 862978 863973 863983 862170 858247 852646 845973 838698 831346 824457 818280 812903 808644
52281H08644k796j453l70J167L677O480Q519R769J0846J1779J2168J2308J2945
$$ 808644 805848 804395 804025 805192 808869 815349 823868 833637 844483 856262 868430 880738 893683
52268H93683J3920J4195J3493J2855J3089J3501J2760J0634Q266O940O877P246
$$ 893683 907603 921798 935291 948146 961235 974736 987496 998130 1006396 1013336 1020213 1027459
52256A027459P123O422N761N477N153M378L483L084L167L153K615J455l74k688
$$ 1027459 1034582 1041004 1046765 1052242 1057395 1061773 1065256 1068340 1071507 1074660 1077275 1078730 1078356 1075668
52242A075668m810o113o741p281p841p987p505o547n200l533j994j078n98O1R22
$$ 1075668 1070858 1064745 1058004 1050723 1042882 1034895 1027390 1020843 1015643 1012110 1010116 1009038 1008440 1008501 1009423
52227A009423J379J268J179J523J975K131K199K573L235L946M659N427O087O437
$$ 1009423 1010802 1012070 1013249 1014772 1016747 1018878 1021077 1023650 1026885 1030831 1035490 1040917 1047004 1053441
52213A053441O549O711P122P720Q219Q322Q039P738P746P963Q019P704P020O070
$$ 1053441 1059990 1066701 1073823 1081543 1089762 1098084 1106123 1113861 1121607 1129570 1137589 1145293 1152313 1158383
52199A158383N072M311L740L007K148J873K613L660L907L226K427K075K078K269
$$ 1158383 1163455 1167766 1171506 1174513 1176661 1178534 1181147 1184807 1188714 1191940 1194367 1196442 1198520 1200789
52185A200789K556K477J513K1r65j190j659l235n434p179q229r228j0522j1556
$$ 1200789 1203345 1205822 1207335 1207356 1206391 1205201 1203542 1200307 1194873 1187694 1179465 1170237 1159715 1148159
52171A148159j1459r942p574n382m136l845l859l419k239p49K09J94j82K49J808
$$ 1148159 1136700 1126758 1119184 1113802 1109666 1105821 1101962 1098543 1096304 1095555 1095764 1095958 1095776 1096025 1097833
52156A097833L494M147L700K796J722M16q11j441j564j781k278k655k712k692
$$ 1097833 1101327 1105474 1109174 1111970 1113692 1114108 1113297 1111856 1110292 1108511 1106233 1103578 1100866 1098174
52142A098174k686k405j718r33m45m71j006j554j191M47K416L502L887M813O702
$$ 1098174 1095488 1093083 1091365 1090432 1089987 1089516 1088510 1086956 1085765 1086212 1088628 1092130 1096017 1100830 1107532
52127A107532Q770J0640J3033J6299J9391K1162K1954K3043K4953K7054K8429
$$ 1107532 1116302 1126942 1139975 1156274 1175665 1196827 1218781 1241824 1266777 1293831 1322260
52116A322260K8508K7197K4998K2848K1318K0111J8579J6533J4190J1687Q999
$$ 1322260 1350768 1377965 1402963 1425811 1447129 1467240 1485819 1502352 1516542 1528229 1537228
52105A537228O109L030p2k692m299n034n612o270o449n847n165n212n710n740
$$ 1537228 1543337 1546367 1546295 1543603 1539304 1534270 1528658 1522388 1515939 1510092 1504927 1499715 1494005 1488265
52091A488265n056m344m254m798n693o734p784q722r422r527q465o036k945k23
$$ 1488265 1483209 1478865 1474611 1469813 1464120 1457386 1449602 1440880 1431458 1421931 1413466 1407430 1404485 1404262
52077A404262J936M338P570J0990J3266J3782J3169J2499J2312J2565J3116J3819
$$ 1404262 1406198 1410536 1418106 1429096 1442362 1456144 1469313 1481812 1494124 1506689 1519805 1533624
52065A533624J4279J4046J3071J1630R756P353M868L091J908J50k682n336o382
$$ 1533624 1547903 1561949 1575020 1586650 1596406 1603759 1608627 1611718 1613626 1613776 1611094 1605758 1599376
52052A599376o312o957r020j1389j2862j3466j3884j4504j5413j6628j8002j9276
$$ 1599376 1593064 1586107 1577087 1565698 1552836 1539370 1525486 1510982 1495569 1478941 1460939 1441663
52040A441663k0361k1157k1308k0707j9915j9288j8108j5647j2768j1093j0648
$$ 1441663 1421302 1400145 1378837 1358130 1338215 1318927 1300819 1285172 1272404 1261311 1250663
52029A250663r784p728n589m444l938l566l848n181o738p731q738j0570j2579
$$ 1250663 1240879 1233151 1227562 1223118 1219180 1215614 1211766 1206585 1199847 1192116 1183378 1172808 1160229
52016A160229j3419j2995j2460j2615j3257j3867j4118j3978j3967j4955j7046
$$ 1160229 1146810 1133815 1121355 1108740 1095483 1081616 1067498 1053520 1039553 1024598 1007552
52005A007552j9160k0306k0710k0960k0809j9797j8455j7770j7887j8240j8619
$$ 1007552 988392 968086 947376 926416 905607 885810 867355 849585 831698 813458 794839
51994G94839j9006j8794j7258j4655j1887r357p140n854o131p287p811p291o773
$$ 794839 775833 757039 739781 725126 713239 703882 696742 690888 684757 677470 669659 662368 655595
51981F55595p089p864q466q865r265r689j0278j1255j2279j2581j2005j1185j0459
$$ 655595 648506 640642 632176 623311 614046 604357 594079 582824 570545 557964 545959 534774 524315
51968E24315r363p565n558l930k512q02J177K975M370N527O578P367P587P001
$$ 524315 514952 507387 501829 497899 495387 494585 495762 498737 503107 508634 515212 522579 530166 537167
51954E37167N643L875K140O63o08j885l454n370p063p585o570m700k886j315L49
$$ 537167 542810 546685 548825 549488 548880 546995 543541 538171 531108 523523 516953 512253 509367 508052 508401
51939E08401K183L992N712P319Q577R383J0025J0539J0274Q782O638M526K101
$$ 508401 510584 514576 520288 527607 536184 545567 555592 566131 576405 585187 591825 596351 598452
51926E98452j192m543o494p165q267j0580j2786j3460j2961j2474j2148j1332
$$ 598452 597260 592717 586223 579058 570791 560211 547425 533965 521004 508530 496382 485050
51914D85050j0057r122q846q552p524n817m030k496r88Q39K837M512N824P462
$$ 485050 474993 465871 457025 448473 440949 435132 431102 428606 427618 428457 431294 435806 441630 449092
51900D49092R839J2209J3465J3640J3704J3871J2983J0042N442L27m650r261j2994
$$ 449092 458931 471140 484605 498245 511949 525820 538803 548845 554287 554614 549964 540703 527709
51887E27709j5159j5635j4972j3799j2416j0872r150p308n530l928k332m58J677
$$ 527709 512550 496915 481943 468144 455728 444856 435706 428398 422868 418940 416608 416150 417827
51874D17827L697N167N723N150L761K555K311K674K648J984J264O50m58k270l993
$$ 417827 421524 426691 432414 437564 441325 443880 446191 448865 451513 453497 454761 455411 454953 452683 448690
51859D48690m890n181n340n202m372k954j248P33K837M408N022N188N507N608
$$ 448690 443800 438619 433279 428077 423705 420751 419503 420236 423073 427481 432503 437691 443198 448806
51845D48806M649K639L37j885m124o009o716o227n665n859o282n929m759l643
$$ 448806 453455 456094 456431 454546 450422 444413 437697 431470 425805 419946 413664 407735 402976 399333
51831C99333l117k820k142r84K80J224J682J798J881K018J675R5k676n256o059
$$ 399333 396216 393396 391254 390270 390550 391774 393456 395254 397135 399153 400828 400923 398247 392991 386932
51816C86932m987l567l096l139k358m25J528K357K095J570J437J819K420K706
$$ 386932 381945 378378 375282 372143 369785 369360 370888 373245 375340 376910 378347 380166 382586 385292
51802C85292K207J002l58j465k299k766k559j766j156j409k306l092l418l431
$$ 385292 387499 388501 388143 386678 384379 381613 379054 377288 376132 374723 372417 369325 365907 362476
51788C62476l218k674j941j499j617k021k158j690p38K11O50M90J57Q8L01N17
$$ 362476 359258 356584 354643 353144 351527 349506 347348 345658 344920 345131 345781 346271 346428 346516 346817 347334
51772C47334O58Q86J235J541J835K485L749N306O502P058P358P918Q677Q978Q273
$$ 347334 347992 348878 350113 351654 353489 355974 359723 365029 371531 378589 385947 393865 402542 411520 419793
51757D19793O706M832K966J020j104l237n197p023q702r767r500p740n358l608
$$ 419793 426499 431331 434297 435317 434213 430976 425779 418756 410054 400287 390787 383047 377689 374081
51743C74081k919k543j582j47R14J294J670K739M306N699O623P118P052O267N082
$$ 374081 371162 368619 367037 366890 367804 369098 370768 373507 377813 383512 390135 397253 404305 410572 415654
51728D15654M099L499K983K399J947J727J438O77p59k823n111o887p559p168o200
$$ 415654 419753 423252 426235 428634 430581 432308 433746 434423 433664 430841 425730 418843 411284 404116 397916
51713C97916m990l726k828k733l206l385k761j678q77p29j008j000J9K036L964
$$ 397916 392926 389200 386372 383639 380433 377048 374287 372609 371732 371003 369995 368995 369014 371050 375014
51698C75014M560L668K168Q17k21p95m95O75K016K787K805K213J156j54j496k837
$$ 375014 379574 383242 385410 386227 386006 385211 384716 385391 387407 390194 392999 395212 396368 396214 394718 391881
51682C91881m127m916m837m380m282m214l101r22R48J664K032K966M066M622N098
$$ 391881 387754 382838 378001 373621 369339 365125 362024 361102 362050 363714 365746 368712 372778 377400 382498
51667C82498O278P657Q020P267O396N815M863L074P91j568l920n972p059o848
$$ 382498 388776 396433 404453 411720 418116 423931 428794 431868 432659 431091 427171 421199 414140 407292
51653D07292n616l700j280J268L459N201O547O884N252J804j840m152n076n510
$$ 407292 401676 397976 396696 397964 401423 406624 413171 420055 425307 427111 425271 421119 416043 410533
51639D10533n986o407o632o686o513n960m992l760k545j701j466j631j666j302
$$ 410533 404547 398140 391508 384822 378309 372349 367357 363597 361052 359351 357885 356254 354588 353286
51625C53286p62l32k3J50q1q66j821k319k141j573r83n91n24q40j366j779j862
$$ 353286 352524 352192 352169 352319 352238 351372 349551 347232 345091 343518 342535 341944 341420 340580 339214 337435 335573
51608C35573j655j290q64n08l65m04k25O58K261L966N125N828O732Q145R506J0056
$$ 335573 333918 332628 331764 331256 330891 330487 330262 330920 333181 337147 342272 348100 354832 362977 372483 382539
51592C82539R721R043Q292P031M678J315k220m905o226o407o030n377m238k402
$$ 382539 392260 401303 409595 416626 421304 422619 420399 415494 409268 402861 396831 391454 387216 384814
51578C84814j88J794L319M722O371Q174R775J0983J1870J2519J2991J3465J4227
$$ 384814 384626 386420 389739 394461 400832 409006 418781 429764 441634 454153 467144 480609 494836
51565D94836J5350J6455J6946J6582J5798J5482J6416J8860K2530K6840L1210
$$ 494836 510186 526641 543587 560169 575967 591449 607865 626725 649255 676095 707305
51554G07305L5131L7982L8840L6852L1912K4803J6501P556j587j0116j7232k2978
$$ 707305 742436 780418 819258 856110 888022 912825 929326 936882 935295 925179 907947 884969
51542H84969k7980l2343l5361l6547l6343l5514l4221l2050k8731k4526k0178
$$ 884969 856989 824646 789285 752738 716395 680881 646660 614610 585879 561353 541175
51531E41175j6690j4735j4041j3652j3033j2449j1984j0939q856o599n493n607
$$ 541175 524485 509750 495709 482057 469024 456575 444591 433652 424796 418197 412704 407097
51519D07097n882n750n689n917n697m471k926k115j981j565n63J58k03j233j790
$$ 407097 401215 395465 389776 383859 378162 373691 370765 368650 366669 365104 364541 364699 364496 363263 361473
51504C61473j332l87K25K68J00J57O04J344K106K492K249J598J062R18R25P61
$$ 361473 360141 359754 359979 360247 360347 360504 361108 362452 364558 367050 369299 370897 371959 372877 373802 374563
51488C74563M48K29J39j1l09o37r11j254j844k674l495m048m364m749n379n967
$$ 374563 375011 375240 375379 375368 375059 374422 373511 372257 370413 367739 364244 360196 355832 351083 345704 339737
51472C39737o048n506m630l706k891k439k574l015l071k482j748j371j147o41
$$ 339737 333689 328183 323553 319847 316956 314517 311943 308928 305857 303375 301627 300256 299109 298468
51458B98468J0K90J09j32j58L8N72J604K859L728M068M463N354O394P011P389
$$ 298468 298478 298768 298877 298745 298587 298625 299197 300801 303660 307388 311456 315919 321273 327667 334678 342067
51442C42067Q302R974J1600J2214J1677J0430Q578N880K671N3j209j575j934k384
$$ 342067 350369 360343 371943 384157 395834 406264 414842 420722 423393 423446 422237 420662 418728 416344
51428D16344k516k624l619n609p473q231q120p842p380o274m614l053j973j219
$$ 416344 413828 411204 407585 401976 394503 386272 378152 370310 362930 356656 352042 348989 347016 345797
51414C45797n83j04J29J85K66N87J136J478J189N78N87J617K928L495L155K476
$$ 345797 345214 345110 345239 345424 345690 346277 347413 348891 350080 350658 351245 352862 355790 359285 362440 364916
51398C64916J938J667J710K066K625L349M258N065N295N147N567P041Q821J0043
$$ 364916 366854 368521 370231 372297 374922 378271 382529 387594 392889 398036 403603 410644 419465 429508
51384D29508J1018J2672J5149J7954K1067K4984K9759L4841L9837M4669M9016
$$ 429508 440526 453198 468347 486301 507368 532352 562111 596952 636789 681458 730474
51373G30474N2340N4334N4520N1715M4889L4687K3222J2226K187o889j4994k2625
$$ 730474 782814 837148 891668 943383 988272 1022959 1046181 1058407 1060594 1053705 1038711 1016086
51361A016086l0569l8614m5257m9221n0621n0326m8902m6614m3717m0186l5698
$$ 1016086 985517 946903 901646 852425 801804 751478 702576 655962 612245 572059 536361
51350E36361l0389k5089k0465j6462j3013j0577r386q775q017p306p212p511p305
$$ 536361 505972 480883 460418 443956 430943 420366 410980 402205 394188 386882 379670 372159 364854
51337C64854o250m963m137l767l340k527j528q41o88p61o98o06q13j185j312j320
$$ 364854 358604 353641 349504 345737 342397 339870 338342 337501 336813 336052 335354 334748 333935 332750 331438 330118
51321C30118j752k454k468j458m44m97j254j550j003k16L60Q30J234J286Q96L64
$$ 330118 328366 325912 323444 321986 321542 321045 319791 318241 317238 317022 317382 318212 319446 320732 321628 321992
51305C21992q2m98q88j045q04k43M75J205J813K239K519K593K231J380M40j69
$$ 321992 321910 321412 320524 319479 318675 318432 318907 320112 321925 324164 326683 329276 331507 332887 333327 333158
51289C33158m76p79j098j226j160j066q92m47J34M52M59N93J172J936K402K370
$$ 333158 332682 331903 330805 329579 328419 327353 326461 326014 326148 326600 327059 327652 328824 330760 333162 335532
51273C35532J947J282N17j26n08p46r65r62l46P98J730J747J013L43K91P02J103
$$ 335532 337479 338761 339278 339152 338644 337898 336933 335971 335625 336423 338153 339900 340913 341256 341547 342249 343352
51256C43352J070K14j560l445m035k831j035k33o28j282j696k144k612k517j764
$$ 343352 344422 344636 343076 339631 335596 332765 331730 331497 330869 329587 327891 325747 323135 320618 318854
51241C18854j064q45o96k91l0k18l79j01J77m5l37M8R58J556J461Q94N5r13j485
$$ 318854 317790 316945 316249 315958 315928 315710 315331 315230 315407 315362 315025 315073 316031 317587 319048 319942 319997 319084 317599
51222C17599j226n95n26j121j539j230n53L9O01J184J352P65j09m19R7R25J486
$$ 317599 316373 315778 315252 314131 312592 311362 310809 310848 311449 312633 313985 314750 314641 314222 314319 315244 316730
51205C16730J700J836J995J967J581J136J247K144L251L707L226K279J499J071
$$ 316730 318430 320266 322261 324228 325809 326945 328192 330336 333587 337294 340520 342799 344298 345369
51191C45369P45K38m02q31p79l82j3J81L07L12p9q35j427j414r69n63m10m94p64
$$ 345369 346114 346352 345950 345119 344340 343958 343945 344126 344433 344745 344666 343831 342404 340990 340021 339458 339048 338554 337790
51172C37790r76p23p4K16l17j004q48J04Q85J087J290J958K632K650K071J483
$$ 337790 336814 336091 336017 336233 335916 334912 334064 334168 335053 336140 337430 339388 342020 344670 346741 348224
51156C48224J246J274J298J043L02q32j946k629k791k542k051j565j384j621k071
$$ 348224 349470 350744 352042 353085 353387 352555 350609 347980 345189 342647 340596 339031 337647 336026 333955
51141C33955k403k362j828q42L51J411K084K196J637N72m31q39p36o30p56q57
$$ 333955 331552 329190 327362 326520 326871 328282 330366 332562 334199 334771 334340 333501 332765 332135 331379 330522
51125C30522p15m76l41k84j91p2R2L74O83P45N00K88N27J314K385L256L385K603
$$ 330522 329807 329331 328990 328706 328515 328443 328535 328909 329592 330337 330837 331125 331652 332966 335351 338607 341992 344595
51107C44595J525J116J656K447K753K630K458K176J524Q18P62J445K139K225J881
$$ 344595 346120 347236 348892 351339 354092 356722 359180 361356 362880 363698 364460 365905 368044 370269 372150
51092C72150J631J601J558J363J061O73J73l51p74j093j380j601j675j608j372
$$ 372150 373781 375382 376940 378303 379364 380037 380210 379859 379085 377992 376612 375011 373336 371728 370356
51077C70356p85K34J306J853J751J483J498J722J901K170K881L923M640M578M177
$$ 370356 369571 369805 371111 372964 374715 376198 377696 379418 381319 383489 386370 390293 394933 399511 403688
51062D03688M486O127Q626J0869J2152J2588J2474J1603R660P101N029M143M376
$$ 403688 408174 414301 422927 433796 445948 458536 471010 482613 492273 499374 504403 508546 512922
51049E12922N621Q003J0951J2886J2753J1427J0610J0507R641O984L268j21k583
$$ 512922 518543 526546 537497 550383 563136 574563 585173 595680 605321 612305 615573 615452 612869
51036F12869m187n053n517o406q308j0861j3245j5135j6711j7901j8191j7083
$$ 612869 608682 603629 598112 591706 583398 572537 559292 544157 527446 509545 491354 474271
51024D74271j4534j1054p589n043l568k541j388j51R42J985L086L997M531M967
$$ 474271 459737 448683 441094 436051 432483 429942 428554 428403 429345 431330 434416 438413 442944 447911
51010D47911N632O362O839P157P557P956Q202Q521R092R450R003P956P140P014
$$ 447911 453543 459905 466744 473901 481458 489414 497616 506137 515229 524679 533682 541638 548778 555792
50996E55792P424Q173R170J0015J0233R951R787R990J0192J0073R703R164Q401
$$ 555792 563216 571389 580559 590574 600807 610758 620545 630535 640727 650800 660503 669667 678068
50983F78068P602P168P189P337P343P207O792N826M390L084K570L276N428Q896
$$ 678068 685670 692838 700027 707364 714707 721914 728706 734532 738922 742006 744576 747852 753280 762176
50969G62176J2962J6833K0408K4112K8066L2055L6180M0711M5213M8670N0769
$$ 762176 775138 791971 812379 836491 864557 896612 932792 973503 1018716 1067386 1118155
50958A118155N2214N3505N4259N4180N3733N3184N1891M9311M6102M3228M0561
$$ 1118155 1170369 1223874 1278133 1332313 1386046 1439230 1491121 1540432 1586534 1629762 1670323
50947A670323L7428L4151L1934L1167L0917L0245K9226K8460K8245K8430K8476
$$ 1670323 1707751 1741902 1773836 1805003 1835920 1866165 1895391 1923851 1952096 1980526 2009002
50936B009002K7348K4056J8799J3157Q710N558K434j936p871j4812k2037k9202
$$ 2009002 2036350 2060406 2079205 2092362 2101072 2106630 2109064 2107128 2099257 2084445 2062408 2033206
50924B033206l6352m3487n0258n6210o1209o5351o8466p0134p0212o8977o6652
$$ 2033206 1996854 1953367 1903109 1846899 1785690 1720339 1651873 1581739 1511527 1442550 1375898
50913A375898o3132n8493n3419m8726m4634m0817l7037l3365k9822k6255k2717
$$ 1375898 1312766 1254273 1200854 1152128 1107494 1066677 1029640 996275 966453 940198 917481
50902I17481j9634j7411j5984j4916j3795j2442j0895r359q114p279o702o180
$$ 917481 897847 880436 864452 849536 835741 823299 812404 803045 794931 787652 780950 774770
50890G74770n692n328n011m487l572k350j080j6P62J440K278L205L712L474K950
$$ 774770 769078 763750 758739 754252 750680 748330 747250 747234 747996 749436 751714 754919 758631 762105 765055
50875G65055L085M274N914P105P570P751Q225R225J0581J1907J2942J3815J4920
$$ 765055 768140 772414 778328 785433 793003 800754 808979 818204 828785 840692 853634 867449 882369
50862H82369J6495J8424K0528K2797K5329K8175L1380L4914L8563M2156M6019
$$ 882369 898864 917288 937816 960613 985942 1014117 1045497 1080411 1118974 1161130 1207149
50851A207149N0893N7149O4323P1655P8739Q5479R1788R7704J03486J09172J14180
$$ 1207149 1258042 1315191 1379514 1451169 1529908 1615387 1707175 1804879 1908365 2017537 2131717
50840B131717J17830J20012J20974J20576J18283J13703J06736R7402Q6100P3983
$$ 2131717 2249547 2369559 2490533 2611109 2729392 2843095 2949831 3047233 3133333 3207316
50830C207316O2400N1969M2667L4828K9342K6643K6217K7484L0631L6041M3217
$$ 3207316 3269716 3321685 3364352 3399180 3428522 3455165 3481382 3508866 3539497 3575538 3618755
50819C618755N0813N7477O2235O4114O1975N4932M2792K6054N676j7080m0791
$$ 3618755 3669568 3727045 3789280 3853394 3915369 3970301 4013093 4039147 4044823 4027743 3986952
50808C986952o4241q6783j08174j27849j44586j57211j65566j70319j71678j69016
$$ 3986952 3922711 3835928 3727754 3599905 3455319 3298108 3132542 2962223 2790545 2621529
50798B621529j62035j51813j40017j27535j14464j01093q8053p5584o3608n2572
$$ 2621529 2459494 2307681 2167664 2040129 1925665 1824572 1736519 1660935 1597327 1544755
50788A544755m3380l6140k9802k3478j7599j3240j0724r349q268p200o478o673
$$ 1544755 1501375 1465235 1435433 1411955 1394356 1381116 1370392 1361043 1352775 1345575 1339097 1332424
50776A332424q026r953j1362j1627j1176j0935j1440j2624j4186j5844j7371j8639
$$ 1332424 1324398 1314445 1303083 1291456 1280280 1269345 1257905 1245281 1231095 1215251 1197880 1179241
50764A179241j9630k0332k0693k0705k0364j9627j8550j7330j5985j4157j1635
$$ 1179241 1159611 1139279 1118586 1097881 1077517 1057890 1039340 1022010 1006025 991868 980233
50753I80233q973p003n725m326k336j42J888M126P042J0331J3245J5561J7850
$$ 980233 971260 964257 958532 954206 951870 951728 953616 957742 964784 975115 988360 1003921 1021771
50740A021771K0867K4888K9468L3752L7245M0342M3780M7613N1207N4245N6939
$$ 1021771 1042638 1067526 1096994 1130746 1167991 1208333 1252113 1299726 1350933 1405178 1462117
50729A462117N9166O0199N9783N8738N7916N7163N5988N4615N3571N2514N0381
$$ 1462117 1521283 1581482 1641265 1700003 1757919 1815082 1871070 1925685 1979256 2031770 2082151
50718B082151M6556M1267L5010K8137K0914J3443N700j784p549j0191r602o704
$$ 2082151 2128707 2169974 2204984 2233121 2254035 2267478 2273178 2271394 2263845 2253654 2244052 2237348
50706B237348k189L772J0692J7651K4058K9851L4680L7565L7634L4689K8834K0080
$$ 2237348 2235159 2238931 2249623 2267274 2291332 2321183 2355863 2393428 2431062 2465751 2494585 2514665
50694B514665Q575n192k0687l7405n4351o9865q2314r0857r5411r6286r4088q9651
$$ 2514665 2523240 2518048 2497361 2459956 2405605 2335740 2253426 2162569 2067158 1970872 1876784 1787133
50682A787133q3649p6319o7747n8268m8501l9067l0372k2411j4818p263M8O517
$$ 1787133 1703484 1627165 1559418 1501150 1452649 1413582 1383210 1360799 1345981 1338718 1338766 1345283
50670A345283J1881J6459K0523K3698K5265K4997K3494K1657J9960J8233J6161
$$ 1345283 1357164 1373623 1394146 1417844 1443109 1468106 1491600 1513257 1533217 1551450 1567611
50659A567611J3963J2413J2079J2789J3957J5262J6692J8098J9230K0120K1014
$$ 1567611 1581574 1593987 1606066 1618855 1632812 1648074 1664766 1682864 1702094 1722214 1743228
50648A743228K1928K2773K3934K6129K9474L3257L6914M0739M5183M9873N3899
$$ 1743228 1765156 1787929 1811863 1837992 1867466 1900723 1937637 1978376 2023559 2073432 2127331
50637B127331N6776N8653N9727N9978N9365N7849N5296N1795M7994M4585M1443
$$ 2127331 2184107 2242760 2302487 2362465 2421830 2479679 2534975 2586770 2634764 2679349 2720792
50626B720792L7688L2556K5533J5673J764j5990l4828n0650o0557o3977o1878
$$ 2720792 2758480 2791036 2816569 2832242 2834006 2818016 2783188 2732538 2671981 2608004 2546126
50615B546126n5656m6851l7070k7623j9200j2031o148j459K048L989L701Q90m078
$$ 2546126 2490470 2443619 2406549 2378926 2359726 2347695 2341547 2340088 2342136 2346125 2349826 2350716 2346638
50602B346638j0686j8802k8484l9385n0676o1265o9987p5802p8322p8106p6161
$$ 2346638 2335952 2317150 2288666 2249281 2198605 2137340 2067353 1991551 1913229 1835123 1758962
50591A758962p3224o9693o5941o2173n8047n2975m6964m0774l5171l0316k6037
$$ 1758962 1685738 1616045 1550104 1487931 1429884 1376909 1329945 1289171 1254000 1223684 1197647
50580A197647k2286j9166j6664j4654j3001j1530r978q108n862l400j005J139
$$ 1197647 1175361 1156195 1139531 1124877 1111876 1100346 1090368 1082260 1076398 1072998 1071993 1073132
50568A073132L155N304P507R288J0462J1545J3089J4894J6431J7788J9580K1925
$$ 1073132 1076287 1081591 1089098 1098386 1108848 1120393 1133482 1148376 1164807 1182595 1202175 1224100
50556A224100K4319K6536K8853L1227L2985L3698L3721L3440L2619L0934K8686
$$ 1224100 1248419 1274955 1303808 1335035 1368020 1401718 1435439 1468879 1501498 1532432 1561118
50545A561118K6444K4458K2977K2629K3869K6335K9392L3050L7747M3434M9554
$$ 1561118 1587562 1612020 1634997 1657626 1681495 1707830 1737222 1770272 1808019 1851453 1901007
50534A901007N5867O2670P0188P8211Q6356R4310J01853J09002J16066J23193
$$ 1901007 1956874 2019544 2089732 2167943 2254299 2348609 2450462 2559464 2675530 2798723
50524B798723J29876J35179J38457J39534J38358J34853J28991J20651J09422
$$ 2798723 2928599 3063778 3202235 3341769 3480127 3614980 3743971 3864622 3974044
50515C974044R5026P7884N8956L8941J8001l777k5928m7631o7965q6043j01119
$$ 3974044 4069070 4146954 4205910 4244851 4262852 4259075 4233147 4185516 4117551 4031508 3930389
50504C930389j12507j19449j21396j18604j12114j02793r0596p5278n7473l8518
$$ 3930389 3817882 3698433 3577037 3458433 3346319 3243526 3152930 3077652 3020179 2981661
50494B981661j9414o28J6997L1898M2691M9009N1024M8459M0394K6152O225j7617
$$ 2981661 2962247 2961619 2978616 3010514 3053205 3102214 3153238 3201697 3242091 3268243 3274468 3256851
50482C256851m3029o7855r0345j08986j22646j31120j35129j35603j33104j28075
$$ 3256851 3213822 3145967 3055622 2946636 2823990 2692870 2557741 2422138 2289034 2160959
50472B160959j21176j13013j03878r4153q4679p6169o8454o0825n3039m5624l9221
$$ 2160959 2039783 1926770 1822892 1728739 1644060 1567891 1499437 1438612 1385573 1339949 1300728
50461A300728l4035k9823k6077k2234j8078j3864r880o082k410R18L854O852J0161
$$ 1300728 1266693 1236870 1210793 1188559 1170481 1156617 1146737 1140655 1138245 1139163 1143017 1149869 1160030
50448A160030J3108J4778J5279J5597J6208J6535J5972J4705J3286J1793R820
$$ 1160030 1173138 1187916 1203195 1218792 1235000 1251535 1267507 1282212 1295498 1307291 1317111
50437A317111P083L972J469L85M84O73L39J06P85K079L086L729M779O532Q461
$$ 1317111 1324194 1328166 1329635 1330020 1330504 1331177 1331516 1331622 1332407 1334486 1337572 1341301 1346080 1352612 1361073
50422A361073J0245J2342J5208J8729K2672K7073L1827L6430M0516M4324M8381
$$ 1361073 1371318 1383660 1398868 1417597 1440269 1467342 1499169 1535599 1576115 1620439 1668820
50411A668820N3007N8088O2969O6691O8782O9741P0206O9781O7420O2890N7069
$$ 1668820 1721827 1779915 1842884 1909575 1978357 2048098 2118304 2188085 2255505 2318395 2375464
50400B375464N0772M4062L6699K8415J8655P023n759j8330l0365m2716n5514o7192
$$ 2375464 2426236 2470298 2506997 2535412 2554067 2561090 2555331 2537001 2506636 2463920 2408406 2341214
50388B341214p6040q1717q4513q4151q0344p3798o5544n5822m4599l2759k1650
$$ 2341214 2265174 2183457 2098944 2014793 1934449 1860651 1795107 1739285 1694686 1661927 1640277
50377A640277j1646k097P283J5796K2457K6587K7698K5494K0182J2347K562q605
$$ 1640277 1628631 1626534 1633817 1649613 1672070 1698657 1726355 1751849 1772031 1784378 1786940 1778335
50365A778335k0307l1588m1747n0263n6534o0127o1118n9986n7348n4078n1157
$$ 1778335 1758028 1726440 1684693 1634430 1577896 1517769 1456651 1396665 1339317 1285239 1234082
50354A234082m8919m6795m4226m1415l8742l5907l2440k8626k5128k1886j8265
$$ 1234082 1185163 1138368 1094142 1052727 1013985 978078 945638 917012 891884 869998 851733
50343H51733j4229j0477p406m656j901O16K572M075N482P106R188J1754J4339
$$ 851733 837504 827027 819621 814965 813064 813680 816252 820327 825809 832915 842103 853857 868196
50330H68196J6314J7584J8631J9762K0730K1221K1290K1080K0357J8478J4855
$$ 868196 884510 902094 920725 940487 961217 982438 1003728 1024808 1045165 1063643 1078498
50319A078498R465L108k914p601j0690j2346j2767j2368j1875j1678j1336j0255
$$ 1078498 1087963 1091071 1088157 1080556 1069866 1057520 1044753 1032385 1020510 1008832 997496 987241
50307I87241q659p279o286n188l727k155o84P18J916K687L291M335N857P263Q258
$$ 987241 978582 971303 965017 959829 956102 953947 953263 953981 955897 958584 961875 966210 972067 979330 987588
50292I87588R223J0333J1076J1052J0694J0666J0953J1071J0889J0796J1179J2064
$$ 987588 996811 1007144 1018220 1029272 1039966 1050632 1061585 1072656 1083545 1094341 1105520 1117584
50280A117584J3164J4018J4212J3448J1220O636p01r445j6957k1424k3086k3062
$$ 1117584 1130748 1144766 1158978 1172426 1183646 1190282 1189581 1180136 1163179 1141755 1118669 1095607
50268A095607k1768j9195j6009j3321j1507j0134q912p936o990n554l711k336
$$ 1095607 1073839 1054644 1038635 1025314 1013807 1003673 994761 986825 979835 974281 970570 968234
50256I68234j927j850j126L62J866K657K710K671L337M976O951Q316Q846R225
$$ 968234 966307 964457 963331 963693 965559 968216 970926 973597 976934 981910 988861 997177 1006023 1015248
50242A015248J0028J0990J1509J1565J1677J2199J2992J3591J3478J2370J0595
$$ 1015248 1025276 1036266 1047775 1059340 1071017 1083216 1096208 1109799 1123277 1135647 1146242
50231A146242Q967P860O739N024L151K042J671J015m17j875k608l070m257o400
$$ 1146242 1155209 1163069 1169808 1174832 1177983 1180025 1181696 1182711 1182294 1180419 1177811 1174741 1170484 1164084
50217A164084r022j1929j5304j8916k2004k4018k4902k4586k2842j9894j6544
$$ 1164084 1155062 1143133 1127829 1108913 1086909 1062891 1037989 1013403 990561 970667 954123
50206I54123j3336j0040o412l104j265j424l171n967r655j4034j8239k1029k1757
$$ 954123 940787 930747 924335 921231 919966 918542 915371 909404 899749 885715 867476 846447 824690
50193H24690k0919j9676j8808j8235j7382j5928j4106j2441j1340j0862j0724
$$ 824690 803771 784095 765287 747052 729670 713742 699636 687195 675855 664993 654269
50182F54269j0473r822q890q083p649p417o991o259n621n539n801n527m215k567
$$ 654269 643796 633974 625084 617001 609352 601935 594944 588685 583064 577525 571724 566197 561982 559415
50168E59415j736j830j774q25M82J331J795K385K993L156L021L180L706M273N094
$$ 559415 557679 555849 554075 553250 553732 555063 556858 559243 562236 565392 568413 571593 575299 579572 584666
50153E84666O736Q898J0413J0751J0622J0700J0601R673Q073O414M866L257J619
$$ 584666 591402 600300 610713 621464 632086 642786 653387 663060 671133 677547 682413 685670 687289
50140F87289J20j191k095k108j131K62J619L223N379P629R391J0834J2400J3781
$$ 687289 687409 686218 684123 682015 680884 681146 682765 685988 691367 698996 708387 719221 731621 745402
50126G45402J4415J4680J5678J7794K0273K2403K4307K6342K8364K9972L1045
$$ 745402 759817 774497 790175 807969 828242 850645 874952 901294 929658 959630 990675
50115I90675L1790L2491L3317L4074L4163L3226L1784L0781L0475L0238K9488
$$ 990675 1022465 1054956 1088273 1122347 1156510 1189736 1221520 1252301 1282776 1313014 1342502
50104A342502K8205K6358K3420J8819J2502M874l464j1657j8704k4092k8037l0781
$$ 1342502 1370707 1397065 1420485 1439304 1451806 1456680 1453216 1441559 1422855 1398763 1370726 1339945
50092A339945l2017l1448k9593k7409k5147k2165j8045j3401r254n990l392j557
$$ 1339945 1307928 1276480 1246887 1219478 1194331 1172166 1154121 1140720 1131466 1125476 1122084 1120527
50080A120527j049j988l552m843n960p605r813j1721j2733j3193j3561j3560j2778
$$ 1120527 1119478 1117490 1113938 1109095 1103135 1095530 1085717 1073996 1061263 1048070 1034509 1020949 1008171
50067A008171j1731j1494j2245j2897j2442j1191j0273j0206j0362r815q369o597
$$ 1008171 996440 984946 972701 959804 947362 936171 925898 915692 905330 895515 887146 880549
50055H80549n071l815k568j234J12J534L138M735N943O750P631Q868J0060J0556
$$ 880549 875478 871663 869095 867861 867973 869507 872645 877380 883323 890073 897704 906572 916632 927188
50041I27188J0231R572R084Q798Q293P138N325L329J621K83q33j705k268k769
$$ 927188 937419 946991 956075 964873 973166 980304 985629 988958 990579 990862 990029 988324 986056 983287
50027I83287l507m355n021n705o813q051q587q294p996q213q572q743r031r440
$$ 983287 979780 975425 970404 964699 957886 949835 941248 932954 924958 916745 908173 899430 890399 880959
50013H80959r188p963o777o560o673n882m242k762j734o41N52J502K713N300R292
$$ 880959 871771 863808 857031 850471 843798 837916 833674 830912 829178 828537 829089 830591 833304 838604 847896
49998H47896J3393J6720J9659K2649K5205K6688K7158K6901K5894K4247K2429
$$ 847896 861289 878009 897668 920317 945522 972210 999368 1026269 1052163 1076410 1098839
49987A098839K0632J8484J5855J3270J1033Q459M476j454r192j8024k6567l3291
$$ 1098839 1119471 1137955 1153810 1167080 1178113 1186572 1191048 1189594 1180402 1162378 1135811 1102520
49975A102520l7734m0680m2655m2967m0874l7044l3048k9651k6508k3278k0228
$$ 1102520 1064786 1024106 981451 938484 897610 860566 827518 797867 771359 748081 727853
49964G27853j7688j5615j3897j2590j1689j0902r819q186o072l915k228j013L41
$$ 727853 710165 694550 680653 668063 656374 645472 635653 627467 621395 617480 615252 614239 614580
49951F14580K321M543O145O910P608R046J1060J2611J2818J1698R883P867N752
$$ 614580 616901 621444 627589 634499 642107 651153 662213 674824 687642 699340 709223 717090 722842
49938G22842L619J775M65l88j019j726l173o228j0910j5759j8922j9833j9303
$$ 722842 726461 728236 728701 728313 727294 725568 722395 716167 705257 689498 670576 650743 631440
49925F31440j8125j6369j4029j1537r235p006m862l348k819k684j906k63J306
$$ 631440 613315 596946 582917 571380 562145 555139 550277 546929 544110 541426 539520 539257 540563
49912E40563J727J017L43P21J816K424K224K349L768N787P016P359P894R090J0373
$$ 540563 542290 543307 543650 544371 546187 548611 550835 553184 556952 562739 569755 577114 585008 594098 604471
49897F04471J1508J2977J4567J4960J3478J1134R115P151M436J372q15j803k448
$$ 604471 615979 628956 643523 658483 671961 683095 692210 699361 703797 705169 704354 702551 700103
49884G00103l515n088p030r209j1221j2690j3881j5309j6688j6964j5623j3440
$$ 700103 696588 691500 684470 675261 664040 651350 637469 622160 605472 588508 572885 559445
49872E59445j1632j0592r689q151n943l804k436j750j045M9J188J895K237K668
$$ 559445 547813 537221 527532 519381 513438 509634 507198 505448 504403 504452 505640 507535 509772 512440
$$ [...]
##END NTUPLES=NMR SPECTRUM
##END=
