##TITLE=AC1530_ROEFFECT0008_8213984_Bq4CHfls3t
##JCAMPDX= 6.0         $$ Bruker NMR JCAMP-DX V2.0
##DATA TYPE= NMR SPECTRUM
##DATA CLASS= NTUPLES
##ORIGIN= BRUKER
##OWNER= Administrator
$$ 1.72 TOPSPIN		Version 2.1
$$ 2013-10-04 20:01:15.841 -0700  Administrator@X
$$ Compression mode = diff/dup
##.OBSERVE FREQUENCY= 400.02188249412
##.OBSERVE NUCLEUS= ^1H
##.ACQUISITION MODE= SIMULTANEOUS (DQD)
##.ACQUISITION SCHEME= undefined
##.AVERAGES= 8
##.DIGITISER RES= 22
##SPECTROMETER/DATA SYSTEM= spect
##.PULSE SEQUENCE= zg30
##.SOLVENT NAME= COFFEE_meoh
##.SHIFT REFERENCE= INTERNAL, COFFEE_meoh, 1, 14.98509
##AUDIT TRAIL= $$ (NUMBER, WHEN, WHO, WHERE, PROCESS, VERSION, WHAT)
$$ ##TITLE= Audit trail, TOPSPIN		Version 2.1
$$ ##JCAMPDX= 5.01
$$ ##ORIGIN= Bruker BioSpin GmbH
$$ ##OWNER= Administrator
$$ $$ E:\/data/COFFEE/nmr/AC1530_ROEFFECT0008_8213984_Bq4CHfls3t/10/pdata/1/auditp.txt
$$ ##AUDIT TRAIL=  $$ (NUMBER, WHEN, WHO, WHERE, PROCESS, VERSION, WHAT)
(   1,<2013-10-04 20:01:09.623 -0700>,<Administrator>,<X>,<go>,<TOPSPIN 2.1>,
      <created by zg
	started at 2013-10-04 20:00:03.341 -0700,
	POWCHK enabled, PULCHK disabled,
       configuration hash MD5:
       C8 4E 4E 5D D3 5C D8 9E 9F 52 82 E0 59 8A DE 15
       data hash MD5: 64K
       71 85 FA FF C4 38 E9 A3 1E 63 69 5E 15 55 E0 56>)
(   2,<2013-10-04 20:01:12.419 -0700>,<Administrator>,<X>,<proc1d>,<TOPSPIN 2.1>,
      <Start of raw data processing
       efp LB = 0 FT_mod = 6 PKNL = 1 PHC0 = 0 PHC1 = 0 SI = 32K 
       data hash MD5: 32K
       D4 8E 6A A3 47 5F 73 55 8A BF 6F 71 B8 0F FB 24>)
(   3,<2013-10-04 20:01:12.701 -0700>,<Administrator>,<X>,<proc1d>,<TOPSPIN 2.1>,
      <pk PHC0 = 93.74084 PHC1 = 0 
       data hash MD5: 32K
       40 D7 AE E6 1F AF 98 54 00 50 4E 2A B6 91 77 08>)
(   4,<2013-10-04 20:01:12.779 -0700>,<Administrator>,<X>,<proc1d>,<TOPSPIN 2.1>,
      <abs ABSG = 1 
       data hash MD5: 32K
       9D 5E F8 41 EE 4C 47 C3 1C 20 DB 5E D1 3C 31 99>)
(   5,<2013-10-04 20:01:12.826 -0700>,<Administrator>,<X>,<proc1d>,<TOPSPIN 2.1>,
      <abs ABSG = 2 
       data hash MD5: 32K
       37 F8 D3 A8 22 B9 A5 AE 44 83 A3 48 09 BC 1D 12>)
(   6,<2013-10-04 20:01:12.904 -0700>,<Administrator>,<X>,<proc1d>,<TOPSPIN 2.1>,
      <abs ABSG = 3 
       data hash MD5: 32K
       D4 B1 6E D5 7C F3 20 62 43 89 56 90 E4 EB 72 6E>)
(   7,<2013-10-04 20:01:12.951 -0700>,<Administrator>,<X>,<proc1d>,<TOPSPIN 2.1>,
      <abs ABSG = 4 
       data hash MD5: 32K
       1C E9 E7 24 D7 45 97 12 3D B7 09 79 F7 85 4B FB>)
(   8,<2013-10-04 20:01:12.998 -0700>,<Administrator>,<X>,<proc1d>,<TOPSPIN 2.1>,
      <abs ABSG = 5 
       data hash MD5: 32K
       7E 2A A2 83 93 C2 D8 02 9F 56 CC 84 DE 67 A2 18>)
$$ ##END=
$$ 
$$ $$ hash MD5
$$ $$ 04 3C 79 2F BE C6 A3 D0 D4 36 ED 72 B9 26 EC AD
##$RELAX= 
##$RELAX= 
##$RELAX= 
##$RELAX= 
##$RELAX= 
##$RELAX= 
##$RELAX= 
$$ Bruker specific parameters
$$ --------------------------
##$DU= <E:\>
##$EXPNO= 10
$$ [...]
150 150 150 150 150 150 150 150
##$TP07= 0
##$TPNAME0= <>
##$TPNAME1= <>
##$TPNAME2= <>
##$TPNAME3= <>
##$TPNAME4= <>
##$TPNAME5= <>
##$TPNAME6= <>
##$TPNAME7= <>
##$TPOAL= (0..7)
0.5 0.5 0.5 0.5 0.5 0.5 0.5 0.5
##$TPOFFS= (0..7)
0 0 0 0 0 0 0 0
##$TUNHIN= 0
##$TUNHOUT= 0
##$TUNXOUT= 0
##$USERA1= <user>
##$USERA2= <user>
##$USERA3= <user>
##$USERA4= <user>
##$USERA5= <user>
##$V9= 5
##$VALIST= <valist>
##$VCLIST= <CCCCCCCCCCCCCCC>
##$VD= 0
##$VDLIST= <DDDDDDDDDDDDDDD>
##$VPLIST= <PPPPPPPPPPPPPPP>
##$VTLIST= <TTTTTTTTTTTTTTT>
##$WBST= 2048
##$WBSW= 25
##$XGAIN= (0..3)
0 0 0 0
##$XL= 0
##$YL= 0
##$YMAX_a= 636372
##$YMIN_a= -540270
##$ZGOPTNS= <>
##$ZL1= 120
##$ZL2= 120
##$ZL3= 120
##$ZL4= 120
##$ABSF1= 14.98509
##$ABSF2= -5.573092
##$ABSG= 5
##$ABSL= 3
##$ALPHA= 0
##$AQORDER= 0
##$ASSFAC= 0
##$ASSFACI= 0
##$ASSFACX= 0
##$ASSWID= 0
##$AUNMP= <proc_prof1d_extract_pilot.lims>
##$AXLEFT= 0
##$AXNAME= <>
##$AXNUC= <1H>
##$AXRIGHT= 0
##$AXTYPE= 0
##$AXUNIT= <>
##$AZFE= 0.1
##$AZFW= 0.1
##$BCFW= 0
##$BC_mod= 0
##$BYTORDP= 0
##$COROFFS= 0
##$CY= 15
##$DATMOD= 1
##$DC= 0
##$DFILT= <>
##$DTYPP= 0
##$F1P= 0
##$F2P= 0
##$FCOR= 0.5
##$FTSIZE= 32768
##$FT_mod= 6
##$GAMMA= 0
##$GB= 0
##$INTBC= 1
##$INTSCL= 1
##$ISEN= 128
##$LB= 0
##$LEV0= 0
##$LPBIN= 0
##$MAXI= 10000
##$MC2= 0
##$MEAN= 0
##$ME_mod= 0
##$MI= 0
##$NCOEF= 0
##$NC_proc= -8
##$NLEV= 6
##$NOISF1= 0
##$NOISF2= 0
##$NSP= 0
##$NTH_PI= 0
##$NZP= 0
##$OFFSET= 14.98509
##$PC= 1
##$PHC0= 93.74084
##$PHC1= 0
##$PH_mod= 1
##$PKNL= yes
##$PPARMOD= 0
##$PPDIAG= 0
##$PPIPTYP= 0
##$PPMPNUM= 2147483647
##$PPRESOL= 1
##$PSCAL= 4
##$PSIGN= 0
##$PYNMP= <proc.py>
##$REVERSE= no
##$SF= 400.02
##$SI= 32768
##$SIGF1= 0
##$SIGF2= 0
##$SINO= 400
##$SIOLD= 32768
##$SPECTYP= <>
##$SREGLST= <1H.CDCl3>
##$SSB= 0
##$STSI= 32768
##$STSR= 0
##$SW_p= 8223.68421052631
##$SYMM= 0
##$S_DEV= 0
##$TDeff= 65536
##$TDoff= 0
##$TI= <>
##$TILT= no
##$TM1= 0
##$TM2= 0
##$TOPLEV= 0
##$USERP1= <user>
##$USERP2= <user>
##$USERP3= <user>
##$USERP4= <user>
##$USERP5= <user>
##$WDW= 1
##$XDIM= 32768
##$YMAX_p= 452461582
##$YMIN_p= -691202
##$CURPLOT= <Network HP LaserJet P1505>
##$CURPRIN= <$Network HP LaserJet P1505>
##$DFORMAT= <normdp>
##$LAYOUT= <+/1D_H.xwp>
##$LFORMAT= <normlp>
##$PFORMAT= <normpl>
##$SURQMSG= 1
$$ End of Bruker specific parameters
$$ ---------------------------------
##NTUPLES= NMR SPECTRUM
##VAR_NAME=  FREQUENCY,     SPECTRUM/REAL,   SPECTRUM/IMAG
##SYMBOL=    X,             R,               I
##VAR_TYPE=  INDEPENDENT,   DEPENDENT,       DEPENDENT
##VAR_FORM=  AFFN,          ASDF,            ASDF
##VAR_DIM=   32768,         32768,           32768
##UNITS=     HZ,            ARBITRARY UNITS, ARBITRARY UNITS
##FACTOR=    0.250966925370066, 1,           1
##FIRST=     8223.43324360094, -143906,      -245852
##LAST=      0,             38366,           -143139
##MIN=       0,             -691202,         0
##MAX=       8223.43324360094, 452461582,    0
$$ Real data points
##PAGE= N=1
##DATA TABLE= (X++(R..R)), XYDATA
$$ [...]
19545g9199r0918C5123i1956j73259a3931A21308h528j95376E4124c3542k0123
19534e3665l07508B62758A04592P6143F3240D78a48461A78748C5153a65885H7992
19522f7930k57866O7734A57023d0108j94687L6212a2202m0933M191a251F6439
19510e1976A35297b6354k6648j67952F4373N0427C1745b22944g9456c5634j30864
19499a66498A10020c47090Q4493f4955c2139k95021B37532A13503J40557f4835
19488a25777I8365h3766r5474l1165R1497c8320F1544B0362h3040B5402J13413
19477A38815b83524h2290l7535A06350c10636I7343a65559A41836b27271k4826
19467b52097E1795k1917a22881m6283f7066E2195f8086j97083a486B9196J45298
$$ y = [-79199, -170117, 35123, -91956, -265215, -13931, 121308, -8528, -203904, 54124, -33542, -53665, -361173, 262758, 104592, 180735, 63240, 478, -148461, 178748, 35153, -165885, 87992, -67930, -325796, -258062, 157023, -40108, -234795, -198583, -12202, -53135, -48944, -1251, 66439, -51976, 135297, -26354, -53002, -220954, 64373, 114800, 31745, -222944, -79456, -35634, -166498, 110020, -347090, -262597, -64955, -32139, -327160, 237532, 113503, 254060, -64835, -125777, 98365, -83766, -179240, -210405, -118908, -38320, 61544, 20362, -83040, 25402, 138815, -283524, -82290, -119825, 106350, -310636, 97343, -165559, 141836, -227271, -252097, 51795, 29878, -122881, -169164, -67066, 52195, -68086, -265169, -1486, 29196, 174494]
19456A74494c32323b9009n13903a18328m5108A48871a05026B706a16664J9817
19446i6847l85197A79590L13870a63868A54687e2872A03429A7910a52994M4565
19436a08429B37051o7056a20338l29531a63888a1780j9521G3473N4638d22448
19425b37370O9054m9165R4294A3901K82223a1605E3578f9305j88884k54263A95282
19413B38406a02949K9814j23546N288M1692G6169J87848H2387b39220e0002j92180
19402b42182L9964j06520A65253p5064Q4720a64098A05017a31137N1972j30608
19392b09773O3035A346c09518J31446q350l1767M3773A26044a00691i658l6741
19381d6399j04220G9209b69436a07215A04865C0201M4044Q0941b03740f3630J5330
$$ y = [174494, -332323, -29009, -542912, -118328, -163436, 148871, -105026, 2706, -116664, -96847, -482044, 179590, 493460, -163868, 154687, -52872, 103429, 17910, -152994, -108429, 237051, 169995, -120338, -449869, -163888, -11780, -31301, 73473, 128111, -422448, -237370, -168316, -217481, -123187, 13901, 296124, -11605, 53578, -69305, -258189, -512452, 195282, 238406, -102949, -73135, -196681, -191393, -149701, 76169, 264017, 82387, -239220, -50002, -242182, -202218, -308738, 165253, 90189, 174909, -164098, 105017, -131137, -79165, -209773, -146738, 1346, -309518, -178072, -186422, -218189, -174416, 126044, -100691, -9658, -46399, -150619, 79209, -269436, -107215, 104865, 30201, 74245, 155186, -203740, -63630, -48300]
19370d8300k98765M0265A98250b8180r1567A9514R0494c02584B51162n9884A5175
19358C011K7762i3213m6483E2558b4732n0102E6696a41654C21279i9599J8086
19347h1513j32034D1654a57513b547A20990b77234D5737g7443l6712K1633p8526
19336a71048q718d0436k14023k4001G7636a80634B6427K80583o7589b24736A62585
19324a67251A44906P8149n5096a83272P6235A15148b49293I0519J99190a10963
19313E7795i6555J3389B62909f4667k71043A65976o9628J5289i4207k18215A6095
19301c44494J01788B03006o4694E679a93912g4276A69242b19105c8255A452b28151
19289a68112A66373a34790k07567D4230f3563q5275r963A53950m7173a45232L8254
$$ y = [-48300, -347065, -306800, 198250, -28180, -119747, 19514, 110008, -302584, 251162, 191278, 15175, 3011, 30773, -93213, -139696, 52558, -24732, -74834, 56696, -141654, 321279, -99599, -81513, -213547, 41654, -157513, -2547, 120990, -277234, 45737, -77443, -114155, -92522, -171048, -179766, -40436, -254459, -278460, 77636, -180634, 26427, 307010, 239421, -224736, 162585, -167251, 144906, 223055, 167959, -183272, -107037, 115148, -249293, 90519, 289709, -110963, 57795, -96555, -83166, 262909, -64667, -335710, 165976, 96348, 111637, -94207, -312422, 16095, -344494, -242706, 203006, 138312, 5679, -193912, -74276, 169242, -219105, -38255, 1452, -228151, -168112, 166373, -134790, -342357, 44230, -63563, -148838, -158801, 153950, 106777, -145232, -106978]
19278a06978c7689B12306J14473c13708e4698b2808j72360k45833A16541h5109
19267E9123a11586p4502d0436B46085q4183P0165n213n2879l9274a4732B76477
19255b1311B47164o1558a83121N4591n6649C70850a68198e331B77677e1757j04795
19244a56552A18234c00490H8335D541R0825k5319k6566b85456a11845C01842b2294
19232a64213B81171F2401g6264F4651a79279j73653A29306J08244c348j09644
19222a12992B05557c06371J34068j30509a15538b267j60316p3708p8488A1885
19211b91527h1723b4897B71059b36390i167j33132B78280i8787B5058J48843H890
19199a20731A37113a56797n9877d3990J7274j84686B49767a2089k28317i9222
$$ y = [-106978, -37689, 212306, 326779, -313708, -54698, -22808, -195168, -441001, 116541, -85109, 59123, -111586, -186088, -40436, 246085, 161902, 232067, 226854, 173975, 134701, -14732, 276477, -21311, 247164, 185606, -183121, -128530, -185179, 370850, -168198, -5331, 277677, -51757, -156552, 118234, -300490, 88335, 4541, 95366, 70047, 43481, -285456, -111845, 301842, -22294, -164213, 281171, 62401, -76264, 64651, -179279, -352932, 129306, 237550, -3348, -112992, 205557, -306371, -172303, -302812, -115538, -2267, -162583, -236291, -314779, 11885, -291527, -81723, -24897, 271059, -236390, -9167, -142299, 278280, -98787, 25058, 173901, 8890, -120731, 137113, -156797, -216674, -43990, -26716, -211402, 249767, -12089, -240406, -99222]
19188a06909M4488p1297j58363e6633A31763a36015M138j16615c7510j47032j39651
19177c24193C2807K3729g9590D071c0907n0607l0824D9160f5258l9958K7533j93730
19165b71413A80679a06212F4236b34587b930G8001f2818I6424C6985K21904h4137
19153a88291m269I1836d75982E3028a31820j63867F39b05404F0730b36684H6452
19141b06047I6137e2640B58720b1778A48641I080a88520m377M6122B93i9704j8924
19129a18628j8663A83520D9894J08794c18847C08370a91804A1997J33814b07890
19118b11121B35450c03791F006J86361R6579a49704H7404l0623i2028l8185B29499
19106H9661b89693D6917K2833b66093a28465j75798D3794P5172a9582l41647A40495
$$ y = [-106909, -62421, -133718, -292081, -56633, 131763, -136015, -131877, -248492, -37510, -184542, -324193, 32807, 56536, -79590, 4071, -30907, -81514, -112338, 49160, -65258, -105216, -77683, -271413, 180679, -106212, 64236, -234587, -2930, 78001, -62818, 96424, 36985, 258889, -84137, -188291, -192560, 91836, -475982, 53028, -131820, -295687, 639, -205404, 60730, -236684, 86452, -206047, 96137, -52640, 258720, -21778, 148641, 9080, -188520, -192897, -146775, 293, -99704, -118628, -137291, 183520, 49894, 158688, -318847, 308370, -191804, 11997, 145811, -207890, -211121, 235450, -303791, 6006, 192367, 288946, -149704, 87404, 56781, -92028, -130213, 229499, 89661, -289693, 46917, 69750, -266093, -128465, -304263, 43794, 118966, -19582, -361229, 140495]
19094A22196c7127j34047a5075B17292F522O6106h4899j94921A3960b904k85359
19083b88263l8661c2937E6725M8525h538j42630A9654b3079k60196A97167d07865
19071b29251A63538b25985d4162k77096I8263J49321b09714b4092k36126G6541
19060A92256a35707E4771a35403M0611q4696j96842J33178A22876a38177C12736
19049h3303b8979j10298e1387r3969M6734a8810q5769B7705O3870j0298a34837
19037G3967e0916j26389C4429L337m354J06067a54921f6914A97755B5715b55403
19025h6153F8099a0331r1365A42518E5802a03401A34101a08282A8253K2308a35487
19013d2144j65256L2743G05K34339A10508f3282p499C5200b48553A31360n4460
$$ y = [122196, -37127, -171174, -15075, 217292, 6522, 72628, -84899, -279820, 13960, -2904, -288263, -326924, -32937, 56725, 105250, -8538, -151168, 19654, -23079, -283275, 197167, -407865, -229251, 163538, -225985, -44162, -321258, 98263, 247584, -209714, -24092, -260218, 76541, 192256, -135707, 54771, -135403, -94792, -179488, -376330, -243152, 122876, -138177, 312736, -83303, -28979, -139277, -51387, -145356, -98622, -18810, -104579, 27705, 91575, 81277, -134837, 73967, -50916, -177305, 34429, 37766, 33412, 139479, -154921, -66914, 197755, 25715, -255403, -86153, 68099, -10331, -101696, 142518, 55802, -103401, 134101, -108282, 18253, 40561, -135487, -42144, -207400, -174657, 705, 235044, 110508, -63282, -70781, 35200, -248553, 131360, 76900]
19002G6900b75136a9617k96726j91134a47720A2276M2084a8553k683q3194A03924
18990b55417d7492c930A63324O7104A226M4932j3055a89625B30193i8123B56187
18978b60778e2600F2227a49877l7553g3198A20797K29356a05803C01758g2642
18967I3987R5387c01594A00860c77759a05152a5799l3934A50822a10772H5982
18956D8092K26155c58656B6609e9895J6958k82m7869L679j10652j07412G0347
18944c96278E7026b1322m8828E6135J87625c79277A90327c1148k31356B21362
18933e3829B63758r5026l5055b19827a4637k54404O1042q076O6795B59360j11157
18922A48203a2656p9816I615Q1973k6500r705a60186N4334M972j39024a10170
$$ y = [76900, -275136, -19617, -316343, -507477, -147720, 12276, 54360, -18553, -21236, -104430, 103924, -255417, -47492, -3930, 163324, 230428, 1226, 46158, 33103, -189625, 230193, -98123, 256187, -260778, -52600, 62227, -149877, -187430, -73198, 120797, 350153, -105803, 301758, -72642, 93987, 189374, -301594, 100860, -377759, -105152, -15799, -49733, 150822, -110772, 85982, 48092, 274247, -358656, 26609, -59895, -42937, -43219, -91088, -87409, -198061, -305473, 70347, -396278, 57026, -21322, -70150, 56135, 243760, -379277, 190327, -31148, -262504, 221362, -53829, 263758, 168732, 133677, -219827, -14637, -269041, -207999, -216075, -149280, 259360, 148203, -12656, -92472, 9615, 91588, 65088, 55383, -160186, -105852, -100880, -239904, -110170]
18910b17396K1699C57539c9930k10708i9639C9228N1573d2959A6769a40166C93573
18898a39836A91747a39573H9093a15736c7709A19857b10267A53320B1571M1744
18888F3315a16426k7292j50952B0807i7594L8035j11712B4988i4598b7755l252
18877c1007a4964j6613A6100a23941k0683j60154a11328H3896i8228L3018j71567
18866b36777B04853e5949B90045b45306g1187L0064q1903B59368J78910a01444
18855b0045j93516J05365A5768O2485J9979c0329A07281J37232n0729a90668e0411
18843b34173g968D816a34588M0184j96751H8549J63207I6940J26212I1045B3801
18831c05629B89201a43125N7215A96008g7894j96957a27178l0365A88217j6683
$$ y = [-217396, -195697, 357539, -39930, -250638, -99639, 39228, 90801, -42959, 16769, -140166, 393573, -139836, 191747, -139573, 89093, -115736, -37709, 119857, -210267, 153320, 21571, 63315, -116426, -143718, -294670, 20807, -97594, -59559, -171271, 24988, -94598, -27755, -31007, -14964, -31577, 16100, -123941, -144624, -304778, -111328, 83896, -98228, -65210, -236777, 204853, -55949, 290045, -245306, -71187, -41123, -123026, 259368, 438278, -101444, -20045, -213561, -108196, 15768, 78253, 98232, -30329, 107281, 244513, 193784, -190668, -50411, -234173, -7968, 4816, -134588, -94404, -291155, 88549, 251756, 96940, 223152, 91045, 23801, -305629, 289201, -143125, -85910, 196008, -77894, -274851, -127178, -157543, 188217, 171534]
18821A71534a96591r1490a07219D22111j01644j08078K7105A8345K69379g1627
18810A97942O9004k8137K1749a33135N2270B71483B9757J20018a63562k0845C3428
18798b58590M9352R9839l19203F4803B5416M4417c95796d5102l8100k73070f2934
18786A36016b37374I7674M8515a03331j0887H9272a74448P8726K7389j54247Q2649
18775a39931k15511f6795j1668J8632a7023C3208a69081I6592O5219a41236J3968
18764a27268I4986Q6306K9320r9686i2910o9230I004J17391a0503k9789D03270
18752a4090A27654o3077b9331k27788q2839J62965j02230B53787g4844j66108
18742b40952A17334f9774j19416A22896N6133j1235D0327J05389I610a20543e3637
$$ y = [171534, -196591, -288081, -107219, 422111, 320467, 212389, 239494, 18345, 287724, -71627, 197942, 266946, 238809, 260558, -133135, -80865, 271483, 29757, 149775, -163562, -184407, 33428, -258590, -209238, -109399, -428602, 64803, 25416, 69833, -395796, -45102, -83202, -356272, -62934, 136016, -237374, 97674, 146189, -103331, -114218, 89272, -174448, -95722, -68333, -222580, -139931, -355442, -66795, -78463, -59831, -17023, 33208, -169081, 96592, 161811, -141236, -127268, 94986, 181292, 210612, 110926, -92910, -162140, 9004, 126395, -10503, -40292, 403270, -14090, 127654, 64577, -29331, -257119, -339958, -176993, -279223, 253787, -74844, -240952, 117334, -69774, -189190, 122896, 179029, 167794, 40327, 145716, 9610, -120543, -53637]
18730a34893N6101l3369m2997F4681i3014j09612a7515B6290g1868k5974B46376
18718b39018n8564A210f2851F3024b49043L3453B553a50276r7240g7286j66645
18707b43931A87073a61369L3491N7917j18141a3845r6666C0489J24615J22221
18697B77325a43A38839d11782J89853a7811G6763J2818b41082I346g9017A24043
18685A02054E0819J3337f4930C07898g6637m27289E3697b44351M2797M6205D0571
18673c14609G737J30736c2438l74002J91604A15153c18158A4497Q434a91326A58731
18661B84585d6152A16637N4457A6721a34280N0363B30734i6710K1726A25176a18755
18649B81368j33334c90650D6927b20765c2369B78166E8390J79479A11853e8723
$$ y = [-134893, -78792, -112161, -155158, 64681, -93014, -202626, -17515, 26290, -71868, -97842, 246376, -239018, -297582, 1210, -62851, 63024, -249043, -215590, 2553, -150276, -247516, -77286, -243931, 187073, -161369, -127878, -69961, -188102, -13845, -110511, 30489, 155104, 277325, -143, 138839, -411782, -221929, -17811, 76763, 89581, -241082, 9346, -79017, 124043, 102054, 50819, 64156, -64930, 307898, -76637, -503926, 53697, -244351, -201554, -155349, 40571, -314609, 7737, 138473, -32438, -406440, -214836, 115153, -318158, 14497, 22931, -191326, 158731, 284585, -46152, 116637, 171094, 16721, -134280, -83917, 230734, -96710, -74984, 125176, -118755, 281368, 148034, -390650, 46927, -220765, -32369, 278166, 58390, 237869, 111853, -58723]
18638C551a08262k47126A07115a85619D4675M2646E198J28258j8726E6099b78702
18626A6132J71641a53453E8567b965A86306d7649B2895b13902P3778B78260A18485
18614a63867N6872j70113G8460f2057k69354P4063n8346a10349j80448K3195e2363
18602C35493b02004b740G8767c52358d520A14112c9170m4921B72852H3276f0343
18590F2854c43268N2962a12565a3277I9520C5778d5155l95098c3622j11391L8861
18579a06152C3899b53353g8452L4663C15179f4768I4392i1515b9491j42228j68410
18568c40129F1781f4470A10219h5941k33091I2302L6411b457r8710k6072L2777
18557i4462C3431a20466j87075a14730d0727l04648J36807L412D3444J02478J75468
$$ y = [3551, -108262, -355388, 107115, -185619, 44675, 87321, 5198, 133456, 114730, 56099, -278702, 16132, 187773, -153453, 58567, -2965, 186306, -47649, 22895, -213902, -140124, 278260, 118485, -163867, -106995, -277108, 78460, -62057, -331411, -257348, -315694, -110349, -290797, -267602, -52363, 335493, -202004, -2740, 78767, -352358, -4520, 114112, -39170, -84091, 272852, 83276, -60343, 62854, -343268, -290306, -112565, -13277, 99520, 35778, -45155, -440253, -33622, -145013, -106152, 33899, -253353, -78452, -43789, 315179, -64768, 94392, -91515, -29491, -171719, -340129, 61781, -64470, 110219, -85941, -319032, 92302, 128713, -2457, -101167, -127239, -94462, 33431, -120466, -307541, -114730, -40727, -345375, -208568, -205156, 43444, 145922, 321390]
18546C21390B7361b50823Q9514j51679a9058n8477a8579A16148g1563A96042d4701
18534B6836b49060C11607j29756d63123A67806b2370k03261j26150H6802b09691
18523c3613j54707O9742r680G3289K4423h1886j68435n7139b138C44616a27035
18511b1209B4811K59621a6238j51215f3086B21714E5311J15980G6381J9102a84003
18499B159J8157b35994f6725A68116A5426J58964d0757A90995C6104D446L00342
18488C04788A26390M1597a22222j12379B4658g2040E3804a29556m8273A17910
18477H189f8054E2627b37767g0624j91985E3157b02412R1645L2529K3495B8272
18465f3517m9017l5822A14529a15450c3488q232B3857a10085B74324G6285g1556
$$ y = [321390, 27361, -250823, -161309, -312988, -19058, -77535, -18579, 116148, -71563, 196042, -44701, 26836, -249060, 311607, 181851, -463123, 167806, -22370, -225631, -351781, 86802, -209691, -33613, -188320, -118578, -128258, 73289, 97712, -81886, -250321, -307460, -2138, 344616, -127035, -21209, 24811, 284432, -16238, -167453, -63086, 221714, 55311, 171291, 76381, 95483, -184003, 2159, 20316, -235994, -66725, 168116, 15426, 174390, -40757, 190995, 36104, 4446, 304788, 126390, 167987, -122222, -234601, 24658, -72040, 53804, -129556, -177829, 117910, 8189, -68054, 52627, -237767, -70624, -262609, 53157, -202412, -110767, -78238, -54743, 28272, -63517, -112534, -148356, 114529, -115450, -33488, -41720, 23857, -110085, 274324, 76285, -71556]
18453h6460d3101b261A00428g3455j35981d3745j26825j28587A9861c75055J33607
18442b41448r2660j69721i6872K419A30729a65641j2872H1241c9744a7705B62973
18430a74996Q2206D0409a24059c735F0886b87180J30628A54971E3088J12339a34020
18418D484Q4922l7667a2034A4508K34009K7507A19322e6385k80169J55245A5483
18406i0871E5252c42067E6968Q0459n9517J38825b05026N6815K7156A72988b21112
18394d22454h5915A7356J09678d1026j31362g2849o2086J8256A98658b67384A02036
18382a36421j64605k7866J1353a14597b7217H6814a38317j92745j07981a00118
18371D5991a83887A95708j9477f5490B66348D7982g0648A16838a71279e441A18570
$$ y = [-86460, -43101, -2261, 100428, -73455, -209436, -43745, -170570, -299157, 19861, -375055, -241448, -334108, -503829, -96872, -94453, 130729, -165641, -178513, 81241, -39744, -17705, 262973, -174996, -92790, 40409, -124059, -3735, 60886, -287180, -156552, 154971, 53088, 165427, -134020, 4484, 89406, 51739, -12034, 14508, 248517, 276024, 119322, -56385, -336554, -181309, 15483, -90871, 55252, -342067, 56968, 137427, 77910, 216735, -205026, -148211, -121055, 172988, -221112, -422454, -85915, 17356, 127034, -41026, -172388, -72849, -134935, -116679, 198658, -267384, 102036, -136421, -301026, -328892, -317539, -114597, -27217, 86814, -138317, -331062, -439043, -100118, 45991, -183887, 195708, 176231, -65490, 266348, 47982, -70648, 116838, -171279, -5441, 118570]
18359e4355H4194b81121h1741m2201k41190P3609Q5323M8295D9510b41697A11302
18347A3736e18166b7171J2769j5120B73082f4603I6847J0823b53512d2740c073
18335A88737a1698I9417b5597E2795L7750J61088a438B4689a29778B95986b15543
18323E8869e0545D9501a04745l2632r8988K719A21662J68034b14769C0861M8317
18312G9178h9714j9909D0141f5069B46110c6275D6772a84164k43985f3913L180
18301f0733C4875b9980k03881k91873B9733a76548d1624F2486a00755J3843B43905
18289C5234r712J07838b14716r5483a21984F100b78346a36660M3118I9496B5279
18277A53588n5745L5716c16924a37324C48555G2103R3717O6434I0743l6718a92056
$$ y = [-54355, 84194, -281121, -81741, -123942, -365132, -291523, -206200, -157905, 49510, -241697, 111302, 13736, -518166, -27171, -14402, -29522, 273082, -64603, 96847, 107670, -253512, -42740, -3073, 188737, -11698, 99417, -25597, 52795, 90545, 251633, -1438, 24689, -129778, 295986, -215543, 58869, -50545, 49501, -104745, -137377, -236365, -233646, 121662, 289696, -214769, 30861, 79178, -89714, -109623, 40141, -65069, 246110, -36275, 46772, -184164, -428149, -63913, -60733, 34875, -29980, -233861, -525734, 29733, -176548, -41624, 62486, -100755, -86912, 243905, 35234, 25522, 133360, -214716, -310199, -121984, 6100, -278346, -136660, -93542, 99496, 25279, 153588, 97843, 133559, -316924, -137324, 348555, 72103, 165820, 232254, 90743, 54025, -192056]
18265b18540B70887A09479D9687a81290C2641d2176j58543e9718P200F7729a7938
18253B97292D545Q4676J78418A2068h0243B2784f243j11318j62273Q0691D9121
18241c1694n9426B17677b40170k760n898l4144b4462k03666A40269c1422F8990
18229d7006D0096P0657a20272E8227L00186i7362b4030j57132r733P7890A82344
18217c11189c8764E59022g6167D1859a23420M4563j5555j9139q2626e9996R961
18206e0035k5728B66563h0502k960I0441a51134j33729A74386B7853a08752A16174
18194D8815P3119a32361H9430g9461A8262a01937B10520b10399i246k50270A40376
18182f707C965f4293A9047K10074b34985f1161n2220A77544b2301j83963A25271
$$ y = [-218540, 270887, 109479, 49687, -181290, 32641, -42176, -200719, -59718, -52518, 67729, -17938, 297292, 4545, 89221, 267639, 12068, -80243, 22784, -6243, -117561, -279834, -199143, 49121, -31694, -91120, 217677, -240170, -242930, -248828, -282972, -24462, -228128, 140269, -31422, 68990, -47006, 40096, 110753, -120272, 58227, 358413, -97362, -24030, -181162, -190895, -113005, 182344, -311189, -38764, 559022, -76167, 41859, -123420, -78857, -94412, -113551, -196177, -59996, -50035, -75763, 266563, -80502, -83462, 90441, -151134, -284863, 174386, 27853, -108752, 116174, 48815, 121934, -132361, 89430, -79461, 18262, -101937, 210520, -210399, -9246, -259516, 140376, -6707, 3965, -64293, 19047, 229121, -234985, -61161, -113381, 177544, -22301, -206264, 125271]
18170c46480N8031k15601h329A76904b90667A48619f7113k0737A50650i6572K3411
18159g3161A07203j659a58089A59082f9079k53428A70619c33669R6200c9997A77465
18147A80066a22369d3199A65468Q1330b38315p1160d5061J2008l295A623M9368
18136E0991b59901K1598h5767a860B67455b095n0146E7305L7799a09278j8948
18125a28226a3074l17166a2471j3143B13896j05585h0521n2331O6387P949A69705
18113b00065B9224J38927k5739m3979P2931b90398A56089a26809D532b64155p7608
18102c41763a23747o5766B10472b67627J32599F1741K3921a36118A35788c9542
18091i9826A38409b16489H5597h5346l1787A39443D1869J91497a47442O5832k29234
$$ y = [-346480, -288449, -504050, -8329, 176904, -290667, 148619, -67113, -87850, 150650, -96572, -73161, 107203, 105544, -158089, 159082, -69079, -322507, 170619, -333669, -237469, -39997, 177465, 180066, -122369, -43199, 165468, 246798, -238315, -309475, -45061, -33053, -36348, 1623, 50991, -259901, -238303, -85767, -1860, 267455, -2095, -52241, 57305, 95104, -109278, -128226, -13074, -330240, -12471, -25614, 213896, 108311, -80521, -132852, -66465, -58516, 169705, -200065, 29224, 168151, 142412, 98433, 171364, -290398, 156089, -126809, 4532, -264155, -341763, -123747, -189513, 210472, -267627, -135028, 61741, 85662, -136118, 135788, -39542, -99826, 138409, -216489, 85597, -85346, -117133, 139443, 41869, 233366, -147442, -81610, -310844]
18080c10844P3131a6061k81391O4755e9196A3713K87233a99082C72736C6785a23035
18068i7022B48732a17459B38312a46768b7837j6009j00120b7847l8203B8601Q8733
18057A17334D7987J29928q7275c6920E4828g9554I8032f5399p0765A13011j6952
18046I6059a23426E8425O4402C6615K66677d43153b0847n9044r0921H6068f6365
18034A4524J77790B9481J11160A4230a74531L7654B6241J62762i6326K3853C79203
18022A86263B6975L24533I5137L4486j9220a91019a9628B10441d95n1243n8507
18011a10245q2286J6286o7711E2450N6452a09822D66466a54846J2742D2902b68741
17999D02246b9163C19271c815l4708k61645E7459a40468G0728b31580k3014B90375
$$ y = [-310844, -237713, -16061, -297452, -232697, -59196, 13713, 300946, -199082, 372736, 36785, -123035, -97022, 248732, -117459, 238312, -146768, -27837, -43846, -143966, -27847, -66050, 28601, 117334, 47987, 177915, 90640, -36920, 54828, -79554, 98032, -65399, -136164, 113011, 96059, -123426, 58425, 122827, 36615, 303292, -443153, -20847, -79891, -170812, 86068, -66365, 14524, 192314, 29481, 140641, 14230, -174531, -136877, 26241, 189003, -96326, -72473, 379203, 186263, 26975, 351508, 95137, 129623, 110403, -191019, -19628, 210441, -495, -51738, -110245, -192531, -176245, -243956, 52450, 108902, -109822, 466466, -154846, -142104, 42902, -268741, 402246, -29163, 319271, -3815, -38523, -300168, 57459, -140468, 70728, -231580, -254594, 290375]
17987i2713A31708b05469i6380A56511B0761c01229N4785C72194b19314g8992
17976A48508g9062q5455B27568a6436A63817i2679a6810r563B15890c20106c8198
17964A3260J45165K48054c53726a49637L7849D72437B31470a81958F4931L1900
17954I6831D2993h5391A67057A8826K2005b35296B3130b2116j05957j17664f9059
17942a79571e7432D1698c79272g8435j83034F7914a7032q6378A3564b04771B05770
17930g9773j60733a5367I459J17541F0557J07272b2522j88786A06658f6546A24643
17918A55890M1763B2471b24578E3J89497I0744b57106R7490c025p452A08006J45633
17906B53639G0599b01236C0321N951O4590f7132r8859e9582a7263B99664d5983
$$ y = [-92713, 131708, -205469, -96380, 156511, 20761, -301229, -246444, 372194, -219314, -78992, 148508, -79062, -164517, 227568, -16436, 163817, -92679, -16810, -26373, 215890, -320106, -38198, 13260, 158425, 406479, -353726, -149637, -111788, 472437, 231470, -181958, 64931, 96831, 42993, -85391, 167057, 18826, 40831, -235296, 23130, -22116, -128073, -245737, -69059, -179571, -57432, 41698, -379272, -78435, -261469, 67914, -17032, -103410, 13564, -204771, 205770, -79773, -240506, -15367, 9459, 127000, 60557, 167829, -22522, -211308, 106658, -66546, 124643, 155890, 197653, 22471, -224578, 53, 189550, 90744, -257106, -159616, -3025, -10477, 108006, 253639, 70599, -201236, 30321, 36272, 100862, -67132, -165991, -59582, -17263, 299664, -45983]
17894G4420C3743a30225l7071m6872B70698p897a39770A29101G286M290a02709
17882C35416D4753a61801j11645R9135a7769B15336h7837J4208m3619N174j32618
17871b44692d1159A90405e0510j24466B12363a20637B07864g97E6130K10684n4297
17860B12517M0538F7580C066K3598K03615A19a66581B46496g7010n1706o1641
17849a90357D2115f9285j08778A61488a17069J7554p604B50167k117g8482A9644
17837b132l2551k30604J5605I6180a26394D1878J3701i7384C50211A61682J20655
17826B82337b56047B58876a20418n7523b8855k00149H0711l8608a4521k09315
17816b23836B00377E5051R6540m7375C1499a86897A29892J46972a89858F4192
$$ y = [74420, 33743, -130225, -167296, -214168, 270698, 262801, -139770, 129101, 7286, 11576, -102709, 335416, 44753, -161801, -273446, -174311, -17769, 215336, -87837, -73629, -117248, -112074, -244692, -41159, 190405, -50510, -174976, 212363, -120637, 207864, -797, 56130, 266814, 212517, 253055, 67580, 3066, 26664, 230279, 119, -166581, 246496, -77010, -128716, -190357, 42115, -69285, -178063, 161488, -117069, -99515, -107119, 250167, 248050, -78482, 19644, -2132, -34683, -265287, -249682, 96180, -126394, 41878, 55579, -97384, 350211, 161682, 282337, -256047, 258876, -120418, -177941, -28855, -229004, 80711, 42103, -14521, -223836, 200377, 55051, 151591, 104216, 31499, -186897, 129892, 276864, -189858, 64192]
17805E4052a87485C3712a21237F416a7116A15730d794k36367f342j9879o7556
17794i3777A25939A6752N6235K6887c83644E8469c07919a9918A70283O8525o0618
17783A78190J6267b7322j90503A08653c3208j13912A81280c37090F9876h2301
17772A07499c2289I5487b6167A63590H1780c2730F6538I408L13399p1479C8652
17760b7519D4781M3767a40933G8330A2936Q551h7475j11453P1486M4884j22044
17749b04602A60270B6758J09694a33375b8607A72204b38132D6908c0611k29035
17739b59646B78101a76757j32413F1880a07749C549M0426a44650F6450f2231D2039
17727C54890c72627a38494E7900a94433N8502H3889R9018f4620f713A32093a40554
$$ y = [54052, -187485, 33712, -121237, 6416, -17116, 115730, -4794, -241161, -6342, -26221, -93777, 125939, 16752, 72987, 99874, -383644, 58469, -307919, -19918, 170283, 238808, 178190, 194457, -27322, -217825, 108653, -33208, -147120, 181280, -337090, 69876, -82301, 107499, -32289, 95487, -26167, 163590, 81780, -32730, 66538, 9408, 322807, 251328, 38652, -27519, 44781, 88548, -140933, 78330, 12936, 21487, -87475, -198928, -127442, -82558, -204602, 160270, 26758, 136452, -133375, -28607, 172204, -238132, 46908, -30611, -259646, 278101, -176757, -309170, 61880, -107749, 3549, 43975, -144650, 66450, -62231, 42039, 354890, -372627, -138494, 57900, -194433, -135931, 83889, 182907, -64620, -6713, 132093, -140554]
17715B1259L23504e321j91542I5673J84107P7938A29103c4405K066B5322P294
17704C2616a6359o08C5348J33493D72J3240a58592m10A65114a58700j7189p8698
17692b54587c4690C05417j43624a6194l5922r3321B72443C7920a01435A77359
17681B20625g7045k45138B6052J14732N9672d5403k4810B43306F8521M322j6552
17670E6291K24518g9543m3954k8396b6521n2197A52925i6041B27724C7435a56184
17658a14552b7159k58140B31761R4705A29379N0286a2995j70169A59561O1822
17648B21383h7164A07196a43608e5611r8665c433m9667j63025A52631F1930a06707
17636C0650g1A48622K98237b59249A06588L4076F6842J90100A22339J69282q7369
$$ y = [21259, 344763, -5321, -196863, 95673, 279780, 357718, 129103, -34405, -32339, 25322, 32616, -16359, -16967, 35348, 168841, 472, 13712, -158592, -159002, 165114, -158700, -175889, -254587, -34690, 305417, 161793, -16194, -52116, -145437, 272443, 37920, -101435, 177359, 220625, -77045, -322183, 26052, 140784, 200456, -45403, -70213, 243306, 68521, 72843, 56291, 280809, -79543, -123497, -151893, -26521, -78718, 152925, -96041, 227724, 37435, -156184, -114552, -27159, -285299, 231761, 326466, 129379, 179665, -12995, -183164, 159561, 221383, -87164, 107196, -143608, -55611, -154276, -3433, -53100, -216125, 152631, 61930, -106707, 30650, -71, 148622, 446859, -259249, 106588, 140664, 66842, 256942, 122339, 291621, 204252]
17625B04252L3908G5376d75941B24914A7508a22865k1691A10376a59559d575r8077
17614a02652F8298L34615a5508j34820C52609A65168J95582A08712a64361F7915
17603b04427D493L1141K01011k500a02082B03452L6316h2362A46740a7280B60063
17591a93128D6942K21465B9416J25946a95478D02439a18017C60292A64135b06177
17580E4338q7k2301j0577R2817C7651a08392F3685a4078A45890b4442B0040b56058
17567c8702C19204A5507K91074d4867A01954J58929a51561q5563H0125f0258A485
17555e3157E00J61457o8181j14J43970E9795b20520b3883H7049J08211e1604F4222
17542G7020k2824a55060o7530B02097E4764Q2666j2809K4522k1750d8866E6327
$$ y = [204252, 238160, 75376, -475941, 224914, 17508, -122865, -144556, 110376, -159559, -4575, -102652, 68298, 402913, -15508, -150328, 352609, 165168, 360750, 108712, -164361, 67915, -204427, 4493, 35634, 236645, 234145, -102082, 203452, 239768, -82362, 146740, -17280, 260063, -193128, 46942, 268407, 29416, 155362, -195478, 402439, -118017, 360292, 164135, -206177, 54338, 54251, 31950, 21373, 114190, 37651, -108392, 63685, -14078, 145890, -24442, 20040, -256058, -38702, 319204, 15507, 306581, -44867, 101954, 260883, -151561, -237124, 80125, -60258, 1485, -53157, 500, 161957, 93776, 93662, 237632, 59795, -220520, -23883, 87049, 195260, -51604, 64222, 77020, 54196, -155060, -222590, 202097, 54764, 137430, 124621, 149143, 127393, -48866, 56327]
17530E2364M1885j1454a5167k283n32542B76074b00090R4171A45841K82838A77292
17518E54273A9928c1404B55410K1656j19155a70109N9045d5054B36437a18917
17507h4232l977C22712a04284l847A4377J92484c6260p3894j21290B85749g8937
17495D35248J5541a574j842C8110a255I3083J56460a09494m1968B85670a34101
17483B25264q9613c7733A81290a8401B78732J57822i375B27883a0325B81437b74801
17471a4656C08052J1672C4244M3462P5251K3275d1563A16153K21802m4885A29726
17459h2215B04792A1801a45272B93648j13952K66136l7570j42663b5757k7834
17449e3591A96810m2153K31773H3633i2815B99938E5521J74003J53231I0816J91866
$$ y = [52364, 94249, 82795, -15167, -17450, -549992, 276074, -200090, -105919, 145841, 428679, 177292, 554273, 19928, -31404, 255410, 277066, 157911, -170109, -111064, -45054, 236437, -118917, -84232, -88209, 322712, -104284, -108131, 14377, 206861, -36260, -110154, -231444, 285749, -78937, 435248, 450789, -1574, -3416, 38110, -1255, 93083, 249543, -109494, -151462, 285670, -134101, 225264, 135651, -37733, 181290, -18401, 278732, 436554, -9375, 227883, -10325, 281437, -274801, -14656, 308052, 319724, 34244, 77706, 152957, 176232, -41563, 116153, 337955, 293070, 129726, -82215, 204792, 11801, -145272, 293648, 179696, 445832, 408262, 265599, -25757, -53591, 196810, 154657, 386430, 83633, -92815, 299938, 55521, 229524, 382755, 90816, 282682]
17438B82682A33320L1011Q7937G2109R2036n7018J68741I7011K67291b1548A87700
17426D34353j37049A12297J89125P4324j85566O5301g0385q1148q3124B73045
17415B50810j13955R3254J56730R2470B7971L35776j6138H3220b6887A91689A4827
17403B32984a92567B16106L0707c9348A90236J22523r6997I93O7477h8764D56609
17391E5223J81801a25985A31270g7262A34011c6216A27349J5399C9589J5070n529
17380D9130Q2736o5685K95847G819i9801A88066c6913C25922l3642k4157J30252
17369C98375c2353k00836B28176j360b602q035q3505D42009I9921a11814B17735
17357A14432K8034F5719e731H5470c2845j8612A75763A0347J85463b4030A58114
$$ y = [282682, 133320, 164331, 252268, 72109, 164145, 107127, 275868, 97011, 364302, -21548, 187700, 434353, 297304, 112297, 301422, 375746, 190180, 255481, -70385, -151533, -234657, 273045, 250810, 136855, 230109, 386839, 479309, 27971, 363747, 347609, 83220, -26887, 191689, 14827, 232984, -192567, 216106, 246813, -39348, 190236, 312759, 215762, 993, 68470, -88764, 456609, 55223, 237024, -125985, 131270, -77262, 134011, -36216, 127349, 142748, 39589, 54659, 49130, 131866, 66181, 362028, 7819, -99801, 188066, -36913, 325922, 292280, 268123, 398375, -32353, -233189, 228176, 226816, -2602, -10637, -94142, 442009, 99921, -111814, 217735, 114432, 142466, 65719, -5731, 85470, -32845, -51457, 175763, 10347, 195810, -24030, 158114]
17345I3640R9420L0555O9556C4556r465J24597N4456L48043F4378M3175M3210
17334A50763J04920j22221o3887L14626A17798Q5561n8666C2878L52332J44518
17324E29728c1979I2737J9534m1602K4787b9812C84846j37506r2742O5660r7165
17313A23093b45484A12038c7402B6108K48297p6989Q5352J8624p6357F086J9564
17302B5650a7546A70586k1906N5322O9197C3177Q2175l502J51915a0785D48483
17290A49142P0593K6408q568J70188A90995H052K03932R1166E132a04159B74069
17278D94389A52606J23054O5213A11228n3852A5803b4635B73406j16449K75937
17268D32894j06270D4468J06478a02644C28131j24838Q4078j4041A0365L20303
$$ y = [93640, 193060, 223615, 293171, 34556, 25091, 149688, 204144, 552187, 64378, 107553, 150763, 255683, 133462, 69575, 384201, 117798, 203359, 144693, 32878, 385210, 529728, -31979, 92737, 112271, 70669, 95456, -29812, 384846, 247340, 154598, 220258, 123093, -245484, 112038, -37402, 26108, 274405, 197416, 282768, 301392, 225035, 6086, 25650, -17546, 170586, 148680, 204002, 273199, 33177, 115352, 111850, 263765, -10785, 448483, 149142, 219735, 246143, 237575, 407763, 190995, 8052, 211984, 303150, 5132, -104159, 274069, 494389, 152606, 275660, 340873, 111228, 57376, 15803, -24635, 273406, 156957, 432894, 326624, 44468, 150946, -102644, 328131, 203293, 287371, 273330, 10365, 330668]
17258C30668j51761d15A41792l20a0509B70850J27717J5779A53888o7569J76333
17247B62652N1173J11921A46328J66218J79181e7572D0133J83857G6466K70821
17237C47287N8361A2432K30141H9050R2663J97799C9637b011A36175o7261Q1483
17226A50397k0895J42062M1881R8976g092A1988J68483Q7756A15406L22915j34906
17215C03415a58657B96973J07583H9271J83665R9814a75704P6956A98106a39879
17204A59161J42564I5862J61922l0675N9162B0483J25575C1892J53001D5771K37705
17193B83476a8298F0648J56549N4794Q15N073Q988P8619L8910q6058H5047h5796
17180E0058J16810P1542K48706a28349A52501a00914k2962A98042L09429M6917
$$ y = [330668, 178907, -415, 141792, 141472, -10509, 270850, 398567, 414346, 153888, 86319, 262652, 313825, 425746, 146328, 312546, 491727, -57572, 40133, 223990, 76466, 347287, 405648, 12432, 242573, 89050, 181713, 379512, 39637, -2011, 136175, 68914, 150397, 129502, 271564, 313445, 412421, -7092, 11988, 180471, 268227, 115406, 438321, 303415, -158657, 296973, 404556, 89271, 272936, 372750, -175704, -98748, 198106, -139879, 159161, 301725, 95862, 257784, 227109, 286271, 20483, 146058, 31892, 184893, 45771, 283476, -18298, 60648, 217197, 271991, 272806, 277879, 286867, 365486, 404396, 318338, 85047, -85796, 50058, 166868, 238410, 487116, -128349, 152501, -100914, -123876, 198042, 507471, 554388]
17170E54388R5554k47728J2047P2031l5333k13705M49599A31763O8002L30548
17160E30313k55573J828A24795L91662A16061K23277o3340k5596L71866B46945
17149C37140J24549J0181B06557k8209n685K14082b7167C52254A13341O3076M4051
17138B20468a5923D90700j41222H0017K19686D4499J72685J67643A51630K53330
17128D04960n5414K19172B73689K15219m6706j85848J67335B00262L7111J26519
17118C63892F9750K73705R2733M5195C8193J48844K20740k7739j52466n6934L14060
17107D84698k04099O2757L41966G8874N49778p8120k12484M27795G1120J61198
17097B32318L8840J45485G3147K79048l5157o2348a35355D11357J34954P0116
$$ y = [554388, 649942, 402214, 414261, 486292, 450959, 237254, 686853, 131763, 199765, 530313, 274740, 276568, 124795, 516457, 116061, 339338, 275998, 250402, 622268, 246945, 337140, 461689, 471870, 206557, 178348, 172663, 386745, -27167, 352254, 113341, 176417, 220468, -15923, 490700, 349478, 80017, 299703, 44499, 217184, 384827, 151630, 404960, 349546, 568718, 273689, 488908, 442202, 256354, 423689, 200262, 237373, 363892, 69750, 343455, 436188, 481383, 38193, 187037, 407777, 380038, 227572, 170638, 484698, 280599, 343356, 685322, 78874, 628652, 550532, 338048, 765843, 71120, 232318, 271158, 416643, 73147, 352195, 317038, 254690, -135355, 411357, 546311, 616427]
17087F16427A35521P8856K47610J3816B35340J28512p2129J93637m9406J048j49868
17076B87134F1557J70900J21751j71432O9560J44899J11888J84784j72506q6703
17066D34698j73490K10356m4590j18295M33M35527A29187M06587j48773K77080
17056F64081j93784j29196J31303k2596K95304B51244J82457J54161Q3174J67303
17046H38339A96443K46617J27772k20561K47928B67534J6374J60283J70074j55570
17036D58695L6293J17582p367p4671B51489N61551C14282M02674K8102q3521K9588
17025F91125n2113K2072j37052N0711k6254j5187L27005l65498Q7424o5913J07540
17014F23860K60043D29680m0908K79198k40654r3689O60144m56342J91674j88690
$$ y = [616427, 135521, 214377, 461987, 475803, 235340, 363852, 291723, 485360, 435954, 437002, 287134, 61557, 232457, 354208, 182776, 252336, 397235, 509123, 693907, 521401, 434698, 261208, 471564, 426974, 308679, 309112, 744639, 129187, 535774, 387001, 664081, 470297, 341101, 472404, 449808, 745112, 251244, 433701, 587862, 671036, 838339, 196443, 443060, 570832, 350271, 598199, 267534, 283908, 444191, 614265, 458695, 494988, 612570, 605203, 530532, 251489, 813040, 314282, 716956, 745058, 661537, 691125, 639012, 661084, 524032, 574743, 548489, 533302, 860307, 494809, 582233, 516320, 623860, 883903, 429680, 388772, 667970, 427316, 333627, 993771, 537429, 729103, 540413]
17004E40413r5483P4845K62236k57880M8169J80278l24776L25098q4467L0065
16994F98498M22208m23624K26780k30342j99912J50983K99560n0821K74874j57663
16984A010541j9366j93409J42915L06622D71473M31152j31831J18483k56588N30449
16974A163138m33935M552J77631j28573K27229k80524j03058L26755l01714L23801
16964I75302j94094L65882k95129l325q1447P9280L0754J81391j25382K47361
16954A180593O0793L46075o49860J06513p4301K23331j10470j81922K51389J39736
16944A291877m02230n5753J14193L97643l47937L97421m00883J10184K80507m89428
16934H95594N50790K7471m54121R7173o5769L8293J95973J03928r4283N5396m79310
$$ y = [540413, 444930, 519775, 782011, 524131, 572300, 752578, 427802, 752900, 668433, 698498, 1120706, 697082, 923862, 693520, 493608, 644591, 944151, 893330, 1168204, 1010541, 991175, 797766, 940681, 1247303, 471473, 902625, 770794, 889277, 632689, 1163138, 729203, 733755, 911386, 782813, 1010042, 729518, 626460, 953215, 651501, 975302, 781208, 1147090, 851961, 848636, 767189, 846469, 877223, 1058614, 933232, 1180593, 1241386, 1587461, 937601, 1044114, 969813, 1193144, 1082674, 900752, 1152141, 1291877, 889647, 833894, 948087, 1345730, 997793, 1395214, 994331, 1104515, 1385022, 895594, 1446384, 1473855, 1019734, 1116907, 1051138, 1089431, 1285404, 1389332, 1295049, 1350445, 871135]
16923H71135J10748N01183q9308Q3723j50407j05128n5048N24408m66167J9348
16913A244487L27241j52951K0733J69455l57572j7457M8470K80368l6496K8673
16903A554951o6741R070j14664L38176j12369L48411o66845K57237O00350m73306
16893A674270J57164o6730j10740M51684l01866n438J97509j64467P5880j07496
16883A799770j64128P45271m03090k23178K80027j14023K86282k53856R6936J02110
16873B152121J31128R6988l60700K18115k3345J18544L99967j87680l11650L12718
16863B546206r2326J82705j89553J85522N3703J07974k8059j11990N26782k54683
16853B926281o7574l2103K7141L19313J06914j06557K04693J02970l9557l8270
$$ y = [871135, 981883, 1483066, 1393758, 1477481, 1327074, 1221946, 1166898, 1691306, 1225139, 1244487, 1571728, 1418777, 1439510, 1608965, 1251393, 1233936, 1282406, 1562774, 1526278, 1554951, 1488210, 1497280, 1382616, 1720792, 1608423, 1956834, 1289989, 1547226, 2147576, 1674270, 1831434, 1764704, 1653964, 2105648, 1803782, 1798344, 1995853, 1831386, 1907266, 1799770, 1635642, 2380913, 1977823, 1754645, 2034672, 1920649, 2206931, 1953075, 2050011, 2152121, 2283249, 2380237, 2019537, 2237652, 2214307, 2332851, 2732818, 2545138, 2233488, 2546206, 2453880, 2636585, 2447032, 2632554, 2686257, 2794231, 2766172, 2654182, 3180964, 2926281, 2858707, 2826604, 2853745, 3173058, 3279972, 3173415, 3378108, 3481078, 3441521, 3403251]
16843C403251P0452J54475M4852p7919k71575J40108M44452k2889J0477j29619
16833C766065K6863J27369K85623j38356J71112j23298J80578J24020K51744o07687
16823D064033Q11436j85618o8232Q0848N26515K9458K3787j09729L49020p4585
16813E446933M33274j44626M04480j17554L24086m53601N51005L0563K12313k29614
16803F457259P01790j06959M5329M52165q2996P9507N64985k53536P04136L8471
16793H600151J00386K64144J70091J94750J24443M75783o1376M40813M34119K86482
16783A1029786K4377M30048K75290M99319M90493J59565N70887P04582J62814
16774A4347161N87362Q16854j4377J89043R03498P91957M77209N65733O85571
$$ y = [3403251, 3473703, 3628178, 3673030, 3595111, 3323536, 3463644, 3908096, 3885207, 3895684, 3766065, 3792928, 3920297, 4205920, 4067564, 4238676, 4115378, 4295956, 4419976, 4671720, 4064033, 4875469, 4689851, 4621619, 4702467, 5228982, 5258440, 5282227, 5172498, 5521518, 5446933, 5880207, 5735581, 6140061, 6022507, 6346593, 5892992, 6443997, 6474560, 6686873, 6457259, 7159049, 7052090, 7097419, 7549584, 7466588, 7546095, 8111080, 7857544, 8561680, 8600151, 8700537, 8964681, 9134772, 9329522, 9453965, 9929748, 9868372, 10309185, 10743304, 11029786, 11054163, 11484211, 11759501, 12258820, 12749313, 12908878, 13479765, 14184347, 14347161, 14934523, 15751377, 15737000, 15926043, 16829541, 17621498, 18098707, 18664440, 19350011]
16765A9350011J115744O00100N10844J299466O30186R68185R14689J169915J040495
16756B7599635J301324J380945J158163J393942J715149J413944J957147J765335
16748C9685584K206587J796379K206809K457187K845848K653154K656799L485198
16740E9993545L411929L910964L741069M557816M539161M594591N729864N241870
16732I5720809O039513O247516P118142O853780P550610P551462Q033492P860740
16724A52976064Q077211P789226P201862O755148O385495M941240L966180K176788
16716B00269214J128926n8488k171853l145068m677381n819283o277089p460567
16708A71788411p913771q197588q119669q205144q131294p862957p389595p012234
$$ y = [19350011, 20465755, 21065855, 21576699, 22876165, 23506351, 24474536, 25389225, 26559140, 27599635, 28900959, 30281904, 31440067, 32834009, 34549158, 35963102, 37920249, 39685584, 41892171, 43688550, 45895359, 48352546, 51198394, 53851548, 56508347, 59993545, 63405474, 67316438, 71057507, 75615323, 80154484, 84749075, 90478939, 95720809, 101760322, 108007838, 115125980, 121979760, 129530370, 137081832, 145115324, 152976064, 161053275, 168842501, 176044363, 182799511, 189185006, 194126246, 198092426, 200269214, 201398140, 201339652, 199167799, 196022731, 191345350, 185526067, 179248978, 171788411, 163874640, 155677052, 147557383, 139352239, 131220945, 123357988, 115968393, 108956159]
16700A08956159o690809o142766o466547n260537n326811m658329m829007m043567
16692F5537786l664538m216889k677791l320641k541104k560437k460558k307760
16684D1788068k140192k212120j444588k110685j466800j812465j190060j462613
16676B7948545r88163j332944q06998j024888r71249r62536j004907p65033p07824
16667A9384003r08087n45758n84211p76943m92465l34933q61718l09693q04070
16658A3766125j49706p53557l4746m54282l18466n72771m29576m55687k83800
16649A0313534J1716l39484m22115q4333l66219J13977r03064p2020k64047k46519
16639G741426j61099K7719m67775J19885o31919p4759J160m15842j12640J59043
$$ y = [108956159, 102265350, 96122584, 89656037, 84395500, 79068689, 74410360, 69581353, 65537786, 61873248, 57656359, 54978568, 51657927, 49116823, 46556386, 44095828, 41788068, 39647876, 37435756, 35991168, 33880483, 32413683, 30601218, 29411158, 27948545, 26960382, 25627438, 24820440, 23795552, 22824303, 21861767, 20856860, 20091827, 19384003, 18475916, 17930158, 17345947, 16569004, 16076539, 15741606, 14879888, 14570195, 13766125, 13616419, 12862862, 12828116, 12373834, 12055368, 11482597, 11053021, 10597334, 10313534, 10325250, 9985766, 9563651, 9479318, 9113099, 9227076, 8324012, 8251992, 7987945, 7741426, 7580327, 7608046, 7140271, 7260156, 6628237, 6553478, 6554638, 6138796, 6026156, 6185199]
16629F185199n2092J2442q4789o97716L07964o5221p31152J55933J96183n25787
16619D700964J48979o9330k30964J21117n08809L29728l22638J7256L2148l09466
16609C908985R8684j92342k68804J83031k10960p376r6245j62725L49054o36703
16599B964599N02392k72819K9719j82347J07659m32710L21266m30495K32730j59181
16589B680813K10532m9782k09810l10238K61419M2355r1427p7279l3688j9924
16579B402971m05380M21894j93944m24306L11243l08143Q7995K35084j34801J35036
16569B127649k40027p3240k92093N03320j8916l46921J87545n8776K30725n52646
16559A466620J59994p115J49588O6500k22325k14047J77419L4340J33346q8953
$$ y = [6185199, 6133107, 6145549, 6060760, 5363044, 5671008, 5605787, 4874635, 5030568, 5226751, 4700964, 4849943, 4780613, 4549649, 4670766, 4161957, 4491685, 4169047, 4186303, 4218451, 3908985, 4007669, 3815327, 3546523, 3729554, 3518594, 3511218, 3414973, 3252248, 3601302, 2964599, 3466991, 3194172, 3223891, 3041544, 3149203, 2716493, 3037759, 2607264, 2839994, 2680813, 2891345, 2841563, 2631753, 2321515, 2582934, 2625289, 2533862, 2456583, 2422895, 2402971, 1997591, 2419485, 2225541, 1801235, 2112478, 1804335, 1892330, 2127414, 1992613, 2127649, 1887622, 1814382, 1522289, 2025609, 2006693, 1659772, 1847317, 1788541, 2019266, 1466620, 1626614, 1619499, 1769087, 1835587, 1613262, 1399215, 1576634, 1610974, 1744320, 1655367]
16549A655367l49555J10761j49542K73909L8969k02617K63827k87217j05082N00719
16539A749539o37743L64431J83838r0384k10944J90723m69093K55973M0075J33799
16529A510214l41211L21844n61689J50282J33187k69222k9105J43875l61160K30123
16519I27138O850L7556j28272q277R6991J3397J86952l51089L6229j54427L36510
16508I99558j11267K4842k14089R6264L46169l62681K35203j5192l10560n9032
16498F29215r7093L24408O9247k18768n912L56645l89884J17069J62813l86068
16488E61672k30175M11099M38152E19523R1324o1536l6078M07033l81974M11896
16478I50188k11497J1849J9938k9887r0812l7365j5410J60565m0836C33513J96996
$$ y = [1655367, 1305812, 1416573, 1267031, 1540940, 1579909, 1377292, 1641119, 1353902, 1248820, 1749539, 1111796, 1476227, 1660065, 1569681, 1358737, 1549460, 1080367, 1336340, 1376415, 1510214, 1169003, 1490847, 929158, 1079440, 1212627, 943405, 914300, 1058175, 697015, 927138, 933988, 971544, 843272, 834995, 931986, 945383, 1132335, 781246, 817475, 663048, 999558, 888291, 913133, 699044, 795308, 1141477, 778796, 1013999, 998807, 688247, 629215, 532122, 856530, 925777, 707009, 701097, 1057742, 667858, 784927, 947740, 561672, 331497, 742596, 1180748, 519523, 610847, 549311, 513233, 920266, 538292, 950188, 738691, 750540, 770478, 740591, 649779, 612414, 597004, 757569, 716733, 333513, 530509]
16467E30509N98645C40216M69301C67977J66261K7888j43275j36641K26556l1344
16457D77422j88974L12800J41985C5481M07880J00265q5935J58195M53j45485
16447D70854L2011J00496L54091m24677K40009l32610J34141j25939L684J75972
16437F28032B05595J22073J23529L2670j9315p9227M70297D22500P9009J17137
16427F18646I7438K30902J58139m3291k2307J46750B23503a6910C52698j59269
16417A93429L9080L2721O2640J70423A16621J79830K23368A59068d5621E06262
16406C41399R1250j6653A24405J30419J81573J0995o167K27309k47137P4684A99506
16394B69677k8992J4564J97200g6248A64258L15981j29179L4839j09556j4021
$$ y = [530509, 1129154, 340216, 809517, 367977, 534238, 562126, 418851, 282210, 508766, 477422, 288448, 601248, 743233, 35481, 443361, 543626, 457691, 615886, 616339, 470854, 502865, 603361, 957452, 532775, 772784, 440174, 574315, 448376, 452060, 628032, 205595, 327668, 451197, 483867, 464552, 385325, 855622, 422500, 501509, 618646, 97438, 328340, 486479, 443188, 420881, 567631, 223503, -16910, 352698, 193429, 232509, 265230, 327870, 498293, 116621, 296451, 519819, 159068, -45621, 506262, 341399, 432649, 415996, 124405, 254824, 436397, 447392, 441225, 668534, 421397, 496081, 199506, 269677, 240685, 255249, 452449, -76248, 164258, 480239, 351060, 385899, 276343, 262322]
16384B62322j20724M8779j4592n3770K77527K02783F2220J19203J79341j18240
16374B42524K28097A97932P6929A35913K38571N5786j81476b63173E00890O2746
16364E63636j78052q361K40025E6896d2756B6213J16577L02078A00208K30904
16354C31112o2975J09837J70655A93261l0308K89157k5824A86892K60144C3919
16343C83184A83929P141b9295B32095M21K6175l8228j3399d4071D75966B10659
16331C26793j35295I5609k4199k273l1807K95872A09221N6946J95504a31386j35554
16320b66940B69527A23526K5949J53819l3313k2017C1937P540J01233N19193h745
16308A06573J30407A06122L6581M40831A24118K59483p5671D0541b038k04565
$$ y = [262322, 141598, 190377, 175785, 122015, 399542, 602325, 62220, 181423, 360764, 242524, 470621, 197932, 274861, 135913, 374484, 430270, 248794, -263173, 500890, 563636, 385584, 377223, 617248, 56896, -42756, 26213, 142790, 444868, 100208, 331112, 268137, 377974, 548629, 193261, 162953, 452110, 426286, 186892, 447036, 33919, 383184, 183929, 191070, -29295, 232095, 232516, 258691, 220463, 207064, -44071, 475966, 210659, 326793, 191498, 95609, 71410, 69137, 37330, 333202, 109221, 166167, 361671, -131386, -266940, 269527, 123526, 149475, 303294, 269981, 247964, 31937, 39477, 140710, 659903, -8745, 106573, 236980, 106122, 142703, 583534, 124118, 383601, 307930, 40541, -2038, -206603]
16298b06603A97200J10429G3442O4625L3365Q4686E323J58840l8896O6759b1928
16286B21322J2930j3765A06094J12014I4795K0239a45726A30682P8973n5027K17622
16275C72250B3544M3393j1922j4769d1036J6235A22311a91377a7482d512A42448
16263d634k4109a2128D9308J0924K2205a11136A18713a32844B84081q3367b38448
16251g6892B1791K27037F148a98837A15440b87434B74970n8052C4343J007J00253
16240A35603a71263P6217A63323H0099c11368c9420j27799P141P8144b8974H8491
16228a88985E8085c5813m5303L4681k03484e1688A18156m6669c64442A9047N3095
16217G2142d7252G4108l5505a07040A03275J8689a07476M3242D4524b979A30245
$$ y = [-206603, 197200, 307629, 73442, 138067, 171432, 256118, 5323, 164163, 125267, 192026, -21928, 221322, 234252, 220487, 106094, 218108, 94795, 115034, -145726, 130682, 209655, 154628, 372250, 23544, 66937, 55015, 40246, -41036, -24801, 122311, -191377, -17482, -4512, 142448, -4634, -28743, -12128, 49308, 60232, 82437, -111136, 118713, -132844, 284081, 200714, -238448, -76892, 21791, 248828, 6148, -198837, 115440, -287434, 274970, 216918, 34343, 35350, 135603, -171263, -95046, 163323, 80099, -311368, -39420, -167219, -160078, -81934, -28974, 88491, -188985, 58085, -35813, -81116, -46435, -249919, -51688, 118156, 71487, -364442, 19047, 72142, -47252, 74108, 38603, -107040, 103275, 121964, -107476, -64234, 44524, -2979, 130245]
16205A73557c55122N3014C86208q7980E9385M9845B9243a6166D31998A09246J72590
16194B81836A9299a17583C24080I3609c52424A47293h0976B00129g5539G9489
16183A81624b5850C00924i8026A91465H8524k9026c4568B31778b8116A30395P4494
16172B04889b80468B40375K4147j16177K6833h5859A54120p687c231j48932H8851
16160h0838A80690G8941L0631b07315C9973L8060K5669a54601f0399B56899o4713
16149A92186a7618B03822b10078c5992A62133J28818b12588A04542M2150L5647
16139A82339E4465g9334j8665j802K5920j10432f5263H6125c5880j72918A29052
16127A69890e5565A52472g5791A81694a77663p7445F2710M2962a13873m1614B97575
$$ y = [173557, -355122, -302108, 386208, 298228, 59385, 109230, 29243, -16166, 431998, 109246, 281836, 19299, -117583, 324080, 93609, -352424, 147293, -80976, 200129, -75539, 79489, 181624, -25850, 300924, -98026, 191465, 88524, 59498, -34568, 231778, -28116, 130395, 204889, -280468, 240375, 264522, 148345, 175178, -85859, 154120, 146433, -3231, -152163, 88851, -80838, 180690, 78941, 109572, -207315, 39973, 78033, 103702, -154601, -60399, 256899, 192186, -17618, 203822, -210078, -35992, 162133, 290951, -212588, 104542, 146692, 182339, 54465, -79334, -97999, -99801, -73881, -184313, -65263, 86125, -35880, -208798, 129052, 169890, -55565, 152472, -75791, 181694, -177663, -255108, 62710, 105672, -113873, -155487, 297575]
16115a6958H8018d8773j3456b300j46162A8674h3328l49258e0983A07536E2323
16103A84635D5718K71335D4983J0751M9054R0246C6255c65801a41182F528J82601
16092A89129n0564b38818A90542a90439h6015j62544p522e9374a8690C44144A00663
16080d7305j11170C10447A11215a18562M9044B17515a16922G3809h6230n6475
16070a42705N4916B3743h5301l3960B29Q8690b61206a6720n1610B17780q9315
16059A28465b96023K2656E1598J09615a19517B06540r9098J24537j0954b69610
16048e2019j68071A8801a44432r9518c3265m1455j4515j6151r4567n9423F1740
16036a28625D032a33603A74405c07184A07050j437b22573h0575l3958A66342f5220
$$ y = [-16958, 88018, -48773, -62229, -2300, -148462, 18674, -83328, -432586, -50983, 107536, 52323, 184635, 45718, 317053, 44983, 55734, 104788, 195034, 36255, -365801, -141182, 6528, 189129, 138565, -238818, 190542, -190439, -86015, -248559, -256081, -59374, -18690, 344144, 100663, -47305, -158475, 310447, 111215, -118562, -69518, 217515, -116922, 73809, -86230, -142705, -87789, 23743, -85301, -119261, 229, 88919, -261206, -16720, -68330, 217780, 128465, -296023, -273367, 51598, 161213, -119517, 206540, 107442, 231979, 221025, -269610, -52019, -220090, 18801, -144432, -243950, -33265, -74720, -89235, -105386, -199953, -259376, 61740, -128625, 4032, -133603, 174405, -307184, 107050, 105613, -222573, -80575, -114533, 166342, -65220]
16024a52104e5378A36712a50903A6473b26415B46264p5050b61415G4639h6021
16013b84548f3402j35744j477R3177a142k12408Q1520j56077A56499c2177o4789
16002i6966J294L7489I5619b11607L1050B61217A19369P6146M320b3862r1936
15991a15798R542j85249B46118b6496B5613Q1952J50008K3528A13621B9888K13000
15980B42888B4164J64025Q2882g075A92479g569C6854J3686b24389l6770d9685
15968d7835r2443N9382k557A18465c55732I648N8374J64106e2380m0426p339c4737
15955b22509k648h2635p2738A89896c39476g4090M066B2105a96282b9379o2180
15944i1559j9213B07641D8083a22658L4561n5452b4017l0665p0009B0479P7473
$$ y = [-152104, -55378, 136712, -150903, 16473, -226415, 246264, 171214, -261415, 74639, -86021, -284548, -63402, -199146, -200623, -107446, -1142, -213550, -132030, -288107, 156499, -32177, -96966, -95672, -58183, 95619, -211607, -180557, 261217, 119369, 195515, 199835, -23862, -115798, -106256, -291505, 246118, -26496, 25613, 107565, 257573, 281101, 113621, 29888, 242888, 24164, 188189, 271071, -7075, 192479, -7569, 36854, 50540, -224389, -261159, -49685, -47835, -140278, -80896, -83453, 118465, -355732, 9648, 68022, 232128, -52380, -92806, -100145, -34737, -222509, -225157, -82635, -155373, 189896, -339476, -74090, -70024, 22105, -196282, -29379, -91559, -110772, 207641, 48083, -122658, -88097, -143549, -24017, -54682, -124691, 20479, 97952]
15933I7952a90772e3717j16872h3969L5960A29904Q5352a04204n4107A3716c8447
15921a23603j80488C2422c0116j2674k6945r591B1637c36491a06111k27780b2172
15909b8880j17281L9793r3094d9054k92954A56747n7373B759b53335a26293i406
15897a05484j61197B32348p8642b58229d1465q459g760B2837m773a33810A91657
15885b11618i2847n7452f8515A24971n2515c3617k0232k44480Q1774H5269b42748
15873b8230F7543a76264e4823k62174D1079a77927C1438J74663o4482C0604g6777
15861I3115A6579b87821G1698a30988M6784m217C08162h7753G9901l3111M44966
15850D91756D373O4535e4092A383e1510q640B11802d6808G2939J3662g757B79730
$$ y = [97952, -190772, -53717, -170589, -83969, -48009, 129904, 215256, -104204, -158311, 13716, -38447, -123603, -304091, 32422, -30116, -42790, -69735, -79326, 21637, -336491, -106111, -333891, -22172, -28880, -146161, -106368, -199462, -49054, -342008, 156747, 99374, 2759, -253335, -126293, -9406, -105484, -266681, 232348, 153706, -258229, -41465, -49924, -7760, 22837, 18064, -133810, 191657, -211618, -92847, -150299, -68515, 124971, 72456, -33617, -53849, -298329, -216555, 85269, -242748, -28230, 67543, -176264, -54823, -316997, 41079, -177927, 31438, 206101, 141619, 30604, -76777, 93115, 16579, -287821, 71698, -130988, -84204, -88421, 308162, -87753, 79901, 46790, 491756, 4373, 68908, -54092, 1383, -51510, -60150, 211802, -46808, 72939, 86601, -7757, 279730]
15837D0964K17053a28651A62456a32853k97386b8737A20224D4316a62371A25286
15826A64218L271c13819d0574q091j35877D5954J44682d24531B4828a4424o0709
15815g5133B12035E9622c74334J70733G583g8588I1024L9165a32917C17278b9591
15803A56215K524h6010m18702B25536A04702a77926N8359B30089j3294b30546
15792A59646c76401A18493N2984o8815K9438a6179j25218A59174c8340k28176
15782b66516j85958J40925I5814D0978a70069K5178c5933A06130j0193n18B1347
15770A2181J93899i8608m4656d8863A64755b63821k70267b192o2696r061o2869
15759a36818B16422l2916a5294B79910I0792a11852r04B07094D1567a89507B21744
$$ y = [40964, 258017, -128651, 162456, -132853, -430239, -28737, 120224, 44316, -162371, 125286, 164218, 167489, -313819, -40574, -48665, -184542, 45954, 190636, -424531, 24828, -14424, -75133, 212035, 59622, -374334, -203601, 7583, -78588, 91024, 130189, -132917, 317278, -29591, 156215, 158739, -86010, -504712, 225536, 104702, -177926, -119567, 230089, 216795, -230546, 159646, -376401, 118493, 171477, 102662, 132100, -16179, -141397, 159174, -38340, -266516, -452474, -311549, 95814, 40978, -170069, -144891, -35933, 106130, 95937, 95419, 21347, 12181, 206080, -98608, -143264, -48863, 164755, -263821, -534088, -2192, -64888, -73949, -136818, 216422, 183506, -15294, 279910, 90792, -111852, -112756, 207094, 41567, -189507, 221744]
15747A81349b7445l73861C6922a74576I6618B2763h1548D3697f8183A7868M8080
15736F5948d2718B21855i9795A03134a08797j53361F8625M7418d4322A55374Q708
15725A64082a31607l68118K19125L5245a14358C65646A18079a22629m3445j82109
15715c48183R8638j36095E5562e0662I6146K78073i7956Q575H6499b41575H5425
15703A95699d6905k01495J12605j03673A8205e9487A3381b2816A9403J14933d05452
15691b57104f7269L0954k31237A01695f1688p1590j4835J719B99748c74097A1994
15679i8551a2690q189H6063O6956a97357H3222a27243j00328B06574c4461A45207
15667A13718d6740j37538C50264I2833m3814b02434B51462a3197G0063N3629M01654
$$ y = [181349, -27445, -401306, 36922, -174576, 96618, 22763, -81548, 43697, -68183, 17868, 65948, -42718, 221855, -99795, 103134, -108797, -262158, 68625, 116043, -44322, 155374, 164082, -131607, -499725, -280600, -245355, -114358, 365646, 118079, -122629, -166074, -348183, -249545, -385640, 55562, -50662, 96146, 374219, -97956, -89381, 86499, -241575, 85425, 195699, -46905, -248400, -135795, -239468, 18205, -59487, 13381, -22816, 19403, 134336, -405452, -257104, -67269, -36315, -267552, 101695, -61688, -133278, -148113, -146394, 299748, -374097, 11994, -98551, -12690, -20879, 86063, 153019, -197357, 83222, -127243, -227571, 206574, -34461, 145207, 113718, -46740, -184278, 350264, 92833, 49019, -202434, 251462, -13197, 70063, 123692, 525346]
15656E25346b62102B4917l726h8240a8220A05312a23169C9468c66671A48672n7695
15645I0977k0246b72523b7016j11307L8214A01350g2244k0541n5088G131R6742
15634A03873c06256c1818j13285H7387g419k1520q0345M6595C26216d1680a9985
15622A89401b47844G351J06868e5000B1511r91J29458F4041q221a16635K3254
15611i3381l22487A86867a82372B52460I877b98350J37410A53307e9957a2105
15600b7417j72541d448k28582D98139B04466a85982D8681K6774a00137b9647j75732
15589b05379c0055j2915j84613A01376C0356M9197A6209K83777J9290h041C7949
15577a00971J678B28130h3907j77929D491e83j17080B05475B6123d8394k1657
$$ y = [525346, -262102, 24917, 21191, -88240, -18220, 105312, -123169, 39468, -366671, 148672, 90977, 70731, -272523, -27016, -138323, -100109, 101350, -72244, -92785, -147873, 7131, 103873, -306256, -31818, -145103, 87387, -7419, -28939, -109284, -62689, 326216, -41680, -19985, 189401, -247844, 7351, 114219, -55000, 21511, 20520, 149978, 64041, 55820, -116635, -93381, -415868, 186867, -182372, 252460, 9877, -298350, -160940, 153307, -59957, -12105, -27417, -199958, -4448, -233030, 498139, 204466, -185982, 48681, 75455, -100137, -29647, -205379, -30055, -42970, -227583, 101376, 30356, 79553, 16209, 299986, 319276, -8041, 37949, -100971, -99293, 228130, -83907, -261836, 4491, -583, -117663, 205475, 26123, -48394, -70051]
15566g0051I258J53150f4241B02608d73134i7223B8451K6561P3518J03441b71985
15554A10301d03198A54676b31681j31075J42819B6369R5393c6597k6825j41851
15544b05273G2326A4547M6244c1146o2853j62583J04239C5011P2386J5180k5000
15533I7577a3752H7417A3974B04K31345b03097O8251d5487j3155B5878b92642
15521b33804G8751b07201F3278a08509j27365N3963q4421d2016A07151J35783
15511B42934a44060G7665M746K12347G7237a20571C8763M1870c033j28629A65003
15499A93262n0202a78987C8010b04840g610G5481k148d847A43667b8787A19244
15487H7710f5198K0371d060q0C71997i1113C6732J50805a34955p0632B36384b8645
$$ y = [-70051, 9258, 162408, -64241, 202608, -473134, -97223, 28451, 55012, 128530, 231971, -271985, 110301, -403198, 154676, -231681, -362756, -219937, 26369, 121762, -36597, -63422, -205273, 72326, 14547, 60791, -31146, -93999, -256582, -152343, 35011, 107397, 122577, 97577, -13752, 87417, 13974, 204, 231549, -203097, -134846, -45487, -58642, 25878, -292642, -233804, 78751, -207201, 63278, -108509, -235874, -181911, -266332, -42016, 107151, 242934, -144060, 77665, 82411, 294758, 77237, -120571, 38763, 80633, -3033, -131662, 165003, 193262, 143060, -178987, 38010, -204840, -7610, 75481, 73333, -4847, 143667, -28787, 119244, 87710, -65198, -44827, -4060, -4140, 371997, -91113, 36732, 187537, -134955, -205587, 236384, -28645]
15474a83127A66115a8905C13506j52906a94210b3398p1206R335j8486C5709L0334
15463F6043e1212F9643a11993B0269K65822F4428a73066j65938D32426C8876P2418
15452A11294a03030n547B6353K20335b59498c3280k38353M1935A05814b16051
15441E1435K15971C1913R9703o3624Q3656b17073A58800k9538g9093A13637J0239
15430A23876J08939H5631a20997D3149b5134A62378b08941A9293c25311I0915
15419C37499j36713M3352E408J65109F1161k1355a28742m525C15775A29128b21046
15407B8575f6518B3533b73571i4453A07243b36613J17844N6238o2821A34506F135
15395A22296K44037K4404j84869b90862D6256j7909b1966A08379M5474b24241
$$ y = [-183127, 166115, -18905, 313506, 160600, -194210, -23398, -94604, -85269, -103755, 35709, 66043, -51212, 69643, -111993, 20269, 286091, 64428, -173066, -339004, 432426, 38876, 111294, -103030, -108577, 26353, 246688, -259498, -33280, -271633, -229698, 105814, -216051, 51435, 267406, 31913, 131616, 67992, 151648, -217073, 158800, 129262, -79093, 113637, 123876, 232815, 85631, -120997, 43149, -25134, 162378, -208941, 19293, -325311, 90915, 337499, 200786, 244138, 5408, 170517, 61161, 39806, -128742, -133267, 315775, 129128, -221046, 28575, -66518, 23533, -273571, -94453, 107243, -236613, -118769, -62531, -125352, 134506, 6135, 122296, 366333, 390737, 205868, -290862, 46256, 28347, -21966, 108379, 153853, -224241]
15384B551e5421E23650d34953A00286b52692I120O9992K05713H3344A067a54609
15372B8948a6379q8560k09992F0138a12878o5151A45757J11059f7225A06629a78271
15360i1700G4388e5101j06082N7298D06261B9355c3229B07275C6128e6593L711
15349e2882b2305F1797b78540e6592p9771G4900f3611a2697C86547B3492J55520
15338A79012H0031a17603B1450a62939F2639a25518I2920h2175K7648B43675E0468
15326a68933o4024a4680C32707j14739G7789a35148B1797a28843A53834G4451
15315D39731a98092f5166k3926H5072J1778K5939E6419a66742g0090j40382m1430
15304b51902F7487J39163k8603o8880a65714C4255N60679h695A61408a52885N978
$$ y = [2551, -55421, 523650, -434953, 100286, -252692, 9120, 79112, 284825, 83344, 1067, -154609, 28948, -16379, -104939, -314931, 60138, -112878, -178029, 145757, 256816, -67225, 106629, -178271, -91700, 74388, -55101, -161183, -103885, 406261, 29355, -33229, 207275, 36128, -56593, -52882, -22305, 61797, -278540, -56592, -136363, 74900, -63611, -12697, 386547, 23492, 179012, 80031, -117603, 21450, -162939, 62639, -125518, 92920, -82175, -54527, 243675, 50468, -168933, -232957, -14680, 332707, 217968, 77789, -135148, 21797, -128843, 153834, 74451, 439731, -198092, -65166, -89092, 85072, 96850, 122789, 56419, -166742, -70090, -210472, -251902, 67487, 206650, 178047, 109167, -165714, 34255, 594934, -8695, 161408, -152885, -146907]
15293a46907k9894A87073J07850b06888c2533B77437c38565J34960D1339J47886
15283A89225e6587n0805B092M1574P8131a12295j20040N8270k51693D8746Q6142
15272A34888J89797n290j25823j2737E3002A5923a77861B8470M1238j895J56210
15261B24023b99233a9701h221A81149F8856c8565B07009k2864o0075c0510B86867
15249E67344K20215R32174q26771L43061p6394A09767M68457A87391b20367A82871
15238B06349d2276A47793m0275J35930L3255P5443G9603O227b09277B76247r6075
15227A80172H1453J74709F2311K02886c67322D87893B00562g9173A56836J1831
15217A68667l3855K70709a00450J2814C05274A40444A6373a0733k6946B40796
$$ y = [-146907, -176801, 187073, 294923, -206888, -32533, 277437, -338565, -203605, 41339, 189225, -56587, -107392, 2092, 43666, 121797, -112295, -232335, -174065, -425758, 48746, 134888, 324685, 319395, 193572, 180835, 53002, 15923, -177861, 28470, 69708, 67813, 224023, -299233, -19701, -8221, 181149, 68856, -38565, 207009, 184145, 124070, -30510, 286867, 567344, 787559, 1719733, 892962, 1236023, 1159629, 109767, 578224, 187391, -220367, 182871, 206349, -42276, 147793, 107518, 243448, 276703, 352146, 79603, 85830, -209277, 276247, 180172, 81453, 256162, 62311, 265197, -367322, 487893, 200562, -79173, 156836, 168667, 134812, 405521, -100450, -87636, 305274, 140444, 16373, -10733, -37679, 240796]
15206a79805d2803k13223B109J21778J62270C3794g8665L7932B8904K51281o1052
15195B19133p2864C0521L2170K37571a7454j89104A37384M06962a64855D2674
15184a08150B3772N3208a89211I2527J29307B3668L46413A9580b0398B10282j6669
15173A93613K15764A97029a76880A07307a81396A81020J58601J2662j70544O6984
15163B48723o253E0285K6072I831g6665A00796J62179J7168g0769B83184P1187
15152C54371A00664Q4514M2720F6530f5721C11137a07050c7697A2350J94926K9280
15141B36556I3889L54339A53877a49037B70683b09213A60284b3105H2525J12400
15131A94925a7312A70009M12543A84401G5161D291M35438B5577L1671J99401O2199
$$ y = [-179805, -42803, -256026, 2109, 123887, 286157, 33794, -78665, -40733, 28904, 280185, 219133, 146269, 30521, 62691, 300262, -17454, -206558, 137384, 544346, -164855, 42674, -108150, 23772, 76980, -189211, 92527, 221834, 23668, 370081, 19580, -20398, 210282, 193613, 409377, 197029, -176880, 107307, -181396, 181020, 339621, 352283, 181739, 248723, 242470, 50285, 76357, 9831, -76665, 100796, 262975, 280143, -70769, 283184, 354371, 100664, 185178, 227898, 66530, -65721, 311137, -107050, -37697, 12350, 207276, 236556, 93889, 448228, 153877, -149037, 270683, -209213, 160284, -23105, 82525, 194925, -17312, 170009, 582552, 184401, 75161, 4291, 439729, 25577, 57248, 256649, 318848]
15120C18848j58235R9352A04990D5735A4282J70507c9293A22897d8839C13338
15109a14285M1536H3966a86558P5025B13041J95281A05146L00087j58825J78867
15099D25275a1167A3354J29424a60690D03854D7797L22176n9202o4853d4406j1640
15088e6046e661n542j60736A24625n509K66161A09234J28877d4364A51410J80549
15077C31959j17702K2264L9578A34594F454J20978n0712L4343r316L20195d9913
15065A84757a1216D1516K96562n3792o7093L32324B37725r8012K20432j9760o4025
15054B76360a64784A72280D9429O3275J3301J81760a27901D07087k8378A79810
15043B77937J753A09044K22769m1231K11311j10807I2416M09519A87478Q4725
$$ y = [318848, 160613, 259965, 104990, 45735, 14282, 184789, -39293, 122897, -48839, 313338, -114285, -72749, 83966, -186558, -111533, 213041, 408322, 105146, 405233, 246408, 425275, -11167, 13354, 142778, -160690, 403854, 47797, 369973, 310771, 245918, -44406, -56046, -5661, -11203, -171939, 124625, 119116, 385277, 109234, 238111, -44364, 151410, 331959, 214257, 236521, 276099, 134594, 6454, 127432, 76720, 111063, 101747, 421942, -49913, 184757, -11216, 41516, 338078, 284286, 217193, 549517, 237725, 139713, 360145, 340385, 276360, -164784, 172280, 49429, 112704, 126005, 307765, -127901, 407087, 378709, 179810, 277937, 279690, 109044, 331813, 290582, 501893, 391086, 92416, 501935, 187478, 272203]
15033B72203k6761O5543A11342C952J148P0686J2867J2774N1355J63571J15922
15022D32275j31583c1456j20244A94553k8581a85456H6801a54203D73140d8556
15011A41388m4968L03160r2032H9313J7722R7252i7621A04443J8394j8937J03314
15000B07214n4776J9986M4466L86960p4481A11438J44396r436q6847L6610M5591
14989B41752Q0361j49413a0002q2039A92274E1715L7049h9855B85369n0967H1800
14977A13913e2141C68942j66787O3188C7628L77418j17656e4735F16886B13504
14966g9899m164B71803I8119J18805L0546a10584I2726O3642J85467l8689r6901
14955B06245P4911A22549J05687J78660q1789j48569K19730L150J0782r0799L26561
$$ y = [272203, 245442, 310985, 111342, 3952, 5100, 75786, 88653, 101427, 152782, 316353, 432275, 300692, -31456, -151700, 194553, 165972, -185456, 86801, -154203, 473140, -48556, 141388, 96420, 399580, 307548, 89313, 107035, 204287, -97621, 104443, 122837, 103900, 207214, 152438, 172424, 216890, 603850, 529369, 111438, 255834, 246398, 159551, 196161, 241752, 322113, 172700, -10002, -92041, 192274, 51715, 88764, -89855, 285369, 234402, 81800, 113913, -52141, 368942, 202155, 265343, 37628, 415046, 297390, -54735, 616886, 213504, -79899, -84063, 271803, 98119, 216924, 247470, -110584, 92726, 156368, 341835, 303146, 206245, 281156, 122549, 228236, 406896, 325107, 176538, 396268, 399418, 410200, 319401, 645962]
14944F45962A84813H9079e2015B11736M2280J11144J28684I3341k2653J28496
14934A99184M12364j49642k0712j16942A03275K29943A04106m8580L88428A87762
14923A43997J42318B5092L42268n1508r3004J52450r5778P5152R9552A26627K39026
14912C65653n9693F0409L66839j27984N6744o1944H6714K19360j25258N8710J25005
14901C64531j57758J86002A27860K94999j30136b8312E68567D2280J08037L9119
14891A89436R3287K96459k38708A3433M79433j89692A255M95628j76317M42434
14881G63000C22637M33856B99168L86670B51224J61602p4102J08079j06449O3562
14871D03916j38283J62437o3593p6687L56005k98437D7749A1315L00446O1606
$$ y = [645962, 184813, 89079, -52015, 211736, 254016, 365160, 493844, 93341, 70688, 199184, 611548, 461906, 441194, 324252, 103275, 333218, 104106, 55526, 443954, 187762, 143997, 286315, 25092, 367360, 315852, 222848, 375298, 279520, 354672, 454224, 126627, 365653, 305960, 60409, 427248, 299264, 356008, 294064, 86714, 306074, 180816, 239526, 364531, 206773, 392775, 127860, 422859, 292723, -28312, 568567, 42280, 150317, 189436, 282723, 579182, 340474, 13433, 492866, 303174, 1255, 496883, 320566, 763000, 322637, 756493, 299168, 685838, 251224, 412826, 338724, 446803, 340354, 403916, 265633, 428070, 364477, 287790, 643795, 345358, 47749, 11315, 311761, 373367]
14861C73367J43881j26294g1803D39406r7568I8644O88928C76010l0563J23883
14851D69330k709J68438j92902J10547k14992G2772O20543A51914L50604B18304
14840B69681I3528O33197A86280L08082j85812K93005k59376L32971N7918k18266
14830E14802j55455P2322J10025o9855N8066J28372k38888r016K38307J4340j90592
14819D72428l0869M17925l83391J91123k04728k15477Q22999C02315L41601k09514
14809D34402J16074P5981m8822A43808L09503k793j13565L99233k67073J93647
14799F62760k55317K74594k20667j2098P830j89524K54331p1230K16243p7605
14789E89317L2630L04140l4245k46600j05171L50440m12219k16917M05162k20412
$$ y = [373367, 517248, 390954, -71803, 439406, 341838, 98644, 787572, 376010, 345447, 469330, 466621, 635059, 442157, 552704, 337712, 72772, 693315, 151914, 502518, 218304, 269681, 93528, 726725, 186280, 494362, 308550, 601555, 342179, 675150, 733068, 514802, 359347, 431669, 541694, 471839, 529905, 658277, 419389, 410373, 648680, 663020, 472428, 441559, 859484, 476093, 667216, 462488, 247011, 1070010, 302315, 643916, 434402, 550476, 626457, 577635, 143808, 453311, 450518, 336953, 736186, 469113, 662760, 407443, 682037, 461370, 449272, 457102, 267578, 521909, 450679, 666922, 589317, 621947, 926087, 891842, 645242, 540071, 890511, 478292, 261375, 666537, 446125]
14779D46125P7777K78231j91234j43280J91462j34775O7864k95577O73270D52452
14768G08551k6982j1661m3274R3366Q1886C64330R8432K95021p3249p8928j43991
14757D61615J89920o3699j22057K64893K6864j09807o4058j1773K0764J13308
14747G05970J15754j07521k0669K84185j33206m18175O19273m90453K86385m5472
14737G96071N8218p696J31576k78982r9361J58283J66023l51238N6093R0447l02749
14726D16685N55286q0626j14087L87874k69229j27270O1741j48693J9227r4396
14716F06512L53472k90354R802J54305j40205J85012k29944J58827j73742L862
14706F37547L47024k56148M19381n39722K62359j52139n746J59328m6250j08936
$$ y = [446125, 523902, 802133, 610899, 467619, 659081, 524306, 592170, 296593, 969863, 452452, 708551, 681569, 669908, 626634, 720000, 801886, 364330, 462762, 757783, 684534, 605606, 461615, 651535, 587836, 465779, 730672, 757536, 647729, 583671, 571898, 592662, 705970, 821724, 714203, 693534, 977719, 844513, 426338, 1045611, 555158, 841543, 796071, 854289, 846593, 978169, 699187, 599826, 758109, 924132, 572894, 628987, 719434, 416685, 971971, 891345, 777258, 1165132, 895903, 768633, 830374, 681681, 700908, 606512, 959984, 669630, 679432, 833737, 693532, 878544, 648600, 807427, 633685, 637547, 984571, 728423, 1147804, 608082, 870441, 718302, 712556, 871884, 825634, 716698]
14696G16698J30783p5565O9312J32193K83938r2453m22472L19400p2863K50012
14686A238983E93638J96883P3766p9630L40528j00700O8090m1264k10959R1282
14676I31634q7812M56860k05394j39136Q5040m59892M26927l5609o4984K94765
14666A202399K1488L9146J10711j73335j67740l12391L57118J63544j55565K63537
14656A348912j4210l6425k94578J10749k98383M91500k71907L59837j50940j92186
14646A052369q85J77987l88426L70775k14276K05434L84447m25388o2445L88384
14636A487976j44293j14295r3479l6847J15948O2975o375k41525L39700j52467
14626A217318M12716j17209k77901J40089P5134O9475j34244n872J18884R5369
$$ y = [716698, 847481, 771916, 841228, 973421, 1257359, 1164906, 742434, 1061834, 988971, 1238983, 593638, 790521, 864287, 784657, 1125185, 1024485, 1092575, 1051311, 840352, 931634, 843822, 1300682, 1095288, 956152, 1041192, 581300, 1008227, 972618, 907634, 1202399, 1223887, 1263033, 1373744, 1200409, 1032669, 720278, 1077396, 1240940, 1085375, 1348912, 1334702, 1298277, 1003699, 1114448, 816065, 1307565, 1035658, 1395495, 1244555, 1052369, 1051484, 1229471, 841045, 1211820, 997544, 1202978, 1587425, 1162037, 1099592, 1487976, 1343683, 1229388, 1135909, 1099062, 1215010, 1277985, 1271610, 1030085, 1369785, 1217318, 1630034, 1512825, 1234924, 1375013, 1450147, 1519622, 1385378, 1379506, 1498390, 1593759]
14616A593759p9926K11788j39047j75107K1514J35624k80832l3527N97915k5415
14606A826746o08247K40958J46005J41507J52632r3196K09608j73504J26223m41048
14596A527684K77671j36160O8339M41979k15557l06173L10328k20691N1602p0320
14586A728702k7192r9189K23997N2155J2827J05212J54558p0004M9778l39864
14576A790980K19568m9377q2536O45585m06201J69602j3782K7527K63691j38632
14566B426425k24815M00733l99626K39160J42143n3365L32367O3193J76024j60240
14556B941999O966L90783K34414J21290P21398O34577O08614J929517L784812
14547A1374370Q873319K1018563N313795B0207713H445616l875927j291568r34902
$$ y = [1593759, 1513833, 1725621, 1586574, 1411467, 1432981, 1568605, 1287773, 1254246, 1852161, 1826746, 1218499, 1459457, 1605462, 1746969, 1899601, 1806405, 2016013, 1842509, 1968732, 1527684, 1805355, 1669195, 1737534, 2179513, 1963956, 1657783, 1968111, 1747420, 1799022, 1728702, 1701510, 1602321, 1826318, 1878473, 1891300, 1996512, 2151070, 2081066, 2130844, 1790980, 2010548, 1961171, 1878635, 2524220, 2118019, 2287621, 2273839, 2301366, 2565057, 2426425, 2201610, 2602343, 2202717, 2441877, 2584020, 2530655, 2863022, 2926215, 3102239, 2941999, 2948965, 3339748, 3574162, 3695452, 4416850, 5051427, 5660041, 7589558, 11374370, 20247689, 41266252, 46580047, 20207713, 8445616, 4569689, 3278121, 2343219]
14539B343219l8165k62150l6596K8208k24289R3831O0004L90469k49957M48082
14529B552656l40100J22162r0730O9037K54479k91097L06089j94993M56466k68880
14519B575089J19072k57002L24513l34969K96586j40963K52268J47823q1017K47729
14509C149129k67407N7214l2378J23411J30669l17981L52150k2776r8666R6871
14499C170236o8462K77393J03974R5656k48664r7075J63356O4484K53197j04537
14489C609558q3644k02203M64738j01103L5884J06714o5181J30974j46815J31536
14479C880458K52419o1956k5035j14074K90031l2047Q5813L59670M8j63102j64520
14468D307705L8722k3022M17521j48940Q8936K57794k13798L13869k65383M39529
$$ y = [2343219, 2305054, 2042904, 2006308, 2034516, 1810227, 1904058, 1964062, 2354531, 2104574, 2552656, 2212556, 2334718, 2243988, 2313025, 2567504, 2276407, 2582496, 2387503, 2843969, 2575089, 2694161, 2437159, 2761672, 2426703, 2723289, 2582326, 2834594, 2982417, 2901400, 3149129, 2881722, 2938936, 2906558, 3029969, 3160638, 2842657, 3194807, 3172031, 3073365, 3170236, 3101774, 3379167, 3483141, 3578797, 3330133, 3233058, 3396414, 3460898, 3714095, 3609558, 3525914, 3323711, 3788449, 3687346, 3723230, 3829944, 3764763, 3895737, 3748922, 3880458, 4132877, 4070921, 4045886, 3931812, 4221843, 4189796, 4275609, 4635279, 4635327, 4472225, 4307705, 4346427, 4323405, 4740926, 4591986, 4680922, 4938716, 4724918, 5038787, 4773404, 5212933]
14458E212933o0519j63734J10285k33733O42522j40892N5567J99694J55381j36269
14448E641235J22309j8266l23241L21030J99347P6632j08450L3555M51110J16900
14438F512161k87473M92323k68035J8569J24076K59161O7413r6872J69881N6253
14428G047457L58812j63678J54890K89746K5562J98995O5989P012k44717N84410
14418H324478J3432m5188N1413K76003R1385J79760K09575j1367L38843O7391
14408I495725J33010L357K93806M75152j86299j53160N55387o5585N00055n2674
14398A0998774J41297P7751J43951J50498M75179K5L44007M17813j76413M91670
14388A3064552K76622P1462L15081R0784K91409L45724r0928N37539K38418j8920
$$ y = [5212933, 5152414, 4988680, 5098965, 4865232, 5507754, 5366862, 5422429, 5622123, 5777504, 5641235, 5763544, 5745278, 5422037, 5743067, 5942414, 6019046, 5910596, 5944151, 6395261, 6512161, 6224688, 6717011, 6448976, 6467545, 6591621, 6850782, 6918195, 6821323, 6991204, 7047457, 7406269, 7242591, 7397481, 7687227, 7712789, 7911784, 7977773, 7984785, 7740068, 8324478, 8337910, 8292722, 8344135, 8620138, 8711523, 8891283, 9100858, 9089491, 9428334, 9495725, 9628735, 9632092, 9925898, 10401050, 10214751, 10061591, 10616978, 10551393, 11051448, 10998774, 11140071, 11217822, 11361773, 11512271, 11987450, 11987475, 12331482, 12749295, 12572882, 13064552, 13341174, 13412636, 13727717, 13818501, 14109910, 14455634, 14364706, 14902245, 15140663, 15121743]
14378A5121743N55396K63449N98531j36594Q20610J17912L24591J20464M22796
14369A8208898L13418N15726L33991Q2954O54218P13950J07416O60569L84028
14360B1975168L14868O12904N23878M74793O76239N79376M80434N85970P81177
14351B7004807N72014O29994O29028P66782M41516R89920P29673R83302R26154
14342C3673190Q15823J071878N01083J306215J157160R96694R50969J525651R48024
14333D2946687J426165J192945J369552J417668J657323J527331J780995J414349
14325E4733015J962711J649630K272664K363104J974695K360827K107694K939792
14317G2364132K561729K970589K490906L601137L135209L321670L730317M047504
$$ y = [15121743, 15677139, 15940588, 16539119, 16402525, 17223135, 17341047, 17665638, 17786102, 18208898, 18522316, 19038042, 19372033, 19454987, 20109205, 20823155, 20930571, 21591140, 21975168, 22290036, 22902940, 23426818, 23901611, 24577850, 25157226, 25637660, 26223630, 27004807, 27576821, 28206815, 28835843, 29602625, 30044141, 31034061, 31763734, 32747036, 33673190, 34489013, 35560891, 36061974, 37368189, 38525349, 39522043, 40473012, 41998663, 42946687, 44372852, 45565797, 46935349, 48353017, 50010340, 51537671, 53318666, 54733015, 56695726, 58345356, 60618020, 62981124, 64955819, 67316646, 69424340, 72364132, 74925861, 77896450, 80387356, 83988493, 87123702, 90445372, 94175689, 98223193]
14309I8223193L990851M360396M713827M826999N072068N243754N839287O366944
14301A38637319N855256P126042P120080P473648Q309071Q397176R558084R264831
14293B01741507R927332J0772218J0735137J1544786J2417998J2692526J2677179
14286B82508683J3471920J3848816J4031487J3958497J4065975J4026146J3504388
14279C79415912J3428090J2585563J1870277J0517869R734216P709300N319436
14272D50580663J880919r9162p48094k966282l543206o216611p506234q124133
14264D23257860j0070381j1192183j2731786j4044347j4600293j5220700j4736530
14257C30661640j5319827j4735487j3317190j3733546j3408182j2842537j1787083
$$ y = [98223193, 102214044, 106574440, 111288267, 116115266, 121187334, 126431088, 132270375, 138637319, 144492575, 151618617, 158738697, 166212345, 174521416, 182918592, 192476676, 201741507, 211668839, 222441057, 233176194, 244720980, 257138978, 269831504, 282508683, 295980603, 309829419, 323860906, 337819403, 351885378, 365911524, 379415912, 392844002, 405429565, 417299842, 427817711, 437551927, 445261227, 450580663, 452461582, 452362420, 451614326, 448648044, 445104838, 438888227, 431381993, 423257860, 413187479, 401995296, 389263510, 375219163, 360618870, 345398170, 330661640, 315341813, 300606326, 287289136, 273555590, 260147408, 247304871, 235517788]
14250B35517788j1570762j1070779j0415649r912933r276149q639096q055106
14243A66577314p560795p742029o781081o670783o265893n360472n347762n209675
14235A15638824m923253m688973m630907l986529l137153l887223l611994l406017
14227H3366775l106302l226288k706818k467071k838058k150453k601876j874606
14219F2395303k305632j749382k127152j579188j936782j445035j335571j466814
14211D8449747j727440j152092j715872j090726n01375j085361j479969j462540
14203C8234372q69647j134326q06580q39938o98590r69325j086447l73618p75082
14194C0680819n19965j521943m93797o90939o84918p71987m62670m42426k65557
$$ y = [235517788, 223947026, 212876247, 202460598, 192547665, 183271516, 174632420, 166577314, 159016519, 151274490, 144493409, 137822626, 131556733, 126196261, 120848499, 115638824, 110715571, 106026598, 101395691, 97409162, 94272009, 90384786, 86772792, 83366775, 80260473, 77034185, 74327367, 71860296, 69022238, 66871785, 64269909, 62395303, 60089671, 58340289, 56213137, 54633949, 52697167, 51252132, 49916561, 48449747, 46722307, 45570215, 43854343, 42763617, 42262242, 41176881, 39696912, 38234372, 37364725, 36230399, 35423819, 34583881, 33885291, 32915966, 31829519, 31455901, 30680819, 30160854, 28638911, 28145114, 27454175, 26769257, 25997270, 25534600, 25092174, 24826617]
14185B4826617j408243j08388l25512o55507m23599n40582l40387l69432l93787
14176B0261180n21801p32641K121l98902m47653n73491n7072m89384l58431J1120
14166A6695046m95728n70109J02916q62683L79072l66646l80670j8557l48528
14157A4134113m30007k0800l88954l12016j88537j02952r979o09194p0421r7518
14147A1903735j63899k64556k99176J3767n71218M79535l29504k35845l6442l99962
14137A0096435l1947l39878Q9877j34450k94285j54144j11182j11443N5170J05417
14127I169570l08930k28442m24018k01413M48227m13063K36655l54227k9799k12891
14117G681669K86371j96996j93005k85682k54512J13788O4249k29321k00060J47082
$$ y = [24826617, 23418374, 23309986, 22984474, 22328967, 21905368, 21364786, 21024399, 20654967, 20261180, 19739379, 19006738, 19008859, 18609957, 18162304, 17588813, 17531741, 17042357, 16683926, 16695046, 16199318, 15629209, 15732125, 14869442, 15248514, 14881868, 14501198, 14482641, 14134113, 13704106, 13683306, 13294352, 12982336, 12793799, 12690847, 12680868, 12071674, 12001253, 11903735, 11739836, 11475280, 11176104, 11189871, 10618653, 11098188, 10768684, 10532839, 10496397, 10096435, 10064488, 9724610, 9814487, 9680037, 9385752, 9231608, 9120426, 9008983, 9064153, 9169570, 8860640, 8632198, 8208180, 8006767, 8454994, 8041931, 8278586, 7924359, 7894560, 7681669, 7968040, 7771044, 7578039, 7292357, 7037845, 7151633, 7215882, 6986561, 6786501, 6933583]
14107F933583p2196j90481r0590k04474p9083K74071k84239n21064N08838r5524
14097F178841l1754K8448l74895r9940O1774J07158l20984j54002k18342N42504
14087E718808n16139J3341k77296N89616l22286k39547j07825m4340M2897j79975
14077D677254m2951n4354J79568r5169L1322l18087J67026k69378L13595l67488
14067D221338k9339J86915j81479m786r3136k4697Q4071J50937m9729m45548O88107
14056D502654n63269k20430J06144J47362m15640P652J09649j89884K02906j68550
14046C518594L59462m25463k48493O9568K8121n271j69768K64299p4770J50312
14036C466591l34537k1132J21832j34892L08700l49331n433J47644k39857j7804
$$ y = [6933583, 6861387, 6670906, 6580316, 6375842, 6296759, 6570830, 6286591, 5765527, 6274365, 6178841, 6147087, 6175535, 5800640, 5700700, 5762474, 5869632, 5548648, 5394646, 5176304, 5718808, 5202669, 5216010, 4938714, 5528330, 5206044, 4966497, 4858672, 4814332, 4857229, 4677254, 4634303, 4579949, 4759517, 4664348, 4695670, 4377583, 4544609, 4275231, 4588826, 4221338, 4191999, 4378914, 4197435, 4192649, 4099513, 4074816, 4158887, 4309824, 4260095, 3814547, 4502654, 3939385, 3718955, 3825099, 3972461, 3556821, 3564473, 3674122, 3484238, 3687144, 3518594, 3878056, 3452593, 3204100, 3273668, 3301789, 3296518, 3126750, 3391049, 3316279, 3466591, 3132054, 3110922, 3232754, 3097862, 3406562, 3057231, 3051798, 3199442, 2959585, 2941781]
14026B941781K30254m40481N0971j68606n8658L61194j5751l14802K75976k37386
14016B624492l93568J84915L33400l68560L24537j35769j22472K600K5677q6039
14006B389213q9626j64514J86078K09133m34618J77445L0091L21194m83288r8274
13996B042834J06043k6315J28157L7373K99956R2999K08905P77820K228391O804375
13986A2700538K0158638J5189510k3153568j1993200m917853j913730j345132
13979D725203q17860k30204m76508n0528Q2260k21481l13586q8603k41782J34659
13969B501570j46264K37845J5569L6496k23646l29313K99778j96894J15669k29808
13959B081002J40942L231K8645j87079P8649l18286L37273k30166K06941j92386
$$ y = [2941781, 3172035, 2731554, 2782525, 2613919, 2555261, 2916455, 2900704, 2585902, 2861878, 2624492, 2230924, 2415839, 2749239, 2380679, 2705216, 2569447, 2446975, 2449575, 2475252, 2389213, 2299587, 2135073, 2321151, 2530284, 2095666, 2273111, 2303202, 2624396, 2141108, 2042834, 2148877, 2122562, 2250719, 2288092, 2588048, 2681047, 2889952, 3667772, 5896163, 12700538, 32859176, 48048686, 24895118, 12901918, 7984065, 6070335, 4725203, 3907343, 3677139, 3200631, 3150103, 3232363, 3010882, 2697296, 2608693, 2366911, 2501570, 2355306, 2593151, 2608720, 2645216, 2421570, 2092257, 2392035, 2195141, 2310810, 2081002, 2221944, 2225175, 2253820, 2066741, 2145390, 1827104, 2164377, 1934211, 2141152, 1948766]
13949A948766J50909k8670J18734m1248m41092J83899r5976q3737K13847j17128
13939A808304J60703j50217j86511L55140j53188J10569o0653j09076K81518k90955
13929A765634o1175l25898N92665k84287m68211L47447J48949k97517q68K36939
13919A653678k72562p401L7647K1816K42184k30982J26426k18212K1696J11348
13909A485638K64101l32831L1059q3017J11212j60268j80739l5812L8980L41797
13899A480120p526j05280j45204J20868j5634m2159j4450M4498j61018L39241
13889A493456m86023L73147l46834M24869m41963j30079L35348j15357J10745
13880A217309J15763J74171k64824j97036J47358J71806k40341J57689l12133
$$ y = [1948766, 2099675, 2071005, 2189739, 2148491, 1707399, 1891298, 1795322, 1711585, 1925432, 1808304, 1969007, 1818790, 1632279, 1987419, 1834231, 1944800, 1884147, 1775071, 2056589, 1765634, 1704459, 1378561, 1971226, 1686939, 1218728, 1566175, 1715124, 1417607, 1416739, 1653678, 1381116, 1373715, 1411362, 1433178, 1675362, 1444380, 1570806, 1352594, 1374290, 1485638, 1749739, 1416908, 1447967, 1364950, 1476162, 1315894, 1135155, 1099343, 1138323, 1480120, 1472594, 1367314, 1222110, 1342978, 1327344, 1285185, 1270735, 1315233, 1154215, 1493456, 1007433, 1380580, 1033746, 1458615, 1016652, 886573, 1221921, 1106564, 1217309, 1333072, 1507243, 1242419, 1045383, 1192741, 1364547, 1124206, 1281895, 969762]
13871I69762m4623L78856m56814L28882l76218J67041K23071J81856j98366O4690
13861A238137J04411k20392J27473m1926m17286K82393J29348J47478k47756J16441
13851A218321m80391K19868P1805k85628J32438K48040R7375k87866M0056L2661
13841A006679K62135m67114J07931p4395j1556K52826J00770l98541k33718N32797
13831A077814l04682J98009k05650P2726J55244j77798N5029j81669j20883L61672
13821I29812j21987o1956Q2517O4934r5514K51393k24476L41926j07895p7947
13811I80807k22491N4280m5436R3556j8263J32726j80810m1763J16334Q0592k54079
13800F95453N04387n59599j6304J93401J64908k21134j9300J10509j49960J68614
$$ y = [969762, 925139, 1303995, 847181, 1176063, 799845, 966886, 1189957, 1371813, 1173447, 1238137, 1342548, 1122156, 1249629, 1207703, 790417, 1072810, 1202158, 1349636, 1101880, 1218321, 737930, 957798, 1029603, 743975, 876413, 1124453, 1221828, 933962, 974018, 1006679, 1268814, 801700, 909631, 835236, 823680, 1076506, 1177276, 778735, 545017, 1077814, 773132, 971141, 765491, 838217, 993461, 815663, 870692, 689023, 568140, 929812, 807825, 745869, 828386, 893320, 797806, 1049199, 824723, 1166649, 1058754, 980807, 758316, 812596, 767160, 860716, 842453, 975179, 794369, 752606, 868940, 949532, 695453, 1199840, 640241, 623937, 817338, 982246, 761112, 741812, 852321, 702361, 870975]
13790H70975r2183k96290K35771K75444j52738J01885j69949K02090l02553K39959
13780I12411r0779j86313l2609L16123l80741J12934L1732q9407K26439l04737
13770E15053r7755L09972O2945k9023j56685L34285j73512J60637m33451J63638
13760F56104j25275L10464k04129K0623p7248l5852K40217r0314l3002O1200j87244
13749E35544R3227J90736o3459l48372L86814j16966O4473k44696J89010P4177
13739G60488J46560k50668k69646M59612C90588L03822k67915j2403K77502m475
13729F87119j86577K06475o5590Q928L64095m67490J40634r4990k32799J05884
13719D65689K98129A27988O8271N15352m3262j81442K29577k11880J84843l3380
$$ y = [870975, 778792, 482502, 718273, 993717, 840979, 942864, 772915, 975005, 672452, 912411, 821632, 635319, 602710, 918833, 538092, 651026, 682758, 593351, 819790, 515053, 417298, 727270, 790215, 761192, 604507, 938792, 765280, 925917, 492466, 656104, 530829, 841293, 637164, 657787, 580539, 544687, 784904, 694590, 661588, 722788, 535544, 628771, 819507, 756048, 407676, 794490, 677524, 741997, 497301, 686311, 760488, 907048, 656380, 386734, 846346, 390588, 694410, 426495, 414092, 691594, 687119, 500542, 707017, 641427, 650355, 1014450, 546960, 687594, 592604, 359805, 465689, 763818, 127988, 196259, 711611, 668349, 486907, 716484, 504604, 689447, 656067]
13709F56067j23533n4989k30969J29796O2591n8444K42562J14551B94735N353
13699C00088M69535C11925K37899B08676M18348k14027K43090k47767J29341R4786
13689F32447l07831K27546R2723p9930o8506J81837A25276L20534L75215l82337
13679D38688K1591O3734o9698M9937q9155J39286q6460P0968M5153B64502J52627
13668D17129J44320A47402K14829K97609B64034L41242B87266K38188j48659j13114
13658B63681P6188M167J21373k8424M2033m2487K34953A05374L3371E0178J16232
13647A66410L22195J06185j36436j79313M80541k76785n1712k7984K37634j66274
13637D74461L38410C43083J48682j454p543j11689J95058k1553q5671n9473L8428
$$ y = [656067, 532534, 477545, 246576, 376372, 438963, 380519, 623081, 737632, 294735, 300088, 769623, 311925, 549824, 208676, 627024, 412997, 656087, 408320, 537661, 632447, 324616, 552162, 644885, 564955, 496449, 678286, 125276, 445810, 821025, 438688, 460279, 524013, 454315, 504252, 415097, 554383, 467923, 538891, 584044, 264502, 417129, 561449, 147402, 362231, 659840, 264034, 605276, 287266, 525454, 376795, 263681, 339869, 344036, 465409, 436985, 479018, 436531, 671484, 105374, 138745, 50178, 166410, 488605, 594790, 458354, 279041, 759582, 482797, 431085, 403101, 640735, 474461, 812871, 343083, 491765, 490311, 482768, 371079, 566137, 544584, 458913, 399440, 437868]
13626D37868L74120k39294q5828N12O9033B36652k1790J34110L30851k04903Q1659
13615E56579j42164P9408n4208j75082j09802G1439b4279C78542j28982O545K62215
13604E18320A20540A4637J81540O2636J2530K82637r9775r3738r384P9624p4788
13593C55919j51931K23903K25729l09245j34463L24838B4549L77108A82802o1362
13583A21440M56501p0126K70043k63945A13681K32797A55200L74725a9273D05153
13572C56313A65616N3043R8350L272A30155J70499O6704j73402L50620B60148
13561a34856D002L44137m7338P0276C7132L2925J86810Q3741K22310j35668c2362
13549C36646J57157l9197J07368k69239l9800M2810J32902k6237A38112M6739
$$ y = [437868, 811988, 572694, 486866, 487378, 556411, 236652, 214862, 348972, 679823, 474920, 556579, 414415, 493823, 439615, 264533, 154731, 71439, -24279, 378542, 249560, 256105, 518320, 120540, 14637, 196177, 258813, 271343, 553980, 454205, 360467, 351083, 430707, 355919, 203988, 427891, 653620, 344375, 209912, 534750, 24549, 401657, 182802, 121440, 577941, 507815, 777858, 513913, 113681, 346478, 155200, 529925, -19273, 405153, 356313, 165616, 218659, 317009, 320281, 130155, 300654, 367358, 193956, 544576, 260148, -134856, 4002, 348139, 300801, 371077, 37132, 70057, 256867, 340608, 562918, 427250, -32362, 336646, 493803, 454606, 561974, 292735, 252935, 295745, 428647, 402410, 138112, 184851]
13539A84851K35705q2847j00274J09526D2377K65604h946B77395j04737K66643
13529D39301q961B8174K67344A11987M30855B24163J25731A36474J43187m1330
13519B38331j8235a08265C89267A72416P7516H2077L94766A38342K36185K12464
13509E86991G0184K39634l6854A02635J87102G3390M98958j03849j34221j14897
13499B19381L088J14826J5153b3537D36533A38897M11213j05029i8153A32831
13488B33083B6451a27467c1589C22333A60911Q1230O0146p1891K22553g6015g498
13476B98452D1013J8965J62722c5895A68247J3722Q6114l6114J17709M9484j45373
13465B53789k0388i9509E20410B28727m116Q6425A40544K75093I4407K20029Q5383
$$ y = [184851, 420556, 337709, 237435, 346961, 42377, 307981, -8946, 277395, 172658, 439301, 430340, 28174, 295518, 111987, 542842, 224163, 349894, 136474, 279661, 238331, 220096, -108265, 389267, 172416, 249932, 82077, 476843, 138342, 374527, 586991, 70184, 309818, 272964, 102635, 289737, 73390, 572348, 468499, 334278, 219381, 222469, 337295, 352448, -23537, 436533, 138897, 550110, 445081, -98153, 132831, 233083, 26451, -127467, -31589, 322333, 160911, 242141, 302287, 230396, 452949, -76015, -7498, 298452, 41013, 59978, 222700, -35895, 168247, 181969, 268083, 231969, 349678, 399162, 253789, 233401, -99509, 520410, 228727, 224611, 311036, 140544, 415637, 94407, 314436, 399819]
13454C99819l4140I9915R5932P5976b3935A92049K09168j06188j20971k4426R8657
13443B48289k6243J77818F2121J27234E2607J43435J06445a89673C98257j79485
13433B18772A07829J59822J08239A43479L00079A6767L12350o4438I4045l3333
13423F0712K98391J6667m1778A53136a2649B93554F3577k114K1291J79684A09999
13411A45084a3602A42634o8669K09192H3044N9505E0555M47287r9723A26388N1726
13400A78114a85708C63596a85403A69176J23771P1908D5118K07432q0636j3075
13390A58839L66295G2775J07573M9023J31744A25866J03449J30530N4609c6995
13379D74253A98050o0937Q2234A0735N58842B49689h5718C01701r3650l0985L01016
$$ y = [399819, 365679, 99915, 195847, 271823, -23935, 192049, 401217, 295029, 174058, 149632, 248289, 222046, 399864, 62121, 189355, 52607, 196042, 302487, -189673, 398257, 218772, 107829, 267651, 375890, 143479, 443558, 16767, 329117, 264679, 94045, 60712, 359103, 375770, 333992, 153136, -12649, 293554, 63577, 61463, 82754, 262438, 109999, 145084, -13602, 142634, 73965, 283157, 83044, 142549, 50555, 497842, 398119, 126388, 178114, -185708, 363596, -185403, 169176, 292947, 364855, 45118, 252550, 171914, 158839, 525134, 72775, 180348, 229371, 361115, 125866, 229315, 359845, 414454, -36995, 474253, 198050, 137113, 219347, 10735, 569577, 249689, -85718, 301701, 208051, 177066, 478082]
13368D78082A96851K15547j80066J09624A67545b0687B88368o6707D27i2727b1598
13356b9743B06666H8783M7449J82113N3206A06930J13513M596l3399J37555q2070
13345B47125K46616A80501J13506j11781J76053L1178r8406L30666A74845G2016
13334A04058J02696J60458j04301N2047r4985q4744f1699G1428R0695N6407F0555
13322E26179G5105Q7467j5146K00763j71226O0353J00940K1788h260B53893j4899
13311B38994N9908E4982L01078j15261O6978j7610L7292n5388J62508e0474B04750
13299b9694C54303A02608K96276j94699r7135K10709p7434J0613F8325K70366
13289C38691j53457Q8421A5029K04979f502H2946a29689I4836D2354f0660k2214
$$ y = [478082, 196851, 412398, 232332, 341956, 167545, -20687, 288368, 221661, 427, -92727, -21598, -29743, 206666, 88783, 136232, 318345, 371551, 106930, 220443, 225039, 191640, 329195, 247125, 493741, 180501, 294007, 182226, 358279, 389457, 291051, 621717, 174845, 72016, 104058, 206754, 367212, 262911, 314958, 219973, 135229, -61699, 71428, 162123, 218530, 60555, 526179, 75105, 162572, 147426, 348189, 176963, 237316, 338256, 360044, -8260, 253893, 238994, 298902, 54982, 356060, 240799, 307777, 290167, 327459, 272071, 434579, -50474, 204750, -29694, 354303, 102608, 398884, 204185, 107050, 317759, 240325, 250938, 68325, 338691, 185234, 273655, 15029, 220008, -6502, 82946, -129689, 94836, 42354, -60660, -82874]
13278h2874D10027D2121j3605J40070j2536b29379B79163G851f27E0974e0894
13266A37335R6284I486L36033b1801p4049C54101a8765j2877B24702L1290M93
13255B56485b18130A84716j4551L45034A52835m0205b34967C67170a68959C1194
13244F9956K4992k8702K31883D1606L9331L09397n7787j58424a77019B82079J4813
13233B96892a16449B94504j7725B8383a1663c262I4430Q675g0580A41428J30573
13222B72001H4739C1837K2678K20552q8783j3858G5536b14461B6213J64638d8642
13210d955n318l1709A30105a30994C43427r6859n1634G5547k1468O4911a14785
13198B94781H6337k8767j2610m273b44334A87708D6067K31313E8305b04445B38843
$$ y = [-82874, 410027, 42121, 28516, 168586, 156050, -229379, 279163, 7851, -627, 50974, -50894, 137335, 233619, 9486, 345519, -21801, -95850, 354101, -18765, -31642, 224702, 255992, 256485, -218130, 184716, 170165, 515199, 152835, 112630, -234967, 367170, -168959, 31194, 69956, 94948, 66246, 298129, 41606, 80937, 390334, 332547, 174123, -177019, 282079, 296892, -116449, 294504, 276779, 28383, -11663, -3262, 94430, 103105, -70580, 141428, 272001, 84739, 31837, 54515, 275067, 186284, 172426, 75536, -214461, 26213, 190851, -48642, -4955, -10273, -41982, 130105, -130994, 343427, 246568, 194934, 75547, 54079, 118990, -114785, 294781, 86337, 57570, 44960, 40687, -244334, 187708, 46067, 277380, 58305, -204445, 238843]
13186C23116j49898a00352B75634r8109J0065a78890A10231c2347A77227a45615
13175C1588b4021j8910D9587g3776C22096b01129d9937G5708b75302H9593M6262
13164A35855C1049g8520H7963j457c64740D15610r9474j6479k5605o1432J02331
13153C14951i5642C23729c2657d918A54934a9441j2914a5958B63025j14729B5170
13141F209L08162d2332k05331C79981j37730O8676c77019f9865A24008D2908c3914
13129E8625J73549f5441E8075b99180A67678J51008f413D8286J33045K12401C8782
13117A51420a08635D07653B03080C5058R5111c6999A33882a26428B72797h3415
13106F5801l17h0081r6791l254a599B5471g9397A36577F2962B5106J51321O3489
$$ y = [323116, 173218, -100352, 275634, 177525, 187590, -178890, 110231, -32347, 177227, -145615, 31588, -24021, -42931, 49587, -73776, 322096, -201129, -49937, 75708, -275302, 89593, 135855, 31049, -78520, 87963, 86506, -364740, 415610, 316136, 299657, 274052, 212620, 314951, -95642, 323729, -32657, -4918, 154934, -19441, -32355, -15958, 263025, 148296, 25170, 6209, 314371, -42332, -247663, 379981, 242251, 310927, -377019, -69865, 124008, 42908, -33914, 58625, 232174, -65441, 58075, -299180, 167678, 318686, -6413, 48286, 181331, 393732, 38782, 151420, -108635, 407653, 203080, 35058, 130169, -36999, 133882, -126428, 272797, -83415, 65801, 65484, -80081, -176872, -180126, -1599, 25471, -79397, 136577, 62962, 25106, 176427, 239916]
13094B39916G3276c98820n1979a0054j97191A77636K8451I3700g3773A93299A0296
13082A64630L0813c41855A07648b10742J00696B55857f351A56675b3267A20543
13071C00435B0330b56433C21746j23229m4984G3816a64708A14262J8229Q867n6448
13060H4910c1543B73730a89181C01342j05246J27379a73379N2423A72053J23237
13050B95290F159j108a84056n1135B37707j05035e4448R442B3236K54452D9950
13038b07859D5033J97558F6050L40700j1768A51490J61024e4638B13050J0610
13028B23660L1157a6034p778A2755K31695K0502A0227c2168G0835l4125K03506
13017B40216E6054L40156G8002a61514B80920q373A15259g6557M76C60855b09076
$$ y = [239916, 73276, -398820, -450799, -10054, -207245, 177636, 206087, 93700, -73773, 193299, 10296, 164630, 195443, -341855, 107648, -210742, -110046, 255857, -6351, 156675, -23267, 120543, 300435, 20330, -256433, 321746, 198517, 153533, 73816, -164708, 114262, 132491, 141358, 84910, -31543, 273730, -189181, 301342, 196096, 323475, -173379, -120956, 172053, 295290, 6159, 5051, -184056, -235191, 237707, 132672, -54448, -45006, 23236, 277688, 49950, -207859, 45033, 242591, 66050, 406750, 394982, 151490, 312514, -54638, 213050, 223660, 254817, -16034, -23812, 12755, 244450, 264952, 10227, -32168, 70835, 36710, 240216, 56054, 396210, 78002, -161514, 280920, 272547, 115259, -76557, -76081, 360855, -209076]
13005A2367L2418J91642J58867e765I1591M7430B2655O0184J23921J04885g3206
12993A06766b5383l2302B51659e634D06101a63298F841h5158B62669O0066i5999
12981D24694a64650H0894d3483j14414A92429l4563g8842I7864e2065A48739a23103
12969i1387B1233a01496D6616J61879R0182l3337k080H3348a23359a8468r4903
12958a13371A94242m003a34818a772C13437I5715L3883J86051E9000a68694F055
12946B50899A02093K92559A90247c72933R9411Q4238d4729A46667b9419B47351
12935f6490o2955J1967E9567M6854a51690A57963k3612P4033b5778q2836c2376
12923e4839j48309B55290J002J52646h4366b034r26B19619m8051H0105n935a4785
$$ y = [12367, 44785, 236427, 395294, -5765, 91591, 139021, 22655, 82839, 206760, 311645, -73206, 106766, -25383, -57685, 251659, -5634, 406101, -163298, 6841, -85158, 262669, 322735, -95999, 424694, -164650, 80894, -43483, -157897, 192429, 157866, -78842, 97864, -52065, 148739, -123103, -91387, 21233, -101496, 46616, 208495, 298677, 265340, 263260, 83348, -123359, -18468, -113371, 194242, 190239, -134818, -1772, 313437, 95715, 129598, 315649, 59000, -168694, 6055, 250899, 102093, 394652, 190247, -372933, -273522, -189284, -44729, 146667, -29419, 247351, -66490, -129445, -117478, 59567, 106421, -151690, 157963, 134351, 208384, -25778, -108614, -32376, -54839, -203148, 255290, 256292, 408938, -84366, -2034, -2960, 219619, 171568, 80105, 74170, -14785]
12910C58617A72203c6638l9169G9506A9161L5340a55732M2667D8926b76298J16069
12899a60229B5153O4711J73476B4879O4681a97459n354p9616f5193G5907M5741
12888A21648F0728b39362B5276J34051D8347a07455A15885f0381N270m7047k2801
12877a24959M735F2622J26102L4075A7078a68698B64980H5859I264J81126a07586
12865A73907o0229f9800A37985g2983J1262A06673c75866J81299O9999G1085h5900
12853A32068e3625j45646i0016n9964A75835L6425B0488F558e9918j25847H2036
12841A70071n188d8533A1171K78231h9126E5304a21069k03479A72995a97437B96506
12829a48885k1981D18177j21911a59835I7214g5690C9552K21079d0589G5542H635
$$ y = [358617, 172203, -36638, -75807, 79506, 19161, 54501, -155732, -113065, 48926, -276298, -160229, 25153, 89864, 263340, 24879, 89560, -197459, -202813, -282429, -65193, 75907, 121648, 60728, -239362, 25276, 159327, 48347, -107455, 115885, -60381, -55111, -102158, -124959, -120224, 62622, 188724, 222799, 17078, -168698, 264980, 85859, 9264, 190390, -107586, 173907, 113678, -69800, 137985, -72983, -61721, 106673, -375866, -194567, -124568, 71085, -85900, 132068, -53625, -199271, -90016, -149980, 175835, 212260, 20488, 6558, -59918, -185765, 82036, 170071, 164883, -48533, 11171, 289402, -89126, 55304, -121069, -324548, 172995, -197437, 296506, -148885, -170866, 418177, 296266, -159835, 97214, -75690, 39552, 260631, -40589, 75542, 8635]
12817a23386j5280A18982J85160b69469A04962a00690C05428d7123A40545O644
12807A47189J61719d1713F9498K87516b802p6523q5531l59255A2679f610k11722
12796b18332f7177B03925c29869A69861K13530A7227c47261h2229j33111g6587
12785B8420e70323A54473B1892L2385O2969c14465B9333a23184E6890b49046B15157
12773B4282N2627K25091h1007B24625o4997g1377c2691j68980O3201B23208N7130
12762B80338A03824f6112I1807R7628g9921p6046I2103B6725L21402H1138l6319
12751D4819L02502H2100R7129d4172A76303a00206A08331a23409B11261k8495
12741A82766p4356k7465b32990A14637b7186C33322c513E9885M3312C6612b09772
$$ y = [-123386, -138666, 118982, 304142, -269469, 104962, -100690, 305428, -47123, 140545, 147189, 308908, -41713, 69498, 357014, -2802, -79325, -164856, -524111, 12679, -6610, -218332, -67177, 203925, -329869, 169861, 383391, 17227, -347261, -82229, -215340, -76587, 28420, -570323, 154473, 21892, 54277, 117246, -314465, 29333, -123184, 56890, -249046, 215157, 24282, 76909, 302000, -81007, 224625, 159628, -71377, -32691, -201671, -138470, 223208, 280338, 103824, -66112, 91807, 189435, -79921, -155967, 92103, 26725, 348127, 81138, 44819, 347321, 82100, 179229, -44172, 176303, -100206, 108331, -123409, 211261, 182766, 108410, 80945, -232990, 114637, -27186, 333322, -3513, 59885, 103197, 36612, -209772]
12729A55425J79315r0626E8632A7215K63223a82016h5191D7050a56416G0514b10957
12717c75247a77030A783d01352C13998A17560N4897a30705B0283N08544A49338
12706H4337e9638A3234b04C54277J77877B25273j7176J55048G2493B1907K799
12695B4706L98713i0949C6948J99725J91800h3746B11652p0630b05110I6705J23399
12684B20104f708B954h2750A79410M8146J43230A0367M1350J24694m179J87802
12673C60034b46580B76807j16570p6071j0425K07197c11153D7629b08245a03522
12662B11985M0412a52869k1071A50780a41456A20320a1421C64231i8118I679K43633
12651B53312n1857R9466E1914k1134d3297G4003J23999b3389A5628e9167j15522
$$ y = [155425, 334740, 244114, 58632, 17215, 280438, -182016, -85191, 47050, -156416, 70514, -210957, -375247, -177030, 1783, -401352, 313998, 117560, 172457, -130705, 20283, 528827, 149338, 84337, -59638, 13234, -204, 354277, 532154, 225273, 208097, 363145, 72493, 21907, 24706, 423419, -90949, 36948, 236673, 428473, -83746, 211652, 141022, -205110, 96705, 220104, -6708, 2954, -82750, 179410, 227556, 370786, 10367, 51717, 176411, 172232, 360034, -246580, 276807, 160237, 84166, 73741, 280938, -311153, 47629, -208245, -103522, 211985, 252397, -152869, -173940, 150780, -141456, 120320, -11421, 364231, -98118, 9679, 253312, 201455, 300921, 51914, 30780, -43297, 74003, 198002, -23389, 15628, -59167, -174689]
12640a74689f4271r9621r3834E5264J69620l3695E1840a60405O0729C54313A67666
12628D16785H3904J78514C4986g1049H1256D0465J31345a65806F49090c4134J4775
12617a9359A25260d1689G3761L6843J94522a54385k02337A22537M3367h3667I3249
12605d0336k95654B69995a00745I1741a6354B81172p608a05555d0002B2507K71121
12594B93628h7156A08413M0708C8344a22278H0774K9374h1592C01931B8677q94
12583B7783R1059b8275k710m4839A19756r817h5569C0492J52883P0162a6020j85786
12571b01806F8003b819k53401A39558a05514L4168b4199A46347a38374F9018g8568
12559H4551J48684q785F3919N3910b81080a8781k5551C0021K00334A11776a69468
$$ y = [-174689, -64271, -163892, -257726, 55264, 224884, 191189, 51840, -160405, -99676, 354313, 167666, 416785, 83904, 262418, 34986, -71049, 81256, 40465, 171810, -165806, 649090, -34134, -19359, 125260, -41689, 73761, 110604, 305126, -154385, -356722, 122537, 165904, -83667, 93249, -40336, -335990, 269995, -100745, 91741, -16354, 281172, 273564, -105555, -40002, 22507, 293628, -87156, 108413, 149121, 38344, -122278, 80774, 110148, -81592, 301931, 28677, 27783, 118842, -28275, -30985, -75824, 119756, 109939, -85569, 30492, 183375, 253537, -16020, -201806, 68003, -2819, -256220, 139558, -105514, -71346, -24199, 146347, -138374, 69018, -78568, 84551, 233235, 224450, 63919, 117829, -281080, -18781, -44332, 30021, 230355, 111776, -169468]
12547C6254O7405j8102l2830h218L783B83825m2577m6190a65153P6747A3211e092
12534A77185a25344j170j14489B10870J00136a22186j1233I0681D941b64223h4668
12522B09101P4619e7115A72622F2396R3819M305J00515a33055B88821b34518a5983
12510b88152C12553D2289e6059F883a22507j60098J00748b2593L864A18638L7118
12499A55756i3149q7205k6461M8170B33064c3361P659k5908j04106A21932b588
12487E624b58150M0254A94449C8813N1515C2523K07613n2247B277J65143n9234
12476A08186E1426M3293J74234a19297B81470a01150k7380e7689B05592H4107
12465a04150j08817P8903f3973D99948D0051M4039g718p0911k39852I5967d2188
$$ y = [36254, 103659, 85557, 52727, -8218, -4435, 283825, 241248, 195058, -165153, -88406, 13211, -5092, 177185, -125344, -126514, -241003, 210870, 311006, -122186, -133419, 90681, 4941, -264223, -84668, 209101, 283720, -57115, 172622, 62396, 156215, 160520, 261035, -133055, 288821, -234518, -15983, -288152, 312553, 42289, -56059, 6883, -122507, -282605, -181857, -22593, -18729, 118638, 155756, -93149, -180354, -206815, -158645, 233064, -33361, -25702, -51610, -155716, 121932, -2588, 5624, -258150, -217896, 194449, 38813, 90328, 32523, 240136, 187889, 2277, 167420, 108186, 51426, 94719, 268953, -119297, 281470, -101150, -128530, -57689, 205592, 84107, -104150, -212967, -134064, -63973, 499948, 40051, 84090, -7718, -78629, -318481, 95967, -42188]
12453A96559c80058C8158K9686P4571b15512I5872K09547j00560A5086b45374
12442a60275A90405a69951A037M7564a14231L2750B2437A0862M2875K57657I8341
12430a96225b0964q3092q600L5761A1108K99140G9086b07769e1841k96372C2060
12418G51i7496j60027a26906c3942j30046B29108a02057J9444E5126J07481i8605
12406A70798c2561j63058A63780R5381a8898k5804C13750A27670h9157D4844J00368
12395A45212a17866A07927J18435C4990b08730B34068a38402I7538J12807A03437
12384a16244B37697A457i3286j76036p9095e4720B36116a40554O5076A14716B6153
12372E3949M7561a12601F2600d3411I0886a03062B29291H6156g5352j619K8589
$$ y = [196559, -380058, 38158, 67844, 142415, -215512, 95872, 305419, 204859, 15086, -245374, -160275, 190405, -169951, 1037, 48601, -114231, -81481, 22437, 10862, 53737, 311394, 98341, -196225, -20964, -104056, -112656, -76895, 11108, 310248, 79086, -207769, -51841, -348213, 32060, 751, -97496, -257523, -126906, -33942, -163988, 229108, -102057, -82613, 55126, 162607, -98605, 170798, -32561, -195619, 163780, 259161, -18898, -44702, 313750, 127670, -89157, 44844, 145212, -117866, 107927, 226362, 34990, -208730, 234068, -138402, 97538, 210345, 103437, -116244, 237697, 1457, -93286, -269322, -348417, -54720, 236116, -140554, -75478, 114716, 26153, 53949, 101510, -112601, 62600, -43411, 90886, -103062, 229291, 86156, -75352, -76971, -48382]
12361d8382l82214a34640A50373o6592e0324J2566A19771A4566J02798B2846e7318
12349a59353k5608B12166h2800A2634L9962J16359h8166b6548B2010K3033J4225
12338E9268b8409A80326O5888e1460C0002P2077l5611K4579b2914C83313G6419
12326A88094G7678a67179N3577c2911m6872C4038J04578a55903B4771a60078b5367
12314a11244K7476B0896Q7937n264b09592j3002H6899J23800o2997J04666a26169
12302F6962J587a89324M6451l1952B93357j11734r0783Q0289J11299e0A28158
12290F7172P8933b91129C5933i1507n2070F0190b2339E5909i2070A12113b26016
12278a2485k17791E8265a85104C72013A02667J68570o843A22120e1113A01375
$$ y = [-48382, -430596, -134640, 150373, 83781, -50324, -37758, 119771, 14566, 117364, 22846, -57318, -159353, -184961, 212166, -82800, 12634, 52596, 168955, -88166, -26548, 22010, 45043, 59268, -28409, 180326, 246214, -51460, 30002, 102079, 66468, 91047, -22914, 383313, 76419, 188094, 77678, -167179, -113602, -32911, -79783, 34038, 138616, -155903, 24771, -160078, -25367, -111244, -83768, 20896, 108833, 103569, -209592, -222594, 86899, 210699, 147702, 252368, -126169, 66962, 68549, -189324, -142873, -174825, 293357, 181623, 90840, 171129, 282428, -50, 128158, 67172, 146105, -291129, 35933, -91507, -143577, 60190, -22339, 55909, -92070, 112113, -226016, -12485, -230276, 58265, -185104, 372013, 102667, 271237, 264394, 122120, -51113, 101375]
12267b3901n5462I3858a9042E3419B0222J13712n4568L2187K14661A29150c57575
12255B38160F4295c47335D31528A58924c7229B89213m9444I664L23758A3842b5663
12243A52199M0089d1572j89250A39866a19815F9574J32335C9152d8060l72578
12233d20638A99908q7128g1086p8933a3990r9219C37596a59519B12696J03107
12223C15803n0795H1174J65596Q0025p8213b28809A76334h2317I6668Q146b12252
12211C01096h9546E7186h1947k4526F0223K23663A10242M90268c07353g3228F2858
12199A93107p1798l4093J68896m5909n155c3299n7596N607C42950d5539m9565
12188i5104B68980A25185e1502C47778B6350b8934q6937A96596I3349b4793B14300
$$ y = [-23901, -79363, 93858, -19042, 53419, 20222, 133934, 79366, 111553, 326214, 129150, -357575, 238160, 64295, -347335, 431528, 158924, -37229, 289213, 239769, 9664, 333422, 13842, -25663, 152199, 192288, -41572, -230822, 139866, -119815, 69574, 201909, 39152, -48060, -420638, 199908, 112780, -71086, -150019, -13990, -113209, 337596, -159519, 212696, 315803, 265008, 81174, 246770, 326795, 248582, -228809, 176334, -82317, 96668, 104814, -212252, 301096, -89546, 57186, -81947, -106473, 60223, 283886, 110242, 600510, -307353, -73228, 62858, 193107, 121309, 87216, 256112, 210203, 205048, -33299, -90895, -85288, 342950, -45539, -95104, 268980, 125185, -51502, 347778, 26350, -28934, -115871, 196596, 93349, -24793, 214300]
12176F906K12543b2463A30980L65654A82383K42285A26642B87a60454g9309b4340
12164d3446C65832j3625A42414A1785J03258J05050a92958B06828L4420J3885
12154B55133b3877A41922R497a6037K861B0625h9886B33972b63501N9541F605
12142A00501D873b07135F1253K71644I336a6684A72763K00022G9800k7725B5811
12130f3371n6822b5431n0008L5722n6498k08150A08804B1286b5253k20169A704
12118d6013A83867c8467A56792N0449C5801K1624k4753a08400A04524D2225J19866
12107A62091k8638l5927B6015a8361k64062A4315c3216A14091a31294H803K9882
12096C8685b51353e1718A29963a80367A29116a33036K054a0724j93822e6949B01601
$$ y = [6906, 219449, -22463, 130980, 496634, 182383, 424668, 126642, 287, -160454, -79309, -24340, -43446, 365832, 352207, 142414, 11785, 115043, 220093, -192958, 206828, 241248, 255133, -23877, 141922, 151419, -16037, -13176, 20625, -89886, 233972, -263501, -203960, 6605, 100501, 4873, -207135, 61253, 332897, 9336, -16684, 172763, 372785, 79800, 52075, 25811, -63371, -120193, -25431, -75439, -39717, -96215, -304365, 108804, 21286, -25253, -245422, 1704, -46013, 183867, -38467, 156792, 207241, 35801, 57425, 32672, -108400, 104524, 42225, 162091, 133453, 97526, 26015, -18361, -282423, 14315, -33216, 114091, -131294, 8803, 38685, -251353, -51718, 129963, -180367, 129116, -133036, -130982, -10724, -204546, -56949, 201601]
12084I7706h1332l3488K0930C04919c49690c2883l19595a74334D61693N52054
12074A013747Q84686G13780B63281g5583A63043J02090d7849H3426c90873d0827
12063A3321a09404I5479g8004C34862g2217p6945D7454R4442J24031C5481g7830
12051A78005c01581H8201A9336g36j54817j51910h7204m9462C101J2566b40512
12039A52254a03760j1580L3146q898m492A93773H6845G352K28391b1400C72393
12027d9896D30196d2148E5912b84724M7020M5000R412h4131a3851A41767b01931
12015A58627a27027A04203m8916d1517F8071a18801A10808Q8956g2738k29218
12005c01956D8957N1991a98853M4275H7198a94385K67L6566I118M44348h7035
$$ y = [97706, -81332, -114820, -93890, 304919, -349690, -32883, -352478, -174334, 461693, 1013747, 1898433, 713780, 263281, -75583, 163043, 265133, -47849, 83426, -390873, -40827, 13321, -109404, 95479, -78004, 334862, -72217, -149162, 47454, 141896, 265927, 35481, -77830, 178005, -301581, 88201, 19336, -736, -155553, -307463, -87204, -136666, 3101, 15667, -240512, 152254, -103760, -115340, -82194, -91092, -95584, 193773, 86845, 7352, 235743, -21400, 372393, -49896, 430196, -42148, 55912, -284724, -237704, -192704, -183292, -84131, -13851, 141767, -201931, 158627, -127027, 104203, 55287, -41517, 68071, -118801, 110808, 199764, -72738, -301956, 48957, 100948, -198853, -154578, 87198, -194385, -194118, -157552, 9118, 453466, -87035]
11993I2879C4205Q1287J5260K8575A9272a13636a9110m6754j02724a5669J388
11982a4281A37756e4687A73595a01587m616B42797c9816B8956b14305N8899n7372
11971b12778C00708C9668a28767A01567L4004b22291h8382J3064l3478H6842a06882
11959A16023J10306b84306b4175D5652J4828b13782B67601a55639G6217K9096
11949A05313C5671e6630B86454I9009J95830L8264d8364m7626A23156N301e5054
11937a50467d8868F7910P0222J72827J10128e48405D7084c9459F2210a23978B68029
11925b05043g0415B97250C5369b01291J6626m2925A98133p0632E2149J84478E2016
11913A30340d8347k57797D4236h5512B63278a07788A39403o5738e8080K7322a1431
$$ y = [92879, 34205, 115492, 130752, 159327, 19272, -113636, -19110, -65864, -168588, -15669, -14281, 137756, -54687, 173595, -101587, -106203, 242797, -39816, 28956, -214305, -155406, -212778, 300708, 39668, -128767, 101567, 135571, -222291, -88382, -75318, -108796, 86842, -106882, 116023, 226329, -284306, -24175, 45652, 60480, -213782, 267601, -155639, 76217, 105313, 35671, -56630, 286454, 99009, 294839, 333103, -48364, -95990, 123156, 128457, -55054, -150467, -48868, 67910, 138132, 310959, 421087, -548405, 47084, -39459, 62210, -123978, 268029, -205043, -70415, 297250, 35369, -201291, -184665, -227590, 198133, 127501, 52149, 236627, 52016, 130340, -48347, -306144, 44236, -85512, 263278, -107788, 139403, 73665, -58080, -30758, -11431]
11901a47414C0800a25173n0538n5544e1365r2608a9852j00611L748G0154P8930
11890A49084b3217k4692G2997a27536j29780J22743F5307J08109b92289G5876
11879b50221J01193E0525b98227a10k38815A99423g9102H7063b4863j96163P9352
11868a41674A52894C4233e9114l82950I5735g84A33642b49177a4277l59907B62814
11856F5216c58521J76792L9121A968c38146i8938j7500A78843E7240a19658l27237
11845d46895A33088f1983p0146B34134B1745c69649I8463g8060J749r8759Q5951
11834h9119a4563A53815e9930A09591a67430O2850d4875A10258a51864q3692R9862
11823a35694B47219d73316a92584a12o2196j67010I2935g1467r5107a0411A00567
$$ y = [-147414, 30800, -125173, -175711, -231255, -51365, -143973, -19852, -120463, -116715, 70154, 149084, -23217, -47909, 72997, -127536, -257316, -134573, 65307, 173416, -292289, 75876, -250221, -149028, 50525, -298227, -110, -238925, 199423, -79102, 87063, -24863, -221026, -141674, 152894, 34233, -59114, -442064, 95735, -784, 133642, -249177, -14277, -374184, 262814, 65216, -358521, -181729, -142608, 1968, -338146, -98938, -116438, 178843, 57240, -119658, -446895, 133088, -61983, -132129, 234134, 21745, -369649, 98463, -78060, -76311, -175070, -89119, -14563, 153815, -59930, 109591, -167430, -104580, -44875, 110258, -151864, -235556, -135694, 247219, -473316, -192584, -112, -62308, -229318, 92935, -71467, -166574, -10411, 100567]
11811c37869J25751R6796b8557m40634A25047h2635M1294k66104i606A56856h848
11799c5741D93868f9181H0474J17382L6495B8017J51360G9109O3483n2226b60416
11787A60210Q0700c020k09746J8106c826F391a49168j51812C20816j38259e00496
11775a96559A12215m3555A4284d9376r8479j4167d0217r2225j3816d0149J7875
11764b2274j8326J8397p2587j1028A0056d0948j4045H5031N2877h3175p3j26701
11752b09949f8919b7874A23597b45016i4818k58360d3185m4654K4694A17623b45944
11740G5763a8043A09062b04953O0595m1700f6722j12163J7269B5904J54580B1387
11728i4032a1504j14854E6571h5200C9304J022J09942c0953C89022b50036B14456
$$ y = [-337869, -212118, -115322, -28557, -469191, 125047, -82635, -41341, -307445, -9606, 156856, -8848, -35741, 493868, -69181, 80474, 197856, 234351, 28017, 179377, 79109, 142592, 90366, -260416, 160210, 240910, -3020, -212766, -194660, -3826, 6391, -149168, -300980, 320816, 182557, -500496, -196559, 112215, 68660, 14284, -49376, -147855, -162022, -40217, -132442, -146258, -40149, -22274, -40600, -22203, -94790, -105818, 10056, -40948, -54993, 85031, 137908, -83175, -83248, -209949, -68919, -27874, 123597, -245016, -94818, -353178, -43185, -87839, -63145, 117623, -245944, 75763, -18043, 109062, -204953, -144358, -186058, -66722, -178885, -161616, 25904, 180484, 21387, -94032, -11504, -126358, 56571, -85200, 39304, 40326, 150268, -30953, 389022, -250036, 214456]
11716A81107o2115d1878k8601b0238G8155k7520a76045E9812d474j04289j59435
11705b68198Q0054B73602A08529A1286a92420B31163b49333J10734a3384C27202
11694C98629g8281q4263q291A15818N9339e2232C5704R5031k5089L3359B1395
11682c0379F7745J14232H7216g1751H1292B9383n600R2249k7945c10612B27975
11670C11323a31948a2601L831F1015a7402n6151A74570J19132J89969k12742G83
11658b74794B54542H6954J28398a08688c9736H7528g5674k461j82472e0592j46128
11647a96720B53959L45523a36952L6256A43780E5459h5901m4833c9102B5837a74135
11635A02051a37080A23474A569a06713G0834B0313K20284d3932e78l17377B97262
$$ y = [181107, 118992, -41878, -70479, -20238, 78155, 50635, -176045, 59812, -4474, -108763, -268198, -188144, 273602, 108529, 11286, -192420, 231163, -249333, -138599, -13384, 327202, 398629, -78281, -162544, -170835, 115818, 175157, -52232, 35704, 130735, 105646, 139005, 21395, -30379, 67745, 181977, 87216, -71751, 81292, 29383, 23783, 116032, 88087, -310612, 227975, 311323, -131948, -12601, -8770, 61015, -17402, -73553, 174570, 293702, 483671, 270929, 783, -274794, 254542, 86954, 215352, -108688, -39736, 87528, -75674, -78135, -260607, -50592, -196720, 253959, 599482, -136952, -100696, 143780, 55459, -85901, -130734, -39102, 25837, -174135, 102051, -137080, 123474, 1569, -106713, 70834, 20313, 240597, -43932, -578, -317955, 297262]
11623f3445E6230c05846d4193l4091j08913h3003D0777h8404A48809e1674K700
11612d8974C34082c66420h6272b9482A84242O3406a27760M8655j93749f4652B37695
11600A3524J50409a68519C15368a4986n1050B18438G9050R3622c41993A95325
11589c1621A46501a6073H3057J34833K6757Q4868q7838E2868a14699m6063F2615
11577f48896A41493m7591m073J16619a19417F7631a12934C4427b32488L4519C1167
11565a0975A65159c9205o4732A2931L18739i265n4813o6229B41116A3341J30307
11554A43648a7253j0264n4366p8077M7368k0443o115A45856D76J72082D7168a02209
11541A62022E8309K56602a6816B42110a17632A8855i0486B63533N0917j21643
$$ y = [-63445, 56230, -305846, -44193, -78284, -187197, -83003, 40777, -88404, 148809, -51674, -48974, 334082, -366420, -86272, -29482, 184242, 247648, -127760, -79105, -272854, -64652, 237695, 13524, 163933, -168519, 315368, -14986, -66036, 218438, 79050, 172672, -341993, 195325, -31621, 146501, -16073, 83057, 217890, 244647, 329515, 241677, 52868, -114699, -160762, 62615, -648896, 141493, 93902, 89829, 206448, -119417, 67631, -112934, 34427, -232488, -197969, 31167, -10975, 165159, -39205, -103937, 12931, 331670, -9265, -64078, -130307, 241116, 13341, 143648, -17253, -27517, -81883, -159960, -112592, -133035, -139150, 145856, 476, 172558, 47168, -102209, 162022, 58309, 314911, -16816, 242110, -117632, 18855, -90486, 263533, 314450, 192807]
11531A92807h2234B177a29697A93617B7280a13575a852A15404l7679a33123A55093
11519C1625K32358I1031J13635J5813N953I7742k8092J72832i2007H8304f0324
11507E41175f6257C60938j60638D2692J39699q632K06596A7912K42020P475K308
11496B69715N1151F2122a05825C55219F1629b7853E3461e6489B76709J1233A29788
11484a33075D03989j81389M8623A34408J06684e187B68755c418B46743a02476
11473B68195d259C2811d1954j69161A6449K30193C2943J27645i7786a3446A92865
11461A40375M56627d0186a8866E0419J43144E6790h7057L6648B36444b34957A05986
11449a92916E1343P9845d7968A09935Q4534g5129I5686J7418E3260K27208B1974
$$ y = [192807, -82234, 2177, -129697, 193617, 27280, -113575, -1852, 115404, 77725, -133123, 155093, 31625, 263983, 91031, 204666, 220479, 226432, 97742, 69650, 242482, -92007, 88304, -60324, 541175, -66257, 360938, 200300, 42692, 182391, 173759, 380355, 17912, 259932, 267407, 269715, 320866, 62122, -105825, 355219, 61629, -27853, 53461, -56489, 276709, 287942, 129788, -133075, 403989, 222600, 271223, 134408, 241092, -5187, 268755, -3418, 246743, -102476, 268195, -4259, 32811, -41954, -211115, 16449, 246642, 32943, 160588, -97786, -13446, 192865, 140375, 597002, -40186, -18866, 50419, 193563, 56790, -87057, -50409, 236444, -234957, 105986, -192916, 51343, 131188, -47968, 109935, 194469, -75129, 95686, 113104, 53260, 280468, 21974]
11437b74308A47923J6126E8108J87429L10785B29353a0887A04212d08414b8625
11426B35583e7174q1460f7831B23725B1712d1464m8978J6629D81748i7479A22177
11414b49185f4331a5582I5450L1655c56576a17568B35048H8692J17856b7083j11828
11403a38911f0624a41F2261e0864k2946I2064I284N9310K62385j09451J05549
11392C27077n9935a7290j29296j40950I7143b21719B491e9710b4195p8776H5562
11380F1181b71230J29941c1605k06914B93184A5725e3242A7305a6971B7102P0326
11369I7428b3822D3131N5073g487m5884A3492J7523a24193m7549B34596e6926
11357A9483J50511b80011A66716e6323A6874K05650c9808B3356K11339d6772G5777
$$ y = [-274308, 147923, 164049, 58108, 245537, 556322, 229353, -10887, 104212, -408414, -28625, 235583, -57174, -138634, -67831, 223725, 21712, -41464, -90442, -73813, 481748, -97479, 122177, -249185, -64331, -15582, 95450, 127105, -356576, -117568, 235048, 88692, 206548, -27083, -138911, -60624, -141, 62261, -50864, -73810, 92064, 9284, 68594, 330979, 221528, 327077, 267142, -17290, -146586, -287536, 97143, -221719, 2491, -59710, -24195, -102971, 85562, 61181, -271230, -141289, -31605, -238519, 293184, 15725, -53242, 17305, -16971, 27102, 97428, -23822, 43131, 98204, -7487, -53371, 13492, 31015, -124193, -171742, 234596, -56926, 19483, 169994, -280011, 166716, -56323, 16874, 222524, -39808, 23356, 234695, -46772, 75777]
11345A82939G6411b74240i182k69557R6765N3868A81850c43265a68257I9943b20360
11333a83518b039A23007K4936c35241J08141F6910Q7441a88920G0863d1997j60615
11322b02612Q2768a1395G057J58370a74486h532n0091j46200C19969j7385l1319
11311B71265A14311j803g550k5473I8171J3100d3585j11517B2854a18029N3993
11300f4036A44967J03544e33688B7516b76507J36071d4500a3715j32315j2027
11290a58057A45979L8879a25422J673j70642M9344O0101C7600J81412b73444i1007
11278G199a36728P816E0755j977g2495q488k65771J05479G820a67374p3460p3418
11266c14252J23949A60321e0973r0353l55678g6931E61473c3194n6400K4934o0011
$$ y = [182939, 76411, -274240, -9182, -278739, -181974, -128106, 181850, -343265, -168257, 99943, -220360, -183518, -2039, 123007, 147943, -335241, -227100, 66910, 154351, -188920, 70863, -41997, -202612, -119844, -11395, 7057, 165427, -174486, -8532, -58623, -204823, 319969, 302584, 271265, 114311, 112508, -7550, -33023, 98171, 111271, -43585, -155102, 22854, -118029, -64036, 144967, 248511, -533688, 27516, -276507, -140436, -44500, -13715, -146030, -158057, 145979, 184858, -125422, -123749, -294391, -245047, -184946, 37600, 219012, -273444, -91007, 7199, -136728, -128912, 50755, 48778, -72495, -80983, -346754, -241275, 7820, -167374, -240834, -314252, -190303, 160321, -50973, -141326, -497004, -76931, 561473, -33194, -89594, -64660, -124671]
11255a24671C22358E0824b5929q8386C34705a44781j25776M161c6325q3166k8049
11244a47540b5715k1790j7749j18312b9237D4543a00035F2846J18471b8665k15274
11233b43939o1243N8856a18485B51451i5471n7018A85146a60508A18855a68839
11222a00769K4925C3546N1943a78261j90555M8600J16752C7552h0850F4214j6970
11211D7244A106J20750C3650g4056F1028e5950A75573a03123b76G6572K4712J13945
11199B15229b17553K8126K0205c8417j19874e9965j51395I965L7592J17266J71956
11188C36779c74602A83423D1057a41174g033H0250J26042b87537H2107b09721
11177b73301C16934a34662M073F2459A0451d6325r6986G5370N0513b87860d4142
$$ y = [-124671, 322358, 50824, -25929, -114315, 334705, -144781, -270557, -266396, -36325, -119491, -147540, -25715, -47505, -65254, -183566, -29237, 44543, -100035, 62846, 181317, -28665, -243939, -305182, -246326, -118485, 251451, -95471, -152489, 185146, -160508, 118855, -168839, -100769, -75844, 33546, 85489, -178261, -368816, -320216, -203464, 37552, -80850, 64214, 47244, 1106, 121856, 33650, -74056, 61028, -55950, 175573, -103123, -276, 76572, 101284, 215229, -217553, -189427, -169222, -38417, -158291, -59965, -211360, 9965, 47557, 164823, 336779, -374602, 183423, 41057, -141174, -7033, 80250, 206292, -287537, 82107, -209721, -273301, 316934, -134662, -130589, 62459, 10451, -46325, -143311, 75370, 125883, -287860, -44142]
11165a28742A41357m4100b35030g1874C3503j6660b06853K6461A73123L0574a42721
11153A0666c12364J39039B76633i8149L9958B1875c30257A88098h2192B19252
11142a54041A8611J14047c72293b01o815C02957M27f48376a4970l4791A23810
11130f2865C2355J90112c10776A08531d2611n7345d2261J5376A48158C0176r877
11119B0299K20803b53429A16770a80369E7603g5641n3167b3029A69795B2583a91176
11107I2147J09772o932K8855e6836n712B25690p378k7854a53025C32952C9194
11095e9586b4425o3891B69248G7595N088K42821j54490f180J85k6404B25448B0171
11082e324k3715H21h2309B1943O46491g651l2763D01624A31603A9507M02720J64788
$$ y = [-128742, 141357, 97257, -235030, -71874, 33503, 16843, -206853, -180392, 173123, 203697, -142721, 10666, -312364, -173325, 276633, -98149, -58191, 21875, -330257, 188098, -82192, 219252, -154041, 18611, 132658, -372293, -201, -7016, 302957, 303384, -648376, -14970, -49761, 123810, -62865, 32355, 222467, -310776, 108531, -42611, -99956, -42261, -26885, 148158, 30176, 20299, 241102, -253429, 116770, -180369, 57603, -75641, -128808, -23029, 169795, 22583, -191176, 92147, 201919, 194987, 223842, -56836, -62548, 225690, 218312, 190458, -153025, 332952, 39194, -59586, -24425, -88316, 269248, 77595, 82683, 325504, 171014, -6180, -5995, -32399, 225448, 20171, -5324, -29039, 821, -82309, 21943, 668434, -7651, -40414, 401624, 131603, 19507, 422227, 587015]
11070E87015m2879j67837j51382J50029j59227L31440k43297J71499j44832J76111
11060E06640J36836k55826K60455k2272J76775k35657J40897l4677C34884K11220
11050E46104M9629J76819r8531C21756K52889j0167J33527j62356j87496M72318
11040H20471k09969q0487K9705k7977J61275r6075j71665J53418J16082J46881
11030H41659C00517J41062M34291k90707B90451N36790k05439k30303K63941A57494
11019B59426N00237B49136K85897J42335m9743j09306O7456m0893A88674J75788
11009C64462K87152j45338R7748K7037n0583O2703Q9555B34255K26611n3316K10357
10998F17907k66030N44743l63505M6175K02678k37187K10605J0223n8201J01860
$$ y = [587015, 544136, 376299, 224917, 374946, 215719, 547159, 303862, 475361, 330529, 506640, 643476, 387650, 648105, 625833, 802608, 566951, 707848, 673171, 334884, 546104, 595733, 772552, 674021, 321756, 574645, 564478, 698005, 535649, 348153, 820471, 610502, 530015, 559720, 531743, 693018, 596943, 425278, 578696, 694778, 841659, 300517, 441579, 875870, 585163, 290451, 827241, 621802, 391499, 655440, 157494, 259426, 759663, 249136, 535033, 677368, 627625, 518319, 585775, 544882, 188674, 364462, 651614, 506276, 604024, 631061, 580478, 643181, 732736, 234255, 460866, 407550, 617907, 351877, 896620, 533115, 579290, 781968, 544781, 755386, 765609, 707408, 809268]
10988H09268k45069K4719J63595K62054k04881L08284K3828p52N9946K09043k31997
10977A178038K12222K28856L61553J25142L55068j36060M32760j97799m92509
10968B067271o5432l23569j4628L103r2259p8752k78765N61807O3187k32294Q3020
10957A692689K7182l86236n2185N76097p66503j43769j31973J65499m14366N2180
10947F18615K05605E8706K22147A11481m9349M78112k43408A27033d5437o418
10937e1855B99669H0767M10402d8936A74762l2512K01513a6378B68371N4902A46149
10925d8556C20888b44224D7239K11288b9888j45313O7199n819J4869E9554O2710
10914A22264B1748J5858N3925g4002m4936J2696L9730A68887N0592h4290k04842
$$ y = [809268, 564199, 588918, 752513, 1014567, 809686, 1117970, 1141798, 1141046, 1200992, 1410035, 1178038, 1390260, 1619116, 1980669, 2105811, 2460879, 2324819, 2757579, 2559780, 2067271, 2001839, 1678270, 1663642, 1666745, 1574486, 1495734, 1216969, 1778776, 1841963, 1609669, 1692689, 1719871, 1333635, 1281450, 1857547, 1091044, 947275, 815302, 980801, 566435, 618615, 824220, 58706, 280853, 111481, 62132, 540244, 296836, 127033, -45437, -51855, 299669, 80767, 491169, -48936, 174762, 142250, 343763, -16378, 268371, 323273, 146149, -48556, 320888, -244224, 47239, 258527, -29888, -175201, -108002, -113821, -98952, 59554, 122264, 21748, 37606, 91531, -74002, -118938, -106242, -66512, 168887, 219479, -84290, -289132]
10903b89132b9871J0912l2976l89025a92397H5875a34095D4460K26501A14407
10892G1550g0777o3015B7135K02600b18463f2568K7010C7366J49281c14443a29737
10880F2061J92750G6800b70549e7853q0549B03571h210C51086a7543B226a66794
10868a67652N6205E7071g2937k56972h4134A4602i0639l37425K09032e4212K6936
10857b7276B61932h2425B6365a83034A50796f0611A50655a75999F1319i2452A47424
10845i1802A2321K18082f0918D6402a2146j7331j51436e7399a9749A1464J38119
10834A49583b88191D7343e6001A43959A5586b9654A21871J61650a32771A01289
10823C884d7825n8173l3839l7919f504l28792a15662o987A16188a15227M525B9292
$$ y = [-289132, -29871, -18959, -51935, -440960, -192397, 85875, -134095, 44460, 270961, 114407, 71550, -70777, -133792, 27135, 229735, -218463, -62568, -35558, 37366, 186647, -314443, -129737, 62061, 254811, 76800, -270549, -57853, -138402, 203571, -8210, 351086, -17543, 2226, -166794, -167652, -111447, 57071, -72937, -329909, -84134, 14602, -90639, -428064, -219032, -54212, -27276, 261932, -82425, 26365, -183034, 150796, -60611, 150655, -175999, 61319, -92452, 147424, -91802, 12321, 230403, -60918, 46402, -12146, -29477, -180913, -57399, -19749, 11464, 149583, -288191, 47343, -56001, 143959, 15586, -29654, 121871, 283521, -132771, 101289, 3884, -47825, -105998, -139837, -177756, -6504, -335296, -115662, -122649, 116188, -115227, -110702, 29292]
10810c16949A39205c11470A08279a28163k57966B6905C270f791q1847A14073Q1086
10799A95159b8064A53806R3021d4730k45857a23936m3214C01701n582a77586k63349
10788d40935f4931A11778F916a09309B2476L16804a28083B6716K65850b61258
10777A18842k3135b15477A75701k9570B8319a37456C9165K637c1560C48524a07032
10765A4587O8981a98812o1975d3133C3963b73690K3192q4804A74122R0091g4159
10753b04022A1402K27631a73747b1672k14742A53546b48990d7987C06457j47112
10743A59345A1680b94148e9459A40075e1166N224p3932c5223j43395o4095q277
10732b50990R5085b2802j79686d1599C08940g4500D7111b33019g4368O49H562
$$ y = [-316949, 139205, -311470, 108279, -128163, -386129, 26905, 3270, -6791, -88638, 114073, 195159, -28064, 153806, 246827, -44730, -290587, -123936, -167150, 301701, 296119, -177586, -440935, -64931, 111778, 6916, -109309, 22476, 339280, -128083, 26716, 292566, -261258, 118842, 95707, -215477, 175701, 146131, 28319, -137456, 39165, 41802, -31560, 348524, -107032, 14587, 83568, -198812, -260787, -43133, 33963, -273690, -250498, -335302, 174122, 264213, -74159, -204022, 11402, 239033, -173747, -21672, -236414, 153546, -248990, -47987, 306457, 159345, 11680, -294148, -59459, 140075, -51166, -45942, -119874, -35223, -178618, -242713, -250990, -155905, -22802, -202488, -41599, 308940, -74500, 47111, -233019, -74368, -73719, 8562]
10720B24776H6873B2772a1982D2905a90261M4663N6428j9892p4584k010g3470
10708a02761l03399Q1575J18000h0182C4786R8656h1213A25626J8234A5929R5467
10697A11396b48959e2466o4988A36961b7057q1462J4186E5877Q8496k4872b61262
10685c1006k41474A9287K3326d56053g2351j10847B28376H4491M5306l8627a1461
10673a59717A03621B7527a31373N7933l19401G363a73412I6684b09366A38016
10662a67313d2757F1597M8750J76038A01103A5652g4290j3453B12576A01470a87617
10650c9740j9332D478h8967k31461B59897C7260a67921k2048J6409j493O1943
10639a13110K7901k272p6543C8374I903K18739m1179r0906C7860b95042k27962
$$ y = [224776, 86873, 22772, -11982, 42905, -190261, -145598, -89170, -109062, -183646, -185656, -73470, -102761, -406160, -324585, -206585, -80182, 34786, 133442, -81213, 125626, 143860, 15929, 111396, -248959, -52466, -117454, 136961, -27057, -108519, -94333, 55877, 144373, 119501, -261262, -31006, -272480, 19287, 42613, -456053, -72351, -183198, 228376, 84491, 129797, 91170, -11461, -159717, 103621, 27527, -131373, -73440, -392841, 7363, -173412, 96684, -209366, 138016, -167313, -42757, 61597, 110347, 286385, 101103, 15652, -74290, -87743, 212576, 101470, -187617, -39740, -59072, 4478, -88967, -320428, 259897, 37260, -167921, -189969, -173560, -175053, -113110, -85209, -87481, -164024, 38374, 9903, 228642, 187463, 96557, 37860, -295042, -523004]
10628e23004J69732E9709c31076i0938l4474L4038B31516i8971q714C9486A1987
10616B45581d3949j0649B20744b59554g5147k50188N0723p076A32381J17383b38800
10604A02444e8171H102O7217e3028j72046a11339A26314b71930a16418D21238
10593h962k96573B99292E1537M6383i9569F0333b1062l48235c810l5509m32937
10582d72256f4933n235E4761J76359a93327B44058a4159A49798a85335C5907a60729
10570H4439a31410k04952a06453A25364M2302l4585m058Q0607G7612b39484Q8479
10559a51005j2417o7225d6038o7009q714j29021A83628Q8112a84167A0399f3542
10547a39644q7777C60794A23612E8083a81042B13233g2144l26819h2181B93052
$$ y = [-523004, -353272, 59709, -331076, -90938, -125412, -91374, 231516, -98971, -107685, 39486, 11987, 245581, -43949, -54598, 220744, -259554, -75147, -325335, -274612, -281688, 132381, 249764, -238800, 102444, -58171, 8102, 75319, -53028, -225074, -111339, 126314, -271930, -116418, 421238, -8962, -305535, 299292, 51537, 97920, -99569, 60333, -21062, -369297, -3810, -39319, -472256, -64933, -70168, 54761, 231120, -193327, 244058, -14159, 149798, -185335, 35907, -160729, 84439, -131410, -336362, -106453, 125364, 167666, 133081, 129023, 209630, 77612, -239484, -151005, -163422, -230647, -46038, -113047, -121761, -250782, 183628, 271740, -184167, 10399, -63542, -139644, -227421, 360794, 123612, 58083, -181042, 213233, -72144, -398963, -82181, 293052]
10536c18521B08544b11550N3853N2521j62909R7108j5319Q7618A80548F5447k533
10525F2914P3243l983i5430K83A41801E9055c06027H0032K7790b90308a00022
10513a11694d0646k32524A77387C5005a60358j17192o2988N1022c5897j5778l260
10502e4935A41298a72390K8935A94995b26681A5394R5805i7692F5411N1102a23647
10490E3339b99147B94996J9776b47878f6506p4911N8247D17964j41853K2992L89377
10479F88480l20792j33255b1010C6449J1859J72663b18759A73570K9449a50146
10468b30152c989m3804h19G1989R2043k8520e1555k55949r1027h6581j82153C25178
10455d2409C04471i8584l9835C3198a3289j67072d4146j73643R4895k4920l34616
$$ y = [-318521, 208544, -211550, -157697, -105176, -268085, -170977, -186296, -98678, 180548, 65447, 62914, 136157, 132174, -95430, -95147, 141801, 59055, -306027, 80032, 107822, -290308, -100022, -111694, -40646, -273170, 177387, 35005, -160358, -277550, -340538, -289516, -35897, -51675, -54935, 141298, -172390, -143455, 194995, -226681, 15394, 111199, -97692, 65411, 116513, -123647, 53339, -299147, 294996, 314772, -247878, -66506, -141417, -83170, 417964, 276111, 299103, 688480, 367688, 234433, -21010, 36449, 48308, 220971, -218759, 173570, 203019, -150146, -230152, -3989, -47793, -819, 71989, 164032, 135512, -51555, -307504, -398531, -86581, -268734, 325178, -42409, 304471, -98584, -138419, 33198, -13289, -180361, -44146, -217789, -122894, -147814, -482430]
10444d82430d2474B92792e9718m8077M0432k25l7299A93213a64675A70474e7535
10432b475B57887a0208B14580a94493c0235r722h751m6218A55083a18490I1902
10420b58169r0432A7464P8171i6430d539l8971C20697b49434B12362b60078A9955
10408a15469B82735a75488A86641o9361l5953a29302F0625a67537A03812M5311
10398A49123L4343d4668q989b081A18495b8335j06545C14177b27873A80557K04413
10387C84970I7736g3902H9135a80531a496A42066a21361B09911A4338K21438A13168
10375D09243F8108K333e8745B60800R2838m7124k1160k5218M8573j6467o4789
10364B27453p4211R1994q9605o4928K80076m1742k1687A04576J31146c06160A39117
$$ y = [-482430, -42474, 292792, -59718, -107795, -67363, -67588, -104887, 193213, -164675, 170474, -57535, -2475, 257887, -10208, 214580, -194493, -30235, -39957, -8751, -54969, 155083, -118490, 91902, -258169, -348601, 17464, 95635, -96430, -4539, -43510, 320697, -249434, 212362, -260078, 19955, -115469, 282735, -175488, 186641, 117280, 81327, -129302, 60625, -167537, 103812, 149123, 183466, -44668, -53657, -2081, 118495, -28335, -134880, 314177, -227873, 180557, 384970, 97736, -73902, 89135, -180531, -1496, 142066, -121361, 209911, 14338, 235776, 113168, 409243, 68108, 70441, -58745, 260800, 353638, 306514, 285354, 260136, 308709, 292242, 227453, 153242, 245236, 155631, 90703, 370779, 329037, 307350, 104576, 235722, -306160, 139117]
10352C68775O9379J25462B16014L02405J32098C16065A12760J57862k626R7802
10342C65798J17482B17834P889K64047A40715l3554K38506j29139a99859A18630
10331e782C7204M0452B2901b9134m5897C6643M2040h7569A78003J09394m1379
10320B46018q805L0622b55129e3827F351R4316R4757q3274g6782A72990m0129
10309A32861i9221B47345c46415h8075A00376c16167q3891a82927j16763J8258
10299b81432A20747b08420R4990C5914b75135a5365j84876e6118p8013B91627
10288A92479c2251A45008m2833d79707a17640b4986G2400C3374b6520A65665K34202
10277C99867F9747J8246c1181A29780P1628f3161B26148b59491e8064m0544A11500
$$ y = [368775, 438154, 563616, 216014, 518419, 650517, 316065, 112760, 270622, 267996, 365798, 483280, 217834, 225723, 489770, 140715, 107161, 345667, 216528, -199859, 118630, -5782, 37204, 77656, 22901, -29134, -75031, 36643, 78683, -87569, 178003, 287397, 246018, 237213, 267835, -255129, -53827, 6351, 100667, 195424, 112150, -76782, 172990, 132861, -99221, 247345, -346415, -88075, 100376, -316167, -400058, -182927, -299690, -281432, 120747, -208420, -113430, 35914, -275135, -15365, -200241, -56118, -134131, 291627, 192479, -32251, 145008, 102175, -479707, -117640, -24986, 72400, 33374, -26520, 165665, 399867, 69747, 87993, -31181, 129780, 201408, -63161, 226148, -259491, -58064, -98608, 111500]
10265F3635Q4421j6104h1391F35688B82495J04526j09576A11582E5351P2366B9153
10253B63570j17268i9554j780j9826e0773E1746b9246B5358a13658a5136p2727
10242h7863j07450A56515D511b12224n179o6067A07674b4994C52169b05906b4244
10230e8791b012j22343H1520e1284A12055a98529j87450a79085c8739l0472j08756
10219a77967F5232b62165A51526c7991G7648e19503A91157h476j33462p8131G674
10207A17707a67562B67878P2559E5742L4751L148a47845k36493J57395g2766B7177
10195i4605C14647f1181m725r0211k23925h306k19125B6901i770A07509a9263
10183B92558a66765r3820Q5463g3250B72236b20412b8305B49588p9840a20014
$$ y = [63635, 148056, 131952, -81391, 635688, 282495, 387021, 277445, 111582, 55351, 127717, 29153, 263570, 146302, -99554, -101334, -121160, -50773, 51746, -29246, 25358, -113658, -15136, -87863, -195313, 156515, 4511, -212224, -217403, -283470, 107674, -24994, 352169, -205906, -24244, -58791, -2012, -124355, 81520, -51284, 112055, -198529, -385979, -179085, -38739, -69211, -177967, 65232, -262165, 151526, -37991, 77648, -519503, 191157, -8476, -141938, -220069, 7674, 117707, -167562, 267878, 340437, 55742, 90493, 93641, -147845, -384338, -226943, -72766, 27177, -94605, 314647, -61181, -65906, -156117, -380042, -8306, -227431, 26901, -9770, 107509, -19263, 292558, -166765, -260585, -175122, -73250, 272236, -220412, -28305, 249588, 169748, -120014]
10172a24261P967H4188h1494j38132m8444g8655r5151h1066B46342F2135P407
10161F9542a59056M4711q0392A61507b59770i4942B20890J27540c22332a25929
10150b151j14810p3866q3914a03972k25860a27572K0426m6169C75791i359A6840
10138d9713A39574d5119k99534D19256b453k71221H023a03836a6748j61465E4913
10126b47828A58984b22406g358o0704J0937l4189m3995F5479a99527E0592j2456
10115C8136b68088b533n3864j75137o2398L861A40787M2690b42342I3630a10417
10103A14969A540L6206a39298D1133c2814l13411a46262q7621a13345D6205K80013
10092C26218j19391p1470h9276A82641b27960D2520b67063H6165g5354j0129B4516
$$ y = [-124261, -116294, 84188, -81494, -219626, -268070, -78655, -173806, -81066, 246342, 62135, 69542, -159056, -114345, -194737, 161507, -259770, -94942, 220890, 348430, -322332, -125929, -2151, -116961, -190827, -274741, -103972, -329832, -127572, -107146, -153315, 375791, -9359, 16840, -49713, 139574, -45119, -344653, 419256, -2453, -273674, 8023, -103836, -16748, -178213, 54913, -247828, 158984, -222406, -7358, -68062, -57125, -91314, -135309, 65479, -199527, 50592, 38136, -268088, -2533, -56397, -231534, -293932, -290071, 140787, 183477, -242342, 93630, -110417, 114969, 1540, 37746, -139298, 41133, -32814, -346225, -146262, -233883, -113345, 46205, 326218, 206827, 135357, -89276, 182641, -227960, 42520, -267063, 86165, -75354, -85483, 24516]
10080c19003M4897c3207k10134D6623c5658l22132B4168b57504G9836J70849a69392
10068a10605I235e8826A42382m0862K07270g6176j47725b6680B66001b1132C02927
10056H2154a69848M396g8939L1527k98005N4005J1754A93030n1202b90549b1568
10044b21526l3111a22663j02028B99201a64877b6504k04337b7626j8046B00661
10033G4155b36681a14691A19542g1227k4461H3419d7556k10856a20643D4476a83657
10021d9218p4333K7599A98175q4213A8310J30386n3967e5951j32625A56567a26791
10009B91459a8070j77745N5424K1043C4775P6575J67409I4859a91388q3174F6205
9997e0760D3064h2913b6213e175n9146a8215j32755B60577e74k60179i8594M4215
$$ y = [-319003, -274106, -33207, -243341, 46623, -35658, -357790, 24168, -257504, 79836, 250685, -169392, -110605, 9235, -58826, 142382, 101520, 308790, -76176, -223901, -26680, 266001, -21132, 302927, 82154, -169848, -165452, -78939, -47412, -345417, -291412, -279658, 193030, 141828, -290549, -21568, -221526, -254637, -122663, -224691, 299201, -164877, -26504, -230841, -27626, -45672, 200661, 74155, -236681, -114691, 119542, -71227, -95688, 83419, -47556, -258412, -120643, 44476, -183657, -49218, -123551, -95952, 198175, 113962, 18310, 148696, 94729, -55951, -188576, 156567, -126791, 291459, -18070, -195815, -140391, -119348, 34775, 111350, 278759, 94859, -191388, -274562, 66205, -50760, 43064, -82913, -26213, -5175, -64321, -18215, -150970, 260577, -574, -260753, -98594, -54379]
9985e4379j8281E1775a14908k40077A25982a92693C55707b30990m1816j39321
9975d12127Q0419P3052A75049b35295B2880Q5269A5372N460a05186j03882d6320
9963I5223e66066g7022a0825r8619A84127g2357A43584C6330a52642r6315j889
9952b50846B3983b7335D906b80092J37728E5425c56665a44156k36221E9511J0147
9941F9658c47353C86545a47480B41400a01824A02744e108A83670i2387d2563o3727
9930a06290B5522J4869L20327A2326a82759B3113K9463b11698j41726f4994j23796
9919a88790A4812L053O8707a36355j57224A6479J33427l2452c35860J49136C3991
9907B8653a42557c0359E7927N4506a0160j21033m6813Q8296N191A90203C7112
$$ y = [-54379, -72660, 51775, -114908, -354985, 125982, -192693, 355707, -230990, -272806, -412127, -331708, -258656, 175049, -235295, 22880, 108149, 15372, 20832, -105186, -209068, -46320, 95223, -566066, -77022, -10825, -109444, 184127, -72357, 143584, 36330, -152642, -248957, -250846, 23983, -27335, 4906, -280092, -142364, 55425, -356665, -144156, -380377, 59511, 69658, -347353, 386545, -147480, 241400, -101824, 102744, -5108, 183670, -92387, -42563, -106290, 25522, 40391, 360718, 12326, -182759, 23113, 52576, -211698, -353424, -64994, -188790, 14812, 17865, 86572, -136355, -293579, 16479, 149906, 117454, -335860, -186724, 33991, 28653, -142557, -30359, 57927, 112433, -10160, -131193, -178006, -89710, -84519, 190203, 37112]
9895A62453a95852f9988k00096f4777k253j18642A6575a04350L2103r4291a1654
9883G3092J02742B8580p89c6740o136j91861h1137C71M1864d0771l6490H095O8695
9870G6790l2929f1803j77558A11414a46615M8032K9523A30519a64559A35857b36797
9858c26930c8479F4782e4782l859B82771C9167b57031a08367m6300f4493A40228
9846g0526C8533J9844a37333c3612P319p0539k75826a2782r4362M2315j18891
9835a83720m3823j79292g5032b9883k62488A00218a68459K4855d2740A8202J37482
9824A55684b6318B16812I8880J18676a2880D7308b92978a36472A0062b97939d5310
9812a47905b1609j73528I2305a61173N8425H629b21592C9379a19255L35b8987
$$ y = [162453, -195852, -69988, -270084, -64777, -67030, -185672, 16575, -104350, -72247, -166538, -11654, 73092, 175834, 28580, 27791, -36740, -42876, -234737, -81137, 371, 42235, -40771, -77261, 8095, 76790, 43861, -61803, -239361, 111414, -146615, -98583, -69060, 130519, -164559, 135857, -236797, -326930, -38479, 64782, -54782, -58641, 282771, 39167, -257031, -108367, -154667, -64493, 140228, -70526, 38533, 58377, -137333, -33612, -26293, -96832, -372658, -12782, -107144, -64829, -183720, -227543, -406835, -75032, -29883, -292371, 100218, -168459, -143604, -42740, 18202, 155684, -26318, 216812, 98880, 217556, -12880, 47308, -292978, -136472, 10062, -297939, -45310, -147905, -21609, -195137, 92305, -161173, -102748, 8629, -221592, 39379, -119255, -118920, -28987]
9800A57227J1066J45765d1240j38030B51955B4377h7310D6848L059b63298A06305
9788a1703A07028m6261A0463P3962Q4788c30299a30475A45133d8640B2587L1451
9777E4038M1540B6836a43594E5008e966A16676c51961f2524r0298e0579I8555
9765a23762I7243b1928j03967f0830l1132o3082B44806a08304A60154b00322k30168
9754d30490J07241o0439F1983A6789O6485a26642Q021e4503n2990o2212d541k19884
9742b24425B22924A03746R6930f6815m5443l98937g8730A13986e4696A25751a18150
9730b49916c2041n85708K21639H8026R8305L7957A03079g4803K0724k64709a6122
9718g4250I6620N3085h465o4774m3067N6708m1425B22601F0345a35862n8165A27388
$$ y = [157227, 168293, 314058, -41240, -179270, 251955, 24377, -87310, 46848, 49907, -263298, 106305, -11703, 107028, 60767, 10463, 84425, 169213, -330299, -130475, 145133, -48640, 22587, 54038, 95578, 26836, -143594, 55008, -5966, 116676, -351961, -62524, -152822, -50579, 98555, -123762, 97243, -21928, -125895, -60830, -91962, -155044, 244806, -108304, 160154, -200322, -430490, -323249, -383688, 61983, 16789, 83274, -126642, -118621, -54503, -107493, -169705, -4541, -224425, 222924, 103746, 200676, -66815, -112258, -511195, -78730, 113986, -54696, 125751, -118150, -249916, -32041, -617749, -396110, 88026, 186331, 224288, 103079, -74803, -54079, -318788, -16122, -74250, 96620, 149705, -8465, -73239, -116306, -59598, -101023, 222601, 60345, -135862, -194027, 127388]
9705b60080d1290l55251B1264b34842l56273H317b0088D4639P6356b17881j72216
9694c90097a83847f0562C1901a09033A28364b0048H7597e9010j29501A30588f2842
9682C8980c46945j60375f8751O562r8154E5137i7325a7314l05993b2326j46186
9671a68512j10454G6959a64660o3517M5804j6821f5760B8966J57544g0403C80388
9659B790b20627R6022j27997R8603j50002b6799k35693A0469a18931E4052a0634
9647h4174m1761N8071A60824l4706L13010A8133d50568I9849d72368a66055A41749
9635b26831F8182c49433L6255B86950a21422c3513l12720A85945F5859J30063
9625A95922g6294k07842B89179C1678K8945g3513o3389f7420k35562C31066A23197
$$ y = [-260080, -41290, -396541, 21264, -234842, -591115, 8317, -20088, 44639, 120995, -217881, -390097, -183847, -60562, 31901, -109033, 128364, -20048, 87597, -59010, -188511, 130588, -62842, 38980, -346945, -507320, -68751, -62189, -160343, 55137, -97325, -17314, -323307, -22326, -168512, -278966, 76959, -164660, -228177, -182373, -199194, -65760, 28966, 186510, -70403, 380388, 2790, -220627, -124605, -252602, -153999, -304001, -26799, -262492, 10469, -118931, 54052, -10634, -84174, -125935, -67864, 160824, 126118, 439128, 18133, -450568, 99849, -472368, -166055, 141749, -226831, 68182, -349433, -313178, 286950, -121422, -33513, -346233, 185945, 65859, 195922, -76294, -284136, 289179, 31678, 60623, -73513, -136902, -67420, -302982, 331066, 123197]
9613a63739c8186k2691K0348A1220a31797F5927g1622l23463b0199B11051f4477
9601b66062d9884o1129A56898a16918j6767B916K2983e4695a1073j42818q9149
9590b43040B6284M5520a12914a1707j36563j6826A71916a81865e9735A20556h0977
9578a30777p0113m4732A43755h378D5258b43739g0941R344p3286B8494K39488
9567B67982h2625K5380l0601C74728a00871n1138k8150h207m21774J7905i2462
9555a01330G2457k6830M5397B7934g3890K374A45152c06671e564k34560B26687
9543C9193O7295c91938b5688j49648M3398k08856b6207l01555E4391a56640B71794
9531e268r0923R183C0513i539A78088p8437M5048m4842B1614a79540L3035I1083
$$ y = [-163739, -38186, -60877, -40529, 11220, -131797, 65927, -71622, -395085, -20199, 211051, -64477, -266062, -49884, -111013, 156898, -116918, -133685, 2916, 25899, -54695, -11073, -153891, -243040, 26284, 71804, -112914, -11707, -148270, -165096, 171916, -181865, -59735, 120556, -80977, -130777, -200890, -245622, 143755, -8378, 45258, -243739, -70941, -61597, -134883, 28494, 267982, -82625, -57245, -87846, 374728, -100871, -152009, -180159, -8207, -429981, -412076, -92462, -101330, 72457, 45627, 91024, 27934, -73890, -71516, 145152, -306671, -5564, -240124, 226687, 39193, 106488, -391938, -25688, -175336, -131938, -340794, -26207, -327762, 54391, -156640, 271794, -5268, -96191, -87008, 30513, -9539, 178088, 99651, 144699, 99857, 21614, -179540, -146505, 91083]
9518B3749J2381e21613a88369J2036k17055h0395l24620C1528b07940F3026a80151
9506b35354D08750H3612K068J14557e1389J3774j3609A73319a53270A653J07588
9495A09241P0290Q3294A12189C7165J8726M4801b76337f0222o3042C9138b03712
9483f7571A63579b01982C165a87908a3046A44202b84978a27651a2333H5292n392
9472G9900B2030M4147b1692l16990B4283N1454b48066D0344a21209B53524f7894
9460A65651a43822L1655J1109B013a15732c2139p797n8929B8292a55685M2812
9449a12873A61061G3124k1543b667I5529c10121I0087a79422K3620A16958Q6894
9438B03852q8767a45518e3995C18706n4772b0721A15142a88010A37157B5387i6002
$$ y = [23749, 36130, -521613, -188369, -176333, -393388, -80395, -405015, 31528, -207940, 63026, -180151, -235354, 408750, 83612, 85680, 200237, -51389, -37615, -51224, 173319, -153270, 1653, 109241, 179531, 262825, 112189, 37165, 55891, 100692, -276337, -60222, -123264, 39138, -203712, -67571, 163579, -201982, 3165, -187908, -13046, 144202, -284978, -127651, -12333, 85292, 79900, 22030, 66177, -21692, -338682, 24283, 75737, -248066, 40344, -121209, 253524, -67894, 165651, -143822, -112167, -101058, 2013, -115732, -32139, -39936, -98865, 28292, -155685, -112873, 161061, 73124, 51581, -2667, 95529, -310121, 90087, -179422, -155802, 116958, 203852, 115085, -145518, -53995, 318706, 263934, -20721, 115142, -188010, 137157, 25387, -96002]
9426a04145l36446K0758G5365i4585G7962J20904d1645D1639a26311A08405b71676
9414i3635d1054o2189B75085c60693a8461j07404j00280D0291b03446L4662E6583
9402b37742g871j10087a6297B9911M00014C206K10666Q7495a71850j78404e149
9390d038r1263M467E5655J05906a87839o0626F9696b10976M8050B8303N5109J182
9378H4594b13691q9128b7610O135B23707a50071b4192o0787D3041c59057a12270
9366B37838A02478a40104G8897a30687B13442e5110B7189M9744b45140A30851
9355a5475j33027m0677f6258m7006j86671A67965a74993r9548J21423f646n5893
9344f2539B01044q6864a5996A30781b9828m3146B61775b09803r2891e0937j17363
$$ y = [-104145, -440591, -419833, 75365, -94585, 77962, 198866, -41645, 41639, -126311, 108405, -271676, -93635, -41054, -103243, 275085, -360693, -18461, -125865, -226145, 40291, -203446, -168784, 56583, -237742, -7871, -117958, -16297, 29911, 429925, 3206, 213872, 301367, -171850, -350254, -5149, -4038, -95301, -90834, 55655, 161561, -187839, -248465, 69696, -210976, -162926, 28303, 83412, 84594, -213691, -302819, -27610, -21475, 223707, -150071, -24192, -84979, 43041, -359057, -112270, 237838, 102478, -140104, 78897, -130687, 213442, -55110, 27189, 76933, -245140, 130851, -15475, -148502, -189179, -66258, -113264, -299935, 167965, -174993, -274541, -153118, -6646, -62539, 201044, 114180, -15996, 130781, -29828, -72974, 261775, -209803, -302694, -50937, -168300]
9333a68300f3682k04284F7132g5623A94032d8770d548j64716P4337A58537G7773
9321a31971A94671J5450H4064g2933A57064d4347A42620d230A33238a17689A62101
9309d3519j98098d4621G7723a41554l010A15540c40968e6488b2742C35595G8788
9297h3320A5618c17872f7965n8309I2930b25744C9397i5881b0433C31655A41302
9285e7932r4626A26789i8770n6231J0485E6753b35924r7973a5511j70162f4913
9273g6190j9768A92757o9445d6734o785A00450a2601A2648E177a05354q5602L9291
9261a51665j489F2391J84595j17186b16454E2804J31321b47529J06080j09472
9251b50921C5794d11126J53878i3830j96172f9912L4392k12042f555B01800J7985
$$ y = [-168300, -63682, -267966, 67132, -75623, 194032, -48770, -4548, -169264, -94927, 158537, 77773, -131971, 194671, 210121, 84064, -72933, 157064, -44347, 142620, -4230, 133238, -117689, 162101, -43519, -241617, -44621, 77723, -141554, -144564, 115540, -340968, -56488, -22742, 335595, 78788, -83320, 15618, -317872, -67965, -126274, 92930, -225744, 39397, -95881, -20433, 331655, 141302, -57932, -152558, 126789, -98770, -155001, -144516, 56753, -235924, -333897, -15511, -185673, -64913, -76190, -95958, 192757, 123312, -46734, -53519, 100450, -12601, 12648, 5177, -105354, -190956, -151665, -153154, 62391, 246986, 129800, -216454, 52804, 184125, -247529, -141449, -250921, 35794, -411126, -257248, -93830, -290002, -69912, -35520, -247562, -6555, 201800, 219785]
9240B19785a47862k08105J22152C5244d7330M704a3798k18145o6740e3487J5613
9229c7874j26667J9576g1332l0856p3055n9298A8537K54915a02136j20367J0481
9218b12022O0200E6470b31888A55280c12622a12018A94321c6423A22065Q2708
9208B04773b36888J04458j30185f1732D7499O6591b956k04128I8044a5551B52457
9196b07669H0701j8687c5748m5423l6179E8338Q474a93849J3471h0440A1245L9702
9184E0947M6046c63274d3735j79606C18812F4523b78422i00j99146b7542j73653
9173b01195h1396F2312e9358q9070B81684I4254l2718K75920b50816q2212B33636
9161G3276g242l67092h3815j49668c8356j21369P1958f135j9864J2093E7503a12662
$$ y = [219785, -147862, -355967, -233815, 35244, -47330, -42626, -13798, -231943, -298683, -53487, -37874, -164541, -144965, -71332, -102188, -175243, -234541, 18537, 273452, -102136, -222503, -212022, -151822, 56470, -231888, 155280, -312622, -112018, 194321, -36423, 122065, 204773, -236888, -132430, -262615, -61732, 47499, 114090, -2956, -207084, 98044, -15551, 252457, -207669, 80701, 62014, -35748, -81171, -117350, 58338, 66812, -193849, -180378, -80440, 11245, 50947, 96993, -363274, -43735, -223341, 318812, 64523, -278422, -900, -200046, -27542, -201195, -81396, 62312, -59358, -148428, 281684, 94254, 61536, 337456, -250816, -333028, 233636, 73276, -7242, -374334, -83815, -233483, -38356, -159725, -87767, -6135, -25999, -13906, 57503, -112662]
9148C16271H373J78373a25090F9595k7873J1466A4261c99247A27942g7961k98179
9137c76140i605l833b380A9770J13841G536O8516b92149G5651a74185a1794j32056
9125a43850A06138c0657o8216G3950J44303c7871k6960j34791L0127n8386M5310
9114a82571g7828j4605m8551K0734l6456r8450Q8000G7793d26417f0737K0826
9103c9911k25449A82023d7936q6334I8960h2537A02782a78646k4371d2219k68593
9092c10812J06997A31814h529D5701L49343B7526R9102a08542i646E1706a41136
9080D9278a14594p024A33318b63060i6431A2116K32995a84242j14665M9729C85076
9068e2662F685J08756n3410a45357c7648k63388o1536e1260m980J3291k22605
$$ y = [316271, 8373, 186746, -125090, 69595, 41722, 53188, 14261, -399247, 127942, -77961, -376140, -9605, -13438, -2380, 19770, 133611, 7536, 76052, -292149, 75651, -174185, -11794, -143850, 106138, -30657, -98873, 73950, 218253, -37871, -64831, -199622, -169495, -227881, -182571, -77828, -92433, -140984, -120250, -156706, -255156, -167156, 77793, -426417, -60737, -39911, -265360, 182023, -47936, -134270, 98960, -82537, 102782, -178646, -203017, -42219, -310812, -203815, 131814, -8529, 45701, 395044, 27526, 126628, -108542, -9646, 51706, -141136, 49278, -114594, -121618, 133318, -263060, -96431, 12116, 245111, -184242, -298907, -249178, 385076, -52662, 6685, 115441, 62031, -145357, -37648, -301036, -362572, -51260, -56240, -42949, -265554]
9057b65554B62867a31885A4904K13849F5297a0764j72765B8845L1541A7439g9257
9045a91893b2632k7361B02204a98626B7485a10046j23289A37246d17275a19364
9034g7121k01868e5647j5931j34361A5181e8838j40173e1128A67601C7115b47323
9022D8471A4743a16029j95645J47349H2397B5924J56684o0737A8081b81223R4708
9011a86515F8435k9241d30746a05456b9899B70K5999J5112a47061A74301a28779
8999A17474C7985b22472g2112l67058i2708k5200l9583p4200G7046i9350E1375
8987g3147L4266m58761c8692m3704D5423j7011h4899F9789B389b0678E2585a63952
8974d431A39944f2740A67642J56235r2571b61845m6842c7395F1711a42969e0961
$$ y = [-265554, 262867, -131885, 14904, 228753, 65297, -10764, -183529, 28845, 60386, 17439, -79257, -191893, -22632, -49993, 202204, -198626, 27485, -110046, -233335, 137246, -417275, -119364, -77121, -278989, -55647, -71578, -205939, 15181, -58838, -199011, -51128, 167601, 37115, -247323, 48471, 14743, -116029, -311674, -164325, 82397, 25924, 182608, 121871, 18081, -281223, -186515, 68435, 39194, -430746, -105456, -29899, 270, 26269, 41381, -147061, 174301, -128779, 117474, 37985, -222472, -72112, -439170, -92708, -117908, -157491, -231691, 77046, -99350, 51375, -73147, -38881, -497642, -38692, -82396, 45423, 28412, -84899, 69789, 2389, -20678, 52585, -163952, -4431, 139944, -62740, 167642, 323877, 231306, -261845, -308687, -37395, 61711, -142969, -50961]
8962B37796b10091J872k97426A51761F2132j2768c2949A76591f4767C8876a16219
8950b36983C8112J64189b61223f475k76087f6252K1782C4152J18590K2459f899
8938A86407c21050A56941R2872J99254B21059J89423A92248a78772B07059J28344
8928C35403A12454K32300K58053k93605J120083K699007J5619643r432006B540156
8918H98396m33829J30352B51150B1667q82b31858e7098l7534m9884C41572J41169
8907D82741n7552f0242j6582k07229H7432a15709F0574g4320E1897R5543b39536
8895B17454b34008q425B27994G6383J27314G1967f3599o460K9168i743l79038
8884c88781h8048k819H185K19477C5103a11318q8817m1091e8543j06158A37669
$$ y = [237796, -210091, -208219, -505645, 151761, 62132, 49364, -32949, 176591, -64767, 38876, -116219, -236983, 38112, 202301, -261223, -6475, -282562, -66252, -44470, 34152, 152742, 175201, -6899, 186407, -321050, 156941, 249813, 449067, 221059, 410482, 192248, -178772, 207059, 335403, 112454, 344754, 602807, 309202, 1429285, 4128292, 19747935, 10315929, 2540156, 898396, 464567, 594919, 251150, 21667, 20785, -231858, -57098, -94632, -144516, 341572, 482741, 425189, -60242, -76824, -284053, 87432, -115709, 60574, -74320, 51897, 147440, -239536, 217454, -234008, -242433, 227994, 76383, 203697, 71967, -63599, -70059, -40891, -9743, -388781, -88048, -90867, 8185, 227662, 35103, -111318, -200135, -241226, -58543, -164701, 137669]
8872b25549B53934j13542b41681I4143c34929a15914k3004a4433j75648A11469
8861b50314O8823A32498d31601E3680J8548b96377j2136m9677J76562o4450j4491
8850b60569l6577j19649F5838a56855E5854b36410K1684L4574l577b489j34691
$$ y = [-225549, 253934, 140392, -241681, 94143, -334929, -115914, -138918, -14433, -190081, 111469, -250314, -181491, 132498, -431601, 53680, 72228, -296377, -308513, -358190, -181628, -246078, -260569, -297146, -416795, 65838, -156855, 55854, -236410, -214726, -180152, -183729, -2489, -137180]
$$ [...]
##END NTUPLES=NMR SPECTRUM
##END=
