##TITLE=AC1530_ROEFFECT0008_8213984_Bq4CHfls3t
##JCAMPDX= 6.0         $$ Bruker NMR JCAMP-DX V2.0
##DATA TYPE= NMR SPECTRUM
##DATA CLASS= NTUPLES
##ORIGIN= BRUKER
##OWNER= Administrator
$$ 1.72 TOPSPIN		Version 2.1
$$ 2013-10-04 20:14:12.998 -0700  Administrator@X
$$ Compression mode = diff/dup
##.OBSERVE FREQUENCY= 400.02188249412
##.OBSERVE NUCLEUS= ^1H
##.ACQUISITION MODE= SIMULTANEOUS (DQD)
##.ACQUISITION SCHEME= undefined
##.AVERAGES= 64
##.DIGITISER RES= 22
##SPECTROMETER/DATA SYSTEM= spect
##.PULSE SEQUENCE= noesygpps1d.comp
##.SOLVENT NAME= COFFEE_meoh
##.SHIFT REFERENCE= INTERNAL, COFFEE_meoh, 1, 14.96077
##AUDIT TRAIL= $$ (NUMBER, WHEN, WHO, WHERE, PROCESS, VERSION, WHAT)
$$ ##TITLE= Audit trail, TOPSPIN		Version 2.1
$$ ##JCAMPDX= 5.01
$$ ##ORIGIN= Bruker BioSpin GmbH
$$ ##OWNER= Administrator
$$ $$ E:\/data/COFFEE/nmr/AC1530_ROEFFECT0008_8213984_Bq4CHfls3t/12/pdata/1/auditp.txt
$$ ##AUDIT TRAIL=  $$ (NUMBER, WHEN, WHO, WHERE, PROCESS, VERSION, WHAT)
(   1,<2013-10-04 20:14:08.388 -0700>,<Administrator>,<X>,<go>,<TOPSPIN 2.1>,
      <created by zg
	started at 2013-10-04 20:02:38.966 -0700,
	POWCHK enabled, PULCHK disabled,
       configuration hash MD5:
       C8 4E 4E 5D D3 5C D8 9E 9F 52 82 E0 59 8A DE 15
       data hash MD5: 64K
       AA 6E 87 2F 7D C1 4E 24 4F 59 CC 47 64 67 E8 87>)
(   2,<2013-10-04 20:14:11.154 -0700>,<Administrator>,<X>,<proc1d>,<TOPSPIN 2.1>,
      <Start of raw data processing
       efp LB = 0.3 FT_mod = 6 PKNL = 1 PHC0 = 0 PHC1 = 0 SI = 128K 
       data hash MD5: 128K
       63 4A 17 65 63 EA 6F D6 51 98 DC 29 FB 94 66 F6>)
(   3,<2013-10-04 20:14:12.060 -0700>,<Administrator>,<X>,<proc1d>,<TOPSPIN 2.1>,
      <pk PHC0 = -83.95752 PHC1 = 0 
       data hash MD5: 128K
       F8 40 47 6B EA 90 15 E9 70 9A 5C 35 5C 23 06 0D>)
(   4,<2013-10-04 20:14:12.466 -0700>,<Administrator>,<X>,<proc1d>,<TOPSPIN 2.1>,
      <abs ABSG = 1 
       data hash MD5: 128K
       61 33 6D 37 DD F9 37 5C 1C 1E 57 B5 78 A9 6C A2>)
(   5,<2013-10-04 20:14:12.544 -0700>,<Administrator>,<X>,<proc1d>,<TOPSPIN 2.1>,
      <abs ABSG = 2 
       data hash MD5: 128K
       74 8B 9F 75 B3 75 D2 F4 87 33 BB D3 10 94 14 F7>)
(   6,<2013-10-04 20:14:12.623 -0700>,<Administrator>,<X>,<proc1d>,<TOPSPIN 2.1>,
      <abs ABSG = 3 
       data hash MD5: 128K
       2C 8E 1F 87 B2 51 6B FB 6D 4E 76 51 F0 88 83 46>)
(   7,<2013-10-04 20:14:12.732 -0700>,<Administrator>,<X>,<proc1d>,<TOPSPIN 2.1>,
      <abs ABSG = 4 
       data hash MD5: 128K
       91 51 A6 F0 E7 F8 B0 1C A2 C1 4D 5C FF 31 82 63>)
(   8,<2013-10-04 20:14:12.810 -0700>,<Administrator>,<X>,<proc1d>,<TOPSPIN 2.1>,
      <abs ABSG = 5 
       data hash MD5: 128K
       19 6F 33 66 1B 4B B9 71 34 6D DE 6D F0 C5 3B 34>)
$$ ##END=
$$ 
$$ $$ hash MD5
$$ $$ 3A E3 36 E3 E8 32 14 B1 EB B4 FE 98 E3 A3 E1 6E
##$RELAX= 
##$RELAX= 
##$RELAX= 
##$RELAX= 
##$RELAX= 
##$RELAX= 
##$RELAX= 
##$RELAX= 
$$ Bruker specific parameters
$$ --------------------------
##$DU= <E:\>
##$EXPNO= 12
$$ [...]
##$TP07= 0
##$TPNAME0= <>
##$TPNAME1= <>
##$TPNAME2= <>
##$TPNAME3= <>
##$TPNAME4= <>
##$TPNAME5= <>
##$TPNAME6= <>
##$TPNAME7= <>
##$TPOAL= (0..7)
0.5 0.5 0.5 0.5 0.5 0.5 0.5 0.5
##$TPOFFS= (0..7)
0 0 0 0 0 0 0 0
##$TUNHIN= 0
##$TUNHOUT= 0
##$TUNXOUT= 0
##$USERA1= <user>
##$USERA2= <user>
##$USERA3= <user>
##$USERA4= <user>
##$USERA5= <user>
##$V9= 5
##$VALIST= <valist>
##$VCLIST= <CCCCCCCCCCCCCCC>
##$VD= 0
##$VDLIST= <DDDDDDDDDDDDDDD>
##$VPLIST= <PPPPPPPPPPPPPPP>
##$VTLIST= <TTTTTTTTTTTTTTT>
##$WBST= 2048
##$WBSW= 25
##$XGAIN= (0..3)
0 0 0 0
##$XL= 0
##$YL= 0
##$YMAX_a= 6256934
##$YMIN_a= -11824803
##$ZGOPTNS= <>
##$ZL1= 120
##$ZL2= 120
##$ZL3= 120
##$ZL4= 120
##$ABSF1= 14.96077
##$ABSF2= -5.597412
##$ABSG= 5
##$ABSL= 3
##$ALPHA= 0
##$AQORDER= 0
##$ASSFAC= 0
##$ASSFACI= 0
##$ASSFACX= 0
##$ASSWID= 0
##$AUNMP= <proc_prof1d_extract.lims>
##$AXLEFT= 0
##$AXNAME= <>
##$AXNUC= <1H>
##$AXRIGHT= 0
##$AXTYPE= 0
##$AXUNIT= <>
##$AZFE= 0.1
##$AZFW= 0.1
##$BCFW= 0
##$BC_mod= 0
##$BYTORDP= 0
##$COROFFS= 0
##$CY= 15
##$DATMOD= 1
##$DC= 0
##$DFILT= <>
##$DTYPP= 0
##$F1P= 0
##$F2P= 0
##$FCOR= 0.5
##$FTSIZE= 131072
##$FT_mod= 6
##$GAMMA= 0
##$GB= 0
##$INTBC= 1
##$INTSCL= 1
##$ISEN= 128
##$LB= 0.3
##$LEV0= 0
##$LPBIN= 0
##$MAXI= 10000
##$MC2= 0
##$MEAN= 0
##$ME_mod= 0
##$MI= 0
##$NCOEF= 0
##$NC_proc= -2
##$NLEV= 6
##$NOISF1= 0
##$NOISF2= 0
##$NSP= 0
##$NTH_PI= 0
##$NZP= 0
##$OFFSET= 14.96077
##$PC= 1
##$PHC0= -83.95752
##$PHC1= 0
##$PH_mod= 1
##$PKNL= yes
##$PPARMOD= 0
##$PPDIAG= 0
##$PPIPTYP= 0
##$PPMPNUM= 2147483647
##$PPRESOL= 1
##$PSCAL= 4
##$PSIGN= 0
##$PYNMP= <proc.py>
##$REVERSE= no
##$SF= 400.020009728886
##$SI= 131072
##$SIGF1= 0
##$SIGF2= 0
##$SINO= 400
##$SIOLD= 131072
##$SPECTYP= <>
##$SREGLST= <1H.CDCl3>
##$SSB= 0
##$STSI= 131072
##$STSR= 0
##$SW_p= 8223.68421052631
##$SYMM= 0
##$S_DEV= 0
##$TDeff= 65536
##$TDoff= 0
##$TI= <>
##$TILT= no
##$TM1= 0
##$TM2= 0
##$TOPLEV= 0
##$USERP1= <user>
##$USERP2= <user>
##$USERP3= <user>
##$USERP4= <user>
##$USERP5= <user>
##$WDW= 1
##$XDIM= 131072
##$YMAX_p= 449755593
##$YMIN_p= -14220
##$CURPLOT= <Network HP LaserJet P1505>
##$CURPRIN= <$Network HP LaserJet P1505>
##$DFORMAT= <normdp>
##$LAYOUT= <+/1D_H.xwp>
##$LFORMAT= <normlp>
##$PFORMAT= <normpl>
##$SURQMSG= 1
$$ End of Bruker specific parameters
$$ ---------------------------------
##NTUPLES= NMR SPECTRUM
##VAR_NAME=  FREQUENCY,     SPECTRUM/REAL,   SPECTRUM/IMAG
##SYMBOL=    X,             R,               I
##VAR_TYPE=  INDEPENDENT,   DEPENDENT,       DEPENDENT
##VAR_FORM=  AFFN,          ASDF,            ASDF
##VAR_DIM=   131072,        131072,          131072
##UNITS=     HZ,            ARBITRARY UNITS, ARBITRARY UNITS
##FACTOR=    0.0627417313425164, 1,          1
##FIRST=     8223.62146879497, 1497,         -62223
##LAST=      0,             3744,            -62347
##MIN=       0,             -14220,          0
##MAX=       8223.62146879497, 449755593,    0
$$ Real data points
##PAGE= N=1
##DATA TABLE= (X++(R..R)), XYDATA
$$ [...]
63931D217050J89979J61979J30146R6327O1374K5434j1183m7806q3804j18605
$$ 4217050 4407029 4569008 4699154 4795481 4856855 4882289 4871106 4823300 4739496 4620891
63921D620891j51269j80444k04746k23020k34448k39059k38185k33826k27247
$$ 4620891 4469622 4289178 4084432 3861412 3626964 3387905 3149720 2915894 2688647
63912B688647k18414k06873j92666j76390j58809j40794j23230j06766r1860p8947
$$ 2688647 2470233 2263360 2070694 1894304 1735495 1594701 1471471 1364705 1272845 1193898
63902A193898o8169n8939n0495m3003l7360l3618l0417k6508k2212j8708j6543
$$ 1193898 1125729 1066790 1016295 973292 935932 902314 871897 845389 823177 804469 787926
63891G87926j5520j5504j6336j7263j7454j6999j6612j6395j5688j4137j2099
$$ 787926 772406 756902 740566 723303 705849 688850 672238 655843 640155 626018 613919
63880F13919r904p535n183l330j902j12K463N241P479R222J0939J2743J4454J6093
$$ 613919 604015 596480 591297 587967 586065 585953 588416 593657 601136 610358 621297 634040 648494 664587
63866F64587J7717J8983J9444J9138J8533J7939J7336J6606J5612J4159J2213
$$ 664587 682304 701287 720731 739869 758402 776341 793677 810283 825895 840054 852267
63855H52267J0030P845N516K815j20k938n532q024j0420j2638j4772j6875j8603
$$ 852267 862297 870142 875658 878473 878353 875415 869883 861859 851439 838801 824029 807154 788551
63842G88551j9522j9870k0489k1842k3494k4757k5483k5941k6199k6010k5199
$$ 788551 769029 749159 728670 706828 683334 658577 633094 607153 580954 554944 529745
63831E29745k3874k2297k0743j9429j8374j7360j6134j4669j3147j1754j0609
$$ 529745 505871 483574 462831 443402 425028 407668 391534 376865 363718 351964 341355
63820C41355r788r246q773q133p290o384n583m994m666m486m147l383k335j519
$$ 341355 331567 322321 313548 305415 298125 291741 286158 281164 276498 272012 267865 264482 262147 260628
63806B60628j344j658j844j452p07k93n92j221j497j292j134j438j969k265k284
$$ 260628 259284 257626 255782 254330 253623 253330 252738 251517 250020 248728 247594 246156 244187 241922 239638
63791B39638k343k577k795k784k441j756r86o94j169j832j756q77j77l92j076
$$ 239638 237295 234718 231923 229139 226698 224942 223956 223262 222093 220261 218505 217628 217451 217059 215983
63776B15983j301q66l36j95m46q74j195j022k47N50N67k00q89q05j67M12P06Q43
$$ 215983 214682 213816 213480 213285 212839 211965 210770 209748 209501 210051 210618 210418 209529 208724 208557 208969 209675 210518
63758B10518P54K05o99j384j339o27K07O11M46j6l36k27L36J126J750J839J347
$$ 210518 211272 211477 210778 209394 208055 207428 207635 208246 208692 208676 208340 208113 208449 209575 211325 213164 214511
63741B14511O44K62N05J314K389L279L538L060K249J590J213J061J283J976K663
$$ 214511 215155 215417 215922 217236 219625 222904 226442 229502 231751 233341 234554 235615 236898 238874 241537
63726B41537K630J991J716K311L078L201L000L343M222M741M477L935L489K730
$$ 241537 244167 246158 247874 250185 253263 256464 259464 262807 267029 271770 276247 280182 283671 286401
63712B86401J331j21q18q90j187k064k996l406l340l068k550j673p65m21p12r34
$$ 286401 287732 287611 286793 285903 284716 282652 279656 276250 272910 269842 267292 265619 264854 264433 263721 262787
63696B62787l77Q77K091K792L179L586L834L475K575J880K021K804L429L320K619
$$ 262787 262410 263287 265378 268170 271349 274935 278769 282244 284819 286699 288720 291524 294953 298273 300892
63681C00892J955J814K072K050J191k90j531j911j598j130o80n8P46J422J738
$$ 300892 302847 304661 306733 308783 309974 309684 308153 306242 304644 303514 302834 302776 303522 304944 306682
63666C06682J687J266M65m11q45p83q24j432k293k819l017l353l924m338m346
$$ 306682 308369 309635 310100 309689 308844 308061 307237 305805 303512 300693 297676 294323 290399 286061 281715
63651B81715m078l562k701j852j836k837l787l414j700J81J218J373J131Q82Q52
$$ 281715 277637 274075 271374 269522 267686 264849 261062 257648 255948 256129 257347 258720 259851 260733 261585
63636B61585J172J804K554L310M003M476M665M901N571O414O672O158N678O022
$$ 261585 262757 264561 267115 270425 274428 278904 283569 288470 294041 300455 307127 313285 318963 324985
63622C24985O988P824Q315Q868R713J0620J1407J2196J3113J4204J5696J7847
$$ 324985 331973 339797 348112 356980 366693 377313 388720 400916 414029 428233 443929 461776
63610D61776K0402K2675K4460K6348K8790L1221L2619L2714L1992L0577K7751
$$ 461776 482178 504853 529313 555661 584451 615672 648291 681005 712997 743574 771325
63599G71325K2808J6054Q662J837l636p309r068r334q995q904r375j0172j0984
$$ 771325 794133 810187 818849 820686 817050 809741 800673 791339 782344 773440 764065 753893 742909
63586G42909j1887j3365j5801j9008k2294k4935k6417k6396k4781k2097j9374
$$ 742909 731022 717657 701856 682848 660554 635619 609202 582806 558025 535928 516554
63575E16554j7308j5627j3641j1261r116p588o225m339j849O86K705M026M752
$$ 516554 499246 483619 469978 458717 449601 442013 435788 431449 429600 430286 432991 437017 441769
63562D41769N125N506O296P667R395J0949J1886J2202J2325J2669J3325J4270
$$ 441769 446894 452400 458696 466363 475758 486707 498593 510795 523120 535789 549114 563384
63550E63384J5716J7948K0895K4217K7884L2184L7021M1480M4340M4644M1637
$$ 563384 579100 597048 617943 642160 670044 702228 739249 780729 825069 869713 911350
63539I11350L4690K3978J1125j331j1249j7608k0312j9844j7168j3539j0169p972
$$ 911350 946040 970018 981143 979812 968563 950955 930643 910799 893631 880092 869923 861951
63527H61951p403q335j0285j3033j6813k1590k6482l0367l2827l4028l3991l2711
$$ 861951 854548 846213 835928 822895 806082 784492 758010 727643 694816 660788 626797 594086
63515E94086l0809k9151k7656k5414k2207j9095j6993j5467j3594j1402r609q400
$$ 594086 563277 534126 506470 481056 458849 439754 422761 407294 393700 382298 372689 364289
63503C64289p308o186n425n150m891m283l579l250l353l533l384k703j626n97
$$ 364289 356981 350795 345370 340220 335329 331046 327467 324217 320864 317331 313947 311244 309618 309021
63489C09021J4K97O38J088J242Q83N06Q21J834K696K669K064J934K813M000M307
$$ 309021 309035 309332 309970 311058 312300 313183 313689 314510 316344 319040 321709 323773 325707 328520 332520 336827
63473C36827L374J966J004O77N45J52o80j867l057l756l762l385l076k966k903
$$ 336827 340201 342167 343171 343848 344393 344545 343865 341998 338941 335185 331423 328038 324962 321996 319093
63458C19093k780k530j958r27L05J179J382J158J006J186J563J915K355L327N021
$$ 319093 316313 313783 311825 310898 311203 312382 313764 314922 315928 317114 318677 320592 322947 326274 331295
63443C31295O930Q346R268J0371J1891J3125J3491J3672J5004J7881K1491K5125
$$ 331295 338225 346571 355839 366210 378101 391226 404717 418389 433393 451274 472765 497890
63431D97890K8842L2400L4175L2092K5767J7237R407L985J054J80J354M631R320
$$ 497890 526732 559132 593307 625399 651166 668403 677810 681795 682849 683029 684383 689014 698334
63418F98334J4102J8109K1632K5594L0400L5336L9009M0307L9002L5435K9767
$$ 698334 712436 730545 752177 777771 808171 843507 882516 922823 961825 997260 1027027
63407A027027K1861J2158K314n600j0630j3244j4278j4168j3377j2796j3183j4594
$$ 1027027 1048888 1061046 1063360 1057760 1047130 1033886 1019608 1005440 992063 979267 966084 951490
63395I51490j6782j9806k3731k8114l2211l5488l7525l7784l6074l3117l0096
$$ 951490 934708 914902 891171 863057 830846 795358 757833 720049 683975 650858 620762
63384F20762k7652k5634k3620k1280j8389j5005j1602q663o267m324k904j900
$$ 620762 593110 567476 543856 522576 504187 489182 477580 468917 462650 458326 455422 453522
63372D53522o98J243L692O063Q185J0051J1202J1306J1147J2055J4294J6963J9506
$$ 453522 452824 454067 457759 463822 472007 482058 493260 504566 515713 527768 542062 559025 578531
63359E78531K2313K5595K8724L1166L3220L5303L7234L8654L9417L9052L6612
$$ 578531 600844 626439 655163 686329 719549 754852 792086 830740 870157 909209 945821
63348I45821L1753K5305J8176J0419K135n412j0666j3447j4763j5245j4760j3589
$$ 945821 977574 1002879 1021055 1031474 1033609 1028197 1017531 1004084 989321 974076 959316 945727
63336I45727j2857j3525j5621j8738k2640k6976l0904l3461l4235l3443l1586
$$ 945727 932870 919345 903724 884986 862346 835370 804466 771005 736770 703327 671741
63325F71741k9133k6355k3281j9866j6222j2541q850n017j163J925K861M33n250
$$ 671741 642608 616253 592972 573106 556884 544343 535493 530476 529313 531238 534099 534532 529282
63312E29282j2295j8105k1169k1685k0521j8250j5429j3014j1607j0667r229p264
$$ 529282 516987 498882 477713 456028 435507 417257 401828 388814 377207 366540 357311 350047
63300C50047n660m922m605m093l288k407j698j487j921k549k648k172j825k004
$$ 350047 344387 339465 334860 330767 327479 325072 323374 321887 319966 317417 314769 312597 310772 308768
63286C08768k257k136j981k320k941l095k438j276j11O41O58j2p56q98m59k4J15
$$ 308768 306511 304375 302394 300074 297133 294038 291600 290324 290213 290854 291512 291500 290744 289846 289387 289363 289478
63269B89478K43N79Q74R15J053J786K944L655L295K179J257J259K158L319M007
$$ 289478 289721 290300 291174 292089 293142 294928 297872 301527 304822 307001 308258 309517 311675 314994 319001
63254C19001L887L230K706K845L656M738N691O333O654O752O852P183P777Q541
$$ 319001 322888 326118 328824 331669 335325 340063 345754 352087 358741 365493 372345 379528 387305 395846
63240C95846R526J0947J2794J4671J6159J7216J8093J8953J9826K0720K1586K2214
$$ 395846 405372 416319 429113 443784 459943 477159 495252 514205 534031 554751 576337 598551
63228E98551K2441K2419K2471K2691K2797K2487K1745K0883K0333K0352K0875
$$ 598551 620992 643411 665882 688573 711370 733857 755602 776485 796818 817170 838045
63217H38045K1678K2650K3674K4149K3104K0157J6110J2092Q225L649k101q347
$$ 838045 859723 882373 906047 930196 953300 973457 989567 1001659 1009884 1013533 1011432 1003085
63205A003085j4075j8958k3238k6938k9695l1222l1648l1307l0402k8829k6267
$$ 1003085 989010 970052 946814 919876 890181 858959 827311 796004 765602 736773 710506
63194G10506k2568j8166j3893j0246p040l922r68J562L872O516R558J2317J4153
$$ 710506 687938 669772 655879 645633 638593 634671 633703 635265 639137 645653 655211 667528 681681
63181F81681J5196J6005J6711J6975J6748J6623J7125J7925J8154J7500J6571
$$ 681681 696877 712882 729593 746568 763316 779939 797064 814989 833143 850643 867214
63170H67214J6073J5895J5265J3690J1320Q487N175J276k916o836j0355j4107
$$ 867214 883287 899182 914447 928137 939457 947944 953119 954395 951479 944643 934288 920181
63158I20181j8784k4150k8937l1885l2735l2124l0811k9268k7816k6547k5096
$$ 920181 901397 877247 848310 816425 783690 751566 720755 691487 663671 637124 612028
63147F12028k2892j9966j7092j4871j3077j1261r628q733q481q081p009n534m203
$$ 612028 589136 569170 552078 537207 524130 512869 503241 494508 486027 477946 470937 465403 461200
63134D61200l285k798k609k352j668p13k9L22R78K313L705M254L945L569L635
$$ 461200 457915 455117 452508 450156 448488 447775 447746 448068 449046 451359 455064 459318 463263 466832 470467
63119D70467L921M064M087M181M294M183L775L315L148L382L740L849L647L416
$$ 470467 474388 478452 482539 486720 491014 495197 498972 502287 505435 508817 512557 516406 520053 523469
63105E23469L320L144K586J630N06n01j054r00k67J55Rk73j77Q0l3l26r5O85J183
$$ 523469 526789 529933 532519 534149 534655 534154 533100 532200 531933 532088 532097 531824 531647 531727 531694 531368 531273 531958 533141
63086E33141R35N02M79O00M04K75R55K329L453L802L860M320N316O560P792Q780
$$ 533141 534076 534578 535057 535657 536061 536336 537291 539620 543073 546875 550735 555055 560371 566931 574723 583503
63070E83503R319R463R606J0058J0775J1607J2582J3718J4818J5753J6835J8567
$$ 583503 592822 602285 611891 621949 632724 644331 656913 670631 685449 701202 718037 736604
63058G36604K1110K4152K7257L0140L2704L5160L8025M1677M5783M9410N1854
$$ 736604 757714 781866 809123 839263 871967 907127 945152 986829 1032612 1082022 1133876
63047A133876N3209N4022N4591N4851N4744N4321N3547N2283N0709M9469M9151
$$ 1133876 1187085 1241107 1295698 1350549 1405293 1459614 1513161 1565444 1616153 1665622 1714773
63036A714773M9711N0595N1354N1890N2082N1432M9242M4954L8331K9491J8898
$$ 1714773 1764484 1815079 1866433 1918323 1970405 2021837 2071079 2116033 2154364 2183855 2202753
63025B202753P163n301j8264l1208m3224n3541o1954o8375p2375p3665p2755p0490
$$ 2202753 2209916 2204615 2186351 2155143 2111919 2058378 1996424 1928049 1855674 1782009 1709254 1638764
63013A638764o6997o1796n5021m7741m0788l3950k6775j9454j2406n580J169P418
$$ 1638764 1571767 1509971 1454950 1407209 1366421 1332471 1305696 1286242 1273836 1268256 1269425 1276843
63001A276843J2678J7168K1296K4707K6737K7713K8709K9936L0450K9851K9171
$$ 1276843 1289521 1306689 1327985 1352692 1379429 1407142 1435851 1465787 1496237 1526088 1555259
62990A555259K9418L0031K9701K8225K6557K5174K3281J9840J4707Q493J732n479
$$ 1555259 1584677 1614708 1644409 1672634 1699191 1724365 1747646 1767486 1782193 1790686 1792418 1786939
62978A786939j3281k1744l0702l9640m7713n4011n8022n9963o0571o0347n9082
$$ 1786939 1773658 1751914 1721212 1681572 1633859 1579848 1521826 1461863 1401292 1340945 1281863
62967A281863n6327n2281m7829m3656l9751l5894l2187k8839k5815k3137k1165
$$ 1281863 1225536 1173255 1125426 1081770 1042019 1006125 973938 945099 919284 896147 874982
62956H74982k0127j9657j9197j8665j8220j7584j6314j4745j3952j4457j5457
$$ 874982 854855 835198 816001 797336 779116 761532 745218 730473 716521 702064 686607
62945F86607j5691j4825j3605j2876j2725j2581j1880j0570r098p992p411p058
$$ 686607 670916 656091 642486 629610 616885 604304 592424 581854 572756 564764 557353 550295
62933E50295o467n405m146l289l195l471l276k276j050l50k42k21l0K00L87O33
$$ 550295 543828 538423 534277 530988 527793 524322 521046 518770 517720 517370 517128 516907 516877 517077 517464 518097
62917E18097P72L90n58j507j945k008k108k301k383k410k676l175l520l477l285
$$ 518097 518869 519259 518701 517194 515249 513241 511133 508832 506449 504039 501363 498188 494668 491191 487906
62902D87906l261l377l464l532l582l205j959j55J148J240N60P2J34M02N72P06
$$ 487906 484645 481268 477804 474272 470690 467485 465526 465371 466519 467759 468319 468391 468525 468927 469499 470205
62886D70205Q47Q08M73r1p71j299j079K35J938K754K294J370O63o2r63j318n67
$$ 470205 471052 471860 472333 472242 471471 470172 469093 469328 471266 474020 476314 477684 478347 478285 477322 476004 475437
62869D75437M92N94l07j180j478j578j738j695j348r50n49K3M55J84n19o34J48
$$ 475437 475929 476523 476216 475036 473558 471980 470242 468547 467199 466249 465700 465723 466178 466362 465843 465209 465357
62852D65357Q83Q03M25O48J406J923J801J255O29K42L83Q96J077M46o33j500k017
$$ 465357 466240 467043 467468 468116 469522 471445 473246 474501 475130 475372 475755 476651 477728 478174 477541 476041 474024
62835D74024k380k517k207j604j060o15j57J80K69M39J016J610J539R34P25J372
$$ 474024 471644 469127 466920 465316 464256 463641 463484 463664 463933 464372 465388 466998 468537 469471 470196 471568
62819D71568K245K467J946J279J052J415K129K725K860K686K732L325M224M935
$$ 471568 473813 476280 478226 479505 480557 481972 484101 486826 489686 492372 495104 498429 502653 507588
62805E07588N247N417N836O596P352P663P504P346P650Q478R723J1351J3203J4776
$$ 507588 512835 518252 524088 530684 538036 545699 553203 560549 568199 576677 586400 597751 610954 625730
62791F25730J5677J6208J7151J9034K1882K5528K9693L3931L7953M2097M6982
$$ 625730 641407 657615 674766 693800 715682 741210 770903 804834 842787 884884 931866
62780I31866N2668N8636O4615P0819P7184Q2947Q7424R0686R2928R3532R1399
$$ 931866 984534 1043170 1107785 1178604 1255788 1338735 1426159 1516845 1609773 1703305 1794704
62769A794704Q6085P8033O7709N5132M0433K4359P837q683k5010m0490n3982o4617
$$ 1794704 1880789 1958822 2026531 2081663 2122096 2146455 2154292 2145609 2120599 2080109 2026127 1961510
62757A961510p2443p8167q2468q5594q7385q7476q5603q2000p7466p2808o8217
$$ 1961510 1889067 1810900 1728432 1642838 1555453 1467977 1382374 1300374 1222908 1150100 1081883
62746A081883o3361n8104n2814m7895m3382l9229l5632l2668k9826k6472k2722
$$ 1081883 1018522 960418 907604 859709 816327 777098 741466 708798 678972 652500 629778
62735F29778j9407j6989j5002j2832j0682r318q956q862q068o307m106k193r01
$$ 629778 610371 593382 578380 565548 554866 545548 536592 527730 519662 513355 509249 507056 506155
62722E06155o2O76J428K004K206K183K356L004M068N428P148R294J1626J3746
$$ 506155 506093 506769 508197 510201 512407 514590 516946 519950 524018 529446 536594 545888 557514 571260
62708E71260J5626J7661K0061K2474K4566K6791L0090L4751L9956M4723M8899
$$ 571260 586886 604547 624608 647082 671648 698439 728529 763280 803236 847959 896858
62697H96858N2914N6794O0092O2717O5237O7980P0203P0678O8896O5264O0073
$$ 896858 949772 1006566 1066658 1129375 1194612 1262592 1332795 1403473 1472369 1537633 1597706
62686A597706N2917M3383L1819J9019N425q719k2629l5120m5644n4568o2120o7688
$$ 1597706 1650623 1694006 1725825 1744844 1750269 1741550 1718921 1683801 1638157 1583589 1521469 1453781
62674A453781p0622p1271p0598o9126o6833o3823o0391n6533n2088m7379m2990
$$ 1453781 1383159 1311888 1241290 1172164 1105331 1041508 981117 924584 872496 825117 782127
62663G82127l8943l4876l1023k8115k6011k3505k0063j6826j5074j4383j3359
$$ 782127 743184 708308 677285 649170 623159 599654 579591 562765 547691 533308 519949
62652E19949j1665j0205r504r042q365p828p835q085p989p336o189m629k965j828
$$ 519949 508284 498079 488575 479533 471168 463340 455505 447420 439431 432095 425906 421277 418312 416484
62638D16484j557j750j701j119j84Q45J719K076J579L00j211k265k464j950j261
$$ 416484 414927 413177 411476 410357 410173 411018 412737 414813 416392 416692 415481 413216 410752 408802 407541
62623D07541q44o52l35J99O63Q55R63J287J886K649L522M487N451O311P076P794
$$ 407541 406697 406045 405710 405909 406572 407427 408390 409677 411563 414212 417734 422221 427672 433983 441059 448853
62607D48853Q500R284J0197J1050J1540J1745J2231J3466J5294J7288J9365K1810
$$ 448853 457353 466637 476834 487884 499424 511169 523400 536866 552160 569448 588813 610623
62595F10623K4783K8165L1802L5549L9049M1809M3556M4336M4162M2861M0288
$$ 610623 635406 663571 695373 730922 769971 811780 855336 899672 943834 986695 1026983
62584A026983L6431L1172K4317J6048P145j542r719j7488k4763l1101l6107l9666
$$ 1026983 1063414 1094586 1118903 1134951 1142096 1140554 1130835 1113347 1088584 1057483 1021376 981710
62572I81710m1797m2539m2103m0888l9240l7298l5086l2604k9810k6755k3760
$$ 981710 939913 897374 855271 814383 775143 737845 702759 670155 640345 613590 589830
62561E89830k1237j9246j7454j5612j3778j1934r848p584n802n115n296n499n186
$$ 589830 568593 549347 531893 516281 502503 490569 480721 473137 467335 462220 456924 451425 446239
62548D46239m474l714l029k290j233K32J627K061J172k37r61o57J02P82J233J248
$$ 446239 441765 438051 435022 432732 431499 431731 433358 435419 436591 436354 435393 434736 434838 435620 436853 438101
62532D38101N84m04q54m33L69J103J947L193M793O707R051J1560J3574J4952J6364
$$ 438101 438685 438281 437427 436994 437363 438466 440413 443606 448399 455106 464157 475717 489291 504243 520607
62517E20607J8263K0288K2165K4471K7710L1318L4367L6808L9112M1176M2436
$$ 520607 538870 559158 581323 605794 633504 664822 699189 735997 775109 816285 858721
62506H58721M2785M2340M0625L6980L1715K5862J9792J3061N702j315p180j1914
$$ 858721 901506 943846 984471 1021451 1053166 1079028 1098820 1111881 1117583 1116268 1109088 1097174
62494A097174j5715j8401j9896k0455k0002j7968j4173r308m106J356P133J2818
$$ 1097174 1081459 1063058 1043162 1022707 1002705 984737 970564 961256 957150 958506 965639 978457
62482I78457J8070K3237K8767L4268L8850M2242M4892M6885M7306M4946L9445
$$ 978457 996527 1019764 1048531 1082799 1121649 1163891 1208783 1255668 1302974 1347920 1387365
62471A387365L1559K2460J3012L731n021j3322k1985l1862m2403n1540n7566o0697
$$ 1387365 1418924 1441384 1454396 1458127 1453106 1439784 1417799 1385937 1343534 1291994 1234428 1173731
62459A173731o2182o2454o1119n8408n5275n1962m7730m2375l6921l2172k7548
$$ 1173731 1111549 1049095 987976 929568 874293 822331 774601 732226 695305 663133 635585
62448F35585k2142j6275j1185p673n699m844m446l604j810M91K472L851M870N665
$$ 635585 613443 597168 585983 578310 572611 567767 563321 559717 557907 558398 560870 564721 569591 575256
62434E75256O176O387O255N556M279K848J480l58l246o771r802j1691j2696j3330
$$ 575256 581432 587819 594074 599630 603909 606757 608237 607879 604633 597862 588060 576369 563673 550343
62420E50343j3781j3972j3728j2838j1358r772q563p684o818n964n382n070m758
$$ 550343 536562 522590 508862 496024 484666 474894 466331 458647 451829 445865 440483 435413 430655
62407D30655m375m071l861l573l148k655k024j223n62m63q41j083p17K01J307
$$ 430655 426280 422209 418348 414775 411627 408972 406948 405725 405163 404700 403859 402776 402059 402260 403567
62392D03567K247K752K718K293J709J035L49mL30J236K218K971L634M411N191
$$ 403567 405814 408566 411284 413577 415286 416321 416670 416666 416996 418232 420450 423421 427055 431466 436657
62377D36657N707N929O206O948Q093Q991R031Q401P946Q218R064J0221J1771J3700
$$ 436657 442364 448293 454499 461447 469540 478531 487562 495963 503909 512127 521191 531412 543183 556883
62363E56883J5585J7189J8974K1471K4511K7720L1391L6130M1732M7151N1596
$$ 556883 572468 589657 608631 630102 654613 682333 713724 749854 791586 838737 890333
62352H90333N5057N7705N9293N9314N7290N2828M5870L7015K7236J7268P536j474
$$ 890333 945390 1003095 1062388 1121702 1178992 1231820 1277690 1314705 1341941 1359209 1366745 1365271
62340A365271r317j6077k2262k8079l3227l7335m0253m1888m2248m1633m0334
$$ 1365271 1355954 1339877 1317615 1289536 1256309 1218974 1178721 1136833 1094585 1052952 1012618
62329A012618l8170l4856l0750k6665k2887j9108j5438j2755j1713j2007j2962
$$ 1012618 974448 939592 908842 882177 859290 840182 824744 811989 800276 788269 775307
62318G75307j4232j5580j6615j7295j8203j9718k1195k1650k1010k0117j9489
$$ 775307 761075 745495 728880 711585 693382 673664 652469 630819 609809 589692 570203
62307E70203j8671j6980j4519j2147j0542r525q410o875n261l948k799j529l62
$$ 570203 551532 534552 520033 507886 497344 487819 479409 472534 467273 463325 460526 458997 458635
62294D58635K31K74L04N80Q39Q67Q73J111J580K239L070L814M142M243M709N679
$$ 458635 458866 459140 459444 460024 460863 461730 462603 463714 465294 467533 470603 474417 478559 482802 487511 493190
62278D93190O617P206P784Q558R102R139R232R944J0884J1375J1729J2920J5047
$$ 493190 499807 507013 514797 523355 532457 541596 550828 560772 571656 583031 594760 607680 622727
62265F22727J7027J8030J8571J9848K2394K5663K8674L0909L2699L4934L8240
$$ 622727 639754 657784 676355 696203 718597 744260 772934 803843 836542 871476 909716
62254I09716M2523M7226N1839N5864N8582N9298N7792N4203M8500M0494L0482
$$ 909716 952239 999465 1051304 1107168 1165750 1225048 1282840 1337043 1385543 1426037 1456519
62243A456519J9602R280L76p134j3803k0170k6571l3328m0697m8313n4865n8961
$$ 1456519 1476121 1485401 1485777 1478643 1464840 1444670 1418099 1384771 1344074 1295761 1240896 1181935
62231A181935o0442o0390n9592n7640n3976m9171m4401l9960l5129k9574k4121
$$ 1181935 1121493 1061103 1001511 943871 889895 840724 796323 756363 721234 691660 667539
62220F67539j9925j7347j5808j4407j2528j0220q161p044o891p075o926o181m984
$$ 667539 647614 630267 614459 600052 587524 577304 569143 562099 555208 548133 541207 535026 530042
62207E30042l834l334l594l890l378k064p00J90O92R74J038J074J478K292L142
$$ 530042 526208 522874 519280 515390 512012 509948 509248 509438 510130 511104 512142 513216 514694 516986 520128
62192E20128L917M931O205P190P572P812Q435R260R844J0228J0699J1126J1144
$$ 520128 524045 528976 535181 542371 549943 557755 566190 575450 585294 595522 606221 617347 628491
62179F28491J0786J0316R690Q746P768P187O708N637M210L859N697R243J3145
$$ 628491 639277 649593 659283 668029 675797 682984 689692 695329 699539 703398 709095 718338 731483
62166G31483J6748K0406K4482K8748L2876L6871M0728M3870M5379M4668M1694
$$ 731483 748231 768637 793119 821867 854743 891614 932342 976212 1021591 1066259 1107953
62155A107953L6571K9401K0727J1818M101j804o310j0183j3917j7787k1953k6172
$$ 1107953 1144524 1173925 1194652 1206470 1210571 1208767 1202457 1192274 1178357 1160570 1138617 1112445
62143A112445k9689l1855l2797l3096l2883l1670k9143k5697k1990j8290j4547
$$ 1112445 1082756 1050901 1018104 985008 952125 920455 891312 865615 843625 825335 810788
62132H10788j0858p524m760k652j354r96j297j649j703j726k079k481k117n26
$$ 810788 799930 792406 787646 784994 783640 782644 781347 779698 777995 776269 774190 771709 769592 769066
62118G69066J780L716M413L600J491j301l833n330n780n845n981n978n558n185
$$ 769066 770846 774562 778975 782575 784066 782765 778932 773602 767822 761977 755996 750018 744460 739275
62104G39275n834p992j1115j3989j5431j4808j2377r212o472m567l130j705j75
$$ 739275 733441 725449 714334 700345 684914 670106 657729 648517 642045 637478 634348 632643 632468
62091F32468J412K951M093M454M157L866M041M513M999N590O365P059P581Q475
$$ 632468 633880 636831 640924 645378 649535 653401 657442 661955 666954 672544 678909 685968 693549 702024
62077G02024J0197J2231J3656J4442J5399J6821J8038J8576J8874J9458K0046
$$ 702024 712221 724452 738108 752550 767949 784770 802808 821384 840258 859716 879762
62066H79762K0151K0141K0918K2759K5069K7264K9299L1274L2924L3562L2363
$$ 879762 899913 920054 940972 963731 988800 1016064 1045363 1076637 1109561 1143123 1175486
62055A175486K8735K2849J5803Q925K838k603p569j1946j5817j9785k4424k9612
$$ 1175486 1204221 1227070 1242873 1251798 1254636 1252033 1244464 1232518 1216701 1196916 1172492 1142880
62043A142880l4623l8728m1591m3302m4252m4785m4687m3258m0183l6295l2976
$$ 1142880 1108257 1069529 1027938 984636 940384 895599 850912 807654 767471 731176 698200
62032F98200l0725k8681k5823k2264j9028j6704j4910j3088j1387j0320r895r541
$$ 698200 667475 638794 612971 590707 571679 554975 540065 526977 515590 505270 495375 485834
62020D85834q844p971p318p030o981o900o470n587m637m154m046l529k154n12
$$ 485834 476990 469019 461701 454671 447690 440790 434320 428733 424096 419942 415896 412367 410213 409701
62006D09701N76J220K223L719M847M924M402M208M558M853M544L720K891K485
$$ 409701 410277 411497 413720 417439 422286 427210 431612 435820 440378 445231 449775 453495 456386 458871
61992D58871K526K562K076J076J56l29q68k089l653m536m499m541n521o869p358
$$ 458871 461397 463959 466035 467111 467267 466938 466070 463981 460328 455792 451293 446752 441231 434362 427004
61977D27004o738n859n364n049m637m346m301m021l069j796q96n28m40o71j423
$$ 427004 420266 414407 409043 403994 399357 395011 390710 386689 383620 381824 380928 380400 379960 379289 377866
61962C77866k292k446j678p09k22j33n9K9o2l15n64p09n56J69J332K275K538K478
$$ 377866 375574 373128 371450 370741 370519 370386 370327 370356 370294 369979 369415 368706 368150 368319 369651 371926 374464 376942
61944C76942K777L581M537N408O176O738P046P472Q488R954J1166J1708J1802
$$ 376942 379719 383300 387837 393245 399421 406159 413205 420677 429165 439119 450285 461993 473795
61931D73795J1701J1202J0027Q442P193O849P240P559P050N684M079K680J261
$$ 473795 485496 496698 506725 515167 522360 529209 536449 544008 551058 556742 560821 563501 564762
61918E64762n51k541m094m891n031m543l393j907o68K77J584L728O278Q375R646
$$ 564762 564211 561670 557576 552685 547654 543111 539718 537811 537143 537420 539004 542732 549010 557385 567031
61903E67031J0329J0666J0474R399P415M931K414n5k614m999o504o864o896p654
$$ 567031 577360 588026 598500 607899 615314 620245 622659 622604 619990 614991 608487 601623 594727 587073
61889E87073r075r971r501q092o788o158o113o282o219n558m434l620l942n481
$$ 587073 577998 568027 558526 550434 543646 537488 531375 525093 518874 513316 508882 505262 501320 495839
61875D95839p431q728q792p886o805o087n591m927m104l317k331p17J273K712
$$ 495839 488408 479680 470888 463002 456197 450110 444519 439592 435488 432171 429840 429123 430396 433108
61861D33108L149L164L465M012M481N076O243P866R408J0704J2076J3702J5351
$$ 433108 436257 439421 442886 446898 451379 456455 462698 470564 479972 490676 502752 516454 531805
61848E31805J6757J7854J8591J8857J8713J8427J8194J7824J6803J4661J1423
$$ 531805 548562 566416 585007 603864 622577 641004 659198 677022 693825 708486 719909
61837G19909P725M277J145k144n613q381r572r364q699q118p249n473k687O41
$$ 719909 727634 731911 733056 730912 725299 716918 707346 697982 689283 681165 673916 668443 665756 666397
61823F66397L827O365Q121R245R854R860R142P667N343K026k060o147r526j2147
$$ 666397 670224 676589 684710 693955 703809 713669 722811 730478 735821 737847 735787 729640 720114 707967
61809G07967j4336j6113j7179j7469j7246j6671j5590j3890j1793r761q277p692
$$ 707967 693631 677518 660339 642870 625624 608953 593363 579473 567680 557919 549642 541950
61797E41950p948q483q586p928o659n193m054l717m175m710m487l472k450k146
$$ 541950 534002 525519 516933 509005 502346 497153 493099 489382 485207 480497 476010 472538 470088 467942
61783D67942k536l073l281l062k641k345k315k383k384k410k577k593k021r80
$$ 467942 465406 462333 459052 455990 453349 451004 448689 446306 443922 441512 438935 436342 434321 433341
61769D33341j66n4l21l08J59O55P55N42M23N61O24K42l86n60J51J375K413K918
$$ 433341 433175 433121 432800 432492 432651 433306 434061 434603 435026 435587 436211 436453 436067 435507 435658 437033 439446 442364
61751D42364K933K496J694R33P08R88J218R10oj317k625l347l190k669k651l203
$$ 442364 445297 447793 449487 450420 451128 452116 453334 454244 454238 452921 450296 446949 443759 441090 438439 435236
61735D35236l435k722j538o70j30N27J202J333R21P25J176J700J543Q88O47J221
$$ 435236 431801 429079 427541 426871 426741 427268 428470 429803 430724 431449 432625 434325 435868 436756 437403 438624
61719D38624J945J950J268P53R81J590J836J560J245J208J145O27k57j061j603
$$ 438624 440569 442519 443787 444540 445521 447111 448947 450507 451752 452960 454105 454732 454475 453414 451811
61704D51811k094k628k940k831k594k760l459m236m550m326l929l740l822l937
$$ 451811 449717 447089 444149 441318 438724 435964 432505 428269 423719 419393 415464 411724 407902 403965
61690D03965l794l293k642k252k436l085l688l737l179k468k111k198k336k118
$$ 403965 400171 396878 394236 391984 389548 386463 382775 379038 375859 373391 371280 369082 366746 364628
61676C64628j586j157j156j400j398q21P8N67O6j154k023j739p24j56n07j023
$$ 364628 363042 361885 360729 359329 357931 357110 357188 357755 357821 356667 354644 352905 352181 352025 351518 350495
61660C50495q25j7O94J059J377J725J796J442R56P00Q61J454K168K334J611O87
$$ 350495 349670 349653 350347 351406 352783 354508 356304 357746 358702 359402 360263 361717 363885 366219 367830 368517
61644C68517N95J374K002J802J213R51J087J302J400J218N91k19n84m50o02j497
$$ 368517 369112 370486 372488 374290 375503 376454 377541 378843 380243 381461 382052 381833 381249 380799 380197 378700
61628C78700k412k412j653j029q87q66p80q59j176j503j729j906j941j718j499
$$ 378700 376288 373876 372223 371194 370307 369441 368661 367802 366626 365123 363394 361488 359547 357829 356330
61613C56330j688k227k587k407j804j228j228k096l377m005l500k672k629l330
$$ 356330 354642 352415 349828 347421 345617 344389 343161 341065 337688 333683 330183 327511 324882 321552
61599C21552l779l394k519j727j361j641k505l297l313k708k178j887j434q79
$$ 321552 317773 314379 311860 310133 308772 307131 304626 301329 298016 295308 293130 291243 289809 288930
61585B88930q50j421j775j327m94N4K78M59N90N13K42j67p28j253j397j199j103
$$ 288930 288080 286659 284884 283557 283063 283117 283395 283854 284444 284957 285199 285032 284304 283051 281654 280455 279352
61568B79352j165q77o6N96N33J62K93R87J630J839J716J369Q36L92M73J141J993
$$ 279352 278187 277310 277244 277840 278373 278535 278828 279815 281445 283284 285000 286369 287205 287597 288070 289211 291204
61551B91204K550K570K043J202M97K23J87o4n87r21o18J52P68Q45O32O31Q80R39
$$ 291204 293754 296324 298367 299569 300066 300289 300476 300412 299825 298904 298286 298438 299206 300051 300683 301314 302194 303133
61533C03133N99K86M53Q71R96Q01P39R55J070Q24M09N7k62n99r20j314j857k214
$$ 303133 303732 304018 304471 305342 306338 307139 307878 308833 309903 310727 311136 311193 310931 310332 309412 308098 306241 304027
61515C04027j983j447j386j851j916j028P2L70kj66Q6J15l96q69o25K58J103J348
$$ 304027 302044 300597 299211 297360 295444 294416 294488 294858 294856 294690 294776 294891 294495 293626 293001 293259 294362 295710
61497B95710R20J34n84r37q73n37j44J24K47M16Q51J474J921J867J306M97j77
$$ 295710 296630 296764 296180 295243 294370 293833 293689 293813 294060 294476 295327 296801 298722 300589 301895 302392 302215
61480C02215l68LN96R81J098J205J433J714K029K375K492K079J338Q55P95O97
$$ 302215 301847 301850 302446 303427 304525 305730 307163 308877 310906 313281 315773 317852 319190 320045 320840 321537
61464C21537K72p9J29O81Q82L78n44j353j736j721j493j135n56K49J020J452J468
$$ 321537 321809 321730 321859 322540 323422 323800 323256 321903 320167 318446 316953 315818 315262 315511 316531 317983 319451
61447C19451J106M04k95l33M32J081O71l62o98N1Q73Q75L62Q9L31J022K038K855
$$ 319451 320557 320961 320666 320333 320765 321846 322517 322155 321457 321508 322381 323256 323618 323707 324038 325060 327098 329953
61429C29953K695J571N55M53P66N68j62p56r03p86n01l6M09O31P75J055J277J136
$$ 329953 332648 334219 334774 335227 335993 336561 336399 335643 334740 333954 333453 333417 333826 334457 335232 336287 337564 338700
61411C38700P85P20J184J896K269J793N12q11j406j403j480j657j325n89n14j444
$$ 338700 339485 340205 341389 343285 345554 347347 347859 347048 345642 344239 342759 341102 339777 339188 338674 337230
61395C37230k144j457O1J051J199J152J180J015P00N02K47k86n92mJ149J832J745
$$ 337230 335086 333629 333690 334741 335940 337092 338272 339287 339987 340489 340736 340450 339858 339854 341003 342835 344580
61378C44580J491J380R99J31p37j040p02O7J002J800K308K689K997K812J857P30
$$ 344580 346071 347451 348450 348581 347844 346804 346102 346169 347171 348971 351279 353968 356965 359777 361634 362364
61362C62364L57Q63J593K107K463K694K700K633K724K866K939L352M503N949O820
$$ 362364 362721 363584 365177 367284 369747 372441 375141 377774 380498 383364 386303 389655 394158 400107 406927
61347D06927O927O610N782M252K887L045M497N167L640J055k84M46K061L038K992
$$ 406927 413854 420464 426246 430498 433385 436430 440927 446094 449734 450789 450505 450951 453012 456050 459042
61332D59042K516K169J813Q95o48k060k599k434k243k194j928j452j211j237r64
$$ 459042 461558 463727 465540 466435 465787 463727 461128 458694 456451 454257 452329 450877 449666 448429 447465
61317D47465j90N32Q21J161K225L922N466O232O261O177O786Q445J0728J2831
$$ 447465 447275 447807 448628 449789 452014 455936 461402 467634 473895 480072 486858 495303 506031 518862
61303E18862J4338J5363J6057J6323J6011J4935J2779R438N551K280K55r77k398
$$ 518862 533200 548563 564620 580943 596954 611889 624668 634106 639657 641937 642192 641215 638817
61290F38817m539o977q710r137q764q649r094r420r214q961q982q655p537o426
$$ 638817 634278 627301 618591 609454 600690 592041 582947 573527 564313 555352 546370 537715 530178 523752
61276E23752o174o100m912k789j157n47j97K94M52K77N52J326J543P94J88P27
$$ 523752 517578 511478 506566 503777 502620 502073 501876 502170 502622 502899 503451 504777 506320 507114 507302 508029
61260E08029J915K788L355M159N145N855O110N869M918L390K017J327J064Q63
$$ 508029 509944 512732 516087 520246 525391 531246 537356 543225 548143 551533 553550 554877 555941 556804
61246E56804Q53J131J270R80O32O43P94O67J98o03j787k951l281k668j988j775
$$ 556804 557657 558788 560058 561038 561670 562313 563107 563774 563972 563369 561582 558631 555350 552682 550694 548919
61230E48919j392k16J183J933K191K769L929N365O847Q023Q248P539P138Q029
$$ 548919 547527 547311 548494 550427 552618 555387 559316 564681 571528 579551 587799 595338 602476 610505
61216F10505R348R435Q241P405P941R009R263Q430P142N962N005M144L240K419
$$ 610505 619853 629288 637529 644934 652875 661884 671147 679577 686719 692681 697686 701830 705070 707489
61202G07489K170K855M055M869M971N040N966P881J0067J1662J2372J2589J2852
$$ 707489 709659 712514 716569 721438 726409 731449 737415 745296 755363 767025 779397 791986 804838
61189H04838J3133J2767J1121Q273N000K233M70n28j428k503l258l273l175m079
$$ 804838 817971 830738 841859 850132 855132 857365 857835 857307 855879 853376 850118 846845 843670 839591
61175H39591o025p768q285p832p258p032p273p988q785r014q703q719r582j0722
$$ 839591 833566 825798 817513 809681 802423 795391 788118 780130 771345 762331 753628 744909 735327 724605
61161G24605j1427j1843j2356j2696j2461j1980j1817j1719j0948r403p737o454
$$ 724605 713178 701335 688979 676283 663822 651842 640025 628306 617358 607955 600218 593764
61149E93764n461m495l455k433j638j213j040j060j764l628n935p134o789o127
$$ 593764 588303 583808 580353 577920 576282 575069 574029 572969 571205 567577 561642 554508 547719 541592
61135E41592o004n499l525q02J102K011K890L905M311M179M706O463Q617J0258
$$ 541592 535588 530089 526564 525762 526864 528875 531765 535670 539981 544160 548866 555329 563946 574204
61121E74204J1484J2705J3806J4597J5510J7165J9549K1991K3807K4843K5443
$$ 574204 585688 598393 612199 626796 642306 659471 679020 701011 724818 749661 775104
61110G75104K5968K6234K5753K4625K3761K3745K3903K3110K1198J8934J6722
$$ 775104 801072 827306 853059 877684 901445 925190 949093 972203 993401 1012335 1029057
61099A029057J4100J0576O421K427q13l386n902q819j1883j4511j6656j8690k0450
$$ 1029057 1043157 1053733 1060154 1062581 1061768 1058382 1052480 1043661 1031778 1017267 1000611 981921 961471
61086I61471k1249k1084k0881k1088k1022k0263j9541j9336j8671j6592j3960
$$ 961471 940222 919138 898257 877169 856147 835884 816343 797007 778336 761744 747784
61075G47784j2307j1556j0419q633p218o509n530l603j335L84J429K246L263M664
$$ 747784 735477 723921 713502 704869 697651 691142 685612 682009 680674 681058 682487 684733 687996 692660
61061F92660O193P256P758Q452R842J1243J1872J2198J3142J4429J5161J5586
$$ 692660 698853 706109 713867 722319 732161 743404 755276 767474 780616 795045 810206 825792
61049H25792J6848J9098K1383K3296K5289K7314K8670K9479L0810L3037L5369
$$ 825792 842640 861738 883121 906417 931706 959020 987690 1017169 1047979 1081016 1116385
61038A116385L7360L9580M2368M5176M7569M9844N2254N4657N7170O0172O3339
$$ 1116385 1153745 1193325 1235693 1280869 1328438 1378282 1430536 1485193 1542363 1602535 1665874
61027A665874O5685O6759O6903O6431O5697O5868O8220P2608P7993Q4350R2442
$$ 1665874 1731559 1798318 1865221 1931652 1997349 2063217 2131437 2204045 2282038 2366388 2458830
61016B458830J01707J10236J17272J24284J33633J47960J70578K04078K48454
$$ 2458830 2560537 2670773 2788045 2912329 3045962 3193922 3364500 3568578 3817032
61007C817032L02919L69421M51400N49789O64810Q01966R70571J175137J414333
$$ 3817032 4119951 4489372 4940772 5490561 6155371 6957337 7927908 9103045 10517378
60998A0517378J685677J969610K189884K205359J887662J243504M58451k04101
$$ 10517378 12203055 14172665 16362549 18567908 20455570 21699074 22157525 21953424
60990B1953424n63899n97390l84215k8083L50978N87157N05849L9736o90812j435050
$$ 21953424 21389525 20792135 20407920 20379837 20730815 21317972 21823821 21863557 21172745 19737695
60980A9737695j966033k194744k165353j976383j715822j442857j192338r79014
$$ 19737695 17771662 15576918 13411565 11435182 9719360 8276503 7084165 6105151
60972F105151q02883o58630n41749m47724l70944l07311k55766k15783j85272
$$ 6105151 5302268 4643638 4101889 3654165 3283221 2975910 2720144 2504361 2319089
60963B319089j61858j44021j29892j16952j04245r3200q4915p7960p0120o1109
$$ 2319089 2157231 2013210 1883318 1766366 1662121 1568921 1484006 1406046 1335926 1274817
60953A274817n2298m4702l8543l4116l1759l1138l1300l1344l0653k8913k6350
$$ 1274817 1222519 1177817 1139274 1105158 1073399 1042261 1010961 979617 948964 920051 893701
60942H93701k3671k1429j9639j8111j6747j5471j4384j3916j4299j4961j5129
$$ 893701 870030 848601 828962 810851 794104 778633 764249 750333 736034 721073 705944
60931G05944j4914j5005j5353j5149j4121j2908j1917j0839r547q478p733o730
$$ 705944 691030 676025 660672 645523 631402 618494 606577 595738 586191 577713 569980 563250
60919E63250n263m009l593l816m177m333l879k480p27J54j53o26m88k05k96k67
$$ 563250 557987 553978 550385 546569 542392 538059 534180 531700 530973 531127 530974 530348 529860 529655 529359 529092
60903E29092L96J108J097P11P58J112J082P57Q52J419J713J346O47j00j030k250
$$ 529092 529488 530596 531693 532404 533162 534274 535356 536113 536965 538384 540097 541443 542090 541990 540960 538710
60887E38710l676n298p030q362q771q467q125p958p662p251p227p767q336q361
$$ 538710 535034 529736 522706 514344 505573 497106 488981 481023 473361 466110 458883 451116 442780 434419
60873D34419p770o701n209l509k146j547j654k071k320j872m64J407K680K802
$$ 434419 426649 419948 414739 411230 409084 407537 405883 403812 401492 399620 399156 400563 403243 406045
60859D06045K325K117K242K110J537J139J510K447L235L464L285L034K871K792
$$ 406045 408370 410487 412729 414839 416376 417515 419025 421472 424707 428171 431456 434490 437361 440153
60845D40153K736K628K446K280K179J974J477Q41M00O5p15k141l553m169m068
$$ 440153 442889 445517 447963 450243 452422 454396 455873 456714 457114 457179 456464 454323 450770 446601 442533
60830D42533l979m229m429m194l637l029k439j941j741j855j946j786j592j675
$$ 442533 438554 434325 429896 425702 422065 419036 416597 414656 412915 411060 409114 407328 405736 404061
60816D04061j975k234k381k485k530k553k838l594m496m907m549l817l280l145
$$ 404061 402086 399852 397471 394986 392456 389903 387065 383471 378975 374068 369519 365702 362422 359277
60802C59277l199l153k901k523k186k035k193k681l300l596l200k210j137l85
$$ 359277 356078 352925 350024 347501 345315 343280 341087 338406 335106 331510 328310 326100 324963 324578
60788C24578N0L44N41O29P29R91J317J429J199Q63Q14J255J978K474K381J899
$$ 324578 324628 324972 325513 326142 326871 327862 329179 330608 331807 332670 333484 334739 336717 339191 341572 343471
60772C43471J642J970K625L141L482L948M534M783M349L443K481J547N13m91j080
$$ 343471 345113 347083 349708 352849 356331 360279 364813 369596 373945 377388 379869 381416 381929 381438 380358
60757C80358j167j072j030r13p18r20j877l069l482k773j591o47K7P30J424J821
$$ 380358 379191 378119 377089 376176 375458 374538 372661 369592 366110 363337 361746 361099 361126 361856 363280 365101
60741C65101J824J433M78j172l122m693n618o244o868p203o656n086l172j955
$$ 365101 366925 368358 368836 367664 364542 359849 354231 347987 341119 333916 327260 322174 319002 317047
60727C17047j920k506k661j955r92n90q68j294j389j046l73L60P11M91J71M19
$$ 317047 315127 312621 309960 308005 307013 306423 305555 304261 302872 301826 301453 301813 302524 303015 303186 303605
60711C03605J177J691J569J347J697K524L159L229K897K411J867J432J390J823
$$ 303605 304782 306473 308042 309389 311086 313610 316769 319998 322895 325306 327173 328605 329995 331818
60697C31818K427K860L034L024K790K233J491R14P26Q14R17Q59N97K20k6R4M18
$$ 331818 334245 337105 340139 343163 345953 348186 349677 350591 351317 352131 353048 353907 354504 354724 354698 354792 355210
60680C55210M23j13p10p42l15j22m84r51r35m10J87M18J07n78j219j527j704k083
$$ 355210 355633 355520 354810 354068 353753 353631 353147 352196 351261 350851 351038 351456 351563 350985 349766 348239 346535 344452
60662C44452k504k500k130j967k130j984j172k98oPM96J506K424K897L038K987
$$ 344452 341948 339448 337318 335351 333221 331237 330065 329767 329761 329768 330264 331770 334194 337091 340129 343116
60646C43116K839K866L148L162K376J120J52n20j562k971l754l324k432k184k622
$$ 343116 345955 348821 351969 355131 357507 358627 358779 358259 356697 353726 349972 346648 344216 342032 339410
60631C39410k914k579j928j398r67l31O09J569K004J471P2j409k010j438l80K24
$$ 339410 336496 333917 331989 330591 329624 329293 329902 331471 333475 334946 335018 333609 331599 330161 329781 330005
60615C30005J67O6M01Q33P74K25l42p32j002q79o6Q81R03j2n62Q8J210J811K114
$$ 330005 330172 330238 330639 331472 332246 332471 332129 331397 330395 329516 329450 330331 331234 331222 330660 330748 331958 333769 335883
60596C35883K753L299K863J704R48R21R88R37J245J832J825R14j05o27r87j449
$$ 335883 338636 341935 344798 346502 347450 348371 349359 350296 351541 353373 355198 356112 356007 355380 354393 352944
60580C52944j397l28J089J802J778J830K343K901L145L346L981N134O496P806
$$ 352944 351547 351219 352308 354110 355888 357718 360061 362962 366107 369453 373434 378568 385064 392870
60566C92870R076J0350J1412J1976J2066J1797J0763Q239M401O36j984l960o238
$$ 392870 401946 412296 423708 435684 447750 459547 470310 478549 482950 483586 481602 477642 471404
60553D71404q344q892p678n981m675l312j403N59J938K903L936N104O300P583
$$ 471404 463060 454168 446490 440509 435834 432522 431119 431678 433616 436519 440455 445559 451859 459442
60539D59442Q815R680J0427J1854J4082J6100J7030J7065J6636J5434J2995R622
$$ 459442 468257 477937 488364 500218 514300 530400 547430 564495 581131 596565 609560 619182
60527F19182N926K045j983n555p977r214r602r246q347p540p244p060o445n523
$$ 619182 625108 627153 625170 619615 611638 602424 592822 583576 575229 567689 560445 553385 546940 541417
60513E41417m586l405j802l79K68N56J255K268L112M240O609J0044J3240J5561
$$ 541417 536831 533426 531624 531245 531513 532069 533324 535592 538704 542944 549553 559597 572837 588398
60499E88398J7822K1002K5089K9511L3849L7729M0631M2233M2564M1596L9124
$$ 588398 606220 627222 652311 681822 715671 753400 794031 836264 878828 920424 959548
60488I59548L5200L0194K4324J7599J0271K744n126j3933k3566l2655l9615m3960
$$ 959548 994748 1024942 1049266 1066865 1077136 1079880 1074754 1060821 1037255 1004600 964985 921025
60476I21025m6277m7179m6688m4582m1023l6768l2719k9250k6121k3117k0465
$$ 921025 874748 827569 780881 736299 695276 658508 625789 596539 570418 547301 526836
60465E26836j8378j6502j4376j2205j0544r372q163o896o177o106n821m693l332
$$ 526836 508458 491956 477580 465375 454831 445459 437296 430400 424223 418117 412296 407603 404271
60452D04271k810l218l667l508k975k639k745l106l264k697j324Q8M98j99q95
$$ 404271 401461 398243 394576 391068 388093 385454 382709 379603 376339 373642 372318 372406 372904 372705 371810
60437C71810n74L64O66p3j000j348j419j723j870j146J61R60P56K8q00j748k479
$$ 371810 371236 371600 372266 372193 371193 369845 368426 366703 364833 363687 363848 364808 365564 365592 364792 363044 360565
60420C60565k159o77Q58J448J422J594J947J950J656J525J457R36K6n90n84k33
$$ 360565 358406 357729 358587 360035 361457 363051 364998 366948 368604 370129 371586 372522 372548 371958 371374 371141
60404C71141K17P69J286J533J609J763J861J632J363J597K235K640K665K744K969
$$ 371141 371358 372127 373413 374946 376555 378318 380179 381811 383174 384771 387006 389646 392311 395055 398024
60389C98024K888K428K139K230K161J607J034Q81Q54O32N99J220K126K545K388
$$ 398024 400912 403340 405479 407709 409870 411477 412511 413392 414246 414878 415477 416697 418823 421368 423756
60374D23756K286K681L409M045M222L745K791J980J836K209K417J982J014M1l40
$$ 423756 426042 428723 432132 436177 440399 444144 446935 448915 450751 452960 455377 457359 458373 458414 458074
60359D58074J47J206K193K795L341M236N384O415P254Q057Q698Q740P961O613
$$ 458074 458221 459427 461620 464415 467756 471992 477376 483791 491045 499102 507800 516540 524501 531114
60345E31114N107L653K170M37j651l827n517o397o760p073p242o727n445m162
$$ 531114 536221 539874 542044 542481 540830 537003 531486 525089 518329 511256 504014 497287 491842 487680
60331D87680l718m021m171l572k659k346k924l745m027l692l236k916k391j285
$$ 487680 483962 479941 475770 472198 469539 467193 464269 460524 456497 452805 449569 446653 444262 442977
60317D42977J79J362J961K328L019M191N612P109Q736J0531J2315J3926J5451
$$ 442977 443156 444518 446479 448807 451826 456017 461629 468738 477474 488005 500320 514246 529697
60304E29697J7036J8536J9594J9821J8691J5467R979L441k203o226r825j4375
$$ 529697 546733 565269 584863 604684 623375 638842 648821 652262 650059 643833 634008 619633
60292F19633j9370k2777k3255k1266j8152j4836j1683q920o689m917l510k450
$$ 619633 600263 577486 554231 532965 514813 499977 488294 479374 472685 467768 464258 461808
60280D61808j623p89J8L70k6q53j519j814j991k302k699k994l066k901k552k189
$$ 461808 460185 459396 459414 459784 459758 458905 457386 455572 453581 451279 448580 445586 442520 439619 437067 434878
60264D34878k045k224k531k581k195j643j396j594j851j702j166o74n19n63m93
$$ 434878 432833 430609 428078 425497 423302 421659 420263 418669 416818 415116 413950 413276 412757 412194 411701
60249D11701k20P6K15K66M90J049J791K363K539K332J847J196N77K21J45J16j4
$$ 411701 411481 411557 411772 412038 412528 413577 415368 417731 420270 422602 424449 425645 426222 426443 426588 426704 426690
60232D26690j51j50j5K80Q86J830K800L392L404K868J951J020M80L99N33Q31J586
$$ 426690 426539 426389 426374 426654 427540 429370 432170 435562 438966 441834 443785 444805 445285 445684 446217 447048 448634
60215D48634K833M018M600M715M869N259N845O632P471P878P660P389P672Q150
$$ 448634 451467 455485 460085 464800 469669 474928 480773 487405 494876 502754 510414 517803 525475 533625
60201E33625Q012P258O706O715O789O526O182N960N458M305K794J505O23j0m93
$$ 533625 541637 548895 555601 562316 569105 575631 581813 587773 593231 597536 600330 601835 602458 602448 601955
60186F01955q38j161j596k240l179m368n421o000o373p087p967q100p087n695
$$ 601955 601117 599956 598360 596120 592941 588573 583152 577152 570779 563692 555725 547625 540538 534843
60172E34843m821m366l766l124l086l680m032l420k122j015o56q85j193j241j036
$$ 534843 530022 525656 521890 518766 515680 512000 507968 504548 502426 501411 500755 499870 498677 497436 496400
60157D96400o82p3R36K084K670K202R65k13p31o17l06j07Q0N86J512K471K991
$$ 496400 495718 495645 496581 498665 501335 503537 504502 504289 503558 502941 502635 502528 502608 503194 504706 507177 510168
60140E10168L073L151L506M023M548N111N652N923N923O107O764P376P066N629
$$ 510168 513241 516392 519898 523921 528469 533580 539232 545155 551078 557185 563949 571325 578391 584020
60126E84020L783K376J633J253Q94M22m7j35N64J993L411M024L761L231K874K588
$$ 584020 587803 590179 591812 593065 593959 594381 594334 594199 594763 596756 600167 604191 607952 611183 614057 616645
60110F16645K254K164K499K708K067P09m45q69r52j279j966k903m002m867m835
$$ 616645 618899 621063 623562 626270 628337 629046 628601 627732 626780 625501 623535 620632 616630 611763 606928
60095F06928l836k804k634l166l667l833l725l097j684J4R83Q10m9r63j508j345
$$ 606928 603092 600288 597654 594488 590821 586988 583263 580166 578482 578496 579479 580289 580240 579277 577769 576424
60079E76424m13O80J129Q90N77M53J28p11j911l293m818o232p172p733q312q768
$$ 576424 576011 576691 577820 578710 579287 579740 579868 579157 577246 573953 569135 562903 555731 547998 539686 530918
60063E30918q475p413o459o254o398o181n509m649l634k441j380q08o33m72j01
$$ 530918 522443 515030 508571 502317 495919 489738 484229 479580 475946 473505 472125 471317 470684 470212 470111
60048D70111M10Q01P28J41l35J67J772L709N244O299O970P109O733O322O236O219
$$ 470111 470521 471322 472050 472191 471856 472023 473795 477504 482748 489047 496017 503126 509859 516181 522417 528636
60032E28636N874N251M565L687K351O53j016k330l095l272l207l548m665o296
$$ 528636 534510 539761 544326 548013 550364 551017 550001 547671 544576 541304 538097 534549 529884 523588
60018E23588p942r271j0043j0043r348q387p544o944o642o537o125m920l252k063
$$ 523588 515646 506375 496332 486289 476941 468554 461010 454066 447424 440887 434762 429842 426590 424527
60004D24527j714j688j577j585j736j505p26m5J09K07O29Q60N05K36P79J595J754
$$ 424527 422813 421125 419548 417963 416227 414722 413996 413951 414060 414267 414896 415756 416261 416497 417276 418871 420625
59987D20625J546J960K883L252K902K866L585M076L435K142J210Q19M35k04r39
$$ 420625 422171 424131 427014 430266 433168 436034 439619 443695 447130 449272 450482 451301 451736 451532 450593
59972D50593j689k538l396l988m153l964l545k895j877m37J091K047K117J786
$$ 450593 448904 446366 442970 438982 434829 430865 427320 424425 422548 422111 423202 425249 427366 429152
59958D29152J842K458L063L107K533J598N76j80l61r0M5l56r62j073m46M02P69
$$ 429152 430994 433452 436515 439622 442155 443753 444329 444149 443788 443698 443743 443387 442425 441352 440906 441308 442077
59941D42077N10P9j40l14p91j400j586j269j103j562k161j967p31R26K261K991
$$ 442077 442587 442666 442526 442212 441421 440021 438435 437166 436063 434501 432340 430373 429642 430568 432829 435820
59925D35820L236L308L658M587N836O699O713O047N039L619J532r14k701l015
$$ 435820 439056 442364 446022 450609 456445 463144 469857 475904 480943 484562 486094 485180 482479 479464
59911D79464k126j069n05j93L87J338K378L161L323K685J732J391J880K272J795
$$ 479464 477338 476269 475764 475571 475958 477296 479674 482835 486158 488843 490575 491966 493846 496118 497913
59896D97913J020R41J402J492J226J503K454L155L323L935N576P267P736P047
$$ 497913 498933 499874 501276 502768 503994 505497 507951 511106 514429 518364 523940 531207 538943 545990
59882E45990O187N746N707N973O356O502O353O276O327N946M783L192J494m85
$$ 545990 552177 557923 563630 569603 575959 582461 588814 595090 601417 607363 612146 615338 616832 616347
59868F16347k659m325n173n857o767p141o229m613l362k523j519m61J01K54N29
$$ 616347 613688 609363 604190 598333 591566 584425 578196 573583 570221 567698 566179 565718 565819 566073 566602
59853E66602Q70R35J101K109L915N852P626R119R494P733M182M46k272l837m240
$$ 566602 567472 568407 569508 571617 575532 581384 589010 598129 607623 615356 619538 619984 617712 613875 609635
59838F09635l228j155P66J498R40n28k572m772o547p450p261n937l907k160j428
$$ 609635 606407 605252 606018 607516 608456 607928 605356 600584 594037 586587 579326 573389 569482 567322 565894
59823E65894j444j564j794k483l362l817l931m314n043n620n913o197o359n915
$$ 565894 564450 562886 561092 558609 555247 551430 547499 543185 538142 532522 526609 520412 514053 508138
59809E08138m900l829k896j975j313j282j534j388r65q92j002n35L27M21o56j957
$$ 508138 503238 499409 496513 494538 493225 491943 490409 489021 488056 487164 486162 485627 485954 486375 485719 483762
59793D83762k562k486j905p70M25O71j03o79l22J34k82j068j001J15J345J815
$$ 483762 481200 478714 476809 476039 476464 477135 477032 476353 476031 476165 475883 474815 473814 473929 475274 477089
59777D77089J330K19q61j269r14k98K18O91J035Q93L49N5K73N21N78J048K323
$$ 477089 478419 478638 477777 476508 475594 475296 475514 476205 477240 478133 478482 478537 478810 479331 479909 480957 483280
59760D83280L646L934L220K563K737L511M126M163L974M333N534O947P836Q312
$$ 483280 486926 490860 494080 496643 499380 502891 507017 511180 515154 519487 525021 531968 539804 548116
59746E48116Q909R421R080P873O720O163N820N370N130N288N384M969M056K676
$$ 548116 557025 566446 575526 583399 590119 596282 602102 607472 612602 617890 623274 628243 632299 634975
59732F34975Q63p47j290j047j307k390l049k469j641j718k167j779p21k61r46
$$ 634975 635838 635091 633801 632754 631447 629057 626008 623539 621898 620180 618013 616234 615513 615252 614306
59717F14306k236l572m682n114m549l475k695k302j911j685k171l212l890l591
$$ 614306 612070 608498 603816 598702 594153 590678 587983 585681 583770 582085 579914 576702 572812 569221
59703E69221k573j437o41m19n81m66L47J362J717J390J236J877L025L923L984
$$ 569221 566648 565211 564570 564151 563570 563104 563451 564813 566530 567920 569156 571033 574058 577981 581965
59688E81965L065J475j50j307j919k076j749j031m34m96j174j982k592l046l462
$$ 581965 585030 586505 586355 585048 583129 581053 579304 578273 577839 577343 576169 574187 571595 568549 565087
59673E65087l857m154m241m086l861l808l897l925l919m102m352m169l319k113
$$ 565087 561230 557076 552835 548749 544888 541080 537183 533258 529339 525237 520885 516716 513397 511284
59659E11284r70j31J99L6j3P43K046K950L206L520M150M326L582K672K302J929
$$ 511284 510314 510183 510382 510418 510405 511148 513194 516144 519350 522870 527020 531346 534928 537600 539902 541831
59643E41831P34r02j913k131k305k911l786m649n183m870l559k001j102q47o28
$$ 541831 542565 541663 539750 537619 535314 532403 528617 523968 518785 513915 510356 508355 507253 506406 505778
59628E05778l51l97p24q91q99j262k106k880l034k625k130k023k434k982l113
$$ 505778 505427 505030 504306 503415 502516 501254 499148 496268 493234 490609 488479 486456 484022 481040 477927
59613D77927k809k652k918l065k563j631p44P2Q65J271J090R00J306J966K132
$$ 477927 475118 472466 469548 466483 463920 462289 461545 461617 462482 463753 464843 465743 467049 469015 471147
59598D71147J828J606J514J168O82N85Q60R81R05J151J800K160J673N90m58j102
$$ 471147 472975 474581 476095 477263 477945 478530 479390 480371 481276 482427 484227 486387 488060 488650 488192 487090
59582D87090j321j297j275j353j416j489j823k377k573k081j465j490k015k244
$$ 487090 485769 484472 483197 481844 480428 478939 477116 474739 472166 470085 468620 467130 465115 462871
59568D62871j874j291q09l22K08N14L44k37q91j113n78L69Q66N15j22l42j28J41
$$ 462871 460997 459706 458897 458575 458783 459297 459641 459404 458513 457400 456822 457191 458057 458572 458450 458108 457980 458121
59550D58121L32M59N24Q53J924L369L974L342K749L493N224O913Q551J0722J3281
$$ 458121 458453 458912 459436 460289 462213 465582 469556 472898 475647 479140 484364 491277 499828 510550 523831
59535E23831J5916J9147K2816K4001J8906P503n342j4133j7066j5808j2685r124
$$ 523831 539747 558894 581710 605711 624617 632120 626778 612645 595579 579771 567086 557962
59523E57962n807k981o96Q48J478J624K032K686K709J655J25j159k234l427m680
$$ 557962 552155 549174 548478 549326 550804 552428 554460 557146 559855 561510 561635 560476 558242 554815 550135
59508E50135n793o801p668p987p423o138m668l618l444m047m611m408l757l529
$$ 550135 544342 537541 529873 521886 514463 508325 503657 500039 496595 492548 487937 483529 479772 476243
59494D76243l726l360j945k78N95N80K81J06J18L77J026K085L285M119M234L960
$$ 476243 472517 469157 467212 466934 467529 468109 468390 468496 468614 468991 470017 472102 475387 479506 483740 487700
59478D87700M099M785N109M443L611L776M642M907M250L625L510L293K568J845
$$ 487700 491799 496584 501693 506136 509747 513523 518165 523072 527322 530947 534457 537750 540318 542163
59464E42163J465R70N0q01j100r61m13Q24K418L291L134L107M221N886O946P391
$$ 542163 543628 544598 544648 543847 542747 541786 541373 542197 544615 547906 551040 554147 558368 564254 571200 578591
59448E78591P960Q617Q583P700O684N897M769K640k99l187n326o691p668q424
$$ 578591 586551 595168 603751 611451 618135 624032 628801 631441 631142 627955 622629 615938 608270 599846
59434E99846q623p920o584n261m266l518l066k993k844j892j60J526K733L939
$$ 599846 591223 583303 576719 571458 567192 563674 560608 557615 554771 552879 552719 554245 556978 560917
59420E60917N631P654R801J2307J5192J7844J9784K1254K2669K4189K6320K9687
$$ 560917 566548 574202 584003 596310 611502 629346 649130 670384 693053 717242 743562 773249
59408G73249L3089L2703K5016J0831m735j6378k2009k2390j9019j3171n893K155
$$ 773249 806338 839041 864057 874888 870153 853775 831766 809376 790357 777186 771293 773448
59396G73448J0438J7263J9175J3206K69j4431k5148k9641k9386k6764k3091j8911
$$ 773448 783886 801149 820324 833530 833799 819368 794220 764579 735193 708429 685338 666427
59384F66427j4741j0937p639n220m084l682k681p30Q17P67j51m26L9J25m98j037
$$ 666427 651686 640749 633110 627890 623806 620124 617443 616713 617530 618297 618146 617720 617759 617884 617386 616349
59368F16349j113j293j817j977j277k97O4l61r45q47M21K495M258N019N402O388
$$ 616349 615236 613943 612126 610149 608872 608575 608639 608278 607333 606486 606907 609402 613660 618679 624081 630469
59352F30469P812Q739R065R594J0601J1521J2184J3082J4197J4763J4535J4207
$$ 630469 638281 647020 656085 665679 676280 687801 699985 713067 727264 742027 756562 770769
59340G70769J4150J3883J3122J2243J1213R293O354L342P54k128n708q899j0565
$$ 770769 784919 798802 811924 824167 835380 844673 851027 854369 855123 852995 847287 838388 827823
59327H27823j1202j2065j3309j4184j4493j4767j5141j5133j4441j3313j2162
$$ 827823 816621 804556 791247 777063 762570 747803 732662 717529 703088 689775 677613
59316F77613j1221j0515r806q850p836p165o643n556l810k248j397o87O71K674
$$ 677613 666392 655877 646071 637221 629385 622220 615577 610021 606211 603963 602566 601879 602550 605224
59302F05224M963P546J0447J3135J4739J4308J0724L473n874j3941j8227j8980
$$ 605224 610187 617733 628180 641315 656054 670362 681086 684559 678685 664744 646517 627537
59290F27537j7886j5941j3521j1391j0149r161p388n072l350k401j224O77K507
$$ 627537 609651 593710 580189 568798 558649 549488 542100 537028 533678 531277 530053 530730 533237
59277E33237L403L569L801M474N430O536P906R639J1472J2880J3594J3877J4028
$$ 533237 536640 540209 544010 548484 553914 560450 568356 577995 589467 602347 615941 629818 643846
59264F43846J3811J2826J1283R728Q127O036L606J450n52l120n963p595p431o784
$$ 643846 657657 670483 681766 691494 699621 705657 709263 710713 710161 707041 701078 693483 686052 679268
59250F79268o923p280o667n244m051l256k264j001O6J007K266L645M404M336L977
$$ 679268 672345 665065 658398 653154 649103 645847 643583 642582 642648 643655 645921 649566 653970 658306 662283
59235F62283L832M060M724N633O173N914N127M188K844O91j975m457o407p765
$$ 662283 666115 670175 674899 680532 686705 692619 697746 701934 704778 705469 703494 699037 692630 684865
59221F84865q413q603r109j0252j1215j1090j0162r345q839q194p284o368n505
$$ 684865 676452 667849 658740 648488 637273 626183 616021 606676 597837 589643 582359 575991 570486
59208E70486m741m396m460m165l047j856j561j919k032j755j451q56M97K028K635
$$ 570486 565745 561349 556889 552724 549677 547821 546260 544341 542309 540554 539103 538247 538744 540772 543407
59193E43407K298K023K208K279J960J741J922K201K460L010L862M502M651M585
$$ 543407 545705 547728 549936 552215 554175 555916 557838 560039 562499 565509 569371 573873 578524 583109
59179E83109M560M499M287L869L150K271J761J891K146K035J894K172K377J780
$$ 583109 587669 592168 596455 600324 603474 605745 607506 609397 611543 613578 615472 617644 620021 621801
59165F21801Q09N39J052J441J378J461J887J961J197rj164k283l492m719n979
$$ 621801 622610 623149 624201 625642 627020 628481 630368 632329 633526 633517 632353 630070 626578 621859 615880
59150F15880p312q378q726q550q484q610q348p419o244n307m735m523m629m804
$$ 615880 608568 600190 591464 582914 574430 565820 557472 550053 543809 538502 533767 529244 524615 519811
59136E19811m850m943n209n273m720l778k872j979j023m18k87K39J848L628M134
$$ 519811 514961 510018 504809 499536 494816 491038 488166 486187 485164 484746 484459 484698 486546 490174 494308
59121D94308L559L441M392N573O476P651R260J0318J0072R059Q237P927Q021Q368
$$ 494308 497867 501308 505700 511273 517749 525400 534660 544978 555050 564109 572346 580273 588294 596662
59107E96662Q477P699O171M876M399M257L817L115K381J459J88j120j999k322
$$ 596662 605139 612838 619009 623885 628284 632541 636358 639473 641854 643313 643501 642381 640382 638060
59093F38060k286k251k532k965k821j701k91M06L43J60p7q44k019k896l396m195
$$ 638060 635774 633523 630991 628026 625205 623504 623213 623619 623962 624122 624045 623201 621182 618286 614890 610695
59077F10695n480o549o942o991p020o851o417n990n617n056m476m339m448l976
$$ 610695 605215 598666 591724 584733 577713 570862 564445 558455 552838 547782 543306 538967 534519 530543
59063E30543k784j812j818k489l043l055k446j390m76l11q10j435k023k659k936
$$ 530543 527759 525947 524129 521640 518597 515542 513096 511706 511230 510919 510109 508674 506651 503992 501056
59048E01056k306j176n71o59o48j89K50N31J113J897K030J280M95K14k8n02n41
$$ 501056 498750 497574 497003 496344 495696 495507 495757 496288 497401 499298 501328 502608 503103 503317 503289 502787 502246
59031E02246L38J497K059K061K146K782M159O169Q100R149R523J0219J1506J2512
$$ 502246 502584 504081 506140 508201 510347 513129 517288 523457 531557 540706 550229 560448 571954 584466
59017E84466J2626J2268J1839J0973R358P366N361L213R41j093l007n267p307
$$ 584466 597092 609360 621199 632172 641530 648896 654257 657470 658411 657318 654311 649044 641737
59004F41737p539n466k697r09M1J117K222K669K762L531N125O499O684N663M064
$$ 641737 634198 628732 626035 625126 625167 626284 628506 631175 633937 637468 642593 649092 655776 661439 665503
58989F65503K599J680J194P72L73K65L24Jq11j417j203l18P75J886L046M326N867
$$ 665503 668102 669782 670976 671748 672121 672386 672710 672711 671900 670483 669280 668962 669737 671623 674669 678995 684862
58972F84862P562Q832R336R793J1083J2750J3510J3210J2936J3105J3003J2457
$$ 684862 692424 701256 710592 720385 731468 744218 757728 770938 783874 796979 809982 822439
58960H22439J2316J2656J2133J0009P294M974K560n22l581n970q518j2030j5492
$$ 822439 834755 847411 859544 869553 876847 881821 884381 883859 880278 874308 865790 853760 838268
58947H38268j7340j7759j8090j8536j8106j6533j4715j3255j1870j0333q875p544
$$ 838268 820928 803169 785079 766543 748437 731904 717189 703934 692064 681731 672856 665312
58935F65312o046m414l108k321j697q56J51R71J300J272J478K199K680J895O3
$$ 665312 659266 654852 651744 649423 647726 646870 647021 647992 649292 650564 652042 654241 656921 658816 658879
58920F58879j411j763j642j700j583r45l49l51n32l71k22n58r24n66M82J793L385
$$ 658879 657468 655705 654063 652363 650780 649835 649486 649135 648603 648232 648010 647452 646528 645962 646444 648237 651622
58903F51622N346P251Q684R878J1108J2176J3013J3972J4855J4657J3138J1680
$$ 651622 656968 664219 672903 682781 693889 706065 719078 733050 747905 762562 775700 787380
58891G87380J1518J2127J2520J3157J5057J7736J9620K0163K0116J9891J9022
$$ 787380 798898 811025 823545 836702 851759 869495 889115 909278 929394 949285 968307
58880I68307J7209J4747J1896Q687N342K086j284m923q350j1105j3477j5799j7450
$$ 968307 985516 1000263 1012159 1020846 1026188 1028274 1026990 1022067 1013717 1002612 989135 973336 955886
58867I55886j7551j6246j4362j2224r804p681o573o250n956n763o355p611q570
$$ 955886 938335 922089 907727 895503 885699 878018 871445 865195 859239 853476 847121 839510 830940
58854H30940q880r161r763j0179r976r471r134q885q389p625o932o661o827p049
$$ 830940 822060 812899 803136 792957 782981 773510 764376 755491 747102 739477 732545 725884 719057 712008
58840G12008p010o976p465q331q771q499q164q215q193p640o906o331n475l992
$$ 712008 704998 698022 690557 682226 673455 664956 656792 648577 640384 632744 625838 619507 614032 610040
58826F10040k559j985j932j494m95O19J730K985M138M884N390N812N796N213M821
$$ 610040 607481 605496 603564 602070 601575 602194 603924 606909 611047 615931 621321 627133 632929 638142 642963
58811F42963N192N600M950L437K171J546J035L16m19j144k063l018l621l903m266
$$ 642963 648155 653755 658705 662142 664313 665859 666894 667210 666791 665647 663584 660566 656945 653042 648776
58796F48776m913n825o902p784p959p639p779q724r448q897p338n604l790j659
$$ 648776 643863 638038 631136 623352 615393 607754 599975 591251 581803 572906 565568 559964 556174 554515
58782E54515L57J652K445L343M333M997N308N385N022M129L073J908J00k360m476
$$ 554515 554872 556524 558969 562312 566645 571642 576950 582335 587357 591486 594559 596467 596567 594207 589731
58767E89731n699o775q224r165q770p754p088o444n279m240l889l181j180Q46
$$ 589731 584032 577257 569033 559868 551098 543344 536256 529812 524533 520293 516404 513223 512043 512889
58753E12889J180O55J509L765N174M681L528K785K033J022O21J333K352K814K844
$$ 512889 514069 514724 516233 519998 525172 529853 533381 536166 538199 539221 539842 541175 543527 546341 549185
58738E49185K930L338M325N866P006O690N330M446M632N033M929M617M548M653
$$ 549185 552115 555453 559778 565644 572650 579340 584670 589116 593748 598781 603710 608327 612875 617528
58724F17528M737M682M239L408K821K937L230L131L221M267N659O319O597P614
$$ 617528 622265 626947 631186 634594 637415 640352 643582 646713 649934 654201 659860 666179 672776 680390
58710F80390R003R178P822O352N667N062L657J440j405m854q380j1140j3102j4911
$$ 680390 689393 698571 706393 712745 718412 723474 727131 728571 727166 722312 713932 702792 689690 674779
58696F74779j6583j7459j7504j7393j7283j6618j5261j3645j1855r699p612o260
$$ 674779 658196 640737 623233 605840 588557 571939 556678 543033 531178 521479 513867 507607
58684E07607n384m285l244l151l845m271m153m093m097l489k313j384q74j78Q00
$$ 507607 502223 497938 494694 491543 487698 483427 479274 475181 471084 467595 465282 463898 463024 462846 463646
58669D63646J602K371L672N275O446P308Q517R816J0396J0380J0359R786P590
$$ 463646 465248 467619 471291 476566 483012 490320 498837 508653 519049 529429 539788 549574 557164
58656E57164M112P13k296n332p619p826o591o060o683o745n438m104l810l870
$$ 557164 561276 561989 559693 554361 546742 538916 532325 526265 519582 512837 507399 503295 499485 495615
58642D95615l505l053k752k118j240r79j267r16L73J572K285L279M482M526L114
$$ 495615 492110 489057 486305 484187 482947 481968 480701 479785 480158 481730 484015 487294 491776 496302 499416
58627D99416J877J908K177J385j89j621k659l160k649j294q5N99J378K391K950
$$ 499416 501293 503201 505378 506763 506574 504953 502294 499134 496485 495191 495106 495705 497083 499474 502424
58612E02424L093L875N545O938P294P075O540N165L102J492P66J40o14p14j78
$$ 502424 505517 509392 514937 521875 529169 536244 542784 547949 551051 552543 553309 553449 552835 552121 551943
58597E51943k63j346k198k113j968k385k618k095j387q16K65K007L529M557N875
$$ 551943 551680 550334 548136 546023 544055 541670 539052 536957 535570 534754 535019 537026 540555 545112 550987
58582E50987P529Q411Q304Q461R346R802R227Q577Q337P541N881M733M954N585
$$ 550987 558516 566927 575231 583692 593038 602840 612067 620644 628981 636522 642403 647136 652090 657675
58568F57675N860O591Q410J0565J2601J5339J8978K2143K4092K5894K8176K9659
$$ 657675 663535 670126 678536 689101 701702 717041 736019 758162 782254 808148 836324 865983
58556H65983K9258K7740K5848K2712J7650J1818O540J663l022o537q282r181r888
$$ 865983 895241 922981 948829 971541 989191 1001009 1007549 1009212 1006190 999653 991371 982190 972302
58543I72302r569p908o475o634p758q954j0778j3813j7233k0230k3014k5097k4650
$$ 972302 962733 954825 948350 941716 933958 925004 914226 900413 883180 862950 839936 814839 790189
58530G90189k1281j7418j5187j3750j1533r042p463o336m770l388k997k879k315
$$ 790189 768908 751490 736303 722553 711020 701978 694515 688179 683409 680021 677024 674145 671830
58517F71830k234l394m559m415l725l607l394k295j492k189l129k521j103q16
$$ 671830 669596 666202 661643 657228 653503 649896 646502 644207 642715 640526 637397 634876 633773 632957
58503F32957j590j877j437j207j157n46L05M92K24K98N25L12N5M10J058J494K180
$$ 632957 631367 629490 628053 626846 625689 625143 625448 625940 626164 626462 626987 627299 627354 627764 628822 630316 632496
58486F32496L452M498M682M735N385O140O670P856J0065J2052J3067J4273J6466
$$ 632496 635948 640446 645128 649863 655248 661388 668058 675914 685979 698031 711098 725371 741837
58473G41837J8227J8058J6532J4548J1390O502J339k616n858q974j0747j0331
$$ 741837 760064 778122 794654 809202 820592 827094 828433 825817 819959 810985 800238 789907
58461G89907r306r162q574n766j764J208L025M828O592P995R976J2883J4709J3767
$$ 789907 780601 771439 762865 757099 755335 756543 759568 764396 770988 778983 788959 801842 816551 830318
58447H30318J1403R450O866J929m032q287j0628j2481j3519j2475j0222q780q090
$$ 830318 841721 851171 858037 859966 855934 847647 837019 824538 811019 798544 788322 779542 771452
58434G71452o771n105m345l937k468m59N96J200K984N663P640Q767R929J0725
$$ 771452 764681 759576 755231 751294 748826 748367 748963 750163 753147 758810 766450 775217 785146 795871
58420G95871J0252R200Q641P709N079J579j204l583o380q423q353p490p828q602
$$ 795871 806123 815323 823964 831673 836752 838331 837127 833544 827164 818741 810388 802898 795070 786468
58406G86468q000o820p025p991p670o307n543m894k780l4J153J050J698L156L862
$$ 786468 778468 771648 764623 756632 748962 742655 737112 732218 729438 729404 730557 731607 733305 736461 740323
58391G40323L894M524N262M685L451L264L706L269K483K759L273K496J588K637
$$ 740323 744217 748741 754003 758688 762139 765403 769109 772378 774861 777620 780893 783389 784977 787614
58377G87614M706N350M953N614O854O493M914M419N078N184N025O219Q017Q324
$$ 787614 792320 797670 802623 808237 815091 821584 826498 830917 835995 841179 846204 852423 860440 868764
58363H68764P667Q280R999J0985J1597J3479J5750J6185J5269J4925J4429J1899
$$ 868764 876431 884711 894710 905695 917292 930771 946521 962706 977975 992900 1007329 1019228
58351A019228Q603P047O118L059q06j673K62J388J126K179M654N654M829M970
$$ 1019228 1027831 1034878 1040996 1044055 1043249 1041576 1041838 1043226 1044352 1046531 1051185 1056839 1061668 1066638
58337A066638O746P994Q515J0348J3111J4200J3834J4875J7346J8232J6967J6040
$$ 1066638 1073384 1081378 1089893 1100241 1113352 1127552 1141386 1156261 1173607 1191839 1208806 1224846
58325A224846J5909J4499J1953J0732J0665R063N953M104L790K767J405K364N104
$$ 1224846 1240755 1255254 1267207 1277939 1288604 1297667 1303620 1307724 1311514 1314281 1315686 1318050 1323154
58312A323154O344O007P041R369J0030R355J0768J4164J5781J5099J5411J7063
$$ 1323154 1329498 1335505 1342546 1351915 1361945 1371300 1382068 1396232 1412013 1427112 1442523 1459586
58300A459586J6760J4343J3729J5980J7756J7665J7941J8993J8591J7282J8238
$$ 1459586 1476346 1490689 1504418 1520398 1538154 1555819 1573760 1592753 1611344 1628626 1646864
58289A646864K1047K2074K1413K2759K5985K7079K5968K6994L0831L3518L4239
$$ 1646864 1667911 1689985 1711398 1734157 1760142 1787221 1813189 1840183 1871014 1904532 1938771
58278A938771L6373L9902M0876L9395L9964M2818M3266M0811M0344M2939M4355
$$ 1938771 1975144 2015046 2055922 2095317 2135281 2178099 2221365 2262176 2302520 2345459 2389814
58267B389814M4023M6349N1468N4133N3658N5420O0501O3684O3860O6274P1917
$$ 2389814 2433837 2480186 2531654 2585787 2639445 2694865 2755366 2819050 2882910 2949184 3021101
58256C021101P5067P4148P4657P8402Q0357P9234Q0375Q5054Q7870Q8050R1882
$$ 3021101 3096168 3170316 3244973 3323375 3403732 3482966 3563341 3648395 3736265 3824315 3916197
58245C916197J00528J07169J09834J15027J24819J32920J37527J45182J57550
$$ 3916197 4016725 4123894 4233728 4348755 4473574 4606494 4744021 4889203 5046753
58236E046753J67759J74430J85405K02574K17458K27162K39940K59222K77531
$$ 5046753 5214512 5388942 5574347 5776921 5994379 6221541 6461481 6720703 6998234
58227F998234K92249L11468L37651L62012L81975M07151M40932M74252N05081
$$ 6998234 7290483 7601951 7939602 8301614 8683589 9090740 9531672 10005924 10511005
58218A0511005N44962N97975O53304P07500P73028Q55292R43810J036425J148366
$$ 10511005 11055967 11653942 12307246 13014746 13787774 14643066 15586876 16623301 17771667
58209A7771667J286196J438590J605232J807344K056050K340384K662398L053326
$$ 17771667 19057863 20496453 22101685 23909029 25965079 28305463 30967861 34021187
58201C4021187L539988M130993M854023N766771O910064Q293489R949175J1948742
$$ 34021187 37561175 41692168 46546191 52312962 59223026 67516515 77465690 89414432
58193H9414432J4343177J7148916K0421801K4260420K8680591L3542876L8551935
$$ 89414432 103757609 120906525 141328326 165588746 194269337 227812213 266364148
58186B66364148M3005146M5288884M2925899L3868913J8302603q00601j9117821
$$ 266364148 309369294 354658178 397584077 431452990 449755593 448954992 429837171
58179D29837171l3173685m1525655m4498512m3337153l9562208l4581539k9414444
$$ 429837171 396663486 355137831 310639319 267302166 227739958 193158419 163743975
58172A63743975k4609217k0390972j6837805j3931979j1573300r649762q091587
$$ 163743975 139134758 118743786 101905981 87974002 76400702 66750940 58659353
58165E8659353o842201n825229m975195m266777l685110l196736k773547k415593
$$ 58659353 51817152 45991923 41016728 36749951 33064841 29868105 27094558 24678965
58157B4678965k125171j882291j666581j480131j328420j199513j080589r75660
$$ 24678965 22553794 20671503 19004922 17524791 16196371 14996858 13916269 12940609
58149A2940609q89477q11700p33179o61152o03165n51521m97810m47754m08241
$$ 12940609 12051132 11239432 10506253 9845101 9241936 8690415 8192605 7744851 7336610
58140G336610l74017l40091l13299k98679k87461k70825k53394k41418k29837
$$ 7336610 6962593 6622502 6309203 6010524 5723063 5452238 5198844 4957426 4727589
58131D727589k12775j95488j84116j74111j59916j46219j38789j33404j24327
$$ 4727589 4514814 4319326 4135210 3961099 3801183 3654964 3516175 3382771 3258444
58122C258444j14975j10184j06366r8934r1478q8321q5720p9354p3007p1165p0303
$$ 3258444 3143469 3033285 2926919 2827985 2736507 2648186 2562466 2483112 2410105 2338940 2268637
58111B268637o5925o1171o0161n9705n5696n1147n0021m9477m5909m2312m2195
$$ 2268637 2202712 2141541 2081380 2021675 1965979 1914832 1864811 1815334 1769425 1727113 1684918
58100A684918m2311l8909l5246l5420l6618l4645l1586l0826l0040k6328k2955
$$ 1684918 1642607 1603698 1568452 1533032 1496414 1461769 1430183 1399357 1369317 1342989 1320034
58089A320034k3716k5556k3913k0726k0142k0823j9399j7429j8196k0289k0649
$$ 1320034 1296318 1270762 1246849 1226123 1205981 1185158 1165759 1148330 1130134 1109845 1089196
58078A089196k0292k1290k1838j9965j8190j9006j9834j7883j5794j6789j8472
$$ 1089196 1068904 1047614 1025776 1005811 987621 968615 948781 930898 915104 898315 879843
58067H79843j7277j5020j4979j5409j3046r598q628r163q169o452o566p701p903
$$ 879843 862566 847546 832567 817158 804112 794514 785886 776723 768554 762102 755536 747835 739932
58054G39932q454j0967j3090j2241j0542j1014j2033j0622q124p375p244n362
$$ 739932 731478 720511 707421 695180 684638 673624 661591 650969 642845 635470 628226 622864
58042F22864l313l755n075m325k863l758n948o323n435n915p273p302o727p619
$$ 622864 619551 615796 610721 606396 603533 599775 593827 587504 582069 576154 568881 561579 554852 547233
58028E47233r032q937q453r605j0976j0228q784r217j0165q702n815m599m826
$$ 547233 538201 529264 520811 511206 500230 490002 481218 472001 461836 453134 447319 442720 437894
58015D37894m165l025l353m223l508k407l448n439n223l246k533l235k932j482
$$ 437894 433729 430704 427351 423128 419620 417213 413765 408326 403103 399857 397324 394089 391157 389675
58001C89675r56j465j338p68j234k120j757r27j416k281j483j8k53j364p54J022
$$ 389675 388719 387254 385916 385148 383914 381794 380037 379110 377694 375413 373930 373912 373659 372295 371541 372563
57985C72563J180k74q39k04l83j550j927j482j813k659k337j368j803l246l296
$$ 372563 373743 373469 372630 372426 372043 370493 368566 367084 365271 362612 360275 358907 357104 353858 350562
57970C50562j762q29j099j034k73j04o34n96O1K69J90P28J287Q33K98R51J441
$$ 350562 348800 347971 346872 345838 345565 345461 344827 344231 344292 344561 344751 345479 346766 347599 347897 348848 350289
57953C50289k26k762l313k212k194l463l529j768l27k86m09M6L97O59J633K898
$$ 350289 350063 347301 343988 341776 339582 336119 332590 330822 330495 330209 329800 329846 330243 330902 332535 335433
57937C35433L331L436M480N864O171O108P338Q971Q560O013L318R30k134n125
$$ 335433 338764 342200 346680 352544 358715 364823 372161 381132 389692 395705 399023 399953 397819 392694
57923C92694o101n497n693p073p875p709p854q201p431o111o098o851n932l293
$$ 392694 386593 381096 375403 368330 360455 352746 344892 336691 329260 323149 317051 310200 304268 300975
57909C00975j449j165o15P86J365O66L71R99R94kk47P72J271L97k95L03J257J831
$$ 300975 299526 298361 297746 298532 299897 300563 300934 301933 302927 302925 302678 303450 304721 305118 304823 305126 306383 308214
57891C08214K705M013M621M202L849L896L423K441K164K653K496J336L45j52j102
$$ 308214 310919 314932 319553 323755 327604 331500 334923 337364 339528 342181 344677 346013 346358 346206 345104
57876C45104k461k982k649k810l591l727l186l284l914l525k242k121l616m645
$$ 345104 342643 339661 337012 334202 330611 326884 323698 320414 316500 312975 310733 308612 304996 300351
57862C00351l937k600j615m95Q62J517J551K266L616M005L195K836L450L665L116
$$ 300351 296414 293814 292199 291704 292566 294083 295634 297900 301516 305521 308716 311552 315002 318667 321783
57847C21783L220M185M212K700J434J389J178k1p69j34M65j72r63o82p8k80r23
$$ 321783 325003 329188 333400 336100 337534 338923 340101 340080 339311 339177 339642 339470 338507 337825 337747 337467 336544
57830C36544j311j629j893j514r04j449k987l474k201r42q48o64N06J209K40j055
$$ 336544 335233 333604 331711 330197 329293 327844 324857 321383 319182 318240 317392 316728 317234 318443 318683 317628
57814C17628j069o30j442l406n349p006q499r151q465p323o769o579o090n386
$$ 317628 316559 315929 314487 311081 305732 298726 290227 281076 272611 265288 258519 251940 245850 240464
57800B40464m668l660k523k082k331k117j033j35j0J86Q51R43n1q41k26J183K222
$$ 240464 235796 232136 229613 227531 225200 223083 222050 221915 221905 222091 222942 223885 223834 222993 222767 223950 226172
57783B26172K718K820K369J901K654M522N616M968L979M085M654M530M052M021
$$ 226172 228890 231710 234079 235980 238634 243156 248772 253740 257719 261804 266458 270988 275040 279061
57769B79061M077L485K439J384J62j095j545j055p81j369j858j407o38l00j4N74
$$ 279061 283138 286623 289062 290446 290608 289513 287968 286913 286132 284763 282905 281498 280860 280560 280546 281120
57753B81120P60R8n74m78r9m1K8L99N82M20N94J196J202K48n81o01n76j067j353
$$ 281120 281880 281978 281404 280926 280827 280786 280814 281213 281795 282215 282809 284005 285207 285455 284874 284273 283697 282630 281277
57734B81277j004q64j357j468o06J89K8l81k58p3j40L78J769K704K288J567J634
$$ 281277 280273 279409 278052 276584 275978 276167 276195 275814 275556 275483 275343 275721 277490 280194 282482 284049 285683
57717B85683J879J587J532K365K994K359J363J258J454P86l00o97p08j282k141
$$ 285683 287562 289149 290681 293046 296040 298399 299762 301020 302474 303260 302960 302263 301555 300273 298132
57702B98132k391k217k324k460j993j247q71n88J28Q87J030N84m08k401n109o919
$$ 298132 295741 293524 291200 288740 286747 285500 284629 284041 284169 285056 286086 286670 286262 283861 278752 271833
57686B71833o799n709m966m424l474k452j672l12K168M740O397P888J0366J3512
$$ 271833 265034 259325 254359 249935 246461 244009 242337 242025 244193 248933 255330 263218 273584 287096
57672B87096J6534J9901K4488L0068L6203M3519N2321O0650O4995O2099M9483
$$ 287096 303630 323531 348019 378087 414290 457809 510130 570780 635775 697874 747357
57661G47357K6434l385l1904n1803o1405o3352o0207n3430m5109l7520l1088k4893
$$ 747357 773791 770406 738502 686699 625294 561942 501735 448305 403196 365676 334588 309695
57649C09695j8998j4508j1703r867q542p541o234m395l061l034l310k539j173
$$ 309695 290697 276189 264486 254619 246077 238536 232302 227907 224846 221812 218502 215963 214790
57636B14790m45j46O63J488J100k18j093j272j589k095k105j737j632j560r55
$$ 214790 214345 214199 214862 216350 217450 217232 216139 214867 213278 211183 209078 207341 205709 204149 203194
57621B03194m23r41k012k327j868j628j663j278p15q44j466j603j275j243j400
$$ 203194 202771 201830 199818 197491 195623 193995 192332 191054 190339 189495 188029 186426 185151 183908 182508
57606A82508j071o00p88j164n82O76J244Q16K48k42j182k348k887k816k764k584
$$ 182508 181437 180837 180049 178885 178303 178979 180223 181039 181287 181045 179863 177515 174628 171812 169048 166464
57590A66464j848j289j894k937k860j814j309j625j647j158j088j484j387q45
$$ 166464 164616 163327 161433 158496 155636 153822 152513 150888 149241 148083 146995 145511 144124 143279
57576A43279r69j772k023j477j192j422j269p56j065k165k367j066J31j32j126
$$ 143279 142310 140538 138515 137038 135846 134424 133155 132399 131334 129169 126802 125736 125867 125735 124609
57561A24609j637j750j960j906j087K05J423K322K544J824J033J624L506M705
$$ 124609 122972 121222 119262 117356 116269 116474 117897 120219 122763 124587 125620 127244 130750 135455
57547A35455L802J508o55k027k578k291j549j135j139p36M32J608K072J993J685
$$ 135455 139257 140765 140110 138083 135505 133214 131665 130530 129391 128655 129087 130695 132767 134760 136445
57532A36445J011L7o94r83j268j660j574q15j58l32j049j480j162j94R27J578
$$ 136445 137456 137493 136799 135816 134548 132888 131314 130499 130341 130009 128960 127480 126318 126124 127051 128629
57516A28629J584J495J726J793J188N42Q45J793K158J592Q69M42K7m22n20l38
$$ 128629 130213 131708 133434 135227 136415 136957 137802 139595 141753 143345 144214 144656 144683 144261 143741 143403
57500A43403l01k92M5K36m88j768k529k675k962l352l033k068j453j410j169o12
$$ 143403 143102 142810 142855 143091 142603 140835 138306 135631 132669 129317 126284 124216 122763 121353 120184 119572
57484A19572n29j039j299j062r58r74l21Q98J469R84L98K01l26j488k403k571
$$ 119572 119043 118004 116705 115643 114685 113711 113390 114288 115757 116741 117139 117340 117014 115526 113123 110552
57468A10552k698l257l518k811j585n51J24L31r8n39N3J455K191J642Q38N90M30
$$ 110552 107854 104597 101079 98268 96683 96132 96256 96587 96489 95950 96003 97458 99649 101291 102129 102719 103149
57451A03149j7j28M33Q79O00J05j10l93q52p14L66J466J667J197O16on25m68J3
$$ 103149 103132 103004 103437 104316 104916 105021 104911 104518 103666 102952 103318 104784 106451 107648 108264 108258 107733 107265 107278
57432A07278L8n26p29j94K38R7R2N87P75K94J52J008J851J615Q48N83O61M24O7
$$ 107278 107316 106790 106061 105867 106105 106202 106294 106881 107656 107950 108102 109110 110961 112576 113424 114007 114668 115092 115159
57413A15159J4j44q40j411r87R4Q26Q78N45k0o22p07j34L19j3p02r69p93o28o01
$$ 115159 115173 115029 114189 112778 111791 111885 112711 113589 114134 114114 113492 112785 112651 112970 112957 112255 111286 110493 109865 109264
57393A09264n52k99M47J727K759K621J714J378J821J972J667K186L850M943M166
$$ 109264 108712 108413 108860 110587 113346 115967 117681 119059 120880 122852 124519 126705 130555 135498 139664
57378A39664K494J373N95n11j312j029n01j025k231k787k496k073j544n21M33
$$ 139664 142158 143531 144126 143615 142303 141274 140773 139748 137517 134730 132234 130161 128617 128096 128529
57363A28529L16o49j266j061n44j6O63J326J631J748K017K119J565P19M96J152
$$ 128529 128845 128196 126930 125869 125325 125309 125972 127298 128929 130677 132694 134813 136378 137097 137593 138745
57347A38745K069K470J900M63r22j136k89K50k24p36l04M78N04j26o19q76j212
$$ 138745 140814 143284 145184 145647 144725 143589 143300 143550 143326 142590 142286 142764 143268 143142 142523 141647 140435
57330A40435j386j057o28n36l39M63J341J501J126P70K73o01j170p26J31L38J
$$ 140435 139049 137992 137364 136828 136489 136952 138293 139794 140920 141690 141963 141362 140192 139466 139597 139935 139936
57313A39936JM42O84N44K78j98j024j728j839j656j501q74N26J722J684J039J112
$$ 139936 139937 140379 141063 141607 141885 141687 140663 138935 137096 135440 133939 133065 133591 135313 136997 138036 139148
57296A39148J821J966J230M24J9k66m92l86l6L27R01J695J886R69m3J08R80J242
$$ 139148 140969 142935 144165 144589 144608 144342 143850 143464 143428 143755 144656 146351 148237 149206 149163 149271 150251 151493
57278A51493R11J083J786J922J283R45J420K025K365K926L860M482M390L996L631
$$ 151493 152404 153487 155273 157195 158478 159423 160843 162868 165233 168159 172019 176501 180891 184887 188518
57263A88518L228L066L675M684M888L857K599K144K355K515K367K197K364K953
$$ 188518 191746 194812 198487 203171 208059 211916 214515 216659 219014 221529 223896 226093 228457 231410
57249B31410L541L458K688K146K429K852K560K034K359L435M172M221M145M095
$$ 231410 234951 238409 241097 243243 245672 248524 251084 253118 255477 258912 263084 267305 271450 275545
57235B75545L697L238L574M624N297N106M676M424L964L151K543K365K170J919
$$ 275545 279242 282480 286054 290678 295975 301081 305757 310181 314145 317296 319839 322204 324374 326293
57221C26293K389L916N653O672P079P459P905Q159Q252Q521R146R964J0533J0471
$$ 326293 328682 332598 338251 344923 352002 359461 367366 375525 383777 392298 401444 411408 421941 432412
57207D32412R960R705J0089J0677J1073J1708J3068J4624J5464J5695J6122J6816
$$ 432412 442372 452077 462166 472843 483916 495624 508692 523316 538780 554475 570597 587413
57195E87413J7052J6665J6375J6685J7304J7767J7825J7270J6180J5313J5473
$$ 587413 604465 621130 637505 654190 671494 689261 707086 724356 740536 755849 771322
57184G71322J6480J7509J8194J8676J8937J9027J9650K1417K3777K5788K7679
$$ 771322 787802 805311 823505 842181 861118 880145 899795 921212 944989 970777 998456
57173I98456L0434L3962L7052L9081M0480M1434M1506M0764M0014L9596L9115
$$ 998456 1028890 1062852 1099904 1138985 1179465 1220899 1262405 1303169 1343183 1382779 1421894
57162A421894L8640L8992M0396M1891M2463M2010M0951L9771L9190L9782M1163
$$ 1421894 1460534 1499526 1539922 1581813 1624276 1666286 1707237 1747008 1786198 1825980 1867143
57151A867143M2276M2729M3179M4333M6310M8888N1536N3276N3424N2385N0863
$$ 1867143 1909419 1952148 1995327 2039660 2085970 2134858 2186394 2239670 2293094 2345479 2396342
57140B396342M8650M5173M0953L7156L3959L0722K7680K6007K6231K7998L1267
$$ 2396342 2444992 2490165 2531118 2568274 2602233 2632955 2660635 2686642 2712873 2740871 2772138
57129B772138L5999M0497M1855L8656L1985K3718J5381Q898O309P787J1184J4298
$$ 2772138 2808137 2848634 2890489 2929145 2961130 2984848 3000229 3009127 3015436 3023223 3034407 3048705
57117C048705J6462J7724J8189J8920K1909K8224L7200M7869N9802P2205Q4007
$$ 3048705 3065167 3082891 3101080 3120000 3141909 3170133 3207333 3255202 3315004 3387209 3471216
57106C471216R5751J09831J27903J49552J74433K04259K41804K89403L49584M25538
$$ 3471216 3566967 3676798 3804701 3954253 4128686 4332945 4574749 4864152 5213736 5639274
57096E639274N19644O32442P63684R12790J077239J252247J433240J616989J799128
$$ 5639274 6158918 6791360 7555044 8467834 9545073 10797320 12230560 13847549 15646677
57087A5646677J972395K128447K259069K354277K402808K397625K337075K214659
$$ 15646677 17619072 19747519 22006588 24360865 26763673 29161298 31498373 33713032
57079C3713032K009311J694664J263681P43022J81479l74083q92043j353168j743528
$$ 33713032 35722343 37417007 38680688 39423710 39605189 39231106 38339063 36985895 35242367
57070C5242367k052651k274973k410044k461739k438332k352510k219537k054450
$$ 35242367 33189716 30914743 28504699 26042960 23604628 21252118 19032581 16978131
57062A6978131j870458j678938j489453j309137j142411r91818q58963p44399
$$ 16978131 15107673 13428735 11939282 10630145 9487734 8495916 7636953 6892554
57054F892554o47137n65129m96373m39051l90809l48913l11525k78216k48966
$$ 6892554 6245417 5680288 5183915 4744864 4354055 4005142 3693617 3415401 3166435
57045C166435k23191k00139j79659j61872j46412j32436j19258j06690r4869q3994
$$ 3166435 2943244 2743105 2563446 2401574 2255162 2122726 2003468 1896778 1801909 1717915
57035A717915p4050o4707n5591m6597l7595k8067j7459n742O569J8163K5656K3483
$$ 1717915 1643865 1579158 1523567 1476970 1439375 1411308 1393849 1388107 1394676 1412839 1438495 1461978
57023A461978P500k0161n0810p4802q7274q8964q3309p3942o3775n4585m6926
$$ 1461978 1469478 1449317 1398507 1323705 1236431 1147467 1064158 990216 926441 871856 824930
57012H24930m0687l5603l1202k6980k3054k0069j8187j6742j5203j3791j2758
$$ 824930 784243 748640 717438 690458 667404 647335 629148 612406 597203 583412 570654
57001E70654j1779j0474q971p579o479n866n770n533m341k463j023l36M77J978
$$ 570654 558875 548401 539430 531851 525372 519506 513736 508203 503862 501399 500376 500040 500517 502495
56987E02495L646N049O465P888Q585Q230P204N138O64o361j3672j8773k1300k2143
$$ 502495 506141 511190 517655 525543 534128 542358 549562 554700 555364 549003 535331 516558 495258 473115
56973D73115k1525j9312j6258j3405j0840q260o074m683l313q89K376N478Q212
$$ 473115 451590 432278 416020 402615 391775 383515 377441 372758 369445 368556 370932 376410 384622
56960C84622J1050J3880J6181J8077J9938K1028J9617J4575O294l622j2878j9316
$$ 384622 395672 409552 425733 443810 463748 484776 504393 518968 525262 521640 508762 489446
56948D89446k2218k2633k1830j9955j6822j3113r754o762l754r66J303L648O764
$$ 489446 467228 444595 422765 402810 385988 372875 363121 356359 352605 351639 352942 356590 363354
56935C63354J0209J3212J6182K0130K4819K8620K9883K7417K0262Q583n240j7694
$$ 363354 373563 386775 402957 423087 447906 476526 506409 533826 554088 562671 557431 539737
56923E39737k6588l1705l3510l2432k9316k5316k1134j7112j3850j1832j0591
$$ 539737 513149 481444 447934 415502 386186 360870 339736 322624 308774 296942 286351
56912B86351r134p210n399m197l698l788l953l369k033j134j397j736q14Q15J576
$$ 286351 277217 270007 264608 260411 256713 252925 248972 245603 243570 242436 241039 239303 238489 239304 240880
56897B40880J361J474K420L371L937M843O636Q991J1573J4457J7503K0312K2787
$$ 240880 242241 243715 246135 249506 253443 258286 264922 273913 285486 299943 317446 337758 360545
56884C60545K4620K4325K0201J2443L293n040j1545j5612j6646j4978j2129r462
$$ 360545 385165 409490 429691 442134 445427 440387 428842 413230 396584 381606 369477 360015
56872C60015p186m816j882J892O324J0691J4568J8604K3619K9270L4698M0119
$$ 360015 352829 348013 346131 348023 354347 365038 379606 398210 421829 451099 485797 525916
56860E25916M6378N2766N6557N4857M6105L0171Q813j3673l1967m2933m6876m5665
$$ 525916 572294 625060 681617 736474 782579 812750 821563 807890 775923 732990 686114 640449
56848F40449m0869l3861k6143j8641j1377m292K385Q870J5986K4202L3264M2975
$$ 640449 599580 565719 539576 520935 509558 505266 507651 516521 532507 556709 589973 632948
56836F32948N3453O4427P5137Q4855R2041R2692Q1354N5432J8419k1460n5554
$$ 632948 686401 750828 825965 910820 1002861 1095553 1176907 1232339 1250758 1229298 1173744
56825A173744p8237q8200q7836q1151p1388o0328m9144l8774k9252j9867j0462
$$ 1173744 1095507 1007307 919471 838320 766932 706604 657460 618686 589434 569567 559105
56814E59105j788N874J3479K2088L1646M1415N0882N9550O6118O8096O2207M5764
$$ 559105 557317 563191 576670 598758 630404 671819 722701 782251 848369 916465 978672 1024436
56802A024436J9111j2800m2197o2836p2844p3981o9326o1802n3458m5089l6703
$$ 1024436 1043547 1030747 988550 925714 852870 778889 709563 647761 594303 549214 512511
56791E12511k8572k1381j5278r689m229R26N829J1124J7207K3689K9892L5100
$$ 512511 483939 462558 447280 437591 433362 434288 440117 451241 468448 492137 522029 557129
56779E57129L7914L6086K7771J3091n350k3225l6410m3229m5030m4113m1411l6910
$$ 557129 595043 631129 658900 671991 666641 643416 607006 563777 518747 474634 433223 396313
56767C96313l1519k6894k3466k0175j6443j3078j0847r465q416p682p153o383
$$ 396313 364794 337900 314434 294259 277816 264738 253891 244426 236010 228328 221175 214792
56755B14792n423m915m945m754l955l106k631k245j773j589j851k158k288k344
$$ 214792 209369 204454 199509 194755 190800 187694 185063 182818 181045 179456 177605 175447 173159 170815
56741A70815k026q99M76R12L87P1K62p8j203j684o23P34Q24l1m28JN47P76Q30
$$ 170815 168789 167890 168366 169278 169665 169736 169998 169920 168717 167033 166410 167144 167968 167937 167509 167510 168057 168833 169663
56722A69663Q69J062J631K323K416J750J002N53K7n96n99Q7L87j96n61J97J161
$$ 169663 170532 171594 173225 175548 177964 179714 180716 181269 181296 180700 180101 180188 180575 180379 179818 180015 181176
56705A81176R86qm49N4P58J161J306J121N10j32l63l18k91j31K72M70J06l99m95
$$ 181176 182162 182154 181705 181759 182517 183678 184984 186105 186615 186483 186120 185802 185511 185380 185652 186122 186228 185829 185334
56686A85334k01L33J189K030J985J065O22J500K640K624J767J343J492J339P41
$$ 185334 185133 185466 186655 188685 190670 191735 192357 193857 196497 199121 200888 202231 203723 205062 205803
56671B05803L67K98j03q78j280j013o22n05l69K9M20M84K89K0k88o37q60o61J64
$$ 205803 206170 206468 206365 205487 204207 203194 202572 202067 201698 201727 202147 202631 202920 202940 202652 202015 201155 200494 200658
56652B00658J335K063J820J142J035J532J590O69m70q90o52l78l99p27j201j327
$$ 200658 201993 204056 205876 207018 208053 209585 211175 211844 211374 210484 209832 209454 209055 208328 207127 205800
56636B05800p12J04J29n08o38k2J23p42j343n88N76O04l40q94o23k79m46j020
$$ 205800 205088 205192 205321 204813 204175 204153 204276 203534 202191 201603 202179 202783 202443 201549 200926 200647 200201 199181
56618A99181j683k011j548n44q3o63j337j059k28N0m36j034j271j012k15P35J053
$$ 199181 197498 195487 193939 193395 193312 192649 191312 190253 190025 190075 189639 188605 187334 186322 186107 186842 187895
56601A87895O62M62P85O16o90j967j714k48R41J247J168J066R21Q86J039J016
$$ 187895 188557 189019 189804 190420 189730 187763 186049 185801 186742 187989 189157 190223 191144 192030 193069 194085
56585A94085P20P49J268J367M80n25p01m78n55m76K98R41N85J64J136K963L730
$$ 194085 194805 195554 196822 198189 198669 198144 197443 196965 196410 195934 196232 197173 197758 197922 199058 202021 205751
56568B05751K908J805J536K134L415N205O860P845Q645R909J1191J1747J1899
$$ 205751 208659 210464 212000 214134 217549 222754 229614 237459 246104 256013 267204 278951 290850
56555B90850J2088J1274Q044L000j613m421n556n359m216l315l672m475m194l133
$$ 290850 302938 314212 322256 325256 323643 319222 313666 308307 304091 300776 297104 292629 288435 285302
56541B85302k972l895m244l232k034j753k035k318k733l202l026k127j468j657
$$ 285302 282330 278435 274191 270959 268925 267172 265137 262819 260086 256884 253858 251731 250263 248606
56527B48606k116k091j517o16M41J161R95J55n97r76j182j135p21n21j141k020
$$ 248606 246490 244399 242882 242266 242707 243868 244863 245018 244421 243445 242263 241128 240407 239886 238745 236725
56511B36725k100j486j133j180r18l26j28l89m47j98j44k22O1M68L77R5L34O27
$$ 236725 234625 233139 232006 230826 229908 229582 229454 229065 228618 228420 228276 228054 228115 228583 228960 229055 229389 230016
56493B30016m6j294j713j183q93j087p49K19O10Q1k24K34N22R9k06J97O81P96
$$ 230016 229970 228676 226963 225780 224887 223800 223051 223270 223880 223961 223737 223971 224493 224592 224386 224583 225264 226060
56475B26060J099J765J901J053R1j97j61k74k40J63N25O64R49J297J082L97J75
$$ 226060 227159 228924 230825 231878 231969 231772 231611 231337 231097 231260 231785 232449 233398 234695 235777 236174 236349
56458B36349O02P93M65M63J094J422R31M33N45N70j66j073j236o11M03J610K590
$$ 236349 236951 237744 238209 238672 239766 241188 242119 242552 243097 243667 243501 242428 241192 240581 240984 242594 245184
56441B45184K692K008J415J200O72m07j227j210q02n01k82k97r57j855j896r58
$$ 245184 247876 249884 251299 252499 253171 252764 251537 250327 249525 249024 248742 248445 247488 245633 243737 242779
56425B42779j58n8N0O59J178J108P72L86k60p98l66Q52J598J483J395J602J175
$$ 242779 242621 242563 242613 243272 244450 245558 246330 246716 246456 245658 245292 246144 247742 249225 250620 252222 253397
56408B53397k3o49j6P61P10M83Q53J318J329J386J805J716N74n78n42L50J052
$$ 253397 253374 252725 252709 253470 254180 254663 255516 256834 258163 259549 261354 263070 263644 263066 262524 262874 263926
56391B63926J296J327J143Q53Q86J149R77M17L11O51L41p84j298m13P26R12N69
$$ 263926 265222 266549 267692 268545 269431 270580 271557 271974 272285 272936 273277 272493 271195 270782 271508 272420 272989
56374B72989N27O27N79Q48J602K001J615J209J306J313R48J045J976K699K434
$$ 272989 273516 274143 274722 275570 277172 279173 280788 281997 283303 284616 285564 286609 288585 291284 293718
56359B93718J823J533J221Q08J046J860J868P02l2O25J362R69L93P48J177N97
$$ 293718 295541 297074 298295 299103 300149 302009 303877 304579 304547 305172 306534 307503 307896 308644 309821 310418
56343C10418j02L70J418J820J960K733L457K969J811J401J833K315K854L733M246
$$ 310418 310316 310686 312104 313924 315884 318617 322074 325043 326854 328255 330088 332403 335257 338990 343236
56328C43236L629K551K104K176K282K914M409N527M959L303J924P90p55k113k195
$$ 343236 346865 349416 351520 353696 355978 358892 363301 368828 373787 377090 379014 379804 379049 376936 374741
56313C74741j326o32k32L47P80O02M50J042J692J509J167J819L092L916M535N828
$$ 374741 373415 372783 372551 372898 373678 374280 374730 375772 377464 378973 380140 381959 385051 388967 393502 399330
56297C99330P310P634O635N345M431L997M272N062N335M599L947M451N535O249
$$ 399330 406640 414274 420909 426254 430685 434682 438954 444016 449351 453950 457897 462348 467883 474132
56283D74132O942Q143R066Q908Q532R130J0278J1048J1841J3298J4524J4422J3798
$$ 474132 481074 489217 498283 507191 515723 524853 535131 546179 558020 571318 585842 600264 614062
56270F14062J4195J5590J7066J8675K0760K2562K3523K4871K7778L1124L3322
$$ 614062 628257 643847 660913 679588 700348 722910 746433 771304 799082 830206 863528
56259H63528L5224L8872M4325N0208N6479O4132P2887Q1665R0814J01436J13099
$$ 863528 898752 937624 981949 1032157 1088636 1152768 1225655 1307320 1398134 1499570 1612669
56248A612669J24525J36009J48711J62012J73816J83185J90477J95385J96898
$$ 1612669 1737194 1873203 2021914 2183926 2357742 2540927 2731404 2926789 3123687
56239C123687J94763J88973J78370J61789J39940J14183Q4448N0523J4477k0674
$$ 3123687 3318450 3507423 3685793 3847582 3987522 4101705 4186153 4236676 4251153 4230479
56229D230479n3807q4849j12262j34088j50781j64077j73736j78242j78158j75809
$$ 4230479 4176672 4091823 3979561 3845473 3694692 3530615 3356879 3178637 3000479 2824670
56219B824670j71983j65780j57442j48490j39250j29022j18447j09064j00695
$$ 2824670 2652687 2486907 2329465 2180975 2041725 1912703 1794256 1685192 1584497
56210A584497r2005q3397p6543p1223o5456n8744n2481m7207m2179l7570l4431
$$ 1584497 1492492 1409095 1332552 1261329 1195873 1137129 1084648 1037441 995262 957692 923261
56199I23261l2368k9851k6760k4237k2220j9691j6980j5185j3697j1140q372p524
$$ 923261 890893 861042 834282 810045 787825 768134 751154 735969 722272 711132 702760 695236
56187F95236q304q318o888n530m784l720k476k178k318j413j33n90k482l269k296
$$ 695236 686932 678614 671726 666196 661412 657692 655216 653038 650720 649307 649174 648584 646102 642833 640537
56172F40537j379j210o04N21Q14M98J250K802L117K274K611M544N850N701N795
$$ 640537 639158 637948 637344 637865 638679 639177 640427 643229 646346 648620 651231 655775 661625 667326 673121
56157F73121O817P360P257Q346J1022J3413J4827J6639J8947J9988J9893K1432
$$ 673121 679938 687298 694555 702901 713923 727336 742163 758802 777749 797737 817630 839062
56145H39062K5823L1178L6313M2619N0798N9121O6288P2986P9190Q2812Q2276
$$ 839062 864885 896063 932376 974995 1025793 1084914 1151202 1224188 1303378 1386190 1468466
56134A468466P7810O9590N7735M4853L5200L0293K8239K7686K8776K9791K7192
$$ 1468466 1546276 1615866 1673601 1718454 1753654 1783947 1812186 1839872 1868648 1898439 1925631
56123A925631K0362J2512N768q43p562j2461j5507k0029k8216l8684m9908o2137
$$ 1925631 1945993 1958505 1964273 1963430 1955868 1943407 1927900 1907871 1879655 1840971 1791063 1728926
56111A728926p4061q1609q2446p8491p2250o4038n4364m5454l8317l1546k4640
$$ 1728926 1654865 1573256 1490810 1412319 1340069 1276031 1221667 1176213 1137896 1106350 1081710
56100A081710j9239j5701j2052p773m952m243l439j465O7O70K164M612N411M054
$$ 1081710 1062471 1046770 1034718 1026945 1021993 1017750 1014311 1012846 1012913 1013583 1015747 1020359 1025770 1029824
56086A029824L512N042O176N694N940Q081R664R267R037J0263J0937J0076J0014
$$ 1029824 1033336 1038378 1044554 1050248 1056188 1064269 1073933 1083200 1092237 1102500 1113437 1123513 1133527
56073A133527J1906J3455J3475J4111J6119J6853J5401J4868J6796J8324J7647
$$ 1133527 1145433 1158888 1172363 1186474 1202593 1219446 1234847 1249715 1266511 1284835 1302482
56062A302482J7226J8595J9237J7780J7134J9043K0627J9805J9035K0143K0678
$$ 1302482 1319708 1338303 1357540 1375320 1392454 1411497 1432124 1451929 1470964 1491107 1511785
56051A511785J9033J7955J9191J9851J7997J6632J8208K0358K1041K2523K6161
$$ 1511785 1530818 1548773 1567964 1587815 1605812 1622444 1640652 1661010 1682051 1704574 1730735
56040A730735K8789K8484K8514L1285L3965L4358L5275L8480M0361L8583L7095
$$ 1730735 1759524 1788008 1816522 1847807 1881772 1916130 1951405 1989885 2030246 2068829 2105924
56029B105924L9504M3190M4961M6546M9535N1018M9537M9114N2154N4839N4762
$$ 2105924 2145428 2188618 2233579 2280125 2329660 2380678 2430215 2479329 2531483 2586322 2641084
56018B641084N6015O1104O5292O5214O5553P0483P6093P8377Q1078Q7972R4968
$$ 2641084 2697099 2758203 2823495 2888709 2954262 3024745 3100838 3179215 3260293 3348265 3443233
56007C443233R7822J00295J06605J13245J16502J20425J28854J37354J41814J47014
$$ 3443233 3541055 3641350 3747955 3861200 3977702 4098127 4226981 4364335 4506149 4653163
55997D653163J57621J68930J76031J83527J96435K10146K19771K30336K47113
$$ 4653163 4810784 4979714 5155745 5339272 5535707 5745853 5965624 6195960 6443073
55988F443073K65109K79263K95318L18906L44135L65206L88595M20761M55127
$$ 6443073 6708182 6987445 7282763 7601669 7945804 8311010 8699605 9120366 9575493
55979I575493M85259N19187N65773O19006O71557P31033Q06023Q89720R75487
$$ 9575493 10060752 10579939 11145712 11764718 12436275 13167308 13973331 14863051 15838538
55970A5838538J074547J198914J342139J497721J680370J906704K173140K478333
$$ 15838538 16913085 18111999 19454138 20951859 22632229 24538933 26712073 29190406
55962B9190406K848894L316253L889652M582238N440073O511210P812515R364959
$$ 29190406 32039300 35355553 39245205 43827443 49267516 55778726 63591241 72956200
55954G2956200J1230433J3470371J6107232J9178556K2774918K6943463L1581347
$$ 72956200 84186633 97657004 113764236 132942792 155717710 182661173 214242520
55947B14242520L6422772M0867791M3495376M1893584L3710749J8609926o53878
$$ 214242520 250665292 291533083 335028459 376922043 410632792 429242718 428588840
55940D28588840j9381245l3479487m1259935m3345623m1447042l7313450l2309238
$$ 428588840 409207595 375728108 334468173 291122550 249675508 212362058 180052820
55933A80052820k7327323k2815256j8915619j5645197j2971538j0807771r043014
$$ 180052820 152725497 129910241 110994622 95349425 82377887 71570116 62527102
55926F2527102p599940o432433n484218m693325m027711l478371l024149k634778
$$ 62527102 54927162 48494729 43010511 38317186 34289475 30811104 27786955 25152177
55918B5152177k299435k021026j788403j581316j396250j241703j113326r97051
$$ 25152177 22852742 20831716 19043313 17461997 16065747 14824044 13710718 12713667
55910A2713667q91238q03658p31133o62685n98435n46295n04004m62308m21866
$$ 12713667 11822429 11018771 10287638 9624953 9026518 8480223 7976219 7513911 7092045
55901G092045l89890l63920l35309l05313k82052k64758k45982k26173k11647
$$ 7092045 6702155 6338235 6002926 5697613 5415561 5150803 4904821 4678648 4467001
55892D467001k00893j86882j70498j58395j49879j38602j25105j15303j08601
$$ 4467001 4266108 4079226 3908728 3750333 3600454 3461852 3336747 3221444 3112843
55883C112843r9597q9868q6396q9356r2189r2533r3013r2701q7951q0558p5667
$$ 3112843 3013246 2923378 2836982 2747626 2655437 2562904 2469891 2377190 2289239 2208681 2133014
55872B133014p2871o8195o3004o1832o3220o1813n7889n5953n5518n2265m6783
$$ 2133014 2060143 1991948 1928944 1867112 1803892 1742079 1684190 1628237 1572719 1520454 1473671
55861A473671m3301m1141l6299l0272k8445l0492l0906k8444k6770k6337k3959
$$ 1473671 1430370 1389229 1352930 1322658 1294213 1263721 1232815 1204371 1177601 1151264 1127305
55850A127305k0209j9211k0965k1475k0422k1283k3895k4234k1876k0668k1572
$$ 1127305 1107096 1087885 1066920 1045445 1025023 1003740 979845 955611 933735 913067 891495
55839H91495k1608k0142j9741k0420j9334j6502j4866j4530j2841j0225r907j1683
$$ 891495 869887 849745 830004 809584 790250 773748 758882 744352 731511 721286 711379 699696
55827F99696j1868r677q030p862p225o221p204r827j1190j1093j1985j3711j3540
$$ 699696 687828 678151 670121 662259 655034 648813 641609 631782 620592 609499 597514 583803 570263
55814E70263j1456j0200j0094q933o913o386o869n612l068k392l519l131o83R69
$$ 570263 558807 548607 538513 529580 522667 516281 509412 503800 500732 498340 494821 491690 491007 491976
55800D91976J168K242M295M710L360L041M049L594J337K07Q55M46j854l218k288
$$ 491976 493144 495386 499681 504391 507751 510792 514841 518435 519772 519979 520834 521280 519426 516208 513920
55785E13920j216j360j346q01j677m628p946j0916j4262j6732j5577j1240p188
$$ 513920 512704 511344 509998 509197 507520 502892 494946 484030 469768 453036 437459 426219 419031
55772D19031m472p56M585R130J1940J4456J5704J1763J931q905j6114j9590k0636
$$ 419031 414559 413803 418388 427518 439458 453914 469618 481381 483312 474407 458293 438703 418067
55759D18067j8995j5146j1743j0340r627q549q091q515q119o325m899m786m709
$$ 418067 399072 383926 372183 361843 352216 343667 335576 327061 318942 312617 307718 302932 298223
55746B98223m085m099m776m267k260q82j001r77j49j22j333j841r67p02k072l413
$$ 298223 294138 290039 285263 280996 278736 277854 276853 275876 275727 275605 274272 272431 271464 270762 268690 265277
55730B65277l681m105n093n006l637l411n307o865o274n197n367n465l731j127
$$ 265277 261596 257491 252398 247392 243755 240344 235037 228172 221898 216701 211334 205869 202138 201011
55716B01011M00P41P69P85J281L184N947P549P478P319P484O279L304P35k95j543
$$ 201011 201411 202152 202921 203706 204987 208171 214118 221667 229145 236464 243948 250227 253531 254266 253971 252428
55700B52428m223o670p340p385q150q645p567n640m106k923j969j935k525k120
$$ 252428 248205 241535 234195 226810 218660 210015 202448 196808 192702 189779 187810 185875 183350 181230
55686A81230n08L78k26n16N15J158K17o07L80K073K718K521K166J029j057k458
$$ 181230 180722 181100 180874 180358 180873 182031 182248 181641 182021 184094 186812 189333 191499 192528 191471 189013
55670A89013k206j711k164k408j394m87j072j932j322J13P50P42J205K053K567
$$ 189013 186807 185096 182932 180524 179130 178643 177571 175639 174317 174430 175180 175922 177127 179180 181747
55655A81747K828K992K539J593J401K160K250R85O0P05J610J327O69P83R70L34
$$ 181747 184575 187567 190106 191699 193100 195260 197510 198495 198555 199260 200870 202197 202866 203649 204619 204953
55639B04953l28l42r23l074n487o535o657o880o778n848n094n205m969l438j869
$$ 204953 204625 204283 203360 200286 194799 188264 181607 174727 167949 162101 157007 151802 146833 143395 141526
55624A41526j533j471n99M2n90j089J26J824J888O63k04p85k046l320l373k861
$$ 141526 139993 138522 137923 137965 137375 136286 136412 138236 140124 140787 140583 139798 137752 134432 131059 128198
55608A28198l077l351k259n46j21r59j475j313j313j393q53k70o95j472j103J14
$$ 128198 125121 121770 119511 118965 118844 117885 116410 115097 113784 112391 111538 111268 110573 109101 107998 108112
55592A08112N64L6j13O36J339J262N58m67j340j186J65J486J826J955K749L385
$$ 108112 108676 108712 108599 109235 110574 111836 112394 111927 110587 109401 109566 111052 112878 114833 117582 120967
55576A20967K846K035K406L631M579N501P097Q430Q183P098O764O763N459L017
$$ 120967 123813 125848 128254 131885 136464 141965 149062 157492 165675 172773 179537 186300 191759 194776
55562A94776J050l32k460n224o872o885o757p441q057p653o528n352m401l894
$$ 194776 195826 195494 193034 187810 180938 174053 167296 159855 151798 144145 137617 132265 127864 123970
55548A23970l855l630k728j892k061k674k436j451r17j033q27%P18J010J356J861
$$ 123970 120115 116485 113757 111865 109804 107130 104694 103243 102326 101293 100466 100466 101184 102194 103550 105411
55532A05411K016J700J300R83O76N25M63p6j131j693j276j002j826k800k617j838
$$ 105411 107427 109127 110427 111410 112086 112611 113074 112998 111867 110174 108898 107896 106070 103270 100653 98815
55516I8815j809k290k121j473j382j696j463q76q30j029n65O9l69j505j723p07
$$ 98815 97006 94716 92595 91122 89740 88044 86581 85705 84875 83846 83281 83350 82981 81476 79753 79046
55500G9046L14P08Q61P29m4p51l80M27J97p94r43j29J63l66l50O38J274Q58L45
$$ 79046 79360 80068 80929 81658 81614 80863 80483 80910 81107 80313 79370 79241 79404 79038 78688 79326 80600 81458 81803
55481H1803L87L36p3N1R73J516R09J4j40K39M84M30Mr64j983k098j355r11j257
$$ 81803 82190 82526 82453 82504 83477 84993 85902 85916 85776 86015 86499 86929 86933 85969 83986 81888 80533 79622 78365
55462G8365j472p97J79N28K80J36M65J009J148N28k81r1J267K286J686K04o59
$$ 78365 76893 76096 76275 76803 77083 77219 77684 78693 79841 80369 80088 79997 81264 83550 85236 85440 84781
55445H4781q16j065j210n75K23K2p05m84N59Q59J66j01N74J030O21J36M2k50q25
$$ 84781 83965 82900 81690 81115 81338 81360 80655 80171 80730 81589 81755 81654 82228 83258 83879 84015 84057 83807 82982
55426H2982q30j90K6l99k81Q40J757J601J095J069J141P75J96m02j185j665q74
$$ 82982 82152 81962 81988 81589 81308 82148 83905 85506 86601 87670 88811 89586 89782 89380 88195 86530 85656
55409H5656P74J439M21q50j184j325k224l184l031j943q47K1Q21J244R58L18j45
$$ 85656 86430 87869 88290 87440 86256 84931 82707 79523 76492 74549 73702 73723 74544 75788 76746 77064 76919
55392G6919k97l3P51J473J160m1p87m18K80O08R25J382J220J62p26o02p8k7j87
$$ 76919 76622 76589 77340 78813 79973 79932 79145 78727 79007 79615 80540 81922 83142 83304 82578 81976 81898 81871 81684
55373H1684j2J91Jj83P6L21J9m65n13k33qJ45J18n05j502j770q26L04N43K28K43
$$ 81684 81672 81863 81864 81681 81757 82078 82097 81632 81119 80886 80878 81023 81141 80636 79134 77364 76538 76842 77385 77613 77856
55352G7856N14M26L7j26jJ03K10M84P75Q36O97M68J95J98P81J402R68o08k009
$$ 77856 78370 78796 78833 78707 78706 78809 79019 79503 80278 81114 81811 82279 82474 82672 83453 84855 85823 85215 83206
55333H3206k135j265k93K92K43n59j524j634q77l63n52n03M16J335J294P32N32
$$ 83206 81071 79806 79513 79805 80048 79489 77965 76331 75454 75091 74539 74036 74452 75787 77081 77813 78345
55316G8345N59K39k38l44j92j40J7N25R30P05O5n19j047j465j156J80J664K090
$$ 78345 78904 79143 78905 78561 78369 78229 78246 78771 79701 80406 80471 79952 78905 77440 76284 76464 78128 80218
55298H0218J248j43j255j418l73J095J527N17o76q39l02N1K42O92J040O92j9l10
$$ 80218 81466 81323 80068 78650 78277 79372 80899 81416 80740 79901 79599 79650 79892 80584 81624 82316 82297 81987
55280H1987j59j46m48q69j410k044k233j548m40L51P44J076J280J084O69M56M52
$$ 81987 81828 81682 81234 80365 78955 76911 74678 73130 72690 73041 73785 74861 76141 77225 77894 78350 78802
55263G8802L44Kn01j005j091l59Q09J427J190Q45R10Q96L41l07n05m49m27k00
$$ 78802 79146 79148 78647 77642 76551 76192 77001 78428 79618 80463 81373 82269 82610 82303 81798 81349 80922 80722
55245H0722K54K86l33p14j66O29P05K79J26K57K08O7J49K25M2L3N30Q91M29l73
$$ 80722 80976 81262 80929 80215 80049 80678 81383 81662 81788 82045 82253 82320 82469 82694 82736 82769 83299 84190 84619 84246
55225H4246o25m47n31q00o52j34K29M57Q85J215Q58K1n03m54j85J27M81N56J44
$$ 84246 83621 83174 82643 81843 81191 81057 81286 81743 82628 83843 84701 84722 84219 83765 83580 83707 84188 84744 84888
55206H4888k41k6M60M92P3l05o19j069j306q38k2M24N38Q36J181R85L41m8lM6
$$ 84888 84647 84621 85081 85573 85646 85341 84722 83653 82347 81509 81487 81911 82449 83285 84466 85451 85792 85744 85741 85787
55186H5787n9m1J03J72L52R36J582J647J145O04J68l28o82n85l56n22p84m00N25
$$ 85787 85728 85687 85790 85962 86314 87250 88832 90479 91624 92228 92396 92068 91386 90801 90445 89923 89139 88739 89264
55167H9264J062P61P5m77p27m73M22J502K047J979J747J433P58o5l84j01J38j45
$$ 89264 90326 91087 91162 90685 89958 89485 89907 91409 93456 95435 97182 98615 99373 99308 98924 98823 98961 98816
55149I8816p71j384j773j759j324q67p33n93M4Q27Q88R8o69o73o1O08R57Q28K41
$$ 98816 98045 96661 94888 93129 91805 90938 90205 89612 89656 90483 91371 91469 90800 90127 90066 90674 91631 92459 92700
55130I2700m72r16j028j006r51q30o58m10j0L80L85M5p8K56O00O36O57P79M92
$$ 92700 92228 91312 90284 89278 88327 87497 86839 86429 86419 86799 87184 87229 87151 87407 88007 88643 89300 90079 90571
55111I0571k79n49K97J280J155L19J22P52J164Q62M03K03N4j19p3J14J25J32M94
$$ 90571 90292 89743 90040 91320 92475 92794 92916 93668 94832 95694 96097 96300 96354 96235 96162 96276 96401 96533 97027
55092I7027Q55N36k24m09L15J195J434Q82k38j390j741r71K7K16j25MN70P18M78
$$ 97027 97882 98418 98194 97785 98100 99295 100729 101611 101373 99983 98242 97271 97298 97514 97389 97393 97963 98681 99159
55073I9159P78J628J822Q59k11l74O6M00O43J077J521J632J388P74l03j469j951
$$ 99159 99937 101565 103387 104246 104035 103661 103727 104127 104770 105847 107368 109000 110388 111162 110859 109390 107439
55056A07439j509p85l55j27P9Q9k03n22o59p02o57m22j85k46m25l27j99o99j719
$$ 107439 105930 105145 104790 104663 104742 104831 104628 104106 103447 102745 102088 101666 101481 101235 100810 100483 100284 99585 97866
55037I7866k342k158j681j341q94j81M56P93R91R46K58p58j020j10R94J199O25
$$ 97866 95524 93366 91685 90344 89450 89269 89725 90518 91509 92455 92713 91955 90935 90825 91819 93018 93643
55020I3643J23R7L45N81O20L81M9n6P0J95L59P09R18M73l07n07N7N66N17L55M73
$$ 93643 93766 93863 94208 94789 95409 95790 95839 95783 95853 96048 96407 97116 98034 98507 98200 97693 97750 98316 98833 99188 99661
54999I9661N51L97N17J133J495Q63l91j325j551j255o50k6J74n9j00M43J081J216
$$ 99661 100212 100609 101126 102259 103754 104617 104226 102901 101350 100095 99445 99419 99593 99534 99434 99877 100958 102174
54981A02174J068J196J516J468R02J94l07m73k23L25P15O13K80K05L96M10j6o41
$$ 102174 103242 104438 105954 107422 108324 108518 108211 107738 107515 107840 108555 109168 109448 109653 110049 110459 110443 109802
54963A09802j020r33n56k93l35l97r4N06R54J029Q76O10K29o6J6L18L29q7m81
$$ 109802 108782 107849 107293 107000 106665 106268 106174 106680 107634 108663 109539 110149 110378 110312 110328 110646 110975 110888 110407
54944A10407n24m06m03m56l81j45K12N63O25K38j93j23L24M63L0m96o24l01M05
$$ 110407 109883 109477 109074 108618 108237 108092 108304 108867 109492 109730 109537 109414 109738 110201 110231 109735 109111 108810 109215
54925A09215J420K340K662K517K559K909K963K527K380L280M880O137O442N955
$$ 109215 110635 112975 115637 118154 120713 123622 126585 129112 131492 134772 139652 145789 152231 158186
54911A58186N178M495L852K730P52j622l422m227m420m373m100l768l832m278
$$ 158186 163364 167859 171711 174441 175193 173571 170149 165922 161502 157129 153029 149261 145429 141151
54897A41151m384l700k705k146k125k213k113j816j379r11n34k14J70N72Q45J078
$$ 141151 136767 133067 130362 128216 126091 123878 121765 119949 118570 117659 117125 116911 117081 117653 118498 119576
54881A19576J487J999K319K395K422K473K565K896L552M175M520N061O227P262
$$ 119576 121063 123062 125381 127776 130198 132671 135236 138132 141684 145859 150379 155440 161667 168929
54867A68929O835M738K103j37k015l712m960n536n547n062m208l620l893m516
$$ 168929 175764 180502 182605 182468 180453 176741 171781 166245 160698 155636 151428 147808 143915 139399
54853A39399m373l414k742k865l037k637k071j838j760j631j645j688j169o3P92
$$ 139399 135026 131612 128870 126005 122968 120331 118260 116422 114662 113031 111386 109698 108529 108466 109258
54838A09258Q91O51M43M4n06o14k20q1m34n45q6J56l27q80q94p70q64o82j1L13
$$ 109258 110149 110800 111243 111287 110781 110167 109947 109866 109432 108887 108801 108957 108630 107750 106856 106086 105222 104540 104529 104842
54818A04842k06p28m73M3K44P23J856K399J145q59j517n47M72N92L60L73M82N55
$$ 104842 104636 103908 103435 103478 103722 104445 106301 108700 109845 108986 107469 106922 107394 107986 108346 108719 109201 109756
54800A09756P55R73Q99O90O85O48J27n94q51o72n48m45N4P82J175J231J392J580
$$ 109756 110511 111484 112383 113073 113758 114406 114533 113939 113088 112416 111868 111423 111477 112259 113434 114665 116057 117637
54782A17637J308O20J08P8M34J118J860J908R13j57p0R59J638J485J266J541J998
$$ 117637 118945 119565 119673 119751 120185 121303 123163 125071 125984 125827 125757 126716 128354 129839 131105 132646 134644
54765A34644K317K742L417M019M328M587N071N727O292O371N518L740J661k43
$$ 134644 136961 139703 143120 147139 151467 156054 161125 166852 173144 179515 185033 188773 190434 190191
54751A90191k209m400o132o630o196n803n812n932n967n719m582k406l74R8p51
$$ 190191 187982 183582 177450 170820 164624 158821 153009 147077 141110 135391 130809 128403 128029 128127 127376
54736A27376j418j211p47m98k05J47O6l52k45O73J549J629J225J028J268J915
$$ 127376 125958 124747 124000 123502 123297 123444 123510 123158 122913 123586 125135 126764 127989 129017 130285 132200
54720A32200K985M188M931N059N110N449N663N114L725J988M42p22j776l105m515
$$ 132200 135185 139373 144304 149363 154473 159922 165585 170699 174424 176412 176854 176132 174356 171251 166736
54705A66736n287n241n167n538n480m071k152j498k329l025k411j061l4L59J67
$$ 166736 161449 156208 151041 145503 140023 135952 133800 132302 129973 126948 124537 123476 123442 123801 123968
54690A23968o61j628j642k91J434K236J800O33o86j615j743j302j099j520k019
$$ 123968 123307 121679 120037 119746 121180 123416 125216 125849 125163 123548 121805 120503 119404 117884 115865
54675A15865j910j136p9Q42J093K99j028j672j075j4M27Q2m97q64q57m00L37Q47
$$ 115865 113955 112819 112740 113582 114675 114974 113946 112274 111199 111185 111612 111694 111197 110333 109476 109076 109413 110260
54657A10260Q09N03M10N87P13N40J33k26k57L3L27M02M28N95O76L97p8m47p88
$$ 110260 111069 111572 111982 112569 113282 113822 113955 113729 113472 113505 113832 114234 114662 115257 115933 116330 116252 115805 115017
54638A15017j172j120k70P21Q74L19M1K67K49k13k96L89J019Q31K36L3K32L40
$$ 115017 113845 112725 112455 113176 114050 114369 114410 114677 114926 114713 114417 114806 115825 116656 116892 116925 117157 117497
54620A17497J34l92j193j816j480j78J009J247R99J067J256Q40o8n89l92n8j46
$$ 117497 117631 117239 116046 114230 112750 112572 113581 114828 115827 116894 118150 118990 118922 118333 117941 117883 117737
54603A17737n18p38o66m75l65l95m88n24m38j83K97Q68J143Q85M14K41M03N70
$$ 117737 117219 116481 115815 115340 114975 114580 114092 113568 113130 112947 113244 114112 115255 116140 116554 116795 117198 117768
54585A17768O68Q51R18M47m03r21q06n25m70m88m03l83m65l06K07P26R93J152
$$ 117768 118436 119287 120205 120652 120249 119328 118522 117997 117527 117039 116636 116253 115788 115482 115689 116415 117408 118560
54567A18560J191Q06J36r7L36O53J97n39o39p3M65O13N44L92J15j78l20l87m67
$$ 118560 119751 120557 120693 120596 120932 121585 121782 121243 120604 120531 120996 121609 122153 122545 122660 122482 122162 121775 121308
54548A21308l54J77Q78J310J384J294J071O69K97K58N15P37P60O82N66L67M3m03
$$ 121308 120954 121131 122009 123319 124703 125997 127068 127737 128034 128292 128807 129544 130304 130986 131552 131919 131962 131559
54530A31559r89j593j912j750j287q48m90l2N63J036J119R01P93J027J257Q61
$$ 131559 130570 128977 127065 125315 124028 123180 122690 122658 123221 124257 125376 126277 127070 128097 129354 130215
54514A30215k44j397j954j948j701j180k83N92Q80O71M97M23K8o53r69n66J10
$$ 130215 129971 128574 126620 124672 122971 121791 121508 122100 122980 123651 124148 124571 124599 123946 122977 122411 122521
54497A22521M58L43l5m26n40k70K3o5k93j19L57M77O5l34l51j21K70Q71J281R94
$$ 122521 122979 123322 123287 122861 122321 122051 122074 122009 121716 121597 121954 122431 122496 122162 121811 121690 121960 122831 124112 125106
54477A25106M55O94J610J849Q90M5N20J563J644O91n3Q4O28R95J085Q59K38m90
$$ 125106 125561 126255 127865 129714 130604 130649 131169 132732 134376 135067 135014 135098 135726 136721 137806 138665 138903 138413
54459A38413p92n39q1K32L08J82J8O2K80K06m62j370j891j825j431j055r61j211
$$ 138413 137621 137082 137001 137233 137541 137723 137741 137803 138083 138289 137827 136457 134566 132741 131310 130255 129294 128083
54441A28083j402r19K47J276J446J002O96Q18J013Q46K89k40k15L82Q11M38k76
$$ 128083 126681 125762 126009 127285 128731 129733 130429 131247 132260 133106 133395 133155 132940 133322 134133 134571 134295
54424A34295k70N32J049O54K5nM34Q83J374J839J515n8j924k635j952q43l8N25
$$ 134295 134025 134557 135606 136260 136285 136280 136714 137597 138971 140810 142325 142267 140343 137708 135756 134913 134875 135400
54406A35400R97J240J189J026Q46N80J80l39q93j187q91k09K34K94O15J578K604
$$ 135400 136397 137637 138826 139852 140698 141278 141458 141119 140226 139039 138148 137939 138173 138467 139082 140660 143264
54389A43264K910K497J777Q71j42p59o59k62p8O8M18M39m76j791k238j355J33
$$ 143264 146174 148671 150448 151319 151177 150418 149759 149497 149419 149487 149905 150344 149868 148077 145839 144484 144617
54372A44617J376K085K314K224K105K129K140K086K347L164M082M507M524M501
$$ 144617 145993 148078 150392 152616 154721 156850 158990 161076 163423 166587 170669 175176 179700 184201
54358A84201M296L521K345J229P9j570l541m931n115m362l426k894k860k967k813
$$ 184201 188497 192018 194363 195592 195671 194101 190560 185629 180514 176152 172726 169832 166972 164005 161192
54343A61192k523k521k704k403j503q15q51j053q65p07j063j366r20j92m6k28
$$ 161192 158669 156148 153444 151041 149538 148723 147872 146819 145954 145247 144184 142818 141898 141706 141660 141432
54327A41432J29Q89J141P54M41M24K41j04q8K02R4m43o35j37N70J071J284Q77
$$ 141432 141561 142450 143591 144345 144786 145210 145451 145347 145259 145461 145555 145112 144477 144340 144910 145981 147265 148142
54309A48142m59k021k541j878j120q53n26J33M10q1n44k35L45L39j15k56J42O62
$$ 148142 147683 145662 143121 141243 140123 139270 138744 138877 139287 139206 138662 138427 138772 139111 138996 138740 138882 139544
54291A39544J002J144J068P51L52N6n7N1L00L91J26j85j24J02Kk79q7O18J108
$$ 139544 140546 141690 142758 143509 143861 143917 143860 143911 144211 144602 144728 144543 144419 144521 144523 144244 144157 144775 145883
54272A45883R24L62j75n86o58q7Q59J493J656J747J732J105O9l32K98J096J291
$$ 145883 146807 147169 146994 146408 145750 145663 146522 148015 149671 151418 153150 154255 154324 153992 154290 155386 156677
54255A56677J226J380J395Q25R6j67q3o9j6K78M08n0o95r07q89j284k000k275
$$ 156677 157903 159283 160678 161503 161599 161432 161349 161280 161264 161542 161950 161900 161205 160298 159409 158125 156125 153850
54237A53850j862j305j042q66m77j2J95J34J66O14J279J492Q43k03p55n51j47
$$ 153850 151988 150683 149641 148775 148298 148286 148481 148615 148781 149395 150674 152166 153009 152806 152051 151500 151353
54220A51353l6j37k36l10k70K6K62j32r94j399r78m63m55n02q7L15O6m07k42M05
$$ 151353 151317 151180 150944 150634 150364 150390 150652 150520 149526 148127 147149 146686 146231 145729 145642 145957 146023 145616 145374 145779
54200A45779O44L24J31L04K83j55m10o3L81K22m06p32l39L93P68M46l06r50j185
$$ 145779 146423 146747 146878 147182 147465 147310 146900 146837 147218 147440 147034 146302 145963 146356 147124 147570 147264 146314 145129
54181A45129j031o02m0L07J10l75m00K86R70R13L71J51M53Q08R27R80R97O86K8
$$ 145129 144098 143496 143456 143763 143873 143498 143098 143384 144354 145267 145638 145789 146242 147050 147977 148957 149954 150640 150668
54162A50668m71l66J90O89P93M77q1n58o48l68o7l7j72j42J43L88L14J49M17J192
$$ 150668 150197 149831 150021 150710 151503 151980 151899 151341 150693 150325 150258 150221 150049 149907 150050 150438 150752 150901 151318 152510
54142A52510J778J502O30N1Q4J96l9k87j39J59J97J42L90P40O04k6m88l67M6L54
$$ 152510 154288 155790 156420 156471 156555 156751 156712 156425 156286 156445 156642 156784 157174 157914 158518 158492 158004 157637 157683 158037
54122A58037N01N80N33M08M68P82J046J025R69J187J441J186L39n02p46l69K55
$$ 158037 158538 159118 159651 160059 160527 161309 162355 163380 164349 165536 166977 168163 168502 168000 167254 166885 167140
54105A67140P57R48Q21O51Q68J514J984J649P03O6M29J636L036M095M579M474
$$ 167140 167897 168845 169666 170317 171185 172699 174683 176332 177035 177101 177530 179166 182202 186297 190876 195350
54089A95350L895K875J187j199l560m808m708m107l730l340k549j691j220q47
$$ 195350 199245 202120 203307 202108 198548 193740 189032 184925 181195 177855 175306 173615 172395 171548
54075A71548j44M16P7p75r22n9Q56J139J272J863K645L058L092K986K649J944
$$ 171548 171404 171820 171897 171122 170200 170141 170997 172136 173408 175271 177916 180974 184066 187052 189701 191645
54059A91645J205R33J214J767K263K376J829P51l09r38j169j115p03k3N47P63
$$ 191645 192850 193783 194997 196764 199027 201403 203232 203983 203674 202736 201567 200452 199749 199726 200273 201036
54043B01036Q11R90J479K412L697M708M802M342M476N590O676O703N908N184M791
$$ 201036 201847 202837 204316 206728 210425 215133 219935 224277 228753 234343 241019 247722 253630 258814 263605
54028B63605M438M083L861L554K913K303K180K168J386k11j613j992j649j464
$$ 263605 268043 272126 275987 279541 282454 284757 286937 289105 290491 290280 288667 286675 285026 283562
54014B83562j864k559l021l068l049l468m284m790m438l607l195l516m022m091
$$ 283562 281698 279139 276118 273050 270001 266533 262249 257459 253021 249414 246219 242703 238681 234590
54000B34590l715l263k910k568k162j838j753j824j738j324q62q31j357k045k396
$$ 234590 230875 227612 224702 222134 219972 218134 216381 214557 212819 211495 210633 209802 208445 206400 204004
53985B04004k246j733j078n03j91k00m74q83j195j049l36M86P58L83q7j38K62
$$ 204004 201758 200025 198947 198444 198253 198053 197579 196696 195501 194452 194116 194602 195360 195743 195656 195518 195780
53968A95780Q57J373J540J304J142J707K994M292N075N547O113O842P768R180
$$ 195780 196637 198010 199550 200854 201996 203703 206697 210989 216064 221611 227724 234566 242334 251514
53954B51514J1138J2953J3528J2166Q822L939j587o431r302r681q174o171m916
$$ 251514 262652 275605 289133 301299 310121 314060 312473 306042 296740 287059 278885 272714 267798
53941B67798m561m152k818q49P15J370J531J779K314L065L732L766K970K039J780
$$ 267798 263237 259085 256267 255418 256133 257503 259034 260813 263127 266192 269924 273690 276660 278699 280479
53926B80479J903J533R02J294L000M563M747M132L968M368M643M784N453O878
$$ 280479 282382 283915 284817 286111 289111 293674 298421 302553 306521 310889 315532 320316 325769 332647
53912C32647Q559R885J0326R403P180M562K525J221K79m38q89j245j637j826j698
$$ 332647 341206 351091 361417 370820 378000 382562 385087 386308 386587 386149 385260 384015 382378 380552 378854
53897C78854j691k227l076l857m730n947p177p866q015q013p991p852p576p036
$$ 378854 377163 374936 371860 368003 363273 357326 350149 342283 334268 326255 318264 310412 302836 295800
53883B95800o011m823m349m772n039m255k961k196k004j858j893k518l286l431
$$ 295800 289789 284966 280617 275845 270806 266551 263590 261394 259390 257532 255639 253121 249835 246404
53869B46404l232l574m378m645m071l319k708j854p95l00p01j395j791j914j815
$$ 246404 243172 239598 235220 230575 226504 223185 220477 218623 217828 217528 216827 215432 213641 211727 209912
53854B09912j313o09l02m54m18L2J94m86j460j745j145l63j79p05j298j173k91
$$ 209912 208599 207990 207688 207234 206816 206848 207042 206556 205096 203351 202206 201843 201664 200959 199661 198488 198197
53837A98197M68L58k50m52p6K79K61Q6m2q5K23J056J865J872J225Q08Q78P67J25
$$ 198197 198665 199023 198773 198321 198245 198524 198785 198871 198829 198744 198967 200023 201888 203760 204985 205793 206671 207438 207563
53818B07563m76m88r6L48R17J739K559K986K798K017J142J179K636M568N425M933
$$ 207563 207087 206599 206503 206851 207768 209507 212066 215052 217850 219867 221009 222188 224824 229392 234817 239750
53802B39750M194L962L869L586L598M246M949M987M327L274K041J020P63J194
$$ 239750 243944 247906 251775 255361 258959 263205 268154 273141 277468 280742 282783 283803 284566 285760
53788B85760J631J860K301K751K163L62j137j052j79k14j428k714l412l836m188
$$ 285760 287391 289251 291552 294303 296466 296828 295691 294639 294460 294246 292818 290104 286692 282856 278668
53773B78668m176l825l649l879m193m386m636m954m937m315l349k536k153k105
$$ 278668 274492 270667 267018 263139 258946 254560 249924 244970 240033 235718 232369 229833 227680 225575
53759B25575k090j861j557j518j730j713j271r08j087j402j089j90M45L07k15
$$ 225575 223485 221624 220067 218549 216819 215106 213835 212927 211840 210438 209349 209159 209604 209911 209696
53744B09696m81l97k92l26l18m3M39Q04Q27O50N65N59L70oj60J44O01P85P20O92
$$ 209696 209215 208818 208526 208200 207882 207839 208278 209082 209909 210559 211124 211683 212053 212047 211887 212031 212632 213417 214137 214829
53724B14829P73Q41R58J307J760J893J544J118J192J876K647K866K433J877J762
$$ 214829 215602 216443 217401 218708 220468 222361 223905 225023 226215 228091 230738 233604 236037 237914 239676
53709B39676K115K506K613K506K445K593K875K979K580J792J278J589K493L202
$$ 239676 241791 244297 246910 249416 251861 254454 257329 260308 262888 264680 265958 267547 270040 273242
53695B73242L274K955K694K694K865K925K511J565N60K6j05k78n96p76q12j089
$$ 273242 276516 279471 282165 284859 287724 290649 293160 294725 295285 295311 295206 294928 294332 293556 292744 291655
53679B91655j704k234k321k092j819j556j256r50o52l80k93m87p20p48q04j240
$$ 291655 289951 287717 285396 283304 281485 279929 278673 277723 277071 276691 276398 275911 275191 274443 273639 272399
53663B72399j757j589n60O45J364J580J495J134N95K56M06Q82J183P70m93j853
$$ 272399 270642 269053 268493 269138 270502 272082 273577 274711 275306 275562 275968 276850 278033 278803 278310 276457
53647B76457k006n56J174J605R48O86J302J810J660J632K300K966K854K358K214
$$ 276457 274451 273895 275069 276674 277622 278308 279610 281420 283080 284712 287012 289978 292832 295190 297404
53632B97404K337K328K395K866L435L700L891M307M607M410M043L907L718L136
$$ 297404 299741 302069 304464 307330 310765 314465 318356 322663 327270 331680 335723 339630 343348 346484
53618C46484K632K753L095K913K377K208K401K316J876J701K111K819L553M234
$$ 346484 349116 351869 354964 357877 360254 362462 364863 367179 369055 370756 372867 375686 379239 383473
53604C83473M602M399L902L536L096K073P61J58O41J403J461P29j18m48k05R4
$$ 383473 388075 392474 396376 399912 403008 405081 405842 406000 406641 408044 409505 410234 410116 409668 409463 409557
53588D09557j82j058j858k071k041k402l067l321k813j938j295j193j597k174
$$ 409557 409375 408317 406459 404388 402347 399945 396878 393557 390744 388806 387511 386318 384721 382547
53574C82547k452k256j886j645j427j073p75o66m59N9N18N19L58N21P62M17n03
$$ 382547 380095 377839 375953 374308 372881 371808 371033 370367 369908 369967 370485 371004 371362 371883 372645 373062 372559
53557C72559j274j437j138n63K63J130J685J869J848J581R71L93M51J217K178
$$ 372559 371285 369848 368710 368147 368410 369540 371225 373094 374942 376523 377494 377887 378338 379555 381733
53542C81733K882L205L089K671K512L131M292N281N848O217O412O268O125O723
$$ 381733 384615 387820 390909 393580 396092 399223 403515 408796 414644 420861 427273 433541 439666 446389
53528D46389Q184R740J0650J0915J0890J0781J0743J0967J1484J2116J2783J3563
$$ 446389 454573 464313 474963 485878 496768 507549 518292 529259 540743 552859 565642 579205
53516E79205J4491J5592J7046J8888K0659K1799K2353K2809K3378K3908K4331
$$ 579205 593696 609288 626334 645222 665881 687680 710033 732842 756220 780128 804459
53505H04459K4613K4477K3781K3103K3069K3229K2477K0666J8913J8069J7737
$$ 804459 829072 853549 877330 900433 923502 946731 969208 989874 1008787 1026856 1044593
53494A044593J7166J6270J5366J4631J4304J4741J5746J6422J6231J5663J5378
$$ 1044593 1061759 1078029 1093395 1108026 1122330 1137071 1152817 1169239 1185470 1201133 1216511
53483A216511J5226J4807J4476J4910J5853J6131J4969J2757J0387Q315O439M495
$$ 1216511 1231737 1246544 1261020 1275930 1291783 1307914 1322883 1335640 1346027 1354342 1360781 1365276
53471A365276K303j95k928n706q256j0296j1688j2606j3423j4301j4926j4838
$$ 1365276 1367579 1367384 1364456 1358750 1350494 1340198 1328510 1315904 1302481 1288180 1273254 1258416
53459A258416j4122j3633j4299j6113j8008j8969j9160j9523k0359k0853k0269
$$ 1258416 1244294 1230661 1216362 1200249 1182241 1163272 1144112 1124589 1104230 1083377 1063108
53448A063108j9023j8110j7842j7740j7279j6216j4401j1899r234o936n011l272
$$ 1063108 1044085 1025975 1008133 990393 973114 956898 942497 930598 921364 914428 909417 906145
53436I06145j982j489j420j054l57J49N48J664L760N903P072P288P337P895R231
$$ 906145 904163 902674 901254 900200 899843 899992 900540 902204 905964 911867 918939 926227 933564 941459 950690
53421I50690J1253J3422J5058J6029J6836J7850J8984K0234K1859K3758K5336
$$ 950690 961943 975365 990423 1006452 1023288 1041138 1060122 1080356 1102215 1125973 1151309
53410A151309K6351K7300K8561K9814L0870L2367L4855L7657L9545M0352M1107
$$ 1151309 1177660 1204960 1233521 1263335 1294205 1326572 1361427 1399084 1438629 1478981 1520088
53399A520088M2659M4871M7140M9012N0216N0699N0863N1259N1901N2273N2100
$$ 1520088 1562747 1607618 1654758 1703770 1753986 1804685 1855548 1906807 1958708 2010981 2063081
53388B063081N1618N0888M9461M7087M4330M1961L9996L7896L5498L3180L0930
$$ 2063081 2114699 2165587 2215048 2262135 2306465 2348426 2388422 2426318 2461816 2494996 2525926
53377B525926K7956K3610J8294J2991Q141L463j335o261j1420j7052k3025k8840
$$ 2525926 2553882 2577492 2595786 2608777 2616918 2620381 2619046 2612785 2601365 2584313 2561288 2532448
53365B532448l4291l9524m4235m7481m8820m9043m9216m9500m9525m9379m9306
$$ 2532448 2498157 2458633 2414398 2366917 2318097 2269054 2219838 2170338 2120813 2071434 2022128
53354B022128m8842m7273m4847m2578m0816l9050l7221l6169l6329l6862l6667
$$ 2022128 1973286 1926013 1881166 1838588 1797772 1758722 1721501 1685332 1649003 1612141 1575474
53343A575474l5635l4350l3109l1774l0180k8196k5723k3026k0727j9081j7613
$$ 1575474 1539839 1505489 1472380 1440606 1410426 1382230 1356507 1333481 1312754 1293673 1276060
53332A276060j5851j3996j2506j1456j0764j0626j1150j1892j2324j2538j2949
$$ 1276060 1260209 1246213 1233707 1222251 1211487 1200861 1189711 1177819 1165495 1152957 1140008
53321A140008j3428j3301j2212j0491q725p307o336n566m545l147j891j281r68
$$ 1140008 1126580 1113279 1101067 1090576 1081851 1074544 1068208 1062642 1058097 1054950 1053059 1051778 1050810
53308A050810p8J632L542N121O523P966R167R930J0849J2738J5466J7947J9435
$$ 1050810 1050732 1052364 1055906 1061027 1067550 1075516 1084683 1094613 1105462 1118200 1133666 1151613 1171048
53295A171048K0294K1317K2698K4099K5341K6441K7090K6675K4996K2651K0447
$$ 1171048 1191342 1212659 1235357 1259456 1284797 1311238 1338328 1365003 1389999 1412650 1433097
53284A433097J8741J7455J6322J4887J2662R625O314L088l54m256p966j0433j1536
$$ 1433097 1451838 1469293 1485615 1500502 1513164 1522789 1529103 1532191 1531837 1527581 1519615 1509182 1497646
53271A497646j2268j3571j5514j7685j9844k1861k3451k4387k4793k5035k5366
$$ 1497646 1485378 1471807 1456293 1438608 1418764 1396903 1373452 1349065 1324272 1299237 1273871
53260A273871k5837k6346k6728k6860k6796k6710k6684k6639k6439k5948k5097
$$ 1273871 1248034 1221688 1194960 1168100 1141304 1114594 1087910 1061271 1034832 1008884 983787
53249I83787k4038k3116k2545k2280k2225k2292k2090k1101j9493j8217j7762
$$ 983787 959749 936633 914088 891808 869583 847291 825201 804100 784607 766390 748628
53238G48628j7285j5773j3705j2503j2483j2438j1407r830q553p668o901o458
$$ 748628 731343 715570 701865 689362 676879 664441 653034 643204 634651 626983 620082 613624
53226F13624o728p580q535r328r906j0219j0383j0737j1359j1862j2018j2187
$$ 613624 606896 599316 590781 581453 571547 561328 550945 540208 528849 516987 504969 492782
53214D92782j2654j2938j2241j0481q384o726n881n902o533p132p076o461o085
$$ 492782 480128 467190 454949 444468 436084 429358 423477 417575 411042 403910 396834 390373 384288
53201C84288o547p490p914p267o035n149m918m888m704m617m842m924m358l521
$$ 384288 377741 370251 362337 355070 349035 343886 338968 334080 329376 324759 319917 314993 310635 307114
53187C07114l280l732m115l968l589l206k555j628j098j426k024k050j548j301
$$ 307114 303834 300102 295987 292019 288430 285224 282669 281041 279943 278517 276493 274443 272895 271594
53173B71594j618j960j788j312j183j637k162k100j467q79o78n26j51k5o50j542
$$ 271594 269976 268016 266228 264916 263733 262096 259934 257834 256367 255488 254810 254284 254133 254108 253458 251916
53157B51916j714j080n11n26p29p07o33o80o35m15l14l70k36L3j99j056j669j379
$$ 251916 250202 249122 248611 248085 247356 246649 246016 245336 244701 244286 243972 243602 243366 243399 243200 242144 240475 239096
53139B39096p14n28o96m49M21J361J846J791J416J106J184J457J283M49m73r18
$$ 239096 238382 237854 237158 236709 237130 238491 240337 242128 243544 244650 245834 247291 248574 249023 248550 247632
53123B47632r97r82p07mP73J263J677K275K731K631K261K149K151J688O74l98
$$ 247632 246635 245653 244946 244942 245715 246978 248655 250930 253661 256292 258553 260702 262853 264541 265215 264817
53107B64817j194j747k140k410k630k714k370j646j096j001q46j23P92J214J140
$$ 264817 263623 261876 259736 257326 254696 251982 249612 247966 246870 245869 245023 244900 245692 246906 248046
53092B48046R56N96j99j065j338j027p34p06p18p20q00o11K04J083R26l51j485
$$ 248046 249002 249598 249399 248334 246996 245969 245235 244529 243811 243091 242291 241680 241884 242967 243893 243542 242057
53075B42057j428n83j08m83j222j608j370q04m29n16q27r29o75k99j34l69q64
$$ 242057 240629 240046 239938 239455 238233 236625 235255 234451 234022 233506 232679 231750 231075 230776 230642 230273 229409
53058B29409j159r27m73l81n54k81M69P13l7o82L9J636K438J793O06j69m65m94
$$ 229409 228250 227323 226850 226469 225915 225634 226103 226816 226779 226097 226136 227772 230210 232003 232609 232440 231975 231481
53040B31481k67O1J53O2J65L76J62n02r63q85p17q84j155j167r45n99l5O35R33
$$ 231481 231214 231275 231428 231490 231655 232031 232193 231691 230728 229843 229126 228242 227087 225920 224975 224376 224341 224976 225909
53021B25909O37K52M25J112J671J547P50j69n10l3Q16J397J589J636J499Q64j54
$$ 225909 226546 226798 227223 228335 230006 231553 232303 232134 231624 231591 232407 233804 235393 237029 238528 239392 239238
53004B39238r23j049p88n71m91m71m87n36o58j052j767k213j591k6J251J274M64
$$ 239238 238315 237266 236478 235907 235416 234945 234458 233922 233264 232212 230445 228232 226641 226615 227866 229140 229604
52987B29604J9M32J147J570J850K383K937K772J708O42N77J404K128K184J878
$$ 229604 229623 230055 231202 232772 234622 237005 239942 242714 244422 245064 245641 247045 249173 251357 253235
52972B53235J553J053L83K2J32J54j84k04N78J389J270O55O29J053P39n41j566
$$ 253235 254788 255841 256224 256246 256378 256532 256348 256144 256722 258111 259381 260036 260665 261718 262457 261916 260350
52955B60350j430o27n2jm64j430k378k421j548r24j420k427k797k331j690j270
$$ 260350 258920 258293 258241 258240 257776 256346 253968 251547 249999 249075 247655 245228 242431 240100 238410 237140
52939B37140q35j40O44J107R55L45j11N6O30R91R58Q14N95k9j004j711j727j282
$$ 237140 236305 236165 236809 237916 238871 239216 239105 239161 239791 240782 241740 242554 243149 243120 242116 240405 238678 237396
52921B37396p26j65K35K03j26k67j81l42p48o54K78J274J474J022M99q0r15j520
$$ 237396 236670 236505 236740 236943 236817 236550 236369 236027 235279 234625 234903 236177 237651 238673 239172 239092 238177 236657
52903B36657j144M9R51P55k58j220j498j029j88N40R32J082J054P42K00j65k5
$$ 236657 235513 235562 236513 237268 237010 235790 234292 233263 233075 233615 234547 235629 236683 237425 237625 237460 237435
52886B37435M25P45P91O99N05R3m77q93q96n47j40K17P36J592K412K551K020J669
$$ 237435 237860 238605 239396 240095 240600 240693 240216 239323 238427 237880 237740 237957 238693 240285 242697 245248 247268 248937
52868B48937K036K509K238J452J060J166J072O92Q16J637K115J392m6j257k148
$$ 248937 250973 253482 255720 257172 258232 259398 260470 261162 261978 263615 265730 267122 267076 265819 263671
52853B63671l051l656l349k347j621j697k148k360k248k127k257k620k943k918
$$ 263671 260620 256964 253615 251268 249647 247950 245802 243442 241194 239067 236810 234190 231247 228329
52839B28329k509k019j737j637j456r91k73L65N03J24k22p1L02L22O3J56P40J215
$$ 228329 225820 223801 222064 220427 218971 217980 217707 218072 218575 218699 218477 218406 218708 219030 219093 219249 219989 221204
52821B21204J119O77K32j64l89j68M08Q44R48R56Q27J93o91q53K4J010J245J047
$$ 221204 222323 223000 223232 223068 222679 222511 222919 223763 224711 225667 226494 226687 225996 225143 225167 226177 227422 228469
52803B28469J011Q23o0j181j589j258j008j152j251j086j025j250j371j070n83
$$ 228469 229480 230303 230243 229062 227473 226215 225207 224055 222804 221718 220693 219443 218072 217002 216419
52788B16419k87j71L8M66R29J081P43J45k28j12L20P60J019J009P71N47M97L40
$$ 216419 216132 215961 215999 216465 217394 218475 219218 219363 219135 219023 219343 220103 221122 222131 222902 223449 223946 224286
52770B24286j87o51l93K62J75r64k088k322k064j869j272K07J691J850Q25Q4M05
$$ 224286 224099 223448 223055 223317 223492 222528 220440 218118 216054 214185 212913 213120 214811 216661 217486 217570 217975
52753B17975J086J207P12J08j96k8N94J417K160K724K943K524J633J101J415J855
$$ 217975 219061 220268 220980 221088 220892 220864 221458 222875 225035 227759 230702 233226 234859 235960 237375 239230
52737B39230J485O17L81R59J299P41o1k45P6K53J49J96N79Q98O52j30q54j052
$$ 239230 240715 241332 241713 242672 243971 244712 244651 244406 244482 244735 244884 245080 245659 246557 247209 247079 246225 245173
52719B45173r86j320k095k514k023j132p21r15j232j441j573j378n15P51J669
$$ 245173 244187 242867 240772 238258 236235 235103 234382 233467 232235 230794 229221 227843 227328 228079 229748
52704B29748J863J512Q69J73j03L48J066J286R55O29M01j55r41j124l67N41P20
$$ 229748 231611 233123 233992 234165 234062 234410 235476 236762 237717 238346 238747 238592 237651 236527 236160 236701 237421
52687B37421L12K3N9Km39j023j253q45pO67P76N27L18P3n25j229j276n00K97L83
$$ 237421 237733 237756 237815 237817 237378 236355 235102 234257 234250 234917 235693 236220 236538 236611 236086 234857 233581 233081 233378 233761
52667B33761O1R3N39P35L06l45o10l39J99Q22J608K594L478L843L604L143K897
$$ 233761 233822 233915 234454 235189 235495 235150 234540 234201 234400 235222 236830 239424 242902 246745 250349 253492 256389
52650B56389K920K915K550J664K97j269k592l264l160k503j835j663j913j900
$$ 256389 259309 262224 264774 266438 266735 265466 262874 259610 256450 253947 252112 250449 248536 246636
52636B46636j175k72p9n47p15r7P58J288J684K211K599K725L033L580L358J581
$$ 246636 245461 245189 245110 244563 243848 243751 244509 245797 247481 249692 252291 255016 258049 261629 264987 266568
52620B66568r28k597l024k999k933k422j313k01L73M46K33j28l87l18j09l4Q1
$$ 266568 265640 263043 260019 257020 254087 251665 250352 250151 250524 250970 251203 251075 250688 250370 250261 250227 250308
52603B50308N11R40Q99O33P19R75Q03M33O36J173Q72m31j294p09M45P75L20J24
$$ 250308 250819 251759 252658 253291 254010 254985 255788 256221 256857 258030 258902 258471 257177 256468 256913 257688 258008 258132
52585B58132N12Q53P10L29M4j05r1K35Q28J261J055J76p54r11k15M18J24p45j080
$$ 258132 258644 259497 260207 260536 260580 260475 260384 260619 261447 262708 263763 263939 263185 262274 262059 262477 262601 261856 260776
52566B60776n98j52l59p28n91j80j69n85q45o44k69j24k68l99j81L70P72N94J10
$$ 260776 260178 260026 259667 258939 258348 258168 257999 257414 256569 255925 255656 255532 255264 254865 254684 255054 255826 256420 256530
52547B56530PM20P38N03N6p4Q3J47K8o6oJ55L53N38O36O43O04N07L21J54P5p1
$$ 256530 256537 256957 257695 258198 258254 258180 258263 258410 258438 258372 258366 258521 258874 259412 260048 260691 261295 261802 262123 262277 262352 262281
52525B62281l78m69O4Q47R91K57n95q57p11o88q31p66k42O89J782K593K712K213
$$ 262281 261903 261434 261498 262345 263336 263593 262998 262141 261430 260742 259911 259145 258903 259592 261374 263967 266679 268892
52507B68892J686J677K327L392M243L919J953p96k754l272l059k815k317j245
$$ 268892 270578 272255 274582 277974 282217 286136 288089 287293 284539 281267 278208 275393 273076 271831
52493B71831r9L25q9r24j780k303k127j401q82r86j123o07K83P34N89M32O68J152
$$ 271831 271732 272057 271968 271044 269264 266961 264834 263433 262551 261565 260442 259835 260118 260852 261441 261873 262541 263693
52475B63693J561J652J216K81o76j065o91J96J159J648J326O27N52J515K728L205
$$ 263693 265254 266906 268122 268403 267727 266662 265971 266167 267326 268974 270300 270927 271479 272994 275722 278927
52459B78927K934K580K393K125J697J285P84j34j467k815l805m215l857k852j855
$$ 278927 281861 284441 286834 288959 290656 291941 292725 292591 291124 288309 284504 280289 276432 273580 271725
52444B71725j484j615j668j416j047o17o5L91M00L3l38o29r60j125p71j63nl82
$$ 271725 270241 268626 266958 265542 264495 263878 263813 264204 264604 264637 264299 263670 262710 261585 260814 260651 260646 260264
52426B60264n48j4P20Q81M54Q5K55Q98J610J960J774J327J154J512K197K921L701
$$ 260264 259716 259702 260422 261303 261757 261842 262097 262995 264605 266565 268339 269666 270820 272332 274529 277450 281151
52409B81151M641N610O380O999P858R273J1039J2282J1855R130M585m25m589p368
$$ 281151 285792 291402 297782 304781 312639 321912 332951 345233 357088 366218 370803 370378 365789 358421
52395C58421q914r511r272q274o761n097l577k363j561j253j350j571j618j393
$$ 358421 349507 339996 330724 322450 315689 310592 307015 304652 303091 301838 300488 298917 297299 295906
52381B95906r71m53O8N55J125J929K848L439L521L515L846M276M360M383N081
$$ 295906 294935 294482 294550 295105 296230 298159 301007 304446 307967 311482 315328 319604 323964 328347 333428
52366C33428O314O845N786L688J714L38o47j280j380j123r88j113j180r98p38
$$ 333428 339742 346587 352373 356061 357775 358113 357466 356186 354806 353683 352695 351582 350402 349404 348666
52351C48666n53k88K79J149K038K522K257J395O66Q16J900L285M354M994N430
$$ 348666 348113 347825 348104 349253 351291 353813 356070 357465 358131 358947 360847 364132 368486 373480 378910
52336C78910N776N963O047O393P379Q899J0394J1556J2732J4353J6191J7578J8266
$$ 378910 384686 390649 396696 403089 410468 419367 429761 441317 454049 468402 484593 502171 520437
52323E20437J8578J8799J9061J9747K1184K2744K3093K1712J9554J7749J6364
$$ 520437 539015 557814 576875 596622 617806 640550 663643 685355 704909 722658 739022
52312G39022J5036J4053J3941J4398J4561J4133J3511J2903J2046J0836R588Q590
$$ 739022 754058 768111 782052 796450 811011 825144 838655 851558 863604 874440 884028 892618
52300H92618P890P421O961O121M826L654L051K422P00k242n423p962r719j0747
$$ 892618 900508 907929 914890 921011 925837 929491 932542 934964 935664 933422 927999 920037 910318 899571
52286H99571j0938j0475r861r171p891n904l932k543j290N25K706M513N871P424
$$ 899571 888633 878158 868297 859126 851235 845331 841399 838856 837566 838091 840797 845310 851181 858605
52272H58605R397J1152J2085J2467J2961J3665J4044J3710J2942J2301J1954J1557
$$ 858605 868002 879154 891239 903706 916667 930332 944376 958086 971028 983329 995283 1006840
52260A006840J0784R806R151R114R386R344Q653P555O569O001N778N648N301M317
$$ 1006840 1017624 1027430 1036581 1045695 1055081 1064425 1073078 1080633 1087202 1093203 1098981 1104629 1109930 1114247
52246A114247K208j153n219r077j2094j4127j5243j5541j5298j4912j4541j4005
$$ 1114247 1116455 1115302 1110083 1101006 1088912 1074785 1059542 1044001 1028703 1013791 999250 985245
52234I85245j3211j2409j1842j1334j0529r468q563p951p191n845m227l115k759
$$ 985245 972034 959625 947783 936449 925920 916452 907889 899938 892747 886902 882675 879560 876801
52221H76801k484j640n74r7j22L46J703L060L551L565L929M486M561M367M783
$$ 876801 874317 872677 872103 872006 871884 872230 873933 876993 880544 884109 888038 892524 897085 901452 906235
52206I06235N793O349N942N177M494L483K002Q96Q77J457J851K121K642L051K772
$$ 906235 912028 918377 924319 929496 933990 937473 939475 940371 941248 942705 944556 946677 949319 952370 955142
52191I55142K179K233L077L903M161M148M273M385M027K995J421l76k147l908
$$ 955142 957321 959554 962631 966534 970695 974843 979116 983501 987528 990523 991944 991568 989421 985513
52177I85513n818p766r251r880r735r084q070o838n651m553l297j856o75j20j9
$$ 985513 979695 971929 962678 952798 943063 933979 925909 919071 913420 908867 905570 903714 903039 902919 902900
52162I02900MK24R71K534M514N844N941N302M562L610K205Q26J32M0N9J04K70
$$ 902900 902904 903128 904099 906633 911147 916991 922932 928234 932796 936406 938611 939437 939569 939609 939668 939772 940042
52145I40042K19l01p18j85J202K489K989K761K171J633J575K135L074M342O261
$$ 940042 940261 939960 939242 939057 940259 942748 945737 948498 950669 952302 953877 956012 959086 963428 969689
52130I69689Q689J0752J2044J3378J5507J7826J9480K1006K3485K6601K8969L0168
$$ 969689 978378 989130 1001174 1014552 1030059 1047885 1067365 1088371 1111856 1138457 1167426 1197594
52118A197594L0939L1525L1342L0374K9316K8077K5620K1741J7676J4431J1728
$$ 1197594 1228533 1260058 1291400 1321774 1351090 1379167 1404787 1426528 1444204 1458635 1470363
52107A470363R109O777M699K075j377m544o264o827p291p899q093p629o925o474
$$ 1470363 1479472 1486249 1490948 1493023 1491646 1487102 1480838 1474011 1466720 1458821 1450728 1443099 1436174 1429700
52093A429700o512p064p943q895r930j1230j2715j4150j5634j7211j8099j7177
$$ 1429700 1423188 1416124 1408181 1399286 1389356 1378126 1365411 1351261 1335627 1318416 1300317 1283140
52081A283140j4545j1608r247o877l777l83K518N005P531R927J1719J2980J4058
$$ 1283140 1268595 1256987 1247740 1240863 1237086 1236703 1239221 1244226 1251757 1261684 1273403 1286383 1300441
52068A300441J4853J5147J5221J5463J5633J5274J4494J3680J2739J1314R534
$$ 1300441 1315294 1330441 1345662 1361125 1376758 1392032 1406526 1420206 1432945 1444259 1453793
52057A453793P830O201M366K481J037J07p46j792k977m380o305q866j1811j4837
$$ 1453793 1461623 1467824 1472190 1474671 1475708 1475815 1475069 1473277 1470300 1465920 1459615 1450749 1438938 1424101
52043A424101j7662j9909k1262k1848k2136k2460k2827k3036k2752k1627j9659
$$ 1424101 1406439 1386530 1365268 1343420 1321284 1298824 1275997 1252961 1230209 1208582 1188923
52032A188923j7375j5347j3671j2097j0546r173q093p353p135p622q634r668j0361
$$ 1188923 1171548 1156201 1142530 1130433 1119887 1110714 1102621 1095268 1088133 1080511 1071877 1062209 1051848
52019A051848j0745j1016j1209j1206j0926j0413r737q894p979p352p416q168
$$ 1051848 1041103 1030087 1018878 1007672 996746 986333 976596 967702 959723 952371 944955 936787
$$ [...]
##END NTUPLES=NMR SPECTRUM
##END=
