##TITLE=AC1531_ROEFFECT0008_8214028_5WJAKzEJno
##JCAMPDX= 6.0         $$ Bruker NMR JCAMP-DX V2.0
##DATA TYPE= NMR SPECTRUM
##DATA CLASS= NTUPLES
##ORIGIN= BRUKER
##OWNER= Administrator
$$ 1.72 TOPSPIN		Version 2.1
$$ 2013-10-04 20:35:19.689 -0700  Administrator@X
$$ Compression mode = diff/dup
##.OBSERVE FREQUENCY= 400.02188249412
##.OBSERVE NUCLEUS= ^1H
##.ACQUISITION MODE= SIMULTANEOUS (DQD)
##.ACQUISITION SCHEME= undefined
##.AVERAGES= 8
##.DIGITISER RES= 22
##SPECTROMETER/DATA SYSTEM= spect
##.PULSE SEQUENCE= zg30
##.SOLVENT NAME= COFFEE_meoh
##.SHIFT REFERENCE= INTERNAL, COFFEE_meoh, 1, 14.98509
##AUDIT TRAIL= $$ (NUMBER, WHEN, WHO, WHERE, PROCESS, VERSION, WHAT)
$$ ##TITLE= Audit trail, TOPSPIN		Version 2.1
$$ ##JCAMPDX= 5.01
$$ ##ORIGIN= Bruker BioSpin GmbH
$$ ##OWNER= Administrator
$$ $$ E:\/data/COFFEE/nmr/AC1531_ROEFFECT0008_8214028_5WJAKzEJno/10/pdata/1/auditp.txt
$$ ##AUDIT TRAIL=  $$ (NUMBER, WHEN, WHO, WHERE, PROCESS, VERSION, WHAT)
(   1,<2013-10-04 20:35:13.376 -0700>,<Administrator>,<X>,<go>,<TOPSPIN 2.1>,
      <created by zg
	started at 2013-10-04 20:34:06.892 -0700,
	POWCHK enabled, PULCHK disabled,
       configuration hash MD5:
       C8 4E 4E 5D D3 5C D8 9E 9F 52 82 E0 59 8A DE 15
       data hash MD5: 64K
       71 34 5B 17 25 E4 48 DA 46 24 04 A2 08 9B E3 85>)
(   2,<2013-10-04 20:35:16.189 -0700>,<Administrator>,<X>,<proc1d>,<TOPSPIN 2.1>,
      <Start of raw data processing
       efp LB = 0 FT_mod = 6 PKNL = 1 PHC0 = 0 PHC1 = 0 SI = 32K 
       data hash MD5: 32K
       74 47 3B 71 DC 15 60 59 A3 C3 FB 81 43 95 8E FE>)
(   3,<2013-10-04 20:35:16.485 -0700>,<Administrator>,<X>,<proc1d>,<TOPSPIN 2.1>,
      <pk PHC0 = 95.42175 PHC1 = 0 
       data hash MD5: 32K
       CF 49 1D 27 BC 64 3E 13 C5 23 B6 EF 63 37 40 3D>)
(   4,<2013-10-04 20:35:16.564 -0700>,<Administrator>,<X>,<proc1d>,<TOPSPIN 2.1>,
      <abs ABSG = 1 
       data hash MD5: 32K
       B4 47 83 8A D4 5F C3 B2 AD 45 5B FB 6B 56 17 EC>)
(   5,<2013-10-04 20:35:16.642 -0700>,<Administrator>,<X>,<proc1d>,<TOPSPIN 2.1>,
      <abs ABSG = 2 
       data hash MD5: 32K
       19 A5 60 79 6A 5C 59 DF 8E B7 32 0C 0C 6D 05 F4>)
(   6,<2013-10-04 20:35:16.704 -0700>,<Administrator>,<X>,<proc1d>,<TOPSPIN 2.1>,
      <abs ABSG = 3 
       data hash MD5: 32K
       DD EE 8B 7C B9 86 AB 18 A1 D5 0A E7 3D BC 2A 56>)
(   7,<2013-10-04 20:35:16.767 -0700>,<Administrator>,<X>,<proc1d>,<TOPSPIN 2.1>,
      <abs ABSG = 4 
       data hash MD5: 32K
       3F 30 2F 89 0C 3F 7C 8A 64 36 37 20 87 13 B3 7A>)
(   8,<2013-10-04 20:35:16.814 -0700>,<Administrator>,<X>,<proc1d>,<TOPSPIN 2.1>,
      <abs ABSG = 5 
       data hash MD5: 32K
       48 42 C7 8B 73 BC 22 EF 5A 5C 1D B0 47 FB 20 51>)
$$ ##END=
$$ 
$$ $$ hash MD5
$$ $$ A4 A4 B9 9B 9D 90 A5 72 BC 46 EE DB F1 B7 5A 5C
##$RELAX= 
##$RELAX= 
##$RELAX= 
##$RELAX= 
##$RELAX= 
##$RELAX= 
##$RELAX= 
$$ Bruker specific parameters
$$ --------------------------
##$DU= <E:\>
##$EXPNO= 10
$$ [...]
150 150 150 150 150 150 150 150
##$TP07= 0
##$TPNAME0= <>
##$TPNAME1= <>
##$TPNAME2= <>
##$TPNAME3= <>
##$TPNAME4= <>
##$TPNAME5= <>
##$TPNAME6= <>
##$TPNAME7= <>
##$TPOAL= (0..7)
0.5 0.5 0.5 0.5 0.5 0.5 0.5 0.5
##$TPOFFS= (0..7)
0 0 0 0 0 0 0 0
##$TUNHIN= 0
##$TUNHOUT= 0
##$TUNXOUT= 0
##$USERA1= <user>
##$USERA2= <user>
##$USERA3= <user>
##$USERA4= <user>
##$USERA5= <user>
##$V9= 5
##$VALIST= <valist>
##$VCLIST= <CCCCCCCCCCCCCCC>
##$VD= 0
##$VDLIST= <DDDDDDDDDDDDDDD>
##$VPLIST= <PPPPPPPPPPPPPPP>
##$VTLIST= <TTTTTTTTTTTTTTT>
##$WBST= 2048
##$WBSW= 25
##$XGAIN= (0..3)
0 0 0 0
##$XL= 0
##$YL= 0
##$YMAX_a= 638038
##$YMIN_a= -542742
##$ZGOPTNS= <>
##$ZL1= 120
##$ZL2= 120
##$ZL3= 120
##$ZL4= 120
##$ABSF1= 14.98509
##$ABSF2= -5.573092
##$ABSG= 5
##$ABSL= 3
##$ALPHA= 0
##$AQORDER= 0
##$ASSFAC= 0
##$ASSFACI= 0
##$ASSFACX= 0
##$ASSWID= 0
##$AUNMP= <proc_prof1d_extract_pilot.lims>
##$AXLEFT= 0
##$AXNAME= <>
##$AXNUC= <1H>
##$AXRIGHT= 0
##$AXTYPE= 0
##$AXUNIT= <>
##$AZFE= 0.1
##$AZFW= 0.1
##$BCFW= 0
##$BC_mod= 0
##$BYTORDP= 0
##$COROFFS= 0
##$CY= 15
##$DATMOD= 1
##$DC= 0
##$DFILT= <>
##$DTYPP= 0
##$F1P= 0
##$F2P= 0
##$FCOR= 0.5
##$FTSIZE= 32768
##$FT_mod= 6
##$GAMMA= 0
##$GB= 0
##$INTBC= 1
##$INTSCL= 1
##$ISEN= 128
##$LB= 0
##$LEV0= 0
##$LPBIN= 0
##$MAXI= 10000
##$MC2= 0
##$MEAN= 0
##$ME_mod= 0
##$MI= 0
##$NCOEF= 0
##$NC_proc= -8
##$NLEV= 6
##$NOISF1= 0
##$NOISF2= 0
##$NSP= 0
##$NTH_PI= 0
##$NZP= 0
##$OFFSET= 14.98509
##$PC= 1
##$PHC0= 95.42175
##$PHC1= 0
##$PH_mod= 1
##$PKNL= yes
##$PPARMOD= 0
##$PPDIAG= 0
##$PPIPTYP= 0
##$PPMPNUM= 2147483647
##$PPRESOL= 1
##$PSCAL= 4
##$PSIGN= 0
##$PYNMP= <proc.py>
##$REVERSE= no
##$SF= 400.02
##$SI= 32768
##$SIGF1= 0
##$SIGF2= 0
##$SINO= 400
##$SIOLD= 32768
##$SPECTYP= <>
##$SREGLST= <1H.CDCl3>
##$SSB= 0
##$STSI= 32768
##$STSR= 0
##$SW_p= 8223.68421052631
##$SYMM= 0
##$S_DEV= 0
##$TDeff= 65536
##$TDoff= 0
##$TI= <>
##$TILT= no
##$TM1= 0
##$TM2= 0
##$TOPLEV= 0
##$USERP1= <user>
##$USERP2= <user>
##$USERP3= <user>
##$USERP4= <user>
##$USERP5= <user>
##$WDW= 1
##$XDIM= 32768
##$YMAX_p= 444884988
##$YMIN_p= -720635
##$CURPLOT= <Network HP LaserJet P1505>
##$CURPRIN= <$Network HP LaserJet P1505>
##$DFORMAT= <normdp>
##$LAYOUT= <+/1D_H.xwp>
##$LFORMAT= <normlp>
##$PFORMAT= <normpl>
##$SURQMSG= 1
$$ End of Bruker specific parameters
$$ ---------------------------------
##NTUPLES= NMR SPECTRUM
##VAR_NAME=  FREQUENCY,     SPECTRUM/REAL,   SPECTRUM/IMAG
##SYMBOL=    X,             R,               I
##VAR_TYPE=  INDEPENDENT,   DEPENDENT,       DEPENDENT
##VAR_FORM=  AFFN,          ASDF,            ASDF
##VAR_DIM=   32768,         32768,           32768
##UNITS=     HZ,            ARBITRARY UNITS, ARBITRARY UNITS
##FACTOR=    0.250966925370066, 1,           1
##FIRST=     8223.43324360094, -214544,      -18749
##LAST=      0,             -77213,          -154450
##MIN=       0,             -720635,         0
##MAX=       8223.43324360094, 444884988,    0
$$ Real data points
##PAGE= N=1
##DATA TABLE= (X++(R..R)), XYDATA
$$ [...]
19558a73962P2958H1181K35565b87744c4431j91914K7662Q2728b660k30394h0407
19546a49209k34423B0219d49779b12802B01079D8320a27339o2899O2426j23995
19536b51807o3452a43933l5105l7919b2036k26738O4132A06402a9255B28737A7159
19524f9288k69739D9099c23400e5268H2453e47185g3189B29573g5050L38q4089
19513a58801j296E108L2884e8912p9933D6471d02789i9267j5721B74178B8797
19501a71748B61021E6081E560O8346e1313A86671a50316j44376B15880a7254k53364
19490b70618J26284B07260a39240C72493A84674h9334j51259B67229c40699a21809
19479A3826N875J64607H7888O5620B3021a82747A33652d1l2058m4667k31120a42289
$$ y = [-173962, -101004, 81181, 316746, -287744, -34431, -226345, -198683, -115955, -2660, -233054, -80407, -149209, -383632, 20219, -449779, -212802, 201079, 48320, -127339, -190238, -127812, -251807, -315259, -143933, -179038, -216957, -22036, -248774, -184642, 106402, -19255, 228737, 17159, -69288, -339027, 49099, -323400, -55268, 82453, -547185, -73189, 229573, -75050, -74712, -158801, -160097, 5108, 37992, -58912, -138845, 46471, -402789, -99267, -114988, 274178, 28797, -171748, 261021, 56081, 5560, 73906, -51313, 186671, -150316, -294692, 215880, -17254, -270618, -144334, 207260, -139240, 372493, 184674, -89334, -240593, 267229, -340699, -121809, 13826, 19701, 184308, 87888, 153508, 23021, -182747, 133652, -41, -32099, -76766, -307886, -142289]
19466D8073e44167b50423g2922o1770A42J12937h7317j33698p9289C3051a57331
19454a25547B08511b8711A85354a75194j32971Q4481B2705a54477A45526E623
19443a30953N3864l0817d5912H6387l3518k3939c1272l84607e1787B39629H0336
19431f4405k26047J35902F5045c37292a44876j03196A91529b50127J05276l25555
19421d70406A55076a8590H4781b64013R4390k31014a83445C20264j03128N5447
19411B72583j1726G5811b50803h1689p820o693b0084A16899h6605A42128c0499
19399b16690A71957b41668i7249c8256I3960a37618j54475a773E4201b34236A12831
19387A7202J21897b15580a07785j01615F2485b69371e2475B22316i9187C04712
$$ y = [48073, -544167, -250423, -72922, -134692, 142, 113079, -87317, -221015, -300304, 33051, -157331, -125547, 208511, -28711, 185354, -175194, -308165, -223684, 22705, -154477, 145526, 5623, -130953, -77089, -107906, -45912, 86387, 52869, 28930, -31272, -415879, -51787, 239629, 80336, -64405, -290452, -154550, 65045, -337292, -144876, -248072, 191529, -250127, -144851, -470406, 155076, -18590, 84781, -264013, -169623, -400637, -183445, 320264, 217136, 272583, 260857, 75811, -250803, -81689, -89509, -96202, -20084, 116899, -86605, 142128, -30499, -216690, 171957, -241668, -97249, -38256, 93960, -137618, -292093, -1773, 54201, -234236, 112831, 17202, 139099, -215580, -107785, -209400, 62485, -269371, -52475, 222316, -99187, 304712]
19376D2779a58640j98466I710b03218A33349a10448q4480C96417D9823b6580o128
19365c2708E5088e67784K22462B87418a8912B7535J5790c20569J26794L7485M8591
19354a07699D2672j8571f8088E7512c85305A52992a36469m2728k0513O8992r1865
19343b22583D228e1541j50181G7656d1582A86964e28281a14670l6378b9356j02644
19332a32000A17751L5257a0265j18878G6483J51329b66526k329F7140K777a57406
19320c2688l66862e2760j97093J10877F4490Q9376C6564b09884d4804P402j8029
19309e5431j21477d8935j66829C68634b55904J08853F6604e6168m6256p942b5877
19297i3814a2857B6508G593a6240A8697R1585a56399A85656a23866d6406l79757
$$ y = [42779, -158640, -357106, 9710, -203218, 133349, -110448, -194928, 396417, 49823, -26580, -32708, 55088, -567784, -345322, 287418, -18912, 27535, 43325, -320569, -193775, -156290, -107699, 42672, 24101, -68088, 57512, -385305, 152992, -136469, -179197, -199710, -130718, -222583, 4228, -51541, -201722, 77656, -41582, 186964, -528281, -114670, -151048, -29356, -132000, 117751, 153008, -10265, -129143, 76483, 227812, -266526, -268855, 67140, 69917, -157406, -32688, -399550, -52760, -249853, -138976, 64490, 153866, 36564, -209884, -44804, -37402, -55431, -176908, -48935, -215764, 368634, -255904, -147051, 66604, -56168, -102424, -110366, -25877, -93814, -12857, 26508, 7593, -16240, 18697, 110282, -156399, 185656, -123866, -46406, -426163]
19286d26163a6439A46480a07892L5155l4820i648j62010k6603A0602J63347n5572
19275A18377a26466A81836a03764C3387g8810F8947a71983N6403d5901A54995
19264b17580q4266g2528h198C0689a66901O0912M6475A582b02865G5136b6918
19252a9032A23121d715B7073K61392b42791B25338a76827b9291k5835I0970a36175
19240e3991B6068c06141B37426i0769o7526E6613M12226i0004l2653b3067o4l7458
19228f0589k83101a01497b6512m0037r8061B5288I461L5152k089b35186Q3651
19217a51535M3649b5940l09546B24022d03480A1627e3511b1267A3597c43558J03907
19206b39651A03644c3682F366c8044A14068a47717H1824b1057C42347b6594G3159
$$ y = [-426163, -16439, 146480, -107892, -72737, -107557, -9648, -171658, -198261, 10602, 173949, 118377, -126466, 181836, -103764, 33387, -78810, 68947, -171983, -115580, -45901, 154995, -217580, -301846, -72528, -8198, 30689, -166901, -105989, -59514, 1582, -202865, 75136, -26918, -19032, 123121, -4715, 27073, 288465, -242791, 225338, -176827, -29291, -55126, 90970, -136175, -53991, 26068, -306141, 237426, -90769, -158295, 56613, 468839, -90004, -122657, -23067, -23131, -60589, -343690, -101497, -26512, -66549, -164610, 25288, 9461, 44613, 42524, -235186, -151535, -107886, -25940, -335486, 224022, -403480, 11627, -53511, -21267, 13597, -343558, -239651, 103644, -33682, 6366, -38044, 114068, -147717, 81824, -21057, 342347, -26594, 73159]
19194g7287B41994r434a11534M7940q9455l40943C2932a87644Q0001M574A00635
19182b94693f2065A32393o0135c6526A04487i887M147l10075c4089q4699L6088
19171h2700k62601C81684b09495O6820P1317l70068a22298o2042c8142j61343
19161a99485B09568K0153A03025b43962g2970n4610p3093b8346A46917f7472B4398
19149c25287F1023a4090A17883a29862A61250b80766o3456h4208j58741j06903
19139c49852a71119k08216i4627j5519f421j3967H10b5949k43970b091l5317j7196
19127e4604C2811Q3743C3988p050J07609a69119A76974F9229Q3729N447a71620
19115e2938j16514d2401H0825g8046A77626H6361l3245M4340d01311E9059c03823
$$ y = [-77287, 241994, 232560, -111534, -63594, -153049, -493992, 32932, -187644, -107643, -103069, 100635, -294693, -62065, 132393, 72258, -36526, 104487, -9887, -5740, -315815, -34089, -118788, -82700, -345301, 381684, -209495, -142675, -71358, -441426, -122298, -184340, -38142, -199485, 209568, 229721, 103025, -243962, -72970, -127580, -200673, -28346, 146917, -67472, 24398, -325287, 61023, -14090, 117883, -129862, 161250, -280766, -344222, -84208, -242949, -349852, -171119, -379335, -94627, -110146, -6421, -20388, 810, -25949, -269919, -2091, -37408, -54604, 32811, 116554, 33988, 26938, 134547, -169119, 176974, 69229, 152958, 158405, -171620, -52938, -169452, -42401, 80825, -78046, 177626, 86361, 53116, 97456, -401311, 59059, -303823]
19103b64279J32055j54577A70331F7141a3582j07729K5110j07051r1801B42906
19092b16427H354J69099c87658G0809J35501H204J27526a43295k19858a4319F1201
19080a08963j10711J01392e2798m6095k3075D1797i1594d3381E5356a38704B2365
19068I3668m0516P2531c08732A24370K81782e715l5604E6375c53780a53461C962
19056b95169G7608O2888b03095o3702N7430h0866G3073R760h0240c0851A53863
19044a94413P1015b3681E7721a59551P6268a2555D1625K09725b30635h3110I2645
19032F4454k0569a62856C00730g652n5004j94563I169L23530c8688j9167l7210
19021i5065M5759A73087a34275B3170b38590h1753I304L3736Q5040a06772G8738
$$ y = [-264279, -132224, -286801, 170331, 67141, -13582, -121311, -96201, -203252, -295053, 242906, -216427, 8354, 177453, -387658, 70809, 206310, 8204, 135730, -143295, -363153, -14319, 61201, -108963, -219674, -118282, -52798, -98893, -121968, 41797, -91594, -43381, 55356, -138704, 22365, 93668, 53152, 125683, -308732, 124370, 406152, -5715, -41319, 56375, -353780, -153461, 3962, -295169, 77608, 140496, -203095, -266797, -209367, -80866, 73073, 82833, -80240, -30851, 153863, -194413, -123398, -23681, 57721, -159551, -83283, -12555, 41625, 251350, -230635, -83110, 92645, 64454, 43885, -162856, 300730, -7652, -62656, -257219, 9169, 332699, -38688, -57855, -95065, -49306, 173087, -134275, 23170, -238590, -81753, 9304, 43040, 128080, -106772, 78738]
19009B4037K7355b18546A67556i7591A64970K11777E1290J58798a19646I2013
18998g3466k20336g3529J7966F5957N8551K13054A66315a04701b1075A49255o4292
18987H4963g8885A92629K80F2410J21064d23254B5184e9927l23383C739N0966
18976E4705J78439a24545p3463B75690b19835j59598A04996a40099j18993H693
18965i3808j03419D0201c31140J63358A85178a30612B39186f2607a4385A39103
18954a08079j67194e8528A10646A0186M679a22843B14621d3687j13201k58509
18944d15397J19135G5332a22397D52590a88328D9012b49426Q8688f8488J3435
18934e5053A802L5569h9136n0006p2231E7044J38564a54851B6977a37407a6845
$$ y = [24037, 51392, -218546, 167556, -97591, 164970, 376747, 51290, 210088, -119646, 92013, -73466, -293802, -73529, -55563, 65957, 124508, 337562, 166315, -104701, -21075, 149255, 84963, -78885, 192629, 192909, 62410, 183474, -423254, 25184, -59927, -383310, 3739, 54705, 233144, -124545, -198008, 275690, -219835, -379433, 104996, -140099, -259092, 8693, -93808, -197227, 40201, -331140, -167782, 185178, -130612, 239186, -62607, -14385, 139103, -108079, -275273, -58528, 110646, 10186, 14865, -122843, 214621, -43687, -156888, -415397, -296262, 75332, -122397, 452590, -188328, 49012, -249426, -160738, -68488, -55053, 1802, 37371, -89136, -139142, -211373, 57044, 195608, -154851, 26977, -137407, -16845]
18922A79167e4614F3433d2917b286n2535m7067G535K6869L94150p1468H6435a62496
18909D4140a39482A78224h0653n2009A28567g6760H1967f9862o1147k84333a07463
18897B25189I5958a52897I5584m3720a33701m6600O6123A78091a02329M4032R551
18886d8746G7997J25877c50841A4797R6839J07516g9153p8528A38783n2633d06640
18874A2004b3157q4320C3862c97679I3416a68769N7745a0249n2153n511k14858
18863b82771A51454n3407b11897P5521j94627a19615e6401A44040j9956P5440
18853A99524H4477K81878a33914F1001b06876g0808A06624E2097K6336B8154J84762
18842B12916D4352a56806j61957A63121o9297N6344D338e908m5929A4485K00914
$$ y = [179167, -54614, 63433, -42917, -2286, -54821, -101888, 7535, 34404, 428554, 357086, 86435, -162496, 44140, -139482, 178224, -80653, -132662, 128567, -76760, 81967, -69862, -131009, -415342, -107463, 225189, 95958, -152897, 95584, 51864, -133701, -180301, -114178, 178091, -102329, -58297, -48746, 77997, 203874, -350841, 14797, 111636, 219152, -79153, -157681, 138783, 86150, -406640, 12004, -23157, -107477, 33862, -397679, 93416, -168769, -111024, -10249, -62402, -67913, -282771, 151454, 98047, -211897, -136376, -331003, -119615, -56401, 144040, 124084, 199524, 84477, 366355, -133914, 61001, -206876, -70808, 106624, 52097, 78433, 28154, 212916, 44352, -156806, -318763, 163121, 93824, 150168, 4338, -5908, -51837, 14485, 215399]
18831B15399c057A81736c24550D4810d71523a79873H0803J18210k8079c06036
18820i0784B65410b43638f702G0252N6050b40036A2034a93707O2401D18685j01791
18809C16894A40710o5837B6333c33038J30466i6177d5479l66847J26216d9802
18798h45q4176a2330D3668L4447J00010i4033d174n1716A03700C5113b09638j71927
18786c81565E9331c26019b1621o6198p4060n106h0623p3697F0072a95832e4512
18774g9746J6442a9002r2145r741d5588r1162A6743b01726A96879e7050k28128
18763b85178f5142A64296J474M4269a05443c395j01381k33614b0931p9186A09761
18751C24798b20043o9385a2083m9104k39953C6824O549L80a4106j0346m1148c757
$$ y = [215399, -3057, 181736, -324550, 44810, -471523, -179873, 80803, 199013, 170934, -306036, -90784, 265410, -243638, -6702, 70252, 126302, -240036, 12034, -193707, -131306, 418685, 316894, 140710, 74873, 26333, -333038, -202572, -96177, -45479, -412326, -286110, -49802, -845, -85021, -12330, 43668, 78115, 178125, -94033, -4174, -55890, 103700, 35113, -209638, -381565, 59331, -326019, -21621, -87819, -161879, -166985, -80623, -154320, 60072, -195832, -54512, -79746, -63304, -19002, -111147, -120888, -45588, -136750, 16743, -201726, 196879, -57050, -285178, -65142, 164296, 165770, 210039, -105443, -3395, -104776, -338390, -20931, -100117, 109761, 324798, -220043, -289428, -12083, -61187, -301140, 36824, 43373, 43753, -14106, -24452, -65600, -3757]
18738a63281g7423A51396d08108f2721A58853D4070a1257A34467a31963j13858
18728b45821j01133B92282j35508M8552a31677K3417l3683F2119J3453c00567
18717c15922J14906I7335a77898f869k56134f8918A8632B011M6989a88656B2184
18705e2054j78741i7996M71L699K2246a6294l3422j49755E1730a1141l54581J64251
18693b01471l188A95553c13846C9427b60917k22104J84639J32862B00969b04251
18682B6557a32684A23387a79162h8708n0976I3421a29976E8035b73734b1766j60679
18671a82445c5051j29221B00634A5315J24238f4571G0738c5704A16779a74056
18660c24171a37576C4061K57130b02186B1789a48123C0304J14463a30992A70229
$$ y = [-163281, -77423, 151396, -408108, -62721, 158853, 44070, -11257, 134467, -131963, -245821, -346954, 292282, 156774, 205326, -131677, -108260, -141943, 62119, 75572, -300567, -315922, -201016, 97335, -177898, -6869, -263003, -68918, 18632, 2011, 49000, -188656, 22184, -52054, -230795, -97996, -97525, -93826, -71580, -16294, -49716, -199471, 51730, -11141, -365722, -201471, -204659, 195553, -313846, 39427, -260917, -483021, -298382, -165520, 200969, -204251, 26557, -132684, 123387, -179162, -88708, -139684, 93421, -129976, 58035, -273734, -21766, -182445, -35051, -164272, 200634, 15315, 139553, -64571, 70738, -35704, 116779, -174056, -324171, -137576, 34061, 291191, -202186, 21789, -148123, 30304, 144767, -130992, 170229]
18649I9346L6410F166K1408K6747K38155C715e6869H0411c753j5875j25740A79422
18636D2271g4707Q14j87966J7985d9863A52457m8064e1365k7176j98057H5660
18624a53367A47304G2261a45967r9421B77322d67192j2101a52463K5980D0505
18613e07087g87k31716R7251H3432H292c11182i9480l33966B63961f838C5976
18601a77592D9279a5296j58443A7363J89933f2557l489A62078c48781a72784B52376
18589a84597j27717B1488A869Q8130a85881C639b59493C7122a93711A50762h9886
18577b94605e1776A7411o378J14830b37547L1396f0742b1195n9124c7880D5101
18565a6932j55374N8890l79836e7056o6912F621h3359j10223A73054C3281b10338
$$ y = [99346, 135756, 6166, 27574, 54321, 292476, 3715, -56869, 80411, -3753, -19628, -145368, 179422, 42271, -74707, -73893, -261859, -243874, -49863, 152457, 104393, -51365, -78541, -276598, 85660, -153367, 147304, 72261, -145967, -245388, 277322, -467192, -479293, -152463, -126483, 40505, -507087, -787, -232503, -135252, 83432, 8292, -311182, -99480, -433446, 263961, -6838, 35976, -177592, 49279, -15296, -173739, 17363, 207296, -62557, -66046, 162078, -348781, -172784, 252376, -184597, -312314, 21488, 1869, 89999, -185881, 3639, -259493, 37122, -193711, 150762, -89886, -294605, -51776, 17411, 11033, 125863, -237547, -206151, -60742, -21195, -80319, -37880, 45101, -16932, -172306, -113416, -493252, -57056, -123968, 6621, -83359, -193582, 173054, 33281, -210338]
18553A09792c269o6245L0159A45351c17751B75772i970k78537a13572j33199a7231
18541a47461D5369R2141g9768l00157k1523b6731q0175k98766b0877n8925C15497
18529G3771b44310L6051L4634B8931J6499b67417a3767B05798a07103C0640P7638
18518A08278j5077P510a63613J0123j40810D8753b37207I5217a16214j30566K5455
18507b21325B7400b20122G0337J53280f6304C7095A2662R6013a72203k3418A40967
18495b06497j327f424l26945Q4792J08238B48117g3299C5414J8720a03938A22301
18483a12669m5387H4634j8651a44928D5776b05309g6079B54630e7155m3250j24174
18472b24579P3673A70900D2155d7206j10369A57237d586G1385e3887B32372K4588
$$ y = [109792, -3269, -69514, -39355, 145351, -317751, 275772, -9970, -288507, -113572, -246771, -17231, -147461, 45369, 137510, -79768, -379925, -401448, -26731, -106906, -405672, -20877, -79802, 315497, 73771, -244310, -208259, -173625, 28931, 45430, -267417, -13767, 205798, -107103, 30640, 108278, 93201, 100711, -163613, -153490, -294300, 48753, -237207, 95217, -116214, -246780, -221325, 27400, -220122, 70337, 223617, -66304, 37095, 12662, 108675, -172203, -195621, 140967, -206497, -207824, -6424, -333369, -248577, -140339, 248117, -73299, 35414, 54134, -103938, 122301, -112669, -158056, 84634, 65983, -144928, 45776, -205309, -76079, 254630, -57155, -100405, -224579, -150906, 170900, 42155, -47206, -157575, 157237, -4586, 71385, -53887, 232372, 256960]
18461B56960b7833B12897n275D4597K3159c61195B67818a63551C6440h0585b6713
18449c4775j51449j6254I400m520a2566j7507j86336A8864c2695B5692a80326
18437f1280B13348E0262f3283H4374a10860k10650L4176C13211b52575L232h9043
18425b31090k0244A4033Q7564a84400j30056a00814N988r3364c0922D1753l254
18414C8499b50916N7124c5318B83916e174A06610e9562C163O4775J885c46502
18402C48620b32397C05838D0874a34359e0953E6845K4514N5947h0368A65030a08573
18390b95879B24692J09318c9258A37187B6238a80046A48481F5944Q0246a01975
18379e3874k6562B7985O8829D4866d2555a8396B4599K7885b72920A0664M872O5863
$$ y = [256960, -27833, 212897, 207622, 44597, 67756, -361195, 267818, -163551, 36440, -80585, -26713, -34775, -186224, -202478, 9400, 4880, -12566, -30073, -216409, 18864, -32695, 25692, -180326, -61280, 213348, 50262, -63283, 84374, -110860, -321510, -287334, 313211, -252575, -249343, -89043, -231090, -251334, 14033, 101597, -184400, -314456, -100814, -94826, -188190, -30922, 41753, 38499, -250916, -193792, -35318, 283916, -5174, 106610, -59562, 3163, 67938, 69823, -346502, 348620, -232397, 305838, 40874, -134359, -50953, 56845, 81359, 137306, -80368, 165030, -108573, -295879, 224692, 334010, -39258, 137187, 26238, -180046, 148481, 65944, 146190, -101975, -53874, -80436, 27985, 96814, 44866, -42555, -18396, 24599, 52484, -272920, 10664, 15536, 81399]
18367H1399a61574O8638k11630A80500A5120g4206A05949Q0528a91010d5352j01892
18356a47244o1089j16927b5039k25843R2041A0582a51834l314q2180I5733a75780
18344C4256K28409a06537A30178b26310B2609M4340B8499a03093c2117A75654
18333b33890F2378k4095m482b2406r9372i557m60998A67252Q9021A7444b01626
18321g4847I2040e1950A01846k8510C4814d65776c9142A35322c33600J10336m9988
18310b73252A37836C0079J08962d47400A24020k7056b77039c3232C8259J7173
18300E5432b47262b0592K607l8806J7477k23103C2467b18683c5300o7070m5149
18289a47519D64991n8090g9681B82928a04036B9469a09058A37036o2690J52571
$$ y = [81399, -161574, -92936, -304566, 180500, 15120, -74206, 105949, 186477, -191010, -45352, -147244, -208333, -325260, -25039, -250882, -158841, 10582, -151834, -155148, -237328, 95733, -175780, 34256, 262665, -106537, 130178, -226310, 22609, 66949, 28499, -103093, -32117, 175654, -233890, 62378, 38283, 33801, -22406, -121778, -9557, -470555, 167252, 256273, 17444, -201626, -74847, 92040, -51950, 101846, 73336, 34814, -465776, -39142, 135322, -333600, -223264, -273252, 137836, 30079, 139041, -447400, 124020, 96964, -277039, -33232, 38259, 55432, -247262, -20592, -17985, -56791, -39314, -262417, 32467, -218683, -35300, -102370, -147519, 464991, 406901, -79681, 282928, -104036, 29469, -109058, 137036, 74346, 226917]
18279B26917c6813m8094F725P8725J79194a64141l6904H5898M5887a03214k23427
18268c26641C55884G8746m416d8581B981i781j06244M5937m58193a67956B61095
18256a43184O06d4264A78165h373j46022p9205d0177B63400I1530f9878k45947
18245c15825Q3417p6005h0685a9022E3252a01864n8344E2615O4610R0800b58540
18233a36796q633c3134H3672c62307g6063c7311J5458j47538k0629A11321D3365
18221F0322c1795j8373F9894e7935r8985j82268A50099a75801M5044J0905b6782
18209a0433l32975e3781m6386H4928f0045j42612A28250J09104a20963G7250P2700
18198A49950m2421C8315J00092L3667A6762a84133B4740d07k80161g8477l2364
$$ y = [226917, -36813, -84907, 6725, 85450, 264644, -164141, -201045, 85898, 131785, -103214, -326641, 355884, 78746, 74330, -48581, 2981, -9781, -116025, -70088, -528281, -167956, 261095, -143184, -142578, -44264, 178165, -8373, -154395, -233600, -40177, 263400, 91530, -69878, -315825, -232408, -308413, -80685, -19022, 53252, -101864, -160208, 52615, 117225, 208025, -258540, -136796, -145429, -33134, 83672, -362307, -76063, -37311, -21853, -169391, -190020, 111321, 43365, 60322, -31795, -50168, 69894, -57935, -156920, -339188, 150099, -175801, -130757, -119852, -26782, -10433, -343408, -53781, -100167, 84928, -60045, -202657, 128250, 237354, -120963, 77250, 149950, 107529, 38315, 138407, 172074, 16762, -184133, 24740, -407, -280568, -78477, -110841]
18187a10841j6863F7543a51126l9882h3661c7485k63491e5313G6230a2078I7119
18175A82224a76425j8220h8093b4733B3288b90680D4114b15588B22722F333K45107
18164B51440b09152M3568c5005A63740h400E0256J32075o6423a51336A22019J22197
18153B44216D9754a60053n4879B43743h1828l2190A36431e499A19354a99707B26160
18141h8249l98345A0035b87631B28394h8307n7768L76A52527a54622d3351A08399
18129d4962C4267c37687B33304h2844n5503A65300Q522i4352B51790a89278a5820
18117a33076n4781B6446b84010d370k31898O5765c7111A01373b64893A82860a73807
18105A5932l66g1417K424F6303a95040G2414d28775a421j41914j11583F2073M6698
$$ y = [-110841, -127704, 67543, -151126, -191008, -83661, -37485, -300976, -55313, 76230, -12078, 97119, 182224, -176425, -194645, -88093, -24733, 23288, -290680, 44114, -215588, 222722, 6333, 251440, -209152, -165584, -35005, 163740, -8400, 50256, 182331, 115908, -151336, 122019, 244216, 49754, -160053, -214932, 243743, -81828, -114018, 136431, -5499, 119354, -199707, 226160, -88249, -486594, 10035, -287631, 228394, -88307, -146075, -145699, 152527, -154622, -43351, 108399, -44962, 34267, -337687, 233304, -82844, -138347, 165300, 173822, -94352, 251790, -189278, -15820, -133076, -187857, 26446, -284010, -4370, -236268, -170503, -37111, 101373, -264893, 182860, -173807, 15932, 15566, -71417, -68993, 66303, -195040, 72414, -428775, -1421, -143335, -254918, 62073, 108771]
18093A08771g5449j18421O3349G9538r527e6038k1800L1073I7725g3063B5121
18081C0312i6649q8683A84765E014J667a80215A87984b05007g6079B44317a59270
18069a8231E1721g4089r1363H0766i2596a7088j86948I386i8906k843b8606l4157
18057f2763A08477b00609i8717a3173B2210J0418J2862a66664B07503b38593B7122
18045h0028A47102c08425o1248l8176K01626a716A04846J82672c4304B52376E3270
18033h0995b5941B60108f0466j03860n0056b6202j3839j22561D5070K04098j24015
18022A25153c97128G8710N851b91658A65475D4853a61248f3371A15834d058A75582
18010b25007a0851H7351b94522j21766b9680j56993B41196j01106a20366F0864
$$ y = [108771, -75449, -193870, -130521, 79538, 70011, -56038, -77838, -46765, 97725, -73063, 25121, 30312, -96649, -185332, 184765, 5014, 6681, -180215, 187984, -205007, -76079, 244317, -159270, -18231, 51721, -74089, -165452, 80766, -92596, -17088, -204036, 9386, -98906, -101749, -28606, -62763, 108477, -200609, -98717, -13173, 22210, 32628, 45490, -166664, 207503, -238593, 27122, -80028, 147102, -308425, -369673, -407849, -206223, -1716, 104846, 287518, -34304, 252376, 53270, -80995, -25941, 260108, -60466, -164326, -214382, -26202, -40041, -162602, 45070, 249168, 125153, -397128, 78710, 84561, -291658, 165475, 44853, -161248, -63371, 115834, -4058, 175582, -225007, -10851, 87351, -294522, -416288, -29680, -186673, 241196, 140090, -120366, 60864]
17999a03640A32074a53422B97438m8904c0121B09890A9629a13296a7065I3654
17988a6967j20598J6347A06249a33957B53514e6852j78478B3725L6493d929G3456
17976F5416a57061A11769f3964o1382B13084b42646F5494J22767e9229k12208
17966b71437L7597M2408G9266a13971B22366b42992g6567k9794O340B45676l7521
17955B08155g0815k12287a27692A68072F9241e2233C00051J2693d37833C06766
17944B9732P1171A6759N4350J7749a40304l0940Q1110l02776A36009K70161a65047
17932a26394J6193j56838b9976D5681O6307f4899q4216B50844R0634D787J46576
17921A51363g2085E0439Q3890d0160j23618e0643r5391c6005J0433B4293R9306
$$ y = [-103640, 132074, -153422, 297438, 248534, -30121, 209890, 19629, -113296, -17065, 93654, -16967, -137565, -121218, 106249, -133957, 253514, -56852, -235330, 23725, 60218, -4929, 73456, 65416, -157061, 111769, -63964, -125346, 213084, -242646, 65494, 188261, -59229, -271437, -233840, -191432, 79266, -113971, 222366, -242992, -76567, -106361, -100021, 245676, 208155, -70815, -283102, -127692, 168072, 69241, -52233, 300051, 312744, -437833, 306766, 29732, 100903, 16759, 71109, 88858, -140304, -171244, -90134, -392910, 136009, 406170, -165047, -126394, -110201, -267039, -29976, 45681, 111988, -64899, -149115, 250844, 341478, 4787, 151363, -72085, 50439, 134329, -40160, -163778, -50643, -146034, -36005, -25572, 24293, 123599]
17910A23599N044b19460A33318b17046g1551I2814g1511j14501B68159e5558j33554
17899a89112p8451K3390a21790e1977p6328a9579m59176C27939b97462B61088
17888A97907j1307b45905h8594F689a66931r2550B03856b01085A39819n8510a05074
17876b77039J9461c2412A39239E3292d3487j62690c9257j00702A2815L5901J36386
17865A85102b2323j30495f7986A37709b56568A04449a62582j82360g2433k16662
17855b89095J23791F1752d6727k67672a51705o8662d9990A5518h2617D10583A16734
17843a59094m818H7042l1302F602a3863j04786L2653E5783a03095c1306j84939
17832b16245A65054c37956a48423I6437A5088O2785c00234A03059E371N3342O1647
$$ y = [123599, 128643, -219460, 133318, -217046, -71551, 92814, -71511, -186012, 268159, -55558, -189112, -267563, -244173, -121790, -51977, -128305, -19579, -478755, 327939, -297462, 261088, 197907, 186600, -245905, -88594, 6689, -166931, -259481, 203856, -201085, 139819, 81309, -105074, -277039, -257578, -32412, 139239, 53292, -43487, -206177, -39257, -139959, 12815, 48716, 185102, -22323, -152818, -67986, 137709, -256568, 104449, -162582, -344942, -72433, -289095, -165304, 61752, -46727, -314399, -151705, -220367, -49990, 15518, -82617, 410583, 116734, -159094, -163912, 87042, 55740, 6602, -13863, -118649, -85996, 55783, -103095, -31306, -216245, 165054, -337956, -148423, 96437, 15088, 77873, -300234, 103059, 5371, 58713, 120360]
17821A20360A6013a49186o3866k10601a92081A8073L5186k6525j2894J92512d3703
17809a36559K6155M6173E1042J42495c5701j59069B26459a52502k50487J63991
17799b38998A79768J6679r4895B5504J4097L020e7942B13618i5695A12317b11792
17787h5108k3209c6990B43923A4269a17124B45436G8660h0765D96J3508a64512
17775H7537N2640c97027d4862r5870C0109J94667J54332a45633A23705e6273G5819
17763E5813K02631c3407A36991J86333F9298a11518j04039f5727H4211a61308
17752d0723F6569b17251A62580F8211g0138A13232J9706b56706A3270i9067A60959
17740b04743C4994O8095b62266E8174L46961a83696j82982e7766A18798l9475
$$ y = [120360, 16013, -149186, -213052, -423653, -192081, 18073, 53259, 26734, 13840, 206352, -43703, -136559, -110404, -64231, 51042, 193537, -35701, -194770, 226459, -152502, -402989, -238998, 179768, 196447, 101552, 25504, 39601, 42621, -57942, 213618, -95695, 112317, -211792, -85108, -108317, -36990, 243923, 14269, -117124, 245436, 78660, -80765, 496, 14004, -164512, 87537, 140177, -397027, -44862, -140732, 30109, 224776, 379108, -145633, 123705, -56273, 75819, 55813, 258444, -33407, 136991, 323324, 69298, -111518, -215557, -65727, 84211, -161308, -40723, 66569, -217251, 162580, 68211, -70138, 113232, 132938, -256706, 13270, -99067, 160959, -204743, 34994, 103089, -262266, 58174, 405135, -183696, -366678, -57766, 118798, 79323]
17730G9323a8062G2587K8462j9905A0701K9202f6288C73768A8123e890A33071
17718F9716a52183C64886A73605L4469l8808e30612g2888j29363E3527j7173d6143
17706b88743A79047q3693a60809A86922I1144M7669a06135A42166O1748a21863
17695H4485d5664A58014B9895J20005J16040a52675P1634j29839n9588A5370J19040
17684A34410J36635a16265B33416K35815c17572e5964B63964e8501I5129L5441
17674A30570a08310e3925A79955j9924b31943C3295J50017b1807A86939I0323
17663c70590G5399f498B19300a9401F5792f8610F5279K14743A12780a38797d9320
17651a96000A13267b72029a00512p4180f2706E1288J39976K36967A95357c27483
$$ y = [79323, -18062, 72587, 101049, 81144, 10701, 39903, -66288, 373768, 18123, -5890, 133071, 69716, -152183, 364886, 173605, 208074, 169266, -530612, -72888, -202251, 53527, 36354, -46143, -288743, 179047, 95354, -160809, 186922, 91144, 138813, -106135, 142166, 203914, -121863, 84485, -45664, 158014, 29895, 149900, 265940, -152675, -81041, -210880, -270468, 15370, 134410, 271045, -116265, 233416, 469231, -317572, -55964, 263964, -58501, 95129, 130570, -108310, -53925, 179955, 160031, -231943, 33295, 183312, -21807, 186939, 90323, -370590, 75399, -6498, 219300, -19401, 65792, -68610, 65279, 280022, 112780, -138797, -49320, -196000, 113267, -272029, -100512, -174692, -62706, 51288, 191264, 428231, 195357, -327483]
17640A06560a6772l60B43069j05494b90492d2915m7614A96656b7711m3626K2859
17629d8478C7249a10871N4213B80064b34207F7302f4178B19645e94k2693C1766
17617a98845F9610k014a50432N4509H1966L0588B4378P1374D1773I044Q9966R6947
17605A95957q6746a14596j02527B45620A13287D2656a81617A83435F2643K8440
17595I1083B3971c33603A25821H865K67793f9546p8004M6052C49J31375C1541
17583b18785E7892J40036F6614a21889P201E3848a11644k59051Q7105A2262c1334
17571A44933a65345q741I0694d7320C19203H0822b06916A93133a61040A23183
17560B3591J34356b7284j87535q6970J06958i5317A2765L50735b21196B59089
$$ y = [106560, -16772, -17132, 243069, 137575, -290492, -42915, -90529, 196656, -27711, -71337, -48478, 37249, -110871, -56658, 280064, -234207, 67302, -64178, 219645, -594, -23287, 31766, -198845, 69610, 67596, -150432, -95923, 81966, 112554, 24378, 95752, 41773, 9044, 99010, 195957, 109211, -114596, -217123, 245620, 113287, 42656, -181617, 183435, 62643, 91083, 23971, -333603, 125821, 8865, 276658, -69546, -147550, -101498, 349, 131724, 31541, -218785, 57892, 197928, 66614, -121889, -114688, 53848, -111644, -370695, -283590, 12262, -31334, 144933, -165345, -174086, 90694, -47320, 319203, 80822, -206916, 193133, -161040, 123183, 23591, 157947, -27284, -214819, -301789, -194831, -95317, 12765, 363500, -221196, 259089]
17549B7967a20672A40227a90145A90628a7033H6770M3301J02525b10277A26775
17538a29278B28045g2164a7269m9753A5086J31746m8541c12430A488J55735k335
17527A54888A4150f8967H5778J57194C5860M14454c08335D713J42466b05598F2808
17515a97413A56269p4142J45295D4349J00559R6091L723a88802m0177j73830h1547
17503d2977A18652J2278K07517j0232A49668a02239B27822a243B07695a44042
17492a36851o5582E0959a7541A5267R1725a81462A10842b91417A47328N5814e5677
17480A10958j021P1991b89170B8654M31111B20985a49247A85751K47495j12460
17470C20786G4274K76067D2420M88510k59116D3963K4392f9490k9650A94812h4713
$$ y = [27967, -120672, 140227, -190145, 190628, -17033, 86770, 130071, 232596, -210277, 126775, -129278, 228045, -72164, -17269, -67022, 15086, 146832, 98291, -312430, 1488, 157223, 154888, 14150, -68967, 85778, 242972, 35860, 450314, -308335, 4713, 147179, -205598, 62808, -197413, 156269, 82127, 227422, 44349, 144908, 240999, 244722, -188802, -228979, -402809, -81547, -42977, 118652, 130930, 338447, 328215, 149668, -102239, 227822, -1243, 207695, -144042, -136851, -202433, 50959, -17541, 15267, 106992, -181462, 110842, -291417, 147328, 203142, -55677, 110958, 109937, 181928, -289170, 28654, 459765, 220985, -149247, 185751, 433246, 320786, 74274, 350341, 42420, 530930, 271814, 43963, 68355, -69490, -99140, 194812, -84713]
17458A22544K3390J21634G131K97169j22410k7724L39967j86289j2243o3636K66234
17447D98199k46717l3819K58309A46096K32179R7249j62422j46549K84823j68810
17437B82566l6292C7429K59215p9471n0217d0288B43074D2666N06463a52328L3495
17426a18833C43443j5103K3986b9952A19813L9866L79534H8990J28301R1710K4106
17415C33107m9124K52187B41118K65392H8597K6633I692K63383A18075L8287l7116
17404A19246d5013B34599r0897k880K4044O2646C4103J76395A9073K23147J23735
17393C65955I9276N8493i4479K6164K8375B00799J16374M491p0269a90720B90969
17381b07112B32835o9854E3652a4823j17575C35071J82033I2765R1543a26868
$$ y = [122544, 145934, 267568, 7131, 304300, 181890, 154166, 494133, 307844, 295601, 231965, 498199, 251482, 217663, 475972, 146096, 378275, 475524, 313102, 166553, 451376, 282566, 246274, 37429, 296644, 217173, 166956, -40288, 243074, 42666, 549129, -152328, -118833, 343443, 328340, 352326, -29952, 119813, 159679, 539213, 88990, 217291, 309001, 333107, 283983, 536170, 241118, 506510, 88597, 115230, 9692, 273075, 118075, 156362, 119246, -45013, 234599, 143702, 140822, 164866, 227512, 34103, 210498, 19073, 242220, 365955, 99276, 157769, -94479, -68315, -39940, 200799, 317173, 321664, 251395, -190720, 290969, -207112, 232835, 162981, 53652, -14823, -132398, 335071, 517104, 92765, 184308, -126868]
17370A55184k7144B4513J53715h4618q3331C18076n0532r5515C4596N72593B47125
17358B42391J596l0167b1152B17830m0526L72N7297j09826K14172a04720E5068
17346A5489b22473B06843J04643A09076L27884A91553a21743A82256J1775a40793
17335C33844F1572a96385C4999K66527b25255C23057F4677J55114G900J8278J38067
17324A64245j8895n9659K83192a30876B8210L7016n799J47598r8364c5164l8891
17313g4055B24554O3367A22843J33148A10016M4739n2098J11050n0295K11958
17303C75370A24002r771J10204A11563E1854Q8844d8271A18441K15186M3272A88168
17291B02238h3922E0436L36212m2124A21831n8386Q0532a28836H1259J60127j10789
$$ y = [155184, 128040, 24513, 178228, -84618, -167949, 318076, 267544, 172029, 34596, 607189, 247125, 242391, 243987, 213820, -21152, 217830, 177304, 177676, 234973, 125147, 339319, -104720, 55068, 15489, -222473, 206843, 311486, 109076, 436960, 191553, -121743, 182256, 194031, -140793, 333844, 61572, -196385, 34999, 301526, -225255, 323057, 64677, 219791, 7900, 26178, 164245, 145350, 85691, 368883, -130876, 28210, 65226, 59427, 207025, 108661, -35164, -74055, 224554, 287921, 122843, 255991, 110016, 154755, 102657, 213707, 163412, 375370, 124002, 114231, 224435, 111563, 51854, 140698, -48271, 118441, 333627, 376899, 188168, 202238, -83922, 50436, 386648, 344524, 121831, 63445, 143977, -128836, 81259, 241386, 130597]
17280A30597N8445M4590g9812C56975j07949a8837C70694c1178I1382B3361L19285
17269C42646g7354A22329K62202j3343j42947o6251D3358J55121F1584L9515L39223
17258D40322a23639I4133J04853B6548J07729R8901e8966B82616b6106A71636
17247a03241K1268C79715D1017L8891K31027b35118B20901N302j02400J23213
17237B47016E6019N2184K93194j15587q1160L66394j49867A37409D7023J70620
17227B17643b08651K6274C36425a33295e1319B61643J6795k908J41923F2766J7903
17216H0669a00574C51330c5736A72837J71471D8456j4197J62832K61667j03182
17206C55576j3957A12211L91543F806J71701J69619e6227D74791B952J77354K12542
$$ y = [130597, 189042, 233632, -79812, 356975, 249026, -18837, 370694, -31178, 91382, 23361, 342646, -77354, 122329, 384531, 371188, 228241, 161990, 43358, 198479, 61584, 101099, 440322, -123639, 94133, 198986, 26548, 134277, 233178, -58966, 282616, -26106, 171636, -103241, -81973, 379715, 41017, 79908, 310935, -235118, 220901, 226203, 123803, 247016, 56019, 108203, 401397, 285810, 204650, 571044, 421177, 137409, 47023, 217643, -208651, -182377, 336425, -133295, -51319, 261643, 278438, 275530, 417453, 62766, 80669, -100574, 351330, -35736, 172837, 344308, 48456, 34259, 197091, 458758, 355576, 341619, 112211, 503754, 6806, 178507, 348126, -56227, 474791, 2952, 180306, 392848]
17195C92848p5393j2180n3919M5162J5953R9044A86081K13445b781D49828j81160
17184B68668J95602j1911A15228J97115r1929R8604a24616A79742J24677J39047
17174D43466q7554o2442O0809r2229J40005n5003L4714j80997a9672D47487A70574
17162A40485J90993A63594o0213J44042J01885J2332A20015J36257O9280K15759
17152E41311k70622K47423I3569K71566e1793D22912A16464K15213L0718j38210
17142B24185K35777j15368j47914F6839N38483k87378J17586A88670J96923J3861
17132C99454p8655P9723O4397J48954A49497J77157j5064m2619P3474r6846J28242
17121C73841A72465E5194L34889K60494A34835J68777M5863m0940Q9396l1904
$$ y = [392848, 317455, 305275, 251356, 296518, 312471, 411515, 186081, 399526, -2781, 449828, 268668, 464270, 452359, 115228, 312343, 220414, 319018, -124616, 179742, 304419, 443466, 355912, 293470, 354279, 262050, 402055, 347052, 381766, 200769, -19672, 447487, 170574, 140485, 331478, 163594, 103381, 247423, 349308, 361640, 120015, 256272, 325552, 541311, 270689, 518112, 93569, 365135, -51793, 422912, 116464, 331677, 362395, 224185, 459962, 344594, 196680, 66839, 605322, 317944, 435530, 188670, 385593, 399454, 320799, 400522, 464919, 613873, 149497, 326654, 311590, 268971, 342445, 245599, 373841, 172465, 55194, 390083, 650577, 134835, 303612, 349475, 308535, 397931, 366027]
17111C66027J20362J4238J13501k86318D8732M40596a60514C65634m1585J61876
17101D85925l3414j61256J39177K37083l04471A69399m0581L02754j12524j15655
17091B03393K44226R4808k45362K22677j99628K73353j79489K14735j45659j99745
17081B83309J82060k0974A37183j8634O69390C04590F7441L33274j16252A13471
17070B62949J69035L25595I7854N43624B88871L09851B38613K74186J22972k26549
17060D09222J99654k27247J12034K45091k55941N3141K9790k71615j284M1526
17050C34371R609J40367J82126k98937J87447p6283J19087Q1340k22159o1718
17040C95250N10508l23924N21615n27586n4961R3287J83135A71804N50080C20451
$$ y = [366027, 486389, 500627, 614128, 327810, 48732, 489328, -160514, 365634, 324049, 485925, 452511, 291255, 430432, 667515, 363044, 169399, 128818, 431572, 319048, 203393, 447619, 542427, 297065, 519742, 320114, 593467, 413978, 628713, 483054, 283309, 465369, 444395, 137183, 118549, 787939, 304590, 67441, 400715, 284463, 113471, 262949, 431984, 757579, 97854, 641478, 288871, 598722, 238613, 512799, 635771, 409222, 608876, 381629, 493663, 738754, 482813, 535954, 565744, 294129, 292845, 334371, 343980, 484347, 666473, 367536, 554983, 478700, 597787, 679127, 456968, 395250, 905758, 581834, 1103449, 575863, 520902, 614189, 797324, 171804, 721884, 320451]
17029H36492D14961o6745L52433n9461k94955K88301L998J265j52207J73150j62867
17018D97873J76461J06725l35838J81859L10329D37585J24327l1373J39891l7375
17008F33055j18664R1809L34160l16401J03055O140j56573Q9310R5255j79376
16998E81770J23117k8340k73701N04053R1133q8081l59511J50671j10055j52109
16988D38947M21104k06868J00666o8838j19828J59927K1985N2709J12131r3124
16978H18811K39329k12931k71842N29675n38118M00634l35659L28329l0603j17258
16968H10367l8053J71186j28759L75553n40729M42041q7264J77235j74663J43360
16958A150274k61707n2210j45317K84618O6863N0333O8789j62278Q7839j72008
$$ y = [836492, 414961, 348216, 700649, 641188, 346233, 634534, 638532, 639797, 487590, 660740, 497873, 674334, 781059, 445221, 627080, 937409, 437585, 561912, 530539, 670430, 633055, 514391, 606200, 940360, 623959, 727014, 733154, 576581, 665891, 761146, 581770, 704887, 676547, 402846, 906899, 998032, 909951, 550440, 701111, 591056, 438947, 860051, 653183, 753849, 685011, 565183, 725110, 747095, 799804, 911935, 818811, 1058140, 845209, 573367, 1103042, 564924, 965558, 629899, 958228, 927625, 810367, 772314, 943500, 814741, 1190294, 649565, 1091606, 1004342, 1181577, 1006914, 1150274, 888567, 836357, 691040, 975658, 1042521, 1092854, 1161643, 999365, 1087204, 915196]
16948I15196M9024l61323O45517m13737N05278m71896J68864k345J80064l38625
16938H76017o1815L69147n2498J94376l23492K42715l09338J76581J14487j73645
16928A052535J60055p9904n4543L48589j76540j422k74854M39180j44148m5821
16918A223127M62954P803k97207J11513R5556o9164j2917Q386k92919K64756L6164
16907A538052n5088L24226j58958j50076J81673n6671L5516j35849K5744j47022
16897A401547K34872K86852k10519R1485p8279j306j19100M62252m41542K43778
16887A870040m1368J73969k19523K62757k49359P9307M1239j67382L87016j41583
16877A995113J63275k7095l3638L48132k21334J03604r8963m4646K32260K08441
$$ y = [915196, 964220, 602897, 1248414, 834677, 1339955, 868059, 1036923, 1034578, 1214642, 876017, 814202, 1183349, 1130851, 1325227, 1001735, 1244450, 935112, 1111693, 1226180, 1052535, 1212590, 1132686, 1078143, 1426732, 1250192, 1248770, 973916, 1413096, 1268948, 1223127, 1686081, 1693884, 1396677, 1508190, 1603746, 1534582, 1521665, 1530051, 1237132, 1501888, 1538052, 1482964, 1807190, 1648232, 1498156, 1679829, 1623158, 1658674, 1522825, 1548569, 1401547, 1636419, 1923271, 1712752, 1804237, 1725958, 1724652, 1605552, 2067804, 1626262, 1870040, 1828672, 2002641, 1783118, 2045875, 1796516, 1875823, 1917062, 1749680, 2136696, 1995113, 2158388, 2131293, 2097655, 2445787, 2224453, 2328057, 2229094, 2184448, 2416708, 2625149]
16867B625149l40817L23611m4902J55236k05784m8286L06210k29710L52218j13277
16857B779648k20066K8077L41032J07711N4846k22163L40189l78227L56320l00435
16847B886932N33854q4323j99421J76622K43503l06869J64829J05339K52639N1869
16837C824974j68369L03495J10830k53686P48220o65260L66965J25969n9491K83354
16827D617001j47912n7600K68748j07277R5266K06044J67274n6205n4999K90358
16817E220698M28188J16879l77751M45331j82333K88793q520J82510J99097J31832
16807F444724l03987M93373K00375J20824j50254N52596L34137k77023L92664
16798G807429N0031K85142j97047P09227K5223M87978j5994P569K88220O25733
$$ y = [2625149, 2284332, 2607943, 2563041, 2718277, 2512493, 2464207, 2770417, 2540707, 2892925, 2779648, 2559582, 2587659, 2928691, 3036402, 3091248, 2869085, 3209274, 2831047, 3187367, 2886932, 3420786, 3336463, 3137042, 3313664, 3557167, 3250298, 3415127, 3520466, 3773105, 3824974, 3656605, 3960100, 4070930, 3817244, 4565464, 3900204, 4267169, 4393138, 4333647, 4617001, 4469089, 4411489, 4680237, 4572960, 4668226, 4874270, 5041544, 4985339, 4930340, 5220698, 5648886, 5765765, 5388014, 5833345, 5651012, 5939805, 5931285, 6113795, 6312892, 6444724, 6140737, 6634110, 6834485, 6955309, 6805055, 7357651, 7691788, 7414765, 7807429, 7857460, 8142602, 7945555, 8654782, 8680005, 9167983, 9151989, 9159558, 9447778, 10073511]
16788A0073511l531J91447K59979L68382M08464J22712M45483M40466J27893K41375
16778A2676181L74434O80682L10363N83760K00788O14133N28263N61771J93625
16769A6724000Q67748R70620L40535J036997M35867R06112O40350R23757Q11456
16760B3657442J003192J323037P74849J306033J205598J362678J373697J233433
16752C3239959J745652J860871J602684J675597K668637J583230K824315K034295
16744D9235240K957948K419263L505106L172376L644481M016601M179258M244768
16736G7375041M578037M959769N916493N712264N974445O547281O975434P097776
16728A25136540P487323P551779P784631P848988P075377P403105O736639N746327
$$ y = [10073511, 10069980, 10261427, 10521406, 10889788, 11298252, 11420964, 11866447, 12306913, 12434806, 12676181, 13050615, 13731297, 14041660, 14625420, 14826208, 15440341, 15968604, 16530375, 16724000, 17591748, 18562368, 18902903, 19939900, 20375767, 21281879, 21922229, 22845986, 23657442, 24660634, 25983671, 26758520, 28064553, 29270151, 30632829, 32006526, 33239959, 34985611, 36846482, 38449166, 40124763, 42793400, 44376630, 47200945, 49235240, 52193188, 54612451, 58117557, 61289933, 64934414, 68951015, 73130273, 77375041, 81953078, 86912847, 92829340, 98541604, 104516049, 111063330, 118038764, 125136540, 132623863, 140175642, 147960273, 155809261, 162884638, 170287743, 177024382, 182770709]
16720A82770709M953577L912997K555729K077208J8646j281788k109623l749690
16712A89147765m905456n169077o540805o819498p419481p623909p565543p816915
16704A35287081p739354p348362o817885o970502o434137n786951n838687n214588
16696H3136615n112470m606637m117210l932183m176226l227967l255914k979708
16688E1728300k766107k636401k268893j864938k411229k150295j722021j570492
16680C4337924j775954j243976j356648j704527r38052j237768j151327q07448
16672B4122224j242379q36064q87912o14300p76786q80013o58247p46059o25861
16663A6854603l89188o54593m72824q65985o46957j3911o30384n1103q57541j48910
$$ y = [182770709, 187724286, 191637283, 194193012, 196270220, 196288866, 195007078, 192897455, 189147765, 184242309, 179073232, 172532427, 165712929, 158293448, 150669539, 143103996, 135287081, 127547727, 120199365, 113381480, 106410978, 99976841, 94189890, 88351203, 83136615, 78024145, 73417508, 69300298, 65368115, 61191889, 57963922, 54708008, 51728300, 48962193, 46325792, 44056899, 42191961, 39780732, 37630437, 35908416, 34337924, 32561970, 31317994, 29961346, 28256819, 27318767, 26080999, 24929672, 24122224, 22879845, 22043781, 21155869, 20541569, 19764783, 18884770, 18226523, 17480464, 16854603, 16465415, 15810822, 15337998, 14472013, 13825056, 13811145, 13180761, 13129658, 12272117, 12123207]
16653A2123207o53419k19285j14293l32597l91039p6487o29020Q2279p23582M3639
16643I109403l07949k8194o76057o7269k90408L82506o11927l57687k61876J71268
16633G061810n10794k3400j11993j71756j5829m70478q9017R0368j49903J296
16623E610304k75554j86047O902k31203j52325K23665l55541j54284l3180l9313
16613D413424l30362M00917k96212k73954q94K20970m35215P6369r6995J45612
16603C823660J69744k23626j34019m55836l8465j94827K58951m5929k69285J34019
16593C024387l09047L57109k44997M2514o8059n7806o6792q663j33793l3113n1614
16582B450126j8613j19637L3890M9070j28275k25017k4695L51701j43384R4461
$$ y = [12123207, 11469788, 11250503, 11136210, 10803613, 10412574, 10336087, 9707067, 9789346, 9065764, 9109403, 8801454, 8773260, 8097203, 8029934, 7739526, 8122032, 7510105, 7152418, 6890542, 7061810, 6551016, 6527616, 6415623, 6243867, 6228038, 5757560, 5668543, 5758911, 5609008, 5610304, 5334750, 5148703, 5155605, 4924402, 4772077, 4995742, 4640201, 4485917, 4452737, 4413424, 4083062, 4483979, 4187767, 3913813, 3912919, 4133889, 3698674, 3775043, 3678048, 3823660, 3993404, 3769778, 3635759, 3179923, 3141458, 2946631, 3205582, 3159653, 2890368, 3024387, 2715340, 3072449, 2827452, 2869966, 2801907, 2744101, 2677309, 2668646, 2534853, 2501740, 2450126, 2431513, 2311876, 2345766, 2394836, 2266561, 2041544, 2016849, 2368550, 2225166, 2319627]
16572B319627r1342j38843j57039J31824k08171J60896J1670l946k71085L83054
16562B136645j43071m47022K09344k16344Q1809L0962J99092o6659l12601K42413
16552A714568j80228k5330K69356m31269M70875l01909j47932P227R4521j72905
16542A296974R9499j20777j63583J69135P5688N5069J07437m81057J96393l50301
16532H84477M14518j34574J53357n9448N3983O2281J50867k28672k61876n8856
16522I76057K77468k42557r223K72283k67810N79J49863j77958P8641j06242K4903
16511I76004P5519K3693l03723J50006M24371k77318j33564K29145n12369K40614
16501H92378P5144j74755R9695k25108J97213O6964K850o3157j42524J95867O7220
$$ y = [2319627, 2228285, 2089442, 1932403, 2064227, 1856056, 2016952, 2028622, 2024676, 1753591, 2136645, 1993574, 1546552, 1755896, 1539552, 1621361, 1652323, 1851415, 1784756, 1472155, 1714568, 1534340, 1509010, 1778366, 1347097, 1817972, 1516063, 1368131, 1375358, 1469879, 1296974, 1396473, 1275696, 1112113, 1281248, 1356936, 1412005, 1519442, 1038385, 1234778, 884477, 1298995, 1164421, 1317778, 1258330, 1312313, 1374594, 1525461, 1296789, 1034913, 976057, 1253525, 1010968, 1001745, 1274028, 1006218, 1006797, 1156660, 978702, 1057343, 951101, 976004, 1051523, 1075216, 771493, 921499, 1345870, 1068552, 934988, 1164133, 651764, 892378, 967522, 792767, 892462, 667354, 864567, 931531, 934381, 871224, 728700, 924567, 991787]
16490I91787n4784l19281J34327o0860R7113r8142L2616r2088L24244m07988J31482
16479F78426j71064L71976n1597l23847J48607L4409K41604D54777R8035B56917
16468D62003M20083j14650l52496K47057k34143j26310J60460K71122k97949k1078
16458D14099J69139j72271l575N2628M0220r8289J01573K73694l02795j22167
16448C52256L9812K15983q3413m3246J57320j30044M3847j21138L25997A01556
16437B25090J06688J53339k29039M40698B72409K47378q4845J46884k03762j4088
16427C63976j14265O5573J83522P6355J12194k09132q1448B3537M84128j21665
16417C86000j54479K59867n3376P6350A97855Q5556J42107J08823A61318k2583
$$ y = [991787, 937003, 617722, 752049, 691189, 788302, 690160, 722776, 630688, 954932, 546944, 678426, 507362, 879338, 827741, 503894, 652501, 686910, 928514, 454777, 552812, 256917, 462003, 882086, 767436, 414940, 661997, 427854, 301544, 462004, 733126, 435177, 414099, 583238, 410967, 407392, 460020, 500240, 401951, 503524, 777218, 474423, 352256, 392068, 608051, 524638, 481392, 638712, 508668, 552515, 431377, 757374, 101556, 225090, 331778, 485117, 256078, 696776, 272409, 519787, 434942, 581826, 378064, 363976, 249711, 315284, 498806, 575161, 687355, 478223, 396775, 23537, 507665, 386000, 231521, 491388, 438012, 514362, 197855, 283411, 425518, 534341, 161318, 138735]
16407A38735K47043K14338A70325M17987j81180D2473J07196K13128l7072O5392
16397C91117o4590j52231K29503n7097n6090E0697K28742K71486j13432j18112
16387C19381J68803j07854H479L11514j16118K18880j70395K62556j25662A75885
16376A17344M08265B43017L5013A35724P1240h4120C15455j12859l6522j35J97535
16365C63474J7766K2822E6384J00315R7501j04235E2667J43238j7649R7489J03597
16354C79342m7231K1963D623b4850E06390E0473R4347h8642B10505K8159j1640
16343B27024J82114j30392c4149B19286J04677G8671L8282K00125n9080o2181
16333A95817Q7422K67449B23814J03428j08564J6883L2874r9969m748J58118l5563
$$ y = [138735, 385778, 600116, 170325, 588312, 407132, 42473, 149669, 362797, 325725, 391117, 326527, 174296, 403799, 346702, 290612, 50697, 279439, 550925, 437493, 319381, 488184, 380330, 8479, 319993, 203875, 422755, 252360, 514916, 389254, 175885, 117344, 525609, 243017, 278030, 135724, 206964, -84120, 315455, 202596, 166074, 165939, 363474, 381240, 404062, 56384, 156699, 254200, 149965, 52667, 195905, 178256, 275745, 379342, 332111, 354074, 4623, -24850, 506390, 50473, 144820, -88642, 210505, 238664, 227024, 409138, 278746, -34149, 219286, 323963, 78671, 116953, 317078, 257998, 195817, 283239, 550688, 223814, 327242, 218678, 235561, 268435, 168466, 163718, 321836, 286273]
16322B86273j11929B2245J28276f5021D6306b68746A05381K52155J73866k58422
16312B72980g3409A94634b3530n9074A22406N9237l1638L60097A95172A96L27374
16301C27570i3694C42979F063K31257b20244G2631j63a45512I4400A8946M52363
16290D71309k08606j11450J14163a12465I5873b27138I8986K9164K62978A6820
16279a36173B24122F8008R4877D3768K8002A0912M1575a30280N6164C11315p7245
16268B34070a12077A36468G048d21372h4032A30288O5923R0683J28604A32226
16257D07892j24072a12674A27000D3170K72771B2009a65028E3649b06144A19076
16246a85092D1031K22349j15312b73648g2382A90279e7684F4244J07036a91396
$$ y = [286273, 174344, 22245, 150521, -65021, 46306, -268746, 105381, 357536, 531402, 272980, -73409, 194634, -23530, -82604, 122406, 181643, 150005, 510102, 195172, 196, 327570, -93694, 342979, 6063, 237320, -220244, 72631, 72468, -145512, 94400, 18946, 471309, 262703, 151253, 265416, -112465, 95873, -227138, 98986, 128150, 391128, 16820, -136173, 224122, 68008, 162885, 43768, 71770, 10912, 52487, -130280, -74116, 311315, 234070, -112077, 136468, 7048, -421372, -84032, 130288, 196211, 286894, 415498, 132226, 407892, 283820, -112674, 127000, 43170, 315941, 22009, -165028, 53649, -206144, 119076, -185092, 41031, 263380, 148068, -273648, -72382, 190279, -57684, 64244, 171280, -191396]
16235B67348j29021h4674G2068A1466J07760J79314a11918D85425G0592o2J36816
16224B07346a7173h65C7209c2375m6618B00629a85395E3561J08422p2399a96811
16212i2346m9620J21j27833a6021j99355n247A081L21958i9866H3729j8723J65125
16200B30131b2693r4156E7768K30082a20485E7765g1895b3103A40748n1036a82977
16188A07623g4319l405j5374A20365a63697I949a82195d2028A94801N8164j10366
16177A42599a5367B1569g2487A71819a45620F7493B6762K02472c9381E859b71908
16165A6890K96977j33390A8506J32558q548G185J89593q1023K5751F2167c77642
16153C54086a48653B14512a1446l9991A76530a24669D8427O3948m2173a98203
$$ y = [267348, 138327, -84674, 72068, 11466, 119226, 298540, -111918, 485425, 70592, 70530, 207346, -17173, -865, 37209, -32375, -78993, 200629, -185395, 53561, 161983, 89584, -196811, -92346, -141966, -141845, -269678, -16021, -215376, -220623, 1081, 323039, -99866, 83729, 65006, 230131, -22693, -116849, 57768, 287850, -120485, 57765, -71895, -23103, 140748, 89712, -182977, 107623, -74319, -77724, -93098, 120365, -163697, 9949, -182195, -42028, 194801, 252965, 142599, -15367, 21569, -72487, 171819, -145620, 67493, 26762, 229234, -39381, 5859, -271908, 16890, 313867, 180477, 18506, 151064, 142516, 7185, 196778, 115755, 141506, 62167, -377642, 354086, -148653, 214512, -11446, -51437, 176530, -124669, 48427, 112375, 70202, -198203]
16142A93695a69588Q4432j54078F5680L16788A88073a86254h48A50233a08542
16131A32447g1644j21516j18861B5995d71912i6413C18588A16515c7870D1645
16120B23639h422p0836k58228A98549b6347A02877a19536A96716N7860c7204A07717
16108f5690B65588E3572B5185c4200A12002A5811c5605A15751K37405e5250B02499
16096a76666D17827A02341a6702k9490B20174a88702E9695c443l2939k53340C04635
16084B55784a30014k37727a70534A13638k2352c1103l88045c1241j9051r2811
16074a43103A553b93214a44681B39801j10742B2418b14764A30854a5462k77093
16064b92555A83641a94198A80602C6623C826g778m8116D88h6561b9144B02581
$$ y = [193695, -169588, -85156, -239234, 65680, 382468, 188073, -186254, -848, 150233, -108542, 132447, -71644, -193160, -312021, 25995, -471912, -96413, 318588, 116515, -37870, 41645, 223639, -8422, -79258, -337486, 198549, -26347, 102877, -119536, 196716, 254576, -37204, 107717, -65690, 265588, 53572, 25185, -34200, 112002, 15811, -35605, 115751, 353156, -55250, 202499, -176666, 417827, 102341, -16702, -46192, 220174, -188702, 59695, -3443, -36382, -289722, 304635, 255784, -130014, -367741, -170534, 113638, 91286, -31103, -419148, -31241, -50292, -143103, 1553, -293214, -144681, 239801, 129059, 22418, -214764, 130854, -15462, -292555, 183641, -194198, 180602, 36623, 3826, -7778, -55894, 488, -86561, -29144, 202581]
16052A45561d8792A6991g2859k04184O974C3046h1160o3512e3161k04995A14520
16040a91800C65137b38502A09148a62537P7067F8242a69651l2980C7168i2608
16029D5301e7612c562j10416B14428F5694a2376A0694K4582e48257g7830j69408
16018b47238F0242f8012j24049E0148K77922h9319a9903A36592f253k29628A02784
16006b14919o301i2249L5581n1603n0044p5447a7949k03127n8828E6241B2449
15994C21615b4757n411j80322E1869P8771E7318b26867P2154j8153e3393k0589
15983g3982B51797E1109J06197Q9859F5242L65181k07739b3521I469L27774A51816
15971b51609j51554f4669A75486o1190a13271H1674J0166a37873H2296k4947a64961
$$ y = [145561, -48792, 16991, -72859, -277043, -270069, 33046, -81160, -144672, -53161, -258156, 114520, -191800, 365137, -238502, 109148, -162537, -85470, 68242, -169651, -202631, 37168, -92608, 45301, -57612, -3562, -113978, 214428, 65694, -12376, 10694, 35276, -548257, -77830, -247238, 60242, -68012, -192061, 50148, 328070, -89319, -19903, 136592, -6253, -235881, 102784, -214919, -221220, -92249, -56668, -108271, -158315, -233762, -17949, -221076, -279904, 56241, 22449, 321615, -24757, -30168, -210490, 51869, 130640, 57318, -226867, -154713, -172866, -53393, -73982, 251797, 51109, 157306, 247165, 65242, 430423, 222684, -23521, 9469, 337243, 151816, -251609, -403163, -64669, 175486, 114296, -113271, 81674, 91840, -137873, 82296, 57349, -164961]
15959G9675J91235c923A32200B0489d8319n3227C4268j1008a37422A10865b5573
15947a80875q6715a19676K4401J753j50139a3664A66536c74622A9582K3314R759
15936E2655c07049H4021a35422L8880D3405b74117J30194j99999H0437b48498
15925D8207h8131A21767D6327J23532a00417M4058D9795J53741b26561A6400b22731
15913a0289A13745a15717j21420A7968F568a54275K1577l35796A48580d26826
15902f2020n8121e1744q0000B00601a41283F0778c19350A57526f3563B0862c43552
15890e0687k06882A48665e1934G6257a25900J537A27375m4019a5532C4210b16537
15878b25358P2118F0506b30699L0183A39452h5562j17231A62088b41125C2649
$$ y = [79675, 270910, -3923, 132200, 20489, -48319, -101546, 34268, 23260, -137422, 110865, -25573, -180875, -267590, -119676, -95275, -93522, -243661, -13664, 166536, -374622, 19582, 42896, 52655, -307049, 84021, -135422, -96542, 43405, -274117, -143923, -343922, 80437, -248498, 48207, -88131, 121767, 46327, 169859, -100417, -56359, 49795, 203536, -226561, 16400, -222731, -10289, 113745, -115717, -237137, 17968, 6568, -154275, -132698, -468494, 148580, -426826, -62020, -120141, -51744, -131744, 200601, -141283, 60778, -319350, 157526, -63563, 20862, -343552, -50687, -257569, 148665, -51934, 76257, -125900, -124363, 127375, 83356, -15532, 34210, -216537, -225358, -153240, 60506, -230699, -200516, 139452, -85562, -202793, 162088, -241125, 32649]
15867c6461G43c34956a63249H488b24288f9302c896A28693g1161q0350e1765b3182
15854E8464b50912J08988f9785A15076d2075j80487c937F803J3755a17768C3360
15842d3055p2912L0508L9718j02887a6462B449d44695A36763E1552b07126B34313
15830a30308J8441B19205Q3732A2942a09759j30917A62890e85j35747A78199D7703
15818a72234d1403A41938F1459a36088B12226F7228a69114d9182Q110j4012A66438
15806A50545a22960I7324K62397b58156a05366E1317d9219b662F3989g9254A16720
15794C1359a15263I230J93876D6198j6851a82963A2697K90136a72158D2181d8899
15782A05102A2444Q589b98027E024J53140i9998f316j8960n17520a80781r607
$$ y = [-36461, 743, -334956, -163249, 8488, -224288, -69302, -3896, 128693, -71161, -151511, -51765, -23182, 58464, -250912, -141924, -69785, 115076, -42075, -222562, -3937, 6803, 20558, -117768, 33360, -43055, -115967, -85459, -45741, -148628, -16462, 2449, -444695, 136763, 51552, -207126, 234313, -130308, -111867, 219205, 302937, 12942, -109759, -240676, 162890, -585, -136332, 178199, 47703, -172234, -41403, 141938, 61459, -136088, 212226, 67228, -169114, -49182, -41072, -55084, 166438, 150545, -122960, 97324, 359721, -258156, -105366, 51317, -49219, -2662, 63989, -79254, 116720, 31359, -115263, 9230, 203106, 46198, 29347, -182963, 12697, 302833, -172158, 42181, -48899, 105102, 12444, 21033, -298027, 5024, 158164, -99998, -6316, -25276, -542796, -180781, -190388]
15771a90388R1871o8401A04998g5673j06547e1345h247c937q8693C34660j46130
15760A88530c11436A30940c1007A98743k2010J77272A09635D3805c62929A52593
15749a43525A97107F1614J06666B6219c6920F8058c445j49548J7958A16204b68137
15737G8830M3364a17409I4219a21694A85581c05195A80056b44964j90393a12172
15726A17138j2691g8625B20700d12588F7817k7038a70866j21883A94536m9101
15716A45435d0289B22847a78783N9468L4682D77334D9035e5637j0901j17383I3289
15704e321A06113D9193b61806C1319a72583M499B50114a57412P360A62695b02745
15692c16356J44119A37422K88370a18817C78153r7738A909Q7046M5487f7103A88373
$$ y = [-190388, -98517, -166918, 104998, -75673, -182220, -51345, -8247, -3937, -92630, 334660, 188530, -311436, 130940, -31007, 198743, 176733, 354005, 109635, 43805, -362929, 152593, -143525, 197107, 61614, 168280, 26219, -36920, 68058, -3445, -152993, -135035, 116204, -268137, 78830, 122194, -117409, 94219, -121694, 185581, -305195, 180056, -244964, -435357, -112172, 117138, 104447, -78625, 220700, -412588, 67817, 40779, -170866, -292749, 194536, 145435, -40289, 222847, -178783, -119315, -84633, 477334, 49035, -55637, -66538, -183921, 93289, -5321, 106113, 49193, -261806, 31319, -172583, -168084, 250114, -157412, -150052, 162695, -202745, -316356, -172237, 137422, 425792, -118817, 378153, 280415, 1909, 88955, 134442, -67103, 188373]
15680A74345a65766C2697a12980k1810j55109F4636M5935a60080L9404A89241
15669a67408A42916g2841c1914q5686B33066j14618n68q253A7062d9276A09596
15657i099A11591b13261N548a7702I9919j2092f3163a0050o9524A74844B2471
15645c9460C4320a74916e3811A68479m6083K16739d11031C12631b20991f6518
15634a16366J2090C45098A08699m1240b17236A69572K2118a67010D700a39821
15623h6294k4198a1599j47141A86649F7262f9356A14991J29817a57262A75680
15612h5874j73529E9025d07354a29351J9932C39804g1748B31321f0025j05827
15602a65852K1923A1166b40548a5555l28541A32545G42f7503j0270j74319J23278
$$ y = [174345, -165766, 32697, -112980, -134790, -289899, 64636, 110571, -160080, -120676, 189241, -167408, 142916, -72841, -31914, -117600, 233066, 118448, 117880, 109627, 17062, -49276, 109596, -9099, 111591, -213261, -207713, -17702, 99919, 87827, -63163, -10050, -79574, 174844, 22471, -39460, 34320, -174916, -53811, 168479, 122396, 339135, -411031, 312631, -220991, -66518, -116366, -104276, 345098, 108699, 67459, -217236, 169572, 191690, -167010, 4700, -139821, -86294, -110492, -11599, -158740, 186649, 67262, -69356, 114991, 244808, -157262, 175680, -85874, -259403, 59025, -407354, -129351, -109419, 339804, -71748, 231321, -60025, -165852, -143929, 11166, -240548, -15555, -344096, 132545, 742, -67503, -77773, -252092, -128814]
15591a28814m0147C79205A26003A381a25319B12820K6603B1807K5647J11681p8278
15580H0857a90216F3986l1821c274A62430a3900n7794a9748k75512B46329c25371
15568a65075J5290A4336b12813d1025q9591O0617A24102C2051J70179a37638m3216
15557a80854A55409F0423J74105A5498a44479j3941I8531d29281J63727a03939
15546a10343j83746i0993B07654b85274G7436A3454d81999A48922f3435F6775
15535d286j45651B83528j05449D2339O8569a7979l6251A63470G8897c28377C74020
15523d50j63772j16420A03041C2532J62537h684A57971a17712d9223k3160E9915
15511E1963c6030F5771M6075l9039a20019L655n9178A33384F0851a77352J7161
$$ y = [-128814, -168961, 379205, 126003, 1381, -125319, 212820, 239423, 21807, 47454, 159135, 80857, -190216, 63986, 32165, -3274, 162430, -13900, -71694, -19748, -295260, 246329, -325371, -165075, -149785, 14336, -212813, -41025, -130616, -69999, 124102, 32051, 202230, -137638, -180854, 155409, 60423, 234528, 15498, -144479, -158420, 98531, -429281, -265554, -103939, -110343, -294089, -90993, 207654, -285274, 77436, 13454, -481999, 148922, -63435, 66775, -4286, -149937, 283528, 178079, 42339, 110908, -17979, -54230, 163470, 78897, -328377, 374020, -450, -164222, -280642, 103041, 32532, 195069, -8684, 157971, -117712, -49223, -72383, 59915, 51963, -36030, 65771, 111846, 72807, -120019, -116364, -175542, 133384, 60851, -177352, -160191]
15500a60191j45280A125O6347d1785B15409I7838R9483b13572G4943K7794j3034
15489H9703a78807H5040P1971a568A58915b8812A91911a20425b6225I1006O6421
15478A57427a52295B20923a15234C1841Q6122K332c144k5799A10411i3009j3384
15467a06393B96007c77321A03333A4674a03095k29942B21635c83945A53957b85470
15456b00796D7250a31648G1415k1288f1345A75341a82350P5402A67725h2036j86283
15445b68319D9910i3199p0070A6821c52655g6234J5003N83m2551E3366B5510N980
15433C1490a16521a91r0218G1114C3628J1736J52013D7740g7266C22897j09597
15422B13300a29572j62511a23267f132D6382a23696k63129M923a44171j38677
$$ y = [-160191, -305471, 1125, 67472, -41785, 215409, 97838, 197321, -213572, 74943, 102737, 89703, -178807, 85040, 157011, -1568, 158915, -28812, 191911, -120425, -26225, 91006, 157427, -152295, 220923, -115234, 31841, 117963, 120295, -3144, -28943, 110411, -93009, -106393, 296007, -377321, 103333, 14674, -103095, -333037, 221635, -383945, 153957, -285470, -200796, 47250, -131648, 71415, 50127, -61345, 175341, -182350, -106948, 167725, -82036, -268319, 49910, -93199, -163269, 16821, -352655, -76234, -61231, -60648, -103199, 53366, 25510, 31490, -116521, -191, -90409, 71114, 33628, 45364, 197377, 47740, -77266, 322897, 213300, -129572, -292083, -123267, -6132, 46382, -123696, -386825, -381902, -144171, -282848]
15412b82848B87255C0328P1512a04326a4853A68994e37157a32645E2343a43938
15401I0998m3917g8755h588A69874K29616i438A51084k6640f8870j14929k70182
15390d53981A55495e21k2448C77304b48460F8846A8080b28892K5315L3355B7147
15378B37417g5411A97948o7676k0937L4814i2321p2695A36894a07622E199J62425
15367A67624J86859D9862Q9403K32194C6229L00882D0708J05078b00810M7535
15357a53275a5950P010j35477A83060a57827C40778a51508A4379a62465A72822
15346A27639c45193A51247G789L47048C6326A3406g8139k18630b2623C08825H964
15334B47037J27095a22830D5026K30004a54394B16033P9955a82909A82153C1501
$$ y = [-282848, 287255, 30328, 101840, -104326, -14853, 168994, -537157, -132645, 52343, -143938, 90998, 47081, -78755, -8588, 169874, 399490, -9438, 151084, 124444, -68870, -183799, -453981, 155495, -521, -22969, 377304, -248460, 68846, 18080, -228892, -203577, -170222, 27147, 237417, -75411, 197948, 130272, 109335, 144149, -92321, -165016, 136894, -107622, 5199, 167624, 354483, 49862, 139265, 371459, 36229, 337111, 40708, 145786, -200810, -153275, -15950, -8940, -144417, 183060, -157827, 340778, -151508, 14379, -162465, 172822, 127639, -345193, 151247, 7789, 354837, 36326, 13406, -78139, -296769, -22623, 308825, 8964, 247037, 374132, -122830, 45026, 275030, -154394, 216033, 295988, -182909, 182153, 31501]
15323E4307g4451l17836a82860A13330K28986D2130f7157A33157P2051h7192C63050
15311A25149c5849B88213j38979b41144a03576A17481B6626a0598A89011J43865
15301C32876a41245f0665A7214h1626B6312K09268G5059j3470K72248b65841E6017
15289c25993A34832a77142k98346A0277K2658A2954K38372a3151H314a45591A3371
15277a54775L0137I2661L6292P4000b36532A72599q6109L64932a08617r9773C6795
15265I4816p629K01552A12387J6262J42245a03122A07410L4557m9507K41338G0391
15253B46351m5386J5092E9307J49921M03925N29856L93509k39994N4397o56419
15243F94502k56046j13855G397Q1772J45437I8063B2610K3251a23411B02181f111
$$ y = [54307, -74451, -392287, -182860, 113330, 342316, 42130, -67157, 133157, 205208, -87192, 363050, 125149, -35849, 288213, 149234, -241144, -103576, 117481, 26626, -10598, 189011, 332876, -141245, -60665, 17214, -81626, 26312, 235580, 75059, 61589, 333837, -265841, 56017, -325993, 134832, -177142, -475488, 10277, 32935, 12954, 251326, -13151, 8314, -145591, 13371, -154775, -124638, 92661, 128953, 202953, -236532, 172599, 86490, 451422, -108617, -208390, 36795, 94816, 87187, 288739, 112387, 128649, 270894, -103122, 107410, 141967, 92460, 333798, 70391, 246351, 200965, 216057, 59307, 209228, 613153, 1143009, 1536518, 1296524, 1350921, 694502, 438456, 324601, 7397, 89169, 234606, 98063, 22610, 45861, -123411, 202181, -6111]
15231g145B06309r3896b44415A68407l0884L0573J22539A19813j9616O2201j8959
15220A43439l9066f9768B01508j6413F4048Q101L01439b42654f4900A52197o7714
15209H4483b2883A67746J32654F6460A0163a30524a5085o1659k11755C27236R340
15198C36576p0508I6939b96842a6974A72268A508a06899E42399F8717K1484b1624
15186E09512c83444D35750j18716r0639E2664b0938l9106p7371A3595a54062K0164
15175a33898A90216b982F1514a64892B00948B1536J41034e519I2860C1288a08185
15163A21014E0395a47769C1892a9929p2895I4496a30543B1042f8210D1209L61448
15152D02657e8923B14257m1145a29440p1228B07102q2679l0193m4073A5757J97569
$$ y = [-7145, 206309, 112413, -244415, 168407, 137523, 168096, 290635, 119813, 100197, 162398, 143439, 104373, -69768, 201508, 185095, 64048, 72149, 373588, -242654, -64900, 152197, 84483, -22883, 167746, 300400, 66460, 10163, -130524, -15085, -76744, -288499, 327236, 336576, 266068, 96939, -296842, -16974, 172268, 1508, -106899, 542399, 68717, 90201, -21624, 509512, -383444, 435750, 317034, 226395, 52664, -20938, -60044, -137415, 13595, -154062, -133898, 190216, -2982, 61514, -164892, 200948, 21536, 162570, -5519, 92860, 31288, -108185, 121014, 50395, -147769, 31892, -19929, -92824, 94496, -130543, 21042, -68210, 41209, 402657, -58923, 214257, 173112, -129440, -200668, 207102, 124423, 94230, 50157, 15757, 213326]
15141B13326p0948a18194I9276a17757A88268g2623I4690a64220B90952M9772
15131C40724a89681B31915q7634J51873D3344J38572m8492l7752K60163D4304
15120B6719J22340E5092e275j47371C00976a37689C10645A13515K1735F7515K6832
15109I4347a20332j2828E8714K06469p6676o9895Q061K12525L9303A8353K355
15098B0708R9285M5692J39776a70122C05346a4090o3207j09045A37511m4139b62267
15086D3608J13973F0652a14090C02003K8365h4093j7346A24173e825r6544A8217
15074E93404A8842K81766j1274I0937D2531N70652A19087P4427q4355Q0304K85034
15063D74497A7602J19976L9522a29327A41227L7494n549l1388O3933c5826H0475
$$ y = [213326, 142378, -118194, 99276, -117757, 188268, -72623, 94690, -164220, 290952, 340724, -189681, 231915, 144281, 296154, 43344, 181916, 133424, 95672, 355835, 44304, 26719, 149059, 55092, -5275, -152646, 300976, -137689, 310645, 113515, 135250, 67515, 94347, -120332, -133160, 58714, 265183, 188507, 118612, 126673, 339198, 378501, 18353, 20708, 119993, 165685, 305461, -170122, 305346, -14090, -77297, -186342, 137511, 93372, -262267, 43608, 157581, 60652, -114090, 302003, 330368, -84093, -101439, 124173, -5825, -102369, 18217, 593404, 18842, 300608, 289334, 90937, 42531, 613183, 119087, 193514, 109159, 189463, 474497, 17602, 137578, 177100, -129327, 141227, 178721, 173172, 141784, 205717, -35826, 80475]
15051B31665b7730A22144L12753H1389A2524e6779B20070m2786C2125L56030j55615
15040B32540m0502G8556N3222J58169L4199J82032j84179A00419L15105A51551
15029C77934e5898B42134o2631A7660o49M46463H7949K62515A270L98035E7483
15017A40515M8806E9327L16641c2322C68763j26790l1275K40511j73165a3065
15006A16599O2985L0973J37249n5290m549B6076J24762A0183N33690k07585j21282
14995B15006D7062R4932N1188M22931B66515J46639A17217R9562p839K66986d7107
14983f6775D90348L1647q0200P781B24239B3356M1418J14991R4892I3248b06169
14971A95010J41937F3794K37467J4020A8767L9974J85020P8135r9459A9715a3524
$$ y = [231665, -27730, 122144, 434897, 81389, 12524, -56779, 220070, 177284, 32125, 388155, 232540, 192038, 78556, 131778, 289947, 324146, 506178, 321999, 100419, 415524, 151551, 377934, -55898, 242134, 179503, 17660, 17011, 463474, 87949, 350464, 1270, 399305, 57483, 140515, 189321, 59327, 375968, -32322, 368763, 241973, 210698, 451209, 278044, -13065, 116599, 179584, 210557, 347806, 292516, 287967, 26076, 150838, 10183, 543873, 336288, 215006, 47062, 141994, 193182, 616113, 266515, 413154, 117217, 216779, 208940, 475926, -47107, -66775, 490348, 521995, 441795, 449576, 224239, 23356, 64774, 179765, 274657, 93248, -206169, 195010, 336947, 63794, 301261, 315281, 18767, 58741, 243761, 321896, 222437, 19715, -13524]
14959B87633l6664k468A05857J22369J69725r6514J78112R6414A6364J86881J37844
14948C41089k8118l0747p4281Q2712j0874J91101p7800k0006K30845A20754L17538
14937D38292n4586n0035H0537Q4389K92854I9404M14653B25889J9682J36400A3994
14925D94460k24240a353C33760k1658L37109I1893L85968O2107k14721J71374
14915D96621k04800k5461L17790A88817Q3313L6473q6085C3824M1588J96719K46204
14904E18335l0569A93700Q3328j19508l7475L28147D5814O874J44910c0689C89245
14892D64910n7409A91723M06040A27910K59566j31301A9881N66852k13425j13603
14882B59705Q9961r0792q931J91269j1758K37482k81359A45803M11596k04674
$$ y = [287633, 250969, 248501, 105857, 228226, 397951, 301437, 479549, 575963, 16364, 203245, 341089, 312971, 282224, 207943, 290655, 279781, 470882, 393082, 373076, 603921, 120754, 438292, 383706, 333671, 80537, 164926, 457780, 99404, 514057, 225889, 245571, 381971, 13994, 494460, 270220, -1353, 333760, 312102, 649211, 91893, 477861, 539968, 325247, 496621, 291821, 266360, 584150, 188817, 272130, 308603, 222518, 33824, 75412, 272131, 518335, 487766, 193700, 277028, 157520, 120045, 448192, 45814, 52688, 197598, -30689, 389245, 464910, 407501, 191723, 597763, 127910, 387476, 256175, 19881, 586733, 373308, 259705, 349666, 258874, 249943, 441212, 429454, 666936, 385577, 145803, 557399, 352725]
14872C52725J91137m2733j38234A60653F1602M22609L55871C50226n7023O3746
14862C56949q289q7958L34666m6078A13195L13653p3597H7030J99568Q5265J23537
14851D95400K1085J7418j40785K99312C18790J64563j97944G8287d1350E93333
14840E10110k7928A83128J7695M12265J70775k22721A48020K63887R3079J3106
14830E18092j23293K09265A13621R7625J04681J62313k35208J82588K03158j69518
14820D59260J02460k73663K13137j70904K1770J78201J1979N734R0122k34070
14810D04026P8675J99337j62694j13621j15403J21614K4882j24442J98293A47134
14799C84873K74656K7232j39815l8626j4592j51451L1475K85963A40817M32262
$$ y = [352725, 543862, 501129, 362895, 160653, 61602, 484211, 840082, 350226, 293203, 356949, 348660, 260702, 595368, 549290, 113195, 426848, 353251, 87030, 286598, 371863, 495400, 516485, 533903, 393118, 692430, 318790, 483353, 285409, 78287, -41350, 593333, 510110, 482182, 183128, 200823, 613088, 783863, 561142, 148020, 411907, 504986, 518092, 394799, 604064, 113621, 211246, 315927, 478240, 243032, 425620, 628778, 459260, 561720, 288057, 501194, 330290, 352060, 530261, 542240, 547974, 638096, 404026, 482701, 682038, 519344, 405723, 290320, 411934, 436816, 312374, 510667, 147134, 384873, 659529, 686761, 546946, 508320, 493728, 342277, 373752, 659715, 140817, 573079]
14789E73079J10752k11411l7862B11088N31789j02747B99291M72295k11500J8559
14779E78645K49383L4739k26058p4205J847N2831o2840k40973J89142J6662M6220
14768E65393J05933K5376K27108j41151k83348L87917D34333L13873l37070J55328
14758E66464n1576o4504j81627L03691J30370K38467k53310l1331O8616j54296
14748E70964O5370k02102J66503J87999j94738J69403j39993L70518l59579o5455
14738E68890B57124Q56293k96139j40742P1619q4924L18777m71721n4628O6629
14728E22288L1772N79558l56186K63896j62023n8584k52171J13568O7883k37852
14718E12149J95875j87652K85393l10827Q9670L13829K07407r7080D86758K11520
$$ y = [573079, 683831, 472420, 434558, 211088, 742877, 640130, 299291, 771586, 560086, 578645, 828028, 862767, 636709, 562504, 564351, 617182, 554342, 313369, 502511, 519173, 565393, 671326, 696702, 923810, 782659, 499311, 887228, 434333, 748206, 411136, 566464, 514888, 450384, 268757, 572448, 702818, 941285, 687975, 656644, 725260, 570964, 636334, 434232, 600735, 788734, 593996, 763399, 623406, 993924, 634345, 568890, 257124, 1113417, 817278, 676536, 748155, 663231, 982008, 510287, 455659, 522288, 554060, 1133618, 777432, 1041328, 879305, 820721, 568550, 682118, 750001, 512149, 708024, 520372, 805765, 494938, 584608, 898437, 1105844, 1008764, 486758, 698278]
14708F98278l9835o6015O9099P7842k225K49591R4565O5915o2954l03246J15510
14697H96525Q4619j8477l05944J55504J04944j12474j07780J41555O734Q5744
14687I30950r8058J29604k2028j14083L0877n0346j6313N7395K31357j08010o1486
14676I09859L20068k12287K52062l27506L45961j71515j15099o3367J92629J6648
14666A147453k00870j31666L29596M24278p46599M60916l28180J71678J56305
14657A282911q5189j53019K29733j83984J074J40568j13566R8023j34021J74751
14647A257281J19674n05948K67988J95712j12499K46530j8874m2141j2278p3536
14637A321909q7308J43016R4139j66023P6743J26595k05262J70444Q5n3816j47324
$$ y = [698278, 658443, 592428, 661527, 739369, 737144, 986735, 1081300, 1147215, 1084261, 781015, 896525, 981144, 962667, 656723, 812227, 917171, 804697, 696917, 838472, 845206, 930950, 832892, 962496, 940468, 826385, 857262, 806916, 790603, 847998, 1079355, 971345, 909859, 1229927, 1017640, 1269702, 942196, 1288157, 1116642, 1001543, 938176, 1130805, 1147453, 946583, 814917, 1144513, 1568791, 822192, 1283108, 954928, 1126606, 1282911, 1197722, 1044703, 1274436, 1090452, 1091526, 1232094, 1118528, 1216551, 1082530, 1257281, 1376955, 871007, 1138995, 1334707, 1222208, 1468738, 1449864, 1407723, 1395445, 1321909, 1234601, 1377617, 1471756, 1305733, 1382476, 1509071, 1303809, 1474253, 1474338, 1420522, 1273198]
14626A273198Q7723K89823j54495n28959M83922j060O6318J9569k01581j95042
14616A139416O26301k84626R4270q8091J09229L5576J9825M0126j68418J19554
14606A643162m30490N00673k07897k4931J67111j72655j01315J58612l00036M73874
14596A706108j47012L7130K802L92641k01448l13813L19645k38203J85412Q8291
14586A831553j55872J17484r1021K73241J0745j00192M7883P3932M858K9967K5981
14575B068559r3975j36063L66041l11529J44160K66078o36J52393k69775J38585
14565B323838l5504J4365L03570r8730K34376q3742J58716j52311M09589j61071
14555B913096Q7213J66446P96312J43614M81056Q97844K060412M139995P782953
$$ y = [1273198, 1360921, 1650744, 1496249, 967290, 1451212, 1450152, 1516470, 1536039, 1334458, 1139416, 1765717, 1481091, 1575361, 1487270, 1596499, 1632075, 1651900, 1692026, 1523608, 1643162, 1212672, 1713345, 1505448, 1480517, 1647628, 1474973, 1373658, 1532270, 1232234, 1706108, 1559096, 1596226, 1599028, 1991669, 1790221, 1476408, 1796053, 1557850, 1743262, 1831553, 1675681, 1793165, 1702144, 1975385, 1986130, 1885938, 1933821, 2007753, 2012611, 2042578, 2068559, 1974584, 1838521, 2204562, 1893033, 2037193, 2303271, 2302635, 2455028, 2185253, 2323838, 2288334, 2302699, 2606269, 2507539, 2741915, 2658173, 2816889, 2664578, 3074167, 2913096, 3000309, 3166755, 3963067, 4106681, 4587737, 5485581, 7545993, 11685988, 19468941]
14546A9468941J4096426O742290j5341745A2231916m852795k864280r97988p16591
14538B800262k24097l81461k08j54882m1785J64830J72903n08057k9554K13021
14528B010972J82175q0956M17621j12686r8043M41864L8642k52818m51532N24495
14518B619734Q9759N607k44089L68444P7291k08530M8892J88328k99398L51655
14508B997693l39778K99015m37294L84224J08230M2799k2617m1937M16223k38362
14498C168196k37337N87137l00116j45304R9964J93119L8235O2923j2180k6636
14488C428001J55763J19625m4808J32422j93l71029L84613J30876j46134J31393
14478C920529l54117O73551n13632O64244k17521k23517K47816n7087N2708j2581
$$ y = [19468941, 33565367, 40307657, 24965912, 12231916, 7379121, 4514841, 3516853, 2800262, 2576165, 2194704, 2194496, 2039614, 1997829, 2162659, 2335562, 1827505, 1797951, 2010972, 2193147, 2112191, 2529812, 2417126, 2319083, 2760947, 2799589, 2546771, 2095239, 2619734, 2709493, 2715100, 2471011, 2839455, 2916746, 2708216, 2757108, 2945436, 2646038, 2997693, 2657915, 2956930, 2519636, 2903860, 3012090, 3054889, 3032272, 2990335, 3406558, 3168196, 2930859, 3517996, 3217880, 3072576, 3172540, 3365659, 3403894, 3466817, 3454637, 3428001, 3583764, 3703389, 3658581, 3791003, 3790810, 3419781, 3804394, 3935270, 3789136, 3920529, 3566412, 4239963, 3726331, 4390575, 4173054, 3949537, 4197353, 4140266, 4192974, 4180393]
14468D180393L28616k10975K07194K6410j07236L24466j33280N5879J19712K32474
14458E023653r1258J05632Q0794q4279o6193J46678P0061J20123J9890J82847
14448E507948j60782L9676J87204o958j94241M79143R3045q7347L86330R9300
14438F343318K06727j07765j14789J16607j25002J49200K31960K70051l22202
14429F648105J74432M00101j89396J26579K25267J11193J34433l9461j85101Q64553
14419H270705l28976m8145r2846O85929L4601R5415n0212K02804L11529j46739
14409H934065M25831K80529l51759L69747Q3279L03350L02600k80454N17431k79674
14399A0304945N61915k63721L40722L76985n7553M54065J38608J12485L68923
$$ y = [4180393, 4509009, 4298034, 4505228, 4531638, 4424402, 4748868, 4615588, 4671467, 4791179, 5023653, 4932395, 5038027, 5118821, 5034542, 4968349, 5115027, 5185088, 5305211, 5325101, 5507948, 5347166, 5386842, 5574046, 5567088, 5372847, 5851990, 5945035, 5857688, 6244018, 6343318, 6550045, 6442280, 6327491, 6444098, 6319096, 6468296, 6700256, 6970307, 6648105, 6822537, 7222638, 7033242, 7159821, 7385088, 7496281, 7630714, 7591253, 7406152, 8270705, 7941729, 7893584, 7800738, 8486667, 8521268, 8616683, 8566471, 8769275, 9080804, 8934065, 9359896, 9640425, 9288666, 9658413, 9741692, 10045042, 10347642, 10067188, 10584619, 10304945, 10866860, 10603139, 10943861, 11320846, 11263293, 11717358, 11855966, 11968451, 12337374]
14390A2337374j71289M12009J7627P91848k16960L06062M85287K9015M90353K24166
14380A4705492j954M85033K31007M50195j3656M23014M52073J11708K90347L53498
14370A7486757J87561M94185K65047J48277R29832n4846R05741J13031L10421
14361B0786006N93788M48825M82952K16654M73148P18119M38777P44218J66562
14352B5069049R97199O23994O11982O14645L85190R47099O79033O89652J184993
14343C1802836N72000P50586J148969Q22906J036112P11478J299951R42548O71748
14334C9759134J371900J434803J206670J468405J222078J356681J574635J572507
14326E0966813J616527J514080K236105J330452K304899K171290K177426K285558
$$ y = [12337374, 12166085, 12578094, 12595721, 13387569, 13170609, 13476671, 13961958, 13990973, 14481326, 14705492, 14703538, 15188571, 15419578, 15869773, 15856117, 16279131, 16731204, 16842912, 17133259, 17486757, 17674318, 18168503, 18433550, 18581827, 19511659, 19456813, 20362554, 20475585, 20786006, 21379794, 21828619, 22311571, 22528225, 23001373, 23719492, 24158269, 24902487, 25069049, 26066248, 26690242, 27302224, 27916869, 28302059, 29249158, 29928191, 30617843, 31802836, 32374836, 33125422, 34274391, 35097297, 36133409, 36844887, 38144838, 39087386, 39759134, 41131034, 42565837, 43772507, 45240912, 46462990, 47819671, 49394306, 50966813, 52583340, 54097420, 56333525, 57663977, 59968876, 62140166, 64317592, 66603150]
14318F6603150K566734K529411K473231L074686K809517K969659L292302L575440
14310H9894130L588579L767849M465754L890294M580174N168113N000304N471551
14302A25826748N602665O078492O628150O825184P452984P764445P909909Q471132
14294A82559709R251484R897567J0267995J0457205J1367560J1930857J2257434
14287B57989811J3024957J3013420J4037511J4020112J4731841J4257098J4463311
14280C55538061J4572662J4095539J3149854J2597874J1819314J0181894Q432504
14273D40387702M224748K72538l51490l72146m02237j698938o525118p110677
14265D28424382o971451o743586q747305j0056039j1327628j2296883j3578180
$$ y = [66603150, 69169884, 71699295, 74172526, 77247212, 80056729, 83026388, 86318690, 89894130, 93482709, 97250558, 101716312, 105606606, 110186780, 115354893, 120355197, 125826748, 131429413, 137507905, 144136055, 150961239, 158414223, 166178668, 174088577, 182559709, 191811193, 201708760, 211976755, 222433960, 233801520, 245732377, 257989811, 271014768, 284028188, 298065699, 312085811, 326817652, 341074750, 355538061, 370110723, 384206262, 397356116, 409953990, 421773304, 431955198, 440387702, 444612450, 444884988, 444533498, 444161352, 443759115, 442060177, 435535059, 428424382, 421452931, 414709345, 405962040, 395906001, 384578373, 372281490, 358703310]
14258C58703310j4226638j5041524j5115259j3898121j3887489j3558530j3532771
14251B59442978j2454027j2057937j1412495j1044999j0382144r493959r114930
14244A83482487q644794p912640q284474p176610o852218o669394n785530n699771
14236A26457056n184308n374560m818955m571229m182823l921980l956932l864566
14228I0581703l316958l539032l118547l019018k656257k767883k766945k097119
14220F7299944k615676j894625k033181k217366j499283k236415j436930j454237
14212E1912231j563434k051763j047499j721662q31784r31640j520009p82887
14204D1461553j608825j109384r05119r53200l88727j116285j511103m98548j133577
$$ y = [358703310, 344476672, 329435148, 314319889, 300421768, 286534279, 272975749, 259442978, 246988951, 234931014, 223518519, 212473520, 202091376, 192597417, 183482487, 174837693, 166925053, 158640579, 151463969, 144611751, 137942357, 132156827, 126457056, 121272748, 115898188, 111079233, 106508004, 102325181, 98403201, 94446269, 90581703, 87264745, 83725713, 80607166, 77588148, 74931891, 72164008, 69397063, 67299944, 64684268, 62789643, 60756462, 58539096, 57039813, 54803398, 53366468, 51912231, 50348797, 48297034, 47249535, 45527873, 44696089, 43764449, 42244440, 41461553, 39852728, 38743344, 37838225, 36885025, 36496298, 35380013, 33868910, 33370362, 32236785]
14195C2236785k87302j045875p11125j201877m56035o83083r07293k59881o66006
14186B6018308l38366r32891q13363l06400n98601m62529n42969k69451n66870
14177B1186868l26243o02281n55673j37321m89146k68967q72025j51754j27990
14168A7655468l73831n34277m29285n411o7266m30266p24368P9071p4733m25799
14158A4669303m78275k73724J15314o78502K84177n14960l83711r4107k33706
14149A2411809j22148k3610m82751J72748m57032m08048J32123l66802m7734j69406
14139A0639149k05983O7330k89907k45693M8573l47723K49913m67710R3872L0626
14129I572447l75685l35846j42306J40158j87737j06509j34691l54254K99787
$$ y = [32236785, 31949483, 30903608, 30192483, 28990606, 28534571, 27851488, 26944195, 26684314, 26018308, 25679942, 24747051, 23933688, 23627288, 23028687, 22566158, 22023189, 21753738, 21186868, 20860625, 20258344, 19702671, 19565350, 19076204, 18807237, 17935212, 17783458, 17655468, 17281637, 16747360, 16318075, 16312664, 16245398, 15815132, 15090764, 15169835, 15095102, 14669303, 14191028, 13917304, 14032618, 13354116, 13638293, 13123333, 12739622, 12645515, 12411809, 12289661, 12266051, 11783300, 11956048, 11499016, 11090968, 11223091, 10856289, 10808555, 10639149, 10433166, 10500496, 10210589, 9964896, 10013469, 9665746, 9915659, 9447949, 9541821, 9572447, 9196762, 8860916, 8718610, 8858768, 8671031, 8564522, 8429831, 8075577, 8375364]
14120H375364n72832L10765q9651l31575m86358J02828K04685R4569m46785k56902
14110F904108M82289k50200j50872J61271j1010n43270J95910l58729k9548j97
14100F399752k76337Q163n5844j4036l5611k12573K2709j34668J13731N0399k16896
14089E648789m2887l30086N3125j5894J18750m7505k96940J71085m72717o834
14079D778886K379K05955J60657j62470j62295l48928N09122j93013l25615J71804
14069D636482j98887m079K798Q88l55839J98516N8216k29298k32415K56026J49257
14058D281665q8862L09750m07559j6618m9590j19215j50185M1599k12644j12764
14048C475577L50765l03322j03486N7299K62001n56253O8875M19968l64383p3602
$$ y = [8375364, 7802532, 8113297, 8023646, 7692071, 7205713, 7308541, 7513226, 7607795, 7161010, 6904108, 7386397, 7136197, 6985325, 7146596, 7135586, 6592316, 6788226, 6429497, 6399949, 6399752, 6123415, 6131578, 6075734, 6061698, 6026087, 5813514, 5836223, 5701555, 5815286, 5865685, 5648789, 5605902, 5275816, 5328941, 5313047, 5431797, 5384292, 5087352, 5258437, 4785720, 4778886, 4781265, 4987220, 5147877, 4985407, 4823112, 4474184, 4983306, 4790293, 4464678, 4636482, 4437595, 4433516, 4436314, 4437202, 4081363, 4279879, 4338095, 4108797, 3876382, 4132408, 4281665, 4192803, 4502553, 4094994, 4078376, 4028786, 3909571, 3759386, 3800985, 3588341, 3475577, 3826342, 3523020, 3419534, 3476833, 3738834, 3182581, 3251456, 3671424, 3307041, 3233439]
14038C233439j23092l1953M7972R3067N5034K05676l18005k3975J34413J2132
14028C284708k94967J44017j74938j06534N1513j69447K90101j91531L00966k75551
14018B858337J7545j79455l24427K17653J40378j97176l94528K81338k6028M5810
14008B439447j58486K17410k12362P3727j55361J40867J44655k98528K83485m47842
13998B027012K11012J24758j74173j32882K19285m4528j78142M00685k33772J451002
13988C670257L001610O436118J4209340J1717299j0734537j2354223n289120k673650
13980G983094j924723p65922j007735o35457k24770l62884j96776K46596k88822
13971B822601K06628m75479l197j53218j76112M36306l31050p5631J62802L0914
$$ y = [3233439, 3110347, 3078394, 3126366, 3219433, 3274467, 3480143, 3162138, 3138163, 3272576, 3284708, 2989741, 3133758, 2958820, 2852286, 2903799, 2734352, 3024453, 2832922, 3133888, 2858337, 2875882, 2696427, 2372000, 2589653, 2730031, 2532855, 2138327, 2419665, 2393637, 2439447, 2280961, 2498371, 2286009, 2359736, 2204375, 2345242, 2489897, 2191369, 2474854, 2027012, 2238024, 2362782, 2188609, 2055727, 2275012, 2230484, 2052342, 2453027, 2219255, 3670257, 6671867, 13107985, 27317325, 39034624, 28300087, 15945864, 10656744, 7983094, 6058371, 5292449, 4284714, 3649257, 3424487, 3061603, 2864827, 3111423, 2822601, 3029229, 2553750, 2550553, 2397335, 2221223, 2657529, 2326479, 2250848, 2413650, 2444564]
13961B444564l17108O5111M0434J08877k09561J25502m98531K27762K23723j23888
13951B086885l26659K2801J1836Q5587l72971L57440k1500k80516K26358L09760
13941B099021l72837L96831k83295j21903k8244L7781m0666Q2143K68775j48974
13931A888632j43772J04426m1412j23395R9725J00325n10100L52184p9166K05916
13921A853363m99043J35751J83013m6780k4566j62664M46501n27705L26947O1549
13911A746366k72626j16147n8459K36780J13434l38126j51707q1563K70076R7331
13901A445359o0702J23481j89451r8197K05900j58891J13298r2459J73758m66343
13891I95753K88684K6283O870P1018J95504k06485R7192l08434K08847L41389
$$ y = [2444564, 2127456, 2192567, 2233001, 2341878, 2132317, 2257819, 1759288, 1987050, 2210773, 2086885, 1760226, 1783027, 1794863, 1880450, 1507479, 1864919, 1843419, 1562903, 1789261, 2099021, 1726184, 2123015, 1839720, 1717817, 1689573, 1727354, 1686688, 1768831, 2037606, 1888632, 1744860, 1849286, 1807874, 1684479, 1784204, 1884529, 1374429, 1726613, 1647447, 1853363, 1354320, 1490071, 1673084, 1626304, 1601738, 1439074, 1885575, 1357870, 1684817, 1746366, 1473740, 1357593, 1299134, 1535914, 1649348, 1311222, 1159515, 1077952, 1348028, 1445359, 1384657, 1508138, 1318687, 1220490, 1426390, 1267499, 1380797, 1288338, 1462096, 995753, 1284437, 1310720, 1317590, 1388608, 1584112, 1377627, 1474819, 1166385, 1375232, 1716621]
13881A716621m69439M5316J09392n1288l7336j31167m6925r4676k4076M25386
13871A441808k18653r4682J66453J05473j68240k33829L87775k94650J56819L28585
13861A576859l54859n16342M12475j13090L06385l79174o9216L95402j45411j83027
13851I30002K20616j08608j04519j43347M97457j64599j17267N9123j34076k18831
13841G15951M02026r3252k9524J00601J18338m99053K66802l08067L13291M938
13831I92051K67078k54338Q9812L0569k1039j99233J06904K77868o00017N39897
13821A229552j25087k21650L42349m19880M52753k76411k39434L45035l75549
13812G11678L62620p6205l4730k05424J00898k16056J67429Q8750k71168K98944
$$ y = [1716621, 1247182, 1292498, 1401890, 1350602, 1313266, 1182099, 1135174, 1040498, 1016422, 1441808, 1223155, 1128473, 1294926, 1400399, 1232159, 998330, 1386105, 1091455, 1248274, 1576859, 1222000, 705658, 1118133, 1005043, 1311428, 932254, 863038, 1258440, 1113029, 930002, 1150618, 1042010, 937491, 794144, 1291601, 1127002, 1009735, 1068858, 934782, 715951, 1117977, 1024725, 995201, 1095802, 1214140, 715087, 981889, 673822, 987113, 992051, 1259129, 1004791, 1094603, 1125172, 1104133, 904900, 1011804, 1289672, 689655, 1229552, 1104465, 882815, 1225164, 805284, 1258037, 981626, 742192, 1087227, 711678, 1074298, 998093, 963363, 757939, 858837, 642781, 810210, 898960, 627792, 926736]
13802I26736j03098M06596j24885j94537O766r4089p1794L520k14737K55866O079
13791H02423R602j61335J91183R2941k40598r8135J36225Q5085j6373j83848Q0601
13780F97771j8357L36956D92093L50137j32377N33911j86644E03044K44068j58323
13770E88789L94617k01159j52984L59013k65564k63233Q0558K00125J35606p061
13760H68707k24899K8341N9767r7208J53208n7929j20017K97334m11511K91639
13750G87432M0246o5931o0489p3801L5815k41495J73627J85029J48249l17161
13740F11521j4023q1115j01310K47097j11549M1735m587J22071j27695B61717
13729D52459n4169K94329j90047K9049Q8460L71290j06976l37388k10553P0392
$$ y = [926736, 823638, 1230234, 1105349, 910812, 917578, 823489, 751695, 755215, 540478, 796344, 802423, 812025, 650690, 841873, 934814, 694216, 596081, 732306, 817391, 801018, 617170, 697771, 679414, 1016370, 492093, 842230, 709853, 1243764, 1057120, 503044, 747112, 588789, 983406, 782247, 629263, 988276, 722712, 459479, 540037, 740162, 875768, 868707, 643808, 672149, 731916, 634708, 787916, 729987, 609970, 907304, 495793, 787432, 827678, 761747, 701258, 627457, 663272, 421777, 595404, 780433, 928682, 611521, 597498, 516383, 415073, 662170, 550621, 592356, 587769, 709840, 582145, 261717, 452459, 398290, 692619, 502572, 531621, 620081, 991371, 884395, 547007, 336454, 406846]
13719D06846L0057K23334k52502j12531J01570J80940A29956N13346K03816j17418
13709G29700l03685P8684K70604l73050n4228O82542l37847C13258K21037A10956
13698D28925K08189j19726k40039L93809k25135J68992J41056l53946L5824J62468
13688F00417A19706N15237A11662L49893P3871k33257J80406j38123J34456j67254
13678C11654N2773J00967Q0894l5226J07296J02872k27893p7902J41605k22285
13668C34755J81168j41662J82466J24121C35347j13215O27820C32346j29784L22278
13658E24840J58419N6243j96633j06678m2557J06867p4647L29264j36813k52699
13648C65606J9479R1771R4153d1804E81794j69556l3441o5065J12965o7245J78166
$$ y = [406846, 436903, 660237, 407735, 295204, 396774, 577714, 129956, 643302, 847118, 729700, 426015, 504699, 775303, 402253, 348025, 1030567, 692720, 313258, 534295, 110956, 428925, 637114, 517388, 277349, 671158, 446023, 615015, 756071, 402125, 437949, 600417, 119706, 634943, 111662, 461555, 535426, 302169, 482575, 344452, 478908, 311654, 364427, 465394, 546288, 511062, 618358, 721230, 493337, 415435, 557040, 334755, 515923, 374261, 556727, 680848, 335347, 222132, 849952, 332346, 202562, 524840, 683259, 739502, 542869, 436191, 393634, 500501, 425854, 755118, 618305, 365606, 385085, 476856, 571009, -41804, 581794, 412238, 378797, 313732, 426697, 359452, 537618]
13637E37618Q0638j89943j08814M4750j18133K35697B25359L61016N6435A90561
13626B39623K73331l21O5909k5829c683D22878J17823k24920J7612K52689B10742
13614D04722J27631j58277j71914M76076C03232l7937K51627L6739j41878F2196
13603G42283k32636m7153j25309p848J30635A36074L12030A75190K61742A728
13592A04501L58266n1897j95509K89684o8568j36705L71309C15783M24634M7788
13582G88205C38654I3702J35182P9741J49761K43873A9947L14721m0202K081j05958
13571A90589J86670n0557k5044A00299J59853A6178J84289K37687A99723J78285
13561C78008m1659K45303A04791K55543J52674j71642q1158H4824J46738L4085
$$ y = [537618, 618256, 428313, 319499, 364249, 246116, 481813, 225359, 586375, 642810, 190561, 239623, 512954, 512633, 578542, 552713, -3683, 422878, 540701, 315781, 333393, 586082, 210742, 404722, 532353, 374076, 202162, 678238, 303232, 265295, 516922, 553661, 411783, 62196, 742283, 509647, 462494, 337185, 329337, 459972, 136074, 448104, 175190, 436932, 1728, 104501, 462767, 410870, 215361, 505045, 436477, 299772, 671081, 315783, 740417, 788205, 338654, 93702, 228884, 308625, 458386, 702259, 19947, 334668, 294466, 296547, 190589, 377259, 326702, 301658, 100299, 260152, 16178, 200467, 438154, 199723, 378008, 336349, 581652, 104791, 360334, 513008, 341366, 260208, 84824, 231562, 265647]
13551B65647J41399j74207L63065k51291J46458A19392Q1731n7085O7168Q3342
13541B94548A10309N8610J66252j27363j1149J92798j43113q9972K1809E3854
13530F7584L35523Q600Q9872J60227o7347k89277O5629j26362J60206j79124P325
13519B32856M38087B95561J9633j7248J58282A17700k1643l9938L68193j29583
13509B94729J33283F7129J73022O6782L2538J23978j00846j43595m2919J2505
13499A88594f0120A86229c331E57711H1652J19661p8497P1954o9233C8946L46467
13488C85413l2656c9276E21507A78390L49876B33997O4039J02053H6055K43237
13478C29292J15925H5593M23044I5950L30716j83298K35591A80566e060A40954
$$ y = [265647, 407046, 232839, 595904, 344613, 491071, 119392, 201123, 144038, 211206, 294548, 110309, 168919, 335171, 207808, 196659, 389457, 246344, 156372, 178181, 53854, 67584, 403107, 411707, 501579, 661806, 594459, 305182, 370811, 244449, 404655, 225531, 232856, 670943, 295561, 315194, 297946, 456228, 117700, 96057, 56119, 424312, 294729, 428012, 67129, 240151, 306933, 339471, 463449, 362603, 219008, 176089, 188594, -60120, 186229, -3331, 557711, 81652, 201313, 122816, 194770, 125537, 38946, 385413, 352757, -39276, 521507, 178390, 528266, 233997, 298036, 400089, 86055, 329292, 445217, 85593, 508637, 95950, 426666, 243368, 478959, 180566, -5060, 140954]
13467B28378K30119q4131K9279J5082j68561O873c4591A4835O79174B50083A03082
13455B94374J00485q6407q4293E1497K32387J7044N8042j13206H6946J89546F5708
13443B17383L53906B53999F7872J62632r5917o6098K3896e1113C53795J1156j11018
13432B53933H5391M8917K88012l1218K54775j81284A60787J34354k1839L74665
13422F47967A51821K25830A75946J49485j21286B2975J66616b5595A30570P4505
13412B05075b53865E8435L94290I5779m2442K15795H4893B2588K29307H1624J25713
13401B07337N1154r6498a2485B71326a95851g5949B54269b69388B93336d7402
13390A48343J95820j70715F5666J7390J24567C6172K54675j27418L40703j44753
$$ y = [228378, 458497, 374366, 403645, 418727, 250166, 257039, -34591, 14835, 694009, 250083, 103082, 294374, 394859, 308452, 224159, 51497, 283884, 300928, 358970, 245764, 86946, 276492, 65708, 217383, 571289, 253999, 67872, 230504, 134587, 68489, 92385, -51113, 353795, 364951, 253933, 85391, 134308, 422320, 391102, 645877, 464593, 160787, 295141, 273302, 647967, 151821, 377651, 175946, 325431, 204145, 22975, 189591, -25595, 130570, 205075, -253865, 58435, 452725, 95779, 53337, 269132, 84893, 22588, 251895, 81624, 207337, 258491, 161993, -12485, 271326, -195851, -75949, 254269, -269388, 293336, -47402, 148343, 344163, 173448, 65666, 83056, 207623, 36172, 290847, 163429, 504132, 359379]
13380C59379k3114j47755Q353O8477l2828m6972E4300K31972H3859R6518Q4623
13369B65000m2775J50541A42345n9311J41841K32253j28844A61787J31496p0128
13359B23155L23358A47680J85134J29572B28145I2598B5942J27725K1437L8380
13349B13484B3392J68490n2055J26293J70451B03257J57596J50912j98533j16030
13339A97202N2904A08809Q3539k6835p1688K96177A29481m0270C4525Q7469O3004
13328A84998N8811q6034R9077q5551a6559A75915Q6565H0761c9107C09133O949
13317C16082O5697n0811H2904J58903d4526A88083J59553j0589j37428K53929
13307D53548J21269a37293A03028C8018L15079j69260e9527j697C32548A63857
$$ y = [359379, 336265, 188510, 196863, 265340, 232512, 185540, 54300, 286272, 83859, 180377, 265000, 222225, 372766, 142345, 83034, 224875, 457128, 328284, 161787, 293283, 223155, 546513, 147680, 332814, 462386, 228145, 92598, 25942, 153667, 175104, 213484, 23392, 191882, 139827, 266120, 436571, 203257, 360853, 511765, 313232, 197202, 250106, 108809, 192348, 165513, 93825, 390002, 129481, 89211, 34525, 121994, 184998, 243809, 157775, 256852, 171301, -16559, 175915, 262480, 80761, -39107, 309133, 316082, 381779, 330968, 82904, 241807, -44526, 188083, 347636, 337047, 199619, 453548, 574817, -137293, 103028, 38018, 353097, 183837, -59527, -61224, 332548, 163857]
13296g7342A87598R3440b08226A07958D9298K69526A24209K39230G7301A6030
13285a06025A09563J70424P9839m1579k3223q4002b7523F5021J80011j7750A05321
13273A47601i7326H8457R6890G8077L00673I7323r845J6110R3894A3459K25704
13262B39163G0546M2864J62091k2085j8651b3106D91643A38188b0519A80540B6343
13250C051J41797P6180G4208e8029C42523j40887J18663A21523L25848B0003b48968
13238h839G540K59431q4589J1288b16617d0493B04953i0275C53151D4091J0577
13227E4668J60781b036A28364D258J15626J54822g9194C12938A38514P3270r286
13216B02498p4211Q9224c8715A47285n455B759L30782r252b8668G0134n429R9609
$$ y = [-77342, 187598, 281038, -208226, 107958, 49298, 318824, 124209, 363439, 77301, 16030, -106025, 109563, 279987, 359826, 318247, 295024, 211022, -27523, 65021, 245032, 227282, 105321, 147601, -97326, 88457, 185347, 78077, 378750, 97323, 87478, 103588, 197482, 13459, 239163, 70546, 113410, 275501, 253416, 234765, -23106, 491643, 138188, -20519, 180540, 26343, 3051, 144848, 221028, 74208, -58029, 342523, 201636, 320299, 121523, 447371, 20003, -248968, -8839, 7540, 266971, 182382, 193670, -216617, -40493, 204953, -90275, 353151, 44091, 54668, 215449, -2036, 128364, 4258, 119884, 274706, -79194, 312938, 138514, 211784, 202498, 128287, 217511, -38715, 147285, 141830, 2759, 333541, 324289, -28668, 70134, 64705, 164314]
13204A64314K5690I1696l6709d7509L684o0185H5920b7630m4230L2433D06122
13192A5046J48255a08034l4037G6734k5121h8143E1572a29496A59070n8757a81374
13180A82770i5741A067J27605K8664N7883a72377b2742A85234p4914N659j971
13169A14008E2432c98892C46231A04682D5870b28019D7571a63745B02797o644
13159A96153e5491B17388d8596B029N4952L51756A50790i4685B89909a20739B02886
13147A96606J95079A5736e7925G8681a57770L8106A16215D160J61333m6713a9068
13135B88968I4727L4418L70999A32228K70842B4035K60339a60526H433e5107A96084
13123B88200e142C73587j46266F1511F008c7511A45577Q903D5067J3024e1606
$$ y = [164314, 190004, 91696, 54987, -47509, -43825, -104010, 85920, -27630, -71860, -39427, 406122, 15046, 163301, -108034, -142071, 76734, 51613, -88143, 51572, -129496, 159070, 100313, -181374, 182770, -95741, 1067, 128672, 157336, 215219, -172377, -22742, 185234, 110320, 115979, 114008, 52432, -398892, 346231, 104682, 45870, -228019, 47571, -163745, 202797, 196153, -55491, 217388, -48596, 2029, 56981, 408737, 150790, -94685, 289909, -120739, 202886, 196606, 391685, 15736, -57925, 78681, -157770, -119664, 116215, 4160, 165493, 118780, -19068, 288968, 94727, 129145, 500144, 132228, 403070, 24035, 284374, -160526, 8433, -55107, 196084, 288200, -5142, 373587, 227321, 61511, 6008, -37511, 145577, 154480, 45067, 58091, -51606]
13111b01905A0517a6579q2065j04080C55845g3971C22015p7945i8058A24087R2800
13100B16887d15021E6719P9283N3617b6201H8266N7502J37993j40787K128N8794
13089B03896a47562A5147h6396b3495F8573J17225J9481k9666o0827Q0124o6941
13078A27969m2071J38241A05669Q7677h1221B97606b13984A02192Q9474o8279
13068A23387L295n8731K06575K9624A22089a77873A12325j9507c9764B04425J9751
13057B24176a50278B5654K97153j36513G6017a48591A5213J7958A1412Q6765K52261
13046C50438c6997I1893j1222J02494q9858J3308h133A03044M99952B26267a92510
13034b2484A91234J00200A5257R9571Q1609E4029L4657K40976D7946L68370i0572
$$ y = [-201905, 10517, -16579, -98644, -202724, 355845, -73971, 322015, 244070, -98058, 124087, 216887, -415021, 56719, 136002, 189619, -26201, 88266, 145768, 283761, 142974, 145102, 203896, -147562, 15147, -86396, -23495, 68573, 185798, 205279, 175613, 114786, 194910, 127969, 85898, 224139, 105669, 193346, -81221, 297606, -213984, 102192, 191666, 123387, 126682, 67951, 274526, 304150, 122089, -177873, 112325, 92818, -39764, 204425, 224176, -150278, 25654, 322807, 186294, 76017, -148591, 15213, 33171, 11412, 98177, 350438, -36997, 91893, 80671, 183165, 93307, 106615, -8133, 103044, 602996, 226267, -192510, -22484, 191234, 291434, 15257, 114828, 196437, 54029, 88686, 329662, 47946, 416316, -90572]
13022D15133C0620J95566o0168l9618a5050G1520j2075h7277A59774J49647b89780
13010e1276B54716m9273K11023a20157b931G1136J56921m6508N5265g7114B91373
12998G3096l2987J76697a57431C2895K7710a70509A5929J23061b18400B17385
12987C20107P9701i9686A82401J2522I6779J90029A33969K47163F5246a09869
12976A32970n3407i7766j10927g1691o1176D5875J00688a57209A05896k7275J24070
12965B02691a86014B64208a43489j2600A84667f8435n3031B11524g2745B405J37503
12954A39908o5688P0671a41123d0733k0093m6933A05916b21845M6069a2264C44363
12942b24539f7999j20432C0757J11478a03434a8551q1618E462b27075A53221f2267
$$ y = [415133, 30620, 226186, 166018, 126400, -15050, 71520, 59445, -87277, 159774, 309421, -289780, -51276, 254716, 205443, 416466, -120157, -2931, 71136, 228057, 181549, 236814, -77114, 291373, 73096, 40109, 216806, -157431, 32895, 60605, -170509, 15929, 138990, -218400, 217385, 320107, 399808, -99686, 182401, 194923, 96779, 286808, 133969, 381132, 65246, -109869, 132970, 79563, -97766, -208693, -71691, -132867, 45875, 146563, -157209, 105896, 78621, 202691, -186014, 264208, -143489, -156089, 184667, -68435, -121466, 211524, -72745, 2405, 139908, 74220, 144891, -141123, -40733, -60826, -107759, 105916, -221845, -175776, -12264, 344363, -224539, -67999, -188431, 30757, 142235, -103434, -18551, -100169, 5462, -227075, 153221, -62267]
12930c43662c0489C1009b46092a03323B56397l4011a25907M7185C874P1818j089
12919G4603h6479B8551g3055G8552k1886M516f7395B33117a04756p8225I7152
12907C5089P9614h8106B41639a44217A05568M6708a93674A29127a71019A73693
12896c44651C40563A0679a2660I4116a86940p9736a25924k32757a05411B61228
12885h5851A5559K9569J1906a46652F7042b0323A14247a00334o5186A34993R1425
12874B26418m153A04006K30668b84083H4342r441L26550G4320a24940D28892b1646
12862g0206F212a76111A59708F9973O2951Q0768b18829F6343L32841f5682c0086
12850C2379K8091J6000J25401E6445a43701b5416A33192b2019G7172A6170g5558
$$ y = [-343662, -30489, 31009, -246092, -103323, 256397, 222386, -125907, -78722, 3874, 75692, 74603, -86479, 28551, -73055, 78552, 56666, 61182, -67395, 233117, -104756, -182981, 97152, 35089, 114703, -88106, 241639, -144217, 105568, 152276, -193674, 129127, -171019, 173693, -344651, 340563, 10679, -12660, 94116, -186940, -266676, -125924, -358681, -105411, 261228, -85851, 15559, 45128, 57034, -146652, 67042, -20323, 114247, -100334, -165520, 134993, 226418, 222265, 104006, 334674, -284083, 84342, 74901, 401451, 74320, -124940, 428892, -21646, -70206, 6212, -176111, 159708, 69973, 132924, 213692, -218829, 66343, 399184, -65682, -30086, 32379, 60470, 76470, 201871, 56445, -143701, -25416, 133192, -22019, 77172, 16170, -75558]
12838A95693a76935P0894A86036a687k94446L3429H6350a17516L5136k02064F9942
12826B2185J78060k6509b63629G5867b56805B15011l3243A2386J3465g3775a0768
12814B2346K2317L08568a10942b1526B99247a02724B3020A0090c3727j50447H9996
12802B52494m7510r5294J65253b64024B00956r9028a98806K3911O5098G7274B3915
12790H2906c1865B19408K4661a67701A27837n7507K0331d7734C32912H0142d60694
12778G7899H179g2750B25967a08217L0750k73134A867J11211J14069b0286n4203
12767g4489F6631b9094j59996D8610i781k9416B91248g2370p7775C46765b02275
12755e4868C56596m300g6530A24801c76412A34785J04027a68778F3397b2019k16247
$$ y = [195693, -176935, -106041, 186036, -1687, -296133, -262704, 86350, -117516, -82380, -284444, 69942, 22185, 200245, 173736, -263629, 75867, -256805, 215011, 181768, 12386, 25851, -73775, -10768, 22346, 44663, 353231, -110942, -21526, 299247, -102724, 23020, 10090, -33727, -184174, 89996, 252494, 204984, 109690, 274943, -264024, 200956, 101928, -198806, -174895, -109797, 77274, 23915, 82906, -31865, 219408, 244069, -167701, 127837, 70330, 90661, -47734, 332912, 80142, -460694, 77899, 8179, -72750, 225967, -108217, -77467, -350601, 1867, 113078, 227147, -20286, -74489, 66631, -29094, -189090, 48610, -9781, -39197, 291248, -72370, -150145, 346765, -202275, -54868, 356596, 352296, -76530, 124801, -376412, 134785, 238812, -168778, 63397, -22019, -238266]
12744b38266B49132K3684A15614b25462A14394a42016A78100o0756Q8719C4791
12733A55021a28226N4248j61629C08998b02730e8809m3230G3421o496a24449B36875
12721I6158m2981J71172D6960K33660a78309N4986b7257m1471A6669J11825f8830
12709B73401j27876L2224O6347m7354K41181q2946a28198C42335b5868C62695
12698B9933a21951C95988E0502L1427b15451A27891K45359L5866B4080A0794a32672
12686A04100i1965b153D9078J03829c04031C09341j53955g225B49314F1011b1248
12674f8614A58736O843h1313B37325m8896a18466A40019R4591m6682I341M2125
12663E1466b98785B30408o1432c5727I2537K29093j29037I4006k959R7349h7709
$$ y = [-238266, 249132, 272816, 115614, -225462, 114394, -142016, 178100, 117344, 206063, 34791, 155021, -128226, -73978, -235607, 308998, -202730, -58809, -102039, 73421, 66925, -124449, 236875, 96158, 53177, 224349, 46960, 280620, -178309, -123323, -27257, -68728, 16669, 128494, -68830, 273401, 145525, 177749, 244096, 196742, 437923, 354977, -128198, 342335, -25868, 362695, 29933, -121951, 395988, 50502, 81929, -215451, 127891, 373250, 409116, 24080, 10794, -132672, 104100, -91965, -2153, 49078, 152907, -304031, 309341, 155386, -7225, 249314, 61011, -21248, -68614, 158736, 165579, -81313, 237325, 188429, -118466, 140019, 234610, 187928, 9341, 51466, -298785, 230408, 168976, -35727, 92537, 321630, 192593, 94006, 91047, 188396, -87709]
12651B52099M6136A36476J44714E5988i1337C44267A52582Q7273n6767D6688J875
12640D8563A8568e6416j30065A04616E2260i0066E780a56585e5732A66218n8939
12629A07279M7266J50467K4055A30629b17354c9549f761j62899C32127A50751
12618A45603F3833J33951D4501J04102c64396A73511b41480E0189a15741F2271
12607A72799a70473H2152B5849N10389g1100K036B43598J2409i154B41482a7887
12595A41759L7944Q0438e2092B39875b11944A95279G6438c4884A9102a64297j05131
12584b69428A27693J13177C9981a58810b237r0742I1575d02446C20923F6350a30502
12572a6824A31643J82819g4264B73974a25715B26598a42444C76030b38155G8490
$$ y = [252099, 298235, 136476, 281190, 55988, -91337, 344267, 152582, 239855, 183088, 46688, 48563, 18568, -56416, -186481, 104616, 52260, -90066, 5780, -156585, -55732, 166218, 107279, 154545, 305012, 329067, 130629, -217354, -39549, -6761, -169660, 332127, 150751, 145603, 63833, 197784, 44501, 148603, -364396, 173511, -241480, 50189, -115741, 62271, 172799, -170473, 82152, 25849, 536238, -71100, -69064, 243598, 256007, -9154, 241482, -17887, 141759, 179703, 260141, -52092, 239875, -211944, 195279, 76438, -34884, 19102, -164297, -269428, 127693, 240870, 39981, -158810, -2237, -92979, 91575, -402446, 320923, 66350, -130502, -16824, 131643, 314462, -74264, 273974, -125715, 226598, -142444, 376030, -238155, 78490]
12561A70485C9567J06779J51531a01458B33612D8826i3235n1987A56719P5349
12551B32068j03954J79166n0094j03052B1918J81195b53981B48011g1151H2558
12540a54758H1242L0662f5990C6901O3342a74126a146I0691P8317P5484a80514
12528a75106d2810I4846a08271B2525P8537B1644a67483A00659g7117C21379j54384
12517A66995k2969l7402d8673H5448a8985B48880j3598L497L9165A1004c76657
12505D2440M5822a75391A05677a0812B92776q1905b9286R0I1856J16894d4097
12493a25640L439j31369Q6513D7340g6301p9040g6041a5476B45322A02549J02098
12482B04647g1856a3943k23533e9121E3265k4567b4242C5395L2856N568C6552
$$ y = [170485, 39567, 146346, 297877, -101458, 233612, 48826, -93235, -145222, 156719, 232068, 128114, 307280, 257186, 154134, 21918, 203113, -253981, 248011, -71151, 82558, -154758, 81242, 111904, -65990, 36901, 100243, -174126, -1146, 90691, 169008, 244492, -180514, -175106, -42810, 94846, -108271, 22525, 101062, 21644, -167483, 100659, -77117, 321379, 166995, 144026, 106624, -48673, 85448, -18985, 248880, 235282, 238779, 277944, 11004, -376657, 42440, 88262, -175391, 105677, -10812, 292776, 210871, -29286, -29196, 91856, 208750, -44097, -125640, -122201, -253570, -167057, 47340, -76301, -155341, -76041, -15476, 245322, 102549, 204647, -71856, -13943, -237476, -59121, 53265, 28698, -24242, 35395, 68251, 73819, 36552]
12470b03875b1748F2361f7673j49087B5762N5042J37593b31240A23239h7487C91337
12458f2183j28635A21273b09501R5564A11591C6677b77061h0989l3347k16161
12448c30497g1947l6014k19901a00603k21958e1270A06148B178b19020B00303
12437A21092J32995g0339B70769h684k426A87607a24136j39025D82a54266J7025
12426a37241A40550a08990R169C6711K2948a25564j24760D3717d04A53557d967
12414c0502D4124D312J59087m9497a68031c5552j32313d6171l11771d6252j71437
12403b17689K8664F7741P1755J58850a20073A25263b32949b7390A72361c1952
12392A88062a05811E4349a03748A68860e0876E7658b09411H7955N1202d6140A95301
$$ y = [-203875, -21748, 62361, -67673, -216760, 25762, 80804, 218397, -231240, 123239, -87487, 391337, -62183, -190818, 121273, -209501, -113937, 111591, 36677, -277061, -80989, -114336, -330497, -71947, -107961, -327862, -100603, -322561, -51270, 106148, 2178, -219020, 200303, 121092, 254087, -70339, 270769, -8684, -11110, 187607, -124136, -263161, 482, -154266, -137241, 140550, -108990, -99821, 36711, 59659, -125564, -250324, 43717, -404, 153557, -4967, -30502, 44124, 4312, 163399, 113902, -168031, -35552, -167865, -46171, -357942, -46252, -217689, -189025, 67741, 139496, 298346, -120073, 125263, -232949, -27390, 172361, -31952, 188062, -105811, 54349, -103748, 168860, -50876, 57658, -209411, 87955, 139157, -46140, 195301]
12380B86186A4403i9339G9391i2608B3927J71394a53410f6983B02688b85792l9412
12369c25204J15176P6930B0563M3188K11178c569A45261N537n7117a01478A70695
12357E7345M4491J20037a68237B59520d4423C37854a7228k37493H4505Q9764O7567
12346B41836a3700k41595f1231k55180F7216M2294J14796M9068c4973A59298b0389
12334A18592C9037a62770A16621E3590c2962A01764a14736n6090C26878c61370
12323B50443a19096j01707P8143P454B09250d54347a52419A47049a89659r7207
12313b86866c8030A58890f0810B09560a2158A27164l9002b15431D7030K66462
12303C13492g9991A21171E0599b19191C127L08839c06075F936J17558J48178h9998
$$ y = [286186, 14403, -99339, 79391, -92608, 23927, 195321, -153410, -66983, 202688, -285792, -325204, -210028, -133098, 20563, 63751, 274929, -3569, 145261, 150798, 93681, -101478, 170695, 57345, 101836, 221873, -168237, 259520, -44423, 337854, -17228, -254721, 84505, 174269, 241836, -13700, -255295, -61231, -316411, 67216, 109510, 224306, 273374, -34973, 159298, -20389, 118592, 39037, -162770, 116621, 53590, -32962, 101764, -114736, -170826, 326878, -361370, 250443, -119096, -220803, -142660, -135206, 209250, -454347, -152419, 147049, -189659, -286866, -38030, 158890, -60810, 209560, -12158, 127164, 88162, -215431, 47030, 313492, -79991, 121171, 50599, -219191, 3127, 311966, -306075, 6936, 124494, 272672, -89998]
12291a85052A29822m3575a66695h281q6827A52800F4885R7923b15156B04258a20983
12279H0603b34636L7855d8288A34991f4235B76141Q1091A11717J28274J23425
12269C63416j23784c9885A0436b19317C49918a27238o9431a5143A26024N9717
12259A85741C8878J36548J27681r8651r5244a45017B27859c6037B21239J2062
12249B33301A01972a14751q0998j5666A53834K72415j08387G1127N065a72020
12238A20904c6086A98951C9251d1578k02007A54670K592l6199P6290o9986h9284
12226B58369G578L79434G6197h1979D31738j80082J23518J24696a86012A49747
12215C54590j13888e4958n5152E1844J88632b82780H2617N2244J2823c9554B55838
$$ y = [-185052, 129822, 86247, -166695, -8281, -95108, 152800, 64885, 162808, -215156, 204258, -120983, 80603, -234636, -196781, -48288, 134991, -64235, 276141, 357232, 111717, 239991, 363416, 239632, -39885, 10436, -219317, 349918, -127238, -196669, -15143, 126024, 185741, 38878, 175426, 303107, 204456, 109212, -145017, 227859, -36037, 221239, 233301, 101972, -114751, -195749, -211415, 153834, 426249, 317862, 71127, 76192, -172020, 120904, -36086, 198951, 39251, -41578, -243585, 154670, 157262, 121063, 197353, 127367, -89284, 258369, 7578, 387012, 76197, -81979, 431738, 251656, 375174, 499870, -186012, 149747, 354590, 240702, -54958, -110110, 51844, 240476, -282780, 82617, 134861, 147684, -39554, 255838]
12203h916B71026F367Q6290J77683I8966i8199a0332l26440A80664A7094f8406
12191a57795g0443C05340j17601k9033i5984b8757F1295L30168r9811E4906h2994
12179B84372C38K63807j04575G0714J57788a25782B34420a35702C64361h125j75458
12168a83583A87631H7357O6975G5843i3139B31057a08572B26424J1222j5155e0487
12156b78879C02917o1972n4179O9325e3784J1981B06882G5045r906a39031c5267
12144b32770B7675p236Q5468F778K05732C4841J49238a16105B16225h6934A27201
12132b9481B1768c01660A83189I0542O7218O8976D3487L9234a05111A42557B7554
12120B15127K3007E3111M0885b30727A76575b70102g345j54523A92236o2417J51137
$$ y = [-8916, 271026, 6367, 92657, 270340, 98966, -98199, -10332, -336772, 180664, 17094, -68406, -157795, -70443, 305340, 187739, 158706, -95984, -28757, 61295, 391463, 291652, 54906, -82994, 284372, 338, 264145, 159570, 70714, 228502, -125782, 234420, -135702, 364361, -8125, -183583, 187631, 87357, 154332, 75843, -93139, 231057, -108572, 226424, 237646, 222491, -50487, -278879, 302917, 240945, 186766, 256091, -53784, -41803, 206882, 75045, 65139, -139031, -35267, -232770, 27675, 20439, 105907, 6778, 212510, 34841, 184079, -116105, 216225, -86934, 127201, -29481, 21768, -301660, 183189, 90542, 157760, 226736, 43487, 82721, -105111, 142557, 27554, 215127, 238134, 53111, 93996, -230727, 176575, -270102, -7345, -161868, 192236, 129819, 280956]
12109B80956C0929d24593A65722f9923B51606f7379H1233a04777j5817B58584
12098d90118a29654A73020h9847F9577b70708A38669K74648c9994j62404M6252
12088a56146A83111C6745J8233b9293R910A41820d6973q7733A20484C6795K95933
12077C32728j07384N68943N09768L4250E87673B63915j12013n7812a22406E8922
12066A63918n4468m4788B5692a7263A48950o0599a16606B87538C228a13462A19526
12054a96911A5330J86584r4965d18621J30886A49046J083d27080L5036A56625
12043a08889j91193m4032A42965f7347D09188B9047K91025a13197A45694B1659
12032g8198D5525J73044b2872j14929A55155F3984c98039f1939k51780g1554B0201
$$ y = [280956, 30929, -424593, 165722, -69923, 251606, -67379, 81233, -104777, -120594, 258584, -490118, -129654, 173020, -89847, 69577, -270708, 138669, 413317, -39994, -202398, -156146, 183111, 36745, 54978, -29293, -19383, 141820, -46973, -134706, 120484, 36795, 332728, 225344, 794287, 1304055, 1338305, 587673, 263915, 151902, 94090, -122406, 58922, 163918, 109450, 64662, 25692, -17263, 148950, 88351, -116606, 287538, 3228, -113462, 119526, -196911, 15330, 201914, 106949, -418621, -287735, 149046, 150129, -427080, -392044, 156625, -108889, -300082, -344114, 142965, -67347, 409188, 29047, 320072, -113197, 145694, 21659, -78198, 45525, 218569, -22872, -137801, 155155, 63984, -398039, -61939, -313719, -71554, 20201]
12020a08567E5916P9313L9578L0564G1393b57281f2856C49450a16936k25964a12816
12008b23390k90987a65310A57626a35254O1991j47325C7647a53010H1063b61063
11997a9906A2911a31633j90267a3305B02673j7339q0769g235k52474o840E1695
11985B58211a71584i997r0955r8117l2437h8730D8954a43531a6108l9078j26382
11974a81568C22394c5388k7799H062a10825M2499A83961a43979L2760n9976a5555
11962E2194J01475Q8771b21940g8631B02415C312a36976B64349e9361k2971L9581
11951d2751F3215a8763p7944A8315J19287h6426G8042e8068B91628a62679c4978
11939F0251J12751H4183c1575E958K6529a27287H583a79211a959p8019p2522o4321
$$ y = [-108567, 55916, 135229, 174807, 205371, 71393, -257281, -62856, 349450, -116936, -342900, -112816, -223390, -514377, -165310, 157626, -135254, -73263, -220588, 37647, -153010, 81063, -261063, -19906, 12911, -131633, -321900, -13305, 202673, 185334, 104565, -7235, -259709, -266549, 51695, 258211, -171584, -9997, -100952, -199069, -231506, -88730, 48954, -143531, -16108, -55186, -181568, 322394, -35388, -63187, 8062, -110825, -68326, 183961, -143979, -111219, -171195, -15555, 52194, 153669, 242440, -221940, -78631, 202415, 3312, -136976, 264349, -59361, -82332, -42751, 63215, -18763, -96707, 18315, 137602, -86426, 78042, -58068, 291628, -162679, -34978, 60251, 173002, 84183, -31575, 5958, 32487, -127287, 8583, -179211, -1959, -79978, -152500, -216821]
11927b16821M1024A9894a28816E15J47442c36371p259A11213h1300H3818N492
11916H9310m3918K6717Q5819a95816C8046a70550L3810N4935F9224e7245B02158
11904g6039o8455c112A16089J59891h3379I9992g2077l25654a6942C39563A34400
11892d5123m4482H2786k3798R0925J92177a05561q7845C7856e2267H2690a2719
11880a04152j60888A20855i0765B4945h3910C6502f1658j22135M0785c3419r2336
11869a25755e7391j81063h5705c4428A61572a18906j13713A91847b35479a9831
11858d4150j39474C1134b97608e4138F8715b44337D9862N6245C1613b30545G6578
11846D741J79880a31881o0693P7545B56551a23157A05071f9355j87312g7391C12307
$$ y = [-216821, -175797, 19894, -128816, 515, 147957, -336371, -343630, 111213, -81300, 83818, 89310, 45392, 72109, 157928, -195816, 38046, -170550, -136740, -81805, 69224, -57245, 202158, -76039, -144494, -3112, 116089, 275980, -83379, 99992, -72077, -397731, -16942, 339563, 134400, -45123, -89605, 82786, 58988, 149913, 342090, -105561, -193406, 37856, -52267, 82690, -12719, -104152, -265040, 120855, -90765, 24945, -83910, 36502, -61658, -183793, -143008, -33419, -125755, -57391, -238454, -85705, -34428, 161572, -118906, -232619, 191847, -235479, -19831, -44150, -183624, 31134, -297608, -54138, 68715, -244337, 49862, 106107, 31613, -230545, 76578, 4741, 184621, -131881, -192574, -115029, 256551, -123157, 105071, -69355, -256667, -77391, 312307]
11834D4251a14055Q375H6460c31026A8759a37690A1190e7987k43108H4112a37811
11822a01401k85830I9627J53286Q7531c32722J04382o002m4623A42616b9755A43015
11810b02774A16542l1411c8607j74749M9998A90569n8289a32448A22185a09001
11799B7331L81633f0783B2250A0853J82008c6399E4111L14467a66032B62247b6698
11787G3502p719d17F379L4384e59824g7743C1161h5568A52771C7297j4030K62464
11775B85731e2188A52656a9958A84891h1197C8068f2712C9819b95727C83108f5735
11763B2339b07003E9410J7105B8055a8926j91710B30507e164A67467k7572a36915
11751A14657D3893a68457B82623b49271B5606c7046C7931N0923M073K27280j38595
$$ y = [44251, -114055, -105680, 86460, -331026, 18759, -137690, 11190, -57987, -301095, 84112, -137811, -101401, -387231, 99627, 252913, 340444, -332722, -228340, -234342, -278965, 142616, -29755, 143015, -202774, 116542, 85131, -38607, -213356, -163358, 190569, 132280, -132448, 122185, -109001, 27331, 408964, -60783, 22250, 10853, 192861, -36399, 54111, 368578, -166032, 262247, -26698, 73502, 65783, -417, 6379, 40763, -559824, -77743, 31161, -85568, 152771, 37297, 23267, 285731, -52188, 152656, -19958, 184891, -81197, 38068, -62712, 39819, -295727, 383108, -65735, 22339, -207003, 59410, 76515, 28055, -18926, -210636, 230507, -5164, 167467, 139895, -136915, 114657, 43893, -168457, 282623, -249271, 25606, -37046, 37931, 88854, 92927, 320207, 181612]
11740A81612m1320g7826C74466a1887j6202k00488A96192a71165j84897b6220
11729A51794F89J2639a03027p9469K3846f9811a6194j41070K7881A30453b62900
11717I5241B769a01380A05047l4397b00139C33788b28372A5136b3149r8065I5581
11705F4507R493J82878a16142M4082A50080N9928H4054a31179Q068I7252a05024
11693b7687B20402J19555h8070j14671O370A71950A2603e4813j17777c4645j5820
11682e0465B72851l1038a72672F2344J9124o793a27551F7096F980d8902m2128
11671i1030k1620B02289d08762A90540a81007A082b39137g2078B47743F5537j2729
11660E2808j837Q2222K17788j64213H8334a85399a3205r2038d5775E7092O8804
$$ y = [181612, 140292, -77826, 374466, -11887, -28089, -228577, 196192, -171165, -356062, -26220, 151794, 689, 13328, -103027, -182496, -158650, -69811, -16194, -157264, -129383, 130453, -262900, 95241, 2769, -101380, 105047, 70650, -200139, 333788, -228372, 15136, -23149, -121214, 95581, 64507, 74000, 256878, -116142, -72060, 150080, 210008, 84054, -131179, -123111, 97252, -105024, -27687, 220402, 339957, -88070, -202741, -196371, 171950, 12603, -54813, -172590, -34645, -50465, 272851, 241813, -172672, 62344, 81468, 74675, -127551, 67096, 6980, -48902, -91030, -112650, 202289, -408762, 190540, -181007, 1082, -239137, -72078, 247743, 65537, 52808, 50971, 133193, 350981, 186768, 88334, -185399, -13205, -105243, -45775, 57092, 125896]
11649A25896a07191B11334l5962b6134L238k76671R1684I5579A4752a46684j00980
11638b47664B47304a91034b174A0242D482i8776A29777L2440a191B13482q2011
11627A31471a09831A82803o0840P7802r2311a78697B04467n8278p1037J0216p720
11616G7648b52820K4469c0570D32116I7597B7464M9944a37239A78903J39447j29963
11605A88387f7373L2182K555B60858O086j18885J21226l7205a77477L0893B41989
11593H0951q801b02934i5498j0222c7755i046m937E3876K5912a21435C93261A47723
11580B13271q4426C6554h2439D9014d3258D00782i8552F8720K63012r6409A4011
11568D12818b13793i141A31000K7707F3707k6499a03883C11388B8686P0789a4978
$$ y = [125896, -107191, 211334, 175372, -26134, -22896, -299567, -207883, 95579, 14752, -146684, -247664, 247304, -191034, -2174, 10242, 4482, -98776, 129777, 162217, -1191, 213482, 131471, -109831, 182803, 121963, 199765, 107454, -178697, 204467, 146189, 75152, 85368, 77648, -252820, -228351, -30570, 432116, 97597, 27464, 77408, -137239, 178903, 318350, 188387, -67373, -35191, -32636, 260858, 266944, 148059, 269285, 232080, -177477, -146584, 241989, 80951, 72150, -202934, -95498, -105720, -37755, -9046, -13983, 53876, 79788, -121435, 393261, 147723, 213271, 128845, 36554, -82439, 49014, -43258, 400782, -98552, 68720, 331732, 235323, 14011, 412818, -213793, -9141, 131000, 158707, 63707, 37208, -103883, 311388, 28686, 99475, -14978]
11556c05783D7918e7503A05042j3951a51090H6632M8198K57393A42173K2813D6192
11544a17813B33539D6972M6553j0102i1800A43207a50152A63549l8077a16365
11533b30353G2281d987j684B31662h9975a4662D39980a95194A90293J24040H4909
11521a11329k4175B10584J27365A53518B2368O1494h6654B76723G5326k7339M8431
11510I6418A1523h329A75153D3542a4492B4218c1768C04317g6754K4656J0126
11499d1972A06914J45630a08933B34075c12161A19482A9501J24777J51712j30232
11489A65758D2852j3515N6334g092D91664I467O2467K3905N61455k65134j49198
11478B42962I8368Q9161D9543K55039A33824D8290N7783l1139J72039j19885a20019
$$ y = [-305783, 47918, -57503, 105042, 91091, -151090, 86632, 134830, 392223, 142173, 164986, 46192, -117813, 233539, 46972, 93525, 83423, -91800, 143207, -150152, 163549, 125472, -116365, -230353, 72281, -4987, -6671, 231662, -89975, -14662, 439980, -195194, 190293, 314333, 84909, -111329, -135504, 210584, 337949, 153518, 22368, 83862, -86654, 276723, 75326, 47987, 96418, 11523, -8329, 175153, 43542, -14492, 24218, -31768, 304317, -76754, -52098, -41972, 106914, 252544, -108933, 234075, -312161, 119482, 19501, 144278, 295990, 165758, 42852, 29337, 85671, -7092, 491664, 9467, 71934, 95839, 657294, 392160, 242962, 98368, 187529, 49543, 304582, 133824, 48290, 106073, 74934, 246973, 127088, -120019]
11466B02682a07811A08904e7638D9449f5412p0002A24364J62934R3333a42234
11455A38144J13465m2774H8226J57525B1572J69995J59255E9576n550e9514C9736
11443a23380k91551A28561l0080A369a47431C66385A25256c867A38344j2164K9069
11432A55249J66846g6286N669j12978e6334A25591b61895A9427E662a16329A8552
11420a44623B84084b0856A97139b3196B42686A737R1740I737c10090P0518a00235
11408D09819A32357J06657e4913g976B30130J5423o8702H5584b01156B89177h8095
11396a26938q2678o1880B35240Q6007b84817d9441C3404a61292k176B04358c7101
11384b64962a23849L5710r7279f3250k33236a43754A99391b16099G2634J1658
$$ y = [202682, -107811, 108904, -57638, 49449, -65412, -135414, 124364, 287298, 380631, -142234, 138144, 251609, 208835, 88226, 245751, 21572, 191567, 350822, 59576, 54026, -59514, 39736, -123380, -414931, 128561, 98481, 1369, -147431, 366385, 125256, -3867, 138344, 126180, 155249, 322095, -76286, -70617, -183595, -56334, 125591, -261895, 19427, 5662, -116329, 18552, -144623, 284084, -20856, 197139, -23196, 242686, 1737, 93477, 9737, -310090, -239572, -100235, 409819, 132357, 239014, -54913, -7976, 230130, 245553, 176851, 85584, -201156, 289177, -88095, -126938, -209616, -271496, 235240, 321247, -284817, -49441, 33404, -161292, -163468, 204358, -37101, -264962, -123849, -88139, -185418, -63250, -296486, -143754, 199391, -216099, 72634, 84292]
11374H4292a08937C61644a43343A01213a76088A10386b76916E313f4364r7059
11364a61423A96286k2603a43165B9685a3836m1522A99685I0519B6414J92499E2701
11352h2736A44477a8603C6125h6412F8137k3381A6224b05666c5953C200J07318
11341A10518c5500A63650G5221I825e9505c605j16872d4712j38691A4671J78905
11330A93576a7558q4199C33319A58169a81637B96506b2419k63240E6911a39163
11319h1953r9481c158E4602e7302G4040J38643G0551g9606j45516o2561H4022
11307B79816l8921m0784a8051p3658j38813m3585B4141J2780i3435k806n1890
11296a48131F8414M2515M8948c46099A77397b11848m1371C07678b12056A81230
$$ y = [84292, -108937, 361644, -143343, 101213, -176088, 110386, -276916, 5313, -64364, -161423, 196286, 173683, -143165, 29685, -13836, -55358, 199685, 90519, 26414, 218913, 52701, -82736, 144477, -18603, 36125, -86412, 68137, 44756, 16224, -205666, -35953, 3200, 110518, -35500, 163650, 75221, 9825, -59505, -3605, -120477, -44712, -183403, 14671, 193576, -17558, -101757, 333319, 158169, -181637, 296506, -22419, -285659, 56911, -139163, -81953, -181434, -3158, 54602, -57302, 74040, 212683, 70551, -79606, -225122, -287683, 84022, 279816, 240895, 200111, -18051, -91709, -230522, -274107, 24141, 36921, -93435, -96241, -148131, 68414, 110929, 159877, -346099, 177397, -211848, -253219, 307678, -212056, 181230]
11285b47128b2869l22001A02190K15163d453j36048c7128H2623g3909j24292g433
11273A64292h5493l64354c0235H3920A4677a89615e0188m1949B6687b39035c9950
11261B35547a05661q788j59409O5001A3664a11651M2948k5591j14553B33839A06298
11249e3497O021B33793a30254j05535a11487I7403c5571A50700h7043A51167G2552
11237I9838C1840i1917J0805k75820a70362d1357A15847a43309e4439F467a12065
11225G7832L3041h3964l16943h0480A21539c5458l42590B57310I5538b09189p4857
11214b84046B19747F2825b7489B40425b9832a1204A05367b89147A18331b92694
11203b15152A46377h3680A98865D2725f6558C12236b67042C15282j06524c28952
$$ y = [-247128, -22869, -344870, 102190, 317353, -4453, -140501, -37128, 82623, -73909, -198201, -7433, 164292, -85493, -449847, -30235, 83920, 14677, -189615, -50188, -92137, 26687, -239035, -39950, 235547, -105661, -114449, -273858, -208857, 13664, -111651, -68703, -94294, -208847, 233839, 106298, -53497, -47476, 233793, -130254, -235789, -111487, 97403, -35571, 150700, -87043, 151167, 72552, 99838, 31840, -91917, -81112, -356932, -170362, -41357, 115847, -143309, -54439, 6467, -112065, 77832, 110873, -83964, -400907, -80480, 121539, -35458, -378048, 257310, 95538, -209189, -284046, 219747, 62825, -27489, 240425, -29832, -11204, 105367, -289147, 118331, -292694, -215152, 146377, -83680, 198865, 42725, -66558, 312236, -267042, 315282, 208758, -328952]
11192A59746p7111M4697l8003b87288A66596C3876c71602g6275c0837j76859E3642
11180a53784a2382k58549a35369A07146l3805k6042d7519B8277a36203A08017
11169B0605g2717A94481a02827F7024b1889A1711L46998a87887G3353c31912h7313
11157H1149K01576a46763o198K4267e334D8747I299M7342b84036B31062B23d6469
11144C7748J07145a8730k80205h6460B10760l2691c5496j77338A18514b22808
11133A69958d1135I3357l3472i7760p0882P5302B07735D722J24425J67575h4272
11121a5672D7840b3409A84904D9270K82105c9955C8296J07935K44214O8662a8840
11109d6071C16232J24644k12341o4598N7514N2859A08116K69970a94080E1801
$$ y = [159746, 82635, 127332, 89329, -287288, 166596, 33876, -371602, -76275, -30837, -207696, 53642, -153784, -12382, -270931, -135369, 107146, 73341, 47299, -47519, 28277, -136203, 108017, 20605, -72717, 194481, -102827, 67024, -21889, 11711, 358709, -187887, 73353, -331912, -87313, 81149, 282725, -146763, -152961, -128694, -5334, 48747, 9299, 56641, -284036, 231062, 223, -46469, 37748, 144893, -18730, -298935, -86460, 210760, 178069, -35496, -212834, 118514, -222808, 169958, -41135, 93357, 59885, -97760, -168642, -93340, 207735, 4722, 129147, 296722, -84272, -15672, 47840, -23409, 184904, 49270, 331375, -39955, 38296, 146231, 390445, 459107, -18840, -46071, 316232, 440876, 228535, 163937, 221451, 274310, 108116, 378086, -194080, 51801]
11098a5484C33804b8536O807B35474J05497F7113g891G7343C2546R8219J18547
11087B49312F1115e7960D20J32087L31427A0699J46168J29339g49A26700D5302
11075I7602J81959G1230L19162C0752Q3687G882L99907L3596L2130q9843E1427
11063B45382M81k2081K27951L81616C28006J78913q4300R4566B12581N03927k85869
11052D30639M5594J12171J76607l64844K21017j5089O5097K28280B97331M20182
11042G17513q4069J90371j81173k20205K22978m5119o4459J6745J63548j22106
11032E94024K73914D22861L24894Q533p7123j17817J17813j7928m9481P4147p6994
11021F08905k26803J44882j445l6833M9239k7109o8164K45459L1815k92830Q7598
$$ y = [-15484, 333804, -28536, -21729, 235474, 340971, 67113, -7891, 77343, 32546, 130765, 249312, 61115, -57960, 420, 132507, 463934, 10699, 156867, 286206, -749, 126700, 45302, 97602, 279561, 71230, 390392, 30752, 114439, 7882, 407789, 441385, 473515, 383672, 51427, 245382, 245863, 223782, 451733, 833349, 328006, 506919, 422619, 517185, 212581, 716508, 430639, 476233, 588404, 765011, 400167, 621184, 606095, 671192, 899472, 297331, 717513, 633444, 823815, 642642, 422437, 645415, 600296, 535837, 552582, 716130, 594024, 867938, 422861, 747755, 756288, 679165, 561348, 679161, 661233, 611752, 685899, 608905, 382102, 526984, 525539, 488706, 537945, 510836, 442672, 688131, 719946, 427116, 514714]
11010E14714j20946P9927j85036L43728N7648k7025j8624m2487j20436q1696J50732
10999E50499K9363J6916j68991J17282J6897j02352L80457m4213k50499J07396
10989F52755K7170P6008J47277m5549L144K58985l34711L54960k84156J41401
10979I97284R0437J82249j08020Q66021r0404K32476R4999K16134j46001L20090
10969B655265q8903l40064l11273j58742j49234L7914J50694k92565j6772O2145
10959A548465Q5596O2791K83599l8577m71197L6685l60731K73733l26653j00465
10949I93246Q7886m74077J25641k59853F8625J23061J63608k0226k6010j6441
10939B92617k0457f435B32375H6091J85953E7877L8025a13841A62460E7678K67161
$$ y = [514714, 393768, 473695, 288659, 632387, 690035, 663010, 644386, 601899, 481463, 399767, 550499, 579862, 596778, 427787, 545069, 561966, 459614, 840071, 795858, 545359, 652755, 679925, 755933, 903210, 857661, 860805, 1119790, 785079, 1140039, 855883, 997284, 1087721, 1269970, 1161950, 2027971, 1937567, 2170043, 2265042, 2481176, 2335175, 2655265, 2566362, 2226298, 1915025, 1756283, 1607049, 1644963, 1795657, 1503092, 1486320, 1548465, 1634061, 1696852, 1980451, 1941874, 1470677, 1507362, 1146631, 1420364, 1093711, 993246, 1081132, 607055, 732696, 472843, 68625, 191686, 355294, 335068, 309058, 292617, 272160, -6435, 232375, 86091, 272044, 57877, 95902, -113841, 162460, 57678, 324839]
10928C24839n4636f5514A7935a9492A47050a77533A12347g9859C76947j07166
10918B69781h8641m1568d2878k9667A23393g2078b7455c382k75456C22733i4765
10906a35r6319L5005D9000c06374J43597e8430j96926J12679I7905K2715a0886
10894f395o3081A58784d2524l54559a70448A81178e6846j98094P7879C10080d982
10882e2470f640k81147I2753i4893F5003a48177j19407B14870H9718J8840c22535
10870a96426A48494F0572h2001l60127d7072n7495B22759a25733l21985A84838
10859b22168h7675c1859q6238E0597K73060b39015F0629c3740l0379l1328L820
10848i1627j6087q076n2706N1039H853P8487a38358E7686Q239O8840A1579P3168
$$ y = [324839, 270203, -65514, 17935, -19492, 147050, -177533, 112347, -79859, 376947, 269781, -88641, -130209, -42878, -72545, 123393, -72078, -27455, -3382, -278838, 322733, -94765, -135, -96454, -61449, 49000, -306374, -162777, -58430, -255356, -142677, 97905, 120620, -10886, -6395, -69476, 158784, -42524, -397083, -170448, 181178, -56846, -254940, -177061, 310080, -4982, -52470, -6640, -287787, 92753, -94893, 65003, -148177, -267584, 214870, 89718, 108558, -322535, -196426, 148494, 60572, -82001, -442128, -47072, -104567, 222759, -125733, -447718, 184838, -222168, -87675, -31859, -118097, 50597, 323657, -239015, 60629, -33740, -64119, -95447, -91627, -107714, -115790, -168496, -117457, 8853, 87340, -138358, 57686, 65925, 134765, 11579, 84747]
10836H4747e5573I0792i583B49084a60849J2005C880J20191n8073a67760n1770
10825b19530j31021Q6901H3201J39480a51898p1361j99146A76999a84936P3535
10815a11401N0060A22303E1454i398A09826a36332b9388G81L1979f2548r6072
10804a58620A57836B596c7989j29496f452k91195A26746a82769L1177k03947f8500
10792E8728c5790k1004B4607b48260G7496b35501B54588g7961A68948a7557n5838
10781g3395F0039a02877A51353m3805M9305a01018j78402D9163c26967f8040b2661
10769B87674C4586L1192P2794f8295l25820a43610f9236j24615J9369A09183f2483
10757D1306J5006a88770d0003B7987R9932j3000J02731e5878A5578J12157a56233
$$ y = [84747, -55573, 90792, -9583, 249084, -160849, -148844, 3880, 124071, 65998, -167760, -219530, -350551, -263650, 83201, 222681, -151898, -223259, -422405, 176999, -184936, -111401, -61341, 122303, 51454, -9398, 109826, -136332, -29388, 781, 32760, -62548, -158620, 157836, 2596, -37989, -167485, -6452, -297647, 126746, -182769, -151592, -355539, -68500, 58728, -35790, -56794, 24607, -248260, 77496, -235501, 254588, -77961, 168948, -17557, -73395, 60039, -102877, 151353, 107548, 156853, -101018, -279420, 49163, -326967, -68040, -22661, 287674, 34586, 65778, 138572, -68295, -394115, -143610, -69236, -193851, -174482, 109183, -62483, 41306, 56312, -188770, -40003, 27987, 127919, 114919, 217650, -55878, 15578, 127735, -156233]
10745d9401B37186B6337a76015g9813j10937K1311C6953b15476j20208d7567n14954
10734e62521H6393g2789B11653b3678q0632k5363B59336d9956B59040c9587j70744
10723b10331c297j83169A51412b74624e0905p7015o359J9773j05519B04026d4472
10711f05G6328i2021Q12c794l93681J71571i5024B74175C5675c12325g9143B01555
10698A21702f4704a265j7494n8149G3225e02551a08496A50255J3183b36824C81536
10686A37140a2878q3753l7945j30672a25888l35666C57756F5585c71910f6471
10675a16933k05198A55460F0446b85234a38324M3940D53J81457a01695A25715
10664I6113f4005A26356e871j19940J1218I7736g1142j27527l0079j01820J9118
$$ y = [-49401, 237186, 26337, -176015, -79813, -190750, -169439, 36953, -215476, -335684, -47567, -562521, 86393, -72789, 211653, -23678, -104310, -129673, 259336, -49956, 259040, -39587, -210331, -3297, -186466, 151412, -274624, -50905, -127920, -134279, -114506, -220025, 204026, -44472, -605, 76328, -92021, -91209, -3794, -397475, -225904, -95024, 274175, 35675, -312325, -79143, 201555, 121702, -64704, -1265, -18759, -76908, 73225, -502551, -108496, 150255, 163438, -236824, 381536, 137140, -12878, -96631, -134576, -265248, -125888, -461554, 357756, 65585, -371910, -66471, -116933, -322131, 155460, 60446, -285234, -138324, -94384, 453, 181910, -101695, 125715, 96113, -64005, 126356, -5871, -125811, -114593, 97736, -71142, -198669, -228748, -330568, -311450]
10653c11450O1358B7687c24166e3526A75411E353b35290R5816l342B52164c5269
10641A57844F5446J03248a04714C1674M7597a04401J6442F4107L1264m4792f132
10629A13686a24368K587j72553a10826D8046a83132h3332B09J02064A0015J51480
10618A61495h4301m7149E9113j8314P620O7168K4261b8819j4839k21435B6346
10606D4553M7738c96938J8787I5748N3972a75939e0534D3203J5085a36171J4967
10595a21204C8363e9058k46953E3920a27021j59918c8101I6236f7013b5717k7480
10584e3197B97080I7604B2969J76663a56024p646B12350F5079d9225k99198C191
10572i7744J2228H3796C127K5851B21h2889A86542R3265a39140A05648A1461N0517
$$ y = [-311450, -250092, 27687, -324166, -53526, 175411, 5353, -235290, -139474, -142816, 252164, -35269, 157844, 65446, 168694, -104714, 31674, 79271, -104401, -87959, 64107, 95371, 50579, -6132, 113686, -124368, -121781, -294334, -110826, 48046, -183132, -83332, 209, 102273, 10015, 161495, -84301, -131450, 59113, 40799, 48419, 115587, 139848, -28819, -43658, -265093, 26346, 44553, 92291, -396938, -378151, 95748, 149720, -175939, -50534, 43203, 58288, -136171, -121204, 38363, -59058, -306011, 53920, -127021, -286939, -38101, 96236, -67013, -25717, -53197, 297080, 97604, 22969, 199632, -156024, -163670, 212350, 65079, -49225, -348423, 3191, -97744, -85516, 83796, 3127, 28978, 221, -82889, 186542, 279807, -139140, 105648, 11461, 61978]
10560F1978c3344A5116N096a77142J8649G8996b3407G633J15545b96112B50151
10548A54478i7043B9493c8260m9734j44658C8604a05880l721c4446k78845J29681
10537a83610h9478q4748j42156k13747A68737a17371c0662k30539f4627A56181
10526c03528B16810D1881M3568i593n4657m7222d7764q9654r9916d7142j48100
10515a95242b1908A11758A4710N9257C2943e0830A424J8965P3620a81232r0220
10504b71452A40618A6133b44540E4630K9821b23984F7986M1285b92209i3904j78659
10493b72563R3259n599M9801p976C8598l804g055A04278N0727J54579I8629J8779
10481A17408K71441j83928K96359k00107A20131Q1092l3008b89131c678l98180
$$ y = [61978, -33344, 15116, 20212, -177142, -158493, 78996, -23407, 7633, 123178, -296112, 250151, 154478, -97043, 29493, -38260, -87994, -232652, 38604, -105880, -109601, -34446, -313291, -183610, -89478, -174226, -316382, -530129, 168737, -117371, -30662, -261201, -64627, 156181, -303528, 216810, 41881, 85449, -9593, -64250, -111472, -47764, -137418, -237334, -47142, -195242, -21908, 111758, 14710, 73967, 32943, -50830, 1424, 20389, 94009, -181232, -271452, 140618, 16133, -244540, 54630, 84451, -223984, 67986, 109271, -292209, -93904, -272563, -179304, -184903, -135102, -143078, 38598, 34794, -7055, 104278, 155005, 309584, 98629, 117408, 388849, 204921, 501280, 301173, 120131, 201223, 168215, -289131, -3678, -401858]
10471d01858a29336j02265C0233J97480a22172d579j07816C0604K06364a67382
10460c4805n4008D7469A8987b5763A40742K279F1527c42522K2387b519j13413
10449a15932d956A31448b42327D2266h5277j4115A6165J35554A6308a60554A16633
10437D7298N9167a06015K24j09961k1229N0303Q625Q1095k3168B97606a52849
10425C0033J75964d5718A35800a24233B48204a5597B73676H708i2286A25429e0983
10413a07208F913Q9142O8496R9016a82571I4255b53440a3269G4093c7242a3837
10401D9601a56716L7D3746A7166J51010D28K8929M33089H8570c48307A67689K9944
10389A97633p2215J26099o1507A2218a07319E5034A0651R4690J96805b8717j36166
$$ y = [-401858, -129336, -231601, 30233, 227713, -122172, -4579, -112395, 30604, 236968, -167382, -34805, -88813, 47469, 18987, -25763, 140742, 143021, 61527, -342522, -320135, -2519, -115932, -4956, 131448, -242327, 42266, -85277, -99392, 16165, 151719, 16308, -160554, 116633, 47298, 106465, -106015, -105791, -215752, -236981, -186678, -178053, -96958, -120126, 297606, -152849, 30033, 205997, -45718, 135800, -124233, 248204, -15597, 273676, 8708, -92286, 125429, -50983, -107208, 6913, 96055, 164551, 263567, -182571, 94255, -253440, -13269, 74093, -37242, -13837, 49601, -156716, -156679, 43746, 17166, 168176, 428, 29357, 462446, 88570, -348307, 167689, 197633, 125418, 251517, 190010, 12218, -107319, 55034, 10651, 105341, 302146, -28717, -164883]
10378a64883B99451J96081A08399m9838K62532q5558l5442K3163j0073A5244N18692
10367E33936j71644j6482l6609K68025B76811k8762f4480D06909a453n305B21723
10355A71637J38616J23784A53755J61715o1980K31144A30609J78737A12111Q5238
10345A97349M06966j31590Q2929j29915A93267K94845i4124J9384F6832Q9661
10335A56493L23034A4067J35031Q2504M2060g7400C68636o3390g9030B1638a65283
10323g1717j7274B76960i801A01398l3379L1913d5549A92333l2495k3764D9461
10311g8993j47821C8944a48569A3626J71625K8978q4682e9247k23128C365L4025
10300C7390g7639L6835A26403a35543H2088N4203e0346F4181n948f204l01201
$$ y = [-164883, 299451, 495532, 108399, 58561, 321093, 235535, 200093, 223256, 213183, 15244, 533936, 362292, 345810, 309201, 577226, 276811, 248049, -64480, 406909, -1453, -6758, 221723, 171637, 310253, 434037, 153755, 315470, 253490, 484634, 130609, 309346, 112111, 197349, 604315, 472725, 555654, 425739, 193267, 488112, -94124, -74740, 66832, 156493, 479527, 14067, 149098, 231602, 273662, -77400, 368636, 305246, -79030, 21638, -165283, -71717, -88991, 276960, -9801, 101398, 68019, 99932, -45549, 192333, 159838, 136074, 49461, -78993, -226814, 38944, -148569, 13626, 185251, 214229, 129547, -59247, -282375, 3365, 37390, -77639, -40804, 126403, -135543, 82088, 136291, -50346, 64181, 58233, -6204, -307405]
10289c07405A44098J15717F9547B6000a48678k1995K7127K9145A73491A1272d0692
10277a27071A32304b5729j41023A92352C1330f3546A72357D2044K6353J93737
10267B62134e9427j17388A81091J81500G043R8687K0282J7635L9991k1148L28788
10256D91278B17770K93395A12855J63938D2052n304A4071b2200m9704F7942a81305
10244a10443B23640j8444a82990M6503A55657a37468a7675A81258G7332c4714
10233B0004a08092F328K18191a01131o1911A85009a49641a5564j38574M3973C07544
10221B83130b12070j66515G2754d4476j93870A90522e2038m9930K9498A44897
10210a41346D0605b12438P5628M855K0987A74169b12268j71184C7697d3901C2797
$$ y = [-307405, 144098, 259815, 69547, 26000, -148678, -170673, -143546, -114401, 173491, 11272, -40692, -127071, 132304, -25729, -166752, 192352, 31330, -63546, 172357, 42044, 68397, 262134, -59427, -176815, 181091, 362591, 7043, 105730, 126012, 143647, 183638, 162490, 491278, 217770, 511165, 112855, 276793, 42052, 36748, 14071, -22200, -71904, 67942, -181305, -110443, 223640, 205196, -182990, -136487, 155657, -137468, -17675, 181258, 77332, -34714, 20004, -108092, 6328, 224519, -101131, -163042, 185009, -149641, -15564, -154138, -110165, 307544, 283130, -212070, -378585, 72754, -44476, -238346, 190522, -52038, -101968, -72470, 144897, -141346, 40605, -212438, -136810, -131955, -110968, 174169, -212268, -383452, 37697, -43901, 32797]
10198h362m61283A78196h2138b3735A07125J71638g6667r7906L3187q752a1405
10186B8912i9179q7856A15918f8453E8997c24986g3622n5201a4387F5493l1217
10175C4276a40959j1036B02494p9033i7693B473a58629k39483B68841c21029A88907
10163I9919l1948g1147O454j90588n4403b3921A8903a86477A23469J07615q4053
10152A47031a79401G0440d9827q9272b236p843l60942a31275B00139a67525o0151
10141b27676P2022L2421A83704F9718b14399k463P6157A29783D5902J10413f3169
10129A02975g4274k6932o3855f2262O323r5118N0304A32397b22345l1199G0353
10117e7027k2427a1392j38051j99779B4572O1304a44658j66583N2592k8799B5434
$$ y = [-8362, -469645, 178196, -82138, -23735, 107125, 278763, -76667, -174573, -141386, -150138, -11405, 28912, -99179, -187035, 115918, -68453, 58997, -324986, -73622, -128823, -14387, 65493, 34276, -140959, -151995, 202494, 123461, -97693, 2473, -158629, -398112, 268841, -321029, 188907, 99919, 67971, -71147, -64693, -255281, -309684, -23921, 18903, -186477, 123469, 231084, 147031, -179401, 70440, -49827, -139099, -2236, -10079, -371021, -131275, 200139, -167525, -227676, -155654, -123233, 183704, 69718, -214399, -216862, -140705, 129783, 45902, 156315, -63169, 102975, -74274, -101206, -165061, -62262, -55939, -151057, -100753, 132397, -222345, -253544, 70353, -57027, -79454, -11392, -149443, -349222, 24572, 85876, -144658, -311241, -258649, -287448, 25434]
10105E9003b33020d4992k08479o2782A7268b88982B90241L1644b90424A62317
10094A05493K42561a39174A276b27404j03820E5700J26552a77453A517g5363B50968
10082d837q0945n0469L8513C71487A19562d48191e9530j18588B04142d2224B5131
10070G2323b72041e7220l929E9582a17280J410j31710l080C02788b95396J04579
10059a90817K3079f4544A6692d4813k45500c3899k81822J22377A55556C0539a64493
10047d9216E6798c7873H1695c1162A72437a33818B2893b63425E0986d3927j09874
10036a53801j05208L4831f0513k779a8564A42635D2766a70508K1653b3010g573
10024B78110d817j0017F1563O8896b36571A15455a26425b2336a411C04758b83539
$$ y = [59003, -233020, -44992, -253471, -316253, 17268, -288982, 290241, 321885, -290424, 162317, 105493, 348054, -139174, 1276, -227404, -331224, 55700, 182252, -177453, 1517, -75363, 250968, -4837, -85782, -136251, -97738, 371487, 119562, -448191, -59530, -178118, 204142, -42224, 25131, 72323, -272041, -57220, -61149, 59582, -117280, -115870, -247580, -250660, 302788, -295396, -190817, -167738, -64544, 16692, -44813, -290313, -33899, -315721, -193344, 155556, 30539, -164493, -49216, 56798, -37873, 81695, -31162, 172437, -133818, 22893, -263425, 50986, -43927, -153801, -259009, -224178, -60513, -63292, -18564, 142635, 42766, -170508, -148855, -23010, -7573, 278110, -4817, -14834, 61563, 130459, -236571, 115455, -126425, -22336, -1411, 304758, -283539]
10012A99108C0938a56133j34474J26762j9328j25666d9401e24k23441I39K20892
10001B21831m8618B4171c69556d7545A17042m5354b10726j6294F0148c29794A2885
9989c00921B86397i7426l74549F2034k23a47561p6799A0721d1942l83281a9620
9977C0619J1376b85279J16307P5537j04722N6332M2407C73950A53139C3903a38882
9965B55074e5887k19025J30191G9795b17803J00488o2036A6601J51850B7782a53524
9953G7751O1773E3570K9764c93130A6297K77128a34514k06843b0684k15012C32199
9941a90002j05574c2629k68174C57630G907a28889l23258a0193D2413a64327A31096
9929E5055J55134C5281a43407j64031N8355N6038A24808a62630l25008A35420
$$ y = [199108, 30938, -156133, -290607, -163845, -183173, -308839, -49401, -524, -223965, 939, 221831, 173213, 24171, -369556, -47545, 117042, 71688, -210726, -227020, 60148, -329794, 12885, -300921, 286397, -97426, -471975, 62034, 61811, -147561, -224360, 10721, -41942, -425223, -19620, 30619, 41995, -285279, -168972, -93435, -198157, -141825, -99418, 373950, 153139, 33903, -138882, 255074, -55887, -274912, -144721, 79795, -217803, -117315, -179351, 16601, 168451, 27782, -153524, 77751, 139524, 53570, 83334, -393130, 16297, 293425, -134514, -341357, -20684, -235696, 332199, -190002, -295576, -32629, -300803, 357630, 7907, -128889, -452147, -10193, 42413, -164327, 131096, 55055, 210189, 35281, -143407, -307438, -249083, -193045, 124808, -162630, -487638, 135420]
9918C4856c81381e3073k46323c692C1207b14563a01859j18635A10123b60833J19029
9907a41804E6751K738c2341A37923j5361a34829b5806A56676h7381A9100a33088
9895h8374k37358J21032Q4870C1909b35389Q0371J0660A0246J9141b08322B56758
9883A33906K57389e8474B43273m3415i6820j94916j01256J30179g9844A05632
9872d08276a08227q5137A3845A555M5702J32360a36173A51287b77975a06135H230
9860b77949M8575K4100P8477N430A55103a83557o485M1612a7498f965D233e8112
9847f8304N532A60680m246c7746k40788a35716j16098c6510j76597A47335D9384
9835a71242A6680c0902m61255b2626A9143a14729e1894G427L2001a00167m398
$$ y = [34856, -381381, -53073, -299396, -3692, 31207, -214563, -101859, -220494, 110123, -260833, -141804, 56751, 59489, -32341, 137923, 122562, -134829, -25806, 156676, -87381, 19100, -133088, -88374, -325732, -204700, -119830, 31909, -235389, -155018, -144358, 10246, 29387, -208322, 256758, 133906, 391295, -58474, 243273, 199858, -96820, -291736, -392992, -262813, -79844, 105632, -408276, -108227, -193364, 13845, 1555, 47257, 179617, -136173, 151287, -277975, -106135, 8230, -277949, -229374, -205274, -126797, -121367, 155103, -183557, -190042, -148430, -17498, -6965, 4233, -58112, -68304, -62772, 160680, 156434, -37746, -278534, -135716, -251814, -36510, -213107, 147335, 49384, -171242, 16680, -30902, -492157, -22626, 19143, -114729, -51894, 7427, 39428, -100167, -104565]
9824a04565j19340j62899A70367e53o3329A64845l7401d7573m9575A76449F010
9812G5581b22418f0008j35323Q9332c6228j88898P7834q9524I5767i8714j53933
9801b52647L2796C7142n931c19138a22369A33230E5854K2927J41859R75I0511
9789a08557G1189a58547r033m1264O6047C8868i2072o5745O6400j83256a15744
9777g7558L4151j11142L6249E412b04012L5861G2502h2624N659K7575C36378e4366
9764c36952J0412e8670l07352a79909B828M1072e42m8974A3380f5831A62810a05933
9751g9115G6278o450Q1476c85303A09291J85859H4544b1440k6175e370j23056
9740a28426K8690l66269B38508a5753j06871e9124A27126a8524l7197C85625A05185
$$ y = [-104565, -223905, -386804, 170367, -553, -63882, 164845, 127444, -47573, -97148, 176449, 6010, 75581, -222418, -60008, -195331, -105999, -36228, -225126, -147292, -236816, 95767, -98714, -252647, -219851, 37142, 31211, -319138, -122369, 133230, 55854, 78781, 220640, 221615, 90511, -108557, 71189, -158547, -167580, -208844, -142797, 38868, -92072, -157817, -91417, -274673, -115744, -77558, -43407, -154549, -118300, 5412, -204012, -168151, 72502, -82624, -76965, -49390, 336378, -54366, -336952, -326540, -58670, -366022, -179909, 2828, 43900, -542, -49516, 13380, -65831, 162810, -105933, -79115, 76278, 69828, 151304, -385303, 109291, 295150, 84544, -21440, -47615, -5370, -128426, -99736, -466005, 238508, -15753, -122624, -59124, 127126, -18524, -55721, 385625, 105185]
9728G7395J10014R4051b7441j96041a4392A66291N2353e10700C3528a9327n684
9717b5011A40302i0483j7502F8119J2244J13295B1805g9864K8533k41189P7960
9706b14560A65243b07990O9952k01368K1158M7070J11315l34419C851P3883J41160
9695B18894c85217J59310E2611g9201o1799I1372a56502O3754o4119A83553a18406
9683a07569j7187l7081l9085A10905b620j7934A6018N0179c10003a03550M4554
9672e8996R274C0148J28435a61846O2501a6466H8721l0460a67253H1011a43300
9660b46740E5824b27807G746b48635j1782J15248M9651k64326a32857B11426I2210
9648a55880A60652C413c7350j5913A43976d93536a17375l50678J49412h9665r4641
$$ y = [77395, 187409, 281460, -27441, -223482, -14392, 166291, 218644, -510700, 33528, -19327, -25011, 140302, -90483, -107985, 68119, 80363, 193658, 21805, -79864, -51331, -292520, -214560, 165243, -207990, -138038, -339406, -318248, -271178, -159863, -494282, 3851, 77734, 218894, -385217, -225907, 52611, -79201, -141000, 91372, -156502, -92748, -156867, 183553, -118406, -107569, -124756, -161837, -200922, 110905, -2620, -20554, 16018, 66197, -310003, -103550, -58996, -49722, 30148, 158583, -161846, -99345, -16466, 88721, 58261, -167253, 81011, -143300, -246740, 55824, -227807, 7746, -248635, -260417, -145169, -95518, -359844, -132857, 211426, 92210, -155880, 160652, 3413, -37350, -53263, 143976, -493536, -117375, -468053, -318641, -89665, -184306]
9637a84306B13859C9862a44969b069k74737A4057a82504G7992C993c73871d4388
9625f4917A52618o5275K79371a13697j41960f2156J2848k0645a5883A79269q8610
9614I0659b58881Q3085a6114k0225k03778a08113A37901b7445r2015j83080m6537
9603c49077A63862p3785g1020k81737C16839j19016J15666d7269j61867I7177
9592c05996K097A37214g3248A57801K5940h7570A18886a4227o6138j8457j15807
9581b14629b9384m32074a83254B56093c4690B73792b08287o6682n0188E8009a87029
9569D8426a00959H6217N995N1464C6303L02910c4479C7815d7381B4897c11728
9557b38283F4898a74028m0533A68192a58321A68954b44405a0903p9998B55247
$$ y = [-184306, 213859, 39862, -144969, -2069, -276806, 14057, -182504, 77992, 3993, -373871, -44388, -64917, 152618, 87343, 366714, -113697, -255657, -62156, -49308, -69953, -15883, 179269, 90659, -258881, -175796, -16114, -36339, -240117, -108113, 137901, -27445, -119460, -302540, -349077, 163862, 90077, -71020, -352757, 316839, 197823, 313489, -47269, -209136, 97177, -305996, -303899, 137214, -73248, 157801, 183741, -87570, 118886, -14227, -80365, -98822, -214629, -29384, -461458, -183254, 256093, -34690, 273792, -208287, -274969, -325157, 58009, -187029, 48426, -100959, 86217, 92212, 143676, 36303, 339213, -34479, 37815, -47381, 24897, -311728, -238283, 64898, -174028, -214561, 168192, -158321, 168954, -244405, -10903, -90901, 255247]
9546c771j38466E499b38542j815A50320b43054a04377b4457q6177A93021m6133
9535A46888b63147a12456F2546d3151A39624a76343A55986b27946R8300j45655
9525b75301a01432p7442B4202c8702C43560c47921c1822E5397J84690A19355a49099
9513d3651k09476C9368J50893n5242b5370A93116a16142L7232l79754d211p1114
9502g5325l08316a56745e721A62785b48010L4730g044j35981o1200b5412B0969
9490b06045A52286a74208A39590a51391B26310a00979B28152O8433A25637d4030
9479D9732J7529c9282k52766j0569J6967c9638j35996G8558a96734L9956c0144
9467D6032b16803k59267d6359l74139a48535L1897A51614g5929n4946j80925h7570
$$ y = [-3771, -142237, 5499, -238542, -240357, 150320, -243054, -104377, -24457, -110634, 193021, 146888, -263147, -112456, 62546, -43151, 139624, -176343, 155986, -227946, -129646, -275301, -101432, -178874, 24202, -38702, 343560, -347921, -31822, 55397, 240087, 119355, -149099, -43651, -253127, 39368, 190261, 135019, -25370, 193116, -116142, -78910, -458664, -4211, -75325, -383641, -156745, -5721, 162785, -248010, -213280, -7044, -143025, -204225, -25412, 20969, -206045, 152286, -174208, 139590, -151391, 226310, -100979, 228152, 296585, 125637, -44030, 49732, 67261, -39282, -292048, -302617, -285650, -39638, -175634, 78558, -196734, -156778, -30144, 46032, -216803, -476070, -46359, -420498, -148535, -116638, 151614, -75929, -130875, -311800, -87570]
9455b1200B48301A16444B5863a74598a3828m682j47286I0612K41618f357j42467
9444a48824g3057A67403i0530F1060c07971q0929J22660J18034A11533J11698
9434B23231a03954d7792C20354e1275m4872j92960C9967a46124H2884a10399A03037
9422D21J00548k1153b12381P8098c1631k54502K4507h7850r0486L2865j61856
9411c07327A97297a57740a7711K727j13082C0644J04727M9442a06463c6001I412
9399g923B56262j13172k3491a27862l26288A5356a82795c9383j57840A04668A5764
9387f8813k46443R1007k5924I2249J17721A50a10223j37381l4223A3992b91619
9375A28169N2960M0613b48763B52505g7687A45286B6888c16308i3830C9950a96690
$$ y = [-21200, 248301, 116444, 25863, -174598, -13828, -18510, -165796, 90612, 332230, -6357, -148824, -73057, 167403, -90530, 61060, -307971, -388900, -266240, -148206, 111533, 223231, -103954, -47792, 320354, -51275, -96147, -289107, 39967, -146124, 82884, -110399, 103037, 421, 100969, 79816, -212381, -134283, -31631, -286133, -261626, -87850, -178336, -145471, -307327, 197297, -157740, -17711, -14984, -128066, 30644, 135371, 184813, -106463, -36001, 9412, -7923, 256262, 143090, 119599, -127862, -454150, 15356, -182795, -39383, -197223, 104668, 15764, -68813, -315256, -224249, -250173, 92249, 209970, 150, -110223, -247604, -281827, 13992, -291619, 128169, 181129, 221742, -248763, 252505, -77687, 145286, 26888, -316308, -93830, 39950, -196690]
9363C11989b76733E4241M3378b00560a7355k256A09869Q4155H8971Q1807a18686
9351b01627A06731R3835a0827N322B2660b34366A58652l7954g8589b408C40692
9339c04810j1035a08449C01944c78134A03202l3302A939a49439j65028f9459b6723
9327G1738a31140E0128d9095j58135c1262A2171b40791m514A17922m3411a1238
9315b0334A01095B0490b37752j0107f8891b3447j57020l2254A45044e5979B72436
9303a9872l5379B5986c66613J55616k1916a8550I2725g5302B33749g1449b7049
9291A391d4628j87432K4143j1354a2246B4846a66570a4848p8535E0101b21664
9279a4679k85432B758J69696F5024J17050n1685O866Q4214a52737H2003C2983
$$ y = [311989, -276733, 54241, 97619, -200560, -17355, -19611, 109869, 194024, 88971, 170778, -118686, -201627, 106731, 200566, -10827, -5505, 22660, -234366, 158652, 120698, -78589, -2408, 340692, -304810, -315845, -108449, 301944, -378134, 103202, 69900, 1939, -149439, -314467, -69459, -26723, 71738, -131140, 50128, -49095, -207230, -31262, 12171, -240791, -245305, 117922, 74511, -11238, -20334, 101095, 20490, -237752, -247859, -68891, -23447, -180467, -212721, 145044, -55979, 272436, -19872, -55251, 25986, -366613, -210997, -232913, -18550, 92725, -75302, 233749, -71449, -27049, 1391, -44628, -232060, -207917, -219271, -12246, 24846, -166570, -14848, -93383, 50101, -221664, -14679, -300111, 2758, 172454, 65024, 182074, 130389, 137255, 221469, -152737, 82003, 32983]
9267a54524g5983k01199M5677N2423n4935I2839A098f7270G557a27461O0850j25387
9255a91998g9948C412b61303e818p2678j8487I0679a06602A50299c35906J40003
9244a95903d174B8967b99689h4708B15920a0668m66395A75424g3857a8948n11934
9233e30882g8076l03742B96115a58940r6170d5486I3291b10953G8099Q9784c45062
9221f5340j70k01005B4862e9776A24258n8716e4550B05337A1563h6160R271I2248
9208b14724b9522m6910K409B7005M0961g9383K1667D05638a6135m4707L392l43252
9196d00702f4383h975A29937B2915K33630A00813P4148b024m0257n4722M0184
9185e6819A33178a62985l2802A48759a75963Q294C0985A4464b56845M4624p045
$$ y = [-154524, -75983, -277182, -231505, -179082, -234017, 92839, 1098, -67270, 7557, -127461, -66611, -191998, -79948, 3412, -261303, -5818, -78496, -96983, 90679, -106602, 150299, -335906, -195903, -4174, 28967, -299689, -84708, 215920, -10668, -477063, 175424, -73857, -18948, -530882, -78076, -381818, 296115, -158940, -255110, -45486, 93291, -210953, 78099, 167883, -345062, -65340, -65510, -266515, 24862, -59776, 124258, 65542, -54550, 205337, 11563, -86160, -76889, 92248, -214724, -29522, -76432, -74023, 27005, 67966, -79383, -57716, 405638, -16135, -60842, -57450, -400702, -64383, -8975, 129937, 22915, 256545, 100813, 174961, -2024, -42281, -97003, -56819, 133178, -162985, -195787, 148759, -175963, -167669, 30985, 14464, -256845, -212221, -219266]
9174b19266E7387A5655a24411N255G3545b22174P5489k16510J58830a0594k46048
9163b56642A2344b05484g9501B5982a17128B72454A9666b73604b0472o0420b1101
9151D5176E536P705b18460B5324i7945j21141e9398A85532a2181k32443k9388
9140b74012a21954A51272i7928D2439k0474H948K30084e9664k23797F5078a9924
9128e5832A99852a02863j73068B5819c4163k59352a0613k12391g785j9140o6816
9117i3741J7108r3265M0775f0023q056j59208M0214j93425D317b41368J02988
9106a38380L1201b4722J333j2669k73054M593m0042f3154k8102I2856c79934A4935
9093a52316B0283f4966l52029K01597r5861J2914B69793d41758K20685D4960i4702
$$ y = [-219266, 57387, 15655, -124411, -119156, 73545, -222174, -146685, -363195, -204365, -10594, -256642, 12344, -205484, -79501, 25982, -117128, 272454, 19666, -273604, -20472, -80892, -21101, 45176, 5536, 13241, -218460, 25324, -97945, -219086, -59398, 185532, -12181, -244624, -274012, -121954, 151272, -97928, 42439, 21965, 8948, 239032, -59664, -283461, 65078, -19924, -55832, 199852, -102863, -275931, 25819, -34163, -293515, -10613, -223004, -7785, -26925, -93741, -76633, -169898, -129123, -60023, -68079, -227287, -187073, -380498, 4317, -241368, -138380, -107179, -24722, -23389, -36058, -309112, -304519, -344561, -63154, -91256, 92856, -379934, 14935, -152316, 20283, -64966, -416995, -215398, -311259, -298345, 269793, -441758, -221073, 44960, -94702]
9081a07834H1921b15222k3462Q3498B17356d4127A39967K4531a43015I1495c7104
9069B56720a54989O1830C51030i8851j01630G7110k1995a32293m0478K8875h855
9057a0512j33958C5195J14367c16034B04278b33651a1172k57152I4061N7136J00310
9046B51507B852h6962j27880K6582h5346C17976g0633H4957K1778a68794e6971
9034A86133h7083A04148D1879J42819q3811a88044B07845q6501M08402i3907C536
9022a98128j3536f0687j09286P2534b9432j89021p8233a20993e9197B63058A9883
9010a1350l54656a47291c3110p8105b8658D9193K6180i165j40081A71037B7730
8998d064G2934j8165Q8952a55889j038J9965k9094j92929g8182q814B34495a63981
$$ y = [-107834, 81921, -215222, -238684, -155186, 217356, -44127, 139967, 164498, -143015, 91495, -37104, 256720, -154989, -93159, 351030, -98851, -200481, 77110, 55115, -132293, -172771, -143896, -8855, -10512, -144470, 35195, 149562, -316034, 204278, -233651, -11172, -268324, 94061, 151197, 251507, 2852, -86962, -214842, -188260, -85346, 317976, -70633, 84957, 106735, -168794, -56971, 186133, -87083, 104148, 41879, 184698, 100887, -188044, 207845, 121344, 529746, -93907, 3536, -198128, -211664, -60687, -169973, -97439, -29432, -218453, -296686, -120993, -59197, 263058, 19883, -11350, -366006, -147291, -33110, -111215, -28658, 49193, 75373, -9165, -149246, 171037, 27730, -4064, 72934, 54769, 143721, -155889, -156927, -136962, -166056, -358985, -78182, -86996, 234495, -163981]
8985G0889a61604D10759a94623A86832d4609G6341a70522j70676A8198h2773i644
8973A86767k541j0688a45853j03962F7938D161a78164c7426A10615M9074p0660
8962H9029m1909J61865a59770G2746c5152B1293b51592a9963k8421A03978a08727
8950d1906N764D9154c69826a43909F135R894b40505B57457a3835m4232l0377D5904
8937a59733C55197j42628L38201A06429a1134A06702a1416A42072a35108L4124
8927a00984D42018K37279o0228R63211K779908P129994J871331D079802A981369
8917A331796n61938o4365k00419b55945E4307h54H2260L11045B6342K48192H3886
8905A9228b41845C6587J11514A4913L4880d2888p3712m1312j5342b2066o8917
$$ y = [70889, -161604, 410759, -194623, 186832, -44609, 76341, -170522, -341198, 18198, -82773, -9644, 186767, 184226, 173538, -145853, -249815, 67938, 4161, -178164, -37426, 110615, 159689, 89029, 47120, 208985, -159770, 72746, -35152, 21293, -251592, -19963, -48384, 103978, -108727, -41906, -36142, 49154, -369826, -143909, 6135, 16029, -240505, 257457, -13835, -58067, -88444, 45904, -159733, 355197, 212569, 550770, 106429, -11134, 106702, -11416, 142072, -135108, -100984, 442018, 679297, 619069, 1582280, 4362188, 11492182, 13363513, 4079802, 1981369, 1331796, 769858, 705493, 505074, -255945, 54307, -854, 82260, 393305, 26342, 274534, 83886, 19228, -241845, 36587, 148101, 14913, 49793, -42888, -116600, -157912, -173254, -22066, -90983]
8894i0983j69402h6852B60196b05221B6022a62414M5227A5536J7160a05802K4146
8883h1656A37252j9088K8553a45925j01746h4500j12596A69755a74964J0409a529
8871F7411h0861q4300f394k1002n4378A0302a07196a1296k70700F3530b5229A26239
8858B14159g4909E0643O9233b8072I7477b3268j23181j69190a11603j49586C745
8846b87849I738J92339M6695c0838r1933j79628J21417K836L1694N4747B09935
$$ y = [-90983, -260385, -86852, 260196, -205221, 26022, -162414, -117187, 15536, 32696, -105802, -81656, 137252, 118164, 146717, -145925, -247671, -84500, -197096, 169755, -174964, -164555, -1529, 67411, -80861, -165161, -6394, -27396, -81774, 10302, -107196, -11296, -281996, 63530, -25229, 126239, 214159, -74909, 50643, 119876, -28072, 97477, -23268, -146449, -315639, -111603, -261189, 3745, -287849, 9738, 202077, 248772, -30838, -122771, -302399, -180982, -178146, -146452, -91705, 209935]
$$ [...]
##END NTUPLES=NMR SPECTRUM
##END=
