##TITLE=AC1531_ROEFFECT0008_8214028_5WJAKzEJno
##JCAMPDX= 6.0         $$ Bruker NMR JCAMP-DX V2.0
##DATA TYPE= NMR SPECTRUM
##DATA CLASS= NTUPLES
##ORIGIN= BRUKER
##OWNER= Administrator
$$ 1.72 TOPSPIN		Version 2.1
$$ 2013-10-04 20:48:17.954 -0700  Administrator@X
$$ Compression mode = diff/dup
##.OBSERVE FREQUENCY= 400.02188249412
##.OBSERVE NUCLEUS= ^1H
##.ACQUISITION MODE= SIMULTANEOUS (DQD)
##.ACQUISITION SCHEME= undefined
##.AVERAGES= 64
##.DIGITISER RES= 22
##SPECTROMETER/DATA SYSTEM= spect
##.PULSE SEQUENCE= noesygpps1d.comp
##.SOLVENT NAME= COFFEE_meoh
##.SHIFT REFERENCE= INTERNAL, COFFEE_meoh, 1, 14.96092
##AUDIT TRAIL= $$ (NUMBER, WHEN, WHO, WHERE, PROCESS, VERSION, WHAT)
$$ ##TITLE= Audit trail, TOPSPIN		Version 2.1
$$ ##JCAMPDX= 5.01
$$ ##ORIGIN= Bruker BioSpin GmbH
$$ ##OWNER= Administrator
$$ $$ E:\/data/COFFEE/nmr/AC1531_ROEFFECT0008_8214028_5WJAKzEJno/12/pdata/1/auditp.txt
$$ ##AUDIT TRAIL=  $$ (NUMBER, WHEN, WHO, WHERE, PROCESS, VERSION, WHAT)
(   1,<2013-10-04 20:48:13.251 -0700>,<Administrator>,<X>,<go>,<TOPSPIN 2.1>,
      <created by zg
	started at 2013-10-04 20:36:43.142 -0700,
	POWCHK enabled, PULCHK disabled,
       configuration hash MD5:
       C8 4E 4E 5D D3 5C D8 9E 9F 52 82 E0 59 8A DE 15
       data hash MD5: 64K
       14 49 94 86 A1 2D FD AC 07 AA 6C F7 04 E3 6F A2>)
(   2,<2013-10-04 20:48:16.126 -0700>,<Administrator>,<X>,<proc1d>,<TOPSPIN 2.1>,
      <Start of raw data processing
       efp LB = 0.3 FT_mod = 6 PKNL = 1 PHC0 = 0 PHC1 = 0 SI = 128K 
       data hash MD5: 128K
       89 7E 77 2E C8 5E C0 55 CF A1 E3 E6 03 B4 4B B2>)
(   3,<2013-10-04 20:48:17.032 -0700>,<Administrator>,<X>,<proc1d>,<TOPSPIN 2.1>,
      <pk PHC0 = -81.96899 PHC1 = 0 
       data hash MD5: 128K
       B6 BF 85 98 E2 9A 1F 72 F5 56 F9 C2 01 FB E3 32>)
(   4,<2013-10-04 20:48:17.454 -0700>,<Administrator>,<X>,<proc1d>,<TOPSPIN 2.1>,
      <abs ABSG = 1 
       data hash MD5: 128K
       11 D8 C5 E2 89 AA 17 82 BC 51 E1 35 8E B5 D3 A1>)
(   5,<2013-10-04 20:48:17.548 -0700>,<Administrator>,<X>,<proc1d>,<TOPSPIN 2.1>,
      <abs ABSG = 2 
       data hash MD5: 128K
       89 08 EF 6C EE 84 94 4A BA F8 80 17 2E 4D 54 89>)
(   6,<2013-10-04 20:48:17.642 -0700>,<Administrator>,<X>,<proc1d>,<TOPSPIN 2.1>,
      <abs ABSG = 3 
       data hash MD5: 128K
       00 CE FE A3 68 4F D7 F2 08 15 2C 32 9A 57 04 45>)
(   7,<2013-10-04 20:48:17.720 -0700>,<Administrator>,<X>,<proc1d>,<TOPSPIN 2.1>,
      <abs ABSG = 4 
       data hash MD5: 128K
       E0 75 AA 15 CB C9 F2 A6 34 54 EE 43 DB 87 1F 32>)
(   8,<2013-10-04 20:48:17.798 -0700>,<Administrator>,<X>,<proc1d>,<TOPSPIN 2.1>,
      <abs ABSG = 5 
       data hash MD5: 128K
       4C 6D CD 22 DE 39 68 29 85 8E 8A EA 58 27 BC DA>)
$$ ##END=
$$ 
$$ $$ hash MD5
$$ $$ 0F CF 66 2A 5F 9D 78 2D 43 27 C6 7F 27 1B DD 28
##$RELAX= 
##$RELAX= 
##$RELAX= 
##$RELAX= 
##$RELAX= 
##$RELAX= 
##$RELAX= 
##$RELAX= 
$$ Bruker specific parameters
$$ --------------------------
##$DU= <E:\>
##$EXPNO= 12
$$ [...]
##$TP07= 0
##$TPNAME0= <>
##$TPNAME1= <>
##$TPNAME2= <>
##$TPNAME3= <>
##$TPNAME4= <>
##$TPNAME5= <>
##$TPNAME6= <>
##$TPNAME7= <>
##$TPOAL= (0..7)
0.5 0.5 0.5 0.5 0.5 0.5 0.5 0.5
##$TPOFFS= (0..7)
0 0 0 0 0 0 0 0
##$TUNHIN= 0
##$TUNHOUT= 0
##$TUNXOUT= 0
##$USERA1= <user>
##$USERA2= <user>
##$USERA3= <user>
##$USERA4= <user>
##$USERA5= <user>
##$V9= 5
##$VALIST= <valist>
##$VCLIST= <CCCCCCCCCCCCCCC>
##$VD= 0
##$VDLIST= <DDDDDDDDDDDDDDD>
##$VPLIST= <PPPPPPPPPPPPPPP>
##$VTLIST= <TTTTTTTTTTTTTTT>
##$WBST= 2048
##$WBSW= 25
##$XGAIN= (0..3)
0 0 0 0
##$XL= 0
##$YL= 0
##$YMAX_a= 6409792
##$YMIN_a= -12250068
##$ZGOPTNS= <>
##$ZL1= 120
##$ZL2= 120
##$ZL3= 120
##$ZL4= 120
##$ABSF1= 14.96092
##$ABSF2= -5.597261
##$ABSG= 5
##$ABSL= 3
##$ALPHA= 0
##$AQORDER= 0
##$ASSFAC= 0
##$ASSFACI= 0
##$ASSFACX= 0
##$ASSWID= 0
##$AUNMP= <proc_prof1d_extract.lims>
##$AXLEFT= 0
##$AXNAME= <>
##$AXNUC= <1H>
##$AXRIGHT= 0
##$AXTYPE= 0
##$AXUNIT= <>
##$AZFE= 0.1
##$AZFW= 0.1
##$BCFW= 0
##$BC_mod= 0
##$BYTORDP= 0
##$COROFFS= 0
##$CY= 15
##$DATMOD= 1
##$DC= 0
##$DFILT= <>
##$DTYPP= 0
##$F1P= 0
##$F2P= 0
##$FCOR= 0.5
##$FTSIZE= 131072
##$FT_mod= 6
##$GAMMA= 0
##$GB= 0
##$INTBC= 1
##$INTSCL= 1
##$ISEN= 128
##$LB= 0.3
##$LEV0= 0
##$LPBIN= 0
##$MAXI= 10000
##$MC2= 0
##$MEAN= 0
##$ME_mod= 0
##$MI= 0
##$NCOEF= 0
##$NC_proc= -2
##$NLEV= 6
##$NOISF1= 0
##$NOISF2= 0
##$NSP= 0
##$NTH_PI= 0
##$NZP= 0
##$OFFSET= 14.96092
##$PC= 1
##$PHC0= -81.96899
##$PHC1= 0
##$PH_mod= 1
##$PKNL= yes
##$PPARMOD= 0
##$PPDIAG= 0
##$PPIPTYP= 0
##$PPMPNUM= 2147483647
##$PPRESOL= 1
##$PSCAL= 4
##$PSIGN= 0
##$PYNMP= <proc.py>
##$REVERSE= no
##$SF= 400.020009670556
##$SI= 131072
##$SIGF1= 0
##$SIGF2= 0
##$SINO= 400
##$SIOLD= 131072
##$SPECTYP= <>
##$SREGLST= <1H.CDCl3>
##$SSB= 0
##$STSI= 131072
##$STSR= 0
##$SW_p= 8223.68421052631
##$SYMM= 0
##$S_DEV= 0
##$TDeff= 65536
##$TDoff= 0
##$TI= <>
##$TILT= no
##$TM1= 0
##$TM2= 0
##$TOPLEV= 0
##$USERP1= <user>
##$USERP2= <user>
##$USERP3= <user>
##$USERP4= <user>
##$USERP5= <user>
##$WDW= 1
##$XDIM= 131072
##$YMAX_p= 418218868
##$YMIN_p= -11244
##$CURPLOT= <Network HP LaserJet P1505>
##$CURPRIN= <$Network HP LaserJet P1505>
##$DFORMAT= <normdp>
##$LAYOUT= <+/1D_H.xwp>
##$LFORMAT= <normlp>
##$PFORMAT= <normpl>
##$SURQMSG= 1
$$ End of Bruker specific parameters
$$ ---------------------------------
##NTUPLES= NMR SPECTRUM
##VAR_NAME=  FREQUENCY,     SPECTRUM/REAL,   SPECTRUM/IMAG
##SYMBOL=    X,             R,               I
##VAR_TYPE=  INDEPENDENT,   DEPENDENT,       DEPENDENT
##VAR_FORM=  AFFN,          ASDF,            ASDF
##VAR_DIM=   131072,        131072,          131072
##UNITS=     HZ,            ARBITRARY UNITS, ARBITRARY UNITS
##FACTOR=    0.0627417313425164, 1,          1
##FIRST=     8223.62146879497, 3189,         -60557
##LAST=      0,             4783,            -60890
##MIN=       0,             -11244,          0
##MAX=       8223.62146879497, 418218868,    0
$$ Real data points
##PAGE= N=1
##DATA TABLE= (X++(R..R)), XYDATA
$$ [...]
$$ plain form
63932 3804478 4024495 4229814 4413578 4570596 4698058 4794153 4857065 4885603 4879825 4840359
63922 4840359 4767638 4662376 4526530 4363462 4177580 3974200 3759273 3538440 3316171 3095852
63912 3095852 2880451 2672780 2475392 2290454 2119528 1963216 1821297 1693493 1579754
63903 1579754 1479399 1390490 1310776 1239238 1176063 1121132 1073266 1031126 994103 961823 933283
63892 933283 907151 882669 859680 837855 816476 795056 773631 752348 731300 711033 692665
63881 692665 676974 663697 652157 642301 634591 629161 625830 624826 626648 631095 637278 644926 654906
63868 654906 667855 682925 698597 714372 730901 748659 767283 786210 805219 824116 842372
63857 842372 859334 874601 888056 899718 909540 917174 922012 923720 922573 919058 913325 905329 895222
$$ packed form
63932C804478K20017K05319J83764J57018J27462R6095O2912K8538n778l9466
63922D840359p2721j05262j35846j63068j85882k03380k14927k20833k22269k20319
63912C095852k15401k07671j97388j84938j70926j56312j41919j27804j13739
63903A579754j00355q8909p9714p1538o3175n4931m7866m2140l7023l2280k8540
63892I33283k6132k4482k2989k1825k1379k1420k1425k1283k1048k0267j8368
63881F92665j5691j3277j1540r856p710n430l331j004J822M447O183P648R980
63868F54906J2949J5070J5672J5775J6529J7758J8624J8927J9009J8897J8256
63857H42372J6962J5267J3455J1662R822P634M838J708j147l515n733p996j0107
$$ plain form
63844 895222 883153 868889 852223 833610 813765 792706 769883 745263 719586 693394 666615
63833 666615 639404 612715 587508 563873 541391 519936 499643 480446 462139 444663 427948
63822 427948 411692 395738 380526 366783 354880 344717 336027 328447 321513 314990 309083 303982 299388
63809 299388 294921 290898 288143 286919 286414 285458 283485 280700 277633 274804 272618 271213 270254 269084 267213
63794 267213 264665 261765 258705 255549 252585 250290 248730 247382 245873 244553 243832 243268 242036 240210 238718
63779 238718 237871 236810 234855 232622 231120 230276 229187 227578 226189 225759 226262 227216 228214 229022 229537 229791
63763 229791 229786 229362 228513 227687 227340 227149 226160 223879 220949 218585 217557 217793 218693 219653 220412 221099 221932 222873
63745 222873 223634 224026 224206 224567 225435 226807 228346 229796 231381 233590 236455 239343 241627 243295 244624
$$ packed form
63844H95222j2069j4264j6666j8613j9845k1059k2823k4620k5677k6192k6779
63833F66615k7211k6689k5207k3635k2482k1455k0293j9197j8307j7476j6715
63822D27948j6256j5954j5212j3743j1903j0163q690p580o934o523n907n101m594
63809B99388m467m023k755j224n05r56j973k785l067k829k186j405r59j170j871
63794B67213k548k900l060l156k964k295j560j348j509j320p21n64j232j826j492
63779B38718q47j061j955k233j502q44j089j609j389m30N03R54R98Q08N15K54
63763B29791nm24q49q26l47j91r89k281k930k364j028K36R00R60P59O87Q33R41
63745B22873P61L92J80L61Q68J372J539J450J585K209K865K888K284J668J329
$$ plain form
63730 244624 245682 246557 247794 249981 252958 255963 258532 260800 262998 265335 268422 273067 279185 285428
63716 285428 290371 293764 296204 297903 298396 297454 295681 293928 292357 290416 287760 284926 282817 281538 280140
63701 280140 277819 275084 273208 272625 272528 272259 272430 274176 277703 282178 286805 291365 295744 299611 302848
63686 302848 305855 309084 312452 315489 317879 319638 320880 321678 322103 322200 321961 321457 320920 320462 319786 318505
63670 318505 316845 315666 315586 316360 317398 318638 320426 322611 324305 324715 323847 322146 319805 316776 313189
63655 313189 309355 305392 301233 297001 293100 289835 287181 284972 283100 281466 279958 278634 277762 277543 277859
63640 277859 278439 279236 280458 282213 284258 286252 288237 290677 293928 297809 301853 305878 310070 314579 319324
63625 319324 324232 329280 334275 339027 344000 350293 358573 368320 378629 389509 401848 416237 432441
$$ packed form
63730B44624J058Q75J237K187K977L005K569K268K198K337L087M645O118O243
63716B85428M943L393K440J699M93r42j773j753j571j941k656k834k109j279j398
63701B80140k321k735j876n83r7k69J71J746L527M475M627M560M379L867L237
63686C02848L007L229L368L037K390J759J242P98M25R7k39n04n37m58o76j281
63670C18505j660j179q0P74J038J240J788K185J694M10q68j701k341l029l587
63655C13189l834l963m159m232l901l265k654k209j872j634j508j324q72k19L16
63640B77859N80P97J222J755K045J994J985K440L251L881M044M025M192M509M745
63625C19324M908N048M995M752M973O293Q280R747J0309J0880J2339J4389J6204
$$ plain form
63612 432441 450046 468982 489212 510465 532645 556197 581709 609299 638570 668894 699459
63601 699459 729181 756716 780529 799041 811143 816927 817734 815219 810423 803847 796104 788125 780630
63588 780630 773567 766046 756803 744839 729838 712030 691813 669691 646511 623398 601276 580623
63576 580623 561654 544376 528366 513039 498555 486130 476903 470672 466238 462916 461104 461358 463516
63563 463516 467024 471651 477416 484075 491241 498950 507642 517332 527223 536499 545458 555446 567640 582226
63549 582226 598991 618306 640975 667255 696688 729082 765012 804714 846598 887231 922717
63538 922717 949953 967091 973826 971675 963453 951944 938999 925854 913730 903578 895345 887979
63526 887979 880137 870597 858096 841516 820627 796291 769468 740284 708641 675567 643212 613221
$$ packed form
63612D32441J7605J8936K0230K1253K2180K3552K5512K7590K9271L0324L0565
63601F99459K9722K7535K3813J8512J2102N784Q07k515m796o576p743p979p495
63588G80630p063p521r243j1964j5001j7808k0217k2122k3180k3113k2122k0653
63576E80623j8969j7278j6010j5327j4484j2425r227o231m434l322j812K54K158
63563D63516L508M627N765O659P166P709Q692R690R891R276Q959R988J2194J4586
63549E82226J6765J9315K2669K6280K9433L2394L5930L9702M1884M0633L5486
63538I22717K7236J7138O735k151q222j1509j2945j3145j2124j0152q233p366
63526H87979p842r540j2501j6580k0889k4336k6823k9184l1643l3074l2355k9991
$$ plain form
63514 613221 585691 560042 536330 515073 496172 478859 462713 448080 435336 424304 414548 405683
63502 405683 397177 388438 379496 371163 364121 358205 352976 348506 345049 342311 339774 337585 336388 336262
63488 336262 336510 336571 336511 336469 336276 335990 336252 337642 339949 342508 344926 347153 349101 350763 352596 355266 358898
63471 358898 362860 366341 368854 370146 369979 368251 365197 361289 357000 352773 349051 346172 344220 343088
63457 343088 342580 342310 341622 339997 337731 335958 335686 336874 338689 340610 342928 346208 350711 356503 363668
63442 363668 372041 381075 390384 400245 411166 423215 436313 450994 468186 488167 510396 534566
63430 534566 561045 589697 618604 644555 664839 678531 686574 691145 694763 699346 705797 714518 726155
63417 726155 741648 761706 786453 815456 847814 882307 917672 952588 985237 1013264 1034679
$$ packed form
63514F13221k7530k5649k3712k1257j8901j7313j6146j4633j2744j1032r756q865
63502D05683q506q739q942q333p042n916n229m470l457k738k537k189j197j26
63488C36262K48O1o0m2j93k86K62J390K307K559K418K227J948J662J833K670L632
63471C58898L962L481K513J292j67j728l054l908m289m227l722k879j952j132
63457C43088n08k70o88j625k266j773k72J188J815J921K318L280M503N792P165
63442C63668Q373R034R309R861J0921J2049J3098J4681J7192J9981K2229K4170
63430E34566K6479K8652K8907K5951K0284J3692Q043M571L618M583O451Q721J1637
63417G26155J5493K0058K4747K9003L2358L4493L5365L4916L2649K8027K1415
$$ plain form
63406 1034679 1048789 1055958 1056735 1051792 1042593 1031377 1020086 1009531 999582 989609 978504 964799 947352
63393 947352 925883 900740 872439 841720 809730 777659 746150 715311 685280 656570 629820
63382 629820 605423 583458 563902 546800 532209 520007 509951 502007 496444 493302 491962 491678 492495
63369 492495 495133 499869 506136 513523 522601 534207 548310 564182 581496 600585 621679 644539
63357 644539 669005 695402 724189 755475 789027 824409 860901 897406 932553 964742 992206
63346 992206 1013399 1027521 1034596 1035196 1030429 1022071 1012077 1001572 990595 978897 966538 953414 938648
63333 938648 921049 900074 876069 849686 821528 792355 763181 734928 708058 682669 658926
63322 658926 637336 618621 603333 591690 583816 579806 579066 579518 578012 571946 560549 544689 525997
$$ packed form
63406A034679J4110P169P77m943r199j1216j1291j0555r949r973j1105j3705j7447
63393I47352k1469k5143k8301l0719l1990l2071l1509l0839l0031k8710k6750
63382F29820k4397k1965j9556j7102j4591j2202j0056p944n563l142j340k84Q17
63369D92495K638M736O267P387R078J1606J4103J5872J7314J9089K1094K2860
63357F44539K4466K6397K8787L1286L3552L5382L6492L6505L5147L2189K7464
63346I92206K1193J4122P075O00m767q358r994j0505j0977j1698j2359j3124j4766
63333I38648j7599k0975k4005k6383k8158k9173k9174k8253k6870k5389k3743
63322F58926k1590j8715j5288j1643p874m010p40M52j506o066j1397j5860j8692
$$ plain form
63309 525997 506338 487427 470141 454299 439554 426299 415181 405984 397751 390028 383271 377825
63297 377825 373235 368877 364709 361003 357841 355298 353603 352536 350977 347839 343328 338699 334761 331210
63283 331210 327544 324014 321348 319884 319299 318978 318368 317205 315696 314430 313876 313950 314187 314270 314292 314562 315325
63266 315325 316620 318263 319948 321438 322683 323784 324989 326730 329444 333062 336734 339407 340892 342205
63252 342205 344689 348790 353767 358559 362797 366940 371602 376978 382962 389612 397185 405728 414957 424777
63238 424777 435733 448589 463504 479923 497294 515605 535063 555588 576892 598817 621250
63227 621250 643835 666126 688081 710106 732527 755184 777592 799392 820667 841977 864018
63216 864018 886992 910351 933339 955660 977154 996864 1013089 1024642 1031618 1034566 1033378 1027464
$$ packed form
63309E25997j9659j8911j7286j5842j4745j3255j1118r197q233p723o757n446
63297C77825m590m358m168l706l162k543j695j067j559l138m511m629l938l551
63283C31210l666l530k666j464n85l21o10j163j509j266n54P4K37Q3K2K70P63
63266C15325J295J643J685J490J245J101J205J741K714L618L672K673J485J313
63252C42205K484M101M977M792M238M143M662N376N984O650P573Q543R229R820
63238D24777J0956J2856J4915J6419J7371J8311J9458K0525K1304K1925K2433
63227F21250K2585K2291K1955K2025K2421K2657K2408K1800K1275K1310K2041
63216H64018K2974K3359K2988K2321K1494J9710J6225J1553O976K948j188n914
$$ plain form
63204 1027464 1016654 1001270 981488 957385 929756 900344 870991 842848 816402 791825 769150
63193 769150 748589 730892 716995 707048 700155 695392 692694 692424 694499 698499 704436 712717 723333
63180 723333 735594 748859 763113 778632 795352 812763 830240 847338 863988 880559 897514
63169 897514 914793 931606 946978 960354 971524 980140 985650 987714 986350 981445 972316 958097 938664
63156 938664 915032 888767 861105 832731 804153 775898 748329 721636 696153 672364 650329
63145 650329 629455 609290 590422 574098 560880 550062 540476 531447 522834 514616 506909 500099 494549
63132 494549 490205 486773 484180 482580 481966 482126 482937 484378 486220 488068 489820 491848 494611 498240 502627
63117 502627 507617 512962 518262 523204 527809 532293 536695 540754 544141 546778 548944 551046 553204 555129
$$ packed form
63204A027464j0810j5384j9782k4103k7629k9412k9353k8143k6446k4577k2675
63193G69150k0561j7697j3897r947o893m763k698k70K075M000N937Q281J0616
63180G23333J2261J3265J4254J5519J6720J7411J7477J7098J6650J6571J6955
63169H97514J7279J6813J5372J3376J1170Q616N510K064j364m905r129j4219j9433
63156I38664k3632k6265k7662k8374k8578k8255k7569k6693k5483k3789k2035
63145F50329k0874k0165j8868j6324j3218j0818r586r029q613q218p707o810n550
63132D94549m344l432k593j600o14J60Q11J441J842J848J752K028K763L629M387
63117E02627M990N345N300M942M605M484M402M059L387K637K166K102K158J925
$$ plain form
63103 555129 556557 557688 558890 560050 560673 560710 560823 561569 562765 564022 565407 566956 567853 567000 564554 562233
63087 562233 561715 563111 565171 566603 566929 566545 566381 567312 569538 572547 575882 579691 584366 589890 595895
63072 595895 602188 608863 616015 623663 631919 640930 650631 660849 671671 683577 697196 713005 731094
63059 731094 751056 772277 794678 819036 846265 876469 909142 944220 982482 1024710 1070777
63048 1070777 1119734 1170535 1222494 1275352 1329141 1383894 1439334 1494905 1550170 1604993 1659347
63037 1659347 1713180 1766582 1819760 1872708 1925136 1976877 2027999 2078123 2125772 2168758 2205117
63026 2205117 2233409 2252278 2260265 2256266 2239964 2211692 2172174 2122677 2065246 2002433 1936550 1869149
63014 1869149 1801241 1733989 1669139 1608662 1553983 1505647 1463776 1428716 1401061 1381096 1368375
$$ packed form
63103E55129J428J131J202J160O23L7J13P46J196J257J385J549Q97q53k446k321
63087E62233n18J396K060J432L26l84j64R31K226L009L335L809M675N524O005
63072E95895O293O675P152P648Q256R011R701J0218J0822J1906J3619J5809J8089
63059G31094J9962K1221K2401K4358K7229L0204L2673L5078L8262M2228M6067
63048A070777M8957N0801N1959N2858N3789N4753N5440N5571N5265N4823N4354
63037A659347N3833N3402N3178N2948N2428N1741N1122N0124M7649M2986L6359
63026B205117K8292J8869P987l999j6302k8272l9518m9497n7431o2813o5883o7401
63014A869149o7908o7252o4850o0477n4679m8336m1871l5060k7655j9965j2721
$$ plain form
63003 1368375 1361942 1360866 1364580 1372837 1385456 1402093 1422198 1445111 1470207 1496964 1524945 1553733
62991 1553733 1582841 1611713 1639952 1667611 1695112 1722664 1749686 1774920 1797105 1815487 1829665
62980 1829665 1839073 1842726 1839428 1828164 1808402 1780221 1744272 1701597 1653401 1600946 1545614 1488965
62968 1488965 1432599 1377852 1325522 1275819 1228589 1183725 1141472 1102267 1066238 1032943 1001791
62957 1001791 972630 945709 921097 898420 877231 857286 838272 819647 801113 783019 765823
62946 765823 749289 732713 715973 699826 684951 671121 657649 644336 631638 620057 609723
62935 609723 600464 591961 583856 576045 568918 563042 558492 554726 551299 548463 546812 546397 546524 546522 546455 546816
62919 546816 547682 548458 548437 547295 545015 541749 537987 534494 531671 529161 526404 523430 520624 517882 514608
$$ packed form
63003A368375o433j076L714Q257J2619J6637K0105K2913K5096K6757K7981K8788
62991A553733K9108K8872K8239K7659K7501K7552K7022K5234K2185J8382J4178
62980A829665R408L653l298j1264j9762k8181l5949m2675m8196n2455n5332n6649
62968A488965n6366n4747n2330m9703m7230m4864m2253l9205l6029l3295l1152
62957A001791k9161k6921k4612k2677k1189j9945j9014j8625j8534j8094j7196
62946G65823j6534j6576j6740j6147j4875j3830j3472j3313j2698j1581j0334
62935F09723r259q503q105p811p127n876m550l766l427k836j651m15J27ko7L61
62919E46816Q66P76k1j142k280l266l762l493k823k510k757k974k806k742l274
$$ plain form
62904 514608 510678 506882 504098 502335 500851 498977 496611 494104 491954 490468 489582 489041 488712 488545 488341
62889 488341 487970 487822 488458 489636 490263 489731 488734 488316 488563 488898 489265 490161 491631 493019 493832 494200 494312 494033
62871 494033 493334 492585 492091 491706 491140 490309 489179 487640 485813 484168 482956 481865 480552 479336 479013 480060
62855 480060 482254 484930 487328 488887 489551 489739 489783 489471 488450 486954 485714 485110 484738 483937 482516 480864
62839 480864 479543 478870 478670 478368 477488 476160 474914 473927 472759 471082 469346 468348 468277 468611 468950 469511 470676
62822 470676 472397 474287 476037 477531 478763 479946 481574 484046 487274 490894 494797 499149 503919 508667
62808 508667 512931 516606 519931 523327 527281 532133 537827 544031 550612 557850 566108 575444 585603 596183
62794 596183 606844 617605 629050 642039 657093 674254 693547 715216 739404 766070 795575
$$ packed form
62904E14608l930l796k784j763j484j874k366k507k150j486q86n41l29j67k04
62889D88341l71j48O36J178O27n32r97m18K47L35L67Q96J470J388Q13L68J12k79
62871D94033o99p49m94l85n66q31j130j539j827j645j212j091j313j216l23J047
62855D80060K194K676K398J559O64J88M4l12j021j496j240o04l72q01j421j652
62839D80864j321o73k00l02q80j328j246r87j168j677j736r98p1L34L39N61J165
62822D70676J721J890J750J494J232J183J628K472L228L620L903M352M770M748
62808E08667M264L675L325L396L954M852N694O204O581P238Q258R336J0159J0580
62794E96183J0661J0761J1445J2989J5054J7161J9293K1669K4188K6666K9505
$$ plain form
62783 795575 829016 867574 911714 961309 1016313 1076905 1143154 1214999 1292455 1375362 1462814
62772 1462814 1553145 1644431 1734726 1821837 1903361 1977115 2041280 2094060 2133575 2158369 2167919
62761 2167919 2162537 2142871 2109667 2063929 2007190 1941510 1869153 1792211 1712548 1631934 1551867
62750 1551867 1473176 1396158 1321332 1249748 1182276 1118939 1059417 1003945 953165 907180 865291
62739 865291 826716 791141 758600 729277 703424 681013 661354 643497 627035 612096 598593
62728 598593 586119 574761 565298 558262 553273 549647 547101 545425 544029 542515 541463 541958 544329 547909
62714 547909 552048 556886 562951 570369 578860 588452 599933 614413 632421 653612 677515 704349 734743
62701 734743 768839 806193 846642 890679 938715 990518 1045811 1104922 1168171 1234821 1303250
$$ packed form
62783G95575L3441L8558M4140M9595N5004O0592O6249P1845P7456Q2907Q7452
62772A462814R0331R1286R0295Q7111Q1524P3754O4165N2780L9515K4794R550
62761B167919n382j9666l3204m5738n6739o5680p2357p6942p9663q0614q0067
62750A551867p8691p7018p4826p1584o7472o3337n9522n5472n0780m5985m1889
62739H65291l8575l5575l2541k9323k5853k2411j9659j7857j6462j4939j3503
62728E98593j2474j1358r463p036m989l626k546j676j396j514j052M95K371L580
62714E47909M139M838O065P418Q491R592J1481J4480J8008K1191K3903K6834L0394
62701G34743L4096L7354M0449M4037M8036N1803N5293N9111O3249O6650O8429
$$ plain form
62690 1303250 1372144 1440912 1508734 1573583 1632488 1682698 1722567 1751502 1769177 1774891 1767808 1747900
62678 1747900 1716414 1675203 1625801 1569373 1507382 1441823 1374695 1307469 1241143 1176571 1114562
62667 1114562 1055722 1000367 948677 900916 857348 817845 781725 748302 717518 689690 664605
62656 664605 641382 619467 599366 582008 567610 555494 544749 534685 524816 514895 505004 495359
62644 495359 486098 477403 469587 462737 456508 450633 445455 441547 438935 437174 436040 435599 435573 435253 434269
62629 434269 433001 432047 431589 431430 431314 431005 430372 429598 429024 428659 428158 427496 427300 428210 430142 432555 435265
62612 435265 438560 442554 446876 451233 456038 462191 470212 479710 489792 499933 510410 521905 534843
62599 534843 549228 565008 582458 602171 624750 650546 679601 711793 746967 784900 825189
$$ packed form
62690A303250O8894O8768O7822O4849N8905N0210L9869K8935J7675N714p083j9908
62678A747900l1486m1211m9402n6428o1991o5559o7128o7226o6326o4572o2009
62667A114562n8840n5355n1690m7761m3568l9503l6120l3423l0784k7828k5085
62656F64605k3223k1915k0101j7358j4398j2116j0745j0064r869r921r891r645
62644D95359r261q695p816o850o229n875n178l908k612j761j134m41k6l20r84
62629D34269j268r54m58j59j16l09o33p74n74l65n01o62j96R10J932K413K710
62612D35265L295L994M322M357M805O153Q021R498J0082J0141J0477J1495J2938
62599E34843J4385J5780J7450J9713K2579K5796K9055L2192L5174L7933M0289
$$ plain form
62588 825189 867288 910590 954220 996709 1036167 1070986 1100248 1123344 1139476 1147843 1148201 1140921
62576 1140921 1126543 1105538 1078476 1046264 1010212 971934 932977 894311 856267 819176 783846
62565 783846 751120 721143 693428 667489 643067 619900 597814 577133 558597 542704 529367
62554 529367 518145 508532 500034 492413 485854 480538 476040 471577 466937 462691 459407 457112 455635 454923
62540 454923 454713 454370 453507 452492 452003 452303 453215 454476 455780 456745 457245 457654 458457 459795 461726 464717 469408
62523 469408 475926 483842 492903 503516 516343 531645 549171 568623 590063 613771 639816 668007
62511 668007 698386 731526 767918 807113 847846 889036 930154 970477 1008607 1043141 1073450
62500 1073450 1099274 1119860 1134083 1141401 1142288 1137733 1128733 1116264 1101393 1085249 1069010 1053923
$$ packed form
62588H25189M2099M3302M3630M2489L9458L4819K9262K3096J6132Q367L58p280
62576A140921j4378k1005k7062l2212l6052l8278l8957l8666l8044l7091l5330
62565G83846l2726k9977k7715k5939k4422k3167k2086k0681j8536j5893j3337
62554E29367j1222r613q498p621o559n316m498m463m640m246l284k295j477p12
62540D54923k10l43q63j015m89L00R12J261J304R65N00M09Q03J338J931K991M691
62523D69408O518P916R061J0613J2827J5302J7526J9452K1440K3708K6045K8191
62511F68007L0379L3140L6392L9195M0733M1190M1118M0323L8130L4534L0309
62500A073450K5824K0586J4223P318Q87m555r000j2469j4871j6144j6239j5087
$$ plain form
62488 1053923 1041201 1031939 1027166 1027692 1033645 1044377 1059288 1078564 1102775 1131873 1165093 1201807
62476 1201807 1241829 1284586 1328276 1370102 1407179 1437259 1459042 1472171 1476854 1473289 1461425 1441200
62464 1441200 1412742 1376308 1332351 1281897 1226715 1168902 1110327 1052450 996413 943057 892933
62453 892933 846495 804267 766752 734177 706411 683052 663550 647278 633594 621891 611723
62442 611723 603019 596165 591700 589814 590186 592271 595670 600218 605829 612280 619056 625386 630473 633714
62428 633714 634671 632964 628413 621313 612387 602402 591823 580797 569341 557549 545743 534423 524008
62415 524008 514584 505914 497579 489154 480596 472623 466368 462210 459139 455730 451599 447430 443708 440132
62401 440132 436345 432572 429229 426486 424489 423488 423329 423357 423292 423771 425530 428469 432006 435838 439652 442597
$$ packed form
62488A053923j2722r262m773N26N953J0732J4911J9276K4211K9098L3220L6714
62476A201807M0022M2757M3690M1826L7077L0080K1783J3129M683l565j1864k0225
62464A441200k8458l6434m3957n0454n5182n7813n8575n7877n6037n3356n0124
62453H92933m6438m2228l7515l2575k7766k3359j9502j6272j3684j1703j0168
62442F11723q704o854m465j886L72K085L399M548N611O451O776O330N087L241
62428F33714R57j707m551p100q926r985j0579j1026j1456j1792j1806j1320j0415
62415E24008r424q670q335q425q558p973o255m158l071l409m131m169l722l576
62401D40132l787l773l343k743j997j001j59K8o5M79J759K939L537L832L814K945
$$ plain form
62385 442597 444065 444855 446602 449927 453986 457929 461906 466363 471219 476273 481717 487691 493847 499955
62371 499955 506510 514208 523108 532788 542972 553613 564807 577148 591744 609250 629226 651073
62359 651073 675238 702752 733910 768359 806311 848619 895540 946280 999905 1055717 1112391
62348 1112391 1167627 1219155 1265420 1304939 1335970 1357588 1370423 1375588 1373405 1363933 1348107 1327254
62336 1327254 1301819 1271673 1237613 1201439 1164480 1127063 1089766 1054172 1021722 992484 965708
62325 965708 941144 919151 899840 882737 867215 852663 838214 822769 805537 786399 765712
62314 765712 743958 721649 699392 677818 657360 638100 619948 602992 587531 573598 560641
62303 560641 548022 535815 524798 515607 508269 502638 498831 496807 495877 495108 494180 493400 492923 492425 491719
$$ packed form
62385D42597J468P90J747L325M059L943L977M457M856N054N444N974O156O108
62371D99955O555P698Q900R680J0184J0641J1194J2341J4596J7506J9976K1847
62359F51073K4165K7514L1158L4449L7952M2308M6921N0740N3625N5812N6674
62348A112391N5236N1528M6265L9519L1031K1618J2835N165k183r472j5826k0853
62336A327254k5435l0146l4060l6174l6959l7417l7297l5594l2450k9238k6776
62325I65708k4564k1993j9311j7103j5522j4552j4449j5445j7232j9138k0687
62314G65712k1754k2309k2257k1574k0458j9260j8152j6956j5461j3933j2957
62303E60641j2619j2207j1017r191p338n631l807k024r30p69r28p80m77m98p06
$$ plain form
62288 491719 491361 492285 494943 499068 504174 509945 516074 522079 527669 533139 539084 545698 552732 560205 568766
62273 568766 579070 591073 604184 617846 631641 645209 658588 672503 687766 704426 722021
62262 722021 740546 760546 782233 805310 830019 857643 889372 925085 963841 1005306 1050099
62251 1050099 1098735 1150608 1203983 1256698 1306864 1353148 1394401 1429132 1455704 1473295 1482341
62240 1482341 1483745 1477970 1465142 1445549 1419416 1386487 1346519 1300208 1249165 1195103 1139584 1084363
62228 1084363 1031136 980717 933115 888654 848404 813110 782252 754658 729679 707267 687240
62217 687240 669119 652646 637950 625102 613884 604047 595443 587817 580768 574152 568296 563611 560093
62204 560093 557370 555189 553584 552515 551559 550208 548503 547204 547160 548576 551034 554210 558351 563871 570606
$$ packed form
62288D91719l58R24K658M125N106N771O129O005N590N470N945O614P034P473Q561
62273E68766J0304J2003J3111J3662J3795J3568J3379J3915J5263J6660J7595
62262G22021J8525K0000K1687K3077K4709K7624L1729L5713L8756M1465M4793
62251A050099M8636N1873N3375N2715N0166M6284M1253L4731K6572J7591R046
62240A482341J404n775j2828j9593k6133l2929l9968m6311n1043n4062n5519n5221
62228A084363n3227n0419m7602m4461m0250l5294l0858k7594k4979k2412k0027
62217F87240j8121j6473j4696j2848j1218r837q604p626p049o616n856m685l518
62204E60093k723k181j605j069r56j351j705j299m4J416K458L176M141N520O735
$$ plain form
62189 570606 577713 584434 590843 597715 605656 614526 623786 633244 643250 654151 665698 677072 687388
62176 687388 696208 703731 710576 717260 723837 730167 736572 743990 753317 764895 778882 795948 817180
62163 817180 843296 874211 909375 948100 989382 1031703 1073330 1112734 1148614 1179711 1204930
62152 1204930 1223668 1235877 1241775 1241699 1236228 1226176 1212155 1194220 1172141 1146101 1116995 1086052
62140 1086052 1054424 1023233 993610 966317 941465 919055 899726 884421 873183 864733 857539 850919
62128 850919 844822 839004 832963 826525 819947 813529 807532 802403 798631 796380 795700 796997 800640 805910
62114 805910 810891 813771 813939 811621 807060 800619 793326 786523 780840 775936 771286 766698 761781 755459
62100 755459 746624 735380 723242 711997 702540 694877 688921 684910 683084 683249 684822 687240 690304 694129
$$ packed form
62189E70606P107O721O409O872P941Q870R260R458J0006J0901J1547J1374J0316
62176F87388Q820P523O845O684O577O330O405P418R327J1578J3987J7066K1232
62163H17180K6116L0915L5164L8725M1282M2321M1627L9404L5880L1097K5219
62152A204930J8738J2209N898p6n471j0052j4021j7935k2079k6040k9106l0943
62140A086052l1628l1191k9623k7293k4852k2410j9329j5305j1238q450p194o620
62128H50919o097n818o041o438o578o418n997n129l772k251o80J297L643N270
62114H05910M981K880J68k318m561o441p293o803n683m904m650m588m917o322
62100G55459q835j1244j2138j1245r457p663n956m011j826J65J573K418L064L825
$$ plain form
62086 694129 698745 703688 708202 712063 716061 721322 728164 736020 744474 753786 764258 775711 788117
62073 788117 802223 818814 837546 857138 876701 896281 916188 936458 957135 978506 1000869
62062 1000869 1024539 1050223 1078721 1109786 1141703 1172444 1200912 1226616 1248539 1265079 1275246
62051 1275246 1279436 1278846 1274408 1266378 1254617 1238849 1218652 1193513 1163232 1128414 1090431 1050761
62039 1050761 1010369 969761 929416 889830 851229 813702 777734 744285 714104 687205 663158
62028 663158 641587 622099 604036 586796 570464 555799 543418 533133 524120 515639 507489 499866
62016 499866 492989 486895 481468 476497 471703 466986 462683 459331 457025 455240 453535 452145 451541 451711 452413
62001 452413 453913 456797 460942 465359 469287 472915 476803 481009 485082 488498 490818 491850 491910 491597 491042
$$ packed form
62086F94129M616M943M514L861L998N261O842P856Q454R312J0472J1453J2406
62073G88117J4106J6591J8732J9592J9563J9580J9907K0270K0677K1371K2363
62062A000869K3670K5684K8498L1065L1917L0741K8468K5704K1923J6540J0167
62051A275246M190n90m438q030j1761j5768k0197k5139l0281l4818l7983l9670
62039A050761m0392m0608m0345l9586l8601l7527l5968l3449l0181k6899k4047
62028F63158k1571j9488j8063j7240j6332j4665j2381j0285r013q481q150p623
62016D99866o877o094n427m971m794m717m303l352k306j785j705j390o04J70P02
62001D52413J500K884M145M417L928L628L888M206M073L416K320J032O0l13n55
$$ plain form
61986 491042 489781 487576 484790 481595 477420 471795 465228 458555 451801 444514 437007 430430 425545 422039
61972 422039 419107 416154 412933 409575 406546 404076 401690 398849 395959 394019 393226 392718 391906 391205 391018
61957 391018 390776 389746 388285 387494 387824 388718 389590 390510 391745 393077 393963 394282 394722 396334 399648 404274
61941 404274 409483 415075 421423 428752 436871 445724 455690 466925 478735 490086 500596 510643 520672
61928 520672 530839 541256 551994 562677 572434 580547 586961 592010 595787 597952 598093 596201 592847
61915 592847 588932 585177 581787 578613 575655 573325 572276 573075 575960 580739 586884 593868 601491 609787
61901 609787 618537 626958 633990 638918 641671 642592 642029 640126 636917 632462 626903 620426 613273 605736 598057
61886 598057 590298 582373 574302 566377 559059 552706 547390 542855 538558 533807 528090 521424 514347 507413
$$ packed form
61986D91042j261k205k786l195m175n625o567o673o754p287p507o577m885l506
61972D22039k932k953l221l358l029k470k386k841k890j940p93n08q12p01j87
61957C91018k42j030j461p91L30Q94Q72R20J235J332Q86L19M40J612L314M626
61941D04274N209N592O348P329Q119Q853R966J1235J1810J1351J0510J0047J0029
61928E20672J0167J0417J0738J0683R757Q113O414N049L777K165J41j892l354
61915E92847l915l755l390l174k958k330j049P99K885M779O145O984P623Q296
61901F09787Q750Q421P032M928K753R21n63j903l209m455n559o477p153p537p679
61886E98057p759p925q071p925p318o353n316m535m297m751n717o666p077o934
$$ plain form
61872 507413 500630 493530 485985 478860 473501 470360 468406 466281 463934 462637 463358 465595 468127 470504
61858 470504 473316 477185 482095 487864 494825 503682 514773 527671 541545 555886 570909 587204 604955
61845 604955 623586 642251 660535 678353 695312 710596 723648 734563 743549 750264 754079 754866
61833 754866 753162 749583 744442 738003 730832 723739 717554 713051 710865 711294 714229 719412 726670 735707
61819 735707 745720 755389 763365 768784 771387 771224 768301 762481 753663 742012 728043 712527 696370
61806 696370 680413 665128 650538 636534 623285 611159 600239 590247 580991 572612 565199 558424
61794 558424 551858 545444 539297 533216 526832 520277 514263 509330 505278 501501 497587 493440 489079 484642
61780 484642 480478 476920 473971 471395 469125 467392 466343 465636 464509 462356 459302 456204 453978 452924
$$ packed form
61872E07413o783p100p545p125n359l141j954k125k347j297P21K237K532K377
61858D70504K812L869M910N769O961Q857J1091J2898J3874J4341J5023J6295J7751
61845F04955J8631J8665J8284J7818J6959J5284J3052J0915Q986O715L815P87
61833G54866j704l579n141o439p171p093o185m503k186M29K935N183P258R037
61819G35707J0013R669P976N419K603j63k923n820q818j1651j3969j5516j6157
61806F96370j5957j5285j4590j4004j3249j2126j0920r992r256q379p413o775
61794E58424o566o414o147o081o384o555o014m933m052l777l914m147m361m437
61780D84642m164l558k949k576k270j733j049p07j127k153l054l098k226j054
$$ plain form
61766 452924 452711 452928 453367 453835 454102 454279 454931 456386 458116 459243 459698 460411 462180 464694 466951 468414
61750 468414 469416 470532 471919 473298 474272 474497 473754 472068 469736 467158 464707 462769 461637 461154 460630
61735 460630 459470 457847 456464 455648 455054 454388 453930 454046 454512 454804 454849 455062 455682 456565 457644 459124 461053
61718 461053 463075 464817 466259 467552 468769 470043 471660 473743 475950 477716 478662 478656 477688 475871 473433
61703 473433 470570 467456 464464 462004 459872 457121 453056 448215 443895 440686 437905 434555 430452 426229
61689 426229 422519 419394 416497 413481 410336 407374 404864 402675 400346 397605 394672 391961 389532 387083
61675 387083 384585 382657 381982 382304 382365 381082 378613 376066 374379 373760 373937 374408 374543 374036 373362 373258 373667
61658 373667 373825 373596 373959 375693 378173 380156 381316 382294 383526 384801 385858 386700 387311 387689 388236 389513
$$ packed form
61766D52924k13K17M39M68K67J77O52J455J730J127M55P13J769K514K257J463
61750D68414J002J116J387J379R74K25p43j686k332k578k451j938j132m83n24
61735D60630j160j623j383q16n94o66m58J16M66K92M5K13O20Q83J079J480J929
61718D61053K022J742J442J293J217J274J617K083K207J766R46or68j817k438
61703D73433k863l114k992k460k132k751m065m841m320l209k781l350m103m223
61689D26229l710l125k897l016l145k962k510k189k329k741k933k711k429k449
61675C87083k498j928o75L22O1j283k469k547j687o19J77M71J35n07o74j04M09
61658C73667J58k29L63J734K480J983J160R78J232J275J057Q42O11L78N47J277
$$ plain form
61642 389513 391494 393581 395404 397100 398709 399929 400689 401436 402512 403612 404163 403929 402994 401475 399572
61627 399572 397661 396066 394793 393620 392316 390744 388987 387433 386448 385878 385115 383753 381917 379959 378177
61612 378177 376856 376096 375405 373930 371380 368366 365555 362870 359875 356589 353459 350696 348045 345128 341803
61597 341803 338318 335255 333106 331654 330041 327693 324940 322458 320413 318491 316498 314444 312224 309731
61583 309731 307198 305012 303215 301644 300537 300502 301715 303466 304710 304883 304121 302949 301925 301379 301233 301056
61567 301056 300440 299417 298517 298326 298867 299520 299716 299644 299945 300760 301514 301813 302077 302943 304456 306225 308053 309897
61549 309897 311429 312241 312379 312228 311959 311627 311699 312835 315005 317359 319183 320517 321685 322732 323658 324747
61533 324747 326217 327745 328713 328807 328177 327213 326395 326167 326596 327199 327366 326895 325985 324801 323326 321610 319965
$$ packed form
61642C89513J981K087J823J696J609J220P60P47J076J100N51k34r35j519j903
61627C99572j911j595j273j173j304j572j757j554r85n70p63j362j836j958j782
61612C78177j321p60o91j475k550l014k811k685k995l286l130k763k651k917l325
61597C41803l485l063k149j452j613k348k753k482k045j922j993k054k220k493
61583C09731k533k186j797j571j107l5J213J751J244J73p62j172j024n46j46j77
61567C01056o16j023r00j91N41O53J96p2L01Q15P54K99K64Q66J513J769J828J844
61549C09897J532Q12J38j51k69l32P2J136K170K354J824J334J168J047R26J089
61533C24747J470J528R68R4o30r64q18k28M29O03J67m71r10j184j475j716j645
$$ plain form
61516 319965 318806 318387 318640 319200 319622 319651 319285 318633 317862 317295 317274 317724 318040 317678 316748 315814 315161 314582 313909
61497 313909 313396 313376 313695 313738 313066 311864 310769 310277 310396 310859 311599 312822 314545 316221 317110 317089 316890 317378
61479 317378 318757 320626 322638 324767 326955 328884 330359 331657 333236 335158 337059 338623 339813 340622
61465 340622 340935 340822 340742 341168 342036 342789 343006 342840 342745 342875 342902 342473 341713 341145 341097 341334 341357 340978 340445 340077
61445 340077 339965 340036 340187 340324 340380 340411 340592 341056 341777 342572 343183 343470 343647 344184 345241 346350 347010 347472 348446
61426 348446 349973 351203 351551 351536 351962 352704 352944 352424 351795 351702 352125 352756 353562 354672 356086 357721 359511
61409 359511 361201 362340 362758 362880 363188 363488 363066 361619 359669 357870 356250 354467 352647 351441 351133 351157
61393 351157 350901 350684 351385 353125 354905 355796 356048 356615 357854 359139 359653 359163 358033 356926 356599 357610
$$ packed form
61516C19965j159m19K53N60M22K9l66o52p71n67k1M50L16l62r30r34o53n79o73
61497C13909n13k0L19M3o72j202j095m92J19M63P40J223J723J676Q89k1j99M88
61479C17378J379J869K012K129K188J929J475J298J579J922J901J564J190Q09
61465C40622L13j13q0M26Q68P53K17j66r5J30K7m29p60n68m8K37K3l79n33l68
61445C40077j12P1J51J37N6L1J81M64P21P95O11K87J77N37J057J109O60M62R74
61426C48446J527J230L48j5M26P42K40n20o29r3M23O31Q06J110J414J635J790
61409C59511J690J139M18J22L08L00m22j447j950j799j620j783j820j206l08K4
61393C51157k56k17P01J740J780Q91K52N67J239J285N14m90j130j107l27J011
$$ plain form
61377 357610 359850 362436 364324 365182 365614 366506 368139 370063 371795 373456 375485 377814 379691 380418 380066
61362 380066 379327 378879 379077 380056 381898 384693 388467 392979 397588 401634 405096 408691 413171 418691 424879
61347 424879 431207 437125 442227 446609 450819 455193 459527 463593 467531 471356 474526 476633 478196 480109
61333 480109 482424 484323 485247 485392 485126 484606 484019 483501 482589 480463 477122 473783 471623 470550 469664 468584
61317 468584 467789 467782 468497 469652 471353 474110 478349 484027 490839 498705 507919 518689 530734 543545 556909
61302 556909 570944 585742 601168 616809 631747 644616 654420 661261 665841 668318 668269 665711 661475
61289 661475 656341 650382 643404 635481 626770 617300 607361 597654 588720 580520 572923 566157 560394 555198
61275 555198 549910 544431 539288 535081 532077 530176 529030 528385 528403 529375 531014 532528 533601 534774 536533
$$ packed form
61377C57610K240K586J888Q58M32Q92J633J924J732J661K029K329J877P27l52
61362C80066p39m48J98R79J842K795L774M512M609M046L462L595M480N520O188
61347D24879O328N918N102M382M210M374M334M066L938L825L170K107J563J913
61333D80109K315J899R24J45k66n20n87n18r12k126l341l339k160j073q86j080
61317D68584p95pP15J155J701K757M239N678O812P866R214J0770J2045J2811J3364
61302E56909J4035J4798J5426J5641J4938J2869R804O841M580K477m9k558m236
61289F61475n134n959o978p923q711r470r939r707q934q200p597o766n763n196
61275E55198n288n479n143m207l004j901j146o45J8R72J639J514J073J173J759
$$ plain form
61260 536533 538590 540605 543061 546704 551411 556357 561159 566131 571393 576367 580335 583092 584965 586490
61246 586490 588051 589536 590350 590043 588828 587245 585527 583658 581811 580254 578952 577703 576536 575576 574722
61231 574722 573941 573645 574124 574872 575279 576002 578657 583887 590554 597244 603882 611323 619919 629130 638216 646787
61215 646787 654883 662989 671728 681120 690343 698692 706478 714459 722479 729382 734415 738181 741863 745924
61201 745924 749948 753561 757063 761125 766271 772841 781188 791503 803425 816143 829001 841790 854285
61188 854285 865827 875691 883735 890346 895758 899765 902150 902999 902484 900567 897169 892431 886686 880287
61174 880287 873557 866730 859776 852442 844638 836667 828881 821076 812414 802027 789793 776515 763311
61161 763311 750775 738745 726814 714843 702875 690833 678691 666839 655842 645827 636473 627800
$$ packed form
61260E36533K057K015K456L643M707M946M802M972N262M974L968K757J873J525
61246E86490J561J485Q14l07j215j583j718j869j847j557j302j249j167r60q54
61231E74722p81k96M79P48M07P23K655N230O667O690O638P441Q596R211R086Q571
61215F46787Q096Q106Q739R392R223Q349P786P981Q020O903N033L766L682M061
61201G45924M024L613L502M062N146O570Q347J0315J1922J2718J2858J2789J2495
61188H54285J1542R864Q044O611N412M007K385Q49n15j917l398m738n745o399
61174H80287o730o827o954p334p804p971p786p805q662j0387j2234j3278j3204
61161G63311j2536j2030j1931j1971j1968j2042j2142j1852j0997j0015r354q673
$$ plain form
61149 627800 620563 615559 612705 611047 609579 607820 605664 603008 599664 595551 590783 585555 580033 574463
61135 574463 569313 565114 562121 560305 559730 560624 562871 565831 569070 573091 578772 586217 594752 604060 614612
61120 614612 626773 640209 654648 670686 689138 709915 732167 755380 779672 805026 830964
61109 830964 857187 883976 911533 939227 965849 990481 1012823 1032863 1050594 1066092 1079460
61098 1079460 1090520 1098730 1103558 1104918 1103089 1098296 1090522 1079692 1065949 1049698 1031516 1012035
61086 1012035 991815 971278 950750 930500 910581 890733 870710 850754 831535 813598 797146
61075 797146 782436 769894 759494 750388 741722 733678 727272 723139 720992 720263 720791 722679 725830 729901
61061 729901 734568 739783 745893 753487 762882 773797 785792 798928 813666 830190 848294 867896
$$ packed form
61149F27800p237n004k854j658j468j759k156k656l344m113m768n228n522n570
61135E74463n150m199k993j816n75Q94K247K960L239M021N681P445Q535R308J0552
61120F14612J2161J3436J4439J6038J8452K0777K2252K3213K4292K5354K5938
61109H30964K6223K6789K7557K7694K6622K4632K2342K0040J7731J5498J3368
61098A079460J1060Q210M828J360j829m793p774j0830j3743j6251j8182j9481
61086A012035k0220k0537k0528k0250j9919j9848k0023j9956j9219j7937j6452
61075G97146j4710j2542j0400r106q666q044o406m133k147p29N28J888L151M071
61061G29901M667N215O110P594R395J0915J1995J3136J4738J6524J8104J9602
$$ plain form
61049 867896 889064 911409 934123 956987 980881 1006941 1035558 1066494 1099456 1134093 1169845
61038 1169845 1206559 1245087 1286642 1331451 1378520 1426807 1476304 1527810 1581971 1638719 1697472
61027 1697472 1757678 1819106 1881655 1944926 2008171 2070698 2132325 2193572 2255662 2320320 2389165
61016 2389165 2463157 2542787 2628757 2722089 2823843 2935754 3061800 3208670 3384323 3596620
61006 3596620 3853739 4165111 4541487 4995758 5546006 6217569 7040100 8042259 9250439
60997 9250439 10689046 12368265 14251882 16223602 18087810 19623691 20669770 21188807
60989 21188807 21276955 21120657 20931222 20882365 21059335 21425800 21824583 22026324 21815109 21072095
60979 21072095 19815132 18178528 16351302 14510538 12780276 11224611 9862979 8689398
$$ packed form
61049H67896K1168K2345K2714K2864K3894K6060K8617L0936L2962L4637L5752
61038A169845L6714L8528M1555M4809M7069M8287M9497N1506N4161N6748N8753
61027A697472O0206O1428O2549O3271O3245O2527O1627O1247O2090O4658O8845
61016B389165P3992P9630Q5970R3332J01754J11911J26046J46870J75653K12297
61006C596620K57119L11372L76376M54271N50248O71563Q22531J002159J208180
60997I250439J438607J679219J883617J971720J864208J535881J046079N19037
60989B1188807Q8148j56298j89435m8857J76970L66465L98783K01741k11215p43014
60979B1072095j256963j636604j827226j840764j730262j555665j361632j173581
$$ plain form
60971 8689398 7685603 6828565 6095686 5467833 4929423 4467008 4068595 3723759 3423458
60962 3423458 3159705 2925830 2716871 2529222 2360014 2207182 2069711 1947048 1838130
60953 1838130 1741377 1655498 1579653 1512658 1452535 1397147 1345056 1295635 1248590 1203676 1160793
60942 1160793 1120206 1082534 1048362 1017700 989826 963700 938498 913768 889354 865416 842333
60931 842333 820341 799380 779478 761031 744325 728961 714287 700344 687895 677369 668246 659703
60919 659703 651491 643907 637207 631417 626523 622454 618870 615266 611359 607296 603427 600001 597036 594409
60905 594409 592072 590236 589265 589300 590006 590791 591253 591399 591501 591820 592365 592752 592366 590853 588466 585774 583030
60888 583030 580022 576573 572821 568748 563711 557004 548893 540646 533245 526389 519066 510804 502016 493338
$$ packed form
60971H689398j003795q57038p32879o27853n38410m62415l98413l44836l00301
60962C423458k63753k33875k08959j87649j69208j52832j37471j22663j08918
60953A838130r6753q5879p5845o6995o0123n5388n2091m9421m7045m4914m2883
60942A160793m0587l7672l4172l0662k7874k6126k5202k4730k4414k3938k3083
60931H42333k1992k0961j9902j8447j6706j5364j4674j3943j2449j0526r123q543
60919F59703q212p584o700n790m894m069l584l604l907m063l869l426k965k627
60905E94409k337j836r71L5P06P85M62J46J02L19N45L87l86j513k387k692k744
60888E83030l008l449l752m073n037o707q111q247p401o856p323q262q788q678
$$ plain form
60874 493338 485176 477883 471835 467073 463140 459494 455921 452480 449365 446914 445411 444651 443991 443147 442663
60859 442663 443288 445087 447503 450110 452868 455692 458296 460581 462849 465495 468661 472261 476122 480038
60845 480038 483867 487648 491455 495093 498143 500349 501780 502511 502370 501145 498906 495997 492728 489146 485109
60830 485109 480617 476035 471888 468322 464977 461571 458419 456083 454567 453209 451342 448764 445680 442524
60816 442524 439796 437545 434972 431101 426061 421125 417147 413493 409016 403640 398335 393793 389848 386163
60802 386163 382782 379829 377219 374936 373173 371935 370793 369363 367788 366528 365788 365385 364980 364232 362912
60787 362912 361196 359780 359356 359912 360834 361753 362981 364858 366978 368505 369272 370150 372021 374669 377042 378582
60771 378582 379917 382103 385447 389305 392932 396247 399710 403548 407283 409992 411034 410545 409325 408260
$$ packed form
60874D93338q162p293o048m762l933l646l573l441l115k451j503p60o60q44m84
60859D42663O25J799K416K607K758K824K604K285K268K646L166L600L861L916
60845D80038L829L781L807L638L050K206J431P31j41j225k239k909l269l582m037
60830D85109m492m582m147l566l345l406l152k336j516j358j867k578l084l156
60816D42524k728k251k573l871n040m936l978l654m477n376n305m542l945l685
60802C86163l381k953k610k283j763j238j142j430j575j260p40m03m05p48j320
60787C62912j716j416m24N56R22R19J228J877K120J527P67Q78J871K648K373J540
60771C78582J335K186L344L858L627L315L463L838L735K709J042m89j220j065
$$ plain form
60757 408260 407734 407361 406273 403920 400762 397994 396404 395617 394682 393146 391251 389356 387759 387000 387617 389331
60741 389331 391006 391705 391349 390079 387581 383531 378310 372675 367015 361478 356529 352716 349937 347575 345333
60726 345333 343391 341753 340084 338282 336612 335059 333113 330520 327816 325848 325054 325443 326872 329029 331356
60711 331356 333281 334483 334952 335092 335726 337508 340123 342530 344174 345587 347563 350259 353421 356890 360320
60696 360320 362904 364102 364483 365186 366687 368620 370641 372717 374604 375819 376372 376940 377969 379088 379689
60681 379689 379721 379562 379444 379351 379308 379396 379622 380056 380950 382409 384002 385117 385698 386248 386940 387047 385586 382465
60663 382465 378618 374967 371539 367856 363998 360905 359531 359904 361148 362283 362881 363075 363127 363101 363009 363240 364578
60646 364578 367460 371296 374887 377573 379584 381167 381919 381342 379656 377523 375221 372660 370026 367804 366130
$$ packed form
60757D08260n26l73j088k353l158k768j590p87r35j536j895j895j597p59O17J714
60741C89331J675O99l56j270k498m050n221n635n660n537m949l813k779k362k242
60726C45333j942j638j669j802j670j553j946k593k704j968p94L89J429K157K327
60711C31356J925J202M69J40O34J782K615K407J644J413J976K696L162L469L430
60696C60320K584J198L81P03J501J933K021K076J887J215N53N68J029J119O01
60681C79689L2j59j18r3m3Q8K26M34Q94J459J593J115N81N50O92J07j461l121
60663C82465l847l651l428l683l858l093j374L73J244J135N98J94N2k6r2K31J338
60646C64578K882L836L591K686K011J583P52n77j686k133k302k561k634k222j674
$$ plain form
60631 366130 364607 362887 361028 359236 357693 356700 356497 356781 356830 356306 355596 355151 354950 354854 355039 355657 356415 356915
60613 356915 357152 357264 357046 356255 355269 354888 355434 356464 357445 358265 359011 359612 359937 360005 359944 359892 360028 360449 360963
60594 360963 361329 361829 363246 365972 369323 372061 373471 373728 373420 373120 373270 373993 374878 375346 375433 375901 377337
60577 377337 379410 381341 382886 384506 386662 389379 392609 396668 401985 408569 415925 423564 431486 440106
60563 440106 449738 460163 470736 480775 489665 496642 500893 502165 501074 498494 494812 490096 484773
60550 484773 479613 475113 471447 469058 468617 470101 472517 474932 477426 480709 485316 491568 499780 509836
60536 509836 520877 532173 544141 557885 573743 590823 607794 623451 636591 646166 651894 654287
60524 654287 653903 651026 646095 639854 632905 625568 618295 611621 605586 599866 594649 590615 587691 584698
$$ packed form
60631C66130j523j720j859j792j543r93k03K84M9n24p10m45k01r6J85O18P58N00
60613C56915K37J12k18p91r86l81N46J030R81Q20P46O01L25O8o1n2J36M21N14
60594C60963L66N00J417K726L351K738J410K57l08l00J50P23Q85M68Q7M68J436
60577C77337K073J931J545J620K156K717L230M059N317O584P356P639P922Q620
60563D40106R632J0425J0573J0039Q890O977M251J272j091k580l682m716n323
60550D84773n160m500l666k389m41J484K416K415K494L283M607O252Q212J0056
60536E09836J1041J1296J1968J3744J5858J7080J6971J5657J3140R575N728K393
60524F54287l84k877m931o241o949p337p273o674o035n720n217m034k924k993
$$ plain form
60510 584698 580935 577446 575848 576304 577576 578888 580833 584433 590180 598247 608968 622731 639790 660499
60496 660499 685413 714809 748234 784654 822997 862543 902927 943747 983903 1021287 1053424
60485 1053424 1078537 1095989 1105813 1108205 1103460 1091975 1073982 1049512 1018889 983181 943981 902823
60473 902823 860961 819532 779584 741843 706634 674163 644763 618671 595662 575137 556628
60462 556628 540004 525134 511648 499277 488212 478765 470801 463903 457975 453151 449043 444716 439693
60449 439693 434529 430007 426211 422788 419723 417250 415247 413332 411485 409957 408544 406550 403694 400617
60435 400617 398224 396791 395917 395057 393882 392316 390485 388675 387198 386253 385848 385737 385549 385114 384643 384356
60419 384356 384066 383365 382265 381411 381536 382824 384797 386748 388327 389858 391976 394784 397504 399250 400027
$$ packed form
60510E84698l763l489j598M56J272J312J945L600N747Q067J0721J3763J7059K0709
60496F60499K4914K9396L3425L6420L8343L9546M0384M0820M0156L7384L2137
60485A053424K5113J7452R824K392m745j1485j7993k4470l0623l5708l9200m1158
60473I02823m1862m1429l9948l7741l5209l2471k9400k6092k3009k0525j8509
60462E56628j6624j4870j3486j2371j1065r447p964o898n928m824m108m327n023
60449D39693n164m522l796l423l065k473k003j915j847j528j413j994k856l077
60435D00617k393j433q74q60j175j566j831j810j477r45m05j11j88m35m71k87
60419C84356k90p01j100q54J25J288J973J951J579J531K118K808K720J746P77
$$ plain form
60404 400027 400672 401827 403406 405084 406859 408869 410973 412813 414228 415415 416721 418352 420224 422111
60390 422111 423976 426097 428729 431771 434931 438037 440881 442937 443843 444181 445212 447523 450390 452811 454714
60375 454714 456706 458956 460981 462479 463829 465570 467787 470219 472705 475261 477806 480026 481521 482128
60361 482128 482142 482256 483131 484837 486829 488624 490569 493689 498711 505388 512942 520901 529190 537506 545188
60346 545188 551869 557865 563542 568550 571962 572970 571213 566718 560049 552421 545183 539024 533838 529243
60332 529243 524971 520926 517298 514512 512603 510616 507157 501778 495555 490114 486287 483760 481690 479494
60318 479494 477273 475653 475170 475884 477664 480557 484547 489242 494421 500742 509265 520285 533209 547491
60304 547491 562931 579046 595119 611094 627391 643339 656740 665773 670570 672046 669925 662992
$$ packed form
60404D00027O45J155J579J678J775K010K104J840J415J187J306J631J872J887
60390D22111J865K121K632L042L160L106K844K056R06L38J031K311K867K421J903
60375D54714J992K250K025J498J350J741K217K432K486K556K545K220J495O07
60361D82128J4J14Q75J706J992J795J945L120N022O677P554P959Q289Q316P682
60346E45188O681N996N677N008L412J008j757m495o669p628p238o159n186m595
60332E29243m272m045l628k786j909j987l459n379o223n441l827k527k070k196
60318D79494k221j620m83P14J780K893L990M695N179O321Q523J1020J2924J4282
60304E47491J5440J6115J6073J5975J6297J5948J3401R033M797J476k121o933
$$ plain form
60292 662992 650970 635122 617257 599044 582025 567134 554079 542076 531266 522607 516380 511756
60280 511756 508025 505221 503225 501296 499093 497341 496714 496679 496189 494913 492966 489935 485295 479684 474724
60265 474724 471296 468751 466091 463247 460702 458400 455715 452441 449227 446869 445487 444564 443622 442623 441744
60250 441744 441000 440315 439831 439914 440755 442149 443792 445621 447664 449618 450875 451093 450593 450113 450221 451002 452181
60233 452181 453398 454411 455220 456046 457091 458254 459155 459549 459730 460450 462328 465298 468644 471653 474258 477021
60217 477021 480474 484578 488958 493533 498601 504244 509991 515355 520545 526311 533118 540752 548662 556401
60203 556401 563737 570682 577531 584599 591773 598561 604718 610549 616439 622307 627692 632193 635651 638107
60189 638107 639749 640741 640959 640144 638443 636428 634266 631227 626511 620340 613744 607383 601128 594819 588780
$$ packed form
60292F62992j2022j5848j7865j8213j7019j4891j3055j2003j0810q659o227m624
60280E11756l731k804j996j929k203j752o27l5m90j276j947l031m640n611m960
60265D74724l428k545k660k844k545k302k685l274l214k358j382r23r42r99q79
60250D41744p44o85m84Q3Q41J394J643J829K043J954J257K18n00m80J08P81J179
60233D52181J217J013Q09Q26J045J163R01L94J81P20J878K970L346L009K605K763
60217D77021L453M104M380M575N068N643N747N364N190N766O807P634P910P739
60203E56401P336O945O849P068P174O788O157N831N890N868N385M501L458K456
60189F38107J642R92K18q15j701k015k162l039m716o171o596o361o255o309o039
$$ plain form
60174 588780 583361 578434 573721 569307 565474 562175 559071 556087 553635 552082 551087 549688 547152 543727
60160 543727 540459 538251 537228 536949 536969 537043 537029 536820 536338 535488 534308 533231 532893 533469 534490 535603 537129
60143 537129 539400 541930 543944 545603 547923 551386 555393 559345 563606 568958 575581 583053 590947 598981
60129 598981 606856 614415 621693 628386 633533 636380 637532 638668 640927 643964 646738 648795 650521 652430
60115 652430 654650 657053 659486 661738 663539 664868 666176 668009 670292 672257 673235 673271 672691 671343 668744
60100 668744 664924 660556 656100 651345 646106 640919 636565 633162 630284 627839 626280 625832 625975 625946 625521
60085 625521 625054 624927 625175 625588 625881 625743 624968 623753 622771 622684 623419 624117 623888 622459 619980 616457 611783
60068 611783 606139 599907 593177 585792 577931 570141 562632 555037 547220 539829 533602 528501 524012 520000
$$ packed form
60174E88780n419m927m713m414l833l299l104k984k452j553r95j399k536l425
60160E43727l268k208j023k79K0P4j4k09m82q50j180j077l38N76J021J113J526
60143E37129K271K530K014J659K320L463M007L952M261N352O623P472P894Q034
60129E98981P875P559P278O693N147K847J152J136K259L037K774K057J726J909
60115F52430K220K403K433K252J801J329J308J833K283J965R78L6n80j348k599
60100F68744l820m368m456m755n239n187m354l403k878k445j559m48J43k9m25
60085F25521m67j27K48M13K93j38p75j215r82q7P35O98k29j429k479l523m674
60068F11783n644o232o730p385p861p790p509p595p817p391o227n101m489m012
$$ plain form
60054 520000 516633 513695 510614 507294 504306 502172 500896 500342 500645 502037 504540 507967 511956 516028 520042
60039 520042 524678 530878 538516 546066 552030 556384 560258 564470 568877 572932 576249 578564 579610 579354
60025 579354 578114 576233 573709 570194 565341 559102 551782 543799 535411 526724 517969 509533 501582 493906
60011 493906 486393 479419 473439 468303 463418 458546 454030 450144 446703 443528 440926 439336 438752 438787 439169
59996 439169 439880 440929 442280 443897 445572 446827 447341 447510 448247 450140 453031 456486 460343 464637 469165
59981 469165 473432 477018 479847 482094 483863 484988 485127 484087 482006 479171 475793 472126 468661 465881
59967 465881 463748 461712 459386 457000 455070 453878 453477 453982 455483 457706 460069 462181 464160 466413 469162
59952 469162 472161 474780 476407 476917 476709 476277 475802 475216 474482 473662 472813 472014 471406 471007 470578 469909 469141 468521
$$ packed form
60054E20000l367k938l081l320k988k134j276n54L03J392K503L427L989M072M014
60039E20042M636O200P638P550N964M354L874M212M407M055L317K315J046k56
60025E79354j240j881k524l515m853o239p320p983q388q687q755q436p951p676
60011D93906p513o974n980n136m885m872m516l886l441l175k602j590n84L5L82
59996D39169P11J049J351J617J675J255N14J69P37J893K891L455L857M294M528
59981D69165M267L586K829K247J769J125J39j040k081k835l378l667l465k780
59967D65881k133k036k326k386j930j192m01N05J501K223K363K112J979K253K749
59952D69162K999K619J627N10k08m32m75n86p34q20q49p99o08l99m29o69p68o20
$$ plain form
59934 468521 467913 466913 465444 463867 462407 460947 459679 459575 461683 465939 471105 475950 480247 484527 489139
59919 489139 493825 498094 501663 504438 506245 506885 506485 505646 505136 505418 506458 507841 509082 509998 510941 512532
59903 512532 514983 517776 520209 522132 523883 525547 526688 526969 526806 527172 528780 531479 534410 536807 538834
59888 538834 541610 546172 552435 559343 565960 572029 577536 582400 586944 592163 598894 606884 615059 622574
59874 622574 629191 634852 639523 643396 646607 648683 648838 647068 644322 641236 637281 631775 625340 619583
59860 619583 615435 612460 609852 607376 605105 602892 600650 598828 598087 598580 599977 602122 605341 610086 616502
59845 616502 624190 632072 638565 642400 643479 642724 641091 639080 637198 636302 636961 638749 640521 641289 640589
59830 640589 638286 634515 629816 624918 620307 616250 613130 611316 610547 609788 607953 604630 600061 594694 588947
$$ packed form
59934D68521o08j000j469j577j460j460j268j04K108M256N166M845M297M280M612
59919D89139M686M269L569K775J807O40m00q39n10K82J040J383J241R16R43J591
59903E12532K451K793K433J923J751J664J141K81j63L66J608K699K931K397K027
59888E38834K776M562O263O908O617O069N507M864M544N219O731P990Q175P515
59874F22574O617N661M671L873L211K076J55j770k746l086l955n506o435n757
59860F19583m148k975k608k476k271k213k242j822p41M93J397K145L219M745O416
59845F16502P688P882O493L835J079p55j633k011j882q96O59J788J772P68p00
59830F40589k303l771m699m898m611m057l120j814p69p59j835l323m569n367n747
$$ plain form
59815 588947 583126 577285 571220 564866 558648 553244 548969 545500 542240 538884 535659 533106 531587 530913
59801 530913 530377 529222 527194 524716 522573 521326 520886 520609 519812 518272 516228 514072 512110 510516 509312
59786 509312 508348 507428 506507 505658 504889 504145 503577 503633 504712 506685 508821 510245 510560 510112 509633 509547 509617 509325
59768 509325 508595 508077 508657 510625 513331 515718 517261 518334 519592 521246 523211 525770 529431 534001 538413
59753 538413 541919 545088 549172 554775 561622 569276 577470 585875 594235 602690 611396 619808 626976 632585
59739 632585 637152 641185 644816 648315 652142 656176 659612 662044 663985 665898 667358 667749 667182 666095 664488
59724 664488 662333 660295 659130 658554 657582 655932 654262 652952 651454 649110 645883 642032 637654 633027 628931
59709 628931 626023 624043 622078 619582 616883 614660 613160 612079 611055 610144 609684 609775 610085 610249 610308 610637
$$ packed form
59815E88947n821n841o065o354o218n404m275l469l260l356l225k553j519o74
59801E30913n36j155k028k478k143j247m40k77p97j540k044k156j962j594j204
59786E09312r64r20r21q49p69p44n68N6J079J973K136J424L15m48m79q6P0k92
59768E09325p30n18N80J968K706K387J543J073J258J654J965K559L661M570M412
59753E38413L506L169M084N603O847P654Q194Q405Q360Q455Q706Q412P168N609
59739F32585M567M033L631L499L827M034L436K432J941J913J460L91n67j087j607
59724F64488k155k038j165n76r72j650j670j310j498k344l227l851m378m627m096
59709F28931k908j980j965k496k699k223j500j081j024r11m60R1L10J64N9L29
$$ plain form
59693 610637 611538 613069 615108 617390 619548 621283 622480 623082 623005 622296 621243 620212 619523 619538 620486 621970
59677 621970 622917 622336 619977 616122 611146 605625 600394 595851 591423 586321 580676 575374 570882 566947 563423
59662 563423 560558 558331 556186 553839 551782 550629 550351 550518 550990 551984 553676 556044 558901 561916 564785
59647 564785 567563 570523 573523 575803 576613 575796 573607 570374 566649 563229 560459 557707 554109 549840 546116
59632 546116 543806 542530 541359 540047 539112 538800 538517 537516 535790 533884 531968 529632 526730 523870 521697
59617 521697 520030 518192 515936 513558 511240 508854 506396 504066 501920 499959 498593 498410 499292 500393 501238
59602 501238 502222 503710 505266 506325 507109 508241 509763 511157 512129 512767 513098 513131 513299 514185 515647 516701
59586 516701 516556 515440 514263 513733 513936 514501 514909 514756 513928 512573 510950 509295 507786 506419 504956 503030
$$ packed form
59693F10637R01J531K039K282K158J735J197O02p7p09j053j031o89J5R48J484
59677F21970R47n81k359l855m976n521n231m543m428n102n645n302m492l935l524
59662E63423k865k227k145k347k057j153k78J67M72R94J692K368K857L015K869
59647E64785K778K960L000K280Q10q17k189l233l725l420k770k752l598m269l724
59632E46116k310j276j171j312r35l12k83j001j726j906j916k336k902k860k173
59617E21697j667j838k256k378k318k386k458k330k146j961j366j83Q82J101Q45
59602E01238R84J488J556J059P84J132J522J394R72O38L31L3J68Q86J462J054
59586E16701j45j116j177n30K03N65M08j53q28j355j623j655j509j367j463j926
$$ plain form
59570 503030 500354 496898 493140 490134 488883 489305 490115 490184 489816 490159 491396 492178 491087 488254 485242 483581
59554 483581 483637 484640 485543 485926 486295 487475 489644 492130 494198 495834 497569 499786 502494 505716 509820
59539 509820 515413 523091 533284 546177 561719 579612 599089 618352 634365 643820 645050 639282
59527 639282 629849 620008 611381 604226 598700 595404 594716 596046 598148 600130 601904 603580 604740 604625 602975
59512 602975 600335 597346 593951 589630 584318 578689 573292 567710 561002 553001 544797 537762 532293 527843
59498 527843 524017 521125 519388 518008 515700 512260 509051 507456 507194 506784 505573 504516 504713 505860 506801
59483 506801 507212 507996 510040 513218 516850 520623 524776 529612 535144 541157 547443 553872 560264 566161 570942
59468 570942 574294 576479 577980 578999 579525 579700 579774 579801 579788 580110 581359 583703 586687 589787 592935 596563
$$ packed form
59570E03030k676l456l758l006j251M22Q10O9l68L43J237P82j091k833l012j661
59554D83581N6J003R03L83L69J180K169K486K068J636J735K217K708L222M104
59539E09820N593P678J0193J2893J5542J7893J9477J9263J6013R455J230n768
59527F39282r433r841q627p155n526l296o88J330K102J982J774J676J160j15j650
59512F02975k640k989l395m321n312n629n397n582o708q001q204p035n469m450
59498E27843l826k892j737j380k308l440l209j595k62m10j211j057J97J147R41
59483E06801M11P84K044L178L632L773M153M836N532O013O286O429O392N897M781
59468E70942L352K185J501J019N26J75P4K7j3L22J249K344K984L100L148L628
$$ plain form
59452 596563 601377 607901 615793 623705 630475 636466 643048 650633 657952 663616 667536 670233 671384 669962
59438 669962 665589 659059 651562 643963 636766 630242 624457 619418 615155 611506 608070 604658 601560 599120
59424 599120 597423 596820 598319 602800 610024 619017 629275 641039 654603 670059 687577 707161 728229
59411 728229 750374 774541 802265 833015 862931 886732 900573 903118 895215 879802 861574 845266
59399 845266 833623 827277 826323 831108 841071 853366 863236 866075 859495 844089 822693 798869 775602
59386 775602 754778 737214 722876 711238 701777 694169 688050 682894 678385 674667 671874 669544 666936
59373 666936 663941 661297 659764 659345 659385 659203 658464 657241 655908 654862 654167 653608 653180 653384 654806 657480
59357 657480 660823 664214 667571 671493 676891 684356 693635 703812 714159 724803 736425 749391 763391
$$ packed form
59452E96563M814O524P892P912O770N991O582P585P319N664L920K697J151j422
59438F69962m373o530p497p599p197o524n785n039m263l649l436l412l098k440
59424E99120j697o03J499M481P224Q993J0258J1764J3564J5456J7518J9584K1068
59411G28229K2145K4167K7724L0750K9916K3801J3841K545p903j5413j8228j6308
59399H45266j1643o346r54M785R963J2295R870K839o580j5406k1396k3824k3267
59386G75602k0824j7564j4338j1638r461p608o119n156m509l718k793k330k608
59373F66936k995k644j533m19M0j82p39j223j333j046o95n59m28K04J422K674
59357F57480L343L391L357L922N398P465R279J0177J0347J0644J1622J2966J4000
$$ plain form
59344 763391 777861 792480 807178 821923 836594 850851 864050 875470 884792 892165 897698 901129
59332 901129 902127 900658 896860 890779 882530 872484 860945 847826 833065 817258 801442 786275 771823
59319 771823 758083 745217 733222 721919 711383 701887 693254 684842 676427 668593 661881 656086 650848
59306 650848 646453 643435 641769 641178 641995 644991 650397 657854 667271 678862 691892 703932 711888 713736
59292 713736 709276 699666 686565 671458 655500 639890 626118 615319 607300 600723 594514 588764 584090
59279 584090 580711 578674 578512 580927 585799 592130 599146 607045 616422 627256 638806 650429 662273
59266 662273 675067 689228 704158 718472 730921 741054 748915 754306 756714 756069 753295 749784 746285
59253 746285 742451 737550 731493 725050 719141 714133 709880 706243 703356 701379 700196 699483 699073 699226 700546
$$ packed form
59344G63391J4470J4619J4698J4745J4671J4257J3199J1420R322P373N533L431
59332I01129R98j469l798o081q249j0046j1539j3119j4761j5807j5816j5167j4452
59319G71823j3740j2866j1995j1303j0536r496q633q412q415p834o712n795n238
59306F50848m395l018j666n91Q17K996N406P457R417J1591J3030J2040P956J848
59292G13736m460r610j3101j5107j5958j5610j3772j0799q019o577o209n750m674
59279E84090l379k037j62K415M872O331P016P899R377J0834J1550J1623J1844
59266F62273J2794J4161J4930J4314J2449J0133P861N391K408o45k774l511l499
59253G46285l834m901o057o443n909n008m253l637k887j977j183p13m10J53J320
$$ plain form
59238 700546 703553 708162 713628 719165 724632 730439 736696 742655 747198 749759 750571 750109 748595 746045 742438
59223 742438 737601 731174 723077 713955 704830 696148 687424 677945 667632 657050 646783 637145 628433
59210 628433 621027 615013 609865 604751 599184 593403 588163 584175 581637 580199 579324 578631 577973 577410 577254
59195 577254 577928 579550 581746 584078 586460 588906 591152 593045 595154 598319 602444 606413 609479 612176
59181 612176 615447 619455 623781 628324 633288 638465 643191 647035 649993 652061 653206 653858 654917 656987
59167 656987 659856 662859 665535 667866 670077 672294 674288 675614 676144 676303 676451 676166 674552 671231 666652
59152 666652 661356 655361 648424 640626 632506 624742 617720 611212 604502 597102 589351 582075 575716 570088
59138 570088 564870 559941 555204 550527 545968 541700 537715 533964 530834 528922 528178 527804 527259 526909 527331
$$ packed form
59238G00546L007M609N466N537N467N807O257N959M543K561Q12m62j514k550l607
59223G42438m837o427q097r122r125q682q724r479j0313j0582j0267r638q712
59210F28433p406o014n148n114n567n781n240l988k538j438q75o93o58n63j56
59195E77254O74J622K196K332K382K446K246J893K109L165M125L969L066K697
59181F12176L271M008M326M543M964N177M726L844K958K068J145O52J059K070
59167F56987K869L003K676K331K211K217J994J326N30J59J48k85j614l321m579
59152F66652n296n995o937p798q120p764p022o508o710p400p751p276o359n628
59138E70088n218m929m737m677m559m268l985l751l130j912p44l74n45l50M22
$$ plain form
59123 527331 528489 530059 532242 535681 540662 546816 553593 560720 568310 576733 586245 596480 606489 615597
59109 615597 624103 632764 641692 650153 657447 663556 668826 673415 677286 680481 683070 684873 685550 685089 684061
59094 684061 683192 682671 682034 680855 679382 678262 677730 677349 676605 675429 674051 672605 671116 669583 667792 665170
59078 665170 661197 655964 650080 644019 637753 631030 623802 616321 608994 602193 596126 590829 586325 582684
59064 582684 579734 576783 572977 568143 563125 559081 556507 555071 554184 553469 552671 551584 550235 548924 547814
59049 547814 546654 545158 543484 541973 540559 538884 537045 535733 535417 535783 536202 536452 536709 537103 537654 538417
59033 538417 539298 539890 539896 539719 540377 542777 547098 552681 558393 563465 568326 574394 582692 592886 603998
59018 603998 615674 628240 641708 655310 667990 678853 687251 692950 696211 697304 696183 693154 689512
$$ packed form
59123E27331J158J570K183L439M981O154O777P127P590Q423R512J0235J0009R108
59109F15597Q506Q661Q928Q461P294O109N270M589L871L195K589J803O77m61j028
59094F84061q69n21o37j179j473j120n32l81p44j176j378j446j489j533j791k622
59078F65170l973n233n884o061o266o723p228p481p327o801o067n297m504l641
59064E82684k950k951l806m834n018m044k574j436q87p15p98j087j349j311j110
59049E47814j160j496j674j511j414j675j839j312l16L66M19K50K57L94N51P63
59033E38417Q81N92Oj77O58K400M321N583N712N072M861O068Q298J0194J1112
59018F03998J1676J2566J3468J3602J2680J0863Q398N699L261J093j121l029l642
$$ plain form
59005 689512 686595 684250 681211 677161 673512 671810 672301 674465 678062 682872 688100 692887 697074 700806
58991 700806 703769 705599 706830 708632 711516 714856 717711 719652 720761 721231 721167 720570 719487 718328 717861
58976 717861 718648 720627 723494 727383 732857 740349 749952 761630 775190 789994 805074 819761 834017
58963 834017 848099 862064 875693 888688 900752 911508 920513 927446 932223 934791 934850 932018 926314
58950 926314 918235 908182 896161 882313 867398 852223 836799 820719 804308 788710 774722 762188
58938 762188 750744 740543 731856 724481 718016 712401 707869 704588 702612 701859 701952 702393 703092 704298 705857
58923 705857 707042 707381 707187 706957 706685 706110 705184 703891 702082 699885 697881 696461 695410 694562 694312 694946
58907 694946 695925 696564 697152 698774 702211 707567 714744 723633 733927 745310 757816 771544 786075 800561
$$ packed form
59005F89512k917k345l039m050l649j702M91K164L597M810N228M787M187L732
58991G00806K963J830J231J802K884L340K855J941J109M70o4n97j083j159m67
58976G17861P87J979K867L889N474P492R603J1678J3560J4804J5080J4687J4256
58963H34017J4082J3965J3629J2995J2064J0756R005O933M777K568N9k832n704
58950I26314q079j0053j2021j3848j4915j5175j5424j6080j6411j5598j3988j2534
58938G62188j1444j0201q687p375o465n615m532l281j976p53R3M41O99J206J559
58923G05857J185L39j94k30k72n75r26j293j809k197k004j420j051q48k50O34
58907F94946R79O39N88J622L437N356P177Q889J0294J1383J2506J3728J4531J4486
$$ plain form
58893 800561 814361 827326 839702 852119 865425 880110 896041 913055 931433 951293 971865
58882 971865 991924 1010772 1028277 1044207 1058069 1069381 1077534 1081643 1081240 1077043 1070405 1062003 1051616
58869 1051616 1039152 1025326 1011210 997561 984654 972414 960736 949924 940677 933307 927184 921245
58857 921245 914781 907422 898868 889264 879460 870152 860991 851190 840768 830431 820481 810725 801319 792769
58843 792769 784958 777040 768576 760109 752309 745079 737691 729441 720158 710460 701430 693524 685975 677878
58829 677878 669700 662954 658423 655483 653235 651410 649972 648706 647679 647512 648748 651342 654996 659580
58815 659580 664962 670766 676526 681870 686550 690623 694515 698547 702501 706037 709205 711958 713470 712795
58801 712795 710129 706582 702756 698371 693281 687861 682225 675941 668840 661307 653549 645296 636539 627890
$$ packed form
58893H00561J3800J2965J2376J2417J3306J4685J5931J7014J8378J9860K0572
58882I71865K0059J8848J7505J5930J3862J1312Q153M109m03m197o638q402j0387
58869A051616j2464j3826j4116j3649j2907j2240j1678j0812r247p370o123n939
58857I21245o464p359q554r604r804r308r161r801j0422j0337r950r756r406q550
58843G92769p811p918q464q467p800p230p388q250r283r698r030p906p549q097
58829F77878q178o746m531k940k248j825j438j266j027j67J236K594L654M584
58815F59580N382N804N760N344M680M073L892M032L954L536L168K753J512o75
58801G12795k666l547l826m385n090n420n636o284p101p533p758q253q757q649
$$ plain form
58787 627890 619983 613186 608005 604961 603812 603657 604045 605250 607325 609775 612449 615839 620108 624609 628712
58772 628712 632256 634882 635824 634804 632223 628146 622084 614308 606313 599294 593098 587313 582372 578719
58758 578719 575822 572999 570482 568781 567750 567203 567664 569451 571666 573245 574447 576231 578611 580827 582702
58743 582702 584618 586467 587889 589483 592539 597399 603102 608739 614248 619734 624960 629804 634495 639167
58729 639167 643768 648540 653946 659942 665864 671179 675882 680110 683952 687752 692066 697117 702636 708342
58715 708342 714239 720462 727130 734333 741886 749251 756087 762733 769584 776045 780634 782196 780681 776787
58701 776787 771248 764393 755925 745159 731788 716407 699980 682972 665401 647575 630279 614313
58689 614313 600179 588061 577716 568615 560589 554045 549024 544435 539028 532896 527228 522630 518587
$$ packed form
58787F27890p907o797n181l044j149j55L88J205K075K450K674L390M269M501M103
58772F28712L544K626R42j020k581m077o062p776p995p019o196n785m941l653
58758E78719k897k823k517j701j031n47M61J787K215J579J202J784K380K216J875
58743E82702J916J849J422J594L056M860N703N637N509N486N226M844M691M672
58729F39167M601M772N406N996N922N315M703M228L842L800M314N051N519N706
58715G08342N897O223O668P203P553P365O836O646O851O461M589J562j515l894
58701G76787n539o855q468j0766j3371j5381j6427j7008j7571j7826j7296j5966
58689F14313j4134j2118j0345r101q026o544n021m589n407o132n668m598m043
$$ plain form
58676 518587 514633 511141 508638 507103 506321 506349 507159 508324 509537 511163 513885 518053 523696 530950 540087
58661 540087 551068 563184 575111 585285 592485 596290 597103 595714 592846 588901 583999 578277 572202
58648 572202 566418 561147 555935 550232 544118 538345 533771 530833 529262 528152 526623 524748 523578 523961
58634 523961 525567 527374 528830 530177 531899 534252 537200 540396 543292 545486 546772 546863 545531 543319 541494
58619 541494 540784 540589 540055 539457 539811 541509 544206 547836 552787 559008 565720 572150 577935 582774 586336
58604 586336 588697 590332 591555 592381 592905 593278 593273 592467 590930 589168 587344 585169 582699 580582 579264 578480
58588 578480 577918 577886 578985 581437 585108 589935 595977 603213 611524 620768 630637 640564 649984 658715 667067
58573 667067 675558 684466 693488 701891 709156 715583 722259 730504 741269 754831 770881 789052 809410
$$ packed form
58676E18587l954l492k503j535p82K8Q10J165J213J626K722M168N643P254R137
58661E40087J0981J2116J1927J0174P200L805Q13j389k868l945m902n722o075
58648E72202n784n271n212n703o114n773m574k938j571j110j529j875j170L83
58634E23961J606J807J456J347J722K353K948L196K896K194J286R1j332k212j825
58619E41494p10j95n34n98L54J698K697L630M951O221O712O430N785M839L562
58604E86336K361J635J223Q26N24L73nq06j537j762j824k175k470k117j318p84
58588E78480n62l2J099K452L671M827O042P236Q311R244R869R927R420Q731Q352
58573F67067Q491Q908R022Q403P265O427O676Q245J0765J3562J6050J8171K0358
$$ plain form
58560 809410 832308 857722 884992 913197 941452 968746 993930 1016025 1034247 1047717 1055761 1058675
58548 1058675 1057663 1053785 1047632 1040125 1032757 1026401 1020618 1014652 1008328 1001296 992286 980168 965101
58535 965101 947696 927719 904924 880758 857819 837586 819750 803763 789851 778340 768931 761009
58523 761009 754000 747386 741008 735391 731049 727497 723653 719125 714352 709620 704835 700252 696449 693442
58509 693442 690627 687727 685018 682567 680126 677849 676219 675141 673922 672321 670788 669544 668338 667281
58495 667281 666929 667216 667243 666591 666011 666346 667507 669040 671011 673717 677051 680774 685175 690961 698550 707698
58479 707698 717745 728336 740021 753866 770076 787401 804413 820849 836811 851147 861865
58468 861865 868049 870177 868590 863130 854564 844936 835820 827322 819439 813274 809977 809294 810170 812303 816269
$$ packed form
58560H09410K2898K5414K7270K8205K8255K7294K5184K2095J8222J3470Q044K914
58548A058675j012l878o153p507p368o356n783n966o324p032r010j2118j5067
58535I65101j7405j9977k2795k4166k2939k0233j7836j5987j3912j1511r409p922
58523G61009p009o614o378n617m342l552l844m528m773m732m785m583l803l007
58509F93442k815k900k709k451k441k277j630j078j219j601j533j244j206j057
58495F67281l52K87K7o52n80L35J161J533J971K706L334L723M401N786P589R148
58479G07698J0047J0591J1685J3845J6210J7325J7012J6436J5962J4336J0718
58468H61865O184K128j587n460q566r628r116q498p883o165l297o83Q76K133L966
$$ plain form
58453 816269 822415 830465 840089 851282 864032 877710 890694 900755 906317 907451 905225 900195 892148
58440 892148 881316 868995 856713 845291 834950 825775 817919 811792 808044 806833 807217 807964 808915 810853
58426 810853 814230 818878 824803 832168 840450 848697 856684 864738 872329 878093 881495 883158 883161 880415 874480
58411 874480 866824 859376 852675 846169 839463 832454 824916 816829 808721 801089 793937 787249 781362 776503
58397 776503 772558 769685 768502 769262 771432 774467 778382 783197 788369 793118 796936 799694 801769 803991
58383 803991 806714 809076 810110 810486 811975 815178 819006 822568 826211 830356 834665 838969 843888 849875
58369 849875 856563 863488 870573 877680 884750 892564 902179 913336 924661 935640 947090 959514 972536
58356 972536 986150 1000767 1015525 1028453 1038959 1048303 1056808 1062643 1064652 1064570 1065000 1066629 1068829 1071607
$$ packed form
58453H16269O146Q050R624J1193J2750J3678J2984J0061N562J134k226n030q047
58440H92148j0832j2321j2282j1422j0341r175p856o127l748j211L84P47R51J938
58426H10853L377M648N925P365Q282Q247P987Q054P591N764L402J663Lk746n935
58411H74480p656p448o701o506o706p009p538q087q108p632p152o688n887m859
58397G76503l945k873j183P60K170L035L915M815N172M749L818K758K075K222
58383H03991K723K362J034L76J489L203L828L562L643M145M309M304M919N987
58369H49875O688O925P085P107P070P814R615J1157J1325J0979J1450J2424J3022
58356I72536J3614J4617J4758J2928J0506R344Q505N835K009q2M30J629K200K778
$$ plain form
58342 1071607 1075400 1080043 1085327 1091674 1099213 1107182 1115251 1124311 1134998 1146706 1159028 1172726 1188117
58329 1188117 1203957 1219190 1234469 1250534 1266392 1280552 1292884 1303835 1312995 1319910 1325288 1330049
58317 1330049 1334151 1337626 1341641 1347184 1353727 1360374 1367190 1374317 1381196 1388038 1396668 1408400 1422238
58304 1422238 1436519 1451027 1466180 1481641 1497294 1514184 1532829 1551930 1570270 1588504 1607505
58293 1607505 1626530 1644767 1663177 1682975 1703701 1724586 1746351 1769791 1794104 1818512 1843960
58282 1843960 1871257 1899175 1926464 1954156 1983635 2014102 2044243 2074795 2106999 2140061 2172731
58271 2172731 2206027 2241881 2280434 2321097 2364745 2412219 2462094 2512616 2564541 2619500 2677026
58260 2677026 2735918 2797044 2861927 2929913 2999403 3070488 3143731 3218059 3292582 3368690 3447496
$$ packed form
58342A071607L793M643N284O347P539P969Q069R060J0687J1708J2322J3698J5391
58329A188117J5840J5233J5279J6065J5858J4160J2332J0951R160O915N378M761
58317A330049M102L475M015N543O543O647O816P127O879O842Q630J1732J3838
58304A422238J4281J4508J5153J5461J5653J6890J8645J9101J8340J8234J9001
58293A607505J9025J8237J8410J9798K0726K0885K1765K3440K4313K4408K5448
58282A843960K7297K7918K7289K7692K9479L0467L0141L0552L2204L3062L2670
58271B172731L3296L5854L8553M0663M3648M7474M9875N0522N1925N4959N7526
58260B677026N8892O1126O4883O7986O9490P1085P3243P4328P4523P6108P8806
$$ plain form
58249 3447496 3527257 3606474 3687449 3773435 3864368 3958886 4058312 4164855 4278071 4397042 4523761
58238 4523761 4660196 4804338 4953660 5110146 5277304 5454719 5640603 5837194 6048097
58229 6048097 6272689 6509061 6760338 7032020 7325156 7638489 7975222 8340890 8736542
58220 8736542 9161135 9618994 10117761 10660958 11250200 11892878 12599647 13376365 14227206
58211 14227206 15163956 16203457 17358331 18640524 20072602 21685973 23511256 25583014
58203 25583014 27953320 30690801 33872383 37592681 41979254 47181947 53350847 60647032
58195 60647032 69279891 79525370 91728173 106325427 123860414 144913738 169985205
58188 169985205 199430428 233383145 271406009 311834289 351302148 385102625 408482686
$$ packed form
58249C447496P9761P9217Q0975Q5986R0933R4518R9426J06543J13216J18971J26719
58238D523761J36435J44142J49322J56486J67158J77415J85884J96591K10903
58229F048097K24592K36372K51277K71682K93136L13333L36733L65668L95652
58220H736542M24593M57859M98767N43197N89242O42678P06769P76718Q50841
58211A4227206R36750J039501J154874J282193J432078J613371J825283K071758
58203B5583014K370306K737481L181582L720298M386573N202693O168900P296185
58195F0647032Q632859J0245479J2202803J4597254J7534987K1053324K5071467
58188A69985205K9445223L3952717L8022864M0428280L9467859L3800477K3380061
$$ plain form
58181 408482686 418218868 413601841 396399509 369984725 338165971 304258882 270678216
58174 270678216 238976826 210049209 184292250 161721235 142109684 125134829 110462561
58167 110462561 97771771 86769388 77209102 68889417 61635211 55292345 49735371 44863624
58159 44863624 40586211 36818453 33489718 30542807 27924911 25587449 23493306 21614814
58151 21614814 19924447 18394742 17006105 15746465 14603360 13563038 12616226 11757282
58143 11757282 10977809 10267430 9620102 9033025 8499657 8010031 7557553 7139504 6751419
58134 6751419 6387360 6045790 5729193 5437504 5167137 4916305 4685638 4473299 4275055
58125 4275055 4089711 3919276 3763087 3616715 3477502 3346461 3223873 3107629 2996997
$$ packed form
58181D08482686R736182m617027j7202332k6414784l1818754l3907089l3580666
58174B70678216l1701390k8927617k5756959k2571015j9611551j6974855j4672268
58167A10462561j2690790j1002383r560286q319685p254206o342866n556974m871747
58159D4863624m277413l767758l328735k946911k617896k337462k094143j878492
58151B1614814j690367j529705j388637j259640j143105j040322r46812q58944
58143A1757282p79473p10379o47328n87077n33368m89626m52478m18049l88085
58134F751419l64059l41570l16597k91689k70367k50832k30667k12339j98244
58125D275055j85344j70435j56189j46372j39213j31041j22588j16244j10632
$$ plain form
58116 2996997 2893687 2797898 2707099 2619832 2537196 2459567 2385240 2313195 2244069 2177655 2112602
58105 2112602 2049175 1989254 1932963 1878234 1824163 1771891 1721905 1673561 1627619 1585976 1548357
58094 1548357 1512274 1476827 1443538 1412937 1383456 1354393 1326998 1301832 1277791 1254499 1232921
58083 1232921 1212965 1193159 1173306 1154766 1137411 1119106 1099027 1078821 1059687 1040933 1022234
58072 1022234 1004576 987895 970397 951420 932681 915572 899452 883667 869076 856372 844881
58061 844881 834119 824704 816743 809072 800904 792516 783758 773817 763016 752759 743125 732670 721296
58048 721296 710974 702725 695198 687250 679695 673312 667281 660891 654783 649178 642782 634868 626679 619420
58034 619420 612597 605658 599459 594515 589432 582719 574849 566955 558763 549402 539281 529647 521063 513456
$$ packed form
58116B996997j03310r5789r0799q7267q2636p7629p4327p2045o9126o6414o5053
58105B112602o3427n9921n6291n4729n4071n2272m9986m8344m5942m1643l7619
58094A548357l6083l5447l3289l0601k9481k9063k7395k5166k4041k3292k1578
58083A232921j9956j9806j9853j8540j7355j8305k0079k0206j9134j8754j8699
58072A022234j7658j6681j7498j8977j8739j7109j6120j5785j4591j2704j1491
58061H44881j0762r415p961p671q168q388q758r941j0801j0257r634j0455j1374
58048G21296j0322q249p527p948p555o383o031o390o108n605o396p914q189p259
58034F19420o823o939o199m944n083o713p870p894q192r361j0121r634q584p607
$$ plain form
58020 513456 506814 500804 494605 488106 482349 477906 473813 469021 463831 459055 454785 450907 447684 444924
58006 444924 441688 437778 434456 432646 431522 429835 427637 425696 424274 423510 423939 425446 426665 426606 426118
57991 426118 426605 428038 429343 430037 430341 430193 429238 427517 425374 423021 420671 418511 416101 412539 407801
57976 407801 403093 399308 396021 392595 389314 386657 384372 382109 380135 378640 377160 375559 374743 375477 377124
57961 377124 378408 378847 378748 378527 378727 379895 381605 382262 380790 377938 375205 373074 370968 368310 364899 360879
57945 360879 357018 354453 353518 353407 353435 353846 354914 356230 357619 359893 363853 369330 375849 383393 391744
57930 391744 399963 407315 413874 419420 422760 423102 421199 418123 413836 408093 401821 396169 390817 384630
57916 384630 377528 370480 363987 357881 352341 347827 344048 340146 336054 332781 331243 331422 332671 334227
$$ packed form
58020E13456o642o010o199o499n757m443m093m792n190m776m270l878l223k760
58006D44924l236l910l322j810j124j687k198j941j422p64M29J507J219n9m88
57991D26118M87J433J305O94L04j48r55j721k143k353k350k160k410l562m738
57976D07801m708l785l287l426l281k657k285k263j974j495j480j601q16P34J647
57961C77124J284M39r9k21K00J168J710O57j472k852k733k131k106k658l411m020
57945C60879l861k565r35j11K8M11J068J316J389K274L960N477O519P544Q351
57930C91744Q219P352O559N546L340L42j903l076m287n743o272n652n352o187
57916C84630p102p048o493o106n540m514l779l902m092l273j538J79J249J556
$$ plain form
57902 334227 335475 336197 336537 336482 335744 334428 333251 332677 332421 332298 332863 334617 337246 340338 344071 348453
57886 348453 352548 355422 357353 359255 361425 363673 366054 368508 370265 370635 370059 369431 368736 367267 364880
57871 364880 362083 359170 356208 353596 351679 349935 347421 343989 340320 336865 333503 330223 327463 325759
57857 325759 325484 326829 329614 333264 337279 341462 345513 348988 352005 355301 359106 362610 365070 366722
57843 366722 368063 369048 369698 370675 372396 374297 375751 376907 377828 377788 376518 375213 374997 375164 374298 372411
57827 372411 370556 368954 367147 365565 365157 365603 365526 364518 363420 362531 361094 358837 356587 354903 353310
57812 353310 351330 349185 346970 344026 339605 333536 326033 317552 308938 300986 293732 286850 280606 275581
57798 275581 271545 267675 263918 261120 259648 258876 258203 257652 257242 256683 255983 255514 255251 254750 254100 254103 255306
$$ packed form
57902C34227J248P22L40n5p38j316j177n74k56j23N65J754K629L092L733M382
57886C48453M095K874J931J902K170K248K381K454J757L70n76o28o95j469k387
57871C64880k797k913k962k612j917j744k514l432l669l455l362l280k760j704
57857C25759k75J345K785L650M015M183M051L475L017L296L805L504K460J652
57843C66722J341R85O50R77J721J901J454J156R21m0j270j305k16J67q66j887
57827C72411j855j602j807j582m08M46p7j008j098q89j437k257k250j684j593
57812C53310j980k145k215k944m421o069p503q481q614p952p254o882o244n025
57798B75581m036l870l757k798j472p72o73n51m10n59p00m69k63n01o50LJ203
$$ plain form
57781 255306 257578 260784 265092 270437 276355 282474 288492 293781 297948 301736 306279 311340 315358 317495
57767 317495 318552 319524 320328 320495 320172 319771 319313 318627 317636 316161 314127 312203 311446 311920 312500 312459 312483 313569
57749 313569 315645 317874 319708 321070 321934 322282 322173 321574 320488 319378 318867 318825 318357 317020 315383 314063
57733 314063 312882 311394 309689 308260 307574 308022 309717 311943 313417 313547 312991 312661 312773 313178 313925 314994
57717 314994 316019 316840 317927 319762 322154 324536 326601 328282 329482 330218 330709 331046 331056 330712 330252 329696
57701 329696 328685 327052 325089 323084 321095 319386 318434 318132 317578 316124 314136 312277 310461 307972 304282
57686 304282 299376 293677 288075 283694 281167 280259 280370 281187 282732 285229 289164 295102 303336 314123 328306
57671 328306 347038 370718 398936 431846 470909 517642 571868 631053 690271 742125 777897
$$ packed form
57781B55306K272L206M308N345N918O119O018N289M167L788M543N061M018K137
57767C17495J057R72Q04J67l23m01m58o86r91j475k034j924p57M74N80m1K4J086
57749C13569K076K229J834J362Q64L48j09n99j086j110n11m2m68j337j637j320
57733C14063j181j488j705j429o86M48J695K226J474J30n56l30J12M05P47J069
57717C14994J025Q21J087J835K392K382K065J681J200P36M91L37J0l44m60n56
57701C29696j011j633j963k005j989j709r52l02n54j454j988j859j816k489l690
57686C04282m906n699n602m381k527r08J11Q17J545K497L935N938Q234J0787J4183
57671C28306J8732K3680K8218L2910L9063M6733N4226N9185N9218N1854L5772
$$ plain form
57660 777897 790727 778895 746384 700611 649321 598322 550606 507027 467805 433334 403760
57649 403760 378578 357074 338806 323355 310072 298517 288780 280993 274843 269862 265809 262440 259356
57636 259356 256490 254368 253411 253277 253217 252829 252174 251468 250907 250502 249926 248961 248115 248088 248423 247518 244479 240233
57618 240233 236217 232753 229441 226447 224355 223087 221980 220831 220058 219844 219869 219836 219700 219352 218678 217999 217908
57601 217908 218512 219148 219024 217980 216576 215450 214526 212972 210239 207059 204783 203675 202582 200570 198057
57586 198057 195821 193700 191102 188262 185996 184453 182982 181187 179419 178168 177504 177082 176336 174812 172679
57571 172679 170751 169619 169022 168382 167547 166575 165293 163676 162248 161381 160603 159359 158099 157702 158063 158281
57555 158281 158175 158553 159765 161027 161665 162212 163645 166044 168607 170696 172322 173623 174349 174058 172771 171239
$$ packed form
57660G77897J2830j1832l2511m5773n1290n0999m7716m3579l9222l4471k9574
57649D03760k5182k1504j8268j5451j3283j1555r737p787o150m981m053l369l084
57636B59356k866k122r57j34o0l88o55p06n61m05n76r65q46k7L35r05l039m246
57618B40233m016l464l312k994k092j268j107j149p73k14K5l3j36l48o74o79r1
57601B17908O04O36j24j044j404j126r24j554k733l180k276j108j093k012k513
57586A98057k236k121k598k840k266j543j471j795j768j251o64m22p46j524k133
57571A72679j928j132n97o40q35r72j282j617j428q67p78j244j260l97L61K18
57555A58281j06L78J212J262O38N47J433K399K563K089J626J301P26k91j287j532
$$ plain form
57539 171239 170357 170294 170474 170487 170673 171519 172835 173917 174325 174068 173238 171875 170153 168306 166478 164884 163929
57522 163929 163800 164142 164505 164931 165754 167047 168658 170527 172516 174179 175234 176085 177329 178923 180396 181673
57506 181673 183020 184265 184761 184297 183435 182822 182560 182368 181948 181080 179713 178089 176530 175099 173617 171901
57490 171901 169795 167217 164505 162367 161070 159973 158398 156627 155414 154792 154195 153668 154035 155664 157796
57475 157796 159407 160192 160404 160188 159399 157831 155459 152591 149825 147645 146175 145462 145667 146601 147423 147426 146944
57458 146944 146856 147375 147974 148335 148555 148491 147775 146551 145420 144530 143510 142414 141844 141860 141648 140750 139860 139892 140839
57439 140839 142089 143307 144480 145521 146375 147186 147912 148119 147595 146817 146360 146169 145841 145353 144999 144838 144701
57422 144701 144657 145027 145896 146883 147489 147550 147365 147382 147669 147795 147468 147128 147472 148448 149298 149740 150401 151757 153200
$$ packed form
57539A71239q82o3J80J3J86Q46J316J082M08k57q30j363j722j847j828j594r55
57522A63929j29L42L63M26Q23J293J611J869J989J663J055Q51J244J594J473J277
57506A81673J347J245M96m64q62o13k62j92m20q68j367j624j559j431j482j716
57490A71901k106k578k712k138j297j097j575j771j213o22n97n27L67J629K132
57475A57796J611P85K12k16p89j568k372k868k766k180j470p13K05R34Q22Lm82
57458A46944q8N19N99L61K20o4p16j224j131q90j020j096n70J6k12q98q90L2R47
57439A40839J250J218J173J041Q54Q11P26K07n24p78m57j91l28m88l54j61j37
57422A44701m4L70Q69R87O06O1j85J7K87J26l27l40L44R76Q50M42O61J356J443
$$ plain form
57403 153200 153743 153269 152512 151983 151444 150477 149223 148435 148851 150394 152036 152748 152718 153201 155013 157568 159728
57386 159728 161178 162517 164310 166596 169206 172014 174814 177321 179408 181154 182682 184113 185613 187268
57372 187268 188938 190380 191393 191718 191025 189335 187315 185789 184893 184007 182600 180905 179640 179236 179481 179818
57356 179818 179815 179426 179009 179126 180151 181870 183587 184787 185640 186573 187467 187719 187182 186528 186362 186467 186324 185992
57338 185992 185825 185632 184879 183616 182513 181937 181688 181699 182258 183255 183938 183810 183200 182569 181803 180730 179910 180236
57320 180236 181860 183991 185715 186713 187244 187722 188296 188688 188525 187844 187021 186141 184853 183026 181182 179893
57304 179893 179069 178240 177293 176522 176086 175879 175947 176583 177884 179463 180701 181232 181181 181046 181341 182249 183599 185122
57286 185122 186686 188289 190043 192201 194974 198227 201541 204655 207703 210938 214399 217988 221653 225359
$$ packed form
57403A53200N43m74p57n29n39r67j254p88M16J543J642P12l0M83J812K555K160
57386A59728J450J339J793K286K610K808K800K507K087J746J528J431J500J655
57372A87268J670J442J013L25o93j690k020j526q96q86j407j695j265m04K45L37
57356A79818ll89m17J17J025J719J717J200Q53R33Q94K52n37o54j66J05j43l32
57338A85992j67j93p53j263j103n76k49J1N59R97O83j28o10o31p66j073q20L26
57320A80236J624K131J724R98N31M78N74L92j63o81q23q80j288j827j844j289
57304A79893q24q29r47p71m36k07O8O36J301J579J238N31n1j35K95R08J350J523
57286A85122J564J603J754K158K773L253L314L114L048L235L461L589L665L706
$$ plain form
57272 225359 229034 232664 236294 239783 242674 244462 245019 244760 244440 244695 245579 246610 247400 248121 249111 250245
57256 250245 251087 251637 252413 253746 255373 256872 258075 258946 259401 259392 258925 258004 256909 256475 257509 259776 262096
57239 262096 263651 264679 265710 266749 267584 268308 269039 269642 270233 271583 274301 277875 281091 283331 284976
57224 284976 286700 288867 291570 294758 298189 301547 304663 307523 310186 312880 315948 319399 322725 325510
57210 325510 328107 331305 335407 339941 344279 348222 351972 355835 360059 364808 370176 376200 382810 389782
57196 389782 396917 404266 411976 419881 427566 434966 442615 451125 460571 470503 480344 489731 498802 508210
57182 508210 518456 529087 538968 547531 555272 562872 570424 577859 585497 593551 601591 609116 616397 624189
57168 624189 632892 642566 653421 665606 678735 692335 706760 723029 741777 762890 786047 810971
$$ packed form
57272B25359L675L630L630L489K891J788N57k59l20K55Q84J031P90P21R90J134
57256B50245Q42N50P76J333J627J499J203Q71M55rm67r21j095m34J034K267K320
57239B62096J555J028J031J039Q35P24P31O03N91J350K718L574L216K240J645
57224B84976J724K167K703L188L431L358L116K860K663K694L068L451L326K785
57210C25510K597L198M102M534M338L943L750L863M224M749N368O024O610O972
57196C89782P135P349P710P905P685P400P649Q510R446R932R841R387R071R408
57182E08210J0246J0631R881Q563P741P600P552P435P638Q054Q040P525P281P792
57168F24189Q703R674J0855J2185J3129J3600J4425J6269J8748K1113K3157K4924
$$ plain form
57156 810971 837181 864220 892304 922115 953735 986373 1019498 1053709 1090023 1128569 1168412
57145 1168412 1208502 1248445 1288407 1328579 1368863 1408951 1448616 1487782 1526299 1563756 1599710
57134 1599710 1634121 1667452 1700329 1733148 1765936 1798420 1830215 1861073 1891137 1921065 1951957
57123 1951957 1985050 2021315 2061292 2105254 2153332 2205306 2260533 2318532 2379588 2444562 2514274
57112 2514274 2589489 2671258 2760555 2857634 2962534 3076444 3201969 3342056 3499637 3678792
57102 3678792 3885467 4126608 4409568 4743305 5139663 5612545 6175712 6841232 7618603
57093 7618603 8513797 9528884 10662860 11912222 13270096 14725119 16261160 17856048
57085 17856048 19478050 21083588 22620582 24035942 25281532 26316309 27107380 27632119
$$ packed form
57156H10971K6210K7039K8084K9811L1620L2638L3125L4211L6314L8546L9843
57145A168412M0090L9943L9962M0172M0284M0088L9665L9166L8517L7457L5954
57134A599710L4411L3331L2877L2819L2788L2484L1795L0858L0064K9928L0892
57123A951957L3093L6265L9977M3962M8078N1974N5227N7999O1056O4974O9712
57112B514274P5215Q1769Q9297R7079J04900J13910J25525J40087J57581J79155
57102C678792K06675K41141K82960L33737L96358M72882N63167O65520P77371
57093G618603Q95194J015087J133976J249362J357874J455023J536041J594888
57085A7856048J622002J605538J536994J415360J245590J034777P91071N24739
$$ plain form
57077 27632119 27880201 27854693 27572763 27064789 26369141 25523797 24560861 23507714 22391438
57068 22391438 21240740 20084090 18946706 17848324 16801899 15813526 14883986 14011037
57060 14011037 13191199 12420963 11698025 11022031 10394016 9814768 9283280 8795878 8346239
57051 8346239 7926450 7528880 7147725 6779326 6421600 6073439 5734364 5404235 5083001
57042 5083001 4770616 4467128 4173005 3889549 3618893 3363179 3123562 2900018 2691957
57033 2691957 2498821 2320397 2157090 2009925 1879954 1767703 1673508 1597975 1541119 1500499
57023 1500499 1470298 1442328 1408104 1361123 1299025 1224495 1143565 1062231 984290 911685 845593
57012 845593 786514 733904 686541 643290 603397 566418 532170 500553 471280 444039 418918
$$ packed form
57077B7632119K48082k5508k81930n07974o95648q45344r62936j053147j116276
57068B2391438j150698j156650j137384j098382j046425r88373r29540q72949
57060A4011037q19838p70236p22938o75994o28015n79248n31488m87402m49639
57051H346239m19789l97570l81155l68399l57726l48161l39075l30129l21234
57042E083001l12385l03488k94123k83456k70656k55714k39617k23544k08061
57033B691957j93136j78424j63307j47165j29971j12251r4195p5533n6856m0620
57023A500499l0201k7970l4224m6981o2098p4530q0930q1334p7941p2605o6092
57012H45593n9079n2610m7363m3251l9893l6979l4248l1617k9273k7241k5121
$$ plain form
57001 418918 396153 375304 355260 335312 315762 297168 279549 262697 246800 232276 219369
56990 219369 208370 199880 194379 191771 191811 194708 200787 209635 220005 230549 240351 248804 255274 259003
56976 259003 259328 256155 250267 243003 235566 228769 223232 219304 216767 215164 214605 215760 218905 223496 229013
56961 229013 235671 244020 254381 267026 282276 299820 318260 335795 350862 361707 366125 362745
56949 362745 352466 337895 321438 304516 288246 273711 261303 250531 241012 233251 228216 226432
56937 226432 227733 231602 237648 246012 257507 273178 293488 317821 344494 370933 393896 410061
56925 410061 416896 413387 400367 380398 356935 332958 310051 288695 269160 251772 236546 223089
56913 223089 211004 200146 190452 181815 174205 167642 161966 156836 152074 147848 144458 142020 140361 139138
$$ packed form
57001D18918k2765k0849k0044j9948j9550j8594j7619j6852j5897j4524j2907
56990B19369j0999q490n501k608M0K897O079Q848J0370J0544R802Q453O470L729
56976B59003L25l173n888p264p437o797n537l928k537j603n59J155L145M591N517
56961B29013O658Q349J0361J2645J5250J7544J8440J7535J5067J0845M418l380
56949C62745j0279j4571j6457j6922j6270j4535j2408j0772r519p761n035j784
56937B26432J301L869O046Q364J1495J5671K0310K4333K6673K6439K2963J6165
56925D10061O835l509j3020j9969k3463k3977k2907k1356j9535j7388j5226j3457
56913B23089j2085j0858r694q637p610o563n676n130m762m226l390k438j659j223
$$ plain form
56899 139138 138081 137260 137159 138355 141109 145332 150884 157793 166225 176373 188425 202563 218956 237653
56885 237653 258356 280230 301957 321912 338192 348817 352486 349414 341205 329863 317160 304855
56873 304855 294726 287743 283529 281189 280601 282524 287566 295648 306631 321100 340234 364992 395584
56860 395584 431724 473104 519107 567518 613520 650616 673318 679437 670316 649573 621774 591350
56848 591350 561569 534102 509738 489412 474293 465059 461640 463770 471560 485549 506588 535822
56836 535822 574473 623414 682885 752339 829842 910982 988282 1052220 1093854 1107723 1093511
56825 1093511 1055716 1001827 940023 877211 817824 763808 715731 674015 639165 611266 589963
56814 589963 575197 567605 568006 576752 593843 619428 653925 697579 749536 806596 862513 909161
$$ packed form
56899A39138j057q21j01J196K754M223N552O909Q432J0148J2052J4138J6393J8697
56885B37653K0703K1874K1727J9955J6280J0625L669l072q209j1342j2703j2305
56873C04855j0129o983m214k340n88J923N042Q082J0983J4469J9134K4758L0592
56860C95584L6140M1380M6003M8411M6002L7096K2702O119r121k0743k7799l0424
56848E91350k9781k7467k4364k0326j5119r234l419K130P790J3989K1039K9234
56836E35822L8651M8941N9471O9454P7503Q1140P7300O3938M1634J3869j4212
56825A093511l7795n3889o1804o2812n9387n4016m8077m1716l4850k7899k1303
56814E89963j4766p592M01Q746J7091K5585L4497M3654N1957N7060N5917M6648
$$ plain form
56802 909161 939254 948588 936427 904957 858940 804943 749400 696607 648459 605609 568318 536391
56790 536391 509207 486281 467668 453745 444826 441079 442707 450175 464221 485331 512742 543804
56778 543804 574292 599369 614674 617465 607484 586758 558278 524884 489253 454054 421233 391242
56766 391242 363565 338020 315062 294937 277146 260890 245695 231514 218616 207454 198265 190615
56754 190615 183574 176481 169438 162949 157260 152132 147194 142479 138559 135920 134194 132323 129706 126864
56740 126864 124676 123239 121920 120302 118574 117061 115936 115421 115813 117072 118700 120172 121247 121785 121529
56725 121529 120370 118753 117660 117960 119669 121884 123688 125084 126699 128546 129682 129478 128744 128932 130365
56710 130365 131919 132498 132233 132057 132549 133547 134633 135644 136677 137819 139017 140179 141283 142229 142741 142642
$$ packed form
56802I09161L0093R334j2161l1470m6017n3997n5543n2793m8148m2850l7291l1927
56790E36391k7184k2926j8613j3923q919l747J628P468J4046K1110K7411L1062
56778E43804L0488K5077J5305K791r981k0726k8480l3394l5631l5199l2821k9991
56766C91242k7677k5545k2958k0125j7791j6256j5195j4181j2898j1162r189p650
56754A90615p041p093p043o489n689n128m938m715l920k639j726j871k617k842
56740A26864k188j437j319j618j728j513j125n15L92J259J628J472J075N38k56
56725A21529j159j617j093L00J709K215J804J396J615J847J136k04p34J88J433
56710A30365J554N79k65j76M92R98J086J011J033J142J198J162J104R46N12r9
$$ plain form
56694 142642 142171 141726 141307 140593 139571 138618 137850 136946 135884 135307 135753 136959 138293 139445 140315 140756 140944
56677 140944 141618 143317 145686 148092 150513 153163 155560 156763 156471 155279 153900 152702 151862 151441 151342 151656
56661 151656 152827 154958 157236 158754 159708 161020 162894 164548 165419 165842 166379 167091 167693 167930 167640 166856
56645 166856 165923 165129 164356 163493 163007 163474 164679 165860 166722 167432 167704 166856 164963 163151 162398 162653 163311
56628 163311 163860 163872 163132 162125 161728 162007 161935 160717 158855 157473 157039 157165 157262 156942 156161 155326 155009 155250
56610 155250 155403 154912 153924 152903 152037 151293 150773 150605 150626 150455 149853 148961 148247 148159 148611 148962 148712 148082 147637
56591 147637 147588 147855 148509 149539 150480 151011 151729 153528 156243 158720 160209 160902 161153 161139 161344 162288 163567
56574 163567 164212 164305 165128 167220 169430 170622 171295 172652 174917 177573 180668 184803 190202 196661 204183
$$ packed form
56694A42642m71m45m19p14j022r53p68r04j062n77M46J206J334J152Q70M41J88
56677A40944O74J699K369K406K421K650K397J203k92j192j379j198q40m21r9L14
56661A51656J171K131K278J518R54J312J874J654Q71M23N37P12O02K37k90p84
56645A66856r33p94p73q63m86M67J205J181Q62P10K72q48j893j812p53K55O58
56628A63311N49J2p40j007l97K79p2j218j862j382m34J26R7l20p81q35l17K41
56610A55250J53m91r88j021q66p44n20j68K1j71o02q92p14q8M52L51k50o30m45
56591A47637m9K67O54J030R41N31P18J799K715K477J489O93K51j4K05R44J279
56574A63567O45R3Q23K092K210J192O73J357K265K656L095M135N399O459P522
$$ plain form
56559 204183 212894 222532 232644 243102 253748 263670 271434 276044 277473 276529 274500 272502 270702 268492
56545 268492 265725 263209 261521 259964 257494 254243 251251 248929 246638 243757 240484 237470 235148 233487
56531 233487 232032 230218 227966 225835 224314 223231 222227 221441 221177 221180 220862 220153 219505 219111 218706 218113 217395
56514 217395 216429 214917 213026 211509 210866 210681 210067 208615 206657 204721 202992 201371 199841 198562 197614
56499 197614 196919 196504 196565 196988 197115 196467 195527 195238 195775 196426 196680 196749 196827 196557 195646 194471 193689 193600 194176 195268
56479 195268 196509 197380 197653 197487 197039 196469 196344 197318 199173 200911 202046 203061 204265 205116 205224 205191 205686
56462 205686 206395 206673 206710 207182 208123 208923 209160 208852 208196 207614 207642 208199 208414 207785 207000 206942 207477 208027 208759 210127
56442 210127 211619 212144 211659 211395 212346 214264 216238 217549 217902 217490 217020 217185 218037 219179 220343 221345
$$ packed form
56559B04183Q711R638J0112J0458J0646R922P764M610J429r44k029j998j800k210
56545B68492k767k516j688j557k470l251k992k322k291k881l273l014k322j661
56531B33487j455j814k252k131j521j083j004p86k64Ll18p09o48l94m05n93p18
56514B17395r66j512j891j517o43j85o14j452j958j936j729j621j530j279r48
56499A97614o95m15O1M23J27o48r40k89N37O51K54O9P8k70r11j175p82q9N76J092
56479A95268J241Q71K73j66m48n70j25R74J855J738J135J015J204Q51J08l3M95
56462B05686P09K78L7M72R41Q00K37l08o56n82K8N57K15o29p85n8N35N50P32J368
56442B10127J492N25m85k64R51J918J974J311L53m12m70J65Q52J142J164J002
$$ plain form
56426 221345 221759 221261 220125 218846 217479 215948 214738 214525 215258 216284 217234 218135 218877 219366 220050 221479
56410 221479 223291 224516 224921 225275 226107 226990 227348 227318 227421 227872 228549 229364 230348 231495 232596 233210 232982 232216
56392 232216 231891 232739 234481 236260 237585 238494 239172 239897 241075 242766 244403 245470 246146 246804 247289 247321 247217
56375 247217 247441 247766 247697 247477 247775 248566 249233 249694 250463 251627 252667 253399 254208 255201 255944 256330 256970 258412
56357 258412 260461 262490 264034 265028 265903 267357 269562 271767 273220 274220 275513 276979 277889 278274 278955
56342 278955 280216 281513 282655 284128 285967 287421 288237 289282 291332 294129 297242 300960 305556 310332
56328 310332 314343 317659 321126 325112 329208 333058 336756 340330 343325 345192 345932 346189 346672 347496 348250
56313 348250 348750 349430 350686 352131 353023 353336 353867 355203 357136 359195 361323 363788 366770 370249 374175
$$ packed form
56426B21345M14m98j136j279j367j531j210k13P33J026R50R01P42M89O84J429
56410B21479J812J225M05L54Q32Q83L58l0J03M51O77Q15R84J147J101O14k28p66
56392B32216l25Q48J742J779J325R09O78P25J178J691J637J067O76O58M85L2j04
56375B47217K24L25o9k20K98P91O67M61P69J164J040P32Q09R93P43L86O40J442
56357B58412K049K029J544R94Q75J454K205K205J453J000J293J466R10L85O81
56342B78955J261J297J142J473J839J454Q16J045K050K797L113L718M596M776
56328C10332M011L316L467L986M096L850L698L574K995J867P40K57M83Q24P54
56313C48250N00O80J256J445Q92L13N31J336J933K059K128K465K982L479L926
$$ plain form
56298 374175 378571 383533 389068 394839 400248 404933 409018 412797 416500 420557 425584 431736 438463 445249
56284 445249 452169 459386 466722 474262 482682 492260 502163 511521 520699 530582 541165 551904 563078
56271 563078 575601 589772 605339 622599 642155 663604 685724 708201 732114 758502 787424
56260 787424 818734 852880 890620 932624 979629 1032439 1091670 1157966 1232338 1315807 1409005
56249 1409005 1512719 1628255 1756334 1896184 2046763 2208275 2381010 2563089 2750891
56240 2750891 2941475 3132846 3321811 3503365 3672612 3825713 3958597 4066417 4145113 4192506
56230 4192506 4207576 4190221 4142303 4067576 3969747 3851639 3716625 3569379 3414281 3254073
56220 3254073 3090784 2926893 2764933 2606931 2454933 2311005 2175999 2049256 1930171
$$ packed form
56298C74175M396M962N535N771N409M685M085L779L703M057N027O152O727O786
56284D45249O920P217P336P540Q420R578R903R358R178R883J0583J0739J1174
56271E63078J2523J4171J5567J7260J9556K1449K2120K2477K3913K6388K8922
56260G87424L1310L4146L7740M2004M7005N2810N9231O6296P4372Q3469R3198
56249A409005J03714J15536J28079J39850J50579J61512J72735J82079J87802
56240B750891J90584J91371J88965J81554J69247J53101J32884J07820P8696M7393
56230D192506J5070j7355m7918p4727r7829j18108j35014j47246j55098j60208
56220C254073j63289j63891j61960j58002j51998j43928j35006j26743j19085
$$ plain form
56211 1930171 1819162 1716567 1621697 1533656 1452128 1376713 1306541 1241242 1181242 1126477 1075865
56200 1075865 1028776 985947 948031 914240 883279 854760 828902 805670 785038 767254 752074
56189 752074 738457 725646 713740 702674 691781 681039 671640 664333 658213 652094 646152 641189 637156
56176 637156 633478 630121 627378 625145 623320 622275 622104 622061 621553 621102 621579 623084 625270 628063 631365 634696
56160 634696 637862 641398 645773 650811 656399 662920 670440 678331 686394 695538 706736 720068 735304
56147 735304 752557 771913 793409 817890 846886 881180 920556 965378 1016974 1075886 1141053
56136 1141053 1211272 1285758 1362322 1436671 1504903 1565661 1619071 1665257 1705197 1741492 1776503
56125 1776503 1810451 1842224 1870717 1894299 1910569 1918376 1919094 1914630 1905364 1891141 1872547 1849333
$$ packed form
56211A930171j11009j02595r4870q8041q1528p5415p0172o5299o0000n4765n0612
56200A075865m7089m2829l7916l3791l0961k8519k5858k3232k0632j7784j5180
56189G52074j3617j2811j1906j1066j0893j0742r399p307o120o119n942m963m033
56176F37156l678l357k743k233j825j045j71m3n08m51M77J505K186K793L302L331
56160F34696L166L536M375N038N588O521P520P891Q063R144J1198J3332J5236
56147G35304J7253J9356K1496K4481K8996L4294L9376M4822N1596N8912O5167
56136A141053P0219P4486P6564P4349O8232O0758N3410M6186L9940L6295L5011
56125A776503L3948L1773K8493K3582J6270P807P18m464r266j4223j8594k3214
$$ plain form
56113 1849333 1818887 1778342 1727491 1668226 1602368 1531991 1460853 1393240 1331587 1276536 1228535
56102 1228535 1187765 1153246 1123735 1099006 1078931 1062145 1047188 1034292 1024483 1017520 1012136 1007733
56090 1007733 1004484 1002408 1001532 1002203 1004181 1006394 1008670 1012410 1018353 1025199 1031870 1039434 1048919 1058877
56076 1058877 1067365 1075047 1083970 1094391 1105166 1116331 1128831 1142418 1156145 1170422 1186325 1203370
56064 1203370 1220066 1236239 1252882 1270215 1287787 1305874 1324902 1344052 1362300 1380170 1398783
56053 1398783 1417926 1436802 1455727 1475272 1494730 1513283 1531654 1550811 1570300 1589791 1610768
56042 1610768 1634433 1659309 1683290 1706714 1731077 1756258 1781637 1808503 1838452 1870662 1903508
56031 1903508 1937532 1974045 2012204 2050470 2089547 2130843 2173493 2216021 2259403 2305191 2352219
$$ packed form
56113A849333l0446m0545n0851n9265o5858p0377p1138o7613o1653n5051m8001
56102A228535m0770l4519k9511k4729k0075j6786j4957j2896r809o963n384m403
56090A007733l249k076q76O71J978K213K276L740N943O846O671P564R485R958
56076A058877Q488P682Q923J0421J0775J1165J2500J3587J3727J4277J5903J7045
56064A203370J6696J6173J6643J7333J7572J8087J9028J9150J8248J7870J8613
56053A398783J9143J8876J8925J9545J9458J8553J8371J9157J9489J9491K0977
56042A610768K3665K4876K3981K3424K4363K5181K5379K6866K9949L2210L2846
56031A903508L4024L6513L8159L8266L9077M1296M2650M2528M3382M5788M7028
$$ plain form
56020 2352219 2398682 2445766 2495514 2546901 2598191 2651565 2710859 2775931 2843756 2913872 2988103
56009 2988103 3066013 3145605 3227825 3315529 3408597 3504712 3604272 3709772 3821220 3937070 4058791
55998 4058791 4189302 4327759 4471278 4620910 4780286 4949250 5124908 5308234 5503407
55989 5503407 5711257 5929926 6161587 6411704 6681820 6969898 7277602 7610343 7970467
55980 7970467 8357752 8776287 9233134 9730582 10267930 10850664 11489414 12190470 12956865
55971 12956865 13798522 14731373 15767008 16914550 18193233 19632098 21258435 23100852
55963 23100852 25205648 27638339 30471736 33791027 37711989 42375150 47920086 54488072
55955 54488072 62258566 71471867 82430896 95524409 111252618 130173719 152784554
$$ packed form
56020B352219M6463M7084M9748N1387N1290N3374N9294O5072O7825P0116P4231
56009B988103P7910P9592Q2220Q7704R3068R6115R9560J05500J11448J15850J21721
55998D058791J30511J38457J43519J49632J59376J68964J75658J83326J95173
55989E503407K07850K18669K31661K50117K70116K88078L07704L32741L60124
55980G970467L87285M18535M56847M97448N37348N82734O38750P01056P66395
55971A2956865Q41657R32851J035635J147542J278683J438865J626337J842417
55963B3100852K104796K432691K833397L319291L920962M663161N544936O567986
55955E4488072P770494R213301J0959029J3093513J5728209J8921101K2610835
$$ plain form
55948 152784554 179452102 210366753 245257702 282759885 319852062 352048251 374565085
55941 374565085 383916275 379066832 361617138 335058995 303543838 270731553 239156777
55934 239156777 210199990 184404615 161814460 142200782 125216479 110506759 97756250
55927 97756250 86685320 77046799 68636829 61291630 54867708 49235054 44286711 39937653
55919 39937653 36109575 32726805 29727227 27064700 24697832 22585739 20695842 19005384
55911 19005384 17492321 16132414 14906342 13801198 12802987 11895077 11065676 10309625 9621033
55902 9621033 8990474 8410794 7879116 7391449 6941110 6524016 6140027 5787609 5462256
55893 5462256 5161306 4885302 4633375 4401945 4188864 3994231 3816395 3651798 3499538
$$ packed form
55948A52784554K6667548L0914651L4890949L7502183L7092177L2196189K2516834
55941C74565085R351190m849443j7449694k6558143l1515157l2812285l1574776
55934B39156777k8956787k5795375k2590155j9613678j6984303j4709720j2750509
55927I7756250j1070930r638521q409970p345199o423922n632654m948343m349058
55919C9937653l828078l382770k999578k662527k366868k112093j889897j690458
55911A9005384j513063j359907j226072j105144r98211r07910q29401p56051o88592
55902I621033o30559n79680n31678m87667m50339m17094l83989l52418l25353
55893E462256l00950k76004k51927k31430k13081j94633j77836j64597j52260
$$ plain form
55884 3499538 3361465 3236956 3122033 3014224 2913654 2818554 2724533 2629700 2536319 2446210
55874 2446210 2358564 2273392 2192859 2117622 2045433 1974748 1906407 1840724 1776411 1713495 1654030
55863 1654030 1598847 1546724 1497589 1453220 1413803 1377040 1341594 1308242 1276803 1245224 1212834
55852 1212834 1181376 1151808 1123010 1094561 1067597 1041919 1015400 987427 960001 934331 909331
55841 909331 884623 861936 842143 823732 805589 788555 772884 756946 740016 723833 709853
55830 709853 697260 685050 673743 663648 653789 643926 635329 628187 620513 611087 601244 592244 583058
55817 583058 572410 561028 550143 539560 528828 518731 510077 502395 495143 488849 483952 479909 476360
55804 476360 473744 472029 470527 469677 471050 474781 479016 482802 487278 492898 497821 500536 501934 503142
$$ packed form
55884C499538j38073j24509j14923j07809j00570r5100r4021r4833r3381r0109
55874B446210q7646q5172q0533p5237p2189p0685o8341o5683o4313o2916n9465
55863A654030n5183n2123m9135m4369l9417l6763l5446l3352l1439l1579l2390
55852A212834l1458k9568k8798k8449k6964k5678k6519k7973k7426k5670k5000
55841I09331k4708k2687j9793j8411j8143j7034j5671j5938j6930j6183j3980
55830G09853j2593j2210j1307j0095r859r863q597p142p674r426r843r000r186
55817E83058j0648j1382j0885j0583j0732j0097q654p682p252o294m897m043l549
55804D76360k616j715j502q50J373L731M235L786M476N620M923K715J398J208
$$ plain form
55790 503142 503351 501659 499210 497504 496048 493575 490289 487028 483383 478431 472426 466134 459348 451483
55776 451483 442828 434022 425287 417333 411939 410393 412344 417297 425869 438047 451183 461239 465402
55763 465402 462651 453120 438472 421947 406360 392340 379357 367499 357131 347797 338881 330662
55751 330662 323531 316866 309822 302548 295591 288860 282251 276516 272315 269016 265499 261621 257961 254840
55737 254840 252452 251248 251131 250888 249392 246797 243814 240565 236994 233619 230885 228395 225597 222519 219118
55722 219118 214788 209429 204148 199939 196420 192818 189475 187399 186966 187989 190390 193942 198004 202347
55708 202347 207561 213902 220428 225944 229984 232189 231772 228575 223778 218642 213286 207459 201503 195730
55694 195730 189829 183809 178498 174217 170095 165678 161953 159629 157698 155126 152775 152029 152555 153159 154013
$$ packed form
55790E03142K09j692k449j706j456k473l286l261l645m952o005o292o786p865
55776D51483q655q806q735p954n394j546J951M953Q572J2178J3136J0056M163
55763D65402k751r531j4648j6525j5587j4020j2983j1858j0368r334q916q219
55751C30662p131o665p044p274o957o731o609n735m201l299l517l878l660l121
55737B54840k388j204j17k43j496k595k983l249l571l375k734k490k798l078l401
55722B19118m330n359n281m209l519l602l343k076m33J023K401L552M062M343
55708B02347N214O341O526N516M040K205m17l197m797n136n356n827n956n773
55694A95730n901o020n311m281m122m417l725k324j931k572k351p46N26O04Q54
$$ plain form
55679 154013 156236 159801 163590 167107 170533 173462 175125 175620 175491 174428 171824 168364 165609 164126 163306
55664 163306 162753 162541 162325 161595 160721 160532 160951 161234 161401 162243 164070 166551 169550 172988 176162 178486 180646
55647 180646 183739 187392 190083 191145 191143 190409 188703 186393 184439 182894 180680 177157 172801 168057 162650
55632 162650 156465 150122 144352 139510 135848 133460 131937 130860 130581 131499 132697 132528 130721 128704 127564
55617 127564 126791 125444 123487 121389 119299 117209 115278 113459 111335 108775 106302 104507 103456 102887 102631
55602 102631 102653 102985 103625 104244 104225 103345 102136 101047 99685 97556 95171 93472 92463 91411 90239 89633
55586 89633 89741 89852 89593 89506 90150 91395 92849 94370 95921 97481 99183 101039 102716 104188 106364 110135
55570 110135 114997 119586 123530 127686 132459 136997 140338 142360 143321 143411 143098 142981 142843 141634 138862 135252
$$ packed form
55679A54013K223L565L789L517L426K929J663M95j29j063k604l460k755j483q20
55664A63306n53k12k16p30q74j89M19K83J67Q42J827K481K999L438L174K324K160
55647A80646L093L653K691J062kp34j706k310j954j545k214l523m356m744n407
55632A62650o185o343n770m842l662k388j523j077k79R18J198j69j807k017j140
55617A27564p73j347j957k098k090k090j931j819k124k560k473j795j051n69k56
55602A02631K2L32O40O19j9q80j209j089j362k129k385j699j009j052j172o06
55586H9633J08J11k59q7O44J245J454J521J551J560J702J856J677J472K176L771
55570A10135M862M589L944M156M773M538L341K022R61R0l13j17j38j209k772l610
$$ plain form
55554 135252 131607 127755 123166 118021 113103 109031 105971 103740 101913 100122 98508 97468 96944 96470 96017
55539 96017 96172 97254 98706 99652 99717 99162 98570 98443 98755 98963 98783 98653 98906 98922 97952 96533 95973 96456 96690
55520 96690 95666 93721 91603 89499 87447 85815 84691 83474 81621 79363 77290 75700 74706 74419 74630
55505 74630 74697 74161 73198 72293 71724 71475 71273 70737 69904 69490 70078 71180 71809 71844 71956 72238 71940 70811 69734
55486 69734 69555 70087 70644 70899 70862 70660 70666 71237 72065 72447 72362 72524 73192 73808 74101 74553 75331 75705 75119 74037
55466 74037 73071 72049 70655 69303 68609 68479 68375 68069 67625 67123 66885 67439 68714 69785 69998 69822 70040
55449 70040 70565 70696 70109 69011 67684 66417 65580 65324 65494 66061 67150 68324 68585 67587 66256 65615 65575
55432 65575 65494 65263 65173 65228 65332 65676 66232 66343 65592 64683 64636 65438 66311 67009 67995 69487 71106 72456 73431
$$ packed form
55554A35252l645l852m589n145m918m072l060k231j827j791j614j040n24m74m53
55539I6017J55J082J452R46O5n55n92j27L12K08j80j30K53J6r70j419n60M83K34
55520I6690j024j945k118k104k052j632j124j217j853k258k073j590r94k87K11
55505G4630O7n36r63r05n69k49k02n36q33m14N88J102O29L5J12K82k98j129j077
55486F9734j79N32N57K55l7k02ON71Q28L82q5J62O68O16K93M52P78L74n86j082
55466G4037r66j022j394j352o94j30j04l06m44n02k38N54J275J071K13j76K18
55449G0040N25J31n87j098j327j267q37k56J70N67J089J174K61r98j331o41m0
55432F5575q1k31r0N5J04L44N56J11p51r09m7Q02Q73O98R86J492J619J350R75
$$ plain form
55413 73431 74012 74276 74490 74752 74781 74531 74620 75540 76826 77666 77967 78080 77847 76876 75555 74771 74592 74098 72657
55394 72657 70584 68440 66451 64842 64046 64240 65139 66467 68176 70064 71668 72673 73034 72634 71378 69736
55378 69736 68670 68703 69415 70050 70236 70026 69664 69491 69638 69619 68664 66792 65090 64573 65072 65649 65840 65974 66409
55359 66409 67102 68026 69465 71497 73472 74509 74438 73823 73031 71826 70126 68632 68159 68627 69312 69907 70610
55342 70610 71224 71083 70149 69447 69867 71097 72270 73198 74367 76002 77725 78952 79172 78057 75835 73486
55326 73486 72106 72051 72907 74056 74919 74925 73837 72090 70455 69402 69033 69368 70230 71035 71218 70878 70585 70636
55308 70636 70863 71113 71406 71640 71522 70919 69968 68877 67920 67533 67953 68723 68973 68353 67433 67099 67790 69330
55290 69330 71195 72819 73840 74193 73927 73096 71991 71305 71624 72741 73756 73985 73518 72907 72559 72587 72970
$$ packed form
55413G3431N81K64K14K62K9k50Q9R20J286Q40L01J13k33r71j321p84j79m94j441
55394G2657k073k144j989j609p96J94Q99J328J709J888J604J005L61m00j256j642
55378F9736j066L3P12O35J86k10l62j73J47j9r55j872j702n17M99N77J91J34M35
55359F6409O93R24J439K032J975J037p1o15p92j205j700j494m73M68O85N95P03
55342G0610O14j41r34p02M20J230J173R28J169J635J723J227K20j115k222k349
55326G3486j380n5Q56J149Q63Oj088j747j635j053l69L35Q62Q05J83l40k93N1
55308G0636K27K50K93K34j18o03r51j091r57l87M20P70K50o20r20l34O91J540
55290F9330J865J624J021L53k66q31j105o86L19J117J015K29m67o11l48K8L83
$$ plain form
55273 72970 73604 74206 74321 73599 72187 70797 70212 70663 71754 72995 74168 75189 75975 76616 77387 78322 78981
55256 78981 78898 78099 76990 75953 75217 74901 74930 74995 74838 74447 73949 73473 73187 73124 72937 72227 71218 70648 70795
55237 70795 71194 71572 72364 73749 74834 74592 73318 72394 72689 73792 74663 74509 73165 71231 69767 69356 69557
55220 69557 69677 69812 70519 71760 72891 73618 74168 74526 74324 73655 73265 73625 74420 75258 76314 77800 79206
55203 79206 79622 78743 77271 76291 76370 77199 78041 78462 78568 78578 78502 78408 78677 79605 80945 82151 82939 83320 83371 83325
55183 83325 83573 84159 84519 84213 83576 83126 82686 81819 80830 80455 80657 80664 80270 80221 81053 82356 83441 84065 84151 83534
55163 83534 82424 81623 81802 82904 84461 86074 87320 87756 87426 86955 86794 86726 86386 85901 85642 85724 86081 86761
55145 86761 87728 88585 88845 88363 87312 85919 84418 83107 82272 82136 82813 84071 85191 85484 85012 84473 84355
$$ packed form
55273G2970O34O02J15p22j412j390n85M51J091J241J173J021P86O41P71R35O59
55256G8981q3p99j109j037p36l16K9O5j57l91m98m76k86o3j87p10j009n70J47
55237G0795L99L78P92J385J085k42j274r24K95J103Q71j54j344j934j464m11K01
55220F9557J20J35P07J241J131P27N50L58k02o69l90L60P95Q38J056J486J406
55203G9206M16q79j472r80P9Q29Q42M21J06J0p6r4K69R28J340J206P88L81N1m6
55183H3325K48N86L60l06o37m50m40q67r89l75K02Pl94m9Q32J303J085O24Q6o17
55163H3534j110q01J79J102J557J613J246M36l30m71j61o8l40m85k59Q2L57O80
55145H6761R67Q57K60m82j051j393j501j311q35j36O77J258J120K93m72n39j18
$$ plain form
55128 84355 84590 84988 85413 85432 84489 82705 80984 79980 79498 79187 79273 80104 81481 82948 84355 85651 86555
55111 86555 87022 87669 89035 90583 91184 90615 89925 90097 90890 91373 91290 91406 92424 93939 94799 94476 93583 92864
55093 92864 92120 90716 88800 87262 86534 86316 86627 88150 90963 93770 95181 95266 95109 95209 95232 95072 95216
55076 95216 95879 96517 96503 95850 95089 94747 95068 95926 96883 97580 98168 99143 100686 102400 103698 104230 103918 102853
55058 102853 101333 99849 98862 98501 98519 98565 98547 98671 99025 99224 98804 97941 97389 97543 97981 98161 98115 98082 97863 97119
55038 97119 96115 95516 95487 95491 95080 94396 93794 93411 93313 93699 94576 95463 95734 95269 94547 94073 93874 93656 93373 93341
55018 93341 93651 93685 92618 90464 88293 87247 87600 88903 90591 92098 92781 92326 91252 90507 90503 90886 91292
55001 91292 91910 93137 94950 96880 98470 99565 100177 100219 99540 98291 97204 97174 98371 99958 100998 101448
$$ packed form
55128H4355K35L98M25J9r43j784j721j004m82l11Q6Q31J377J467J407J296R04
55111H6555M67O47J366J548O01n69o90J72P93M83q3J16J018J515Q60l23q93p19
55093I2864p44j404j916j538p28k18L11J523K813K807J411Q5j57J00K3j60J44
55076I5216O63O38j4o53p61l42L21Q58R57O97N88R75J543J714J298N32l12j065
55058A02853j520j484r87l61J8M6j8J24L54J99m20q63n52J54M38J80m6l3k19p44
55038I7119j004n99k9Mm11o84o02l83r8L86Q77Q87K71m65p22m74j99k18k83l2
55018I3341L10L4j067k154k171j046L53J303J688J507O83m55j074p45mL83M06
55001I1292O18J227J813J930J590J095O12M2o79j249j087l0J197J587J040M50
$$ plain form
54985 101448 101925 102593 102819 102093 100808 99822 99463 99332 98948 98257 97482 96800 96338 96287 96817 97895 99300 100834
54967 100834 102380 103764 104694 105008 104971 105193 106075 107297 107975 107553 106615 106498 107814 109516 109903 108583 106911
54950 106911 106266 106513 106625 106262 105919 105732 105163 103992 102864 102408 102434 102402 102188 101871 101200 99869 98175 96921
54932 96921 96656 97303 98435 99648 100743 101787 102970 104294 105557 106788 108445 110957 114305 118292 122939
54917 122939 128294 134057 139778 145274 150501 155178 158995 162084 164841 167160 168205 167115 163781 158932
54903 158932 153626 148641 144101 139592 134823 130139 126281 123652 122015 120906 120145 119834 119976 120254 120248 119830
54887 119830 119217 118629 118073 117645 117764 118726 120127 121243 121984 122937 124390 125998 127653 129981 133424 137378
54871 137378 140943 144145 147725 151936 156245 160052 163011 164699 164707 163195 160839 158091 154910 151237 147275
$$ packed form
54985A01448M77O68K26p26j285r86l59j31l84o91p75o82m62n1N30J078J405J534
54967A00834J546J384R30L14l7K22Q82J222O78m22r38j17J316J702L87j320j672
54950A06911o45K47J12l63l43j87n69j171j128m56K6l2k14l17o71j331j694j254
54932I6921k65O47J132J213J095J044J183J324J263J231J657K512L348L987M647
54917A22939N355N763N721N496N227M677L817L089K757K319J045j090l334m849
54903A58932n306m985m540m509m769m684l858k629j637j109p61l11J42K78om18
54887A19830o13n88n56m28J19R62J401J116P41R53J453J608J655K328L443L954
54871A37378L565L202L580M211M309L807K959J688Qj512k356k748l181l673l962
$$ plain form
54856 147275 143261 139441 136268 134070 132425 130406 127592 124391 121220 117973 114536 111306 108816 107230
54842 107230 106506 106641 107361 107866 107413 106065 104601 103729 103583 103835 104115 104372 104908 105933 107108 107804 107834 107542
54824 107542 107105 106270 105016 103962 103577 103383 102556 101143 100101 100156 101131 102427 103632 104557 105183 105836 107059
54807 107059 108931 110766 111782 111920 111754 111729 111782 111634 111110 110143 108802 107443 106575 106379 106497 106474 106240 105988
54789 105988 105774 105548 105491 105985 107238 109101 111229 113103 114006 113496 112129 111254 111761 113255 114744 115794
54773 115794 116647 117494 118190 118668 119194 120130 121723 124111 127236 130824 134684 139031 144183 150049 156252 162651
54757 162651 169210 175313 179781 181867 181857 180407 177646 173351 167803 161966 156734 152218 147901 143424 139127
54742 139127 135787 133774 132585 131368 129827 128384 127470 127034 126812 126722 126672 126326 125469 124530 124292 124972 125894
$$ packed form
54856A47275m014l820l173k198j645k019k814l201l171l247l437l230k490j586
54842A07230p24J35P20N05m53j348j464q72j46K52K80K57N36J025J175O96L0k92
54824A07542m37q35j254j054l85j94q27j413j042N5R75J296J205R25O26O53J223
54807A07059J872J835J016J38j66k5N3j48n24r67j341j359q68j96J18k3k34k52
54789A05988k14k26n7M94J253J863K128J874R03n10j367q75N07J494J489J050
54773A15794Q53Q47O96M78N26R36J593K388L125L588L860M347N152N866O203O399
54757A62651O559O103M468K086j0j450k761m295n548n837n232m516m317m477m297
54742A39127l340k013j189j217j541j443r14m36k22r0n0l46q57r39k38O80R22
$$ plain form
54725 125894 126302 126306 126776 128375 131014 134296 138170 142817 148070 153410 158567 163656 168492 172153 173720
54710 173720 173239 171541 169159 165827 161088 155077 148586 142589 137794 134411 132237 130995 130507 130461 130214
54695 130214 129161 127228 124715 121838 118817 116299 115069 115188 115833 116206 116174 115889 115248 114083 112551 110983
54679 110983 109558 108428 107956 108411 109457 110239 110071 109008 107760 107080 107128 107402 107430 107401 107849 108776 109519 109635
54661 109635 109482 109767 110834 112529 114350 115477 115183 113671 112129 111502 111493 111226 110532 109974 109874 110073 110529
54644 110529 111344 112113 112097 111385 111136 112113 113474 113699 112450 110791 109710 109099 108425 107795 107848 108835 110231 111293
54626 111293 111700 111619 111464 111697 112641 114201 115808 116887 117360 117538 117542 117129 116216 115309 115081 115591 116192 116250 115777
54607 115777 115270 115076 115053 114879 114566 114586 115367 116692 117730 117771 116896 115821 115170 115021 115140 115384 115700 115822 115277
$$ packed form
54725A25894M08MM70J599K639L282L874M647N253N340N157N089M836L661J567
54710A73720m81j698k382l332m739o011o491n997m795l383k174j242m88m6k47
54695A30214j053j933k513k877l021k518j230J19O45L73l2k85o41j165j532j568
54679A10983j425j130m72M55J046P82j68j063j248o80M8K74K8k9M48R27P43J16
54661A09635j53K85J067J695J821J127k94j512j542o27rk67o94n58j00J99M56
54644A10529Q15P69j6p12k49R77J361K25j249j659j081o11o74o30N3R87J396J062
54626A11293M07q1j55K33R44J560J607J079M73J78Mm13r13r07k28N10O01N8m73
54607A15777n07j94k3j74l13K0P81J325J038M1q75j075o51j49J19K44L16J22n45
$$ plain form
54588 115277 113845 111955 110493 110162 110988 112391 113624 114216 114140 113736 113397 113305 113410 113631 113995 114528 115086 115376
54570 115376 115185 114705 114618 115621 117581 119272 119372 117837 115933 114789 114361 114053 113855 114305 115589 117248
54554 117248 118698 119525 119365 118116 116449 115571 116220 118084 120285 122118 123338 124132 124963 126097 127190 127643
54538 127643 127392 126936 126573 126168 125774 125840 126436 126856 126428 125344 124288 123658 123521 123838 124215 123894 122643 121336
54520 121336 120976 121382 121547 121107 120606 120371 119984 119114 118146 117595 117424 117302 117134 116959 116664 116166 115698 115563 115742
54501 115742 115942 115966 115883 115966 116462 117258 117822 117747 117306 117070 116991 116449 115383 114743 115375 116960 118565 119807 120784
54482 120784 121259 120828 119915 119668 120607 122023 123077 123912 125156 126809 128215 128934 129084 128938 128657 128433 128450
54465 128450 128651 128849 129123 129755 130683 131448 131783 131978 132452 133244 134104 134802 135103 134740 133780 132912 132969 134131 135770
$$ packed form
54588A15277j432j890j462l31Q26J403J233N92p6m04l39r2J05K21L64N33N58K90
54570A15376j91m80q7J003J960J691J00j535j904j144m28l08j98M50J284J659
54554A17248J450Q27j60j249j667q78O49J864K201J833J220P94Q31J134J093M53
54538A27643k51m56l63m05l94O6N96M20m28j084j056o30j37L17L77l21j251j307
54520A21336l60M06J65m40n01k35l87q70r68n51j71j22j68j75k95m98m68j35J79
54501A15742K00K4q3Q3M96P96N64p5m41k36p9n42j066o40O32J585J605J242R77
54482A20784M75m31r13k47R39J416J054Q35J244J653J406P19J50j46k81k24J7
54465A28450K01J98K74O32R28P65L35J95M74P92Q60O98L01l63r60q68N7J162J639
$$ plain form
54446 135770 137069 137624 137506 136971 136216 135325 134409 133741 133593 133895 134267 134522 134862 135409 135810 135647 135011 134256
54428 134256 133380 132188 131040 130875 132241 134585 136705 137702 137478 136580 135726 135319 135301 135490 135837 136238 136318 135862
54410 135862 135236 134936 134864 134662 134663 135703 137860 140111 141576 142399 143012 143232 142725 141839 141262 141157 141241 141464 141957
54391 141957 142497 142683 142559 142551 142828 143262 143937 145087 146404 146940 145968 143750 141376 140032 140295 141778 143484
54374 143484 144765 145869 147250 148660 149483 149869 150818 152956 155843 158764 161697 165093 169047 173126 176872
54359 176872 180142 183096 186019 188985 191423 192259 190876 187895 184681 182041 179660 176887 173696 170557
54345 170557 167581 164350 160759 157604 155816 155272 154862 153820 152417 151133 149802 148147 146705 146349 146910
54330 146910 147063 145905 144085 142977 143133 143953 144667 145114 145535 145980 146143 145718 144809 143980 143875 144718 146122
$$ packed form
54446A35770J299N55j18n35p55q91r16o68j48L02L72K55L40N47M01j63o36p55
54428A34256q76j192j148j65J366K344K120R97k24q98q54m07j8J89L47M01Q0m56
54410A35862o26l00p2k02JJ040K157K251J465Q23O13K20n07q86n77j05Q4K23M93
54391A41957N40J86j24qK77M34O75J150J317N36r72k218k374j344K63J483J706
54374A43484J281J104J381J410Q23L86R49K138K887K921K933L396L954M079L746
54359A76872L270K954K923K966K438Q36j383k981l214k640k381k773l191l139
54345A70557k976l231l591l155j788n44m10j042j403j284j331j655j442l56N61
54330A46910J53j158j820j108J56Q20P14M47M21M45J63m25r09q29j05Q43J404
$$ plain form
54313 146122 147412 148140 148297 148094 147579 146572 144998 143170 141576 140433 139637 139084 138774 138537 137995 137019 135988
54296 135988 135335 135042 134786 134388 133844 133151 132497 132464 133589 135631 137618 138719 138867 138513 138066 137707 137562 137845
54278 137845 138747 140194 141720 142751 143067 142924 142728 142778 143330 144525 146077 147324 147872 147948 147919 147776 147432 147146
54260 147146 147262 147761 148497 149590 151098 152547 153376 153729 154258 155257 156498 157796 159093 160062 160249 159716 159021
54243 159021 158530 158235 158095 157998 157492 156292 154989 154448 154471 153953 152510 151000 150145 149655 149144 148954 149327 149625
54225 149625 149262 148765 148966 149636 149885 149603 149488 149844 150283 150664 151371 152398 152889 151986 149751 147022 144696
54208 144696 143263 142667 142387 141897 141203 140798 141049 141817 142665 143249 143522 143776 144434 145550 146541 146682 145902 144899
54190 144899 144455 144813 145682 146636 147403 147936 148249 148228 147759 147075 146742 147155 148217 149695 151559 153691 155536
$$ packed form
54313A46122J290P28J57k03n15j007j574j828j594j143p96n53l10k37n42r76j031
54296A35988o53k93k56l98n44o93o54l3J125K042J987J101J48l54m47l59j45K83
54278A37845R02J447J526J031L16j43j96N0N52J195J552J247N48P6k9j43l44k86
54260A47146J16M99P36J093J508J449Q29L53N29R99J241J298J297R69J87n33o95
54243A59021m91k95j40r7n06j200j303n41K3n18j443j510q55m90n11j90L73K98
54225A49625l63m97K01O70K49k82j15L56M39L81P07J027M91r03k235k729k326
54208A44696j433n96k80m90o94m05K51P68Q48N84K73K54O58J116R91J41p80j003
54190A44899m44L58Q69R54P67N33L13k1m69o84l33M13J062J478J864K132J845
$$ plain form
54173 155536 156522 156735 156780 157003 157200 157040 156439 155520 154566 154022 154207 154887 155459 155621 155642 155841 156066 155883 155190
54154 155190 154467 154359 154998 155787 155945 155314 154470 154007 153998 154259 154792 155607 156396 156790 156830 156784 156623 156121 155417 154952
54134 154952 154799 154515 153869 153266 153238 153810 154645 155511 156346 157074 157656 158246 158993 159736 160140 160168 160198 160550 161068 161351
54114 161351 161349 161489 162110 163010 163829 164698 166076 167903 169427 170091 170193 170304 170435 170285 170110 170727 172637 175600
54096 175600 179083 182689 186124 189259 192425 196193 200505 204241 205919 204776 201204 196470 192152 189405
54082 189405 188296 187804 186748 184779 182494 180709 179732 179262 178852 178487 178661 179771 181529 183195 184399 185405
54066 185405 186514 187590 188450 189441 191171 193676 196220 198030 199017 199629 200175 200509 200377 199851 199185 198343 196967
54049 196967 194978 193002 191873 191785 192183 192553 193042 194212 196412 199563 203377 207563 211921 216394 221117
$$ packed form
54173A55536R86K13M5K23J97j60o01r19r54n44J85O80N72J62K1J99K25j83o93
54154A55190p23j08O39P89J58o31q44m63rK61N33Q15P89L94M0m6j61n02p04m65
54134A54952j53k84o46o03k8N72Q35Q66Q35P28N82N90P47P43M04K8L0L52N18K83
54114A61351kJ40O21R00Q19Q69J378J827J524O64J02J11J31j50j75O17J910K963
54096A75600L483L606L435L135L166L768M312L736J678j143l572m734m318k747
54082A89405j109m92j056j969k285j785r77m70m10l65J74J110J758J666J204J006
54066A85405J109J076Q60R91J730K505K544J810R87O12N46L34j32n26o66q42j376
54049A96967j989j976j129q8L98L70M89J170K200L151L814M186M358M473M723
$$ plain form
54034 221117 226313 232119 238486 245144 251665 257675 263091 268090 272741 276746 279673 281474 282648 283803
54020 283803 285034 285848 285787 285055 284355 284135 284136 283760 282628 280680 277952 274541 270686 266643 262472 258080 253410
54003 253410 248461 243250 238036 233467 230197 228317 227317 226502 225245 223051 219891 216532 214113 213154 213218
53988 213218 213575 213814 213720 213002 211534 209596 207599 205729 204097 202989 202589 202583 202454 202096 201843 201849 201773 201193 200129
53969 200129 199062 198597 199142 200703 202833 204935 206815 208885 211697 215366 219612 224318 229811 236512 244560
53954 244560 253958 264838 277055 289417 299726 306024 307867 306277 302598 297581 291482 284707 278183
53941 278183 273082 270095 268889 268414 267886 267407 267547 268566 270264 272351 274517 276276 277232 277613 278120 279182
53925 279182 280727 282768 285708 289762 294393 298717 302387 305870 310009 315397 321954 328969 335778 342499
$$ packed form
54034B21117N196N806O367O658O521O010N416M999M651M005K927J801J174J155
54020B83803J231Q14o1p32p00k20Jl76j132j948k728l411l855m043m171m392m670
54003B53410m949n211n214m569l270j880j000q15j257k194l160l359k419r59O4
53988B13218L57K39r4p18j468j938j997j870j632j108m00oj29l58k53Op6n80j064
53969B00129j067m65N45J561K130K102J880K070K812L669M246M706N493O701Q048
53954B44560R398J0880J2217J2362J0309O298J843j590l679n017o099o775o524
53941B78183n101k987j206m75n28m79J40J019J698K087K166J759R56L81N07J062
53925B79182J545K041K940M054M631M324L670L483M139N388O557P015O809O721
$$ plain form
53911 342499 349793 357768 365558 372257 377826 382597 386302 388268 388427 387515 386243 384857 383515 382423 381380
53896 381380 379768 377361 374692 372168 369226 364871 358895 352065 345129 338123 330781 323214 315921 309313
53882 309313 303444 298136 293156 288270 283289 278224 273447 269553 266835 264816 262486 259224 255422 251978
53868 251978 249241 246694 243696 240246 236857 233950 231634 229899 228675 227697 226554 224976 222912 220401
53854 220401 217567 214758 212407 210607 209018 207347 205782 204800 204632 205044 205528 205567 204795 203148 200970 198891
53838 198891 197512 197032 197095 197059 196638 196245 196472 197264 197941 198112 198205 198853 200071 201345 202326 203116 204056 205510
53820 205510 207626 209966 211591 211939 211531 211422 212100 213325 214871 216808 219045 221240 223300 225488 227836
53805 227836 230012 232004 234419 237733 241651 245614 249601 254002 258972 264296 269689 274802 279099 282173
$$ packed form
53911C42499P294P975P790O699N569M771L705J966J59r12j272j386j342j092j043
53896C81380j612k407k669k524k942m355n976o830o936p006p342p567p293o608
53882C09313n869n308m980m886m981n065m777l894k718k019k330l262l802l444
53868B51978k737k547k998l450l389k907k316j735j224r78j143j578k064k511
53854B20401k834k809k351j800j589j671j565r82j68M12M84L9p72j647k178k079
53838A98891j379m80O3l6m21l93K27P92O77J71R3O48J218J274R81P90R40J454
53820B05510K116K340J625L48m08j09O78J225J546J937K237K195K060K188K348
53805B27836K176J992K415L314L918L963L987M401M970N324N393N113M297L074
$$ plain form
53791 282173 284212 285893 287789 290033 292410 294512 295989 296915 297797 298917 299755 299415 297571 294716 291527
53776 291527 288302 285016 281584 277944 274067 270026 265961 261990 258243 254902 252030 249406 246718 243892
53762 243892 241045 238199 235267 232351 229759 227697 226067 224603 223064 221326 219466 217786 216520 215494
53748 215494 214279 212694 211031 209733 209049 209003 209429 209955 210205 210217 210486 211413 212788 213966 214491 214444 214233 214213
53730 214213 214501 215036 215725 216536 217442 218309 218927 219209 219392 219996 221558 224268 227711 230996 233338 234660 235586
53713 235586 236771 238273 239633 240456 240785 240991 241591 243162 246156 250427 255036 258832 261377 263221 265241
53698 265241 267866 270951 274135 277142 279868 282395 284910 287475 289981 292372 294645 296485 297269 296843 296045
53683 296045 295878 296209 295875 294209 291912 290199 289527 289398 289022 287826 285728 283269 281259 279999 279137 278469
$$ packed form
53791B82173K039J681J896K244K377K102J477R26Q82J120Q38l40j844k855l189
53776B91527l225l286l432l640l877m041m065l971l747l341k872k624k688k826
53762B43892k847k846k932k916k592k062j630j464j539j738j860j680j266j026
53748B15494j215j585j663j298o84m6M26N26K50J2K69R27J375J178N25m7k11k0
53730B14213K88N35O89Q11R06Q67O18K82J83O04J562K710L443L285K342J322R26
53713B35586J185J502J360Q23L29K06O00J571K994M271M609L796K545J844K020
53698B65241K625L085L184L007K726K527K515K565K506K391K273J840P84m26p98
53683B96045j67L31l34j666k297j713o72j29l76j196k098k459k010j260q62o68
$$ plain form
53667 278469 278365 278973 279514 279076 277890 277060 277087 277390 277366 277170 277175 277234 276962 276420 276098 276321 276954 277621 278044 278245
53647 278245 278517 279164 280218 281504 282890 284274 285446 286262 286962 287960 289229 290299 291072 292279 294773 298531
53631 298531 302625 306128 308825 311105 313415 315916 318529 321182 323920 326762 329683 332896 336986 342335
53617 342335 348399 353900 357976 360882 363472 366273 369302 372507 375993 379832 383907 387976 391790 395184
53603 395184 398189 401044 404019 407177 410247 412638 413763 413639 413125 413205 413931 414398 413919 412851 412000 411586
53587 411586 411185 410454 409486 408523 407678 406897 405926 404401 402249 399895 397777 395829 393689 391261 388662 385790
53571 385790 382511 379256 376827 375512 374856 374436 374282 374327 374073 373238 372308 371917 372024 372164 372222 372430 372801 373135
53553 373135 373452 373842 373998 373582 373058 373444 375012 376843 378082 379046 380622 382959 385378 387397 389276 391561
$$ packed form
53667B78469j04O08N41m38j186q30K7L03k4j96NN9k72n42l22K23O33O67M23K01
53647B78245K72O47J054J286J386J384J172Q16P00R98J269J070P73J207K494L758
53631B98531M094L503K697K280K310K501K613K653K738K842K921L213M090N349
53617C42335O064N501M076K906K590K801L029L205L486L839M075M069L814L394
53603C95184L005K855K975L158L070K391J125j24n14Q0P26M67m79j068q51m14
53587D11586m01p31r68r63q45p81r71j525k152k354k118j948k140k428k599k872
53571C85790l279l255k429j315o56m20j54M5k54q35r30l91J07J40N8K08L71L34
53553C73135L17L90J56m16n24L86J568J831J239R64J576K337K419K019J879K285
$$ plain form
53537 391561 394554 398286 402658 407473 412589 418141 424401 431387 438789 446372 454250 462715 471889 481633
53523 481633 491726 502158 513307 525681 539306 553492 567500 581408 596017 611923 629006
53512 629006 646881 665470 684967 705556 727324 750215 773873 797767 821665 845748 870080
53501 870080 894214 917543 939726 960510 979557 996970 1013811 1031379 1049900 1068353 1085720
53490 1085720 1101976 1117775 1133686 1150033 1166966 1184219 1201026 1216786 1231762 1246718 1261926
53479 1261926 1276981 1291542 1305755 1319695 1332859 1344598 1354730 1363270 1369806 1373713 1374948 1374030
53467 1374030 1371096 1365590 1357247 1346909 1335833 1324486 1312562 1299947 1287007 1273943 1260540 1246672
53455 1246672 1232471 1217751 1201844 1184371 1165777 1146708 1127288 1107445 1087586 1068329 1049814
$$ packed form
53537C91561K993L732M372M815N116N552O260O986P402P583P878Q465R174R744
53523D81633J0093J0432J1149J2374J3625J4186J4008J3908J4609J5906J7083
53512F29006J7875J8589J9497K0589K1768K2891K3658K3894K3898K4083K4332
53501H70080K4134K3329K2183K0784J9047J7413J6841J7568J8521J8453J7367
53490A085720J6256J5799J5911J6347J6933J7253J6807J5760J4976J4956J5208
53479A261926J5055J4561J4213J3940J3164J1739J0132Q540O536L907J235r18
53467A374030k934n506q343j0338j1076j1347j1924j2615j2940j3064j3403j3868
53455A246672j4201j4720j5907j7473j8594j9069j9420j9843j9859j9257j8515
$$ plain form
53444 1049814 1031880 1014863 999594 986468 975020 964664 955502 948104 942733 939041 936466 934696
53432 934696 933707 933453 933636 933932 934424 935649 938068 941665 946227 951831 958814 967374 977481 989122 1002403
53417 1002403 1017395 1034033 1052090 1071097 1090524 1110387 1131514 1154855 1180588 1208218 1237350
53406 1237350 1267889 1299570 1331984 1365222 1399976 1436692 1475050 1514603 1555571 1598622 1644081
53395 1644081 1691687 1740934 1791352 1842540 1894215 1946203 1998263 2049997 2101008 2151006 2199729
53384 2199729 2247007 2293037 2338268 2382700 2425457 2465309 2501470 2533742 2562091 2586468 2606893
53373 2606893 2623383 2635728 2643554 2646617 2644795 2637855 2625434 2607285 2583403 2553981 2519438 2480560
53361 2480560 2438357 2393731 2347369 2299972 2252344 2205077 2158232 2111524 2064938 2019128 1975100
$$ packed form
53444A049814j7934j7017j5269j3126j1448j0356r162p398n371l692k575j770
53432I34696r89k54J83K96M92J225K419L597M562N604O983Q560J0107J1641J3281
53417A002403J4992J6638J8057J9007J9427J9863K1127K3341K5733K7630K9132
53406A237350L0539L1681L2414L3238L4754L6716L8358L9553M0968M3051M5459
53395A644081M7606M9247N0418N1188N1675N1988N2060N1734N1011M9998M8723
53384B199729M7278M6030M5231M4432M2757L9852L6161L2272K8349K4377K0425
53373B606893J6490J2345P826L063j822o940j2421j8149k3882k9422l4543l8878
53361B480560m2203m4626m6362m7397m7628m7267m6845m6708m6586m5810m4028
$$ plain form
53350 1975100 1933443 1893917 1855815 1818609 1782089 1746026 1710023 1673792 1637332 1600828 1564727
53339 1564727 1530051 1498200 1469908 1444475 1420471 1397239 1375379 1355705 1338170 1322109 1307189
53328 1307189 1293603 1281242 1269180 1256345 1242565 1228573 1214984 1201682 1188401 1175483 1163549
53317 1163549 1152566 1141793 1130789 1120041 1110431 1102464 1096302 1092174 1090288 1090411 1091929 1094343 1097471
53304 1097471 1101210 1105459 1110389 1116548 1124551 1134729 1147076 1161371 1177244 1194337 1212591 1232333
53292 1232333 1253852 1276848 1300456 1323994 1347534 1371502 1395726 1419160 1440694 1459978 1477254
53281 1477254 1492634 1505926 1517045 1526107 1533101 1537785 1540033 1539902 1537288 1531922 1523859 1513606 1501532
53268 1501532 1487497 1471317 1453277 1433829 1413051 1390803 1367237 1342808 1317920 1292886 1268004
$$ packed form
53350A975100m1657l9526l8102l7206l6520l6063l6003l6231l6460l6504l6101
53339A564727l4676l1851k8292k5433k4004k3232k1860j9674j7535j6061j4920
53328A307189j3586j2361j2062j2835j3780j3992j3589j3302j3281j2918j1934
53317A163549j0983j0773j1004j0748r610p967o162m128j886J23J518K414L128
53304A097471L739M249M930O159Q003J0178J2347J4295J5873J7093J8254J9742
53292A232333K1519K2996K3608K3538K3540K3968K4224K3434K1534J9284J7276
53281A477254J5380J3292J1119R062O994M684K248j31k614n366q063j0253j2074
53268A501532j4035j6180j8040j9448k0778k2248k3566k4429k4888k5034k4882
$$ plain form
53257 1268004 1243273 1218125 1191947 1164870 1137669 1110926 1084726 1059134 1034441 1010701 987410
53246 987410 964034 940623 917687 895594 874296 853522 833023 812727 792819 773645 755473
53235 755473 738373 722386 707683 694452 682681 672106 662347 653082 644229 636003 628651 621935 615013
53222 615013 607040 597879 588063 577991 567395 555754 543125 530319 518211 507072 496587 486269
53210 486269 475754 465016 454607 445476 438108 431842 425416 418202 410607 403242 396165 389092 381865
53197 381865 374466 366921 359486 352564 346138 339664 332920 326581 321435 317334 313525 309820 306713 304328
53183 304328 301935 298746 294705 290386 286489 283567 281649 279908 277176 273175 268954 265806 264035 262992
53169 262992 261963 260648 259076 257523 256484 256321 256912 257743 258289 258194 257351 256045 254825 253924 253007 251795
$$ packed form
53257A268004k4731k5148k6178k7077k7201k6743k6200k5592k4693k3740k3291
53246I87410k3376k3411k2936k2093k1298k0774k0499k0296j9908j9174j8172
53235G55473j7100j5987j4703j3231j1771j0575r759r265q853q226p352o716o922
53222F15013p973r161r816j0072j0596j1641j2629j2806j2108j1139j0485j0318
53210D86269j0515j0738j0409r131p368o266o426p214p595p365p077p073p227
53197C81865p399p545p435o922o426o474o744o339n146m101l809l705l107k385
53183C04328k393l189m041m319l897k922j918j741k732m001m221l148j771j043
53169B62992j029j315j572j553j039j63N91Q31N46r5q43j306j220r01r17j212
$$ plain form
53153 251795 250725 250490 251026 251523 251477 251211 251143 251047 250489 249618 249019 248897 248890 248750 248731 249112 249660 249861 249530 248955
53133 248955 248550 248558 249025 249841 250853 252034 253454 254920 255888 256074 255994 256394 257106 257110 256031 255031 255650 258077
53115 258077 261154 263924 266463 269102 271515 272962 273094 272125 270470 268582 267023 266215 265963 265453 263922
53100 263922 261383 258593 256346 254828 253725 252791 252129 251872 251896 252034 252374 253007 253603 253578 252703 251265 249630
53083 249630 247967 246464 245401 244792 244245 243452 242669 242470 243081 244127 244921 244921 244080 242902 242045 241712 241519 241079
53065 241079 240476 239943 239328 238250 236705 235141 233871 232768 231694 230911 230806 231367 232179 232874 233369 233708 233937
53048 233937 234192 234713 235616 236736 237790 238599 239015 238805 237841 236407 235011 233859 232755 231692 231221 231951
53032 231951 233780 235874 237371 237877 237417 236256 234890 233909 233673 234107 234813 235308 235226 234547 233702 233340 233891
$$ packed form
53153B51795j070k35N36M97m6k66o8r6n58q71n99j22pj40j9L81N48K01l31n75
53133B48955m05QM67Q16J012J181J420J466R68J86q0M00P12Mj079j000O19K427
53115B58077L077K770K539K639K413J447J32r69j655j888j559q08k52n10j531
53100B63922k539k790k247j518j103r34o62k57K4J38L40O33N96k5q75j438j635
53083B49630j663j503j063o09n47p93p83j99O11J046P94%q41j178q57l33j93m40
53065B41079o03n33o15j078j545j564j270j103j074p83j05N61Q12O95M95L39K29
53048B33937K55N21R03J120J054Q09M16k10r64j434j396j152j104j063m71P30
53032B31951J829K094J497N06m60j161j366r81k36M34P06M95q2o79q45l62N51
$$ plain form
53015 233891 235379 237528 239853 241770 242908 243400 243612 243634 243285 242653 242234 242299 242460 242113 241126 239848 238662
52998 238662 237853 237751 238545 239907 241081 241520 241290 240775 240150 239315 238270 237356 237009 237351 238174 239404 241312
52981 241312 244099 247354 250278 252387 253749 254557 254933 255224 255981 257266 258348 258585 258444 259079 260929 263184
52965 263184 264766 265488 266034 267068 268563 269895 270407 269971 269068 268288 267738 267036 265836 264191 262378 260592
52949 260592 258891 257237 255464 253396 251234 249629 249082 249240 249069 247900 246151 244887 244690 245118 245228 244504
52933 244504 243203 241972 241270 241145 241326 241431 241175 240529 239706 238965 238445 238140 237914 237538 236902 236323 236436 237507
52915 237507 238930 239693 239435 238785 238535 238761 238986 239026 239284 240172 241515 242590 242615 241202 238661 235976 234248
52898 234248 233856 234245 234673 235032 235669 236632 237499 238022 238455 239035 239476 239352 238838 238698 239484 240947 242307 242935
$$ packed form
53015B33891J488K149K325J917J138M92K12K2l49o32m19O5J61l47r87j278j186
52998B38662q09j02P94J362J174M39k30n15o25q35j045r14l47L42Q23J230J908
52981B41312K787L255K924K109J362Q08L76K91P57J285J082K37j41O35J850K255
52965B63184J582P22N46J034J495J332N12m36r03p80n50p02j200j645j813j786
52949B60592j701j654j773k068k162j605n47J58j71j169j749j264j97M28J10p24
52933B44504j301j231p02j25J81J05k56o46q23p41n20l05k26l76o36n79J13J071
52915B37507J423P63k58o50k50K26K25M0K58Q88J343J075K5j413k541k685j728
52898B34248l92L89M28L59O37R63Q67N23M33N80M41j24n14j40P86J463J360O28
$$ plain form
52880 242935 242813 242446 242438 243064 244153 245330 246301 246982 247530 248341 249853 252136 254713 256877 258198 258729 258884
52863 258884 259212 260069 261331 262553 263550 264637 266007 267125 267112 265717 263551 261317 259136 256702 253804
52848 253804 250534 247211 244253 241966 240277 238727 236833 234485 232052 230128 229069 228611 228080 227060 225729
52833 225729 224394 222999 221495 220401 220367 221186 221819 221616 221034 220907 221472 222362 223179 223690 223722 223296 222765 222566
52815 222566 222883 223618 224509 225213 225578 225949 226843 228165 229174 229498 229753 230704 232210 233502 234221 234564 234560 233889
52797 233889 232485 230813 229375 228360 227842 227872 228170 228153 227530 226617 225814 225032 223948 222678 221866 222062 223180
52780 223180 224549 225396 225297 224417 223414 223003 223405 224217 224898 225430 226279 227601 228742 228840 227873 226745 226261 226338
52762 226338 226339 225833 224821 223534 222371 221869 222352 223551 224741 225259 224834 223654 222256 221245 220877 221038 221664
$$ packed form
52880B42935j22l67qO26J089J177R71O81N48Q11J512K283K577K164J321N31J55
52863B58884L28Q57J262J222R97J087J370J118j3j395k166k234k181k434k898
52848B53804l270l323k958k287j689j550j894k348k433j924j059m58n31j020j331
52833B25729j335j395j504j094l4Q19O33k03n82j27N65Q90Q17N11L2m26n31j99
52815B22566L17P35Q91P04L65L71Q94J322J009L24K55R51J506J292P19L43mo71
52797B33889j404j672j438j015n18L0K98j7o23r13q03p82j084j270q12J96J118
52780B23180J369Q47r9q80j003m11M02Q12O81N32Q49J322J141R8r67j128m84P7
52762B26338Jn06j012j287j163n02M83J199J190N18m25j180j398j011l68J61O26
$$ plain form
52745 221664 222926 224873 227234 229854 232978 236618 239926 241845 242409 242873 244431 247099 249862 251534 251479
52730 251479 250000 248282 247624 248400 249825 250772 250693 249807 248767 248206 248298 248596 248526 248082 247701 247448 246783 245375
52712 245375 243676 242272 241031 239402 237398 235710 234844 234618 234640 234859 235365 235971 236294 236129 235522 234609 233622
52695 233622 232933 232758 232856 232832 232769 233185 234246 235408 236135 236666 237632 239131 240617 241643 242171 242140 241303 239748
52677 239748 238177 237303 237194 237388 237425 237121 236605 236350 236867 238110 239423 240245 240648 240975 241337 241738 242287 242839
52659 242839 242776 241745 240451 240178 241563 244221 247434 250719 253777 256398 258531 260169 261210 261658 261706 261284
52643 261284 259852 257252 254507 252957 252707 252723 252500 252652 253555 254360 254036 252789 251702 251315 251281 251292 251686 253038
52625 253038 255541 258867 262362 265311 267154 267594 266602 264505 262076 260238 259440 259364 259289 258618 257153 255161
$$ packed form
52745B21664J262J947K361K620L124L640L308J919N64M64J558K668K763J672n5
52730B51479j479j718o58P76J425R47p9q86j040n61R2K98p0m44l81k53o65j408
52712B45375j699j404j241j629k004j688q66k26K2K19N06O06L23j65o07r13r87
52695B33622o89j75R8k4o3M16J061J162P27N31R66J499J486J026N28l1q37j555
52677B39748j571q74j09J94L7l04n16k55N17J243J313Q22M03L27L62M01N49N52
52659B42839o3j031j294k73J385K658L213L285L058K621K133J638J041M48M8m22
52643B61284j432k600k745j550k50J6k23J52R03Q05l24j247j087l87l4J1L94J352
52625B53038K503L326L495K949J843M40r92k097k429j838p98p6p5o71j465j992
$$ plain form
52609 255161 253285 252110 251694 251721 252088 253005 254432 255806 256527 256439 255760 254856 254199 254147 254568 255012 255406 256105
52591 256105 257116 257841 257975 258122 258957 260193 261022 261281 261539 262188 263113 264182 265406 266510 266965 266690 266302
52574 266302 266412 266963 267472 267654 267600 267574 267822 268453 269302 269945 269936 269034 267318 265253 263585 262828 262704 262349 261323
52555 261323 260277 260294 261570 263002 263288 262256 260846 259875 259202 258264 257019 255918 255151 254481 253897 253896 254855
52538 254855 256437 257936 258969 259604 260009 260289 260539 260816 261154 261750 262913 264585 266114 266887 267065 267346 268004
52521 268004 268583 268697 268800 269819 272008 274421 275712 275490 274679 274430 274963 275831 277047 279258 282647 286376
52505 286376 289628 292713 296400 300349 302908 302649 299650 295159 290434 286123 282446 279501 277323 275782
52491 275782 274577 273472 272552 272078 272024 271948 271518 270934 270567 270420 270303 270411 271212 272685 274144 275046 275644 276513
$$ packed form
52609B55161j876j175m16K7L67R17J427J374P21q8o79r04o57n2M21M44L94O99
52591B56105J011P25J34J47Q35J236Q29K59K58O49R25J069J224J104M55k75l88
52574B66302J10N51N09J82n4k6K48O31Q49O43rr02j716k065j668p57j24l55j026
52555B61323j046J7J276J432K86j032j410r71o73r38j245j101p67o70n84jR59
52538B54855J582J499J033O35M05K80K50K77L38N96J163J672J529P73J78K81O58
52521B68004N79J14J03J019K189K413J291k22q11k49N33Q68J216K211L389L729
52505B86376L252L085L687L949K559k59k999m491m725m311l677k945k178j541
52491B75782j205j105r20m74n4p6m30n84l67j47j17J08Q01J473J459R02N98Q69
$$ plain form
52473 276513 277734 278905 279876 281006 282486 283760 284007 283207 282393 282667 284200 286444 289065 292221 295907
52458 295907 299505 302234 303756 304181 303709 302488 300635 298160 295055 291558 288141 285093 282368 280007 278344
52443 278344 277498 276950 276045 274726 273427 272408 271577 270864 270340 269961 269565 269109 268712 268482 268499 268848 269445 270001
52425 270001 270371 270679 270832 270295 268904 267602 267644 269118 270903 272103 272791 273288 273573 273852 275019 277862 282094
52408 282094 286764 291411 296416 302378 309643 318345 328355 338983 349030 357284 362852 365051 363387
52395 363387 358052 350398 342492 335817 330342 324975 319011 312963 308000 304763 302933 301781 300869 300270 300304
52380 300304 301101 302332 303395 303929 304060 304135 304492 305632 308226 312542 318006 323673 329044 334129 338967 343483
52364 343483 347678 351412 354088 355147 354948 354617 354867 355411 355621 355234 354243 352712 351042 349963 349823 350266
$$ packed form
52473B76513J221J171R71J130J480J274K47q00q14K74J533K244K621L156L686
52458B95907L598K729J522M25m72j221j853k475l105l497l417l048k725k361j663
52443B78344q46n48r05j319j299j019q31p13n24l79l96m56l97k30J7L49N97N56
52425B70001L70L08J53n37j391j302M2J474J785J200O88M97K85K79J167K843M232
52408B82094M670M647N005N962P265Q702J0010J0628J0047Q254N568K199j664
52395C63387n335p654p906o675n475n367n964o048m963l237j830j152r12n99L4
52380C00304P97J231J063N34J31P5L57J140K594M316N464N667N371N085M838M516
52364C43483M195L734K676J059j99l31K50N44K10l87r91j531j670j079j40M43
$$ plain form
52348 350266 351006 352505 355254 358644 361274 362534 363375 365240 368571 372617 376483 379973 383439 387286 391894
52333 391894 397810 405469 414639 424472 434394 444651 455791 467943 481013 495270 511142 528561
52321 528561 546988 566098 585846 605920 625686 644866 663725 682429 700718 718389 735579
52310 735579 752281 768152 783163 797999 813293 828824 843855 858092 871855 885475 898821
52299 898821 911261 921955 930487 937464 944128 950999 957197 961421 963226 962911 960565 955994 949475 941868
52285 941868 933829 925402 916555 907745 899719 892943 887375 882736 878989 876635 876438 878762 883281 889364
52271 889364 896499 904249 912275 920794 930628 942230 954865 967261 978951 990419 1002071 1013743
52259 1013743 1025314 1037081 1049183 1061173 1072544 1083377 1094072 1104689 1114907 1124464 1133292 1141230
$$ packed form
52348C50266P40J499K749L390K630J260Q41J865L331M046L866L490L466L847M608
52333C91894N916P659R170R833R922J0257J1140J2152J3070J4257J5872J7419
52321E28561J8427J9110J9748K0074J9766J9180J8859J8704J8289J7671J7190
52310G35579J6702J5871J5011J4836J5294J5531J5031J4237J3763J3620J3346
52299H98821J2440J0694Q532O977O664O871O198M224J805l15k346m571o519p607
52285I41868q039q427q847q810q026o776n568m639l747k354j97K324M519O083
52271H89364P135P750Q026Q519R834J1602J2635J2396J1690J1468J1652J1672
52259A013743J1571J1767J2102J1990J1371J0833J0695J0617J0218R557Q828P938
$$ plain form
52247 1141230 1147831 1152463 1154520 1153625 1149843 1143664 1135664 1126214 1115596 1104290 1092831 1081292 1069112
52234 1069112 1055766 1041624 1027879 1015512 1004517 994346 984834 976239 968505 961099 953787 947107
52222 947107 941690 937432 933673 929993 926503 923598 921722 921146 921642 922628 923963 926320 930167 934642 938152
52207 938152 940188 941932 944872 949291 954317 959005 963075 966872 970896 975212 979268 982499 985112 987908
52193 987908 991294 994892 998285 1001696 1005644 1010261 1015236 1020132 1024458 1027704 1029671 1030634 1030831 1029957 1027420
52178 1027420 1022995 1016950 1009683 1001543 992887 984015 975118 966580 959225 953824 950273 947612 945021 942579
52164 942579 940894 940281 940605 941799 944107 947640 951903 956081 959776 963282 967069 971129 974947 977886 979471
52149 979471 979533 978411 976948 975930 975523 975503 975909 977040 978809 980653 982283 983948 985707 987023 987648 988392
$$ packed form
52247A141230O601M632K057q95l782o179q000r450j0618j1306j1459j1539j2180
52234A069112j3346j4142j3745j2367j0995j0171r512q595p734p406p312o680
52222I47107n417m258l759l680l490k905j876n76M96R86J335K357L847M475L510
52207I38152K036J744K940M419N026M688M070L797M024M316M056L231K613K796
52193I87908L386L598L393L411L948M617M975M896M326L246J967R63J97q74k537
52178A027420m425o045p267q140q656q872q897q538p355n401l551k661k591k442
52164I42579j685o13L24J194K308L533M263M178L695L506L787M060L818K939J585
52149I79471O2j122j463j018m07k0M06J131J769J844J630J665J759J316O25P44
$$ plain form
52133 988392 990295 993334 996833 1001044 1007370 1016695 1028319 1041048 1054807 1070609 1089296 1110894 1134925
52120 1134925 1160737 1187594 1215047 1243322 1272904 1303532 1333914 1362583 1388834 1412749 1434681
52109 1434681 1454859 1473200 1489177 1502035 1511417 1517745 1521852 1524369 1525599 1525828 1525414 1524561 1523310 1521778
52095 1521778 1520195 1518508 1516068 1511916 1505379 1496375 1485192 1472104 1457234 1440756 1423127 1405020
52083 1405020 1387052 1369649 1353234 1338433 1325929 1316089 1308856 1304007 1301450 1301211 1303187 1307034 1312406
52070 1312406 1319320 1328131 1338965 1351276 1364254 1377714 1392159 1407749 1423566 1438344 1451707 1464194
52058 1464194 1476160 1487231 1496922 1505237 1512417 1518505 1523458 1527346 1530141 1531595 1531542 1529991 1526602 1520516
52044 1520516 1511249 1499440 1486109 1471260 1453973 1433914 1412089 1389817 1367587 1345408 1323821
$$ packed form
52133I88392J903L039L499M211O326R325J1624J2729J3759J5802J8687K1598K4031
52120A134925K5812K6857K7453K8275K9582L0628L0382K8669K6251K3915K1932
52109A434681K0178J8341J5977J2858R382O328M107K517J230K29m14q53j251j532
52095A521778j583j687k440m152o537r004j1183j3088j4870j6478j7629j8107
52083A405020j7968j7403j6415j4801j2504r840p233m849k557k39J976L847N372
52070A312406O914Q811J0834J2311J2978J3460J4445J5590J5817J4778J3363J2487
52058A464194J1966J1071R691Q315P180O088M953L888K795J454n3j551l389o086
52044A520516r267j1809j3331j4849j7287k0059k1825k2272k2230k2179k1587
$$ plain form
52033 1323821 1303810 1285732 1268915 1252561 1236706 1222013 1208860 1196957 1185845 1175345 1165283
52022 1165283 1155041 1143860 1131707 1119503 1108222 1097908 1087802 1077327 1066633 1056178 1046087
$$ packed form
52033A323821k0011j8078j6817j6354j5855j4693j3153j1903j1112j0500j0062
52022A165283j0242j1181j2153j2204j1281j0314j0106j0475j0694j0455j0091
$$ [...]
##END NTUPLES=NMR SPECTRUM
##END=
