##TITLE=AC1532_ROEFFECT0008_8214568_NnRS8ca380
##JCAMPDX= 6.0         $$ Bruker NMR JCAMP-DX V2.0
##DATA TYPE= NMR SPECTRUM
##DATA CLASS= NTUPLES
##ORIGIN= BRUKER
##OWNER= Administrator
$$ 1.72 TOPSPIN		Version 2.1
$$ 2013-10-11 15:51:24.216 -0700  Administrator@X
$$ Compression mode = diff/dup
##.OBSERVE FREQUENCY= 400.02188249412
##.OBSERVE NUCLEUS= ^1H
##.ACQUISITION MODE= SIMULTANEOUS (DQD)
##.ACQUISITION SCHEME= undefined
##.AVERAGES= 64
##.DIGITISER RES= 22
##SPECTROMETER/DATA SYSTEM= spect
##.PULSE SEQUENCE= noesygpps1d.comp
##.SOLVENT NAME= COFFEE_meoh
##.SHIFT REFERENCE= INTERNAL, COFFEE_meoh, 1, 14.96116
##AUDIT TRAIL= $$ (NUMBER, WHEN, WHO, WHERE, PROCESS, VERSION, WHAT)
$$ ##TITLE= Audit trail, TOPSPIN		Version 2.1
$$ ##JCAMPDX= 5.01
$$ ##ORIGIN= Bruker BioSpin GmbH
$$ ##OWNER= Administrator
$$ $$ E:\/data/COFFEE/nmr/AC1532_ROEFFECT0008_8214568_NnRS8ca380/22/pdata/1/auditp.txt
$$ ##AUDIT TRAIL=  $$ (NUMBER, WHEN, WHO, WHERE, PROCESS, VERSION, WHAT)
(   1,<2013-10-11 15:51:18.225 -0700>,<Administrator>,<X>,<go>,<TOPSPIN 2.1>,
      <created by zg
	started at 2013-10-11 15:39:50.842 -0700,
	POWCHK enabled, PULCHK disabled,
       configuration hash MD5:
       C8 4E 4E 5D D3 5C D8 9E 9F 52 82 E0 59 8A DE 15
       data hash MD5: 64K
       28 A4 EA 77 FD B9 D4 6A A8 65 96 4F 0F EB D6 41>)
(   2,<2013-10-11 15:51:21.721 -0700>,<Administrator>,<X>,<proc1d>,<TOPSPIN 2.1>,
      <Start of raw data processing
       efp LB = 0.3 FT_mod = 6 PKNL = 1 PHC0 = 0 PHC1 = 0 SI = 128K 
       data hash MD5: 128K
       30 AC C9 7E 14 BE 99 99 8F 61 EF 0D D8 72 47 3A>)
(   3,<2013-10-11 15:51:22.931 -0700>,<Administrator>,<X>,<proc1d>,<TOPSPIN 2.1>,
      <pk PHC0 = -82.37 PHC1 = 0 
       data hash MD5: 128K
       E3 93 3B F0 E8 7C 5E 11 34 57 D5 20 E9 C1 73 FA>)
(   4,<2013-10-11 15:51:23.328 -0700>,<Administrator>,<X>,<proc1d>,<TOPSPIN 2.1>,
      <abs ABSG = 1 
       data hash MD5: 128K
       DE 9C F6 2D C1 1A 82 38 8C C1 C5 7D 95 C2 7A E4>)
(   5,<2013-10-11 15:51:23.422 -0700>,<Administrator>,<X>,<proc1d>,<TOPSPIN 2.1>,
      <abs ABSG = 2 
       data hash MD5: 128K
       FF 5A 99 13 FD DE 75 52 72 07 C5 A7 BC 5B A9 13>)
(   6,<2013-10-11 15:51:23.517 -0700>,<Administrator>,<X>,<proc1d>,<TOPSPIN 2.1>,
      <abs ABSG = 3 
       data hash MD5: 128K
       33 B0 EA 78 AD 98 A7 07 83 73 0A 6D 82 31 A5 5A>)
(   7,<2013-10-11 15:51:23.611 -0700>,<Administrator>,<X>,<proc1d>,<TOPSPIN 2.1>,
      <abs ABSG = 4 
       data hash MD5: 128K
       DE 5D 39 DB F6 34 CD 80 B2 81 BC 24 C1 29 07 F3>)
(   8,<2013-10-11 15:51:23.725 -0700>,<Administrator>,<X>,<proc1d>,<TOPSPIN 2.1>,
      <abs ABSG = 5 
       data hash MD5: 128K
       54 7F AA 10 DA AC 84 74 6D 44 12 F8 0D F7 55 5C>)
$$ ##END=
$$ 
$$ $$ hash MD5
$$ $$ E0 7F 56 46 0F 7B 14 B5 28 F5 DE 4C AC 80 3B AA
##$RELAX= 
##$RELAX= 
##$RELAX= 
##$RELAX= 
##$RELAX= 
##$RELAX= 
##$RELAX= 
##$RELAX= 
$$ Bruker specific parameters
$$ --------------------------
##$DU= <E:\>
##$EXPNO= 22
$$ [...]
150 150 150 150 150 150 150 150
##$TP07= 0
##$TPNAME0= <>
##$TPNAME1= <>
##$TPNAME2= <>
##$TPNAME3= <>
##$TPNAME4= <>
##$TPNAME5= <>
##$TPNAME6= <>
##$TPNAME7= <>
##$TPOAL= (0..7)
0.5 0.5 0.5 0.5 0.5 0.5 0.5 0.5
##$TPOFFS= (0..7)
0 0 0 0 0 0 0 0
##$TUNHIN= 0
##$TUNHOUT= 0
##$TUNXOUT= 0
##$USERA1= <user>
##$USERA2= <user>
##$USERA3= <user>
##$USERA4= <user>
##$USERA5= <user>
##$V9= 5
##$VALIST= <valist>
##$VCLIST= <CCCCCCCCCCCCCCC>
##$VD= 0
##$VDLIST= <DDDDDDDDDDDDDDD>
##$VPLIST= <PPPPPPPPPPPPPPP>
##$VTLIST= <TTTTTTTTTTTTTTT>
##$WBST= 1024
##$WBSW= 4
##$XGAIN= (0..3)
0 0 0 0
##$XL= 0
##$YL= 0
##$YMAX_a= 5530426
##$YMIN_a= -12166548
##$ZGOPTNS= <>
##$ZL1= 120
##$ZL2= 120
##$ZL3= 120
##$ZL4= 120
##$ABSF1= 14.96116
##$ABSF2= -5.597022
##$ABSG= 5
##$ABSL= 3
##$ALPHA= 0
##$AQORDER= 0
##$ASSFAC= 0
##$ASSFACI= 0
##$ASSFACX= 0
##$ASSWID= 0
##$AUNMP= <proc_prof1d_extract.lims>
##$AXLEFT= 0
##$AXNAME= <>
##$AXNUC= <1H>
##$AXRIGHT= 0
##$AXTYPE= 0
##$AXUNIT= <>
##$AZFE= 0.1
##$AZFW= 0.1
##$BCFW= 0
##$BC_mod= 0
##$BYTORDP= 0
##$COROFFS= 0
##$CY= 15
##$DATMOD= 1
##$DC= 0
##$DFILT= <>
##$DTYPP= 0
##$F1P= 0
##$F2P= 0
##$FCOR= 0.5
##$FTSIZE= 131072
##$FT_mod= 6
##$GAMMA= 0
##$GB= 0
##$INTBC= 1
##$INTSCL= 1
##$ISEN= 128
##$LB= 0.3
##$LEV0= 0
##$LPBIN= 0
##$MAXI= 10000
##$MC2= 0
##$MEAN= 0
##$ME_mod= 0
##$MI= 0
##$NCOEF= 0
##$NC_proc= -2
##$NLEV= 6
##$NOISF1= 0
##$NOISF2= 0
##$NSP= 0
##$NTH_PI= 0
##$NZP= 0
##$OFFSET= 14.96116
##$PC= 1
##$PHC0= -82.37
##$PHC1= 0
##$PH_mod= 1
##$PKNL= yes
##$PPARMOD= 0
##$PPDIAG= 0
##$PPIPTYP= 0
##$PPMPNUM= 2147483647
##$PPRESOL= 1
##$PSCAL= 4
##$PSIGN= 0
##$PYNMP= <proc.py>
##$REVERSE= no
##$SF= 400.020009572032
##$SI= 131072
##$SIGF1= 0
##$SIGF2= 0
##$SINO= 400
##$SIOLD= 131072
##$SPECTYP= <>
##$SREGLST= <1H.CDCl3>
##$SSB= 0
##$STSI= 131072
##$STSR= 0
##$SW_p= 8223.68421052631
##$SYMM= 0
##$S_DEV= 0
##$TDeff= 65536
##$TDoff= 0
##$TI= <>
##$TILT= no
##$TM1= 0
##$TM2= 0
##$TOPLEV= 0
##$USERP1= <user>
##$USERP2= <user>
##$USERP3= <user>
##$USERP4= <user>
##$USERP5= <user>
##$WDW= 1
##$XDIM= 131072
##$YMAX_p= 428737465
##$YMIN_p= -10983
##$CURPLOT= <Network HP LaserJet P1505>
##$CURPRIN= <$Network HP LaserJet P1505>
##$DFORMAT= <normdp>
##$LAYOUT= <+/1D_H.xwp>
##$LFORMAT= <normlp>
##$PFORMAT= <normpl>
##$SURQMSG= 1
$$ End of Bruker specific parameters
$$ ---------------------------------
##NTUPLES= NMR SPECTRUM
##VAR_NAME=  FREQUENCY,     SPECTRUM/REAL,   SPECTRUM/IMAG
##SYMBOL=    X,             R,               I
##VAR_TYPE=  INDEPENDENT,   DEPENDENT,       DEPENDENT
##VAR_FORM=  AFFN,          ASDF,            ASDF
##VAR_DIM=   131072,        131072,          131072
##UNITS=     HZ,            ARBITRARY UNITS, ARBITRARY UNITS
##FACTOR=    0.0627417313425164, 1,          1
##FIRST=     8223.62146879497, -1653,        -57267
##LAST=      0,             232,             -58035
##MIN=       0,             -10983,          0
##MAX=       8223.62146879497, 428737465,    0
$$ Real data points
##PAGE= N=1
##DATA TABLE= (X++(R..R)), XYDATA
$$ [...]
61681C82693l286l179k975k972l213l357l090k443j600o73J51N16L76J72K48J98
61665C57566n10j462j522l44J036J479J049O00N31N62N33O72J056J353J309J084
61649C64992R66R99J065J206J603K342L213L797L727L028K101J329P31J41l69
61634C90871m93j25L48L72k05r82j439j486j486j725k115k419k620k790k781k391
61618C68534j813j465j416j309j022r51j374j879j841j316j032j561k650l503
61604C45402l557k983k414k210k142j887j587j614j959k283k499k801l081k914
61590C11471k282j749j631j552j107n42l31m93p30r28j099j089q12n50o78j121
61574B94777j402j088j31J018J565J064M0n05l39j31k20q3N17P70Qr73p95O59
$$ y = [382693, 379407, 376228, 373253, 370281, 367068, 363711, 360621, 358178, 356578, 355905, 356056, 356572, 356948, 357120, 357368, 357566, 357056, 355594, 354072, 353728, 354764, 356243, 357292, 357892, 358423, 358985, 359518, 360190, 361246, 362599, 363908, 364992, 365958, 366957, 368022, 369228, 370831, 373173, 376386, 380183, 383910, 386938, 389039, 390368, 391099, 391240, 390871, 390378, 390253, 390601, 390973, 390768, 389786, 388347, 386861, 385375, 383650, 381535, 379116, 376496, 373706, 370925, 368534, 366721, 365256, 363840, 362531, 361509, 360558, 359184, 357305, 355464, 354148, 353116, 351555, 348905, 345402, 341845, 338862, 336448, 334238, 332096, 330209, 328622, 327008, 325049, 322766, 320267, 317466, 314385, 311471, 309189, 307440, 305809, 304257, 303150, 302608, 302277, 301784, 301054, 300126, 299027, 297938, 297126, 296576, 295898, 294777, 293375, 292287, 292156, 293174, 294739, 295803, 295843, 295338, 294999, 294868, 294648, 294565, 295082, 295852, 295860, 294887, 294092, 294751]
61556B94751K123K564K082J376R80J036J237J063N10K73P73J371J237N73J49O7
61540C12165j09k54J33P32O14j65l33Q25K408L139K809J960Q93l26j311j601j246
61523C20333p06l11p6R3K84M94N19J18n89j141j242j013o47j68L38M84j25j430
61505C15215k756l211k450j180n61r02j265p53K68Q16O78M36L37J41p6J66Q54
61488C05757J332J276J092J092J016O73M12O02J147J751K188K179J606R70J022
61473C24115J656J882J174J93k26r7J05L05O39R04Q05M13j0l52m92j80M88Q85
61455C32207N81qj58K64P96J014P77J56n05o65j71M81P66Q23J096J555J716J392
61437C42117R36P86R70J210J288J249J295J502J730J830J784J545R58J18m99o33
$$ y = [294751, 296874, 299438, 301520, 302896, 303876, 304912, 306149, 307212, 307722, 307995, 308768, 310139, 311376, 311949, 312098, 312165, 312056, 311802, 311935, 312667, 313281, 313116, 312783, 313608, 316016, 319155, 321964, 323924, 324817, 324491, 323180, 321579, 320333, 319627, 319316, 319240, 319333, 319617, 320111, 320630, 320748, 320159, 319018, 317776, 316763, 316116, 315948, 316286, 316770, 316645, 315215, 312459, 309248, 306798, 305618, 305057, 304155, 302890, 302137, 302405, 303221, 303899, 304335, 304672, 304813, 304737, 304903, 305757, 307089, 308365, 309457, 310549, 311565, 312238, 312650, 313252, 314399, 316150, 318338, 320517, 322123, 323093, 324115, 325771, 327653, 328827, 329020, 328794, 328697, 328802, 329107, 329746, 330650, 331455, 331868, 331858, 331506, 331014, 330834, 331322, 332207, 332788, 332780, 332622, 332886, 333682, 334696, 335473, 335629, 335124, 334459, 334288, 334769, 335535, 336358, 337454, 339009, 340725, 342117, 343053, 343839, 344809, 346019, 347307, 348556, 349851, 351353, 353083, 354913, 356697, 358242, 359200, 359318, 358819, 358186]
61421C58186o96j054j201m19R00J580J356J211J726K103J461J98p08j056j309
61406C62278j537j392q45k67J23L46L28l8o20j212j730j994j607n49M54O48J37
61389C52523l50l39J45Q93J600J818J373P07L97N20Q20J189J589J780J661J611
61373C67937J921K199J939J483J613K287K549J840P45K10N31J284J867J851J340
61358C91596J063J735L033L781L426K881L389M852N968N904N218M974N399N822
61344D49041N593M630L265J981J298J498K266K846K768K200J569J064O91L77j45
61329D80942j191k527l372l320k951k956l137k899k337j990j730q83N20J596J930
61314D55695K201L112M460N638O489P245Q164R528J1519J3712J5273J5951J6360
$$ y = [358186, 357490, 356436, 355235, 354816, 355716, 357296, 358652, 359863, 361589, 363692, 365153, 365351, 364643, 363587, 362278, 360741, 359349, 358504, 358237, 358360, 358706, 359034, 358996, 358376, 357164, 355434, 353440, 351833, 351284, 351738, 352386, 352523, 352173, 351834, 351979, 352872, 354472, 356290, 357663, 358370, 358767, 359287, 360107, 361296, 362885, 364665, 366326, 367937, 369858, 372057, 373996, 375479, 377092, 379379, 381928, 383768, 384513, 384723, 385254, 386538, 388405, 390256, 391596, 392659, 394394, 397427, 401208, 404634, 407515, 410904, 415756, 421724, 427628, 432846, 437820, 443219, 449041, 454634, 459264, 462529, 464510, 465808, 467306, 469572, 472418, 475186, 477386, 478955, 480019, 480710, 481087, 480942, 479751, 477224, 473852, 470532, 467581, 464625, 461488, 458589, 456252, 454262, 452532, 451649, 452169, 453765, 455695, 457896, 461008, 465468, 471106, 477595, 484840, 493004, 502532, 514051, 527763, 543036, 558987, 575347]
61301E75347J6955J7236J6396J4294J1417Q388N813M030K595N61k258m853o314
61288F59607o990p762q759r506r880j0154j0295j0068r646r449r363q764p353
61275E41618n530l897k758k121j773j341o15J90P00Q18P56P17P73R30J176J566
61259E31209K364L806N645P155P724P262O019M398K934K012J454P73r7p68j121
61244E80769j406j630j556j447j963k992l470k863j964j680j764j460p21pN91
61229E56437J252J872K304K835L799N028O187P254Q247Q944R244R359R268Q749
61215F40779Q277Q904J0597J1716J1094R654Q874Q502P264N213L702L333L366
61202G41275L266L426M171N186O230P441Q743R766J0593J1871J3914J6200J7824
$$ y = [575347, 592302, 609538, 625934, 640228, 651645, 660033, 665846, 669876, 672471, 673032, 670774, 665921, 659607, 652617, 644855, 636096, 626590, 616710, 606556, 596261, 586193, 576547, 567098, 557735, 548971, 541618, 536088, 532191, 529433, 527312, 525539, 524198, 523583, 523773, 524473, 525291, 526047, 526764, 527537, 528467, 529643, 531209, 533573, 537379, 543024, 550179, 557903, 565165, 571184, 575582, 578516, 580528, 581982, 582755, 582658, 581890, 580769, 579363, 577733, 576177, 574730, 572767, 569775, 566305, 563442, 561478, 559798, 558034, 556574, 555853, 555846, 556437, 557689, 559561, 561865, 564700, 568499, 573527, 579714, 586968, 595215, 604159, 613403, 622762, 632030, 640779, 649056, 657960, 668557, 680273, 691367, 701021, 709895, 718397, 725661, 730874, 734576, 737909, 741275, 744541, 747967, 752138, 757324, 763554, 770995, 779738, 789504, 800097, 811968, 825882, 842082, 859906]
61189H59906J7959J6132J2695Q924N960L806J879J56j069k115l566n189o315p115
61175I02048q358r934j0856j0908j1108j2123j3272j3592j3135j2639j2585j2964
61163G60574j3555j4060j4305j4433j4586j4487j3781j2669j1617j0596r257p630
61151F09598o049m459k664j023j41P1J43Qq51k309l597m417n084n560n327m343
61135E63996l202k161r31M50J445J928K405L239M441O186Q583J0896J2166J2683
61121F22124J3767J5884J8172K0026K1882K4017K5816K6860K7593K8369K8819
61110H73329K8796K8830K9019K8479K6675K4393K2582K0976J8715J5678J2382
61099A129854R134N863K409j489n993j0628j4497j7298j9438k1064k1973k2627
$$ y = [859906, 877865, 893997, 906692, 915616, 921576, 925382, 927261, 927417, 926348, 924233, 920667, 915478, 909163, 902048, 893690, 883756, 872900, 861992, 850884, 838761, 825489, 811897, 798762, 786123, 773538, 760574, 747019, 732959, 718654, 704221, 689635, 675148, 661367, 648698, 637081, 626485, 617228, 609598, 603549, 599090, 596426, 595403, 595262, 595333, 595476, 595484, 594633, 592324, 588727, 584310, 579226, 573666, 568339, 563996, 560794, 558633, 557702, 558152, 559597, 561525, 563930, 567169, 571610, 577796, 586379, 597275, 609441, 622124, 635891, 651775, 669947, 689973, 711855, 735872, 761688, 788548, 816141, 844510, 873329, 902125, 930955, 959974, 988453, 1015128, 1039521, 1062103, 1083079, 1101794, 1117472, 1129854, 1138988, 1144851, 1147260, 1145771, 1139778, 1129150, 1114653, 1097355, 1077917, 1056853, 1034880, 1012253]
61087A012253k3908k5441k5514k3534k1161k0042j9588j8304j6235j4558j3471
61076G90497j2049r896p532n257k905o63R31J945L092M703O361P642Q610R508
61062G94987J0458J1534J2677J3673J4515J5614J7272J9173K0785K2050K3297
61051I76035K4704K6203K7739K9339L1092L3163L5521L7674L9123M0106M1228
61040A341927M2317M2470M1452M0122L9113L8022L6358L4428L2707L1162K9694
61029A749772K8436K7195K5561K3917K3208K3194K2346K0233J8461J8189J8233
61018A998745J7201J6173J7496K1835K8243L6226M5865N6350O6411P6043Q6487
61007B467075R9061J15457J38483J70635K12758K66118L34637M22319N29381O54830
$$ y = [1012253, 988345, 962904, 937390, 913856, 892695, 872653, 853065, 834761, 818526, 803968, 790497, 778448, 768552, 761020, 755763, 752858, 752195, 753126, 755071, 758163, 762866, 769227, 776869, 785479, 794987, 805445, 816979, 829656, 843329, 857844, 873458, 890730, 909903, 930688, 952738, 976035, 1000739, 1026942, 1054681, 1084020, 1115112, 1148275, 1183796, 1221470, 1260593, 1300699, 1341927, 1384244, 1426714, 1468166, 1508288, 1547401, 1585423, 1621781, 1656209, 1688916, 1720078, 1749772, 1778208, 1805403, 1830964, 1854881, 1878089, 1901283, 1923629, 1943862, 1962323, 1980512, 1998745, 2015946, 2032119, 2049615, 2071450, 2099693, 2135919, 2181784, 2238134, 2304545, 2380588, 2467075, 2566136, 2681593, 2820076, 2990711, 3203469, 3469587, 3804224, 4226543, 4755924, 5410754]
60997E410754Q02944R82977J201015J454015J727555J985662K155124K135074
60989A7855120J853505J336543P20658J82495j55296k62488j73858M3882K89618
60980B1690179M23987L17497o6552o35285j221203j680236j948690k032360j968730
60971A2878607j804039j585893j355286j138049r45214p80187o42976n30329m37432
60962C659202l61143l00111k52321k14747j85146j62095j43513j27155j12507
60953A800464j00346r0293q0565p0358o0763n2882m6451m0896l6504l3857l2936
60942A154613l3266l4237l4982l4712l3524l2215l1077k9588k7468k5211k3271
60931H15062k1512j9850j8616j7807j6671j4680j2355j0578r474q623p921p611
$$ y = [5410754, 6213698, 7196675, 8397690, 9851705, 11579260, 13564922, 15720046, 17855120, 19708625, 21045168, 21765826, 21948321, 21793025, 21530537, 21356679, 21400561, 21690179, 22114166, 22431663, 22365111, 21729826, 20508623, 18828387, 16879697, 14847337, 12878607, 11074568, 9488675, 8133389, 6995340, 6050126, 5269939, 4626963, 4096634, 3659202, 3298059, 2997948, 2745627, 2530880, 2345734, 2183639, 2040126, 1912971, 1800464, 1700118, 1609825, 1529260, 1458902, 1398139, 1345257, 1298806, 1257910, 1221406, 1187549, 1154613, 1121347, 1087110, 1052128, 1017416, 983892, 951677, 920600, 891012, 863544, 838333, 815062, 793550, 773700, 755084, 737277, 720606, 705926, 693571, 682993, 673519, 664896, 656975, 649364]
60919F49364p586p334o590n555m519l591k912k714l032l492l511k790j577m89
60905E93672K0J2j73l33m30l52o2Q4l84j360k281l002m002n418o528o748o551
60888E56164o753p235p239o653o096n799n364m813m857n694o408o259n810n995
60874D71189o618o665n830m811m090l355k257j092m27m78j025j524j222L05K529
60859D34629M222M672M306M046M314M914N414N377M536L166K179K405L779N335
60845D93294O046N551M229K688J300P0j165k546m153n891p283p684o976n797m883
60830D66800m395m147m122m256m118l448k752k629k750k334j564j512k521l683
60816D22569m207m395m803n272n381n200n009m767m386m037l704l024k005j341
$$ y = [649364, 641778, 634444, 627854, 622299, 617780, 614189, 611277, 608563, 605531, 602039, 598528, 595738, 594161, 593672, 593692, 593704, 593531, 593198, 592768, 592416, 592354, 592438, 592054, 590694, 588413, 585411, 581409, 575991, 569463, 562715, 556164, 549411, 542176, 534937, 528284, 522188, 516389, 511025, 506212, 501355, 495661, 489253, 482994, 477184, 471189, 464571, 457906, 452076, 447265, 443175, 439820, 437563, 436471, 436044, 435566, 434541, 433017, 431795, 432100, 434629, 438851, 443523, 447829, 451875, 456189, 461103, 466517, 471894, 476430, 479596, 481775, 484180, 487959, 493294, 499340, 504891, 509120, 511808, 513108, 513178, 512013, 509467, 505314, 499423, 492140, 484456, 477480, 471683, 466800, 462405, 458258, 454136, 449880, 445762, 442314, 439562, 436933, 434183, 431849, 430285, 428773, 426252, 422569, 418362, 413967, 409164, 403892, 398511, 393311, 388302, 383535, 379149, 375112, 371408, 368384, 366379, 365038]
60802C65038j503k057k378k451k416j999j099l78l74n17J08J311J983J551N72
60787C55391j9L06J405K444K449J437O42J022K008K441K225K127K377K469K230
60772C80954J986J743J136L07q7J58N76Q35J016J082Q44M44J33l43j343k338k372
60755C84731j522r43j191j531j246p04o02r58j323j383q92K82J599K004J139j90
60739C77270j186k047l210m319m704m494m400m625m686m224l400k492j641r97
60725C30845p03o38m93j94J0l0r2J58O92J097J075Q89J001J398J608J463J386
60708C39472J604J680J310J106J754K773L095K696K568K994L036K114J019O76
60694C67897P70M78j15k88M1K52J10j4J3k34r30j580j694j465j266q87J28J415
$$ y = [365038, 363535, 361478, 359100, 356649, 354233, 352234, 351135, 350757, 350383, 349866, 349974, 351285, 353268, 354819, 355391, 355372, 355678, 357083, 359527, 361976, 363413, 364055, 365077, 367085, 369526, 371751, 373878, 376255, 378724, 380954, 382940, 384683, 385819, 386126, 386039, 386197, 386773, 387608, 388624, 389706, 390550, 390994, 391127, 390784, 389441, 387103, 384731, 383209, 382266, 381075, 379544, 378298, 377594, 376992, 376034, 374711, 373328, 372436, 372718, 374317, 376321, 377460, 377270, 376084, 374037, 370827, 366508, 361804, 357310, 352910, 348285, 343599, 339375, 335975, 333483, 331842, 330845, 330142, 329504, 329011, 328817, 328827, 328797, 328705, 328863, 329555, 330652, 331727, 332616, 333617, 335015, 336623, 338086, 339472, 341076, 342756, 344066, 345172, 346926, 349699, 352794, 355490, 358058, 361052, 364088, 366202, 367221, 367897, 368667, 369145, 369030, 368742, 368783, 369035, 369145, 369131, 369144, 368910, 367980, 366400, 364706, 363241, 361975, 361088, 361216, 362631]
60676C62631J802P73n03l06J480L110L066J759O67M01L24k29j249k439l525m104
60660C63658l897l230k696k256j381j45O01M10j08j90J90P34J492K565L585M126
60644C63458M256M168L522J873l54j981k340k046k247l316m514m888m335l514
60630C47742k812j821j66J521K106J386M05J88O67J130J254J268J352J336R61
60615C56517K25n94j209j574j764j647r48J57R03P77K18m2J2p2k32K4N74P03K90
60596C52318J40P57J540J678J224P91O39N92N58O07P17Q13R13J055J183J220J089
60579C67834P28K94K42P52J260J117O57Q66J986L220M028M832O105P514Q550R351
60563D19336J0354J1558J2580J3052J2613J1021Q642O318M368K297k00k555m194
$$ y = [362631, 364433, 365206, 364703, 364397, 365877, 368987, 372053, 373812, 374479, 374880, 375204, 374975, 373726, 371287, 367762, 363658, 359761, 356531, 353835, 351579, 350198, 350053, 350654, 351064, 350956, 350766, 350956, 351690, 353182, 355747, 359332, 363458, 367714, 371882, 375404, 377277, 376923, 374942, 372602, 370556, 368309, 364993, 360479, 355591, 351256, 347742, 344930, 343109, 342943, 344464, 346570, 347956, 348361, 348549, 349216, 350346, 351600, 352868, 354220, 355556, 356517, 356742, 356148, 354939, 353365, 351601, 349954, 349006, 349163, 350066, 350843, 351061, 351019, 351031, 350959, 350727, 350751, 351325, 352028, 352318, 352458, 353215, 354755, 356433, 357657, 358448, 359087, 359679, 360237, 360844, 361561, 362374, 363287, 364342, 365525, 366745, 367834, 368562, 368856, 369098, 369850, 371110, 372227, 372884, 373750, 375736, 378956, 382984, 387816, 393921, 401435, 409985, 419336, 429690, 441248, 453828, 466880, 479493, 490514, 499156, 505474, 509842, 512139, 511939, 509384, 505190]
60550E05190n361o416o973o558n625m987m491l253j086J144K712L813M980O317
60536D79406P644Q999J0677J2856J5281J7342J8528J8828J8524J7566J5541J2365
60524F53557Q551M614O47l161o171p951q899r618j0040r829r269q946q648p462
60510E77375n176k866j684j552j425o02O72J813K690L762N532Q132J1402J5183
60496F13256J9366K3681K7725L1240L4282L7047L9613M1759M2905M2410M0145
60485I93429L6619L2280K6908K0187J2670N510q70p253j4549k2627l0467l7033
60473A014804m1840m4946m6680m7226m6457m4348m1352l7938l4017k9417k4763
60462E75820k1102j8664j6709j4689j2788j1178r649q198p216o759o417o085o081
$$ y = [505190, 499829, 493413, 486440, 479882, 474257, 469270, 464779, 461526, 460440, 461584, 464296, 468109, 473089, 479406, 487050, 496049, 506726, 519582, 534863, 552205, 570733, 589561, 608085, 625651, 641192, 653557, 662108, 666722, 667369, 664208, 658037, 650086, 641187, 631569, 621529, 611700, 602431, 593485, 584837, 577375, 572199, 569333, 567649, 566097, 564672, 564070, 564742, 566555, 569245, 573007, 578539, 586671, 598073, 613256, 632622, 656303, 684028, 715268, 749550, 786597, 826210, 867969, 910874, 953284, 993429, 1030048, 1062328, 1089236, 1109423, 1122093, 1127603, 1126733, 1119480, 1104931, 1082304, 1051837, 1014804, 972964, 928018, 881338, 834112, 787655, 743307, 701955, 664017, 630000, 600583, 575820, 554718, 536054, 519345, 504656, 491868, 480690, 471041, 462843, 455627, 448868, 442451, 436366, 430285]
60449D30285o173n513l942k495j992k059k085k190k515k453j518l51J30m5k89
60434C96795n35j018j506j682j792k054j920q89L38N89j06o09k94L79Q10R34Q85
60417C88325P55P71J089J475J695J990K546K750J814R1j071q31L33J407J839J730
60401D06708J525J640K072K397K286J884J505J258J247J662K298K536K141J679
60387D32838J668J916K086K291K507K247J429Q79J128J509J342J133J499J753
60373D56225J012j3Q0J090J556J125Q98J388J874J970K201K611K392J546J380
60358D77335K520L725L663K833K704L678M888N626O039O587P459Q402Q899Q650
60344E53008P920P108O046M246J768q42l391n986q172r082q643p748o993o207
$$ y = [430285, 424112, 418599, 414657, 412162, 410170, 408111, 406026, 403836, 401321, 398868, 397350, 396999, 397129, 397084, 396795, 396260, 395242, 393736, 392054, 390262, 388208, 386288, 385399, 385737, 386326, 386220, 385611, 385317, 385696, 386506, 387440, 388325, 389080, 389851, 390940, 392415, 394110, 396100, 398646, 401396, 403210, 403301, 402230, 401399, 401732, 403139, 404978, 406708, 408233, 409873, 411945, 414342, 416628, 418512, 420017, 421275, 422522, 424184, 426482, 429018, 431159, 432838, 434506, 436422, 438508, 440799, 443306, 445553, 446982, 447861, 448989, 450498, 451840, 452973, 454472, 456225, 457237, 457224, 457304, 458394, 459950, 461075, 461973, 463361, 465235, 467205, 469406, 472017, 474409, 475955, 477335, 479855, 483580, 487243, 490076, 492780, 496458, 501346, 506972, 513011, 519598, 527057, 535459, 544358, 553008, 560928, 568036, 574082, 578328, 580096, 579254, 575863, 569877, 561705, 552623, 543980, 536232, 529239, 523032]
60330E23032n423n197n537n551m742l790l406l386l356l551l988l849k626j192
60316D67438n86l83N86K313L662M225M864O257P983R450J0850J2609J4463J5730
60302E59461J6244J6524J6982J7275J6570J4351J0819O600K196k184o459j0534
60290F57845j4203j7019j8354j7933j6258j4206j2231j0278q379o850n810m951
60278E11373m072l460l499m106m781n088m974m670m427m292m131l872l555l186
60264D53260k744k416k449k626k355j585j017j027r55j76O91O69L7k6P33J384
60248D39398J420J382J643J653J013K93J60M04M67L55L82M79L67J78L05Q00J255
60231D51954J263P86K15J17O66J461K077K608L220L531L169K706L094M140M642
$$ y = [523032, 517609, 512412, 506875, 501324, 496582, 492792, 489386, 486000, 482644, 479093, 475105, 471256, 468630, 467438, 466852, 466469, 467055, 469368, 473030, 477255, 482119, 488376, 496359, 505809, 516659, 529268, 543731, 559461, 575705, 592229, 609211, 626486, 643056, 657407, 668226, 674826, 677022, 674838, 668379, 657845, 643642, 626623, 608269, 590336, 574078, 559872, 547641, 537363, 528984, 522134, 516324, 511373, 507301, 503841, 500342, 496236, 491455, 486367, 481393, 476723, 472296, 468004, 463873, 460001, 456446, 453260, 450516, 448100, 445651, 443025, 440670, 439085, 438068, 437041, 436086, 435910, 436601, 437270, 437307, 437281, 438014, 439398, 440818, 442200, 443843, 445496, 446509, 446802, 446962, 447366, 447833, 448188, 448570, 449049, 449416, 449594, 449899, 450699, 451954, 453217, 454003, 454218, 454335, 455001, 456462, 458539, 461147, 464367, 467898, 471067, 473773, 476867, 481007, 485649]
60216D85649M219L956M730N980O731O977P245P577P765Q082Q848R615R580Q661
60202E85615P520O695O240O079O123O091N691M905L897K707J383J57q00j676k740
60187F37887l904m817n310n505n626n820o096o342o460o485o416o083n436m760
60173E58827m300l866l241k750k714k617j683k25N38J11p58j362j770j960j397
60158E30833j64N09j79j285j370m23M16O30P06R72J164J232J648K557L334L296
60142E43876K575J952K023K712L562M340N253O468P614Q055P663O944O373N995
60128F15405N739N621N533N184M481L590K598J460M23o5P9N47J235K262L309L630
60112F61031L050K255J808J470Q26Ro38j141j733k509l500m646n532n717n468
$$ y = [485649, 489868, 493824, 498554, 504534, 511265, 518242, 525487, 533064, 540829, 548911, 557759, 567374, 576954, 585615, 593135, 599830, 606070, 612149, 618272, 624363, 630054, 634959, 638856, 641563, 642946, 643103, 642303, 640627, 637887, 633983, 629166, 623856, 618351, 612725, 606905, 600809, 594467, 588007, 581522, 575106, 569023, 563587, 558827, 554527, 550661, 547420, 544670, 541956, 539339, 537656, 537431, 537969, 538080, 537322, 535960, 534190, 532230, 530833, 530669, 531178, 530999, 529714, 528344, 527921, 528337, 528967, 529673, 530645, 531809, 533041, 534689, 537246, 540580, 543876, 546451, 548403, 550426, 553138, 556700, 561040, 566293, 572761, 580375, 588430, 596093, 603037, 609410, 615405, 621144, 626765, 632298, 637482, 641963, 645553, 648151, 649611, 650034, 649969, 650048, 650595, 651830, 654092, 657401, 661031, 664081, 666336, 668144, 669614, 670440, 670449, 669811, 668670, 666937, 664428, 660928, 656282, 650750, 645033, 639565]
60097F39565n479n737n441m330l165k521k004j175l49J64O60J280J472J024P16
60082F14680J097J466J082N29O99J088N11r69k184k716l294m358n538o677q142
60067E87274r793j0680j0265r156q137p178n856m379l506l581m049m001l160k174
60053E01359j819k013j950j158M9J335K784M280N125M914M320M296M890N506O005
60038E37923O699P484P756P231O239N130L870K314N10j207k347k654k533k812
60024E73603l830n149o358p583q908r975j0576j1022j1393j1129j0022q849q274
60011D60535p751o482m833l719l083k164r66k13N7O35J759K601K390J310R1o03
59995D39564l47P58J892K221J857J603J873K494L318M257M828M507L587K888K589
$$ y = [639565, 634086, 628349, 622908, 618578, 615413, 612892, 610888, 609713, 609364, 609528, 610188, 611468, 612940, 613964, 614680, 615777, 617243, 618325, 618854, 619553, 620641, 621152, 620183, 617999, 615283, 611989, 607631, 602093, 595416, 587274, 577481, 566801, 556536, 547380, 539243, 532065, 526209, 521830, 518324, 514743, 510694, 506693, 503533, 501359, 499540, 497527, 495577, 494419, 494468, 495803, 498587, 502867, 507992, 512906, 517226, 521522, 526412, 531918, 537923, 544622, 552106, 559862, 567093, 573332, 578462, 582332, 584646, 585156, 583949, 581602, 578948, 576415, 573603, 569773, 564624, 558266, 550683, 541775, 531800, 521224, 510202, 498809, 487680, 477658, 468809, 460535, 452784, 446302, 441469, 437750, 434667, 432503, 431537, 431324, 431381, 432016, 433775, 436376, 438766, 440076, 440167, 439564, 439217, 439975, 441867, 444088, 445945, 447548, 449421, 451915, 455233, 459490, 464318, 468825, 472412, 475300, 477889]
59980D77889K116J221L48k43r27k052l363m344m709m459l867l398l198k825j934
59965D46255r91o13n22M8J037J670J802K192L218M258M653M476M017L217J988
59950D76705O12n04j063q87j68K72l03j486k124j847j422j485j762j907k150k633
59934D57848k868k463j771j235n75O19K009K915L446M359N820O968O987O138N272
59919D93469M574L288R55j564k837k537j748j489j540j143k08Q26J825K918L849
59904D98638M154L933L738L747L571K921J954R84K91O6J95K56J97O34J971L635
59888E30885M843N727O761P545P266O249N809O413P169P391P542Q122Q562P977
59874F28261O380M552L127K166J360K61j317l009m269n003n464n567m996l961
$$ y = [477889, 480005, 481226, 481574, 481331, 480404, 478352, 474989, 470645, 465936, 461477, 457610, 454212, 451014, 448189, 446255, 445264, 444651, 444129, 444177, 445214, 446884, 448686, 450878, 454096, 458354, 463007, 467483, 471500, 474717, 476705, 477317, 476813, 475750, 474863, 474695, 474967, 474664, 473178, 471054, 469207, 467785, 466300, 464538, 462631, 460481, 457848, 454980, 452517, 450746, 449511, 448936, 449555, 451564, 454479, 457925, 462284, 468104, 475072, 482059, 488197, 493469, 498043, 501331, 502286, 500722, 497885, 495348, 493600, 492111, 490571, 489428, 489220, 490046, 491871, 494789, 498638, 502792, 506725, 510463, 514210, 517781, 520702, 522656, 523640, 523931, 523997, 524192, 524448, 524645, 525279, 527250, 530885, 535728, 541455, 548216, 555761, 563027, 569276, 575085, 581498, 588667, 596058, 603600, 611722, 620284, 628261, 634641, 639193, 642320, 644486, 645846, 646107, 644790, 641781, 637512, 632509, 627045, 621478, 616482, 612521]
59860F12521l215l195l709m477n281n572m835l500k693k771k868k127o16J246
59846E68908L329N412O941P749Q338Q924Q764P129M456J948M23jN38J752L058
59831F37668L917M241M177L628K246r0k984n622p242p699p606p644p846p856p686
59816E93602p634p615p265o682o351o293o044n554n309n287m758l505k402k192
59802E16711k419k251j760j652k045k339k110j587j249j387j937k460k355j443
59788D89717k37N65P61O68O30O91O75M29M7j91j36P1K48M40O92Q04O88O90J102
59769D98354J530J403R19Q91J634K642L328L534L308K812K485K652K971K852K507
59754E33822K825M137N739O832P332P584P826Q138Q402Q266P574O788O454O355
$$ y = [612521, 609306, 606111, 602402, 597925, 592644, 587072, 582237, 578737, 576044, 573273, 570405, 568278, 567662, 568908, 572237, 577649, 584590, 592339, 600677, 609601, 618365, 625494, 629950, 631898, 632321, 632320, 632858, 634610, 637668, 641585, 645826, 650003, 653631, 655877, 655787, 652803, 647181, 639939, 632240, 624634, 616990, 609144, 601288, 593602, 585968, 578353, 571088, 564406, 558055, 551762, 545718, 540164, 534855, 529568, 524810, 521305, 518903, 516711, 514292, 512041, 510281, 508629, 506584, 504245, 502135, 500548, 499299, 497912, 495975, 493515, 491160, 489717, 489480, 490045, 490806, 491474, 492104, 492795, 493470, 493899, 493946, 493755, 493619, 493690, 493938, 494378, 495070, 495874, 496562, 497252, 498354, 499884, 501287, 502206, 503097, 504731, 507373, 510701, 514235, 517543, 520355, 522840, 525492, 528463, 531315, 533822, 536647, 540784, 546523, 553355, 560687, 568271, 576097, 584235, 592637, 600903, 608477, 615265, 621719, 628074]
59740F28074N912N238M910M798M086K621J222M65M1m24q15j068j399j697j551
59725F50413j186j444k423l047k475j222m45p51k027l654m646m327l223k497k405
59710F14641k246j899k098k793k744j452j47J4m52n83n71r25j042q6J409K154
59694F01180J967J741J910K047J790J156J92q66j346r26m17p80j618j706q46j68
59678F03310n59j716k893l794m428m729m665m417m237m278m498m622m374l871
59664E50229l501l249k621j466l91N7J01K66O08Q96J094J243J294J443K140L298
59648E51441M057L823K993K114J017n15j877k393k494l176m489n417n257m355
59634E35472l471k975k729k363j676r65p49j028j252j242j515k315l007l055k898
$$ y = [628074, 633986, 639224, 644134, 648932, 653018, 655639, 656861, 657326, 657367, 656943, 656128, 655060, 653661, 651964, 650413, 649227, 647783, 645360, 642313, 639838, 638616, 638171, 637420, 635393, 631739, 627093, 622766, 619543, 617046, 614641, 612395, 610496, 608398, 605605, 602861, 601409, 601262, 601276, 600824, 600241, 599670, 598745, 597703, 597617, 599026, 601180, 603147, 604888, 606798, 608845, 610635, 611791, 611983, 611117, 609771, 608845, 608428, 607648, 606030, 604324, 603478, 603310, 602751, 601035, 598142, 594348, 589920, 585191, 580526, 576109, 571872, 567594, 563096, 558474, 554100, 550229, 546728, 543479, 540858, 539392, 539001, 539058, 539159, 539425, 540033, 540929, 542023, 543266, 544560, 546003, 548143, 551441, 555498, 559321, 562314, 564428, 565445, 564930, 563053, 560660, 558166, 554990, 550501, 545084, 539827, 535472, 532001, 529026, 526297, 523934, 522258, 521293, 520544, 519516, 518264, 517022, 515507, 513192, 510185, 507130, 504232]
59619E04232l099l236k540j298o23j018j918k573k671k202j331m14L84J281K291
59604D85265K820K416J643J484K066K568K314J386K77n56q43o37k61J09N42R11
59588E01504Q04J96l01l17l09p52j235j063l95q2n80j523k213k136j363o81q86
59571D88668j677j917j332j052j811k527j773N7J219R11l7n74n07j74Q0L5k32
59554D77357l11k0K40J04j43j03L6rP2P15J713K608L468M540N575O324P287R130
59536E18583J1668J4289J6903J9400K0469J8245J2399M814j969o430q343q242
59524F11786o875m791k309O7J557J831J343N79n68k188l787m894n768o758p533
59509E71692p658p368p134o920o626o544o702o412n363m412m328m456l727k363
$$ y = [504232, 501133, 497897, 495357, 494059, 493436, 492418, 490500, 487927, 485256, 483054, 481723, 481309, 481693, 482974, 485265, 488085, 490501, 492144, 493628, 495694, 498262, 500576, 501962, 502239, 501683, 500840, 500203, 499942, 500051, 500593, 501504, 502308, 502504, 502203, 501886, 501577, 500825, 499590, 498527, 498132, 498050, 497470, 495947, 493734, 491598, 490235, 489554, 488668, 486991, 485074, 483742, 482690, 480879, 478352, 476579, 476636, 477855, 478766, 478729, 478155, 477648, 477474, 477554, 477589, 477357, 477046, 477026, 477266, 477370, 477227, 477124, 477160, 477151, 477223, 477938, 479651, 482259, 485727, 490267, 495842, 502166, 509453, 518583, 530251, 544540, 561443, 580843, 601312, 619557, 631956, 636770, 634801, 628371, 620028, 611786, 604911, 600120, 597811, 597878, 599435, 601266, 602609, 603188, 602620, 600432, 596645, 591751, 585983, 579225, 571692, 564034, 556666, 549532, 542612, 535986, 529442, 522740, 516328, 510965, 506553, 502225, 497769, 494042, 491679]
59495D91679j384j021p62n07m07j28N85J058O84K06O43J549J814J667K188L192
59479E01056L465K909K639K889K732K162K517M301O133O590N763M456L075J930
59465E52617J434J408J146O07N37J079J425J303J596K871M342N010M992N073N646
59450E91086O604P599Q005P266N684M241L348K447R28j198l645o063p851q560
59436F09891q553q426p870o166l703j766p13K82J407J659P44J30J297L860O312
59421E88385P882Q922J0077J1766J3992J6198J7720J8603J9458K0455K1265K2053
59409G76776K3321K4320K2776J6975P673k545j1095j6323j7620j5562j1482o399
59397G90815n86N512J0442J2217R511K608o342j4263j9182k1400k2176k1698j9429
$$ y = [491679, 490295, 489274, 488512, 488005, 487598, 487470, 488055, 489113, 489797, 490003, 490646, 492195, 494009, 495676, 497864, 501056, 504521, 507430, 510069, 512958, 515690, 517852, 520369, 524670, 530803, 537393, 543156, 547612, 550687, 552617, 554051, 555459, 556605, 557212, 557749, 558828, 560253, 561556, 563152, 566023, 570365, 575375, 580367, 585440, 591086, 597690, 605289, 613294, 620560, 626244, 630485, 633833, 636280, 637208, 636010, 632365, 626302, 618451, 609891, 601338, 592912, 585042, 578876, 575173, 573407, 572694, 572976, 574383, 576042, 576786, 576916, 578213, 582073, 588385, 596267, 605189, 615266, 627032, 641024, 657222, 674942, 693545, 713003, 733458, 754723, 776776, 800097, 824417, 847193, 864168, 871841, 869296, 858201, 841878, 824258, 808696, 797214, 790815, 790229, 795741, 806183, 818400, 827911, 830519, 824177, 809914, 790732, 769332, 747156, 725458, 706029]
59384G06029j5973j2977j1020r127o778m959m532m798m528l490k217j068k20P4
59370F24416j32l50k65NL85R31J412J610K014L232M720N287M893M699N185N695
59354F63737O089P249R411J1501J2814J3965J5389J6411J6612J6707J7055J6710
59342H23650J5077J3155J1891J0576Q226N472L419J614j175m756p773r820j1801
59329H57755j4262j6708j8560j9665j9865j9014j7522j6070j4775j3343j1899
59318F76072j0938j0465r873q804p617o870o720o834o751o257n500m629l548k323
59304E78943j495j335j057L45K580M414N539O905R036J1272J3003J4252J4501
59291F56903J2371P377J018m763r192j2127j3180j2406j0926r651q206n976l401
$$ y = [706029, 690056, 677079, 666059, 656932, 650154, 645195, 640663, 635865, 631337, 627847, 625630, 624562, 624342, 624416, 624284, 623934, 623669, 623674, 624059, 624990, 626402, 628012, 630026, 633258, 637978, 643265, 648158, 652857, 658042, 663737, 669826, 677075, 686486, 697987, 710801, 724766, 740155, 756566, 773178, 789885, 806940, 823650, 838727, 851882, 863773, 874349, 882575, 888047, 891466, 893080, 891905, 887149, 879376, 869556, 857755, 843493, 826785, 808225, 788560, 768695, 749681, 732159, 716089, 701314, 687971, 676072, 665134, 654669, 644796, 635992, 628375, 621505, 614785, 607951, 601200, 594943, 589443, 584814, 581266, 578943, 577448, 576113, 575056, 575401, 577981, 582395, 587934, 594839, 603875, 615147, 628150, 642402, 656903, 669274, 676651, 677669, 672906, 663714, 651587, 638407, 626001, 615075, 605424, 597218, 591242, 587841]
59278E87841j228P18K922N103O762Q173R748J1118J1932J2847J4554J6316J6728
59265G03534J5549J3696J1742R566P243N127L097O89j989m263n752o610p020p039
59251G37570o850o553n913m744l353k194j320n68L9M91R76J595K232K938L918
59236G18264M942N404N214M899M546L531J593p50l153n757q160r378r484r968
59222G01743j1568j2988j2882j1879j1387j1322j0551q913p347o365n579m617
59210E86345l562k669k238k387k548j839m69K58r1k24Q85K345K850K612K518K419
59194E84205J763J083J249J875K007J772J862J998J482Q18J066J876J862Q16l9
59179F05695nL06K76M9j77m50n27m1P12J142J458K389L806M685M605M281M363
$$ y = [587841, 586613, 587331, 590253, 595356, 602118, 610291, 620039, 631157, 643089, 655936, 670490, 686806, 703534, 719083, 732779, 744521, 754087, 761330, 766457, 769554, 770243, 768254, 763991, 758239, 751629, 744609, 737570, 730720, 724167, 718254, 713510, 710157, 707963, 706643, 706075, 706114, 706605, 707581, 709176, 711408, 714346, 718264, 723206, 728610, 733824, 738723, 743269, 746800, 748393, 747643, 744490, 738733, 730573, 721195, 711711, 701743, 690175, 677187, 664305, 652426, 641039, 629717, 619166, 610253, 602906, 596541, 590962, 586345, 582783, 580114, 577876, 575489, 572941, 571102, 570633, 570891, 570800, 570576, 571461, 573806, 576656, 579268, 581786, 584205, 585968, 587051, 588300, 590175, 592182, 593954, 595816, 597814, 599296, 600114, 601180, 603056, 604918, 605734, 605695, 605690, 605996, 606272, 606321, 606144, 605694, 605167, 605126, 605838, 606980, 608438, 610827, 614633, 619318, 623923, 628204, 632567]
59162F32567M539M092K814J173j13p50j313k726n054p311q768r683j0318j0237
59148E88912r238q006p045n949m632m181n246o607o670n556m427l607k843k611
59134E12294l401m312m005k675j562r44j78P64J372J867K784L670L836L972N263
59119E18745P167P998P577P401Q135Q813Q843Q890R379R753R776R990J0369R945
59105F42781Q384O693N717N051M007K681J448L33o51j307j719k332l263m130m558
59090F59135m332l217j427k6N0p88j372j363j318j538j928k714m178n806o820
59075F22358p300p786q059p571o697o310o288n797m839m253m257m290m127l949
59061E40835l544k723k168k536l076k603j468j025j414j635j449j411j223q6J329
$$ y = [632567, 637106, 641198, 644012, 645185, 645072, 644322, 643009, 640283, 635229, 627918, 619150, 609467, 599149, 588912, 579674, 571668, 564623, 558674, 554042, 549861, 544615, 538008, 531338, 525782, 521355, 517748, 514905, 512294, 508893, 504581, 500576, 497901, 496339, 495395, 495217, 495981, 497353, 499220, 502004, 505674, 509510, 513482, 518745, 525912, 533910, 541487, 548888, 557023, 565836, 574679, 583569, 592948, 602701, 612477, 622467, 632836, 642781, 651165, 657858, 663575, 668626, 672633, 675314, 676762, 677095, 676444, 675137, 673418, 671086, 667823, 663693, 659135, 654803, 651586, 650159, 650133, 650183, 649395, 648023, 646660, 645342, 643804, 641876, 639162, 634984, 629178, 622358, 615058, 607272, 599213, 591642, 584945, 578635, 572347, 566550, 561711, 557458, 553201, 548911, 544784, 540835, 537291, 534568, 532400, 529864, 526788, 524185, 522717, 521692, 520278, 518643, 517194, 515783, 514560, 514474, 515803]
59046E15803J409K12m63K2L33l13q41l81K71K21q5Q8O01J160J936K737K805K150
59028E27665J975L095M940O607P953R231J0615J2354J4373J5648J5103J3227J1477
59015F54263J0115Q112N182K254k49k844n377o721o591o036n636m832l470k342
59001F35828j577j86K162M406N721O390O590O011N148N130N691N188L361K015
58987F91878K047J894J56k138l324l446l318k724j193O75K131L496N184O535O906
58972G04759O956P687R137J0996J3410J6016J7398J6784J5341J4624J4585J4221
58960H61914J3258J2064J0703R112P472N532K473j777o020r392j2370j5344j7469
58947H60156j8098j8121j8605j9098j8611j7312j5954j4388j2039r297p142n833
$$ y = [515803, 517212, 517424, 516961, 516983, 517316, 517003, 516162, 515781, 516052, 516273, 516188, 516276, 516877, 518037, 519973, 522710, 525515, 527665, 529640, 532735, 537675, 544282, 552235, 561466, 572081, 584435, 598808, 614456, 629559, 642786, 654263, 664378, 672490, 677672, 679926, 679677, 676833, 671456, 664735, 658144, 652108, 646472, 641640, 638170, 635828, 634251, 634065, 636227, 640633, 646354, 652744, 659334, 665345, 670493, 675623, 681314, 686502, 689863, 691878, 693925, 695819, 695975, 693837, 690513, 687067, 683749, 681025, 679832, 680507, 682638, 686134, 691318, 697853, 704759, 711715, 719402, 728539, 739535, 752945, 768961, 786359, 803143, 818484, 833108, 847693, 861914, 875172, 887236, 897939, 907051, 914523, 920055, 922528, 920751, 914731, 905339, 892969, 877625, 860156, 842058, 823937, 805332, 786234, 767623, 750311, 734357, 719969, 707930, 698633, 691491, 685658]
58935F85658m870l838k515p69R13J551J044N73Q84J190N78m60r54r41r76r99p79
58918F75290p85j534k571l057k806k068r68J54O16L47K25Q08J599K172L032M619
58902F75073O473Q145R885J1698J2867J3232J3704J4639J4974J4120J3419J4363
58890H22592J6503J8420J9842K1337K2767K3461K3356K2705K1205J8540J5239
58879A045967J1952Q481M493N43k665n395q330j1476j4405j6936j8742j9118j7941
58866I56428j6100j4220j1895r030o795o160o420o289n780n822o761q155r469
58853H43532j0169r883r156r157r935j0049q706p084o619p171p863q535r231r425
58839G20549q949q649r034r348q975q592q780q792p959p043o770o248m442k113
$$ y = [685658, 680788, 676950, 674435, 673666, 674579, 676130, 677174, 677747, 678631, 679821, 680399, 679939, 678985, 678044, 677068, 676069, 675290, 674505, 672971, 670400, 667343, 664537, 662469, 661501, 661655, 662271, 662618, 662843, 663651, 665250, 667422, 670454, 675073, 681546, 689691, 699576, 711274, 724141, 737373, 751077, 765716, 780690, 794810, 808229, 822592, 839095, 857515, 877357, 898694, 921461, 944922, 968278, 990983, 1012188, 1030728, 1045967, 1057919, 1066400, 1070893, 1071436, 1068771, 1063376, 1055046, 1043570, 1029165, 1012229, 993487, 974369, 956428, 940328, 926108, 914213, 905183, 898388, 892228, 885808, 879519, 873739, 867917, 861156, 853001, 843532, 833363, 823480, 814324, 805167, 795232, 785183, 776477, 769393, 762774, 755603, 747740, 739205, 729974, 720549, 711600, 702951, 693917, 684569, 675594, 667002, 658222, 649430, 641471, 634428, 627658, 621410, 616968, 614855]
58825F14855p34k98K67J283K342L350M279M677M553M829N863O597O288N792N881
58810F69824N690M322K660J887J463L34j023j590j803k649l700l923l644l973
58796F63875m974o068p327q731r159p959o572o735p847q004o770n028l005n65
58782E75131J323J608J170J740L216M065L939L905M350M482L690J913r24m360
58768F05248o865p473p221p442p565o438m816m354m808m495l089j744q32L59J918
58753E40383L208M153M874M592K789Q24L88R48Q67L32Q52K358L350L676M642O368
58737E84604P380P050O253N525M586L758L891M738N225N290N665O089N654M684
58723F60392M262M171L394K377K577L930M970N395O214P456Q066Q088Q566R206
$$ y = [614855, 614121, 613823, 614090, 615373, 617715, 621065, 625344, 630021, 634574, 639403, 645266, 651863, 658151, 663943, 669824, 675514, 679836, 682496, 684383, 685846, 686180, 685157, 683567, 681764, 679115, 675415, 671492, 667848, 663875, 658901, 652833, 645506, 636775, 627616, 619657, 613085, 606350, 598503, 590499, 583729, 578701, 575696, 575131, 576454, 578062, 579232, 580972, 584188, 588253, 592192, 596097, 600447, 604929, 608619, 610532, 609608, 605248, 598383, 590910, 583689, 576247, 568682, 562244, 557428, 553074, 548266, 543771, 540682, 538938, 538106, 538465, 540383, 543591, 547744, 552618, 557210, 559999, 560823, 561211, 562159, 563026, 563358, 564210, 566568, 569918, 573594, 578236, 584604, 591984, 599034, 605287, 610812, 615398, 619156, 623047, 627785, 633010, 638300, 643965, 650054, 655708, 660392, 664654, 668825, 672219, 674596, 677173, 681103, 686073, 691468, 697682, 705138, 713204, 721292, 729858, 739064]
58709G39064Q464O226M086K642Q05j911m628p013r754j2734j4877j6213j7934
58696F76223j9923k0417j8767j6525j5108j4168j2917j1352r614p670o041n380
58684E18341n205m557l801l978m593m168k854k270k678k695j999j812k291j896
58670D73544n1J863K899L842N409P172Q946J1279J3828J5111J4530J2884J0514
58657E81770O836K200j838m636o911q714r007p913p168p572p951p339o343n581
58643E09833m710l620k917k527j568q2Q58J116J638K447K583K289K903M142M027
58628E16412K199P42P87P66o80k424k869k259j577q18K54J157J712K625M162N538
58612E25727O341P114P982Q140P246N827L992J466q84j533p18l40j077j672j517
$$ y = [739064, 747528, 753754, 757840, 760482, 761287, 759376, 754748, 747735, 737981, 725247, 710370, 694157, 676223, 656300, 635883, 617116, 600591, 585483, 571315, 558398, 547046, 537432, 529762, 523721, 518341, 513136, 508579, 504778, 500800, 496207, 492039, 489185, 486915, 484237, 481542, 479543, 477731, 475440, 473544, 473493, 475356, 478255, 482097, 487506, 494678, 503624, 514903, 528731, 543842, 558372, 571256, 581770, 588606, 590806, 588968, 584332, 577421, 568707, 559700, 551787, 544619, 537047, 529096, 521757, 515414, 509833, 505123, 501503, 498586, 496059, 494491, 494409, 495267, 496383, 498021, 500468, 503051, 505340, 508243, 512385, 516412, 518611, 519353, 520140, 520906, 520226, 517802, 514933, 512674, 511097, 510279, 510533, 511690, 513402, 516027, 520189, 525727, 532068, 539182, 547164, 555304, 562550, 568377, 572369, 573835, 572951, 571418, 570700, 570360, 569283, 567611, 566094]
58597E66094j602k299k508j790j210j226q98J00Q23J194K564N220P558Q639R395
58582E90054J0489J1127J0961J0918J1172J0435Q350O486N954N973N759N724O060
58569F99462O230O734R051J2953J6249J8114K0290K3912K7603K9968L1446L2448
58557I34460L1876K8996K4690J9617J3219N765p77n107p858r574r654q344p324
58544A009985p237o935o195o747r408j2653j5281j7986k1082k3220k3727k3779
58532H35735k3887k2730j9795j6646j4236j1609q531o644o548o419n143m008l881
58519F85658l539k455k222l412m009k957k208l215m254l555k235j799j502n81
58505F47715m01j856l133k620j590j592j629m14Q93Q23K42M35P00J70q6Q95J994
$$ y = [566094, 564492, 562193, 559685, 557895, 556685, 555459, 554561, 554661, 555484, 556678, 559242, 564462, 572020, 580659, 590054, 600543, 611670, 622631, 633549, 644721, 655156, 663506, 669992, 675946, 681919, 687678, 693402, 699462, 705692, 712426, 721477, 734430, 750679, 768793, 789083, 812995, 840598, 870566, 902012, 934460, 966336, 995332, 1020022, 1039639, 1052858, 1058623, 1057846, 1052739, 1044881, 1035307, 1025653, 1017309, 1009985, 1002748, 995813, 989618, 982871, 973463, 960810, 945529, 927543, 906461, 883241, 859514, 835735, 811848, 789118, 769323, 752677, 738441, 726832, 718301, 711657, 705109, 698690, 693547, 689539, 685658, 682119, 679664, 677442, 674030, 670021, 667064, 664856, 661641, 657387, 653832, 651597, 649798, 648296, 647715, 647314, 645458, 642325, 639705, 638115, 636523, 634894, 634480, 635373, 636196, 636438, 636873, 637573, 637743, 637657, 638552, 640546]
58488F40546K230K754M504O247O988P877R705J1089J1320J2194J4719J6899J7179
58475G64251J7091J7828J7386J3984R429N853K120l310q687j1623j2893j4155
58463G97274j4378j2072q679o270m048o02K695M110N123P972J1613J3678J4438
58450H10854J5281J5224J2582Q355M445L56m954r824j2033j2443j3132j3700j2740
58437G88271j1023r849q209n006k009j087o92J292L498L716L364N117Q072R500
58423G84955R599J0287J0944R683P372O098N001J824k615n614p069q800j0554
58410H11111j0684r744r607j0003r439q447q443q681p731o414n939m990k170O55
58396G09474J210R03K141L831L744L149M420O114N198K534J343J758J579R97J841
$$ y = [640546, 642776, 645530, 650034, 656281, 663269, 671146, 680851, 691940, 703260, 715454, 730173, 747072, 764251, 781342, 799170, 816556, 830540, 839969, 845822, 847942, 844632, 835945, 824322, 811429, 797274, 782896, 770824, 762145, 755875, 751827, 751225, 753920, 758030, 763153, 771125, 782738, 796416, 810854, 826135, 841359, 853941, 862296, 866741, 867097, 862143, 852319, 840286, 827843, 814711, 801011, 788271, 777248, 767399, 759190, 754184, 752175, 751088, 750396, 751688, 755186, 758902, 762266, 767383, 775455, 784955, 794554, 804841, 815785, 825468, 832840, 838938, 843939, 845763, 843148, 837534, 830465, 821665, 811111, 800427, 790683, 781076, 771073, 761634, 753187, 744744, 736063, 728332, 721918, 715979, 710989, 708819, 709474, 710684, 711587, 713728, 717559, 721303, 724452, 728872, 734986, 740184, 742718, 744061, 745819, 747398, 748395, 750236]
58381G50236L439L834L726M850N899M737K904L330N093N345M731N932Q341R272
58367H21669R081J0113J1882J2264J2016J3186J4605J3981J2767J3755J5524J4791
58355I75634J2429J1520J1112Q004L240P27N32l90j972j600J37M05j52J361M133
58340A025120N015M766O657R873J0781R883J0945J3984J5590J5617J6858J8685
58328A163774J7733J4507J2793J2764J1207Q031O078N022K149j317j500J017K103
58315A254361J551K721N377O084N275O656R899J1119J0275J0874J2803J2817J1569
58302A361381J2674J5324J5426J3507J3699J5596J5210J3253J4032J6755J6670
58291A523527J4332J4805J8046J9147J7869J8665K1455K1876K0576K2556K7265
$$ y = [750236, 753675, 757509, 761235, 766085, 771984, 776721, 779625, 782955, 788048, 793393, 798124, 804056, 812397, 821669, 830750, 840863, 852745, 865009, 877025, 890211, 904816, 918797, 931564, 945319, 960843, 975634, 988063, 999583, 1010695, 1018699, 1021939, 1022666, 1023198, 1022808, 1020836, 1019236, 1019373, 1019778, 1019626, 1020987, 1025120, 1030135, 1034901, 1041558, 1051431, 1062212, 1072095, 1083040, 1097024, 1112614, 1128231, 1145089, 1163774, 1181507, 1196014, 1208807, 1221571, 1232778, 1240809, 1246887, 1251909, 1254058, 1252741, 1251241, 1252258, 1254361, 1255912, 1258633, 1264010, 1270094, 1275369, 1282025, 1291924, 1303043, 1313318, 1324192, 1336995, 1349812, 1361381, 1374055, 1389379, 1404805, 1418312, 1432011, 1447607, 1462817, 1476070, 1490102, 1506857, 1523527, 1537859, 1552664, 1570710, 1589857, 1607726, 1626391, 1647846, 1669722, 1690298, 1712854, 1740119]
58280A740119K9280K8906L1950L8700M3366M4771M7053M9440M6339L8436L2907
58269B171267L1725L0482K9186L2703L9838M3756M4304M8049N5193N8836N8205
58258B643544N9942O4865O6402O3726O3381O6236O6188O3322O4689P0355P2902
58247C365552P2247P6379Q5702R2048R4884J02549J15330J24010J27521J34843
58237D391065J46852J54138J55852J62128J74608J83633J88212J98850K16740
58228E972078K30944K40161K55787K79092K98155L12064L34253L66640L95637
58219H684811M19485M53013M98920N42285N80592O29895O93661P56729Q18561
58210A4077952Q99276J003645J114598J232279J381519J570265J782668K025639
$$ y = [1740119, 1769399, 1798305, 1830255, 1868955, 1912321, 1957092, 2004145, 2053585, 2099924, 2138360, 2171267, 2202992, 2233474, 2262660, 2295363, 2335201, 2378957, 2423261, 2471310, 2526503, 2585339, 2643544, 2703486, 2768351, 2834753, 2898479, 2961860, 3028096, 3094284, 3157606, 3222295, 3292650, 3365552, 3437799, 3514178, 3599880, 3691928, 3786812, 3889361, 4004691, 4128701, 4256222, 4391065, 4537917, 4692055, 4847907, 5010035, 5184643, 5368276, 5556488, 5755338, 5972078, 6203022, 6443183, 6698970, 6978062, 7276217, 7588281, 7922534, 8289174, 8684811, 9104296, 9557309, 10056229, 10598514, 11179106, 11809001, 12502662, 13259391, 14077952, 14977228, 15980873, 17095471, 18327750, 19709269, 21279534, 23062202, 25087841]
58202B5087841K337036K734994L210371L785999M530175N497628O720327Q269151
58194F2173522J0241225J2662167J5500956J8821773K2799536K7495093L2668951
58187B02363223L7765323M1774200M2957511L9164745K9186132J4150189k624121
58180D04737202j7434399k7993568l3812015l5511945l4209485l1260160k7922977
58173A96592653k4908339k2290740j9885242j7598656j5438266j3399029j1479866
58166G1592515r734226q216714o920943n816188m896641m153277l542286l021758
58158B5290482k585809k233257j937428j674510j449775j270161j119498r83054
58150A2036990q68818p83320p11911o42279n82952n40401n01260m54764m10642
$$ y = [25087841, 27424877, 30159871, 33370242, 37156241, 41686416, 47184044, 53904371, 62173522, 72414747, 85076914, 100577870, 119399643, 142199179, 169694272, 202363223, 240128546, 281902746, 324860257, 364025002, 393211134, 407361323, 404737202, 387302803, 359309235, 325497220, 289985275, 255775790, 224515630, 196592653, 171684314, 149393574, 129508332, 111909676, 96471410, 83072381, 71592515, 61858289, 53641575, 46720632, 40904444, 36007803, 31854526, 28312240, 25290482, 22704673, 20471416, 18533988, 16859478, 15409703, 14139542, 13020044, 12036990, 11168172, 10384852, 9672941, 9030662, 8447710, 7907309, 7406049, 6951285, 6540643]
58141F540643l78041l47774l11477k78145k55832k35995k11309j90933j83102
58132D148035j79410j70702j62461j60627j57620j46359j33810j27514j22040
58123B787492j11242j00998r7546r5420q8488q1396p9212p7106p0675o5362o5582
58112A854465o5473o0045n4615n3823n2336m5911m0769m2226m4510m1577l7842
58101A315338l8577l9558l6085l2570l3277l2571k4496j3629o823k185M179Q442
58089A068188N880L06k610m844j0192j5555j6805j6983k0236k3558k2713k0532
58077I20346k1338k2896k1602j9970k1332k2676k0374j7558j8370k0148j8621
58066F95461j5723j5066j4748j1849r017r487j0384q003m981n396p350p254o842
$$ y = [6540643, 6162602, 5814828, 5503351, 5225206, 4969374, 4733379, 4522070, 4331137, 4148035, 3968625, 3797923, 3635462, 3474835, 3317215, 3170856, 3037046, 2909532, 2787492, 2676250, 2575252, 2477706, 2382286, 2293798, 2212402, 2133190, 2056084, 1985409, 1920047, 1854465, 1788992, 1728947, 1674332, 1620509, 1568173, 1522262, 1481493, 1439267, 1394757, 1353180, 1315338, 1276761, 1237203, 1201118, 1168548, 1135271, 1102700, 1078204, 1064575, 1057752, 1055567, 1059746, 1068188, 1074068, 1074374, 1071764, 1066920, 1056728, 1041173, 1024368, 1007385, 987149, 963591, 940878, 920346, 899008, 876112, 854510, 834540, 813208, 790532, 770158, 752600, 734230, 714082, 695461, 679738, 664672, 649924, 638075, 629058, 619571, 609187, 601184, 596203, 590807, 583457, 576203, 569361]
58053E69361r133j1785j1326r703j0095j0471p891m942n221o515n064k673k963
58040D71579m430l762k488l737n864n626m397n015n862m306k614m191p086p470
58026D04731o495p439r054q075n576m776n022l875k604l709n459m716k816l019
58012C32096m487m333l244l530m065k667j071j964l516k476k68k95j557q00J130
57997B98953J097j79L26J884J485j46J78K024K200O42M5N39M7j021n20P65J97
57980C08516j760k435j853k140k974k331q60q48j665q36J157J654O19L15R19P59
57964B96237O2L37R00Q9j016l06J060L32j880k689k049k378l828m318l652l518
57948B73383l878l326k300k162k005k71J626J301n1N75K775L729L388M156O110
$$ y = [569361, 560228, 548443, 537117, 527414, 517319, 506848, 498957, 494015, 488794, 482279, 477215, 474542, 471579, 467149, 463387, 460899, 457162, 451298, 445672, 441275, 436260, 430398, 426092, 423478, 419287, 412201, 404731, 398236, 390797, 381743, 373668, 368092, 363316, 358294, 354419, 351815, 348106, 342647, 337931, 335115, 332096, 327609, 323276, 320032, 316502, 312437, 309770, 308699, 306735, 303219, 300743, 300475, 300180, 298623, 297823, 298953, 300050, 299871, 300197, 302081, 303566, 303420, 303598, 305622, 307822, 308464, 308509, 309048, 309095, 308074, 307554, 308319, 308516, 306756, 304321, 302468, 300328, 297354, 295023, 294163, 293315, 291650, 290814, 291971, 293625, 294244, 294559, 295478, 296237, 296299, 296636, 297536, 297625, 296609, 296303, 297363, 297695, 295815, 293126, 291077, 288699, 284871, 280553, 276901, 273383, 269505, 266179, 263879, 261717, 259712, 259441, 261067, 262368, 262317, 262892, 265667, 269396, 272784, 276940, 283050]
57933B83050P135P288Q470J0112R670P255N432M601K770j95k275l201m644o578
57919C28890p347p232q014r153q395o056m788n159n317m807m849m929l218l39
57905B49287J176J161J641K574J883k51j332r77j301k507k334l57J135J237J591
57890B52626K779L283K734K634L209L008K177K560M012M179K586J387J388Q96
57876B89458o80j655j451j752l210m135l446k102q62N91J667J066n75j115m23
57861B71376m30j490j892j324j276j613l59K346L777L076K616L824N020M733L889
57846B92273L363K413R46M32J204J491M87l44j32q1r26j502j024l79r3N88J665
57829C00381J896J116O72P80L8j745k907k757k425k326j592n62q81k372k903k100
$$ y = [283050, 290185, 297473, 305943, 316055, 325725, 332980, 338412, 343013, 345783, 345588, 343313, 340112, 335468, 328890, 321543, 314311, 306297, 297144, 288749, 282693, 277905, 272746, 267429, 262622, 257773, 252844, 249626, 249287, 250463, 251624, 253265, 255839, 257722, 257471, 256139, 255162, 253861, 251354, 249020, 248663, 249798, 251035, 252626, 255405, 258688, 261422, 264056, 267265, 270273, 272450, 275010, 279022, 283201, 285787, 287174, 288562, 289458, 288778, 287123, 285672, 283920, 280710, 276575, 273129, 271027, 270165, 270756, 272423, 273489, 272914, 271799, 271376, 270946, 269456, 267564, 266240, 264964, 263351, 262992, 265338, 269115, 272191, 274807, 278631, 283651, 288384, 292273, 295636, 298049, 298995, 299427, 300631, 302122, 302609, 302265, 302133, 302052, 301126, 299624, 298600, 298221, 298128, 298716, 300381, 302277, 303393, 304065, 304845, 304883, 303138, 300231, 297474, 295049, 292723, 291131, 290569, 289688, 287316, 284413, 282313]
57813B82313j965k964k967j286l38j695l748m904o022p846r013q535p642p228
57799B16160o132l828k255k885m249m373l580l040k586j756j178j182q36K13Q25
57784A79318N21N41J484K125J933K431M491O479O764O053N628N298M663M421M786
57769B36936M554L239K171K062J611N3j146q54l50r66j747j375n28l48l35K72
57753B43249P67N41O89K102L494L316K181J493J153M65j6L84P32j27j515k027
57737B56881j770j786k148k227k122k289k461k176j662j195m50N95J139Q19M64
57722B39612P42J221J509J963K544K407J406N87L94J1p59p82L06J119P29O8M9
57705B53126N8n12r76q36q58j450j680j083p03j139j436j067j124k247l277l329
$$ y = [282313, 280348, 277384, 274417, 273131, 272793, 271098, 267350, 262446, 256424, 248578, 239565, 231030, 223388, 216160, 210028, 206200, 203945, 201060, 196811, 192438, 188858, 185818, 183232, 181476, 180298, 179116, 178280, 178493, 179318, 179839, 180380, 181864, 183989, 185922, 188353, 192844, 199323, 206087, 212140, 217768, 223066, 227729, 232150, 236936, 241490, 244729, 246900, 248962, 250573, 250626, 249480, 248626, 248276, 247310, 245563, 244188, 243660, 243312, 242977, 243249, 244016, 244557, 245246, 247348, 250842, 254158, 256339, 257832, 258985, 259450, 259434, 259818, 260550, 260423, 258908, 256881, 255111, 253325, 251177, 248950, 246828, 244539, 242078, 239902, 238240, 237045, 236595, 237190, 238329, 239148, 239612, 240354, 241575, 243084, 245047, 247591, 249998, 251404, 251991, 252385, 252396, 251637, 250855, 251161, 252280, 253009, 253077, 253126, 253184, 252672, 251696, 250860, 250002, 248552, 246872, 245789, 245086, 243947, 242511, 241444, 240320, 238073, 234796, 231467]
57689B31467l303l997m604m495m483m891m422k546r09o94o37N99K170L095M447
57674B06797P365J0780J3362J6078K0575K6588L3030M0126M8323N6365O2209O4299
57662F05897O0349M7304K5148q20k4012m1583n3648n9852n9746n5077m8596m1331
57650C54033l3442k6441k1848j8700j5138j1548r538q779p610o005n087m388k477
57637A83032J7Q64l40j698j970j712j480j025m42j89l9M34O32j21r53o02L18J80
57619A74906j005j773j694j622j779j557j056r82j147p86j51j65p50j065j012
57604A58362r71n83N10J322O69q02j463j128q32q38o52n47j148j946k090k064
57588A45799k804l653l298k257k196l122l359k326j246j050j362j662j852j717
$$ y = [231467, 228164, 224167, 219563, 215068, 210585, 205694, 201272, 198726, 197817, 197123, 196486, 197085, 199255, 202350, 206797, 214162, 224942, 238304, 254382, 274957, 301545, 334575, 374701, 423024, 479389, 541598, 605897, 666246, 713550, 738698, 737878, 713866, 672283, 618635, 558783, 499037, 443960, 395364, 354033, 320591, 294150, 272302, 253602, 238464, 226916, 217378, 208599, 200989, 194984, 189897, 185509, 183032, 183049, 183913, 183573, 181875, 179905, 178193, 176713, 175688, 175246, 175057, 175018, 175452, 176084, 175963, 175010, 174408, 174726, 174906, 173901, 172128, 170434, 168812, 167033, 165476, 164420, 163438, 162291, 161505, 161354, 161189, 160439, 159374, 158362, 157391, 156808, 157318, 158640, 159309, 158507, 157044, 155916, 155084, 154246, 153594, 153047, 151899, 149953, 147863, 145799, 142995, 139342, 136044, 133787, 131591, 128469, 125110, 122784, 121538, 120488, 119126, 117464, 115612, 113895]
57574A13895j202r89j477j793j226p62j490k430k063j084j285k350k367j131k92
57559I1954l77k01O30J097Q94Q62J106Q02J31K30J028J251Q23J060K139K562J636
57542A07627M05l86j240k173k071n58J178K105K384K206J244j74q99o60m37p41
57526A07810q83m57j26m10r10j193j330j231n76M03J115J565K122K503K218J710
57510A12330J689J747J089K60L96J109R93l7p90r32j127j280o70J93K9r56j357
57493A12686j088j359k155k178j417j295j876j529P2J140P22J5q3l34j025q78
57477I9418O12J915J850J349J459J463M01j139k201l001l996m648m372l557k668
57462H2885j483j49L88k06r64j188j365j732j499l42O37N43K4J13Q12J643K341
$$ y = [113895, 112693, 111704, 110227, 108434, 107208, 106446, 104956, 102526, 100463, 99379, 98094, 95744, 93377, 92246, 91954, 91577, 91376, 92006, 93103, 93997, 94859, 95965, 96767, 96898, 97128, 98156, 99407, 100230, 101290, 103429, 105991, 107627, 108032, 107646, 106406, 104233, 102162, 101604, 102782, 104887, 107271, 109477, 110721, 110547, 109648, 108988, 108551, 107810, 106927, 106470, 106344, 105934, 105024, 103831, 102501, 101270, 100694, 101097, 102212, 103777, 105899, 108402, 110620, 112330, 114019, 115766, 116855, 117115, 117511, 118620, 119613, 119576, 118786, 117854, 116727, 115447, 114777, 114970, 114999, 114043, 112686, 111598, 110239, 108084, 105906, 104489, 103194, 101318, 99789, 99861, 101001, 101723, 101738, 101655, 101321, 100296, 99418, 100030, 101945, 103795, 105144, 106603, 108066, 108467, 107328, 105127, 102126, 98130, 93482, 89110, 85553, 82885, 81402, 81253, 81641, 81435, 80471, 79283, 77918, 76186, 74687, 74345, 74982, 75525, 75549, 75662, 76474, 78117, 80458]
57445H0458K400J220n34j200l68N00L92L8J38J01m36n27L30R48L61m14J0J134
57427H4551J489Q20k0n76r17q77l06M30R53J370J691J547R83O11N22J15n58n07
57409I1321N23J447J554J519J902K022J235J19n37q45j043q22k00P2k68m93k69
57392I7237j67k08N31K026K742K000J225J627K294K007J409J702K520K799K650
57377A22394K743K725J907O89j02o03j222j464q21q8k85r70r98l47J66M00P44
57360A24868R80O63K05M02J162J821K282K780L053K785K475K791L408L547L281
57345A56503L343L839M055L427K115P70J28M52J076J056M17O8K72K81k14m53K3
57328A77158N59O11O61J154J608J568J368J316J143R08J260K132K488K068J947
$$ y = [80458, 82858, 84078, 83544, 82344, 81976, 82476, 82868, 82906, 83044, 83145, 82709, 82182, 82512, 83460, 83821, 83407, 83417, 84551, 86040, 86860, 86840, 86264, 85347, 84470, 84164, 84594, 85547, 86917, 88608, 90155, 91138, 91749, 92271, 92386, 91828, 91321, 91844, 93291, 94845, 96364, 98266, 100288, 101523, 101642, 101105, 100260, 99217, 98395, 98195, 98267, 97999, 97506, 97237, 97070, 96862, 97393, 99419, 102161, 104161, 105386, 107013, 109307, 111314, 112723, 114425, 116945, 119744, 122394, 125137, 127862, 129769, 130458, 130356, 129753, 128531, 127067, 126246, 126158, 125873, 124903, 123905, 123558, 123724, 124124, 124868, 125848, 126511, 126716, 127118, 128280, 130101, 132383, 135163, 138216, 141001, 143476, 146267, 149675, 153222, 156503, 159846, 163685, 167740, 171167, 173282, 174052, 174180, 174632, 175708, 176764, 177181, 177249, 177521, 177802, 177588, 177135, 177158, 177717, 178328, 178989, 180143, 181751, 183319, 184687, 186003, 187146, 188054, 189314, 191446, 193934, 196002, 197949]
57313A97949K602K968K368J809K237L029L469M130N395O183N713N134N697O628
57299B55311O541N752N321M972L926K891L140M294M905M753M778N203N464N609
57285C22860O217P095P500P379P243P198P182P515Q256Q708Q586Q755R645J0141
57271D34280R370Q407Q643R543R723R223Q914Q636P860P342Q093R425R922R755
57257E59136R989J0415J0156R855J0847J2561J3028J1925J0986J1309J2286J3227
57245F95720J4131J4707J4499J4155J4861J6404J7450J7711J8136J8885J8990
57234H75649J8229J7652J7924J8633J9374K0075K0236J9415J8545J9120K0977
57223A085829K2503K3136K3997K5731K7493K8593K9514L0797L2219L3606L5198
$$ y = [197949, 200551, 203519, 205887, 207696, 209933, 212962, 216431, 220561, 225956, 232139, 237852, 242986, 248683, 255311, 261852, 267604, 272925, 277897, 281823, 284714, 287854, 292148, 297053, 301806, 306584, 311787, 317251, 322860, 329077, 336172, 343672, 351051, 358294, 365492, 372674, 380189, 388445, 397153, 405739, 414494, 424139, 434280, 443650, 452057, 460700, 470243, 479966, 489189, 498103, 506739, 514599, 521941, 530034, 539459, 549381, 559136, 569125, 579540, 589696, 599551, 610398, 622959, 635987, 647912, 658898, 670207, 682493, 695720, 709851, 724558, 739057, 753212, 768073, 784477, 801927, 819638, 837774, 856659, 875649, 893878, 911530, 929454, 948087, 967461, 987536, 1007772, 1027187, 1045732, 1064852, 1085829, 1108332, 1131468, 1155465, 1181196, 1208689, 1237282, 1266796, 1297593, 1329812, 1363418, 1398616]
57212A398616L6837L7854L8115L8006L7341L5427L2494K9757K7915K6669K5832
57201A764863K5663K5961K6093K6142K6851K8303K9738L0814L1857L2949L3874
57190B083108L4877L6234L7255L7078L6267L6126L6593L6484L5755L5543L5828
57179B481148L5051L2666L0272K9340K9393K9242K8761K8498K8578K8798K9095
57168B810842K9345K9449K9805L0892L2239L2886L2861L3063L3583L3453L2308
57157C160726L0937K9770K8123K5588K2923K0925J9303J7298J4784J2300J0630
57146C393307J0541J2384J5737K0025K5350L2081L9931M8170N6308O3577O8352
57135C785763O9388O7257O3288N7571M9543L9998L0751K2584J5480J0749J0648
$$ y = [1398616, 1435453, 1473307, 1511422, 1549428, 1586769, 1622196, 1654690, 1684447, 1712362, 1739031, 1764863, 1790526, 1816487, 1842580, 1868722, 1895573, 1923876, 1953614, 1984428, 2016285, 2049234, 2083108, 2117985, 2154219, 2191474, 2228552, 2264819, 2300945, 2337538, 2374022, 2409777, 2445320, 2481148, 2516199, 2548865, 2579137, 2608477, 2637870, 2667112, 2695873, 2724371, 2752949, 2781747, 2810842, 2840187, 2869636, 2899441, 2930333, 2962572, 2995458, 3028319, 3061382, 3094965, 3128418, 3160726, 3191663, 3221433, 3249556, 3275144, 3298067, 3318992, 3338295, 3355593, 3370377, 3382677, 3393307, 3403848, 3416232, 3431969, 3451994, 3477344, 3509425, 3549356, 3597526, 3653834, 3717411, 3785763, 3855151, 3922408, 3985696, 4043267, 4092810, 4132808, 4163559, 4186143, 4201623, 4212372, 4223020]
57124D223020J5467K2880L0664L8267M5230N0033N1624N0844M9626M9919N3738
57113D681312O2756P6905R4290J13049J32622J53258J75564K00844K30912K67345
57103F188857L11821L66894M35399N19628O22740P50760R11496J111574J355725
57094A2574894J647884J990328K381203K813945L277601L754936M221545M651474
57086C7313810N025242N330802N558481N699808N749336N696882N510924N136073
57078H1021358M519964L650412K568108J345274N4437j245295k500941l654008
57070H5759309m640676n405276n915688o168965o186295o005056n672788n240813
57062D0523752m756000m255023l764274l302169k879797k501405k167136j875822
$$ y = [4223020, 4238487, 4261367, 4292031, 4330298, 4375528, 4425561, 4477185, 4528029, 4577655, 4627574, 4681312, 4744068, 4820973, 4915263, 5028312, 5160934, 5314192, 5489756, 5690600, 5921512, 6188857, 6500678, 6867572, 7302971, 7822599, 8445339, 9196099, 10107595, 11219169, 12574894, 14222778, 16213106, 18594309, 21408254, 24685855, 28440791, 32662336, 37313810, 42339052, 47669854, 53228335, 58928143, 64677479, 70374361, 75885285, 81021358, 85541322, 89191734, 91759842, 93105116, 93159553, 91914258, 89413317, 85759309, 81118633, 75713357, 69797669, 63628704, 57442409, 51437353, 45764565, 40523752, 35767752, 31512729, 27748455, 24446286, 21566489, 19065084, 16897948, 15022126]
57054A5022126j625029j410346j226539j069097r33941q16863p14553o25420n48362
57045F051976m81633m23668l73849l31352k94416k61723k33314k09113j87773
57036C255135j68125j50561j35668j22687j10459r8814q7732p6372o4190n1811
57026B188716l9583k6379j1016O501K5879M6189O2363O4261M3482J785m8836r4418
57014B218944j26435j42972j46368j40834j30353j17347j03253q9701p8039o8108
57004A075534n8785m9691m1394l4263k8102k2662j7655j2616p625l612j084Q47
56992G98892L266N903P847R188J0872J3405J6596K0069K3088K4498K3658K0789
56980I78071J5750P593l533j5150k4469l0751l4602l6004l4746l1918k9186k6943
$$ y = [15022126, 13397097, 11986751, 10760212, 9691115, 8757174, 7940311, 7225758, 6600338, 6051976, 5570343, 5146675, 4772826, 4441474, 4147058, 3885335, 3652021, 3442908, 3255135, 3087010, 2936449, 2800781, 2678094, 2567635, 2468821, 2381089, 2304717, 2240527, 2188716, 2149133, 2122754, 2111738, 2118239, 2144118, 2190307, 2252670, 2316931, 2360413, 2362198, 2313362, 2218944, 2092509, 1949537, 1803169, 1662335, 1531982, 1414635, 1311382, 1221681, 1143642, 1075534, 1016749, 967058, 925664, 891401, 863299, 840637, 822982, 810366, 802741, 799129, 798045, 798892, 802158, 808061, 815908, 825096, 835968, 849373, 865969, 886038, 909126, 933624, 957282, 978071, 993821, 1001414, 997881, 982731, 958262, 927511, 892909, 856905, 822159, 790241, 761055, 734112]
56968G34112k4550k1774j8678j4732r617m388l31K928O686J1070J5217J8912K2170
56955G17025K3454K0256J1867L20j1546k1815k9394l3688l4794l3277k9657k4652
56943E54099j9483j5046j1094p021k969O71M198Q048J1941J5707K0261K6405L3117
56930F18834L8165L9824L6942K8271J3749l766j9740l1190l7880m0790m0826l8881
56918E62712l5654l1329k6213k1451j8117j5970j4078j2274j0921r821q543p353
56906C50988o635n919m672l554l491l946l586k266j070n47k26L98J522L372N781
56891C26149P912R445J1428J4816J8883K2295K4836K6496K5835K1145J2914L479
56879E25633n308j2528j7185j8686j8004j6458j3872r679n117k049O4L550Q972
$$ y = [734112, 709562, 687788, 669110, 654378, 644761, 640373, 640042, 642970, 649656, 660726, 675943, 694855, 717025, 740479, 760735, 772602, 772922, 761376, 739561, 710167, 676479, 641685, 608408, 578751, 554099, 534616, 519570, 508476, 501455, 498486, 499157, 503355, 511403, 523344, 539051, 559312, 585717, 618834, 656999, 696823, 733765, 762036, 775785, 772019, 752279, 721089, 683209, 642419, 601593, 562712, 527058, 495729, 469516, 448065, 429948, 413978, 399900, 387626, 376705, 366884, 358341, 350988, 344353, 338434, 333762, 330208, 326717, 322771, 319185, 316919, 315849, 315302, 315076, 315474, 316996, 320368, 326149, 334061, 343506, 354934, 369750, 388633, 410928, 435764, 462260, 488095, 509240, 522154, 525633, 520325, 507797, 490612, 471926, 453922, 437464, 423592, 413913, 408796, 406747, 406811, 410361, 419333]
56866D19333J4543J9242K4183L0432L7580M5074N2883O0003O3782O1520N1873
56855H80448L4923J2634j0600k9768m2374m8838n0151m6906m0511l3125k5774
56844E99958j8045r955k314N001J3263K2922L3177M3937N6309P0538Q5015R7599
56832I97405J05808J05312R1021O1740K2672j7713n2413p7486r1529r5622r2758
56821I56437q5710p5686o3501n0743l8784k7653j6920o826K368J1386K1273L2177
56809F57818M3552N4990O5964P4736P7879P1262N2411K3097j0422m0704o2997
56798A007586p6021q0323p7483p0254o1376n1915m1957l2507k4950j8879j2544
56787D59377n617N57N697J1424J8665K6236L2724L7801M0592L8630K9952J5307
$$ y = [419333, 433876, 453118, 477301, 507733, 545313, 590387, 643270, 703273, 767055, 828575, 880448, 915371, 928005, 917405, 887637, 845263, 796425, 746274, 699368, 658857, 625732, 599958, 581913, 571958, 569644, 574645, 587908, 610830, 644007, 687944, 744253, 814791, 899806, 997405, 1103213, 1208525, 1299546, 1361286, 1383958, 1366245, 1313832, 1236346, 1144817, 1049195, 956437, 870727, 795041, 731540, 680797, 642013, 614360, 597440, 590614, 592982, 604368, 625641, 657818, 701370, 756360, 822324, 897060, 974939, 1046201, 1098612, 1121709, 1111287, 1070583, 1007586, 931565, 851242, 773759, 703505, 642129, 590214, 548257, 515750, 490800, 471921, 459377, 453760, 454317, 460014, 471438, 490103, 516339, 549063, 586864, 627456, 666086, 696038, 711345]
56775G11345k454j9995l4101m2522m5474m5252m3475l9946l4663k9229k5123k2016
56763C27095j9006j6295j4403j2812j0728q377o496n207m318m014m349m693m446
56750B11951l759l055k428j944j778j659j076k73j21o95j051p21k86j37J46P10
56734A93824R23M91m6l57p20j082q97l02j23l61q1Q17J163M64j83J81J081J676
56716A96468J815J485N98j56L42J854K740K269J475J176Q23K5m80k25J95M89J196
56699B12089K071J801K13r96q21m39r77j648j464j038j156j192m62K57J85J68
56683B06591J158K304K204J100L29M23J081K058K878K689J572Q94J334J757J145
56668B29517K08j85o15j624k163j283o5mo18m97K64O10N73Q57J102M79n22o54
$$ y = [711345, 708891, 688896, 654795, 612273, 566799, 521547, 478072, 438126, 403463, 374234, 349111, 327095, 308089, 291794, 277391, 264579, 253851, 245474, 238978, 233771, 229453, 225439, 221090, 216397, 211951, 208192, 205137, 202709, 200765, 198987, 197328, 196252, 195979, 195858, 195163, 194112, 193391, 193105, 192968, 193114, 193824, 194747, 195238, 195192, 194835, 194115, 193033, 192136, 191834, 191711, 191350, 191269, 192086, 193249, 193713, 193530, 193711, 194792, 196468, 198283, 199768, 200366, 200210, 200552, 202406, 205146, 207415, 208890, 210066, 210889, 210914, 210434, 210209, 210404, 210893, 212089, 214160, 215961, 216174, 215178, 214357, 213918, 212941, 211293, 209829, 208791, 207635, 206443, 205981, 206238, 206423, 206591, 207749, 210053, 212257, 213357, 213686, 214109, 215190, 217248, 220126, 222815, 224387, 225281, 226615, 228372, 229517, 229725, 229540, 228925, 227301, 225138, 223855, 223790, 223786, 223168, 222671, 222935, 223545, 224118, 224975, 226077, 226556, 226034, 225380]
56650B25380J23P96R97J064R03K09n57p54o61q28r34m48J51N7n31q91r67r73n73
56631B21563L60R40M54l94n78l30m35q27j123j658k662l236k606j570j273j402
56615B05223r84k99l43j049j516j517j385r22J55J187J238M65k74o95r02n69N26
56598A98339J705K137J875J384Q34N03R06J670J524L30l43L48J083O64J0K69O33
56581B13871l4q89n32M64O37J84K99Q91J110J227J911K448J886J187J986L832
56565B30478M821M547M277M646N258O170P823R768J1225J2457J3809J4095J1873
56552C41247P808L846O90k010l796m034l757m562o019o421n665n032m623l448
56538C04224j869j408k142k627k510k869l838m193l545k873k588k057j289j078
$$ y = [225380, 225503, 226299, 227296, 228360, 229263, 229472, 228915, 228161, 227500, 226672, 225738, 225290, 225441, 225498, 224967, 224076, 223109, 222136, 221563, 221923, 222863, 223317, 222923, 222345, 222015, 221580, 220753, 219630, 217972, 215310, 212074, 209468, 207898, 206625, 205223, 204239, 203940, 203597, 202548, 201032, 199515, 198130, 197208, 197363, 198550, 199788, 200253, 199979, 199284, 198382, 197813, 198339, 200044, 202181, 204056, 205440, 206274, 206777, 207683, 209353, 210877, 211207, 210864, 211212, 212295, 212959, 212969, 213238, 213871, 213837, 212948, 212416, 212880, 213517, 213701, 214000, 214891, 216001, 217228, 219139, 221587, 223473, 224660, 226646, 230478, 235299, 239846, 244123, 248769, 254027, 260197, 268020, 277788, 289013, 301470, 315279, 329374, 341247, 349055, 352901, 353591, 351581, 347785, 343751, 339994, 335432, 329413, 322992, 317327, 312295, 307672, 304224, 302355, 300947, 298805, 296178, 293668, 290799, 286961, 282768, 279223, 276350, 273762, 271705, 270416, 269338]
56524B69338j360j249q56j114j750j465k66M44K09n4p6n76j399j466r49j321k740
56507B53350l504k687j445r79j025j018j082j167p37M7K69j90l79lJ10l74p09
56490B38477n30m68p91p86m7P41P84P7r16j612j453n78n1m88r37l38O61P89L48
56471B32882N82J442J836J718J901K145J473K18k31K44M04j64n90m80l92n48o42
56454B41798p79j049o90O93J736J107p3J85J503J914J250J010J337J031L33O99
56438B52005J781J672L53j46O49Q64k93j288j164q82r63m82O19Q28l33j307j075
56421B50838m68j87K27P25L27p95j153n26l79j055j027L01J471J552J400J463
56405B52714Q40n08j038j93O35O02N80R17N06q01j371m36P09J199J877K992L227
$$ y = [269338, 267978, 266729, 265873, 264759, 263009, 261544, 261278, 261722, 261931, 261877, 261801, 261225, 259826, 258360, 257411, 256090, 253350, 249846, 247159, 245714, 244735, 243710, 242692, 241610, 240443, 239706, 239753, 240022, 239832, 239453, 239450, 239560, 239186, 238477, 237947, 237479, 236688, 235902, 235855, 236596, 237380, 237457, 236541, 234929, 233476, 232898, 232847, 232359, 231422, 231084, 231745, 232534, 232882, 233464, 234906, 236742, 238460, 240361, 242506, 243979, 244197, 243966, 244210, 244614, 244450, 243860, 243380, 242988, 242440, 241798, 241019, 239970, 239280, 239973, 241709, 242816, 242743, 242928, 244431, 246345, 247595, 248605, 249942, 250973, 251306, 252005, 253786, 255458, 255811, 255665, 256314, 257178, 256885, 255597, 254433, 253551, 252588, 252106, 252725, 253553, 253220, 251913, 250838, 250370, 250183, 250410, 251135, 251462, 250667, 249514, 248988, 248609, 247554, 246527, 246828, 248299, 249851, 251251, 252714, 253554, 253046, 252008, 251815, 252450, 253052, 253632, 254549, 255055, 254254, 252883, 252447, 253156, 254355, 256232, 259224, 262451]
56388B62451K225J576K023K107J002P4K50K91o61j249l76P21P11L54P00J075O83
56371B73957L77J019J819J854J672J884J838J101O07R82J418J323J364J767J547
56356B94529N78L32J340K021J400Q03J385K141J960J593J884K011J202L87N85
56341C14151J283J853K681L611L314J646N95J328K372K280K014K969M517N376
56327C49990N610N668N155M120L715M170L939K273O12R8k03j113j659j110m92
56312C80773m60j0J095J146m69j454l3K192K980K810L237L997M180M386N370O188
56296D15928N828N084M876M497L425K927L930N173N446N622O541P006O147N593
56282D88023O915Q810R250Q665Q643R209R618J0292J1715J2949J3250J3576J4751
$$ y = [262451, 264676, 266252, 268275, 270382, 271384, 271458, 271708, 271999, 271338, 270089, 269713, 270434, 271145, 271499, 272199, 273274, 273957, 274334, 275353, 277172, 279026, 280698, 282582, 284420, 285521, 286128, 287110, 288528, 289851, 291215, 292982, 294529, 295107, 295439, 296779, 298800, 300200, 301003, 302388, 304529, 306489, 308082, 309966, 311977, 313179, 313566, 314151, 315434, 317287, 319968, 323579, 326893, 328539, 329134, 330462, 332834, 335114, 337128, 340097, 344614, 349990, 355600, 361268, 366423, 370543, 374258, 378428, 382367, 384640, 385252, 385350, 385147, 384034, 382375, 381265, 380773, 380313, 380303, 381398, 382544, 382075, 380621, 380588, 382780, 385760, 388570, 391807, 395804, 399984, 404370, 409740, 415928, 421756, 426840, 431716, 436213, 439638, 442565, 446495, 451668, 457114, 462736, 469277, 476283, 482430, 488023, 494938, 503748, 512998, 521663, 530306, 539515, 549133, 559425, 571140, 584089, 597339, 610915, 625666]
56269F25666J5901J6445J7526J9682K1377K1782K2640K5298K8332L0368L2793
56258H77810L7162M2441M7387N3224O1148O9573P6875Q4646R5235J08022J21055
56247A674578J34466J49185J64074J77271J88774J99058K06884K11045K12284
56238C317619K10879K04432J90823J71256J47614J19181Q5108M7901J1073k4649
56228D481237n9629r1900j18964j41214j60164j74951j83925j88065j89526j88308
56218B984591j83498j76263j68444j59745j49352j38645j29259j20215j10029
56209A649141r9833r1387q3873p5780o8064o2202n7143n1336m5778m1895l8510
56198I33340l4175l0165k7916k5838k2197j8650j7263j6560j4326j1799j1061
$$ y = [625666, 641567, 658012, 675538, 695220, 716597, 738379, 761019, 786317, 814649, 845017, 877810, 914972, 957413, 1004800, 1058024, 1119172, 1188745, 1265620, 1350266, 1445501, 1553523, 1674578, 1809044, 1958229, 2122303, 2299574, 2488348, 2687406, 2894290, 3105335, 3317619, 3528498, 3732930, 3923753, 4095009, 4242623, 4361804, 4446912, 4494813, 4505886, 4481237, 4421608, 4329708, 4210744, 4069530, 3909366, 3734415, 3550490, 3362425, 3172899, 2984591, 2801093, 2624830, 2456386, 2296641, 2147289, 2008644, 1879385, 1759170, 1649141, 1549308, 1457921, 1374048, 1298268, 1230204, 1168002, 1110859, 1059523, 1013745, 971850, 933340, 899165, 869000, 841084, 815246, 793049, 774399, 757136, 740576, 726250, 714451, 703390]
56187G03390j0913r530q466r530j0369q113m863m431n806n237k878j836k216j616
56173F17586l20n87j783j377J65L60l80K49J612J263m5N27K745M063M574O340
56157F34992Q743R404Q805R275J0425J0354J0170J2270J5356J6322J6032J7933
56145G80081K1997K5339K7937L2320L8375M3807M9003N6175O4469P1070P6160
56134A286733Q1421Q4787Q2352P4744O6068N7574M8039L9258L4821L3960L2369
56123A922126K8624K4214J8335Q969j655q895j2590j6281k0670k4126k8546l7722
56111A851783n0292o1043o8668p5569q0768q0335p4783o8678o2890n4301m3348
56100A131108l4531k9013k3659j7832j4163j2341r132m905l270l991l202o89K05
$$ y = [703390, 692477, 682947, 674481, 664951, 654582, 646469, 641606, 637175, 631369, 626132, 623254, 621418, 619202, 617586, 617266, 616679, 614896, 613519, 613684, 614044, 613664, 613913, 615525, 616788, 616743, 617270, 620015, 624078, 628652, 634992, 643735, 653139, 661944, 671219, 681644, 691998, 702168, 714438, 729794, 746116, 762148, 780081, 802078, 827417, 855354, 887674, 926049, 969856, 1018859, 1075034, 1139503, 1210573, 1286733, 1368154, 1452941, 1535293, 1610037, 1676105, 1733679, 1781718, 1820976, 1855797, 1889757, 1922126, 1950750, 1974964, 1993299, 2002268, 2000613, 1991718, 1979128, 1962847, 1942177, 1918051, 1889505, 1851783, 1801491, 1740448, 1671780, 1596211, 1515443, 1435108, 1360325, 1291647, 1228757, 1174456, 1131108, 1096577, 1067564, 1043905, 1026073, 1011910, 999569, 990437, 985532, 982262, 978271, 975069, 974380, 974585]
56087I74585k31J599N130O195N055O044R113R829Q046Q303J1075J1972J0276R979
56073A076970J1670J1745J0339J1480J4718J5344J3529J4293J7678J8310J5671
56062A231747J5190J7919J8793J6603J5910J7516J6800J3279J1964J3518J3018
56051A402257J0167J0371J3962J4923J2353J2331J6215J8204J6919J8060K2870
56040A568632K5524K4956K7614L5247M1453M3591M6271M9789M7539L8786L1711
56029A981113K9881K7972K4507K5707L2521L7176L7265L9824M6876N0838M9349
56018B383029N0339N6867O1293O0350O1330O7204P0527O8633O9754P7140Q2514
56007C108980Q2317Q4826R3719J00771J02463J07420J19136J28220J30272J34335
$$ y = [974585, 974354, 975953, 981083, 987278, 992333, 998377, 1007490, 1017319, 1025365, 1033668, 1044743, 1056715, 1066991, 1076970, 1088640, 1100385, 1110724, 1122204, 1136922, 1152266, 1165795, 1180088, 1197766, 1216076, 1231747, 1246937, 1264856, 1283649, 1300252, 1316162, 1333678, 1350478, 1363757, 1375721, 1389239, 1402257, 1412424, 1422795, 1436757, 1451680, 1464033, 1476364, 1492579, 1510783, 1527702, 1545762, 1568632, 1594156, 1619112, 1646726, 1681973, 1723426, 1767017, 1813288, 1863077, 1910616, 1949402, 1981113, 2010994, 2038966, 2063473, 2089180, 2121701, 2158877, 2196142, 2235966, 2282842, 2333680, 2383029, 2433368, 2490235, 2551528, 2611878, 2673208, 2740412, 2810939, 2879572, 2949326, 3026466, 3108980, 3191297, 3276123, 3369842, 3470613, 3573076, 3680496, 3799632, 3927852, 4058124, 4192459]
55997D192459J44869J53054J55126J60905J74621J86047J90694J99214K16460
55988E773449K31594K39949K53353K77131K99056L13478L33384L65289L96291
55979H482974M20116M50804M95640N40735N79286O26525O90106P55072Q15977
55970A3857235Q92512R94233J103670J215143J353988J535021J742115J974261
55962B4668178K268801K651831L114695L672636M395872N350010O566738Q108930
55954F0797691J0084583J2542862J5449235J8839769K2894356K7732686L3182593
55947B01523775L8755497M3558248M5950652M3597505L4664723J9518910J168155
55940D28737465j6279921k9759287l8156304m1783025m1560102l8647750l4272661
$$ y = [4192459, 4337328, 4490382, 4645508, 4806413, 4981034, 5167081, 5357775, 5556989, 5773449, 6005043, 6244992, 6498345, 6775476, 7074532, 7388010, 7721394, 8086683, 8482974, 8903090, 9353894, 9849534, 10390269, 10969555, 11596080, 12286186, 13041258, 13857235, 14749747, 15743980, 16847650, 18062793, 19416781, 20951802, 22693917, 24668178, 26936979, 29588810, 32703505, 36376141, 40772013, 46122023, 52688761, 60797691, 70882274, 83425136, 98874371, 117714140, 140608496, 168341182, 201523775, 240279272, 283837520, 329788172, 373385677, 408050400, 427569310, 428737465, 412457544, 382698257, 344541953, 302758928, 261198826, 222551076, 188278415]
55933A88278415k9445071k4769519k0540698j6912907j3926548j1499400r516860
55926F1667412p914493o643308n620818m771516m071505l509479l043537k634236
55918B3458520k282019j994960j751918j529670j335180j179671j048166r23148
55910A1413788q12691p28374o58849n90059n29470m86846m51708m11945l75176
55901F368670l50825l29723l01382k73681k56386k42074k21685k02476j92718
55892C997720j84319j68043j51073j42596j36321j23738j10969j06160j03130
55883B771371r3425q2421p8075p5304o6606n7235n5255n6813n5242n4599o0519
55872B035877o7213o7001o3810o4518o5851o2113n7192n6677n6548n1418m5727
$$ y = [188278415, 158833344, 134063825, 113523127, 96610220, 82683672, 71184272, 61667412, 53752919, 47109611, 41488793, 36717277, 32645772, 29136293, 26092756, 23458520, 21176501, 19181541, 17429623, 15899953, 14564773, 13385102, 12336936, 11413788, 10601097, 9872723, 9213874, 8623815, 8094345, 7607499, 7155791, 6743846, 6368670, 6017845, 5688122, 5386740, 5113059, 4856673, 4614599, 4392914, 4190438, 3997720, 3813401, 3645358, 3494285, 3351689, 3215368, 3091630, 2980661, 2874501, 2771371, 2677946, 2595525, 2517450, 2442146, 2375540, 2318305, 2263050, 2206237, 2150995, 2096396, 2035877, 1968664, 1901663, 1837853, 1773335, 1707484, 1645371, 1588179, 1531502, 1474954, 1423536, 1377809]
55861A377809m5199m5454m0571l4694l3649l2987k5972j6013r766n225J962P412
55849A097653M782k645q064j2704k0619k8162k9571k7568k7990k9175k6665k3074
55837H66198k3109k3989k0822j6554j6728j9093j8170j5528j5796j6943j4279
55826F65187j0006r245j0453r018o637p814j0752j0739r218j0502j2848j1723
55814E46232q827q985j0987j0192p428o766p122m591o20M90m8K073N701O320M686
55799D99936N320Q054Q854P500O895O306K785k129m375m624o640r863j0617r274
55785D98128r210r945q227m817l436m156m289m607p904j2471j3748j1737j0392
55772C93189j0404q906n654l178j345K066N783O046K933J83j017k616m717n386
$$ y = [1377809, 1332610, 1287156, 1246585, 1211891, 1178242, 1145255, 1119283, 1103270, 1093504, 1088279, 1090241, 1097653, 1102435, 1099790, 1091726, 1079022, 1058403, 1030241, 1000670, 973102, 945112, 915937, 889272, 866198, 843089, 819100, 798278, 781724, 764996, 745903, 727733, 712205, 696409, 679466, 665187, 655181, 645936, 635483, 626465, 619828, 612014, 601262, 590523, 581305, 570803, 557955, 546232, 537405, 528420, 517433, 507241, 499813, 493047, 485925, 481334, 480714, 481204, 481156, 483229, 488930, 495250, 499936, 505256, 513310, 522164, 529664, 536559, 542865, 545650, 543521, 539146, 534522, 527882, 518019, 507402, 498128, 488918, 478973, 470746, 465929, 462493, 458337, 454048, 449441, 441537, 429066, 415318, 403581, 393189, 382785, 373879, 368225, 365047, 363702, 365768, 371551, 377597, 380530, 380713, 379696, 377080, 372363, 366977]
55758C66977n084o070p797p822o623o623p324o343m341l912m557l843k518l244
55744B90876n226n358l891l640m441l751j991j892l064k607o56j08j147j212j17
55729B51775p7r38m35R67M27k170m197n092o459p781o921m644l777m107k859m7
55713B03665J523J386J721K684K324J038J315K934L216K076K057L206K787L74
55699B32306j499k057l094m787n281m761n300o439n510k723j204j582j213N77
55685A87433J300J72m26O12J555J685K533M274M914M074L622L837K826M84r96
55670B17899j224k107l602l281j025J48r34j941j549j380k154k011k68J040R76
55655A98587J392L174M352L692K829L092L345K575J683J203K7k105l560l588l542
$$ y = [366977, 361893, 355823, 348026, 340204, 333581, 326958, 319634, 313291, 308950, 305038, 300481, 296638, 294120, 290876, 285650, 280292, 276401, 272761, 268320, 264569, 262578, 260686, 257622, 255015, 254359, 254251, 253104, 251892, 251775, 251698, 250760, 250325, 251292, 251719, 249549, 245352, 240260, 233801, 226020, 219099, 214455, 210678, 206571, 203712, 203665, 205188, 206574, 208295, 210979, 213303, 214341, 215656, 218590, 221806, 223882, 225939, 229145, 231932, 232306, 230807, 228750, 225656, 220869, 215588, 210827, 205527, 199088, 193578, 190855, 189651, 188069, 186856, 187433, 188733, 188905, 188479, 189091, 190646, 192331, 194864, 199138, 204052, 208126, 211748, 215585, 218411, 218895, 217899, 216675, 214568, 210966, 207685, 206660, 206808, 205874, 203933, 202384, 201004, 198850, 196839, 196571, 197611, 198587, 199979, 203153, 207505, 211197, 214026, 217118, 220463, 223038, 224721, 225924, 225951, 223846, 220286, 216698, 213156]
55640B13156m316n076n429o141o979o517m883l858l791l197j916j527k116j922
55626A55488p71m74j206r93L61N44j039k017j283q65k086l207k653j438q07l56
55610A37198R0m61j778j992q17l09j201j557l58O30J23o03m53l91j071j386r79
55593A24685j315k671k983j349K16J76j56M85R22Nj102j136q74j119r11L50J305
55576A14528R43M58R65J572J382J274J998K618K534K857M063M513L128J390Q39
55561A45062O28m92j781k030j757j967k326k276k447l314l961l645l043k727k027
55546A11897p03P9k28l90M72J387J485J507K001J991R20J3J96M95k2n47l06j48
55528A20099q18j363r06l06o08j331j720k019k275j613m1Q29K20n38m42n16j589
$$ y = [213156, 208840, 203764, 198335, 192194, 185215, 178698, 173815, 169957, 166166, 162969, 161053, 159526, 157410, 155488, 154717, 154243, 153037, 152044, 152405, 152949, 151910, 149893, 148610, 147745, 145659, 142452, 139799, 138361, 137554, 137198, 137288, 136827, 135049, 133057, 132240, 131931, 130730, 129173, 128815, 129445, 129568, 128965, 128512, 128121, 127050, 125664, 124685, 123370, 120699, 117716, 116367, 116583, 116759, 116603, 117088, 118010, 118015, 116913, 115777, 114903, 113784, 112873, 113223, 114528, 115471, 115929, 116894, 118466, 119848, 121122, 123120, 125738, 128272, 131129, 135192, 139705, 142833, 144223, 145062, 145690, 145198, 143417, 141387, 139630, 137663, 135337, 133061, 130614, 127300, 123339, 119694, 116651, 113924, 111897, 111194, 111273, 111045, 110655, 111127, 112514, 113999, 115506, 117507, 119498, 120418, 120431, 120627, 121122, 121100, 120553, 120247, 120099, 119281, 117918, 117012, 116706, 116098, 114767, 113047, 111028, 108753, 107140, 107099, 107928, 108148, 107610, 107168, 106652, 105063]
55511A05063k464k009j158j044r49N6J086R26O6m51p53j171j061j64L84p9m38
55494I5840J88P52K76k24M51J489J528R34P93R14N28q8l18m63r14j140p64m24
55476I9358n22m20J31L16r6j37L19l7j412j980q68K66J90K09J376K051O58j266
55458I8136j444n00m99j334j362m91L2L9K91N73J90l19l1N26K56m72m94J51O43
55439I3891J001J564J709P95m14q76r56j451j903j456n04J35O47J336J455N32
55423I5505k94L9O86M51o8K41Q29O23J63M81R26L46n25k25O97M82p67j261m81
55404I7848K25M1l91n59q55j453j786j383l96O85J210P24k41n12O2L29j74m40
55386I2934nLr01j213R5J549J511Q40J087J628R69m29j056j015j281j358j84J403
$$ y = [105063, 102599, 100590, 99432, 98388, 97439, 97495, 98581, 99507, 99573, 99122, 98369, 97198, 96137, 95973, 96357, 96278, 95840, 96028, 96780, 97056, 96832, 97283, 98772, 100300, 101234, 102027, 102941, 103469, 103381, 103063, 102600, 101686, 100546, 99782, 99358, 98836, 98416, 98547, 98863, 98767, 98630, 98949, 98912, 97500, 95520, 94652, 94918, 95108, 95317, 96693, 98744, 99402, 98136, 96692, 96192, 95693, 94359, 92997, 92506, 92538, 92577, 92868, 93441, 93631, 93312, 93281, 93807, 94063, 93591, 93097, 93248, 93891, 94892, 96456, 98165, 98960, 98546, 97670, 96714, 95263, 93360, 91904, 91400, 91535, 92182, 93518, 94973, 95505, 95211, 95250, 95936, 96387, 96319, 96560, 97389, 98012, 98175, 98656, 99582, 99928, 99403, 99178, 99875, 100357, 99590, 98329, 97848, 98073, 98114, 97723, 97164, 96309, 94856, 93070, 91687, 91291, 91976, 93186, 93910, 93669, 93157, 93219, 93548, 93374, 92934, 92929, 92932, 92031, 90818, 90913, 92462, 93973, 94813, 95900, 97528, 98497, 98068, 97012, 95997, 94716, 93358, 93174, 94577]
55368I4577J680Q42M35N44M9q50q51j0L88K25M81J018P35j73l47L56P27N12O96
55349A01034J387J423M17o90j338j879k233j724n20K86L07J78J89m0m47l94K03
55332I6159P61R95R68M99m53j216j266j065j005m07J124K316J872O07J72M95L90
55315A00946p9M4M51lj055j356q16n68q16p04k45l25q64q31j79J31p5n6J88j5
55295I3773m66k92L76O52N55P49R32M22j14M38J349R11n92j170m03J1p60j523
55277I4848j326p33k58L75Q93M02p10p90N29J543J023k49j048j241j001j61R28
55260I3024J286P69L40M49M75J94L20J059J529J155M68Ok76k79L29J093R92n9
55242A02874j017j272j153q52j68N47N66N4j38J03K11K28N08M69o68k018j882
$$ y = [94577, 96257, 97099, 97534, 98078, 98127, 97277, 96426, 96416, 96804, 97029, 97510, 98528, 99263, 99090, 98743, 99099, 99826, 100338, 101034, 102421, 103844, 104261, 103571, 102233, 100354, 98121, 96397, 95877, 96163, 96470, 96648, 96837, 96797, 96350, 95956, 96159, 96920, 97915, 98883, 99382, 98929, 97713, 96447, 95382, 94377, 93970, 95094, 97410, 99282, 99889, 100061, 100556, 100946, 100867, 100911, 101362, 101359, 100304, 98948, 98132, 97564, 96748, 96044, 95799, 95474, 94610, 93779, 93600, 93731, 93656, 93600, 93788, 93773, 93307, 93015, 93391, 94043, 94598, 95347, 96279, 96701, 96587, 97025, 98374, 99285, 98693, 97523, 97120, 97131, 96371, 94848, 93522, 92789, 92531, 92906, 93799, 94201, 93491, 92701, 93230, 94773, 95796, 95547, 94499, 93258, 92257, 92096, 93024, 94310, 95079, 95419, 95868, 96343, 96537, 96857, 97916, 99445, 100600, 101068, 101074, 100798, 100519, 100848, 101941, 102933, 102874, 101857, 100585, 99432, 98580, 98412, 98959, 99525, 99579, 99441, 99544, 99755, 99983, 100491, 100960, 100292, 98274, 96392]
55225I6392l69P79R52J116J446R38k20l12J096K191J677M65k95q53j485j380j91
55208A01947R36R67L29k81r56j585j337j55O28K20m03j43O39J049R85O13j84j055
55190A02214j048p2P06N70J53kl50j043j212m23M11N18L92O12Q57Q48J019J312
55172A05462P64p96j924j532m16J78L03N58Q00P56Q38J234J178K07p85q25k88
55155A05712l4MK92N63K92k52m27j49K39N36N70K09j50J15O80N17m29r69n21K2
55135A06820j11m68n55p71j291j342n31L02M56L99N52L22o09j284q85m0L93O94
55117A02051J272J444N89m06l35M89Q72O09M52P20J071J284J311R70L17j32j91
55100A12387l33o79n55K87R61Q10N04Q72J590J889J671J053j71j592j826l06J464
$$ y = [96392, 96023, 96802, 97754, 98870, 100316, 101254, 101034, 100722, 101818, 104009, 105686, 106151, 105856, 105003, 103518, 102138, 101947, 102883, 103850, 104179, 103898, 102942, 101357, 100020, 99865, 100493, 100713, 100310, 100167, 100806, 101855, 102840, 103453, 103269, 102214, 101166, 101094, 101800, 102370, 102523, 102521, 102171, 101128, 99916, 99493, 99904, 100422, 100814, 101426, 102283, 103131, 104150, 105462, 106226, 105430, 103506, 101974, 101558, 101736, 102039, 102597, 103397, 104153, 104991, 106225, 107403, 107610, 106825, 106000, 105712, 105678, 105682, 105974, 106537, 106829, 106577, 106150, 106001, 106240, 106776, 107346, 107555, 107405, 107520, 108200, 108717, 108288, 107319, 106798, 106820, 106709, 106241, 105686, 104915, 103624, 102282, 101751, 102053, 102509, 102908, 103460, 103782, 103173, 101889, 101004, 100964, 101357, 102051, 103323, 104767, 105356, 104950, 104615, 105104, 105976, 106585, 107037, 107757, 108828, 110112, 111423, 112393, 112710, 112578, 112387, 112054, 111375, 110820, 111107, 112068, 112878, 113382, 114254, 115844, 117733, 119404, 120457, 120286, 118694, 116868, 116562, 118026]
55083A18026J711O79j34j57R9M62J154J847J966J675J504J305N89k95m77J58Q21
55066A30933Q60K99m69r39p36j25P5n23j404j955k122j914j160j74K06k11o51
55049A19990p22j026j776k035j182j11O8l98n69k92k6N4l2l37n19L7R75J080K54
55030A13433K9J176K260J826N57j60m35r78j248m65N32M24l46l85K11K51j90Q5
55012A16577J065J366N53k28k03kl23r43j410j576j263m16K85M5p18p78J67J193
54994A13391J614J692J701J443R21N62N02L24k24q85j329j426j125o25m28p17
54978A15391q73l40M92R11R55J083J160P67J46j26j17k59l89o1M06L46jK37J099
54959A20827J653J429R66Q06P89N62J16l56o98p74o66o68p43l85N58J336J275
$$ y = [118026, 119737, 120416, 120282, 120125, 120224, 120686, 121840, 123687, 125653, 127328, 128832, 130137, 130726, 130431, 129954, 130112, 130933, 131793, 132092, 131623, 130684, 129948, 129823, 129898, 129375, 127971, 126016, 123894, 121980, 120820, 120646, 120852, 120641, 119990, 119268, 118242, 116466, 114431, 113249, 113138, 113206, 112808, 112239, 111947, 111921, 111975, 111943, 111606, 111087, 111124, 112099, 113179, 113433, 113462, 114638, 116898, 118724, 119281, 119121, 118686, 117708, 116460, 115995, 116527, 116951, 116605, 116220, 116431, 116682, 116492, 116577, 117642, 119008, 119561, 119333, 119130, 119128, 118805, 117862, 116452, 114876, 113613, 113197, 113482, 113527, 112809, 112031, 112198, 113391, 115005, 116697, 118398, 119841, 120762, 121324, 121826, 122150, 121926, 121041, 119712, 118286, 117161, 116536, 116108, 115391, 114518, 114178, 114670, 115581, 116536, 117619, 118779, 119546, 119692, 119566, 119449, 119190, 118801, 118740, 119146, 119492, 119491, 119728, 120827, 122480, 123909, 124875, 125681, 126470, 127032, 127148, 126792, 126094, 125320, 124654, 123986, 123243, 122858, 123416, 124752, 126027]
54942A26027P22K98j04p79j227q17J5L57K36L18N82M75J96N38J475K132K168K127
54924A34739K333K495K563K992L940M970N751O296O521O231N595M952M170K879
54910A96427J246k32j624l388n398o876p427p347o937o135m928l540k199j113
54896A40529n42m76n04m27o03j186j537j115m03j32r0M08J308K025K487K976L218
54879A45936K758K054K191L520N345O858P659P608O926O173N363L593L93l078
54865B03299n240n997o330o566o320n750n436n173m351l376l266l842l762k597
54851A35293j419j048r79n56l7L3l60r65j601j955j715j137p99p32m89r4q7n65
54833A20788r86j025q47n32L2O57R98J141J345J368Q97L74M75R58R96N15J29k6
$$ y = [126027, 126749, 127047, 126943, 126164, 124937, 124120, 124135, 124492, 124728, 125046, 125628, 126103, 126299, 126837, 128312, 130444, 132612, 134739, 137072, 139567, 142130, 145122, 149062, 154032, 159783, 166079, 172600, 178831, 184426, 189378, 193548, 196427, 197673, 197441, 195817, 192429, 187031, 180155, 172728, 165381, 158444, 152309, 147381, 143841, 141642, 140529, 139987, 139511, 139007, 138580, 137977, 136791, 135254, 134139, 133736, 133604, 133514, 133922, 135230, 137255, 139742, 142718, 145936, 148694, 150748, 152939, 156459, 161804, 168662, 176321, 183929, 190855, 197028, 202391, 205984, 206377, 203299, 198059, 192062, 185732, 179166, 172846, 167096, 161660, 156487, 152136, 148760, 145494, 141652, 137890, 135293, 133874, 132826, 131847, 131291, 131254, 131287, 130927, 129962, 128361, 126406, 124691, 123554, 122755, 122023, 121534, 121440, 121353, 120788, 119802, 118777, 117930, 117398, 117430, 118087, 119085, 120226, 121571, 122939, 123836, 124210, 124685, 125643, 126639, 127154, 127283, 127257]
54815A27257l28o33l66L19O02K83o5j94m05o41m79o7Nk08r1L51M90J98r1l23o70
54794A24944o36L30J445J362L42J4Q24J437J061N43N61M57k29o67k41K72J21L1
54776A31971R17K165K511J956J554J753K084K187K244K447K769L211L807M547
54762A66123N416O306O731O110M540K807J484M33p25k191m047o051p334p097n736
54747A66769m486l863l265k282j404j143j291j461j650j853j787j325o92lP86
54732A41050J432J525J138P08L74J08L27J397K707L311L428M072N254N919N747
54717A78497N558N606M975L282J508M62m29j942l774n217o134o614o476n810n157
54702A58335m513l153j004P00Q92k1r74j530j756j629j246r79q94o69l97o28j277
$$ y = [127257, 126929, 126296, 125930, 126249, 126851, 127134, 127069, 126875, 126470, 125829, 125350, 125283, 125288, 125080, 124989, 125340, 125830, 126028, 125937, 125614, 124944, 124308, 124638, 126083, 127445, 127787, 127801, 128625, 130062, 131123, 131666, 132227, 132684, 132455, 131788, 131547, 131819, 131940, 131971, 132888, 135053, 137564, 139520, 141074, 142827, 144911, 147098, 149342, 151789, 154558, 157769, 161576, 166123, 171539, 177845, 184576, 190686, 195226, 198033, 199517, 199950, 199225, 197034, 192987, 186936, 179602, 172505, 166769, 162283, 158420, 155155, 152873, 151469, 150326, 149035, 147574, 145924, 144071, 142284, 140959, 140267, 140264, 141050, 142482, 144007, 145145, 145853, 146227, 146335, 146662, 148059, 150766, 154077, 157505, 161577, 166831, 172750, 178497, 184055, 189661, 194636, 197918, 199426, 199888, 199459, 197517, 193743, 188526, 182392, 175778, 169302, 163492, 158335, 153822, 150669, 149665, 150365, 151257, 151236, 150262, 148732, 146976, 145347, 144101, 143122, 142228, 141559, 141162, 140534, 139257]
54685A39257j502j075p78r79r67l35J89O7r0L01P05M85M1j3Q1p8j94n4k22j027
54665A33812j658j327o45p26j540k140k038j415m69N64J181J145Q44O10K81nM83
54648A26957J812K699K029M06p12q18m41q4O5j14l76j53M54M73m30j128o09M93
54630A30523R84R11J031J211O72n85j722k192k031j335l92K01K90N74J381J787
54614A31308R52l23o17J21P71Q23O44L77j57o45n49o9J90K64N52P74L26n17q87
54595A33338o07j85K56R41J511J333O92M71O72L67p36j849k302k215j718o29P62
54578A30102J558J309O03J84J40J62J04k7j92k84k55k98m89m70M2O08N62k2m83
54559A32854n38m10j55L80R63J111R28J037J599J982J610O33l69r33q17q2Q27
$$ y = [139257, 137755, 136680, 135902, 134923, 133956, 133621, 133810, 133877, 133787, 134088, 134793, 135278, 135319, 135306, 135387, 135309, 135115, 135061, 134839, 133812, 132154, 130827, 130182, 129456, 127916, 125776, 123738, 122323, 121854, 122418, 123599, 124744, 125588, 126198, 126479, 126474, 126957, 128769, 131468, 133497, 133903, 133191, 132373, 131932, 131848, 131913, 131799, 131423, 131270, 131724, 132197, 131767, 130639, 130030, 130523, 131507, 132418, 133449, 134660, 135332, 134747, 133025, 130833, 128802, 127467, 127075, 127276, 127566, 128140, 129521, 131308, 132260, 131937, 131320, 131441, 132212, 133035, 133679, 134056, 133899, 133254, 132705, 132636, 132826, 133090, 133642, 134416, 134742, 134225, 133338, 132731, 132546, 132802, 133743, 135254, 136587, 137279, 137750, 138422, 138789, 138053, 136204, 133902, 131687, 129969, 129340, 130102, 131660, 132969, 133572, 133756, 133896, 134058, 134162, 134135, 133943, 133659, 133404, 133106, 132617, 132147, 132189, 132797, 133359, 133337, 132854, 132316, 131906, 131751, 132131, 133094, 134205, 135133, 136170, 137769, 139751, 141361, 141994, 141625, 140692, 139875, 139793, 140620]
54542A40620J367J401J206J035R24P80M59j36p59r14m69O8J19l77j125j789j974
54525A40436j429n45o6n6J41O18M99n64j476j176j78L09J54J26M99R45J403J911
54507A41551J955J047k32q32o15k70j65j98m59r88j176n24L26M02nJ66Q82J042
54489A41907L09m15m96k99j02M11J170J411Q29J17q8k0m6J8L20M69J52k68k60
54470A45119J92P23J061J106R07P08P16P86O69M92N74Q73J066J037Q21K89m64
54453A56675q21m61j16n89j337j146r0N04J15k90k5J61n82j720k052j325l09L30
54435A46922N64O41P07P35N46M5m87n60k1P51J253J219O95P8r9K54N91N01L66
54416A54701P13J222J121L91k35l78m04o08p84o85l22K75J017J439J095L01r4
$$ y = [140620, 141987, 143388, 144594, 145629, 146553, 147333, 147792, 147656, 146897, 145983, 145514, 145582, 145701, 145324, 144199, 142410, 140436, 139007, 138462, 138396, 138340, 138481, 139099, 139598, 139034, 137558, 136382, 136204, 136513, 136667, 136793, 137292, 138237, 139640, 141551, 143506, 144553, 144321, 143489, 142874, 142604, 142439, 142241, 141782, 140794, 139618, 139094, 139420, 139822, 139817, 139983, 140865, 141907, 142216, 141801, 141305, 141006, 140904, 141315, 142485, 143896, 144725, 144842, 144754, 144734, 144688, 144706, 145026, 145495, 145647, 145379, 145119, 145311, 146034, 147095, 148201, 149108, 149816, 150532, 151318, 151987, 152479, 153053, 153926, 154992, 156029, 156850, 157139, 156675, 155854, 155393, 155277, 154688, 153351, 152205, 152115, 152619, 152734, 152444, 152419, 152580, 151998, 150278, 148226, 146901, 146592, 146922, 147486, 148127, 148834, 149569, 150115, 150160, 149673, 149113, 149092, 149843, 151096, 152315, 153010, 153088, 152989, 153243, 153834, 154335, 154701, 155414, 156636, 157757, 158148, 157913, 157535, 157131, 156523, 155739, 155054, 154732, 155007, 156024, 157463, 158558, 158859, 158765]
54399A58765K98J079J671J680R09l46j153r03k54k79q98j049l43M99Q92R86R30
54382A62484N63P8N4M65O05K78J60N70Q58M91n9q3L43P33R58J178J423J776K500
54363A75375L628M657N017M600L754L015K810K940K503Q84j247k613k906k892
54349A99525l009k941k643k695l218l452k968k428k535k942k890k292j594j049
54335A62869o89n60n55l47Q4L34K68L23P55J079P35j37r86j523j731j556j043
54318A57320m92j78j14k35m75n57j75N21J014J159J280J390R32l21j623j981j243
54301A56222j96K52j75r18j076l18O70J006O91L99L76K13l37r59j267j113m29
54284A53041O20J351J197N78M38Q58J008N42J46L82R16J170J056P31K99P4M28
$$ y = [158765, 159063, 160142, 161813, 163493, 164402, 164056, 162903, 162000, 161746, 161467, 160569, 159520, 159177, 159676, 160568, 161554, 162484, 163047, 163125, 163179, 163644, 164249, 164527, 164687, 165257, 166115, 166606, 166547, 166464, 166807, 167540, 168498, 169676, 171099, 172875, 175375, 179003, 183660, 188677, 193277, 197031, 200046, 202856, 205796, 208299, 209183, 207936, 205323, 202417, 199525, 196516, 193575, 190932, 188237, 185019, 181567, 178599, 176171, 173636, 170694, 167804, 165512, 163918, 162869, 162180, 161620, 161065, 160718, 160802, 161136, 161404, 161727, 162482, 163561, 164296, 164159, 163173, 161650, 159919, 158363, 157320, 156828, 156650, 156536, 156301, 155826, 155269, 155094, 155615, 156629, 157788, 159068, 160458, 161390, 161069, 159446, 157465, 156222, 156026, 156278, 156103, 155185, 154109, 153791, 154461, 155467, 156158, 156557, 156933, 157146, 156809, 155850, 154583, 153470, 153041, 153661, 155012, 156209, 156787, 157225, 158083, 159091, 159633, 159779, 160161, 161077, 162247, 163303, 164034, 164333, 164407, 164835]
54267A64835J088J228M93o21j516j927j639n78O55J201J065J013J283J366J146
54252A69092J127J263Q17k15p79l70K02K32J88N44Q03N27K97O32Q95K91p90j505
54234A73251j856k219k236j351j8P52P99Q04J104J392J401J144O83K34K19O80
54218A74783R78O39Q2j17j72o00j236j505j343j147j013p76m82k86p0K68M65L09
54200A68777O1Ml0j99k37k2K0l10m12J09N57J75m46j20J050J669R08n44j532j631
54180A67847j187p69p43r63q82k21O21J173J582K213K864K902K100Q31m45j464
54164A75459k110k476k717k651j836m42N00K51o40j091q14k80K10P09J044Q77
54148A63993K76k94n21m45k40r6j00J1O08J451J687R84P5k83k56k92j60N60J497
$$ y = [164835, 165923, 167151, 167644, 167023, 165507, 163580, 161941, 161363, 162018, 163219, 164284, 165297, 166580, 167946, 169092, 170219, 171482, 172299, 172084, 171305, 170935, 171137, 171369, 171557, 172101, 172904, 173431, 173728, 174360, 175255, 175546, 174756, 173251, 171395, 169176, 166940, 165589, 165571, 166323, 167122, 167926, 169030, 170422, 171823, 172967, 173650, 173884, 174103, 174783, 175761, 176400, 176482, 176365, 176193, 175593, 174357, 172852, 171509, 170362, 169349, 168573, 168091, 167805, 167735, 168003, 168468, 168777, 168838, 168842, 168812, 168613, 168376, 168354, 168374, 168064, 167652, 167761, 168318, 168493, 168047, 167927, 168977, 170646, 171554, 171010, 169478, 167847, 166660, 165891, 165148, 164185, 163303, 163082, 163703, 164876, 166458, 168671, 171535, 174437, 176537, 177368, 176923, 175459, 173349, 170873, 168156, 165505, 163669, 163227, 163727, 163978, 163338, 162247, 161433, 161153, 161363, 162072, 163116, 163993, 164269, 163975, 163454, 163009, 162769, 162673, 162573, 162584, 163192, 164643, 166330, 167314, 167389, 167106, 166850, 166558, 166398, 166958, 168455]
54129A68455J853J446P43J27k52k59n2k21r51j478j029N6R04J307J608J764J516
54112A75537J198J365J779J681J016N29O45J011J267J504J863K253K553K741K852
54097A99794L147L976N090N437M266K173L49q21j819k913l819m284m320m033l612
54082A98611l294k858j689J55J585J892J838K439L345L560L139K891K843K365
54068B16822J580J151Q30k61j932k958l084l335m054m149k933j361n57l22K9L39
54052A95805J38k94l82j63M4M46J353K333K689K498K479K953L590M070M381M462
54036B26402M155L634L431L838M550N136N609O290P053P163O077M291K916K447
54022B92992K397K197J915J739J425P73J99J95M75L10m79j438k221k891l557m240
$$ y = [168455, 170308, 171754, 172497, 172624, 172372, 172113, 172061, 171840, 170889, 169411, 168382, 168438, 169342, 170649, 172257, 174021, 175537, 176735, 178100, 179879, 181560, 182576, 183105, 183750, 184761, 186028, 187532, 189395, 191648, 194201, 196942, 199794, 202941, 206917, 212007, 217444, 221710, 223883, 224232, 223411, 221592, 218679, 214860, 210576, 206256, 202223, 198611, 195317, 192459, 190770, 190925, 192510, 194402, 196240, 198679, 202024, 205584, 208723, 211614, 214457, 216822, 218402, 219553, 220383, 220122, 218190, 215232, 212148, 208813, 204759, 200610, 197677, 196316, 195759, 195437, 195466, 195805, 195943, 195649, 195267, 195104, 195148, 195594, 196947, 199280, 201969, 204467, 206946, 209899, 213489, 217559, 221940, 226402, 230557, 234191, 237622, 241460, 246010, 251146, 256755, 263045, 270098, 277261, 283338, 287629, 290545, 292992, 295389, 297586, 299501, 301240, 302665, 303438, 303637, 303832, 304307, 304617, 304138, 302700, 300479, 297588, 294031, 289791]
54006B89791m910n314n037m203l737m258n135n331m834m407m153l381j894m44
53992B32753K61K58j17o87j261j584j669j705j665j400j070r91j115j221j298
53977B17489j315q91P0Q16O65J40K63R68J309J118J167J724K136K101K195K815
53961B32770L640M476N622P093Q420R615J1172J2689J2561R812N365Q17l203o707
53947C14142r265j0222r602q035o037l956k282j346q39j89P64J702K312K558K645
53932B72350K828L061K935K294J811K200L068L268K548J967K337L193L725L979
53918C11564M532N468O319O635O312N646N298N720O504O864O787O910P173O629
53904C98361M958L156K104J419M55n20j040j500k441l360l475l228l802n253o333
$$ y = [289791, 284881, 279567, 274530, 270327, 266590, 262332, 257197, 251866, 247032, 242625, 238472, 235091, 233197, 232753, 233014, 233272, 233155, 232468, 231207, 229623, 227954, 226249, 224584, 223184, 222114, 221123, 220008, 218787, 217489, 216174, 215283, 215353, 216169, 216834, 216974, 217237, 218205, 219514, 220632, 221799, 223523, 225659, 227760, 229955, 232770, 236410, 240886, 246508, 253601, 262021, 271636, 282808, 295497, 308058, 317870, 323235, 324052, 320849, 314142, 304877, 294655, 285053, 277018, 270981, 267025, 264743, 263397, 262558, 262369, 263133, 264835, 267147, 269705, 272350, 275178, 278239, 281174, 283468, 285279, 287479, 290547, 293815, 296363, 298330, 300667, 303860, 307585, 311564, 316096, 321564, 327883, 334518, 340830, 346476, 351774, 357494, 363998, 370862, 377649, 384559, 391732, 398361, 403319, 406475, 408579, 409998, 410453, 409933, 408893, 407393, 404952, 401592, 398117, 394889, 391087, 385834, 379501]
53889C79501o280n800n907o659p421p786p764p427o838o188n631n096m415l652
53875B92637l092k929l060l249l395l473l329k821k206k014k357k751k836k851
53861B52274l009k921k261j551j522k022k400k597k945l071k212o43L72K61k82
53846B25471o39j001j415j250l01O15Q07N88L61j61j100j664j250m95l30n82m50
53829B17204J69P86J241J543J326M39k92pP81Q04p7p32m71Q6J68r0j10K96R25
53810B23989J544J994K177K173K130K080K106K556L648M950N712N710N375N118
53796B71262M952M814M764M756M568M097L483K919K525K422K603K728K368J541
53782C19802P05J72k83j030k044k952l545m022m646n281n516n237m845m748m900
$$ y = [379501, 373221, 367421, 361514, 354855, 347434, 339648, 331884, 324457, 317619, 311431, 305800, 300704, 296289, 292637, 289545, 286616, 283556, 280307, 276912, 273439, 270110, 267289, 265083, 263069, 260712, 257961, 255125, 252274, 249265, 246344, 244083, 242532, 241010, 238988, 236588, 233991, 231046, 227975, 225763, 225120, 225492, 225753, 225471, 224832, 223831, 222416, 221166, 220865, 221480, 222287, 222875, 223236, 223075, 221975, 220311, 219061, 218566, 218236, 217654, 217204, 217373, 218159, 219400, 220943, 222269, 222708, 222416, 222409, 223190, 223994, 223917, 223185, 222714, 222800, 222968, 222878, 222768, 223064, 223989, 225533, 227527, 229704, 231877, 234007, 236087, 238193, 240749, 244397, 249347, 255059, 260769, 266144, 271262, 276214, 281028, 285792, 290548, 295116, 299213, 302696, 305615, 308140, 310562, 313165, 315893, 318261, 319802, 320507, 320679, 320396, 319366, 317322, 314370, 310825, 306803, 302157, 296876, 291360, 286123, 281278, 276530, 271630]
53767B71630m989m906m675m148l206k127j359j008r02r87j218j262r76r43j774
53752B37150k953l281k566j884j954k158j673o96O3M60P96J170J436J517J261
53737B26688M14p97j592j504r65n80l56k7L23N02N92O68N43K42K66R12J707K017
53719B29053J804J400J034R22J325K046K379K047J599J497J439J135J054J621
53705B50355K338K521K420K692L247L413L037K545K207K089K470L516M671N123
53691B92644M722L848K664J239R5j67K63O29N09k2q82j876k355j823p63j33j57
53674B98435l08l21m71q55j195j359j444j331q11j42R3k14n79n92k40L16Q11R14
53656B90707O32M90P63Q79K76n19n43R2L16k25o97l82L28O67M89J41j05j40J77
$$ y = [271630, 266641, 261735, 257060, 252912, 249706, 247579, 246220, 245212, 244310, 243323, 242105, 240843, 239867, 238924, 237150, 234197, 230916, 228350, 226466, 224512, 222354, 220681, 219985, 220048, 220508, 221304, 222474, 223910, 225427, 226688, 227102, 226305, 224713, 223209, 222244, 221664, 221308, 221281, 221604, 222106, 222698, 223366, 223909, 224151, 224417, 225329, 227036, 229053, 230857, 232257, 233291, 234213, 235538, 237584, 239963, 242010, 243609, 245106, 246545, 247680, 248734, 250355, 252693, 255214, 257634, 260326, 263573, 266986, 270023, 272568, 274775, 276864, 279334, 282850, 287521, 292644, 297366, 301214, 303878, 305117, 305212, 305045, 305308, 305937, 306446, 306424, 305542, 303666, 301311, 299488, 298725, 298592, 298435, 298127, 297806, 297335, 296480, 295285, 293926, 292482, 291151, 290340, 290198, 290291, 290077, 289498, 288906, 288666, 288982, 289793, 290707, 291339, 291829, 292592, 293471, 293747, 293228, 292685, 292777, 293093, 292868, 292171, 291789, 292117, 292784, 293273, 293414, 293309, 293169, 293346]
53637B93346R26J985K973L344K779J792J508K404L574L830L129K340J997K042
53623C27969K476L339M197M540M641N162N938O086N289M144L167K347J712J472
53609C82479J461J263J036J407K418L388L925M201M192L643K913K757K937K259
53595D20279M50j086j099q7P24J007J076P73k13j397j887j585j168j091j295j689
53579D11712k207k517k379k148k282k503k156j388j156j847k614k446j442n18
53565C84109k02k34k34k58m94p86p96n62m86o96p34j36R13J772K025J671Q42k02
53547C85512q08k47J356K785K777J384nk5J343K841L257K578J834J924K799L742
53531D13047M245M460M911N889P037P687P732P890Q785R966J0475J0256J0221
$$ y = [293346, 294272, 296257, 299230, 302574, 305353, 307145, 308653, 311057, 314631, 318461, 321590, 323930, 325927, 327969, 330445, 333784, 337981, 342521, 347162, 352324, 358262, 364348, 369637, 373781, 376948, 379295, 381007, 382479, 383940, 385203, 386239, 387646, 390064, 393452, 397377, 401578, 405770, 409413, 412326, 415083, 418020, 420279, 420729, 419643, 418544, 418457, 419181, 420188, 421264, 422037, 421824, 420427, 418540, 416955, 415787, 414696, 413401, 411712, 409505, 406988, 404609, 402461, 400179, 397676, 395520, 394132, 392976, 391129, 388515, 386069, 384627, 384109, 383907, 383673, 383439, 383181, 382687, 381901, 381105, 380543, 380057, 379361, 378627, 378491, 379404, 381176, 383201, 384872, 385714, 385512, 384704, 384457, 385813, 388598, 391375, 392759, 392754, 392729, 394072, 396913, 400170, 402748, 404582, 406506, 409305, 413047, 417292, 421752, 426663, 432552, 439589, 447276, 455008, 462898, 471683, 481649, 492124, 502380, 512601]
53518E12601J0844J1591J2026J2553J3549J4556J5069J5447J6260J7385J8455
53507F70336J9608K0982K2075K2485K2765K3546K4304K4082K2983K1856K0842
53496I15864J9495J8043J7217J6940J6468J5793J5611J5857J5665J4980J4779
53485A096712J5337J5670J5181J4618J4728J5124J5241J5395J6025J6683J6572
53474A267286J5555J3969J2037J0005Q230O632M607J919q54l147m992o566p838
53461A316843r070j0734j2528j3411j3132j2742j3040j3524j3646j4004j5231
53450A175781j6662j7289j7362j7751j8288j8076j7153j6496j6445j6297j5551
53439I88411j4513j3468j2163j0360q268o167m173k491j404q51m61m7L30P86J637
$$ y = [512601, 523445, 535036, 547062, 559615, 573164, 587720, 602789, 618236, 634496, 651881, 670336, 689944, 710926, 733001, 755486, 778251, 801797, 826101, 850183, 873166, 895022, 915864, 935359, 953402, 970619, 987559, 1004027, 1019820, 1035431, 1051288, 1066953, 1081933, 1096712, 1112049, 1127719, 1142900, 1157518, 1172246, 1187370, 1202611, 1218006, 1234031, 1250714, 1267286, 1282841, 1296810, 1308847, 1318852, 1327082, 1333714, 1338321, 1340240, 1339386, 1336239, 1331247, 1324681, 1316843, 1307773, 1297039, 1284511, 1271100, 1257968, 1245226, 1232186, 1218662, 1205016, 1191012, 1175781, 1159119, 1141830, 1124468, 1106717, 1088429, 1070353, 1053200, 1036704, 1020259, 1003962, 988411, 973898, 960430, 948267, 937907, 929639, 923472, 919299, 916808, 915404, 914553, 914092, 914045, 914375, 915161, 916798]
53424I16798K966M522O051P374Q230Q507Q592R178J0551J2385J4137J5529J6667
53411A041487J7934J9631K1540K3053K3904K4515K5382K6515K7738K9109L0672
53400A311480L2137L3307L4543L6275L8410M0629M2921M5247M7048M7838M8093
53389A757928M8767N0022N1087N1341N0876M9882M8279M6166M4081M2420M0953
53378B281802L9207L7103L4968L2953L0614K7156K2302J6925J2378R008N679J204
53366B551299m285r853j5240k0944k7018l2691l7255m0639m2971m4328m5117m5985
53354B184973m6946m7264m6547m5405m4490m3473m1636l9113l6832l5342l4389
53343A723536l3665l3342l3621l4227l4625l4484l3742l2358l0282k7598k4564
$$ y = [916798, 919764, 924286, 930337, 937711, 945941, 954448, 963040, 972218, 982769, 995154, 1009291, 1024820, 1041487, 1059421, 1079052, 1100592, 1123645, 1147549, 1172064, 1197446, 1223961, 1251699, 1280808, 1311480, 1343617, 1376924, 1411467, 1447742, 1486152, 1526781, 1569702, 1614949, 1661997, 1709835, 1757928, 1806695, 1856717, 1907804, 1959145, 2010021, 2059903, 2108182, 2154348, 2198429, 2240849, 2281802, 2321009, 2358112, 2393080, 2426033, 2456647, 2483803, 2506105, 2523030, 2535408, 2544416, 2550095, 2551299, 2547014, 2537161, 2521921, 2500977, 2473959, 2441268, 2404013, 2363374, 2320403, 2276075, 2230958, 2184973, 2138027, 2090763, 2044216, 1998811, 1954321, 1910848, 1869212, 1830099, 1793267, 1757925, 1723536, 1689871, 1656529, 1622908, 1588681, 1554056, 1519572, 1485830, 1453472, 1423190, 1395592, 1371028]
53332A371028k1546j8927j6934j5467j4181j2862j1622j0716j0298j0454j1211
53321A216810j2344j3343j3862j4003j3946j3478j2335j0812r497q485p435o425
53309A080845n917n729m916l169j552j052j031p3K098M499O434Q095R652J0847
53295A099031J1711J2783J4303J5909J7413J9149K1174K2841K3600K3695K3626
53284A305235K3443K2956K2195K1212J9820J7922J5791J3626J1260Q580N952L719
53272A491711J640q35l871p119j0124j2628j4679j6541j8285j9528j9997k0286
53260A349458k1395k3360k5025k5505k5292k5418k6106k6808k7020k6552k5278
53249A071699k3324k1343k0088j9798k0183k0789k1135k0869k0167j9702j9846
$$ y = [1371028, 1349482, 1330555, 1313621, 1298154, 1283973, 1271111, 1259489, 1248773, 1238475, 1228021, 1216810, 1204466, 1191123, 1177261, 1163258, 1149312, 1135834, 1123499, 1112687, 1103190, 1094705, 1087270, 1080845, 1074928, 1069199, 1064283, 1061114, 1059562, 1058510, 1057479, 1057406, 1059504, 1064003, 1070437, 1078532, 1088184, 1099031, 1110742, 1123525, 1137828, 1153737, 1171150, 1190299, 1211473, 1234314, 1257914, 1281609, 1305235, 1328678, 1351634, 1373829, 1395041, 1414861, 1432783, 1448574, 1462200, 1473460, 1482040, 1487992, 1491711, 1493351, 1492516, 1488645, 1481526, 1471402, 1458774, 1444095, 1427554, 1409269, 1389741, 1369744, 1349458, 1328063, 1304703, 1279678, 1254173, 1228881, 1203463, 1177357, 1150549, 1123529, 1096977, 1071699, 1048375, 1027032, 1006944, 987146, 966963, 946174, 925039, 904170, 884003, 864301, 844455]
53238H44455k0150j9925j9055j7963j7024j6312j5632j4565j2864j0916r460q648
53226F61941p903o938o241o210o487o664o994p803q743r344r851j0750j1876j2753
53212E43384j3408j4065j4317j3493j1815j0327r636r372q922q113p081n982n077
53199D11776m676m890n555o345o861o883o734o992p575p584o508n122m567m942
53185C26542n429n494n182m496l329k048j369j536k073k371k146j460p46o98j509
53170B86656k442k560j854j110q49r97j359j773j859j357p02o29j125j416j125
53155B65499p87j069j931k709k721j760l39O05O02J18k08m61r94j429r59L60J480
53138B53297J632J033K96j91j66M07R80Q15O3k77K93J126J497J564J768J982J838
$$ y = [844455, 824305, 804380, 785325, 767362, 750338, 734026, 718394, 703829, 690965, 680049, 670589, 661941, 654038, 647100, 640859, 634649, 628162, 621498, 614504, 606701, 597958, 588614, 578763, 568013, 556137, 543384, 529976, 515911, 501594, 488101, 476286, 465959, 456323, 446951, 438029, 429916, 422835, 416853, 411776, 407100, 402210, 396655, 390310, 383449, 376566, 369832, 362840, 355265, 347681, 341173, 336051, 331484, 326542, 321113, 315619, 310437, 305941, 302612, 300564, 299195, 297659, 295586, 293215, 291069, 289609, 288863, 288165, 286656, 284214, 281654, 279800, 278690, 277841, 276844, 275485, 273712, 271853, 270496, 269794, 269165, 268040, 266624, 265499, 264712, 263643, 261712, 259003, 256282, 254522, 254183, 254788, 255390, 255508, 255300, 254839, 253845, 252416, 251457, 251817, 253297, 254929, 255962, 256258, 256067, 255901, 256308, 257288, 258103, 258166, 257889, 258182, 259308, 260805, 262369, 264137, 266119, 267957]
53121B67957J481J301J230R47N91O93J340J999K213K036J678J079J60p54j108
53106B82843p72l11l65r82j716k294k783l068k717j648n59k24n66q70p85o06o38
53089B61939p64q01q45j020j111p36J36R41R51N3r98j286p70k63m12j039j619
53072B52356j936j979j632q98j61K33M06O23P19L25n13j312j723j773j659j522
53056B39554j362j034m59J19M15O08J063J566J485Q85O41J058J376J130R98J492
53040B49535J798J044j11n07m02q72j691j509j28R71Q04J19k1K50K10k17n67n75
53022B48131k98J23M40M58L75N00O61M24q0k40J0O8l13o52o04m55m36k88J34M70
53002B48428M09R5k77p38j077q40l9O54P95P01P43P49M77K04L19P82J331J907
$$ y = [267957, 269438, 270739, 271969, 272916, 273507, 274200, 275540, 277539, 279752, 281788, 283466, 284545, 284705, 283951, 282843, 282071, 281760, 281395, 280413, 278697, 276403, 273620, 270552, 267835, 266187, 265628, 265404, 264838, 263968, 263183, 262577, 261939, 261175, 260374, 259529, 258509, 257398, 256662, 256798, 257739, 258690, 258743, 257745, 256459, 255689, 255426, 255014, 253975, 252356, 250420, 248441, 246809, 245911, 245750, 245983, 246389, 247012, 247731, 248056, 247543, 246231, 244508, 242735, 241076, 239554, 238192, 237158, 236699, 236818, 237233, 237841, 238904, 240470, 241955, 242840, 243481, 244539, 245915, 247045, 248043, 249535, 251333, 252377, 252266, 251759, 251357, 250485, 248794, 247285, 247157, 248128, 248932, 249051, 249030, 249280, 249490, 249273, 248706, 248131, 247833, 247956, 248396, 248854, 249229, 249729, 250390, 250814, 250734, 250494, 250504, 250572, 250259, 249607, 249003, 248548, 248112, 247824, 247958, 248428, 248837, 248932, 248655, 247917, 246840, 246000, 245961, 246615, 247410, 248111, 248854, 249603, 250080, 250284, 250603, 251385, 252716, 254623]
52984B54623K470K741K517K034J731J837K282K770K850K270J311N03J8l57p26
52969B78874j016j290j558j414m46R66J910K016J736J539J437J316J023K09j194
52954B84108k328k194j150p12j635l063l817l641k847j709p31n85j221j677j334
52939B55464o36j61J97N76N34j16n89j22P62Q97M8q67j033n25N2J75k93j005j393
52920B51965j201o34RN63Q08N63Q1o0K82P00R38J119J078K80j193k283k122j068
52902B49825p7M73P59Q11M34k86r34j133p48N1P60Q53L51j78k10L23J179J911
52884B54164J976J240L47K9K19L99N40P90O49l81j479j252J76J264J462J911L257
52867B65311M447M546M154M014L587K261P92J51J5m20r75j187j490k376l145l009
$$ y = [254623, 257093, 259834, 262351, 264385, 266116, 267953, 270235, 273005, 275855, 278125, 279436, 279939, 279957, 279600, 278874, 277858, 276568, 275010, 273596, 273150, 274116, 276026, 278042, 279778, 281317, 282754, 284070, 285093, 285302, 284108, 281780, 279586, 278436, 277724, 276089, 273026, 269209, 265568, 262721, 261012, 260281, 259696, 258475, 256798, 255464, 254828, 254667, 254864, 255440, 255974, 255858, 255269, 255147, 255909, 256806, 256854, 255987, 254954, 254429, 254481, 254656, 254363, 253358, 251965, 250764, 250130, 250139, 250702, 251510, 252073, 252154, 252094, 252376, 253076, 254014, 255133, 256211, 256491, 255298, 253015, 250893, 249825, 249748, 250221, 250980, 251791, 252225, 251939, 251005, 249872, 249124, 249175, 249935, 250788, 251139, 250961, 250751, 251074, 252253, 254164, 256140, 257380, 257727, 257756, 257975, 258374, 258914, 259704, 260353, 259972, 258493, 257241, 257417, 258681, 260143, 262054, 265311, 269758, 274304, 278458, 282472, 286059, 288320, 289112, 289263, 289278, 288858, 287883, 286696, 285206, 282830, 279685, 276676]
52851B76676k611l000l698l487k598k391l043l307k610j815j593j468r44m40n19
52836B43152j089j728k126j996j187j06N25N29L52L79O95J308J984K057J142q1
52820B43810o06l86j89k93k66K2J34o8j05L47J025J555J828J819J543J178Q26
52803B52174K48o91j563j887j851j857j703j006j81j14q99j647j596p99J77O59
52787B37464K22p75j255o98M0n6o55p36k88j64m76m65J27P14J025J345J593J253
52769B38215M46o8j42m60j176j470q15K88J168J689J745J127K50K6N58Q85M83
52752B42749K7J53M05J97j09R7N67O79N23O93J301J836J865J413Q07M95O93J049
52734B55440R30K86k52k45Q9M60Q97J290J261Q65P75J221J396N27q72j606j329
$$ y = [276676, 274065, 271065, 267367, 263880, 261282, 258891, 255848, 252541, 249931, 248116, 246523, 245055, 244111, 243671, 243152, 242063, 240335, 238209, 236213, 235026, 234920, 235445, 235974, 236326, 236705, 237400, 238708, 240692, 242749, 243891, 243810, 243204, 242818, 242629, 242336, 242070, 242092, 242226, 242158, 242053, 242400, 243425, 244980, 246808, 248627, 250170, 251348, 252174, 252422, 251731, 250168, 248281, 246430, 244573, 242870, 241864, 241683, 241569, 240670, 239023, 237427, 236628, 236805, 237464, 237686, 236911, 235656, 234958, 234998, 234942, 234287, 233551, 233263, 233099, 232623, 232158, 232285, 232999, 234024, 235369, 236962, 238215, 238661, 238593, 238451, 237991, 236815, 235345, 234530, 234818, 235986, 237675, 239420, 240547, 240797, 240823, 241381, 242266, 242749, 242776, 242929, 243334, 243531, 243422, 243519, 244086, 244765, 245288, 245981, 247282, 249118, 250983, 252396, 253203, 253698, 254391, 255440, 256370, 256656, 256404, 256159, 256248, 256708, 257605, 258895, 260156, 261021, 261796, 263017, 264413, 264940, 264068, 262462, 261133]
52717B61133q07p47r89r89o13k54k41m00k84J31L64J41j54j25q6n03j019q76j40
52698B53542L32K11P1L38O31N31K00l1n7K50R65J561J214M4p44m37K10J56m64
52679B58523p53l96J34M10L78R0l94q90j214j311j125o57k53l66q29q54o6R53
52661B51380J483J529J531J608J634J627J684J735J679J607J657J902K420L026
52647B76502K995J759k3q74l93Q7o87k194k955k490j552p82j09N36P62K59o01
52630B70240j038o52J70P03P73J021J936K873K651J107o40j538j582j256q18n39
52614B73411p74j342j422o74J65L41J52K81O06N29Q0q8L30R95J457J464R13M7
52596B76471m30m2P87J173P75N1l94k91K82R96J425J396J097P43L83J41K45N89
$$ y = [261133, 260326, 259579, 258590, 257601, 256988, 256734, 256493, 256093, 255809, 255940, 256304, 256445, 256291, 256166, 256080, 255577, 254558, 253682, 253542, 253874, 254085, 254156, 254494, 255125, 255656, 255856, 255825, 255768, 256018, 256983, 258544, 259758, 259802, 259058, 258621, 258831, 258987, 258523, 257770, 257374, 257508, 257918, 258296, 258386, 257992, 257102, 255888, 254577, 253452, 252795, 252542, 252176, 251347, 250493, 250427, 251380, 252863, 254392, 255923, 257531, 259165, 260792, 262476, 264211, 265890, 267497, 269154, 271056, 273476, 276502, 279497, 281256, 281233, 280359, 279966, 280053, 279366, 277172, 274217, 271727, 270175, 269393, 269284, 269820, 270582, 270841, 270240, 269202, 268550, 268720, 269423, 270196, 271217, 273153, 276026, 278677, 279784, 279144, 277606, 276024, 274768, 273950, 273411, 272637, 271295, 269873, 269199, 269364, 269705, 269857, 270138, 270744, 271273, 271353, 271265, 271595, 272590, 274047, 275511, 276424, 276471, 276041, 275999, 276786, 277959, 278734, 278785, 278391, 278100, 278382, 279378, 280803, 282199, 283296, 284039, 284422, 284563, 284808, 285397]
52578B85397P46O01N22O68O46K31j86k68k60l44j86K94L42o22j854k055j004K90
52560B82958Q18L74n92j236p99M68J225N62p52j377j177r76r62n88L5N3o01q13
52542B76620P5J224J473Q14N9l03k72J46Q57J369J157L85j76j7N15O50J09n23
52524B84162m71K55Q98R89Q70R34Q73L05k60L7J070J741J510J069J270K036K723
52507C00011L083L315L510L463K957J944N30j065k597l896m797n057m597l762
52493B93042l005k308j335j72N13K77n35j298j809k148k117j360lJ222J693J490
52477B82147J100P91N00K83M46J056J650J729J418J254J407J569J616J847K418
52462C01231K949L010K692K384K242K131J803R57n54k268l260l071k279j781j845
$$ y = [285397, 286143, 286744, 287266, 287934, 288580, 288811, 288625, 288357, 288097, 287753, 287567, 287861, 288203, 287581, 285727, 283672, 282668, 282958, 283776, 284150, 283558, 282322, 281523, 281991, 283216, 283778, 283026, 281649, 280472, 279496, 278534, 277946, 277981, 278034, 277433, 276620, 276695, 277919, 279392, 280206, 280265, 279962, 279690, 279836, 280693, 282062, 283219, 283604, 283428, 283411, 283926, 284576, 284685, 284162, 283691, 283946, 284844, 285833, 286703, 287637, 288510, 288815, 288555, 288592, 289662, 291403, 292913, 293982, 295252, 297288, 300011, 303094, 306409, 309919, 313382, 316339, 318283, 318813, 317748, 315151, 311255, 306458, 301401, 296804, 293042, 290037, 287729, 286394, 286222, 286735, 287012, 286477, 285179, 283370, 281222, 279105, 277745, 277742, 278964, 280657, 282147, 283247, 284038, 284538, 284821, 285267, 286323, 287973, 289702, 291120, 292374, 293781, 295350, 296966, 298813, 301231, 304180, 307190, 309882, 312266, 314508, 316639, 318442, 319399, 318845, 316577, 313317, 310246, 307967, 306186, 304341]
52447C04341k197k641l118l398l235k750k234j732j170p15n57n23l40j43k45n46
52431B78797o60n26m10l88k43P0L41M32L95K98K49M39Q83J253J342J401J648J765
52413B87086J466J204J624K495K984K967L227M302N902P669R729J2088J4034J4546
52399C71323J3022R516M664m24m677p721r739j0738j0512r379q160p163n843l871
52385C20298j899p71m80m22k92q4L03Q63J177R94Q56J435K398K757K419K464L570
52368C35586M928N351M822M230L877L231K107J175Q81O15m00j888k887l094k960
52353C55574k612j565J72J595J787J051M25M30P89J077J144J101J272J965K975
52338C67180L598L547L443L929M662M904M780N145O268P492Q325R094J0244J1596
$$ y = [304341, 302144, 299503, 296385, 292987, 289752, 287002, 284768, 283036, 281866, 281151, 280594, 280071, 279731, 279588, 279343, 278797, 278137, 277611, 277201, 276813, 276570, 276640, 276981, 277413, 277808, 278106, 278355, 278794, 279677, 280930, 282272, 283673, 285321, 287086, 288552, 289756, 291380, 293875, 296859, 299826, 303053, 307355, 313257, 320926, 330655, 342743, 356777, 371323, 384345, 393861, 398525, 398101, 393424, 385703, 375964, 365226, 354714, 345335, 337175, 330012, 324169, 320298, 318399, 317628, 317148, 316726, 316434, 316350, 316653, 317516, 318693, 319687, 320543, 321978, 324376, 327133, 329552, 332016, 335586, 340514, 345865, 350687, 354917, 358794, 362025, 364132, 365307, 366188, 366803, 366403, 364515, 361628, 358534, 355574, 352962, 351397, 351569, 353164, 354951, 356002, 356427, 356857, 357646, 358723, 359867, 360968, 362240, 364205, 367180, 370778, 374325, 377768, 381697, 386359, 391263, 396043, 401188, 407456, 414948, 423273, 432367, 442611, 454207]
52324D54207J2634J3168J3424J3764J4507J5671J6744J7026J6389J5464J5010
52313F18008J5253J5840J6230J6134J5829J5962J6737J7520J7682J7555J7934
52302H00684J8781J9261J9095J8939J9201J9289J8598J7372J6024J4181J1225
52291I92650P427L764Q13j573l568n034n918o415o731p018p567q560r532r586
52277I33152q366o522m966l963l158k198j018L46J895L560N240O883Q378R426
52263I38689R831R925J0272J0852J1024J0638J0689J2197J4668J6508J6901J6540
52251A088734J6325J6213J5796J5113J4202J2407R163N166J858k33j891l875n987
52238A182991p609q515q889r006r265j0024j1125j1839j1672j0998j0607j0768
$$ y = [454207, 466841, 480009, 493433, 507197, 521704, 537375, 554119, 571145, 587534, 602998, 618008, 633261, 649101, 665331, 681465, 697294, 713256, 729993, 747513, 765195, 782750, 800684, 819465, 838726, 857821, 876760, 895961, 915250, 933848, 951220, 967244, 981425, 992650, 1000077, 1003841, 1004654, 1003081, 999513, 994479, 988561, 982146, 975415, 968397, 960830, 952270, 942738, 933152, 924786, 918264, 913298, 909335, 906177, 903979, 902961, 903307, 905202, 908762, 914002, 920885, 929263, 938689, 948520, 958445, 968717, 979569, 990593, 1001231, 1011920, 1024117, 1038785, 1055293, 1072194, 1088734, 1105059, 1121272, 1137068, 1152181, 1166383, 1178790, 1187953, 1193119, 1194977, 1194744, 1192853, 1188978, 1182991, 1175382, 1166867, 1157978, 1148972, 1139707, 1129683, 1118558, 1106719, 1095047, 1084049, 1073442, 1062674]
52226A062674j1009j0828j0350j0102j0237j0196r384p993o788o047n302m274
52214I60164l453l238l064k097m60J000J955K843L901M737N015M885M516L805
52200I80509K794J935J704K273L583N314O736P193O851O513O573O642O345N847
52186A050812N387M764L690K229O33r75k557m098n742p593r275j0156j0096r591
52172A007432r015q248p164o022n078m313l744l455l091j914K79K748M675N898
52158I68988O502O214M863K971J364L82j21k72r9K48O10R23R69M34m78r15l31
52141I92252P60J435J444J142P08M2p38j336j705j856j424J1K195M384O321Q434
52125A012069J0967J3496J5552J7265J9043K0948K2744K4393K6071K7705K8741
$$ y = [1062674, 1051665, 1040837, 1030487, 1020385, 1010148, 999952, 990568, 982575, 975787, 969740, 964438, 960164, 956711, 953473, 950409, 948312, 947852, 948852, 950807, 953650, 957551, 962288, 967303, 972188, 976704, 980509, 983303, 985238, 986942, 989215, 992798, 998112, 1004848, 1012041, 1018892, 1025405, 1031978, 1038620, 1044965, 1050812, 1056199, 1060963, 1064653, 1066882, 1067515, 1066540, 1063983, 1059885, 1054143, 1046550, 1037275, 1027119, 1017023, 1007432, 998417, 990169, 983005, 976983, 971905, 967592, 963848, 960393, 957302, 955388, 955667, 958415, 963090, 968988, 975490, 981704, 986567, 989538, 990902, 991284, 991163, 990891, 990792, 991040, 991650, 992573, 993542, 993976, 993498, 992583, 992252, 993012, 994447, 995891, 997033, 997741, 997783, 997045, 995709, 994004, 992148, 990724, 990735, 992930, 997314, 1003635, 1012069, 1023036, 1036532, 1052084, 1069349, 1088392, 1109340, 1132084, 1156477, 1182548, 1210253, 1238994]
52114A238994K8571K7135K5074K3211K1914K0955J9926J8655J7165J5485J3688
52103A470773J2099J1243J1412J2246J2837J2399J0890Q969P259N786M113J792
52091A581818j385n284r313j2712j5285j7620k0138k2233k2872k1903k0154j8345
52079A394574j6523j4575j2619j0657q523o364m613l277j895l40R33J837L112
52066A321070N309P882R852J1007J1862J2814J3848J4841J5554J5622J5043J4473
52054A469177J4551J5083J5288J4614J2979J0480P421M441K034n4k553n767r267
52041A548427j2376j4683j6185j7211j8099j8682j8425j7261j5989j5384j5260
52030A368872j4921j4237j3671j3464j3415j3480j3845j4428j4867j5087j5292
$$ y = [1238994, 1267565, 1294700, 1319774, 1342985, 1364899, 1385854, 1405780, 1424435, 1441600, 1457085, 1470773, 1482872, 1494115, 1505527, 1517773, 1530610, 1543009, 1553899, 1562868, 1570127, 1575913, 1580026, 1581818, 1580433, 1575149, 1565836, 1553124, 1537839, 1520219, 1500081, 1477848, 1454976, 1433073, 1412919, 1394574, 1378051, 1363476, 1350857, 1340200, 1331677, 1325313, 1320700, 1317423, 1315528, 1315188, 1316121, 1317958, 1321070, 1326379, 1334261, 1344113, 1355120, 1366982, 1379796, 1393644, 1408485, 1424039, 1439661, 1454704, 1469177, 1483728, 1498811, 1514099, 1528713, 1541692, 1552172, 1559593, 1564034, 1566068, 1566014, 1563461, 1557694, 1548427, 1536051, 1521368, 1505183, 1487972, 1469873, 1451191, 1432766, 1415505, 1399516, 1384132, 1368872, 1353951, 1339714, 1326043, 1312579, 1299164, 1285684, 1271839, 1257411, 1242544, 1227457, 1212165]
52019A212165j5367j4909j4061j3577j3693j3534j2261j0366r115q929r014q663
52007A068676q148q039q334q797r796j1929j4904j7431j8499j8214j7202j5824
51995I11559j4377j3397j3031j2493j0987q956p663p672q541r914j1846j3888
51983G78794j4969j4747j4263j4630j5627j6232j5965j5182j4418j4056j4193
51972F14512j4274j3271j0820p893n698m159k169Q01L993O225P016O829O579O847
51958E94518P286O896N080K280o15l141n254o817p673p971p972p608o580m777
51944E57652k359L48K853M814O574Q949J2055J4840J6283J6636J6904J7479J7954
51931F90982J8024J7777J7243J6182J4286J1177O445J42o888j3649j9605k4371
$$ y = [1212165, 1196798, 1181889, 1167828, 1154251, 1140558, 1127024, 1114763, 1104397, 1095282, 1086353, 1077339, 1068676, 1060528, 1052489, 1044155, 1035358, 1025562, 1013633, 998729, 981298, 962799, 944585, 927383, 911559, 897182, 883785, 870754, 858261, 847274, 838318, 830655, 822983, 814442, 804528, 792682, 778794, 763825, 749078, 734815, 720185, 704558, 688326, 672361, 657179, 642761, 628705, 614512, 600238, 586967, 576147, 568254, 562556, 558397, 556228, 557029, 561022, 567247, 574263, 581092, 587671, 594518, 601804, 608700, 613780, 616060, 615445, 612304, 607050, 600233, 592560, 584589, 576617, 569009, 562429, 557652, 555293, 555641, 558494, 563308, 569882, 578831, 590886, 605726, 622009, 638645, 655549, 673028, 690982, 709006, 726783, 744026, 760208, 774494, 785671, 792116, 792258, 785370, 771721, 752116, 727745]
51919G27745k7366k8438k8316k7674k6105k2952j8845j5328j3054j1319r383p270
51907D91695n194l063r16R34K499M179O060P614Q300Q044P057N675M255K650k0
51892E39769m281r060j2450j3783j4023j3985j3252j1240q379n593l299j450K5
51879D28999J387L081N107O830P870Q661R645J0445J0465R793Q917P823O079L598
51865E28700Q55j609l493m700n384n869o223o066n077l521k005q20J90J248K350
51850D88576L227L482K850J482k38k135m235o269p602p909p589p263p079o714
51836D42584n861m524l057k013j688j649j072L53K008L004K990K241J290N75J30
51821D35311m95j697l128l986l961l463k765j647j26J123J601J723K234L119L619
$$ y = [727745, 700379, 671941, 643625, 615951, 589846, 566894, 548049, 532721, 519667, 508348, 498965, 491695, 486501, 483438, 482522, 483456, 485955, 490134, 496194, 503808, 512108, 520152, 527209, 532884, 537139, 539789, 539769, 535488, 526428, 513978, 500195, 486172, 472187, 458935, 447695, 439316, 433723, 430424, 428974, 428999, 430386, 433467, 438574, 445404, 453274, 461935, 471580, 482025, 492490, 502283, 511200, 519023, 525102, 528700, 529555, 527946, 524453, 519753, 514369, 508500, 502277, 496211, 491134, 487613, 485608, 484788, 484978, 486226, 488576, 491803, 495285, 498135, 499617, 499379, 497244, 493009, 486740, 479138, 471229, 463640, 456377, 449298, 442584, 436723, 432199, 429142, 427129, 425441, 423792, 422720, 423073, 425081, 428085, 431075, 433316, 434606, 435181, 435311, 434816, 433119, 429991, 426005, 422044, 418581, 415816, 414169, 414043, 415166, 416767, 418490, 420724, 423843, 427462]
51806D27462L065J413p24k309k630k094j839k161k031o89R64J529J098R27J300
51791D23281J044n50k450l212k783k206k025j821j163l10K99O76J127J632J717
51776D13256J075J50m9J073K994M521M978M835N090O188P726R090J0036J0496
51762D81459J0174Q739O389L807J369j232m338p504r753j0595j0432j0004r739
51749D48340r607r295q437p013n550m637m192l531k269p96L18J053J816K902M313
51734D03415N900P372Q307Q406P722O457M648K299k13k070k483j294Q35K739L485
51719D55525K867J325n31k276l684m687n215n020l836k002o30o46j636k239j724
51704D25591o46K33R96K112L465M384M497L954K920J357n93k351l234k920j604
$$ y = [427462, 430527, 431940, 431216, 428907, 426277, 424183, 422344, 420183, 418152, 417463, 418427, 419956, 421054, 421981, 423281, 424325, 423775, 421325, 418113, 415330, 413124, 411099, 409278, 408115, 407805, 408104, 408780, 409907, 411539, 413256, 414331, 414481, 414432, 415505, 418499, 423020, 427998, 432833, 437923, 444111, 451837, 460927, 470963, 481459, 491633, 500372, 506761, 510568, 511937, 510705, 506367, 498863, 489110, 478515, 468083, 458079, 448340, 438733, 429438, 421001, 413988, 408438, 403801, 399609, 396078, 393809, 393013, 393331, 394384, 396200, 399102, 403415, 409315, 416687, 424994, 433400, 441122, 447579, 452227, 454526, 454313, 452243, 449760, 448466, 449301, 452040, 455525, 458392, 459717, 459186, 456910, 453226, 448539, 443324, 438304, 434468, 432466, 431836, 431190, 429554, 427315, 425591, 424945, 425178, 426174, 428286, 431751, 436135, 440632, 444586, 447506, 448863, 448270, 445919, 442685, 439765, 438161]
51689D38161J47J678K521K503J628J5j967l662m522m547m251m063l823k969j280
51674D15569O08J654J446O77M47J202K521L756M586N139N795O911Q392R539R565
51659D77807Q212N706K309j698n561q175q812p641n392k723J13L220O622R657
51645D73644J0962R481N550O35l900p490j0021j1412j1754j1371j0519r233p525
51632D17047n435k980m03J585K322J961J270O93Q7o10j162j528j960k453k643
51617D05791k486k455k861l492m087m606m844m421l421k504k078j880j556j111
51603C63989n76J08P10Q99R92J749L131M246M831N803P771R990J1464J2049J1666
51588D38822R521N334N65k879m699n812o498o270n185l916k524m12K422N265P857
$$ y = [438161, 438308, 439986, 442507, 445010, 446638, 446653, 444686, 441024, 436502, 431955, 427704, 423641, 419818, 416849, 415569, 416177, 417831, 419277, 419954, 420401, 421603, 424124, 427880, 432466, 437605, 443400, 450311, 458703, 468242, 477807, 486019, 491725, 494034, 492336, 486775, 478600, 469788, 462147, 456755, 454032, 454145, 457365, 463987, 473644, 484606, 494087, 499637, 500272, 496372, 488882, 478861, 467449, 455695, 444324, 433805, 424572, 417047, 411612, 408632, 408229, 409814, 412136, 414097, 415367, 416060, 416147, 415537, 414375, 412847, 410887, 408434, 405791, 403305, 400850, 397989, 394497, 390410, 385804, 380960, 376539, 373118, 370614, 368536, 366656, 365100, 363989, 363413, 363521, 364231, 365130, 366122, 367871, 371002, 375248, 380079, 385882, 393653, 403643, 415107, 427156, 438822, 448343, 453677, 454242, 451363, 446664, 440852, 434354, 428084, 422899, 418983, 416459, 416047, 418469, 423734, 431591]
51573D31591J0575J3310J5262J6148J6598J7072J7325J7280J7474J8121J8539
51562F09295J8148J7418J7369J8592K1202K5107K9783L4138L7216L8685L8298
51551I05251L5288K8967J9798R397o27r560j7386k4122k9571l3655l6612l8680
51539H08488l9627l8862l6220l2310k7973k3650j9426j5350j1434p746m827l512
51527E47551l848m719n225n854p422r350j0159r554q719q446q190p344o300n656
51513D46765n279m843m567m666m651l934k782k036k111k744l467l839l560k793
51499C95493k099j695j084J25J412J861J336N79K96N45R42J183J334J821K871
51484D04920L889L797K313M52o74j122j597k196k439k396k756l600l971l128j644
$$ y = [431591, 442166, 455476, 470738, 486886, 503484, 520556, 537881, 555161, 572635, 590756, 609295, 627443, 644861, 662230, 680822, 702024, 727131, 756914, 791052, 828268, 866953, 905251, 940539, 969506, 989304, 998701, 998074, 988514, 971128, 947006, 917435, 883780, 847168, 808488, 768861, 729999, 693779, 661469, 633496, 609846, 590420, 575070, 563636, 555890, 551063, 547551, 543703, 538984, 533759, 527905, 520483, 511133, 500974, 491420, 482701, 474255, 466065, 458721, 452421, 446765, 441486, 436643, 432076, 427410, 422759, 418825, 416043, 414007, 411896, 409152, 405685, 401846, 398286, 395493, 393394, 391699, 390615, 390740, 392152, 394013, 395349, 395928, 396224, 396769, 397711, 398894, 400228, 402049, 404920, 408809, 412606, 414919, 415371, 414697, 413575, 411978, 409782, 407343, 404947, 402191, 398591, 394620, 391492, 389848]
51469C89848p57r57j726k490l220m032m628m506l641k683k301k507k703k400j672
51454C49625r23m13r2K23O92J339J965K311K424K761L766N442P484R653J1854
51439C98111J3883J5363J5894J5073J2536Q396L785N04l19P52J992K092R70q63
51425D88169l159n808q216r505r445q655p755o776n710n036n051n108m290k755
51411D00900j573j216j013l94J68M2m19m04J08M83O32J185K304L224L325L075
51395D10427L302L983M362M150L956M417N414O440P419Q726J0532J2551J4633
51382E00312J7270K1143K6170L1375L5929M0028M4434M9291N3898N7627O0281
51371I37758O1120N8256N0088L7346K2851Q997l840j6132k7396l6466m3033m7888
$$ y = [389848, 389091, 388134, 386408, 383918, 380698, 376666, 372038, 367532, 363891, 361208, 358907, 356400, 353697, 351297, 349625, 348702, 348289, 348197, 348420, 349112, 350451, 352416, 354727, 357151, 359912, 363678, 369120, 376604, 386257, 398111, 411994, 427357, 443251, 458324, 470860, 479256, 483041, 483545, 483226, 483978, 485970, 488062, 489032, 488169, 485010, 479202, 470986, 461481, 452036, 443381, 435626, 428850, 423140, 418104, 413053, 407945, 403655, 400900, 399327, 398111, 397098, 396704, 396872, 396914, 396495, 396091, 396199, 396682, 397314, 398499, 400803, 404027, 407352, 410427, 413729, 417712, 422074, 426224, 430180, 434597, 440011, 446451, 453870, 462596, 473128, 485679, 500312, 517582, 538725, 564895, 596270, 632199, 672227, 716661, 765952, 819850, 877477, 937758, 998878, 1057134, 1107222, 1144568, 1167419, 1176416, 1172576, 1156444, 1129048, 1092582, 1049549, 1001661]
51359A001661n1674n4212n5127n4394n2121m8411m3704l8717l3812k8889k4067
51348E16533j9857j6468j3561j1003r265q584q374p954p345o757n899m473k963
51335C94030k077j611q36K06O47K17j91K72J302J981J965J669J454J134L29r66
51319C99525k263l093l497l829m111l903k986j795r05l40K25Q61J363J619J622
51304C78493J322P94L11j29r70k239l032k513j243o10j056j680j679j279j059
51289C63431j047q65k27R39K369L346L236K367J833K277L378M544N521O115O048
51274D03265N390M562L690K550J339P20P45N40l20q46J28K234L887M031K963J511
51258D36389J79j051k430m069n525o017n332m216l514l278l165l267l837m416
$$ y = [1001661, 949987, 895775, 840648, 786254, 734133, 685722, 642018, 603301, 569489, 540600, 516533, 496676, 480208, 466647, 455644, 446379, 437795, 429421, 421467, 414122, 407365, 401466, 396993, 394030, 391953, 390342, 389506, 389712, 390359, 390576, 390385, 390657, 391959, 393940, 395905, 397574, 399028, 400162, 400491, 399525, 397262, 394169, 390672, 386843, 382732, 378829, 375843, 374048, 373143, 372803, 373028, 373889, 375252, 376871, 378493, 379815, 380609, 380920, 380791, 379821, 377582, 374550, 372037, 370794, 370184, 369128, 367448, 365769, 364490, 363431, 362384, 361519, 361292, 362231, 364600, 367946, 371182, 373549, 375382, 377659, 381037, 385581, 391102, 397217, 403265, 408655, 413217, 416907, 419457, 420796, 421516, 422261, 422801, 422481, 421635, 421763, 423997, 427884, 431915, 434878, 436389, 436568, 435517, 433087, 429018, 423493, 417476, 412144, 407928, 404414, 401136, 397971, 394704, 390867, 386451]
51244C86451m142k929j710j288j542j852j860j502p93L4M83K34l91o84k57O71
51228C68923J645K413K891K872K135R32M8J9L95K26o94j502j389n92j7j31o11
51211C77563q86o49P9J063J969K526K654K450K167K175K657L286L506L263L047
51196D06870L039K731J753N97l9l01q16j565j836j403r06q25p94m04p2m18j128
51179D04483j188l09N99O44Q3j67J86O11P41R10J496K162K169J313K09m13m24
51162D13105k47k18j35M05J274J687J122J24l08j49m23j656l024l498l255l160
51146D01644l403l484l238k913k372j291r6L30K5L4P87J418J238Q74J181J793
51130C92527J738J002M90O37R47R44P91Q51J136J439J643J734J691J511J254J034
$$ y = [386451, 382309, 379380, 377670, 376382, 374840, 372988, 371128, 369626, 368833, 368867, 369350, 369584, 369193, 368509, 368252, 368923, 370568, 372981, 375872, 378744, 380879, 381811, 381859, 381878, 382273, 382499, 381805, 380303, 378914, 378322, 378305, 378174, 377563, 376677, 376028, 376107, 377170, 379139, 381665, 384319, 386769, 388936, 391111, 393768, 397054, 400560, 403823, 406870, 409909, 412640, 414393, 414990, 414951, 414650, 413834, 412269, 410433, 409030, 408124, 407299, 406505, 406101, 406029, 405611, 404483, 403295, 402986, 403585, 404229, 404312, 404145, 404331, 404942, 405683, 406593, 408089, 410251, 412420, 413733, 413942, 413529, 413105, 412858, 412640, 412505, 412910, 414184, 415871, 416993, 417117, 416809, 416660, 416237, 414581, 411557, 408059, 404804, 401644, 398241, 394757, 391519, 388606, 386234, 384943, 384847, 385177, 385202, 385236, 386023, 387441, 388679, 389553, 390734, 392527, 394265, 395267, 395757, 396394, 397341, 398285, 399076, 399927, 401063, 402502, 404145, 405879, 407570, 409081, 410335, 411369]
51114D11369R71J073J171J134J123J420J967K382K428K168J731J315J372K179
51100D33803L126L158K154J229J254J739J676R52K35o3j65m17r34j515j595o22
51084D44015J057K171J840N95l84o66n64k86J06J97m08j240j329m35O94J400J766
51067D48529K113K517K976L618M557N879P768J0240J2891J5420J8245K1815K5208
51054E81776K6315K3926J9109J4098J0296P854O706P087Q827J0702J1034R031
51042G36761N433J744j131l459o013r010j1765j3112j2167q994m920j963j539
51029F69865l559o862j0368j3601j6314j8066j8318j6824j3860j0147o479l349
51017E32118q69J033K471L663M823O024P344Q980J0911J2521J3182J3157J3208
$$ y = [411369, 412340, 413413, 414584, 415718, 416841, 418261, 420228, 422610, 425038, 427206, 428937, 430252, 431624, 433803, 436929, 440087, 442241, 443470, 444724, 446463, 448139, 449091, 449326, 449263, 449098, 448681, 447747, 446232, 444637, 444015, 445072, 447243, 449083, 449678, 449294, 448628, 448064, 447778, 447884, 448081, 447673, 446433, 445104, 444669, 445363, 446763, 448529, 450642, 453159, 456135, 459753, 464310, 470189, 477957, 488197, 501088, 516508, 534753, 556568, 581776, 608091, 632017, 651126, 665224, 675520, 683374, 690080, 697167, 705994, 716696, 727730, 736761, 742194, 743938, 742807, 739348, 733335, 724325, 712560, 699448, 687281, 678287, 673367, 671404, 669865, 666306, 659444, 649076, 635475, 619161, 601095, 582777, 565953, 552093, 541946, 535467, 532118, 531249, 532282, 534753, 538416, 543239, 549263, 556607, 565587, 576498, 589019, 602201, 615358, 628566]
51004F28566J3283J2442J0377Q111O634N644M365K854J576L63j181k688l541m034
50990F82771m884n734n366l541j455j04P96J954L512N430P997J1257J4480J6865
50976G23978J8390J9430J9879J9283J7816J6561J6696J8600K1825K5768L0154
50965I48380L4916L9803M4474M8892N3258N7410O0818O3323O5401O7340O8680
50954A552695O8813O7568O4749N9902N3263M6234L9915L3673K6379J8555J1912
50943B043658P005K850r71l448l932l466l627m936p147j0071j3363j6217j8076
50930A968259j9221k0086k0667k1157k2469k5383k9614l4362l9223m4020m8228
50919A643829n1384n3685n5459n6404n5966n4211n1645m8458m4656m0655l7008
$$ y = [628566, 641849, 654291, 664668, 672779, 679413, 685057, 689422, 692276, 693852, 694215, 693034, 690346, 686805, 682771, 677887, 672153, 666787, 663246, 661791, 661687, 662483, 664437, 667949, 673379, 681376, 692633, 707113, 723978, 742368, 761798, 781677, 800960, 818776, 835337, 852033, 870633, 892458, 918226, 948380, 983296, 1023099, 1067573, 1116465, 1169723, 1227133, 1287951, 1351274, 1416675, 1484015, 1552695, 1621508, 1689076, 1753825, 1813727, 1866990, 1913224, 1953139, 1986812, 2013191, 2031746, 2043658, 2050663, 2053513, 2052542, 2049094, 2045162, 2041696, 2038069, 2033133, 2025986, 2015915, 2002552, 1986335, 1968259, 1949038, 1928952, 1908285, 1887128, 1864659, 1839276, 1809662, 1775300, 1736077, 1692057, 1643829, 1592445, 1538760, 1483301, 1426897, 1370931, 1316720, 1265075, 1216617, 1171961, 1131306, 1094298]
50908A094298l3688l0270k6803k3861k1696k0003j8457j7048j5796j4636j3676
50897H58364j3054j2475j1293r276p019n324m372l682k740j544n26o2j27m05n79
50882G85886m07K47J265K216K808L305M240N776P635R513J1117J1985J1898J1504
50868H68988J1812J2935J4042J4740J5700J7516J9748K1734K3719K6393K9706
50857A077033L2954L5854L8884M2663M7532N3602O0689O8354P6369Q5010R4439
50846A713383J04094J13246J21962J30804J39630J47370J53069J56592J58074
50837B938224J57135J52923J44684J32175J15845R6746P6070N4671L3110J2148
50827C913731p129k3732l7127m7023n3011n4654n2019m5967l7770k8444j8721
$$ y = [1094298, 1060610, 1030340, 1003537, 979676, 957980, 937977, 919520, 902472, 886676, 872040, 858364, 845310, 832835, 821542, 812266, 805247, 799923, 795551, 791869, 789129, 787585, 787059, 786997, 786870, 786465, 785886, 785479, 785726, 786991, 789207, 792015, 795320, 799560, 805336, 812971, 822484, 833601, 845586, 857484, 868988, 880800, 893735, 907777, 922517, 938217, 955733, 975481, 997215, 1020934, 1047327, 1077033, 1109987, 1145841, 1184725, 1227388, 1274920, 1328522, 1389211, 1457565, 1533934, 1618944, 1713383, 1817477, 1930723, 2052685, 2183489, 2323119, 2470489, 2623558, 2780150, 2938224, 3095359, 3248282, 3392966, 3525141, 3640986, 3737732, 3813802, 3868473, 3901583, 3913731, 3906602, 3882870, 3845743, 3798720, 3745709, 3691055, 3639036, 3593069, 3555299, 3526855, 3508134]
50816C508134r727l241p59k490p839j6634k9016m4107n9811p4530q8291j01572
50804C070117j13721j23391j30091j34276j36112j35065j30820j23892j15176
50795A927573j05401r5141q4851p4725o4839n5507m7144l9866l3487k7833k2747
50784A276032j7916j3268r336o740n336m368l519l153l553m408n224n758n960
50771A187493n984o375p634r410j0664j0935j0923j1477j2479j3207j3416j3487
50759A061502j3731j4004j3984j3469j2375j0748q801o776m786k853r28J191L825
50746I64063O991J0219J3069J5734J8824K2672K7136L2000L7094M1929M5809M8614
50734A284154N1224N4655N8963O3307O7034P0211P3075P5489P7176P8081P8273
$$ y = [3508134, 3498407, 3495166, 3494407, 3491917, 3484078, 3467444, 3438428, 3394321, 3334510, 3259980, 3171689, 3070117, 2956396, 2833005, 2702914, 2568638, 2432526, 2297461, 2166641, 2042749, 1927573, 1822172, 1727031, 1642180, 1567455, 1502616, 1447109, 1399965, 1360099, 1326612, 1298779, 1276032, 1258116, 1244848, 1235512, 1228772, 1223436, 1219068, 1215549, 1212396, 1208843, 1204435, 1199211, 1193453, 1187493, 1181509, 1175134, 1167500, 1158090, 1147426, 1136491, 1125568, 1114091, 1101612, 1088405, 1074989, 1061502, 1047771, 1033767, 1019783, 1006314, 993939, 983191, 974390, 967614, 962828, 959975, 959047, 960238, 964063, 971054, 981273, 994342, 1010076, 1028900, 1051572, 1078708, 1110708, 1147802, 1189731, 1235540, 1284154, 1335378, 1390033, 1448996, 1512303, 1579337, 1649548, 1722623, 1798112, 1875288, 1953369, 2031642]
50723B031642P7641P6111P3837P0962O7258O2308N5835M7532L6862K3553Q235
50712B631776p779k3200l6910m7689n4514n7195n6119n1557m3913l4638k5820
50701B192442j8394j1557m478K090O407P321M678j219r688j9661l0441m2080n4275
50688B021145o5323p3134p7188p8514p7892p5081p0078o3972n7917n1897m5180
50677A284969l7598k9885k2915j6964j1616o221n44M878R238J2361J4817J7119
50665A217639J9133K0406K0671J9847J7957J5403J3070J1766J1571J1901J2154
50654A391518J2068J1738J1508J1855J3026J4752J6395J7537J8377J9590K1742
50643A560106K4832K8374L1867L5101L8058M0691M2946M4920M6729M8301M9376
$$ y = [2031642, 2109283, 2185394, 2259231, 2330193, 2397451, 2459759, 2515594, 2563126, 2599988, 2623541, 2631776, 2623997, 2600797, 2563887, 2516198, 2461684, 2404489, 2348370, 2296813, 2252900, 2218262, 2192442, 2174048, 2162491, 2158013, 2160103, 2166510, 2173831, 2178509, 2177290, 2167602, 2147941, 2117500, 2075420, 2021145, 1955822, 1882688, 1805500, 1726986, 1649094, 1574013, 1503935, 1439963, 1382046, 1330149, 1284969, 1247371, 1217486, 1194571, 1177607, 1165991, 1159770, 1159226, 1164104, 1173342, 1185703, 1200520, 1217639, 1236772, 1257178, 1277849, 1297696, 1315653, 1331056, 1344126, 1355892, 1367463, 1379364, 1391518, 1403586, 1415324, 1426832, 1438687, 1451713, 1466465, 1482860, 1500397, 1518774, 1538364, 1560106, 1584938, 1613312, 1645179, 1680280, 1718338, 1759029, 1801975, 1846895, 1893624, 1941925, 1991301]
50632A991301M9788M9555M8755M7497M6091M5141M5309M6831M9077N0375M8344
50621B518064M0673K6262O384j5071l3068m4156m8099m6843m2135l4783k5856
50610B301372j7275j0461n211p41K650L921K906M97k872p959j5545k5239l5744
50597B190299m5767n4294o0657o4874o7640o9448o9948o8641o5946o2990o0331
50586A499763n7473n3854m9756m5895m2465l9095l5603l2215k8967k5566k2048
50575A066826j8973j6441j3518r327m422k15K769N157P349Q979J0033J1329J3290
50562A062836J5213J6537J7956K0303K2929K4391K4368K3843K3561K3398K3233
50551A298568K3418K4068K4621K4356K2986K0751J8390J6854J6499J6713J6903
$$ y = [1991301, 2041089, 2090644, 2139399, 2186896, 2232987, 2278128, 2323437, 2370268, 2419345, 2469720, 2518064, 2558737, 2584999, 2591383, 2576312, 2543244, 2499088, 2450989, 2404146, 2362011, 2327228, 2301372, 2284097, 2273636, 2268425, 2267684, 2270334, 2274255, 2277161, 2277658, 2274786, 2266827, 2251282, 2226043, 2190299, 2144532, 2090238, 2029581, 1964707, 1897067, 1827619, 1757671, 1689030, 1623084, 1560094, 1499763, 1442290, 1388436, 1338680, 1292785, 1250320, 1211225, 1175622, 1143407, 1114440, 1088874, 1066826, 1047853, 1031412, 1017894, 1008567, 1004145, 1003930, 1006699, 1011856, 1019205, 1028184, 1038217, 1049546, 1062836, 1078049, 1094586, 1112542, 1132845, 1155774, 1180165, 1204533, 1228376, 1251937, 1275335, 1298568, 1321986, 1346054, 1370675, 1395031, 1418017, 1438768, 1457158, 1474012, 1490511, 1507224, 1524127]
50540A524127J7542J9430K2307K5308K8579L3123L8869M4342M8707N2930N8132
50529A913396O3947O9431P4699Q0491Q6728R2619R7960J03161J08077J11737J13406
50518B915652J13127J11054J06917J00385R1501Q0391O6931N1023L3049J3848
50508C683878n684k4800m2815n9064p2978q4139r2224r6915r7949r5252q8879
50497B923179p8888o5517m9656l2769j6131k51J4728K8312L9694M8085N2502N1540
50485B914828M4133L0628J2529q776l2310n6494p8758r6737j09474j17230j20645
50474B381694j20486j17613j12636j05747r7249q7978p8943p0796o3882n8353
50464A468011n3907m9750m5332m0871l6777l2907k8765k4257j9721j5311j0848
$$ y = [1524127, 1541669, 1561099, 1583406, 1608714, 1637293, 1670416, 1709285, 1753627, 1802334, 1855264, 1913396, 1977343, 2046774, 2121473, 2201964, 2288692, 2381311, 2479271, 2582432, 2690509, 2802246, 2915652, 3028779, 3139833, 3246750, 3347135, 3438636, 3519027, 3585958, 3636981, 3670030, 3683878, 3678194, 3653394, 3610579, 3551515, 3478537, 3394398, 3302174, 3205259, 3107310, 3012058, 2923179, 2844291, 2778774, 2729118, 2696349, 2680218, 2679967, 2694695, 2723007, 2762701, 2810786, 2863288, 2914828, 2958961, 2989589, 3002118, 2993342, 2961032, 2904538, 2825780, 2729043, 2619569, 2502339, 2381694, 2261208, 2143595, 2030959, 1925212, 1827963, 1739985, 1661042, 1590246, 1526364, 1468011, 1414104, 1364354, 1319022, 1278151, 1241374, 1208467, 1179702, 1155445, 1135724, 1120413, 1109565]
50453A109565o266j906J802M795P458J0240J3180J5850J7890J9529K1300K3454
50441A236891K5926K8745L1729L3835L3545L0312K5101J9159J2919O520P83l197
50429A482268n261o351p406q549r249r004p826o297n057m086k725n29K283N382
50415A417593Q965J3438J8775K4534L0310L5844M0929M5477M9490N2767N4986
50404A793108N6245N7017N7266N6170N3228M9146M4923M0474L4790K7245J8055
50393B287667P615l823j5871k7931l9564n0388n9665o6430p0125p0844o8973o4951
50381A756717n9231n2178m4003l5014k5689j6333p007J880R426J5090J9199K1932
50369A584789K2350J9320J3039M772m585j4667k4536l2784l8919m3641m7367m9443
$$ y = [1109565, 1103299, 1101393, 1103195, 1107990, 1115448, 1125688, 1138868, 1154718, 1172608, 1192137, 1213437, 1236891, 1262817, 1291562, 1323291, 1357126, 1390671, 1420983, 1446084, 1465243, 1478162, 1484682, 1485465, 1482268, 1477007, 1470656, 1463250, 1454701, 1445452, 1436448, 1428622, 1422325, 1417268, 1413182, 1410457, 1409928, 1412211, 1417593, 1426558, 1439996, 1458771, 1483305, 1513615, 1549459, 1590388, 1635865, 1685355, 1738122, 1793108, 1849353, 1906370, 1963636, 2019806, 2073034, 2122180, 2167103, 2207577, 2242367, 2269612, 2287667, 2295282, 2291459, 2275588, 2247657, 2208093, 2157705, 2098040, 2031610, 1961485, 1890641, 1821668, 1756717, 1697486, 1645308, 1601305, 1566291, 1540602, 1524269, 1517262, 1519142, 1528568, 1543658, 1562857, 1584789, 1607139, 1626459, 1639498, 1644270, 1639685, 1625018, 1600482, 1567698, 1528779, 1485138, 1437771, 1388328]
50357A388328m9222m7078m3788l9693l4958l0079k5547k1419j7643j4383j1738
50346A052780r761r021j0469j4127j8484k1777k3390k3483k1963j8708j4446j0438
50334H56713p253m574k105j4J622L120M754O341P497Q052Q192Q351Q888R637J0015
50319I19236R806R562R826J0235R989Q987P815O693N202L175J200j50r52j427
50305I99197j376n95N54J574K607M234O639R447J2355J5492J9078K3155K7733
50292A120094L2937L8839M5179N0943N3740M9983L6922J5493r040l0051m3568
50281A361471m9588n0188m7284m2124l5872k9594k3731j8184j3007q747n893m279
50269A032980l216k108q18M35J380J861J867J585J399J750K836M468O306Q286
$$ y = [1388328, 1339106, 1292028, 1248240, 1208547, 1173589, 1143510, 1117963, 1096544, 1078901, 1064518, 1052780, 1043019, 1033998, 1023529, 1009402, 990918, 969141, 945751, 922268, 900305, 881597, 867151, 856713, 849460, 844886, 842781, 842767, 844389, 847509, 852263, 858604, 866101, 874153, 882345, 890696, 899584, 909221, 919236, 929042, 938604, 948430, 958665, 968654, 977641, 985456, 992149, 997351, 1000526, 1001726, 1001576, 1000624, 999197, 997821, 997226, 997780, 999354, 1001961, 1006195, 1012834, 1022281, 1034636, 1050128, 1069206, 1092361, 1120094, 1153031, 1191870, 1237049, 1287992, 1341732, 1391715, 1428637, 1444130, 1435090, 1405039, 1361471, 1311883, 1261695, 1214411, 1172287, 1136415, 1106821, 1083090, 1064906, 1051899, 1043152, 1037259, 1032980, 1029764, 1027656, 1026838, 1027273, 1028653, 1030514, 1032381, 1033966, 1035365, 1037115, 1039951, 1044419, 1050725, 1059011]
50255A059011J0659J3456J5999J7276J6909J5593J4390J3707J3245J2820J2770
50244A215835J3242J3530J2659J0593Q235O053L328p98n871j0358j3224j4607
50232A238617j4940j4099j1868q698n554l136j766j899m218r013j5614k2613k8533
50219A096666l2322l3583l2659l0500k8114k5885k3413k0260j6819j4141j2759
50208H26211j2024j0945r464q362q019p847p180o126n218m576l922l238k902l138
50194G33250l640l883l686l427l630m299m731m269l189k520k837l606l946l617
50180F81970l020k575k475k833l512l947l549k331q53L56R97R32L69N9P27K164
50164F62479L335L484K830K045J503J300J554K285L131L644L884M445N710P327
$$ y = [1059011, 1069670, 1083126, 1099125, 1116401, 1133310, 1148903, 1163293, 1177000, 1190245, 1203065, 1215835, 1229077, 1242607, 1255266, 1265859, 1274094, 1280147, 1283475, 1282677, 1276806, 1266448, 1253224, 1238617, 1223677, 1209578, 1197710, 1189012, 1183458, 1180322, 1178556, 1176657, 1172439, 1163426, 1147812, 1125199, 1096666, 1064344, 1030761, 998102, 967602, 939488, 913603, 890190, 869930, 853111, 838970, 826211, 814187, 803242, 793778, 785416, 777397, 769550, 762370, 756244, 751026, 746450, 742528, 739290, 736388, 733250, 729610, 725727, 722041, 718614, 714984, 710685, 705954, 701685, 698496, 695976, 693139, 689533, 685587, 681970, 678950, 676375, 673900, 671067, 667555, 663608, 660059, 657728, 656875, 657231, 658228, 659160, 659529, 659588, 660315, 662479, 665814, 669298, 672128, 674173, 675676, 676976, 678530, 680815, 683946, 687590, 691474, 695919, 701629, 708956]
50150G08956Q617R477J0530J2193J3884J4602J4233J3839J4431J6013J8124K0730
50138H75629K3912K7043K9146L0110L0821L1909L3071L3912L4784L6178L7713
50127A224228L8346L7456L5142L1481K6104J8709R687k4r511j8165k5560l1359
50115A336534l5387l7661l8409l8057l7081l5593l3158k9288k4338j9652j6556
50104I91354j5254j4933j4816j4810j5129j5649j5868j5328j4025j2537j1655
50093H31350j1621j1655j0673q505o084m256k886j428J19J356K231L050L821M182
50079G89001M045L861M087M705N389N946O405O820P096P036O540N735M834L917
50065H65417L014K310J911J425K69j425k779l283l408l699l947l828l804m481
$$ y = [708956, 717573, 727050, 737580, 749773, 763657, 778259, 792492, 806331, 820762, 836775, 854899, 875629, 899541, 926584, 955730, 985840, 1016661, 1048570, 1081641, 1115553, 1150337, 1186515, 1224228, 1262574, 1300030, 1335172, 1366653, 1392757, 1411466, 1421153, 1421129, 1411618, 1393453, 1367893, 1336534, 1301147, 1263486, 1225077, 1187020, 1149939, 1114346, 1081188, 1051900, 1027562, 1007910, 991354, 976100, 961167, 946351, 931541, 916412, 900763, 884895, 869567, 855542, 843005, 831350, 819729, 808074, 797401, 788896, 782812, 778556, 775670, 774242, 774361, 775717, 777948, 780998, 784819, 789001, 793046, 796907, 800994, 805699, 811088, 817034, 823439, 830259, 837355, 844391, 850931, 856666, 861500, 865417, 868431, 870741, 872652, 874077, 874346, 872921, 870142, 866859, 863451, 859752, 855805, 851977, 848173, 843692]
50051H43692n413n525m604l475k691j916q06L64J273K088L087M307N810P752R888
50036H53831J1529J2356J2895J3802J4969J5693J5521J4748J4229J4713J6050
50025A010336J7153J7124J6334J5831J5804J5525J4815J4572J5406J6672J7384
50014A186956J7252J6156J3487R117M493J692J377K477L641M153L523J193k980
50001A262537q507j4634k0548k5256k7904k8466k7671k6202k4381k2550k1108
49990A015310j9991j8678j6987j5423j4424j3767j3101j2676j3073j4346j5841
49979H47003j6761j6731j5866j4628j3545j2826j2235j1366j0067q512p066o143
49967G01257n947o121n912m982l970l765m269m344l221j507l90j51R0J220L246
$$ y = [843692, 838279, 832754, 828150, 824675, 821984, 820068, 819262, 819626, 820899, 822987, 826074, 830381, 836191, 843943, 853831, 865360, 877716, 890611, 904413, 919382, 935075, 950596, 965344, 979573, 994286, 1010336, 1027489, 1044613, 1060947, 1076778, 1092582, 1108107, 1122922, 1137494, 1152900, 1169572, 1186956, 1204208, 1220364, 1233851, 1242968, 1247461, 1249153, 1250530, 1253007, 1256648, 1260801, 1264324, 1265517, 1262537, 1254030, 1239396, 1218848, 1193592, 1165688, 1137222, 1109551, 1083349, 1058968, 1036418, 1015310, 995319, 976641, 959654, 944231, 929807, 916040, 902939, 890263, 877190, 862844, 847003, 830242, 813511, 797645, 783017, 769472, 756646, 744411, 733045, 722978, 714466, 707400, 701257, 695310, 689189, 683277, 678295, 674325, 670560, 666291, 661947, 658726, 657219, 656829, 656678, 656768, 657988, 661234]
49952F61234N624P930R905J1297J2062J2539J2971J2949J1776R398O647M443L025
49939G81800K063J096j36j582k892l863m967p065j0330j3729j5947j6611j6278
49926F91559j5429j4032j2098j0096q526p357o251n164m361l816k959j275J001
49913F01196K991L994M021L531K913K391K211K638L729N294P097R018J0935J2564
49899F74523J3579J3903J3849J3778J3565J2619J0601P999N611L613J508r40l384
49886G80824n583p812j0104j1826j2542j2807j3308j3680j3141j1980j1322j1378
49874F45341j1062r673p902o656n810m761l568k665j983j069J46J376K543L713
49860E97970M670N214N696O693Q183R651J0940J2395J4039J5236J5460J4927J4117
$$ y = [661234, 666858, 674788, 684693, 695990, 708052, 720591, 733562, 746511, 758287, 767685, 774332, 778775, 781800, 783863, 784959, 784823, 783241, 780349, 776486, 771519, 764454, 754124, 740395, 724448, 707837, 691559, 676130, 662098, 650000, 639904, 631378, 624021, 617770, 612606, 608245, 604429, 601470, 600195, 601196, 604187, 608181, 612202, 615733, 618646, 621037, 623248, 625886, 629615, 634909, 642006, 651024, 661959, 674523, 688102, 702005, 715854, 729632, 743197, 755816, 766417, 774416, 780027, 783640, 785148, 784208, 780824, 775241, 767429, 757325, 745499, 732957, 720150, 706842, 693162, 680021, 668041, 656719, 645341, 634279, 624606, 616704, 610048, 604238, 599477, 595909, 593244, 591261, 590192, 590338, 591714, 594257, 597970, 602640, 607854, 613550, 620243, 628426, 638077, 649017, 661412, 675451, 690687, 706147, 721074, 735191]
$$ [...]
##END NTUPLES=NMR SPECTRUM
##END=
