##TITLE=AC1533_ROEFFECT0009_8214086_iX1p2NjASO
##JCAMPDX= 6.0         $$ Bruker NMR JCAMP-DX V2.0
##DATA TYPE= NMR SPECTRUM
##DATA CLASS= NTUPLES
##ORIGIN= BRUKER
##OWNER= Administrator
$$ 1.72 TOPSPIN		Version 2.1
$$ 2013-10-04 21:09:25.487 -0700  Administrator@X
$$ Compression mode = diff/dup
##.OBSERVE FREQUENCY= 400.02188249412
##.OBSERVE NUCLEUS= ^1H
##.ACQUISITION MODE= SIMULTANEOUS (DQD)
##.ACQUISITION SCHEME= undefined
##.AVERAGES= 8
##.DIGITISER RES= 22
##SPECTROMETER/DATA SYSTEM= spect
##.PULSE SEQUENCE= zg30
##.SOLVENT NAME= COFFEE_meoh
##.SHIFT REFERENCE= INTERNAL, COFFEE_meoh, 1, 14.98509
##AUDIT TRAIL= $$ (NUMBER, WHEN, WHO, WHERE, PROCESS, VERSION, WHAT)
$$ ##TITLE= Audit trail, TOPSPIN		Version 2.1
$$ ##JCAMPDX= 5.01
$$ ##ORIGIN= Bruker BioSpin GmbH
$$ ##OWNER= Administrator
$$ $$ E:\/data/COFFEE/nmr/AC1533_ROEFFECT0009_8214086_iX1p2NjASO/10/pdata/1/auditp.txt
$$ ##AUDIT TRAIL=  $$ (NUMBER, WHEN, WHO, WHERE, PROCESS, VERSION, WHAT)
(   1,<2013-10-04 21:09:19.143 -0700>,<Administrator>,<X>,<go>,<TOPSPIN 2.1>,
      <created by zg
	started at 2013-10-04 21:08:13.143 -0700,
	POWCHK enabled, PULCHK disabled,
       configuration hash MD5:
       C8 4E 4E 5D D3 5C D8 9E 9F 52 82 E0 59 8A DE 15
       data hash MD5: 64K
       E9 9E A6 E9 F0 F0 C0 60 7E 23 84 93 1B 7E 44 CA>)
(   2,<2013-10-04 21:09:22.034 -0700>,<Administrator>,<X>,<proc1d>,<TOPSPIN 2.1>,
      <Start of raw data processing
       efp LB = 0 FT_mod = 6 PKNL = 1 PHC0 = 0 PHC1 = 0 SI = 32K 
       data hash MD5: 32K
       C4 A5 9C F1 C9 66 A1 C4 BE A7 B3 C5 67 E3 8D BF>)
(   3,<2013-10-04 21:09:22.347 -0700>,<Administrator>,<X>,<proc1d>,<TOPSPIN 2.1>,
      <pk PHC0 = 95.03723 PHC1 = 0 
       data hash MD5: 32K
       84 55 91 57 58 78 9A 55 DC F9 86 E5 B0 76 04 FE>)
(   4,<2013-10-04 21:09:22.425 -0700>,<Administrator>,<X>,<proc1d>,<TOPSPIN 2.1>,
      <abs ABSG = 1 
       data hash MD5: 32K
       BA 01 8E E6 D3 65 3C 58 E8 C6 1B C4 81 98 B2 F4>)
(   5,<2013-10-04 21:09:22.472 -0700>,<Administrator>,<X>,<proc1d>,<TOPSPIN 2.1>,
      <abs ABSG = 2 
       data hash MD5: 32K
       1A 51 3C E4 51 23 F2 8C 3A 40 57 CB 08 D9 9D 79>)
(   6,<2013-10-04 21:09:22.550 -0700>,<Administrator>,<X>,<proc1d>,<TOPSPIN 2.1>,
      <abs ABSG = 3 
       data hash MD5: 32K
       CB 12 F4 9D 18 F0 0E B3 41 76 B9 F9 BD 49 09 BC>)
(   7,<2013-10-04 21:09:22.597 -0700>,<Administrator>,<X>,<proc1d>,<TOPSPIN 2.1>,
      <abs ABSG = 4 
       data hash MD5: 32K
       86 DA 97 0B 64 FC BF FB 29 58 75 05 0B E4 95 1A>)
(   8,<2013-10-04 21:09:22.643 -0700>,<Administrator>,<X>,<proc1d>,<TOPSPIN 2.1>,
      <abs ABSG = 5 
       data hash MD5: 32K
       5C DD 4D 73 16 62 84 50 12 D2 CA 80 D1 C5 BC 56>)
$$ ##END=
$$ 
$$ $$ hash MD5
$$ $$ 7A 9D 1E D9 7C BD F1 C9 32 E0 1F F9 DC FE 84 8E
##$RELAX= 
##$RELAX= 
##$RELAX= 
##$RELAX= 
##$RELAX= 
##$RELAX= 
##$RELAX= 
$$ Bruker specific parameters
$$ --------------------------
##$DU= <E:\>
##$EXPNO= 10
$$ [...]
150 150 150 150 150 150 150 150
##$TP07= 0
##$TPNAME0= <>
##$TPNAME1= <>
##$TPNAME2= <>
##$TPNAME3= <>
##$TPNAME4= <>
##$TPNAME5= <>
##$TPNAME6= <>
##$TPNAME7= <>
##$TPOAL= (0..7)
0.5 0.5 0.5 0.5 0.5 0.5 0.5 0.5
##$TPOFFS= (0..7)
0 0 0 0 0 0 0 0
##$TUNHIN= 0
##$TUNHOUT= 0
##$TUNXOUT= 0
##$USERA1= <user>
##$USERA2= <user>
##$USERA3= <user>
##$USERA4= <user>
##$USERA5= <user>
##$V9= 5
##$VALIST= <valist>
##$VCLIST= <CCCCCCCCCCCCCCC>
##$VD= 0
##$VDLIST= <DDDDDDDDDDDDDDD>
##$VPLIST= <PPPPPPPPPPPPPPP>
##$VTLIST= <TTTTTTTTTTTTTTT>
##$WBST= 2048
##$WBSW= 25
##$XGAIN= (0..3)
0 0 0 0
##$XL= 0
##$YL= 0
##$YMAX_a= 665541
##$YMIN_a= -566015
##$ZGOPTNS= <>
##$ZL1= 120
##$ZL2= 120
##$ZL3= 120
##$ZL4= 120
##$ABSF1= 14.98509
##$ABSF2= -5.573092
##$ABSG= 5
##$ABSL= 3
##$ALPHA= 0
##$AQORDER= 0
##$ASSFAC= 0
##$ASSFACI= 0
##$ASSFACX= 0
##$ASSWID= 0
##$AUNMP= <proc_prof1d_extract_pilot.lims>
##$AXLEFT= 0
##$AXNAME= <>
##$AXNUC= <1H>
##$AXRIGHT= 0
##$AXTYPE= 0
##$AXUNIT= <>
##$AZFE= 0.1
##$AZFW= 0.1
##$BCFW= 0
##$BC_mod= 0
##$BYTORDP= 0
##$COROFFS= 0
##$CY= 15
##$DATMOD= 1
##$DC= 0
##$DFILT= <>
##$DTYPP= 0
##$F1P= 0
##$F2P= 0
##$FCOR= 0.5
##$FTSIZE= 32768
##$FT_mod= 6
##$GAMMA= 0
##$GB= 0
##$INTBC= 1
##$INTSCL= 1
##$ISEN= 128
##$LB= 0
##$LEV0= 0
##$LPBIN= 0
##$MAXI= 10000
##$MC2= 0
##$MEAN= 0
##$ME_mod= 0
##$MI= 0
##$NCOEF= 0
##$NC_proc= -8
##$NLEV= 6
##$NOISF1= 0
##$NOISF2= 0
##$NSP= 0
##$NTH_PI= 0
##$NZP= 0
##$OFFSET= 14.98509
##$PC= 1
##$PHC0= 95.03723
##$PHC1= 0
##$PH_mod= 1
##$PKNL= yes
##$PPARMOD= 0
##$PPDIAG= 0
##$PPIPTYP= 0
##$PPMPNUM= 2147483647
##$PPRESOL= 1
##$PSCAL= 4
##$PSIGN= 0
##$PYNMP= <proc.py>
##$REVERSE= no
##$SF= 400.02
##$SI= 32768
##$SIGF1= 0
##$SIGF2= 0
##$SINO= 400
##$SIOLD= 32768
##$SPECTYP= <>
##$SREGLST= <1H.CDCl3>
##$SSB= 0
##$STSI= 32768
##$STSR= 0
##$SW_p= 8223.68421052631
##$SYMM= 0
##$S_DEV= 0
##$TDeff= 65536
##$TDoff= 0
##$TI= <>
##$TILT= no
##$TM1= 0
##$TM2= 0
##$TOPLEV= 0
##$USERP1= <user>
##$USERP2= <user>
##$USERP3= <user>
##$USERP4= <user>
##$USERP5= <user>
##$WDW= 1
##$XDIM= 32768
##$YMAX_p= 450168928
##$YMIN_p= -696680
##$CURPLOT= <Network HP LaserJet P1505>
##$CURPRIN= <$Network HP LaserJet P1505>
##$DFORMAT= <normdp>
##$LAYOUT= <+/1D_H.xwp>
##$LFORMAT= <normlp>
##$PFORMAT= <normpl>
##$SURQMSG= 1
$$ End of Bruker specific parameters
$$ ---------------------------------
##NTUPLES= NMR SPECTRUM
##VAR_NAME=  FREQUENCY,     SPECTRUM/REAL,   SPECTRUM/IMAG
##SYMBOL=    X,             R,               I
##VAR_TYPE=  INDEPENDENT,   DEPENDENT,       DEPENDENT
##VAR_FORM=  AFFN,          ASDF,            ASDF
##VAR_DIM=   32768,         32768,           32768
##UNITS=     HZ,            ARBITRARY UNITS, ARBITRARY UNITS
##FACTOR=    0.250966925370066, 1,           1
##FIRST=     8223.43324360094, -129828,      -207757
##LAST=      0,             -160248,         -28335
##MIN=       0,             -696680,         0
##MAX=       8223.43324360094, 450168928,    0
$$ Real data points
##PAGE= N=1
##DATA TABLE= (X++(R..R)), XYDATA
$$ [...]
$$ plain form
19569 -159873 -275769 -107197 66061 -380344 -181549 -201967 -145834 46103 -81710 104875
19558 -152452 -14687 32897 -58008 -181724 -251457 42245 1848 90448 -30566 93804 -213545
19546 -54531 384017 64660 127207 -304740 360916 142771 -193 -183938 -67322 96304 -311967
19534 -22957 -183059 158341 -219211 -119982 -4897 -138772 -72644 -24456 -19826 -144251 -110748
19523 -110748 -143919 -173261 145206 270148 12668 -84711 -75715 -251569 -328617 95815 5690
19511 -238747 130283 -55078 -494202 86255 -461651 180330 17049 30117 -59979 -3235 -83798
19500 -83798 -18366 16416 -206335 -98309 -377289 -216907 181684 -72987 -208989 -40137 -95331
19489 -95331 18620 79416 -208450 112737 40829 138807 -123787 -180446 -13939 -348092 -102362
$$ packed form
19569a59873j15896a07197F6061c80344a81549k0418N6133D6103h1710A04875
19558a52452a4687C2897e8008j23716o9733D2245A848Q8600c0566I3804b13545
19546e4531C84017F4660O2547c04740C60916A42771a93j83745f7322I6304c11967
19534b2957j60102A58341b19211R9229d897j33875O6128b4456M630j24425L3503
19523a10748l3171k9342A45206J24942A2668h4711Q996j75854p7048I5815E690
19511b38747A30283e5078m39124H6255d61651A80330A7049J3068e9979c235q0563
19500h3798a8366A6416b06335i8309k78980J60382A81684g2987j36002d0137n5194
19489i5331A8620O0796b08450A12737D0829R7978a23787n6659a3939l34153a02362
$$ plain form
19477 -127806 -286392 290378 176731 186105 -29847 -186863 153803 -222009 25981 -278796
19466 35635 -247075 -22858 180942 38871 176637 17935 -23506 -323969 -270129 -249738 -268613
19455 -268613 -127104 -317829 168894 29261 -430432 -88449 -9801 52680 11308 74520 -32802
19443 -1340 43462 -157380 -90673 -27943 243643 -148601 -96434 -124133 -242073 400250 200130
19432 200130 -109755 5299 -151048 -604212 -129624 -175052 -109184 -59700 -265080 50627 -209515
19420 91148 3794 73229 -222917 -1662 -40143 171039 137323 -107893 191068 -490851 -129314
19408 136437 -247918 83470 29343 -54366 -78865 -109569 -38135 -235960 -252598 22120 2078
19396 -479577 199657 -170617 -248245 -381444 16689 -127100 -132225 -41533 -90682 -170703 -285461
$$ packed form
19477a27806j58586B90378j13647R374b9847j57016A53803b22009B5981b78796
19466C5635b47075b2858A80942C8871J37766A7935b3506l00463N3840K0391j8875
19455b68613a27104j90725A68894B9261d30432h8449i801E2680A1308O3212c2802
19443a340D3462a57380O6707b7943B43643a48601N2167k7699j17940D00250k00120
19432B00130a09755E299a51048m53164a29624m5428O5868M9484k05380E0627b09515
19420I1148C794O9435b22917a662l8481A71039l3716a07893A91068d90851a29314
19408A36437b47918H3470B9343e4366k4499l0704c8135j97825j6638B2120B078
19396d79577A99657a70617p7628j33199A6689a27100n125d1533m9149q0021j14758
$$ plain form
19385 -285461 41879 74765 -137901 80947 -37795 16018 -180455 250348 -67715 -268830 -234328
19374 -234328 -326385 62430 127668 49305 -93911 -127902 197103 260895 -49396 -99011 -344820
19363 -344820 3647 -129717 -123871 84229 108082 -197287 -20018 30395 73031 37989 -329895
19351 42051 -98062 -121045 -249656 -57252 -237496 -125557 -81382 11719 -164806 84475 -248296
19339 -68199 -26859 -204329 31804 179545 -29794 -313193 -65169 -394499 125943 97581 116243
19328 116243 -35181 -19362 169939 -126676 150589 -348861 -67639 -255956 -239166 158988
19317 -142925 -116462 -295017 -85685 -75634 -188918 -515459 131394 203020 42004 -87102 -354304
19306 -354304 -256792 -217915 -54223 -189696 -26960 -75176 -28500 -142956 -42298 -184513 194916
$$ packed form
19385b85461D1879L2886a37901H0947c7795A6018a80455B50348f7715k01115L4502
19374b34328r2057F2430O5238D9305i3911l3991A97103O3792d9396m9615k45809
19363c44820C647a29717N846H4229K3853a97287b0018C0395M2636l5042c29895
19351D2051i8062k2983j28611e7252j80244J11939M4175A1719a64806H4475b48296
19339f8199b6859j77470C1804J47741b9794k83399f5169l29330A25943k8362J8662
19328A16243c5181J5819A69939a26676A50589c48861f7639j88317J6790A58988
19317a42925K6463j78555h5685J0051j13284l26541A31394P1626D2004h7102k67202
19306c54304R7512L8877e4223j35473b6960m8216b8500j14456d2298j42215A94916
$$ plain form
19294 -177085 371262 -169656 173 -119809 -46670 -59980 -76853 76687 -276712 -167922 -179102
19283 -179102 -87330 98807 -53180 -16839 -2709 49776 -212264 -75183 -69156 132406 229246
19272 229246 -310499 -374837 -237827 5121 221150 -103966 -64368 -97167 -180535 -278039 124941
19260 -427827 -375507 -294581 107385 57749 -120104 -49332 -5588 -170173 64582 97802 -113559
19248 56346 -83627 26538 140057 107129 269209 -171636 -169617 1376 -22731 -54340 140880
19236 12034 -51857 -34152 305463 -42286 -82196 269760 35033 110456 -93846 -52214 -261609
19225 -261609 -55541 -151036 36284 13538 29340 -164567 62532 55253 -27521 277965 17784
19213 349929 127304 -442254 21926 -77766 -346442 320094 -152458 76433 -289420 -136748
$$ packed form
19294a77085C71262a69656A73a19809d6670j3310j6873G6687b76712J08790j1180
19283a79102h7330I8807e3180a6839b709D9776b12264g5183O027A32406R6840
19272B29246c10499o4338J37010E121K16029a03966L9598l2799q3368r7504A24941
19260d27827N2320Q0926A07385m9636a20104d9332e588j64585F4582L3220a13559
19248E6346h3627B6538J13519l2928J62080a71636K019A376b2731l1609A40880
19236A2034e1857J7705C05463d2286l9910B69760C5033P5423i3846M1632k09395
19225b61609e5541r5495C6284A3538J5802a64567F2532p279b7521B77965A7784
19213C49929A27304d42254B1926g7766k68676C20094a52458G6433b89420a36748
$$ plain form
19202 298621 1584 -110976 106866 -106584 -9975 -123599 -223818 -340966 -3248 -124503 2221
19190 -66676 205626 83745 120364 -102369 -72854 -134056 -188011 -60486 -135304 -92401 24120
19178 -172227 187277 -73919 321511 15328 -185240 60376 -135401 137002 -114510 -66375
19168 -66375 -226121 -107612 145244 199788 48787 73165 -28823 -352311 -161898 -355042
19158 -355042 -51065 -550068 -33985 89984 47750 105390 -101130 -9952 -179603 42188 -26732
19146 90085 86170 -182007 -153235 -254335 -185001 -172772 -98574 -164236 94591 111263 -235956
19134 262497 15296 -86924 -68796 309650 -145326 -150481 341384 67234 -111701 -44651 -203970
19123 -203970 -130651 287103 14020 -664106 321930 -1957 -13712 -255861 -384111 -209930
$$ packed form
19202B98621A584a10976A06866a06584i975j13624j00219j17148c248j21255B221
19190f6676B05626H3745L6619a02369K9515o1202n3955f0486p4818M2903B4120
19178a72227A87277g3919C21511A5328a85240F0376a35401A37002a14510M8135
19168f6375j59746a07612A45244N4544D8787K4378b8823l23488a61898j93144
19158c55042e1065m99003c3985H9984m2234N7640a01130i952j69651D2188b6732
19146I0085l915a82007K8772j01100O9334J2229P4198o5662I4591J6672b35956
19134B62497A5296h6924J8128C09650a45326n155C41384F7234a11701d4651j59319
19123b03970P3319B87103A4020f64106C21930a957j1755k42149j28250J74181
$$ plain form
19113 -209930 -14839 -378260 -13646 -117323 -164811 97410 -207634 262494 -26979 97451 264289
19102 264289 5413 69904 45085 -23542 -339978 -365041 23363 -270911 -4942 -224593 -39184
19090 45888 176195 -33492 -164520 -152989 -174214 -112059 -82693 124317 -93492 -128632 -168215
19079 -168215 -148675 -367592 -138180 8698 78584 49453 16678 -41297 84215 -66175 -66145 -118945
19067 -118945 20406 -63233 -32557 -173473 22269 -121058 230358 -399793 -20736 -26474 108576
19055 -101279 -59874 -31359 -276305 -35960 -104655 -274706 -115642 110072 -237303 98234
19044 -53236 204021 38801 -293860 -36153 118392 118773 -368180 156496 -163785 109425 29799
19032 -41006 256875 270942 146440 163717 317994 56990 149032 -8402 -119870 -35148 -32510
$$ packed form
19113b09930a4839l63421a3646j03677m7488I7410b07634B62494b6979I7451J66838
19102B64289E413O4491k4819b3542l16436k5063B3363b70911d942k19651c9184
19090D5888J30307c3492j31028J1531k1225O2155K9366A24317i3492l5140l9583
19079a68215J9540k18917a38180H698O9886k9131A6678d1297H4215f6175L0n2800
19067a18945B0406f3233L0676j40916B2269a21058B30358c99793b0736n738A08576
19055a01279M1405K8515k44946c5960o8695j70051a15642A10072b37303I8234
19044e3236B04021C8801b93860c6153A18392L81c68180A56496a63785A09425B9799
19032d1006B56875J4067j24502J7277J54277E6990R2042h402j11468c5148K638
$$ plain form
19021 -32510 166736 -182346 -31512 7425 -90259 42859 -48703 9849 -188505 -153088 21968
19009 30445 36689 207017 -232959 -31966 -119510 251342 -63117 -214224 -279720 -4400 84484
18997 -161010 -89415 30456 -95128 -107163 -210170 43327 -163517 -78805 120983 -21731 288037
18985 -74652 -110161 -166300 -90275 -105627 66861 -37826 53529 -129649 -200657 361638 3959
18973 -115057 97184 225289 -120832 -107610 -313765 94056 -27752 -26087 91918 184307 17012
18961 21217 -237178 -181650 145117 101484 -6756 -39242 -62091 59023 -252151 -34774 17134
18949 51192 -408337 -202693 323697 40168 77080 199082 231341 -116540 19548 11332 -77359
18937 115276 -96746 -3637 59719 -271044 318527 84324 27450 -230092 -35592 -286805 -90828
$$ packed form
19021c2510A66736a82346c1512G425i0259D2859d8703I849a88505L5417B1968
19009C0445O244J70328b32959c1966q7544B51342f3117j51107o5496d400H4484
18997a61010P1595C0456i5128j2035j03007D3327a63517g8805A20983b1731B88037
18985g4652l5509n6139P6025j5352F6861c7826E3529a29649p1008C61638C959
18973a15057I7184J28105a20832J3222k06155I4056b7752J665I1918R2389A7012
18961B1217b37178N5528A45117m3633f756l2486k2849E9023b52151c4774A7134
18949E1192d08337b02693C23697D0168L6912J22002L2259a16540A9548q216g7359
18937A15276i6746c637E9719b71044C18527H4324B7450b30092c5592k51213i0828
$$ plain form
18925 -139692 -96836 -17392 39094 -34834 -171736 59412 -3627 14920 -26385 93545 -75998
18913 8018 126439 -65124 -299410 133744 -75497 -81281 -182751 -173221 5311 -416403 -30594
18901 -141696 76552 133271 286283 -135514 -194339 -177732 -33346 184507 -11311 -61304 -72888
18890 -72888 -191985 47189 -142599 -112464 4625 81054 36624 278155 -241309 56585 -123413
18878 -190485 -154424 -37473 117575 -265766 -25670 -5959 -149652 -211261 -182196 349112 86629
18866 -298795 -162703 31179 -99596 146654 91261 -57374 282791 245046 -1653 -42211 -214292
18855 -214292 41983 158901 98198 155393 -98646 -175267 -111425 -291535 -246087 128304 -188276
18843 -393037 24365 -146857 15166 -296655 -115024 -117868 57308 -181673 57964 -28091 59259
$$ packed form
18925a39692M2856a7392C9094c4834j36902E9412c627A4920b6385I3545g5998
18913H018J18421f5124k34286A33744g5497n784j01470R530E311d16403c0594
18901a41696G6552N6719J53012a35514n8825J6607c3346A84507a1311m9993j1584
18890g2888j19097D7189a42599L0135D625P6429C6624K41531b41309E6585a23413
18878a90485L6061c7473A17575b65766b5670e959j43693o1609K9065C49112H6629
18866b98795J36092C1179i9596A46654n5393e7374B82791l7745a653m0558j72081
18855b14292D1983J16918o0703N7195i8646p6621O3842j80110M5448A28304a88276
18843c93037B4365a46857A5166b96655a15024k844E7308a81673E7964b8091E9259
$$ plain form
18831 -266279 -170777 -51642 -218414 -288286 -13172 -58091 356725 251484 56814 -34451 -51834
18820 -51834 -17111 -144177 -72618 -148856 139738 -45514 256523 -66463 238033 -17941 31926
18808 261095 271329 336483 -28550 168703 -250771 -17176 163978 18550 -125004 443902
18797 -181552 -153800 -66684 -34575 -369291 -277858 -171556 -40569 -532675 -334324 -275538 12179
18785 -147494 86188 -194098 3454 -12571 40499 -129732 280015 -59760 130867 -273369 -360782
18774 -360782 -85551 45057 -141048 -154584 279242 -12130 -65969 -122513 64191 17429 -98948
18762 -132359 -555700 24282 -107725 152121 -160728 -218128 276035 3507 -276703 -198668
18752 -198668 203960 -19789 -83776 -276940 178887 245446 425722 -484832 -16830 173952
$$ packed form
18831b66279R5502e1642j66772o9872a3172m4919C56725j05241E6814c4451j7383
18820e1834a7111j27066P1559p6238A39738d5514B56523f6463B38033a7941C1926
18808B61095J0234O5154b8550A68703b50771a7176A63978A8550a25004D43902
18797a81552K7752f6684L2109l34716R1433J06302d0569m92106J98351N8786A2179
18785a47494H6188a94098C454a2571D0499a29732B80015e9760A30867b73369q7413
18774c60782h5551D5057a41048j3536B79242a2130n3839n6544F4191A7429i8948
18762a32359m23341B4282a07725A52121a60728n7400B76035C507b76703P8035
18752a98668B03960a9789o3987j93164A78887O6559J80276d84832a6830A73952
$$ plain form
18741 299833 -173077 70641 -350139 -122990 -168704 -6282 -161726 81906 29299 -48168 -141102
18730 -141102 -235894 77722 -2808 -15311 -49535 -69157 -87350 -296047 -172250 130330 -422796
18718 6705 -249414 -50954 -281150 104124 40278 27375 -176049 -45155 -37594 37422 -263189
18706 191380 108243 -436086 -163912 69201 -115859 -125313 362977 -39116 72336 -74041 -256473
18695 -256473 72452 -96049 -64982 127490 32115 -84699 330295 57336 -113682 -250262 167206
18683 -131763 409509 283067 -152655 -295305 75727 254903 171605 123964 -123916 -252815
18673 -252815 -29328 44548 -7181 -187970 217290 -175902 -110060 -169318 -171312 53986 -163090
18661 -220836 -75274 -64220 -114604 79356 171464 -86644 -118505 -202418 12638 -119462 3496
$$ packed form
18741B99833a73077G0641c50139a22990m5714f282j55444H1906B9299d8168r2934
18730a41102r4792G7722b808j2503l4224j9622j8193k08697J23797A30330d22796
18718F705b49414e0954k30196A04124D0278j2903a76049d5155P561C7422b63189
18706A91380q3137d36086a63912F9201a15859r454C62977c9116G2336g4041j82432
18695b56473G2452i6049L1067A27490C2115h4699C30295E7336a13682j36580A67206
18683a31763D09509j26442a52655j42650G5727J79176q3298m7641a23916j28899
18673b52815b9328D4548g181j80789B17290a75902O5842n9258j994E3986a63090
18661b20836g5274J1054n0384G9356R2108h6644l1861q3913A2638a19462C496
$$ plain form
18649 27524 236334 -127478 119201 -212221 213811 145304 -74005 -30916 -12487 -207745
18639 -207745 -31766 -244455 -41379 143156 -356855 -447457 207780 -266739 -133844 -9228
18628 183154 -65579 121081 -74879 209071 -54120 135780 -248626 -46592 -19084 47366 -337286
18616 -213404 -328019 -44337 -195399 -223010 78500 234378 -128586 -154254 53598 -82894 -146318
18605 -146318 59017 243754 -163303 135044 93495 122479 101043 -91390 -66774 67458 89872
18594 89872 -65605 -409341 -301388 -115579 -83409 34554 126656 259178 -148423 -126514 54040
18582 22935 97606 -243994 -212019 -362269 193534 -1352 157756 -207966 -41890 -538267 -379053
18571 -379053 -147912 -53257 -403575 32187 -274295 105559 -189586 -270428 -153867 -15336
$$ packed form
18649B7524K08810a27478A19201b12221B13811o8507g4005c0916a2487j95258
18639b07745c1766k12689d1379A43156c56855r0602B07780b66739J32895i228
18628A83154f5579A21081g4879B09071e4120A35780b48626d6592a9084D7366c37286
18616b13404j14615d4337j51062k7611G8500J55878a28586k5668E3598h2894o3424
18605a46318E9017J84737a63303A35044m1549K8984k1436i1390K4616F7458K2414
18594H9872f5605l43736J07953a15579L2170C4554R2102J32522a48423K1909E4040
18582B2935P4671b43994L1975j50250A93534a352A57756b07966d1890m96377J59214
18571c79053a47912e3257l50318C2187b74295A05559a89586q0842J16561a5336
$$ plain form
18560 -243719 136860 -71793 -64853 -297477 134583 133556 32676 -161342 -136934 -118009 -55131
18548 122869 -16204 -118040 -122984 -47245 -145430 -13593 -59696 -91842 -47537 -30426 -94252
18537 -94252 -223609 -6771 42476 106171 105223 68376 -35908 255494 -67301 17465 -116418 -140324
18525 -140324 178551 -151703 -257018 -22714 212163 115402 -295679 -101565 -29622 -13050
18514 -291474 154805 -416956 127649 -13429 -458820 54674 68956 -68613 -15972 72734 -301850
18502 -182570 -349315 185513 253417 90454 -47565 84182 -276584 -164873 -24737 -46068 -103484
18491 -103484 -142484 134455 131980 99348 -20524 -97893 357515 23606 -209229 -169042 -177161
18480 -177161 -197957 -95633 -11898 -39606 227129 -77825 -316128 35446 -34710 -40304 184540
$$ packed form
18560b43719A36860g1793O940k32624A34583j027C2676a61342K4408J8925e5131
18548A22869a6204j01836m944d7245r8185a3593m6103l2146M4305J7111o3826
18537i4252j29357f771D2476O3695r48l6847c5908B55494f7301A7465a16418k3906
18525a40324A78551a51703j05315b2714B12163r6761b95679a01565b9622a3050
18514b91474A54805d16956A27649a3429m45391E4674J4282f8613a5972G2734c01850
18502a82570j66745A85513O7904I0454d7565H4182b76584J11711b4737k1331n7416
18491a03484l9000A34455k475l2632b0524p7369C57515B3606b09229M0187q119
18480a77161k0796i5633a1898k7708B27129g7825k38303C5446c4710n594A84540
$$ plain form
18468 48796 -7778 -218452 -17779 233357 -132480 -44509 73594 -24264 257768 -245621 52088
18456 312444 137371 -168597 -79372 11524 147625 -148547 -149225 229345 -123654 -143742 -1700
18444 80026 310491 70971 -146627 255256 20837 -57910 -253834 -84841 -50848 -151806 21001
18432 179082 -162153 -5319 -47692 26005 -188283 -205846 33780 71487 -107410 -305254 -258182
18421 -258182 -278156 25629 132812 -43935 -169219 91016 196758 63130 13374 -220839 55387
18409 239673 -57227 -214768 142792 -39298 -159286 20837 -83898 92329 -274536 151 -209596
18397 -35309 -171536 131794 -194420 -266561 -8139 -280384 110742 -211411 -62549 -156562 174022
18385 -44956 -86139 -63648 143117 294252 -462574 25274 -54552 144940 200233 -110039 -4025
$$ packed form
18468D8796g778k10674a7779B33357a32480d4509G3594b4264B57768b45621E2088
18456C12444A37371a68597g9372A1524J36101a48547o78B29345a23654k0088a700
18444H0026K30465G0971a46627B55256B0837e7910j95924h4841L3993j00958B1001
18432A79082a62153e319m2373B6005a88283j7563C3780L7707a07410j97844M7072
18421b58182j9974B5629J07183d3935j25284I1016J05742F3130A3374b20839E5387
18409B39673e7227j57541A42792c9298j19988B0837h3898I2329b74536A51b09596
18397c5309j36227A31794a94420p2141h139k72245A10742b11411f2549r4013A74022
18385d4956m1183K2491A43117J51135d62574B5274e4552A44940N5293a10039d025
$$ plain form
18373 -31328 15838 38180 -18267 164660 -48839 88891 36223 -260323 234520 243708 -57689
18361 -47124 117012 126359 -372380 -4602 -20035 -145352 -101612 334746 -130900 -86625 -92138
18350 -92138 -67667 6321 -530962 113835 -212471 4867 -234212 286862 -158845 -482320 24198
18338 -37024 140360 18530 188585 138372 -83316 -11161 -243926 -10992 32002 -39094 1317
18326 -264579 -111277 271529 -38463 -210964 17629 40823 -9383 219337 132686 -88056 100839
18314 -282465 -56068 -191128 135508 206209 -120205 -309884 19733 -569 -19571 177026 123834
18303 123834 -3387 27986 -335372 -20216 -68974 27493 13715 -114694 4991 177420 -220562
18291 22628 -104081 -239416 -48354 -12051 -320863 -45644 -27829 -120170 223945 -19833 -170300
$$ packed form
18373c1328A5838K2342a8267A64660d8839H8891C6223b60323B34520R188e7689
18361d7124A17012R347c72380d602j5433j25317M3740C34746a30900M4275n513
18350i2138K4471F321e30962A13835b12471D867b34212B86862a58845l23475B4198
18338c7024A40360A8530J70055n0213h3316a1161k32765a0992C2002c9094A317
18326b64579a11277B71529c8463j72501A7629K3194i383B19337q6651h8056A00839
18314b82465e6068j35060A35508P0701a20205j89679A9733e69j9002A77026n3192
18303A23834c387B7986c35372b0216m8758B7493A3715a14694D991J72429b20562
18291B2628a04081j35335d8354a2051l08812d5644J7815r2341B23945a9833j50467
$$ plain form
18280 -170300 -247551 -155019 -164911 -77817 -218337 -87981 -117824 47153 -96011 -28607 -120586
18269 -120586 -91917 7718 -109147 -150648 -175113 -4225 -16517 76212 118415 -172626 147966
18257 179625 75486 -17218 -145510 -111968 -289734 -300976 -75639 -122852 154213 80503 -309534
18245 -145098 -350534 -63220 67655 -207934 -83705 78470 -86741 558 -144166 135503 -96162
18233 190503 145296 -92574 -67307 -114369 49550 -3172 -165455 -33031 -133414 61712 -190088
18221 32252 22490 43929 190200 -300318 -170830 18668 -20464 -136273 55670 -203709 247202
18209 -144959 -61631 -89493 -8197 82355 -91457 131132 -276389 -99794 42025 -442920 47978
18197 -78674 4556 -176546 -73183 -268688 -139275 -5154 -155522 -84723 -212446 281333 -138583
$$ packed form
18280a70300p7251R2532r892g7817j40520h7981k9843D7153i6011b8607r1979
18269a20586K8669G718a09147m1501k4465d225j2292G6212M2203a72626A47966
18257A79625G5486a7218j28292L3542j77766j1242g5639m7213A54213p3710c09534
18245a45098k05436f3220F7655b07934h3705G8470h6741E58a44166A35503i6162
18233A90503m5207i2574K5267m7062D9550c172j62283c3031j00383F1712a90088
18221C2252r762K1439J46271c00318J29488A8668b0464j15809E5670b03709B47202
18209a44959f1631k7862h197H2355i1457A31132b76389i9794D2025d42920D7978
18197g8674D556a76546g3183j95505J29413e154j50368P0799j27723B81333a38583
$$ plain form
18185 -291812 -53800 -301392 88335 77871 -264430 43801 195353 -188657 145768 -89806
18174 -15392 406382 225593 -200505 -374510 151374 157414 -326807 -37013 -131162 -172136 -262861
18163 -262861 67696 -12634 -114155 319456 206339 161843 -281081 -36886 116219 -164841
18152 -137694 30162 -189520 100466 -250446 -38997 25044 323163 -144491 26791 -562693
18141 -29811 133985 -86005 -23602 -211181 24658 -9753 -90919 -51879 -57869 -21786 82731 205066
18129 205066 -113764 66293 -180028 -304783 71737 243703 -53807 -112477 333208 46 139427
18118 139427 -148846 -346350 -146347 -209755 215526 140325 -53004 -178262 409942 -246687
18107 -38589 44267 -92256 -42982 -97501 -192262 -200727 -159185 -109016 149845 98824 -153059
$$ packed form
18185b91812e3800k47592H8335j0464b64430D3801J51552a88657A45768h9806
18174a5392D06382j80789b00505j74005A51374O040c26807c7013r4149m0974r0725
18163b62861F7696a2634j01521C19456j13117m4496b81081c6886A16219a64841
18152a37694C0162a89520A00466b50446c8997B5044K98119a44491B6791e62693
18141b9811A33985h6005b3602j87579B4658i753q1166L9040n990b1786H2731J22335
18129B05066a13764F6293a80028j24755G1737J71966e3807n8670C33208D6J39381
18118A39427a48846j97504a46347o3408B15526p5201e3004j25258D09942b46687
18107c8589D4267i2256d2982n4519r4761q465M1542N0169A49845n1021a53059
$$ plain form
18095 -63600 100194 205778 -463591 348 -185602 43389 120917 -40567 65577 -275046 191302
18083 317128 283923 -142590 110511 -221548 -101847 -57606 -200698 739 187119 83929 -217448
18071 20736 202749 -212592 393830 31820 -91747 -250118 -139656 103569 -120223 273274
18060 -247290 32262 -43635 5287 86124 51103 262770 -140214 41132 241651 208357 212524
18049 212524 -83391 -28925 -275176 -231108 13631 -15297 -124493 242031 6467 -150715 -109367
18038 -109367 -20618 -67165 329880 130438 67551 286659 -145469 -2370 -199030 -460342
18028 -460342 14435 113286 -194159 -137022 -29258 90194 -69303 -14221 -65234 174009 -297430
18016 -120696 -157991 -35842 119455 167768 -195543 149654 55925 -34816 -46742 -53212 170248
$$ packed form
18095f3600A00194J05584d63591C48a85602D3389P7528d0567F5577b75046A91302
18083C17128l3205a42590A10511b21548a01847M4241j43092G39J86380H3929b17448
18071B0736J82013b12592C93830C1820i1747j58371J10462A03569a20223B73274
18060b47290C2262d3635E287Q0837l5021K11667a40214D1132K00519l3294M167
18049B12524h3391b8925k46251M4068A3631a5297j09196B42031F467a50715M1348
18038a09367b0618m6547C29880A30438o2887K19108a45469b370j96660k61312
18028d60342A4435R8851a94159N7137b9258I0194f9303a4221n1013A74009b97430
18016a20696l7295c5842A19455M8313a95543A49654E5925c4816j1926o470A70248
$$ plain form
18004 36098 437723 180945 201779 558782 -413180 165306 -56793 -3533 43597 -1207 -257577
17993 -257577 -83182 62388 83406 -429982 -282905 44833 165403 -72858 130447 -13859 -227872
17982 -227872 -63673 -209506 -50092 -261747 283197 131890 40264 -8962 44687 17522 127518
17971 127518 27133 -40277 -210843 16633 181379 96675 -86473 -337142 -72761 278887 254528
17960 254528 38797 22196 -187436 -211540 3459 306414 227656 -474839 -189941 175339 -248758
17948 -187841 218224 220783 -323548 243212 64050 -127951 19875 -31945 58196 -122718 -38021
17936 -230426 -122424 36713 -73568 122839 101784 -89904 238336 52855 288125 71838 -66679
17924 -199851 -369925 -175459 -148157 -205700 -104921 -136272 -208204 -207638 -182619 193711 197297
$$ packed form
18004C6098M01625A80945K0834L57003d13180A65306e6793c533D3597a207k56370
17993b57577h3182F2388K1018d29982J47077D4833J20570g2858A30447a3859k14013
17982b27872f3673j45833e0092k11655B83197A31890D0264h962D4687A7522J09996
17971A27518B7133d0277j70566A6633J64746q4704h6473k50669g2761B78887k4359
17960B54528C8797j6601a87436k4104C459L02955p8758d74839a89941A75339b48758
17948a87841B18224K559c23548B43212F4050a27951A9875c1945E8196a22718c8021
17936b30426J08002C6713g3568A22839k1055h9904B38336E2855K35270G1838f6679
17924a99851j70074a75459K7302n7543J00779l1351p1932N66K5019A93711L586
$$ plain form
17913 197297 -233560 309866 44040 -96275 -28343 120301 272788 -266913 141397 167044
17903 167044 275667 46974 -80853 -35905 -246611 26117 70096 -290571 -235761 -403967 70742
17891 126850 -86901 -10188 23794 -11621 -35758 -82547 -61320 63889 250833 105055 17540
17879 73851 31579 -16267 -90399 -136626 242151 -219328 -39012 376434 -50917 49820 115636
17868 115636 -372379 -368923 113167 -78970 -2566 -49634 -475694 115433 -84950 -73021 -136003
17857 -136003 47319 -9160 -224145 70348 122242 317163 -417538 -232947 -64965 400428 10294
17845 -101004 -9393 158291 -102865 -259496 278225 60172 -207456 -116702 145854 -328371
17834 133896 -284429 79321 -160778 45957 -38867 -71338 259114 102771 -71345 -175299
$$ packed form
17913A97297b33560C09866D4040i6275b8343A20301J52487b66913A41397K5647
17903A67044J08623D6974h0853c5905k10706B6117M3979b90571N4810j68206G0742
17891A26850h6901a0188B3794a1621k4137m6789K1227F3889J86944A05055A7540
17879G3851C1579a6267p4132m6227B42151b19328c9012C76434e0917D9820O5816
17868A15636c72379L456A13167g8970b566m7068m26060A15433h4950J1929o2982
17857a36003D7319i160k14985G0348N1894J94921d17538J84591f4965D00428A0294
17845a01004i393A58291a02865j56631B78225F0172b07456R0754A45854c28371
17834A33896b84429G9321a60778D5957c8867l2471B59114A02771g1345j03954
$$ plain form
17824 -175299 289840 226600 61289 13724 103462 64131 121270 -25828 43479 -26390 182864
17812 182545 145594 -24957 50272 -3037 -183683 -148739 99210 -219447 16734 98941 -80060
17800 11015 192729 53574 -65678 -454930 42583 17776 339156 -70509 112850 265806 -145260
17788 98916 -93123 263079 293906 -8815 369534 65346 -354628 -131939 203087 -59649 29702
17776 85970 58758 27936 -21452 -258 -251555 55227 245514 -238759 -213088 -61439 122544
17764 12448 -169311 -266870 241923 48062 27956 -56303 190613 -284693 -610 223671 -128772
17752 -220212 73179 11197 -42700 -154235 12163 59501 -88704 3867 114605 -48373 28190
17740 2104 -34068 195573 73799 196901 216860 269125 -162093 33224 49724 384426 97413
$$ packed form
17824a75299B89840o3240F1289A3724Q9738l9331N7139b5828D3479b6390A82864
17812A82545l6951b4957E0272c037j80646L4944I9210b19447A6734Q2207h0060
17800A1015J81714E3574f5678l89252D2583A7776L21380g0509A12850J52956a45260
17788I8916i3123B63079L0827h815C69534F5346c54628a31939B03087e9649B9702
17776H5970k7212B7936b1452b58k51297E5227J90287b38759K5671f1439A22544
17764A2448a69311r7559B41923D8062k0106e6303A90613b84693f10B23671a28772
17752b20212G3179A1197d2700j11535A2163M7338h8704C867J10738d8373B8190
17740B104c4068A95573G3799J23102J9959N2265a62093C3224J6500L34702I7413
$$ plain form
17728 -153044 339143 -46478 -403877 -165218 5661 116983 -226294 -2121 -272676 2123 24915
17717 24915 -66348 -105214 150401 -18828 -92912 52188 118990 217110 69210 316538 270582
17706 270582 67275 172079 262097 160379 159107 23087 348514 189647 341791 -67559 181422
17694 246596 -278771 48744 211629 112803 -140769 -29923 239564 8835 51625 32129 -130672
17682 33857 136359 330754 110294 87312 138079 163429 118591 -24024 121767 79370 214071
17671 214071 58074 136501 -214884 -307164 145869 -230694 -197047 -11394 314307 117387
17660 156096 16345 -47788 -207615 233858 -133988 169645 -36411 -26523 -225451 18757 70287
17649 70287 356164 -84063 281047 272794 40354 29786 -90468 -237554 77688 115803 90676
$$ packed form
17728a53044C39143d6478l57399a65218E661J11322b26294b121k70555B123K2792
17717B4915f6348l8866A50401a8828p4084E2188O6802R8120F9210K47328m5956
17706B70582F7275J04804R0018j01718j272B3087L25427j58867J52144f7559A81422
17694B46596b78771D8744J62885r8826a40769b9923B39564H835M2790j9496a30672
17682C3857J02502J94395A10294k2982N0767K5350m4838b4024A21767m2397J34701
17671B14071E8074P8427b14884r2280A45869b30694L3647a1394C14307A17387
17660A56096A6345d7788j59827B33858a33988A69645c6411R888j98928A8757N1530
17649G0287K85877h4063B81047q253D0354j0568i0468j47086G7688L8115k5127
$$ plain form
17638 90676 111770 -390314 -182843 125125 253763 -83224 178943 -46901 -253481 127055
17627 -126839 352838 86420 36284 109969 141165 113764 -188420 28860 -130713 -321144 183381
17615 265040 334470 -393473 -43677 16126 -185924 209682 337346 -214079 -286313 26312
17604 200003 33295 26050 -52994 206707 117591 188422 -95104 216235 72176 -42416 178114
17592 649198 -340288 -150007 -82885 -1981 -106177 -115187 -53003 58836 56341 -199759 -40651
17580 422854 -327019 326135 80177 154141 25078 -76492 108118 110217 36582 31812 -42762
17568 167666 -187490 17716 121118 -75577 73436 347154 3675 8558 478178 4092 -289585
17556 97391 215641 302803 41917 54180 1731 51140 217657 321905 243762 134420 495974
$$ packed form
17638I0676K1094c90314a82843A25125J28638h3224A78943d6901k06580A27055
17627a26839C52838H6420C6284P3685L1196k7401a88420B8860a30713j90431A83381
17615B65040O9430c93473d3677A6126a85924B09682J27664b14079p2234B6312
17604B00003C3295p245e2994B06707q9116P0831i5104B16235G2176d2416A78114
17592F49198c40288a50007O7122a981j04196r010e3003E8836k495a99759d0651
17580D22854c27019C26135H0177P3964B5078g6492A08118K099C6582m770d2762
17568A67666a87490A7716J03402g5577G3436K73718C675M883M69620D092b89585
17556I7391J18250Q7162D1917J2263A731M9409J66517J04248p8143j09342L61554
$$ plain form
17545 495974 138536 -220794 -10852 -125685 195198 321698 40456 589929 -25743 -85387
17535 -85387 -112351 -346002 -169809 -59666 -181751 40349 157605 -209936 78784 82912 -26179
17523 390786 218634 40675 271849 -120729 -113872 114579 131071 104693 1471 199979 69910
17511 -161245 -239155 178375 -184532 188589 107928 34879 218847 455358 334876 218477
17501 218477 200537 48160 210871 65392 51741 221409 223268 279479 158614 313475 38557
17489 264015 101057 38716 122081 -386007 105703 -71177 9513 201814 160800 376411 179114
17477 558502 76155 61408 224924 242119 337012 285206 161612 202667 305 182358 -94570
17465 -84432 112762 207367 390542 168229 -43690 236634 131833 273796 440460 271834
$$ packed form
17545D95974A38536b20794a0852j14833A95198J26500D0456N49473b5743n9644
17535h5387k6964k33651a69809e9666j22085D0349J17256b09936G8784M128b6179
17523C90786j72152D0675K31174a20729O857A14579J6492k6378A471J98508F9910
17511a61245p7910A78375a84532A88589q0661C4879J83968K36511j20482j16399
17501B18477j7940D8160J62711F5392j3651J69668J859N6211j20865J54861C8557
17489B64015A01057C8716Q3365c86007A05703g1177I513J92301m1014K15611A79114
17477E58502G6155j4747J63516J7195R4893n1806j23594M1055C05J82053i4570
17465h4432A12762R4605J83175A68229d3690B36634j04801J41963J66664j68626
$$ plain form
17455 271834 208658 347741 382181 148552 350774 233295 109807 117710 351603 260838
17445 260838 752003 200248 162441 332039 316025 257278 120632 358679 140038 353825
17435 353825 342951 350232 -15228 100919 467417 388565 62993 -38069 346351 105233 -203599
17423 176647 425525 404470 218408 115026 453701 268990 596832 297497 204415 233379
17413 233379 278752 479463 116908 391644 -94739 -158741 297951 191377 74502 -111422
17402 357874 -37622 450017 22830 284424 -5816 419997 274909 -292841 139629 56143
17391 208288 148236 406449 193397 -116441 328270 387168 -135725 217326 274969 243517
17381 243517 -84641 178026 124953 248298 165773 95228 180270 26431 255561 444222 183834
$$ packed form
17455B71834o3176J39083L4440A48552K02222j17479A09807P903K33893r0765
17445B60838M91165B00248l7807J69598j6014n8747A20632K38047A40038K13787
17435C53825j0874P281a5228A00919L66498p8852F2993c8069C46351A05233b03599
17423A76647K48878k1055j86062j03382L38675j84711L27842B97497r3082K8964
17413B33379M5373K00711A16908K74736i4739o4002B97951j06574G4502a11422
17402C57874c7622D50017B2830K61594e816D19997j45088b92841A39629E6143
17391B08288o0052K58213A93397a16441C28270N8898a35725B17326N7643l1452
17381B43517h4641A78026n3073J23345q2525p0545Q5042B6431K29130J88661A83834
$$ plain form
17369 53465 -71075 46038 233344 175261 -135983 -328852 430974 204671 400150 318384
17359 318384 212959 -42205 79855 192834 -119823 107224 265955 276586 489497 593965
17349 593965 357723 -96095 39360 215294 -36207 -112421 -129538 181599 -39188 -74679 233173
17337 -9338 306018 -5452 -144418 381245 280688 109431 -13558 -3272 183005 613 240277
17326 240277 -21218 133505 132529 -176751 128345 412696 173067 151136 429195 91154 105785
17315 105785 439021 -3281 262023 57194 -87028 48334 -51819 128709 230814 125213 13761
17303 41740 -302581 442678 -60277 328611 235279 79989 51836 286410 -62908 202920 173949
17292 173949 310230 -213010 249070 383481 221443 302995 185818 337613 434258 75105
$$ packed form
17369E3465g1075D6038J87306n8083a35983j92869D30974B04671J95479q1766
17359C18384j05425d2205G9855J12979a19823A07224J58731J0631K12911J04468
17349E93965k36242i6095C9360J75934c6207p6214j7117A81599c9188l5491B33173
17337i338C06018e452j38966C81245j00557A09431a3558c272A83005F13K39664
17326B40277b1218A33505r76a76751A28345K84351A73067k1931K78059I1154J4631
17315A05785L33236c281B62023E7194h7028D8334e1819A28709J02105j05601A3761
17303D1740c02581D42678f0277C28611r3332G9989k8153K34574f2908B02920k8971
17292A73949J36281b13010B49070J34411j62038Q1552j17177J51795R6645G5105
$$ plain form
17281 465272 344900 282228 165670 -1540 300759 -90082 244341 114819 -441 381255 224110
17270 224110 68891 297668 450679 26798 426695 74164 140885 484 -14530 55670 12540
17258 289074 222691 65947 219723 292167 -115622 202132 317036 304548 261375 518868
17248 518868 39572 477560 77231 -12790 264968 280123 36127 -89911 95576 -61385 227554
17236 232237 127828 458696 246968 313112 102904 197188 217594 485115 202646 262874
17226 262874 323943 186448 235239 201583 331642 356640 433969 322298 457298 222464
17215 274970 379243 374186 269050 374469 78809 25613 397365 184959 399490 342152
17205 342152 312699 203580 328926 222810 198421 371279 426364 397760 233730 167762
$$ packed form
17281D65272j20372o2672j16558a540C00759i0082B44341A14819d41C81255j57145
17270B24110F8891K28777J53011B6798L99897G4164O6721D84a4530E5670A2540
17258B89074o6383F5947J53776P2444a15622B02132J14904j2488m3173K57493
17248E18868C9572M37988G7231a2790B64968J5155C6127h9911I5576f1385B27554
17236B32237j04409L30868k11728O6144A02904R4284K0406K67521B02646O0228
17226B62874O1069j37495M8791l3656J30059K4998P7329j11671J35000B22464
17215B74970J04273n057j05136J05419G8809B5613L71752A84959K14531n7338
17205C42152k9453j09119J25346j06116k4389J72858N5085k8604j64030o5968
$$ plain form
17195 167762 328345 338762 523198 283310 247129 333813 262391 516909 301513 162602
17185 162602 399085 182868 598170 279447 147121 346880 352864 149380 289483 356481
17175 356481 253086 365509 269444 -90023 219754 265671 358572 497310 290243 384341
17165 384341 78274 389426 -110824 413710 15474 393011 92093 340927 273540 584303
17155 584303 197584 238976 136707 -77219 433287 141895 297317 177363 213396 157859
17145 157859 348478 123368 281463 531621 233146 135493 552855 546923 413044 136920
17134 167726 -70575 498322 64567 451713 95703 323599 202749 47836 350057 118756
17123 448027 361555 402961 227531 313603 123272 266167 555379 395054 373241 211333
$$ packed form
17195A67762J60583J0417J84436k39888l6181Q6684p1422K54518k15396j38911
17185A62602K36483A82868M15302B79447j32326J99759N984A49380J40103O6998
17175C56481j03395J12423r6065i0023B19754M5917R2901J38738k07067R4098
17165C84341G8274L11152a10824D13710A5474L77537I2093K48834o7387L10763
17155E84303A97584M1392j02269g7219D33287A41895J55422j19954L6033n5537
17145A57859J90619A23368J58095K50158B33146r7653M17362n932j33879A36920
17134A67726g0575D98322F4567L87146I5703K27896j20850D7836L02221A18756
17123D48027q6472M1406j75430Q6072A23272J42895K89212j60325k1813j61908
$$ plain form
17113 211333 508790 481861 500506 606706 236068 223828 403557 246408 210718 318298
17103 318298 412725 432178 326799 393686 774819 46466 343456 479558 698845 273522
17092 663808 709311 546493 505988 247415 415776 288807 239116 409849 6312 604065
17082 604065 246551 361861 331007 525172 440542 453261 332363 421251 247714 657070
17072 657070 324505 486425 537758 356182 251227 705551 628540 329390 477476 420794
17062 420794 152955 567705 544979 341345 571937 431339 508585 405121 495785 613663
17052 613663 534992 216481 681583 418834 419881 674477 441408 398700 368638 758301
17042 758301 646256 474829 393614 701792 790120 774800 654935 668841 409365 376882
$$ packed form
17113B11333K97457k6929J8645J06200B36068j2240J79729j57149l5690J07580
17103C18298R4427J9453j05379O6887L81133D6466K96990J36102K19287B73522
17092F63808M5503j62818m0505B47415J68361j26969m9691J70733F312N97753
17082F04065B46551J15310l0854J94165q4630J2719j20898Q8888j73537M09356
17072F57070C24505J61920N1333j81576j04955M54324p7011k99150J48086n6682
17062D20794A52955M14750k2726k03634K30592j40598P7246j03464R0664J17878
17052F13663p8671B16481M65102k62749J047K54596k33069m2708l0062L89663
17042G58301j12045j71427q1215L08178Q8328j5320j19865J3906k59476l2483
$$ plain form
17032 376882 584926 607154 383416 658444 739705 871674 687686 750943 475682 163403
17021 462433 493341 728460 915648 667112 416123 346110 478334 552110 839776 709086
17011 709086 620986 657455 734390 853996 751439 734159 672113 575075 677172 577001 961055
17000 961055 882876 939337 1065344 618925 794253 626248 736152 600385 637133 756216
16990 756216 832595 743712 750096 619993 818897 889180 753930 757963 973380 851777 691650
16979 691650 714970 1081503 782934 655568 913845 1042401 1149310 861384 1264841 783646
16969 783646 831825 677209 1084161 832445 1135424 1075408 1163682 1113023 1123864 692744
16959 692744 1303694 1320103 1063779 1214870 950503 1132355 1171929 1184734 881036 1128557
$$ packed form
17032C76882K08044K2228k23738K75028Q1261J31969j83988O3257k75261A63403
17021D62433L0908K35119J87188k48536k50989p0013J32224P3776K87666j30690
17011G09086q8100L6469P6935J19606j02557j7280o2046r7038J02097j00171L84054
17000I61055p8179N6461J26007m46419J75328j68005J09904j35767L6748J19083
16990G56216P6379q8883O384j30103J98904P0283j35250M033K15417j21603j60127
16979F91650K3320L66533k98569j27366K58277J28556J06909k87926M03457m81195
16969G83646M8179j54616M06952k51716L02979o0016Q8274n0659J0841m31120
16959F92744O10950J6409k56324J51091k64367J81852L9574J2805l03698K47521
$$ plain form
16949 1128557 1210415 1110344 903853 1206682 1115406 1111228 1228026 1255019 1281533 1223961 1555073
16938 1555073 1524615 1352336 1232529 1192430 1333787 805237 1010797 1655191 1457392 1474582
16928 1474582 1188714 1394951 1283390 1110925 1338433 1354623 1319211 1437477 1195207 1322737
16918 1322737 1771155 1374809 1176576 1756371 1538856 1729139 1553901 1841375 1364025
16909 1364025 1560232 1468406 1659460 2181850 1445721 1630126 1773961 1616235 1642862 1886817
16899 1886817 1628602 1608392 2006345 2131954 2010177 1829171 1803816 2025671 1935047 2000254
16889 2000254 2155912 1656486 1765673 2008331 2037382 2046767 2190436 2156768 2084471 1910596
16879 1910596 2288353 2126616 2235450 1969314 2411453 2588214 2167217 2648559 2497306
$$ packed form
16949A128557Q1858j00071k06491L02829r1276m178J16798K6993K6514n7572L31112
16938A555073l0458j72279j19807m0099J41357n28550K05560O44394j97799J7190
16928A474582k85868K06237j11561j72465K27508J6190l5412J18266k42270J27530
16918A322737M48418l96346j98233N79795k17515J90283j75238K87474m77350
16909A364025J96207r1826J91054N22390p36129J84405J43835j57726K6627K43955
16899A886817k58215k0210L97953J25609j21777j81006k5355K21855r0624O5207
16889B000254J55658m99426J09187K42658K9051R385J43669l3668p2297j73875
16879A910596L77757j61737J08834k66136M42139J76761m20997M81342j51253
$$ plain form
16870 2497306 2420831 2380996 2415778 2520742 2414780 2615095 2827600 2916642 2891244 2625519
16860 2625519 3286813 2887122 2802339 3039396 2869479 3024881 2995481 3253584 3038364 3802453
16850 3802453 3203210 3728236 3794604 3505359 3511360 3447031 3508595 3653995 3649520 4090810 4158377
16839 4158377 4099755 3864376 4158272 4368913 4599051 4187787 4321426 4589833 4395723 4730092
16829 4730092 4528704 4645120 4950419 4877318 4990998 5780274 5391929 5602695 5602694 5802453
16819 5802453 5630225 5973590 6228594 6020797 6265592 6268049 6177471 6541478 6231155 6833787
16809 6833787 7030425 6953664 7658187 7577532 7234245 7709176 8321809 8030185 8266321 8501831
16799 8501831 8581299 8724422 8997227 9596539 9513270 9871092 9956154 10430566 10858432 10620941
$$ packed form
16870B497306p6475l9835L4782J04964j05962K00315K12505Q9042k5398k65725
16860B625519O61294l99691q4783K37057j69917J55402k9400K58103k15220P64089
16850C802453n99243N25026O6368k89245O001o4329O1564J45400m475M41290O7567
16839D158377n8622k35379K93896K10641K30138m11264J33639K68407j94110L34369
16829D730092k01388J16416L05299p3101J13680P89276l88345K10766jJ99759
16819E802453j72228L43365K55004k07797K44795K457r0578L64007l10323O02632
16809F833787J96638p6761P04523q0655l43287M74931O12633k91624K36136K35510
16799H501831P9468J43123K72805N99312q3269L57822Q5062M74412M27866k37491
$$ plain form
16789 10620941 11459801 11389841 12056357 12464534 12643175 13209694 13536561 13606103 14436431 14798179
16779 14798179 15129666 15598152 16089958 16662657 17119527 17821556 18622325 19018276 19575739
16770 19575739 20196889 21373591 21872184 22755576 23868184 24661441 25368445 26241252 27563360
16761 27563360 28750114 30152474 31737129 32759695 34784584 36188186 37465287 39548319
16753 39548319 41538451 43481502 45698618 48108715 50530337 53367072 56471812 59616116
16745 59616116 63057039 66392637 70639319 74898994 79349008 84234582 89488177 95072230
16737 95072230 101321676 107795028 114489048 122076095 129253168 136994337 145092104 153276712
16729 153276712 161553668 169620975 177632594 184934538 191425318 197062681 201779652 204850196
$$ packed form
16789A0620941Q38860o9960O66516M08177J78641N66519L26867O9542Q30328L61748
16779A4798179L31487M68486M91806N72699M56870P02029Q00769L95951N57463
16770A9575739O21150J176702M98593Q83392J112608P93257P07004Q72807J322108
16761B7563360J186754J402360J584655J022566K024889J403602J277101K083032
16753C9548319J990132J943051K217116K410097K421622K836735L104740L144304
16745E9616116L440923L335598M246682M259675M450014M885574N253595N584053
16737I5072230O249446O473352O694020P587047P177073P741169Q097767Q184608
16729A53276712Q276956Q067307Q011619P301944O490780N637363M716971L070544
$$ plain form
16721 204850196 206891739 207283486 206167920 203530972 199942004 195412996 189011211 182297274
16713 182297274 174789726 167062882 158935894 150346327 142143371 134129735 126258602 118722917
16705 118722917 111528046 104878686 98452831 92256878 86742966 81569309 76472102 72270523
16697 72270523 68242915 64167197 60495103 56831909 53997466 50827331 48456158 45879814
16689 45879814 43357449 41408357 39446354 37429452 35583055 34070028 32217184 30728707
16681 30728707 29244665 28024886 26560945 25740705 24355478 23510703 22850026 21751305
16673 21751305 20821737 19972579 19477490 18654169 18040938 17032815 16709387 16164338 15320610
16664 15320610 14956562 14707929 14287149 13579778 13365648 12735477 12480340 11726892 11737266
$$ packed form
16721B04850196K041543L91747j115566k636948l588968m529008o401785o713937
16713A82297274p507548p726844q126988q589567q202956q013636p871133p535685
16705A18722917p194871o649360o425855o195953n513912n173657n097207m201579
16697G2270523m027608m075718l672094l663194k834443l170135k371173k576344
16689D5879814k522365j949092j962003k016902j846397j513027j852844j488477
16681C0728707j484042j219779j463941q20240j385227q44775o60677j098721
16673B1751305r29568q49158m95089q23321o13231j008123l23428n45049q43728
16664A5320610l64048k48633m20780p07371k14130o30171k55137p53448J0374
$$ plain form
16655 11737266 11179187 11187222 10641375 10039730 10328712 9805543 9136262 9304923 8903476 8708121
16645 8708121 8678195 8098920 8169274 7915548 7255377 7531203 7215537 6782450 7059057 6603466
16635 6603466 6526718 6188961 6274672 5986248 6096831 5964352 5903317 5666243 5124776 5368947
16625 5368947 5159981 5128332 5061696 5192235 4956027 4674623 4465367 4608512 4241029 4443234
16615 4443234 3971072 3941697 4034212 4383603 4050269 4061914 3795230 3502538 3407155 3554744
16605 3554744 3592432 3449924 3667890 3076147 2994246 3160564 2905270 2946253 3037586 3138443
16595 3138443 2996651 3083030 2994207 2854925 2705973 2748868 2559685 2272883 2637260 2571830
16585 2571830 2531304 2314488 2495016 2324239 2574909 2061463 2368437 2255822 2428112 1990501
$$ packed form
16655A1737266n58079Q035n45847o01645K88982n23169o69281J68661m01447j95355
16645H708121k9926n79275P0354k53726o60171K75826l15666m33087K76607m55591
16635F603466p6748l37757Q5711k88424J10583j32479o1035k37074n41467K44171
16625E368947k08966l1649o6636J30539k36208k81404k09256J43145l67483K02205
16615D443234m72162k9375R2515L49391l33334J1645k66684k92692r5383J47589
16605C554744L7688j42508K17966n91743q1901J66318k55294M0983R1333J00857
16595C138443j41792Q6379q8823j39282j48952M2895j89183k86802L64377o5430
16585B571830m0526k16816J80528j70777K50670n13446L06974j12615J72290m37611
$$ plain form
16575 1990501 1899332 2223363 1921402 1879455 2042905 2054141 1749735 1926751 1766980 1677769
16565 1677769 1680957 1907408 1822413 1799740 1625921 1469576 1661090 1630333 1660436 1705576 1642612
16554 1642612 1629641 1469904 1561179 1545287 1403562 1094006 1341943 1201768 1218982 1626457
16544 1626457 1612135 1343525 1306550 1378009 1295361 1101560 1143048 1027962 1150006 1343055
16534 1343055 1002190 1381441 1384272 1157910 1457136 869050 1165903 1314454 988690 1225656
16524 1225656 889847 1121704 1021069 1231630 1236440 1160878 1157528 1088317 1019508 1289319 996056
16513 996056 792903 707543 1132436 1056277 917175 884758 864208 1018362 911903 818639
16503 818639 905903 909612 731355 732654 833137 1098768 715320 697978 1010240 1110289 648973
$$ packed form
16575A990501r1169L24031l01961m1947J63450J1236l04406J77016j59771q9211
16565A677769L188K26451q4995k2673j73819j56345J91514l0757L0103M5140o2964
16554A642612j2971j59737R1275j5892j41725l09556K47937j40175J7214M07475
16544A626457j4322k68610l6975P1459q2648j93801M1488j15086J22044J93049
16534A343055l40865L79251K831k26362K99226n88086K96853J48551l25764K36966
16524A225656l35809K31857j00635K10561M810p5562l350o9211o8809K69811k93263
16513I96056k03153q5360M24893p6159j39102l2417k0550J54154j06459r3264
16503H18639Q7264L709j78257J299J00483K65631l83448j7342L12262J00049m61316
$$ plain form
16492 648973 906738 794325 416734 693009 604537 648871 803066 845917 953846 719864
16482 719864 835737 359969 792477 646960 587601 412217 501547 465977 308421 649563
16472 649563 766957 891883 597315 689799 619829 420849 506514 420558 415107 635018 557489
16461 557489 319272 895830 517185 751876 100548 617457 612859 591389 575946 205955
16450 367631 594056 581824 473782 392173 541989 400649 556413 604594 633041 564590
16440 564590 558300 431172 591730 336779 172719 954540 180250 545749 528078 710328
16430 710328 384908 172374 450308 569617 512451 312120 303942 258637 495991 462636
16420 462636 402290 385485 734883 526655 752689 442550 466435 58612 573641 564852 580889
$$ packed form
16492F48973K57765j12413l77591K76275q8472M4334J54195M2851J07929k33982
16482G19864J15873C59969M32508j45517n9359j75384Q9330l5570j57556L41142
16472F49563J17394J24926k94568R2484o9970j98980Q5665q5956n451K19911p7529
16461E57489k38217N76558l78645K34691A00548N16909m598k1470j5443B05955
16450C67631K26425j2232j08042q1609J49816j41340J55764M8181K8447o8451
16440E64590o290j27128J60558k54951j64060P81821A80250L65499j7671J82250
16430G10328l25420A72374K77934J19309n7166k00331q178m5305K37354l3355
16420D62636o0346j6805L49398k08228K26034l10139K3885E8612N15029q789J6037
$$ plain form
16409 580889 548145 262208 529302 345369 307397 335774 428831 548359 660275 662404 281427
16397 -125219 -180618 302401 219791 375256 202511 417570 63484 335061 691037 96494
16386 9407 421075 399984 -103618 143224 119453 465329 177017 236427 285986 293791 236785
16375 236785 240173 261903 83150 170060 65638 374760 24619 461293 46233 227613 287656
16364 287656 656544 154855 282592 273662 171439 163793 83735 115069 323892 259954 136100
16353 136100 180049 -57736 -6031 253044 -345235 257835 -200144 -112909 89086 373771 418382
16342 418382 473021 343266 207783 203863 330984 233197 364334 -125479 193967 122801
16332 122801 300702 222166 163657 48170 223675 33436 514353 263635 433646 34952
$$ packed form
16409E80889l2744B62208K67094j83933l7972K8377R3057J19528J11916K129B81427
16397a25219n5399C02401q2610J55465j72745K15059F3484K71577L55976I6494
16386I407M11668k1091a03618A43224k3771L45876A77017N9410M9559P805n7006
16375B36785L388K1730H3150Q6910F5638L09122B4619M36674D6233J81380O0043
16364B87656L68888A54855J27737q930j02223p646q0058L1334K08823o3938j23854
16353A36100M3949e7736f031B53044c45235B57835b00144Q7235H9086K84685M4611
16342D18382N4639j29755j35483l920J27121r7787J31137a25479A93967p1166
16332A22801J77901p8536n8509D8170J75505C3436M80917k50718J70011C4952
$$ plain form
16321 168800 135470 87703 27114 83117 396246 -115026 231876 47206 282125 -111516
16310 20752 142966 -21971 346911 -140645 280187 184853 196370 31979 203371 73889 251252
16299 251252 375056 -165730 335503 399184 248210 204637 238037 171746 175911 -100251 439689
16287 60530 178544 469060 190212 198013 206225 10067 157414 46764 249450 149810 277287
16276 277287 292199 195180 -20702 199506 -82172 247234 -106924 -116750 107460 19864 222829
16265 222829 351082 229163 159300 146487 125400 261341 25403 360504 295992 165802
16255 165802 20430 233178 174054 281980 251848 118315 161516 -279868 237521 192427
16245 192427 283955 485890 28813 137425 282188 85109 334050 73979 177852 48059
$$ packed form
16321A68800l3330m7767B7114N6003L13129a15026B31876D7206K34919a11516
16310B0752J22214b1971C46911a40645B80187r5334J1517C1979J71392G3889J77363
16299B51252J23804a65730C35503O3681j50974m3573L3400o6291M165a00251D39689
16287F0530J18014K90516A90212P801Q212A0067J47347D6764K02686r9640J27477
16276B77287J4912r7019b0702A99506h2172B47234a06924r826A07460A9864K02965
16265B22829J28253j21919o9863j2813k1087J35941B5403L35101o4512j30190
16255A65802B0430K12748n9124J07926l0132A18315M3201b79868B37521m5094
16245A92427R1528K01935B8813J08612J44763H5109K48941G3979J03873D8059
$$ plain form
16234 2418 148905 169893 -34756 303927 241571 101424 210358 221817 -18656 496416 120254
16222 129424 185610 125153 290560 -127923 -118365 -29905 316378 350355 42201 379997 -36183
16210 -88948 -191946 -25020 -44114 43576 175950 135825 -25562 -98762 81013 242718 195752
16199 195752 182213 136902 -13213 59404 -43216 -69541 -10600 -138617 -5566 207849 -129641
16187 224922 -62418 -32670 -15719 286888 201536 -46333 65667 232618 -41845 77310 -140755
16175 -23029 313490 -362290 -18850 249148 -14017 153675 -79417 35679 -169412 172919
16164 -371573 212807 72220 -7869 -47419 -63472 64596 -121040 20017 65522 -76671 33562
16152 -15279 -327565 2558 2405 -167827 -19121 261550 -130841 -58704 295521 82105 491887
$$ packed form
16234B418J46487K0988c4756C03927o2356A01424J08934J1459a8656D96416A20254
16222A29424N6186o0457J65407a27923R558b9905C16378L3977D2201L37796c6183
16210h8948j02998b5020j9094D3576J32374m0125b5562p3200H1013J61705m6966
16199A95752j3539m5311a3213E9404d3216k6325a0600j28017e566B07849a29641
16187B24922f2418K9748a5719B86888q5352d6333F5667J66951d1845G7310a40755
16175b3029C13490c62290a8850B49148a4017A53675g9417C5679a69412A72919
16164c71573B12807G2220g869l9550j6053F4596a21040B0017M5505g6671C3562
16152a5279l12286B558j53a67827a9121B61550a30841e8704B95521H2105M09782
$$ plain form
16141 491887 178422 148504 75112 178268 -303269 46229 201274 -43193 -158639 -160059 108915
16129 123799 40807 257446 246530 -183917 258606 129549 -195465 6545 -59427 33636 -288788
16117 42807 68762 141336 -250149 -232402 186076 267108 -125179 -84314 19245 -71936 -75516
16106 -75516 -188873 -26262 106764 34242 37444 -134949 169565 165568 -336591 188935 -4071
16094 -36633 -393789 170212 339051 -85897 -95137 96577 -77042 123038 -30925 -23679 343970
16082 -253977 -331424 -54445 172113 317237 -112537 50819 -339535 -271235 160628 -322762
16071 228120 26894 62523 -5222 153425 108676 -182392 47206 -45468 92392 -134617 -101517
16060 -101517 286181 -121077 -56979 -265866 272187 -71834 -303113 93021 -178622 190768
$$ packed form
16141D91887A78422k9918p3392J03156c03269D6229J55045d3193j15446j420A08915
16129A23799D0807K16639j0916a83917B58606j29057a95465F545e9427C3636b88788
16117D2807K5955P2574b50149J7747A86076Q1032a25179M0865A9245g1936l580
16106g5516j13357b6262A06764C4242L202a34949A69565l997c36591A88935d071
16094c6633l57156A70212J68839h5897r240I6577g7042A23038c0925P246C43970
16082b53977p7447e4445A72113J45124a12537E0819c39535O8300A60628c22762
16071B28120B6894L5629e222A53425m4749a82392D7206d5468I2392a34617L3100
16060a01517B86181a21077e6979k08887B72187g1834k31279I3021a78622A90768
$$ plain form
16049 -31231 213854 -100300 -60452 -74638 -58938 -31560 -168675 3721 -249012 34790 -125377
16037 -75159 -27441 329415 -28907 22153 -28747 59766 404912 85809 70015 -13996 220878
16025 173377 76376 -196416 -11185 191628 -39491 54358 50454 -221829 -419236 -312755 -457432
16014 -457432 27563 57450 11933 -30616 -155090 -207703 111921 222782 278164 83078 -77336
16002 174099 52991 297607 -369919 114628 145673 -153661 -207697 -26344 148306 129277
15992 129277 8760 -129929 -155639 207560 153810 -187729 17690 -69404 175223 233288 39530
15980 280816 56889 229085 153865 337993 61103 -92507 83947 246330 45978 -342018 98941
15968 100608 -338060 -110988 85797 88627 144562 15528 -3002 190414 140854 -4641 -240356
$$ packed form
16049c1231B13854a00300L9848j4186J5700K7378j37115C721b49012C4790a25377
16037g5159b7441C29415b8907B2153b8747E9766L45146H5809j5794a3996B20878
16025A73377G6376a96416a1185A91628c9491E4358l904b21829j97407J06481j44677
16014d57432B7563K9887A1933c0616j24474n2613A11921J10861N5382H3078g7336
16002A74099E2991K44616c69919A14628L1045a53661n4036b6344A48306j9029
15992A29277H760a29929k5710B07560n3750a87729A7690f9404A75223N8065C9530
15980B80816E6889J72196p5220J84128F1103i2507H3947J62383D5978c42018I8941
15968A00608c38060a10988H5797K830N5935A5528c002A90414m9560d641k35715
$$ plain form
15957 -240356 351992 21915 -58438 -201928 -207915 -157502 -206643 65879 34908 122585 -145681
15945 17433 16629 -300564 189462 -165512 -9636 5574 -181811 -119278 -80587 177898 -150841
15933 -244445 215300 -167720 -144720 -158116 223258 -43248 -160144 -40718 62592 -169304
15922 -159308 -77104 -111641 -116092 -351501 197872 -200934 97726 -85503 -193738 -128548 31612
15910 54386 -122712 82515 15830 -196599 6890 49358 58113 -247467 -172805 97982 -163647
15898 -187522 257255 207289 91750 -75486 113316 -8981 -50498 -81964 -19041 -341293 -23121
15886 14738 119878 -51504 48606 -95579 -38598 -152390 -3685 -50866 19192 -169 167043 -297961
15873 181790 -283675 11131 179559 9402 -102327 -25035 -253786 -17869 -209044 -195283 -195503
$$ packed form
15957b40356C51992B1915e8438j43490n987N0413m9141F5879l0971Q7677a45681
15945A7433q04c00564A89462a65512i636E574a81811O2533L8691A77898a50841
15933b44445B15300a67720K3000j3396B23258d3248j16896d0718F2592a69304
15922a59308g7104l4537m451k35409A97872b00934I7726h5503j08235O5190C1612
15910E4386a22712H2515A5830a96599F890M2468Q755b47467P4662I7982a63647
15898a87522B57255m9966I1750g5486A13316h981m1517l1466a9041l22252b3121
15886A4738J05140e1504D8606i5579c8598j13792c685m7181A9192a69A67043b97961
15873A81790b83675A1131J68428I402a02327b5035k28751a7869j91175J3761k20
$$ plain form
15862 -195503 -242270 108089 -207749 -19000 -102979 -30585 -128984 -78634 -83566 -49669 69911
15850 288527 113596 -213331 -172430 -15404 -144751 -26775 65034 -300231 30907 251591
15840 251591 -152753 -265848 -7968 -81776 124749 10542 189150 -183565 105648 63307
15830 63307 291604 179416 18883 27019 152589 -384493 -167724 -91734 -162673 136678 -112552
15818 -1106 -164582 -210676 -268111 -211114 134871 -13563 218042 -105735 -250443 97133 -323865
15806 -86577 -148828 -23038 -49615 -54223 42706 294902 148982 350106 -93260 -251461 -214486
15795 -214486 -28225 25947 -298512 -112361 -1321 -460710 33710 216269 -348554 46920 -55817
15783 252157 126168 41006 -382063 128398 105248 -13957 -206661 -54727 -317883 78985
$$ packed form
15862a95503m6767A08089b07749a9000q3979c0585r8399N0350m932L3897F9911
15850B88527A13596b13331M0901a5404j29347b6775F5034c00231C0907K20684
15840B51591a52753j13095g968p3808A24749A0542J78608a83565A05648m2341
15830F3307K28297j12188A8883Q136J25570c84493a67724P5990p0939A36678a12552
15818a106j63476m6094n7435N6997A34871a3563B18042a05735j44708I7133c23865
15806h6577o2251b3038k6577m608D2706K52196j45920K01124i3260j58201L6975
15795b14486b8225B5947b98512a12361a321m59389C3710J82559c48554D6920e5817
15783B52157j25989D1006c82063A28398k3150a3957j92704e4727k63156G8985
$$ plain form
15772 78167 -176801 21125 183459 -47806 262264 -12042 61978 118721 44165 39546 155136
15761 155136 -259662 251895 -18543 -135856 262188 247149 -119295 305494 -32993 37466
15750 88678 -36115 79825 -57261 -29236 296313 258938 -45763 74939 -381194 7479 -44473
15738 4263 139984 34414 -134551 -135085 -28373 -54328 -33639 133570 83520 -430824 -29270
15726 -151153 -25365 -164406 -188008 26855 73470 188209 175344 -81009 118721 -2311 121703
15714 53950 95872 120799 -128892 75015 106071 -10742 -79840 -36412 -550064 -96152 100664
15702 174902 -286453 188160 -161677 112306 357280 -170703 -120386 -193469 -28904 -5281
15691 -40247 -142894 92026 411809 -381634 203632 159115 118109 62021 -248696 -161771 -211992
$$ packed form
15772G8167a76801B1125J62334d7806B62264a2042F1978N6743D4165m619J15590
15761A55136b59662B51895a8543j17313B62188j5039a19295C05494c2993C7466
15750H8678c6115G9825e7261K8025B96313l7375d5763G4939c81194G479d4473
15738D263J35721C4414a34551n34b8373k5955K0689A33570n0050d30824b9270
15726a51153b5365j39041k3602B6855M6615J14739j2865h1009A18721b311A21703
15714E3950M1922K4927a28892G5015L1056a0742o9098c6412n13652i6152A00664
15702A74902b86453A88160a61677A12306K44974a70703N0317p3083b8904e281
15691d0247j02647I2026L19783c81634B03632m4517m1006n6088b48696Q6925n0221
$$ plain form
15680 -211992 -97860 -113120 44646 14800 -64723 5516 380088 127994 -32824 143185 206107
15669 206107 -99481 34674 77745 -160413 172699 130365 143435 129158 -276185 -431418 -58776
15657 354516 -362856 69968 56884 -97980 -99319 22695 89280 73812 -35475 -52238 12299
15645 -78903 63143 43027 -155938 69262 -122470 61800 -303111 -77326 -129166 -145281 88443
15633 -329999 -212404 21400 -154102 -253478 -31301 114240 -357984 -7194 65391 135237 -117205
15621 107316 -74531 -160625 176596 -153351 365526 -22963 81007 215240 -188058 -162827
15611 -162827 129994 -102992 42304 -170452 -110082 134052 -504977 28838 -120304 -210591
15601 -210591 244019 73236 6727 -132809 -135447 -160298 -47767 -42230 182010 -168284 110108
$$ packed form
15680b11992i7860j5260D4646A4800f4723E516L74572A27994c2824A43185O2922
15669B06107i9481C4674M3071a60413A72699m2334J3070j4277b76185j55233e8776
15657C54516c62856F9968j3084i7980j339B2695O6585j5468c5475j6763A2299
15645g8903F3143k0116a55938F9262a22470F1800c03111g7326n1840j6115H8443
15633c29999J17595B1400a54102r9376c1301A14240c57984g194F5391O9846a17205
15621A07316g4531q6094A76596a53351C65526b2963H1007J34233a88058K5231
15611a62827A29994a02992D2304a70452O0370A34052e04977B8838a20304r0287
15601b10591B44019G3236F727a32809k638k4851d7767N537A82010a68284A10108
$$ plain form
15589 -59558 60638 -143145 -162197 -160677 -83126 304373 -67576 123167 -61502 605 -93482 -144362
15577 -144362 53320 -78348 -104363 174746 216068 80580 54007 -100152 -169398 -40004 128447
15565 9904 7246 -40619 -164966 213138 27860 -18248 109237 -378816 -168055 427886 270831
15554 270831 66084 155902 86286 153154 186227 362858 30529 43490 -389097 -259655 -39566
15542 -160502 106579 -94789 79216 52610 -175057 -312714 219803 -167000 -83429 126313
15531 -174601 88682 -38211 308 389588 63095 -260614 -311003 -198359 -69126 -247060 -74044
15519 -10401 -233166 176717 -142710 -118400 73412 -71019 35616 273060 71036 -32066 -489347
15508 -489347 55554 -189077 -163481 94068 -249467 -120081 -53039 -72068 241013 109225
$$ packed form
15589e9558F0638a43145j9052J520P7551C04373f7576A23167f1502F05i3482n0880
15577a44362E3320g8348k6015A74746M1322H0580k6573a00152o9246d0004A28447
15565I904k658d0619j24347B13138B7860a8248A09237c78816a68055D27886j57055
15554B70831F6084Q9818o9616O6868L3073J76631C0529J2961c89097J29442c9566
15542a60502A06579i4789G9216k6606a75057j37657B19803a67000h3429A26313
15531a74601H8682c8211C08L89280F3095b60614n0389J12644f9126j77934g4044
15519a0401k22765A76717a42710K4310G3412g1019C5616K37444G1036c2066m57281
15508d89347E5554a89077K5596I4068b49467a20081e3039j9029B41013A09225
$$ plain form
15497 -68871 -175910 -381463 55063 112315 83930 -220207 -4535 -41460 261604 -164410 -158869
15486 -158869 75534 194698 -69848 176388 185110 -204362 45468 -66690 177508 -96790 25233
15474 -156701 67628 97611 -223367 -97555 -83306 108248 271010 11770 98199 -32492 -106887
15463 -106887 22946 -201439 268682 28133 -79303 29443 158210 -46858 -105679 98153 -97984
15451 338781 4807 135041 88240 -88046 271182 -93875 119729 332463 16623 -58026 -15900
15439 129033 -48698 6573 -222609 -800 124736 -95252 -13906 50044 279159 79839 -151912
15427 -157584 -103252 -108299 156224 -198873 -180592 387174 249116 307170 63059 50229 101535
15416 101535 -205198 -236239 -332048 -30942 -110457 -46782 239501 79887 -218629 227755 -232518
$$ packed form
15497f8871j07039k05553E5063N7252k8385b20207d535l6925B61604a64410N541
15486a58869G5534J19164f9848A76388Q722b04362D5468f6690A77508i6790B5233
15474a56701F7628K9983b23367i7555J4249A08248J62762A1770Q6429c2492p4395
15463a06887B2946b01439B68682B8133g9303B9443J28767d6858n8821I8153i7984
15451C38781D807J30234m6801h8046B71182i3875A19729K12734A6623e8026a5900
15439A29033d8698F573b22609h00A24736i5252a3906E0044K29115G9839a51912
15427a57584N4332n047A56224a98873J8281C87174j38058N8054F3059j2830N1306
15416A01535b05198l1041r5809c0942p9515d6782B39501G9887b18629B27755b32518
$$ plain form
15404 -27963 298622 -43493 4711 -53690 -42663 169876 -370126 79393 -54736 -118725 114347
15392 51740 -137691 -78790 -254174 16274 -214715 -105686 125613 -34146 36082 69041 -148783
15380 -481096 376642 12260 76973 150576 -156673 174142 60876 409708 -316344 -475558
15370 -475558 -19313 -27392 60314 49023 -140236 -140321 -123039 130355 -42072 -90891 -114345 -198101
15358 -198101 50992 96106 41362 -147161 112559 50326 216279 49371 -77179 -136414 -196203
15347 -196203 -88273 62960 -172261 -220032 -37232 -216453 300629 -34608 13716 244922 255335
15336 255335 -351224 -67097 -422924 40052 349443 -140381 399092 233217 144869 -219748
15325 148432 1720 102825 77456 52939 -73644 -71661 51992 -127269 -35733 -11039 20577
$$ packed form
15404b7963B98622d3493D711e3690J1027A69876c70126G9393e4736o3989A14347
15392E1740a37691N8901j75384A6274b14715a05686A25613c4146C6082L2959a48783
15380d81096C76642A2260O4713P3603a56673A74142F0876L48832c16344j59214
15370d75558a9313q079F0314j1291a40236q5J7282A30355d2072m8819k3454q3756
15358a98101E0992M5114D1362a47161A12559E0326J65953D9371g7179n9235n9789
15347a96203h8273F2960a72261m7771c7232j79221C00629c4608A3716K31206J0413
15336B55335c51224f7097l55827D0052L09391a40381C99092j65875q8348b19748
15325A48432A720J01105k5369k4517g3644J983E1992a27269c5733a1039B0577
$$ plain form
15313 112069 -53768 -181008 -130777 126197 8141 128859 107937 142159 -215584 -90531 166234
15301 87682 154 -169079 -101851 -221580 396950 -130731 -182017 5858 -44495 720 91723 24226
15288 298106 283058 215081 -22513 123363 -77182 164931 54405 192516 142143 246823 153776
15277 153776 -285071 281888 -80130 70482 -29736 226210 -123499 63542 359592 -196849
15266 414885 127738 62116 -234557 -114193 168525 -13478 144362 339778 38761 134809
15256 134809 205213 30091 -151410 320476 -125514 317427 639671 641527 1476242 992753
15246 992753 1266756 924318 607451 166075 33225 59494 -55929 170190 278158 -151016
15235 -10924 -30951 -36743 -49998 40970 97731 384585 311409 303461 -106856 155207 69978
$$ packed form
15313A12069e3768j27240N0231A26197H141J20718k0922L4222b15584i0531A66234
15301H7682A54a69079O7228j19729C96950a30731n1286E858d4495G20R1003B4226
15288B98106j5048o7977b2513A23363g7182A64931E4405J38111n0373J04680r3047
15277A53776b85071B81888h0130G0482b9736B26210a23499F3542K96050a96849
15266D14885A27738F2116b34557a14193A68525a3478A44362J95416C8761R6048
15256A34809P0404C0091a51410C20476a25514C17427L22244J856Q34715m83489
15246I92753K74003l42438l16867A66075C3225K6269e5929A70190J07968a51016
15235a0924k0027n792j3255D0970N6761K86854p3176p948a06856A55207F9978
$$ plain form
15223 101690 133875 160279 104009 -26898 11285 -209012 -314381 89337 -404217 195815 -132357
15211 249229 79280 217174 212604 128587 160184 -47576 -162938 239388 193563 149963 540380
15200 540380 -33784 208318 315734 85670 91226 -10344 -70922 293613 -42048 63298 60740
15189 60740 53466 88270 130649 204568 127158 252362 98349 -192690 -234881 -72771 142935
15177 -11159 194136 -123567 32265 120645 110071 190395 227739 141639 675195 136664 -67125
15165 -32366 -44592 105961 243516 501047 21554 78091 244228 -11084 80783 142691 72240
15154 72240 -154230 159388 300621 -30584 308425 10366 -76710 380417 265522 -37756
15143 -106559 -85731 103445 -83350 48834 -45665 110808 79556 239696 -274187 339525
$$ packed form
15223A01690L2185K6404n6270b6898A1285b09012j05369H9337d04217A95815a32357
15211B49229G9280J37894m570q4017L1597d7576j15362B39388m5825m3600L90417
15200E40380c3784B08318J07416H5670N556a0344o0578B93613d2048F3298k558
15189F0740p274L4804M2379P3919p7410J25204I8349a92690m2191g2771A42935
15177a1159A94136a23567C2265Q8380j0574Q0324L7344q6100N33556A36664f7125
15165c2366j2226A05961J37555K57531B1554N6537J66137a1084H0783O1908p0451
15154G2240a54230A59388J41233c0584C08425A0366g6710C80417j14895c7756
15143a06559K0828A03445h3350D8834d5665A10808l1252J60140b74187C39525
$$ plain form
15132 78491 103528 280031 207069 -142916 154483 404612 -131589 282856 107829 324168
15122 324168 91300 56172 49019 175661 -52343 167748 -90677 140081 175942 473748 145776
15110 238716 7929 -177972 171709 143332 87194 328010 -70268 375228 647 24553 487883
15099 487883 65211 145527 177221 -121441 419928 344394 -51781 134257 164615 -265473 -40473
15087 432450 -149349 79768 134194 -29014 209003 206397 253026 -2863 215614 285056 51241
15075 78226 415225 108482 213461 294466 157281 349745 119241 322434 165110 -137141
15064 -182789 223950 192864 185812 112587 22940 99887 109532 -199372 290862 155229 184815
15053 184815 -47743 204044 29960 132224 103692 124739 -3712 38809 143194 132144 165463
$$ packed form
15132G8491K5037J76503p2962a42916A54483K50129a31589B82856A07829K16339
15122C24168I1300l5128p153J26642e2343A67748i0677A40081L5861K97806A45776
15110B38716G929a77972A71709k8377n6138K40816g0268C75228F47K3906M63330
15099D87883F5211Q0316L1694a21441D19928p5534e1781A34257L0358b65473d0473
15087D32450a49349G9768N4426b9014B09003k606M6629b863B15614O9442E1241
15075G8226L36999A08482J04979Q1005j37185J92464A19241K03193j57324a37141
15064a82789B23950l1086p052p3225B2940P6947R645a99372B90862j35633K9586
15053A84815d7743B04044B9960J02264k8532K1047c712C8809J04385j1050L3319
$$ plain form
15042 165463 288350 104525 198419 81540 -3923 165191 240872 436958 245574 -1156 -78081
15031 -78081 574723 303524 -21886 -25061 179245 704038 -63832 54351 351512 236902 626141
15020 626141 166827 78886 84181 465470 97465 252272 163694 276266 364720 466780 91582
15008 459058 508847 -36549 -174259 595479 309045 270738 229573 172236 256392 -55722 255208
14996 301241 103389 216811 133960 492750 218723 130566 163001 429567 47782 384382
14986 384382 196595 128158 309841 112844 247174 46913 482246 267448 58505 41236
14976 41236 35869 584167 200322 303816 271642 366079 68977 284184 182099 378057 -70849
14964 193187 262424 453891 123261 327538 365431 230124 399907 678616 352327 269380
$$ packed form
15042A65463J22887A04525R3894H1540c923A65191P5681J96086j91384a156p6925
15031g8081E74723k71199b1886l175A79245N24793f3832E4351K97161j14610L89239
15020F26141A66827G8886N295L81289I7465J54807q8578J12572Q8454J02060I1582
15008D59058M9789c6549j37710E95479k86434l8307m1165n7337Q4156e5722B55208
14996C01241A03389J13422q2851L58790B18723q8157L2435K66566D7782L36600
14986C84382j87787o8437J81683A12844J34330D6913M35333k14798E8505j7269
14976D1236n367N48298B00322J03494l2174R4437F8977K15207j02085J95958g0849
14964A93187O9237J91467A23261K04277L7893j35307J69783K78709l26289q2947
$$ plain form
14954 269380 346339 327574 53815 246407 134117 400881 290209 199370 264779 132697
14944 132697 277974 215031 178537 305194 342594 380670 166441 429030 442890 407118 580898
14933 580898 309188 474980 177969 243786 206232 420633 140990 315978 378663 448466
14923 448466 250301 296263 699855 523403 235927 452314 620961 394891 287739 312147
14913 312147 457174 318090 275836 402389 494037 568322 378728 431004 474738 192357
14902 116657 617630 403425 369432 368289 246034 352550 301389 373814 444996 443569 678284
14891 678284 131597 637410 503052 196179 322050 76139 664814 294305 597412 464981
14881 464981 342111 335813 419569 273327 596601 304739 444236 463144 356975 302139
$$ packed form
14954B69380P6959j8765E3815J92592j12290K66764j10672r0839O5409j32082
14944A32697J45277o2943l6494J26657L7400L8076A66441K62589J3860l5772J73780
14933E80898k71710J65792A77969O5817l7554K14401A40990J74988O2685O9803
14923D48466j98165M5962M03592j76452B35927K16387J68647k26070j07152K4408
14913C12147J45027j39084m2254J26553R1648P4285j89594N2276M3734A92357
14902A16657N00973k14205l3993j143j22255J06516n1161P2425P1182j427K34715
14891F78284A31597N05813j34358A96179J25871G6139N88675B94305L03107j32431
14881D64981j22870o298Q3756j46242L23274k91862J39497J8908j06169n4836
$$ plain form
14871 302139 756052 632477 331877 536571 320113 489829 226273 225375 196492 486892
14861 486892 275412 400272 353062 423774 398751 632725 588726 473418 324624 795328
14851 795328 363721 376317 366560 444026 560226 410838 260172 200597 704095 437557
14841 437557 298975 414837 404270 565989 519809 370719 537326 401323 901530 586383
14831 586383 442692 712272 409682 685523 568084 491671 559460 656676 324546 610706
14821 610706 433262 625661 455222 499726 475843 717388 695343 718435 922938 549697
14811 549697 496202 555681 790743 939243 466125 659467 584321 277381 479628 373475
14801 373475 522840 796321 756689 688509 564871 609049 602500 412575 510182 321333 576847
$$ packed form
14871C02139M53913j23575l00600K04694k16458J69716B26273q98k8883K90400
14861D86892k11480J24860m7210P0712k5023K33974m3999j15308j48794M70704
14851G95328C63721J2596r757P7466J16200j49388j50666n9575N03498k66538
14841D37557j38582J15862j0567J61719m6180j49090J66607j36003N00207l15147
14831E86383j43691K69580l02590K75841j17439p6413O7789R7216C24546K86160
14821F10706j77444J92399j70439M4504k3883K41545k2045K3092K04503l73241
14811E49697n3495N9479K35062J48500D66125J93342p5146B77381K02247j06153
14801C73475J49365K73481l9632o8180j23638M4178o549j89925R7607j88849K55514
$$ plain form
14790 576847 718898 630788 317910 719810 761797 819313 682398 505003 927493 765142
14780 765142 689676 711290 749479 799236 877911 1055592 852891 668254 246452 816723
14770 816723 582457 635375 659661 763900 452601 789230 590225 598615 516316 723917
14760 723917 800427 648859 969115 946168 787688 1101382 614740 587132 680238 890749
14750 890749 659220 760620 767429 722821 696455 708066 939858 749471 782933 796910 441094
14739 441094 875805 804998 939552 1080041 524473 644189 617026 898704 784023 885302
14729 885302 694459 879549 792009 1037404 753662 678654 613656 931702 876343 689460
14719 689460 832301 842345 1043346 935673 752476 1472590 988783 863064 1063972 895258
$$ packed form
14790E76847J42051q8110l12878M01900M1987N7516j36915j77395M22490j62351
14780G65142p5466K1614L8189M9757P8675J77681k02701j84637B46452N70271
14770H16723k34266N2918K4286J04239l11299L36629j99005Q390q2299K07601
14760G23917P6510j51568L20256k2947j58480L13694m86642k7608R3106K10511
14750H90749k31529J01400O809m4608k6366J1611K31792j90387L3462J3977l55816
14739D41094M34711p0807J34554J40489E24473J19716k7163K81678j14681J01279
14729H85302j90843J85090q7540K45395k83742p5008o4998L18046n5359j86883
14719F89460J42841J0044K01001j07673j83197P20114m83807j25719K00908j68714
$$ plain form
14709 895258 914746 742117 732326 759904 1163850 695305 813379 770255 927035 1365327
14699 1365327 886372 1076374 961749 955762 1133516 858918 1017521 764700 836650 870228
14689 870228 867328 1173523 1186687 1159526 753818 986987 921768 1169494 1210327 1056528 1123461
14678 1123461 846894 1186582 1348306 1063444 1021368 1122626 895267 1160600 1074871 1199642
14668 1199642 996210 854470 1170963 819135 1324467 1104008 1243798 1243255 1381989 1475016
14658 1475016 837710 1245150 1233252 1309239 1237088 1278395 1236441 1278810 977017 1568192
14648 1568192 1219318 1519909 1409486 1380269 1036478 1486645 1515610 1320897 1417120 1360340
14638 1360340 1486135 1351151 1594890 1516070 1368192 1690125 1436741 1354424 1399612 1646879
$$ packed form
14709H95258J9488j72629r791K7578M03946m68545J18074m3124J56780M38292
14699A365327m78955J90002j14625n987J77754k74598J58603k52821P1950L3578
14689H70228k900L06195J3164k7161m05708K33169o5219K47726M0833j53799O6933
14678A123461k76567L39688J61724k84862m2076J01258k27359K65333q5729J24771
14668A199642k03432j41740L16493l51828N05332k20459J39790n43J38734R3027
14658A475016o37306M07440j1898P5987p2151M1307m1954M2369l01793N91175
14648A568192l48874L00591j10423k9217l43791M50167K8965j94713R6223n6780
14638A360340J25795j34984K43739p8820j47878L21933k53384q2317M5188K47267
$$ plain form
14628 1646879 1635646 1113243 1544203 1699600 1646975 1825668 1454126 1598893 1519558 1744302
14618 1744302 1375793 1777793 1732556 1722026 1587784 1912646 1647481 1748569 1570514 1877090
14608 1877090 1929750 1490944 1607331 1669960 1665104 1776952 1767234 1946127 1884293 1722570 2135001
14597 2135001 1801446 2055464 1942891 1933397 1966844 1908553 2166738 2200000 1922023 2108610
14587 2108610 1709690 2234955 1961239 2133796 2245585 2033826 2275313 1929718 2206656
14578 2206656 2190582 2176046 2211129 2171501 2502097 2461023 2311215 2601671 2355001 2235721
14568 2235721 2458002 2783628 2581651 2473805 2608963 2721151 2450796 2973136 3161373
14559 3161373 3055064 3486260 3147541 3476438 3475486 3973294 4250028 4894725 5372190 6833935
$$ packed form
14628A646879j1233n22403M30960J55397n2625J78693l71542J44767p9335K24744
14618A744302l68509M02000m5237j0530j34242L24862k65165J01088j78055L06576
14608A877090N2660m38806J16387O2629m856J11848r718J78893o1834j61723M12431
14597B135001l33555K54018j12573r494L3447n8291K58185L3262k77977J86587
14587B108610l98920N25265k73716J72557J11789k11759K41487l45595K76938
14578B206656j6074j4536L5083l9628L30596m1074j49808K90456k46670j19280
14568B235721K22281L25626k01977j07846J35158J12188k70355N22340J88237
14559C161373j06309M31196l38719L28897r52M97808K76734O44697M77465J461745
$$ plain form
14549 6833935 9431355 15080087 24128761 37154631 40925329 21123324 9646690 5679167
14541 5679167 4120139 2914791 3018005 2553531 2345376 2331221 2238137 2468445 2376676 2210801
14531 2210801 2437304 2346239 2589200 2492857 2768866 2569484 2881475 2714292 2515188 3285249
14521 3285249 2671416 2885489 2793867 3022540 2791517 2880485 3060054 3034256 2987458 2852452
14511 2852452 2994027 2928853 3045753 2764868 3211812 3307747 3403501 3190332 3589234 3094482
14501 3094482 3424459 3691421 3777498 3560717 3535578 3748354 3761046 3767894 3609608 3769636
14491 3769636 3976341 3896416 4095317 3995786 3942738 3986881 3887359 4135610 4370166 4165563
14481 4165563 4222494 4400829 4563167 4540500 4419362 4537293 4753824 4332566 4456078 4803729
$$ packed form
14549F833935K597420N648732R048674J3025870L770698j9802005I646690l967523
14541E679167j559028j205348J03214m64474k08155j4155r3084K30308r1769j65875
14531B210801K26503r1065K42961r6343K76009j99382L11991j67183j99104P70061
14521C285249o13833K14073r1622K28673k31023Q8968J79569k5798m6798j35006
14511B852452J41575o5174J16900k80885M46944R5935R5754k13169L98902m94752
14501C094482L29977K66962Q6077k16781k5139K12776J2692O848j58286J60028
14491C769636K06705p9925J98901r9531n3048M4143r9522K48251K34556k04603
14481D165563N6931J78335J62338k2667j21138J17931K16531m21258J23512L47651
$$ plain form
14471 4803729 4680022 5130601 5081805 4869630 5146233 4825558 5269020 4896465 5331121 5200645
14461 5200645 5034235 5232413 5368626 5408884 5595892 5822317 5527956 5794295 5696807 6087051
14451 6087051 5892366 6011056 6140531 5706147 6342830 6351307 6317465 6776439 6260777 6515371
14441 6515371 7029399 6466892 6978318 7010481 7109127 7171980 7214437 7284319 7350446 7375032 7593772
14430 7593772 7660783 7581192 7818718 8112675 8308774 8274244 8269695 8564606 8304152 8628583
14420 8628583 8687431 8641104 9132514 9109789 9063395 9447746 9635052 9444137 9615840 9968879
14410 9968879 10112057 10012561 10707555 10553094 10837965 10925784 11212002 11155203 11040628 11312444
14400 11312444 11627191 12031681 12130172 12369573 12042262 12995413 13018638 13021113 13182972 13428759
$$ packed form
14471D803729j23707M50579m8796k12175K76603l20675M43462l72555M34656j30476
14461E200645j66410J98178J36213M0258J87008K26425k94361K66339r7488L90244
14451F087051j94685J18690J29475m34384O36683Q477l3842M58974n15662K54594
14441F515371N14028n62507N11426L2163R8646O2853M2457O9882O6127K4586K18740
14430G593772O7011p9591K37526K93957J96099l4530m549K94911k60454L24431
14420H628583N8848m6327M91410k2725m6394L84351J87306j90915J71703L53039
14410I968879J43178r9496O94994j54461K84871Q7819K86218n6799j14575K71816
14400A1312444L14747M04490R8491K39401l27311R53151K3225K475J61859K45787
$$ plain form
14390 13428759 14030198 14012507 13898615 14363853 14843424 14891907 15451143 15499628 15631271 16055350
14380 16055350 16298826 16542956 16850654 16857295 17612204 17683153 18018873 18632148 18648874 19194159
14370 19194159 19608232 20118370 20671361 21129022 21118263 21855858 21887609 22531564 23504476 23596621
14360 23596621 24282941 24874640 25045420 25924163 26639370 26975648 27399685 28312673 28937857
14351 28937857 29363285 30566847 30971247 31536328 32386452 33190950 34178735 35329014 35697316
14342 35697316 36935666 37896328 38812737 39766653 41036115 42186188 43310882 44426973
14334 44426973 45861482 47196820 48386486 49940562 51486096 52875117 54377020 56029121
14326 56029121 58164408 60125019 62235515 64198867 66336163 68523552 71004862 73276382
$$ packed form
14390A3428759O01439j7691j13892M65238M79571M8483N59236M8485J31643M24079
14380A6055350K43476K44130L07698O641P54909P0949L35720O13275J6726N45285
14370A9194159M14073N10138N52991M57661j0759P37595L1751O43955R72912R2145
14360B3596621O86320N91699J70780Q78743P15207L36278M24037R12988O25184
14351B8937857M25428J203562M04400N65081Q50124Q04498R87785J150279L68302
14342C5697316J238350R60662R16409R53916J269462J150073J124694J116091
14334D4426973J434509J335338J189666J554076J545534J389021J501903J652101
14326E6029121K135287J960611K110496J963352K137296K187389K481310K271520
$$ plain form
14318 73276382 76071532 79033181 82008317 85010271 88007464 91392245 95060799 98872641
14310 98872641 102956524 106806780 111533144 116276251 121097099 126364033 131737970 137492463
14302 137492463 143657679 150420987 157086849 164354159 171637690 180049269 188689815 197482852
14294 197482852 207140172 217238873 227689915 238586934 250191063 261944026 274662583
14287 274662583 287494656 300967425 314580430 328472855 342567367 356668881 370547435
14280 370547435 384450238 397720083 410005394 421712647 432191418 440847444 447311858
14273 447311858 450168928 449873355 448843352 448913063 449408809 446033810 440526308 434198724
14265 434198724 426328153 418570236 408845598 397932985 385444533 372458727 358348189
$$ packed form
14318G3276382K795150K961649K975136L001954K997193L384781L668554L811842
14310I8872641M083883L850256M726364M743107M820848N266934N373937N754493
14302A37492463O165216O763308O665862P267310P283531Q411579Q640546Q793037
14294A97482852R657320J0098701J0451042J0897019J1604129J1752963J2718557
14287B74662583J2832073J3472769J3613005J3892425J4094512J4101514J3878554
14280C70547435J3902803J3269845J2285311J1707253J0478771Q656026O464414
14273D47311858K857070k95573j030003O9711M95746l374999n507502o327584
14265D34198724p870571p757917r724638j0912613j2488452j2985806j4110538
$$ plain form
14258 358348189 344154694 329656722 315169948 301627686 288085063 274761406 262175999
14251 262175999 249788421 238026908 226859407 216343303 206153905 196525308 187542677
14244 187542677 179214242 170940803 163009195 155794888 148961808 142253979 136620910 130656571
14236 130656571 125446853 119879064 115035010 110240965 105837863 102183745 98003250 94249569
14228 94249569 90678642 87198192 84198535 80866421 78086189 75142701 72559069 70108292
14220 70108292 67975062 65534713 63546458 61358317 59461399 57315914 55836200 54341050
14212 54341050 52695959 50853833 49355127 47897710 46687452 45784467 44453599 42893865
14204 42893865 41761960 40588635 39327099 38854820 37661290 36784470 35379387 34442415
$$ packed form
14258C58348189j4193495j4497972j4486774j3542262j3542623j3323657j2585407
14251B62175999j2387578j1761513j1167501j0516104j0189398r628597q982631
14244A87542677q328435q273439p931608p214307o833080o707829n633069n964339
14236A30656571n209718n567789m844054m794045m403102l654118m180495l753681
14228I4249569l570927l480450k999657l332114k780232k943488k583632k450777
14220G0108292k133230k440349j988255k188141j896918k145485j479714j495150
14212E4341050j645091j842126j498706j457417j210258r02985j330868j559734
14204D2893865j131905j173325j261536m72279j193530q76820j405083r36972
$$ plain form
14196 34442415 33690064 32861919 31941686 31233228 30355228 29797780 29006421 28620615 27653515
14187 27653515 27047482 26330742 25995370 25580788 24695516 24092639 23662640 23198120 22628623
14178 22628623 22272988 21904317 21490782 20839772 20393333 20165553 19543899 19161491 18960506
14169 18960506 18320024 18320244 17724758 17743184 17345156 16853900 16435162 16242963 16084405 15699348
14159 15699348 15613576 15136200 14827791 14691228 14579619 14168013 14229047 13290097 13624269 13441741
14149 13441741 12957884 12747301 12567329 12369449 12338143 11853628 11562050 11649914 11411617 11172352
14139 11172352 11111362 10725515 10687451 10659077 10499213 10218444 10090928 10094341 9757683 9653995
14129 9653995 9689223 9485642 9229687 9287387 8771976 8928585 8801596 8947488 8536785 8524158
$$ packed form
14196C4442415p52351q28145r20233p08458q78000n57448p91359l85806r67100
14187B7653515o06033p16740l35372m14582q85272o02877m29999m64520n69497
14178B2628623l55635l68671m13535o51010m46439k27780o21654l82408k00985
14169A8960506o40482K20n95486J8426l98028m91256m18738j92199j58558l85057
14159A5699348q5772m77376l08409j36563j11609m11606O1034r38950L34172j82528
14149A3441741m83857k10583j79972j97880l1306m84515k91578Q7864k38297k39265
14139A1172352o0990l85847l8064k8374j59864k80769j27516L413l36658j03688
14129I653995L5228k03581k55955N7700n15411J56609j26989J45892m10703j2627
$$ plain form
14119 8524158 8331817 8258229 7938872 8194101 7980179 7912182 7627755 7503932 7370742 7068814
14109 7068814 7406272 7220697 7446974 7085058 7077858 6869654 6979200 6440255 6868307 6472695
14099 6472695 6511700 6645048 6479932 6367339 6109107 5823808 5832751 5932673 5625186 5858273
14089 5858273 5992109 5736605 5376274 5703979 5623952 5354424 5280097 5346977 5366822 5126622
14079 5126622 5048737 5119710 5317483 5201389 5090227 5214187 4808837 4682152 4702452 4859512
14069 4859512 4560582 4705067 4673255 4587086 4413483 4163684 4415458 4520377 4434518 4194116
14059 4194116 4127626 4451457 4726324 4515209 4394058 4107772 3878866 3939411 3938042 3861957
14049 3861957 3718857 3718309 4018448 4001851 3659092 3610666 3562303 3919559 3566899 3435158
$$ packed form
14119H524158j92341p3588l19357K55229k13922o7997k84427j23823j33190l01928
14109G068814L37458j85575K26277l61916p200k08204J09546n38945M28052l95612
14099F472695L9005J33348j65116j12593k58232k85299Q943R9922l07487K33087
14089E858273J33836k55504l60331L27705q0027k69528p4327O6880J9845k40200
14079E126622p7885P0973J97773j16094j11162J23960m05350j26685K0300J57060
14069D859512k98930J44485l1812q6169j73603k49799K51774J04919q5859k40402
14059D194116o6490L23831K74867k11115j21151k86286k28906O0545j369p6085
14049C861957j43100n48L00139j6597l42759m8426m8363L57256l52660j31741
$$ plain form
14039 3435158 3476264 3360229 3530185 3586920 3021161 3129783 3333878 3410035 3492379 3412462
14029 3412462 3460133 3335591 3262499 3061408 3204080 2894571 2672811 2991913 3329002 2994674
14019 2994674 2851644 2635187 2893917 2980988 2488473 2699762 2494862 2649242 2827015 2100841
14009 2100841 2648932 2637088 2623197 2586018 2362680 2214084 2405485 2370123 2154676 2326894
13999 2326894 2434619 2181747 2138590 2324257 2375164 2365659 2536097 2495286 2545625 3342327
13989 3342327 4992627 8977050 17515049 31478840 41371519 25079837 14345381 9583347
13981 9583347 6920054 5642351 4656902 4096791 3631413 3433549 3100662 3094502 2802249
13972 2802249 2941997 2734442 2913891 2986655 2608795 2597313 2375800 2663985 2168530 2324399
$$ packed form
14039C435158M1106j16035J69956N6735n65759J08622K04095P6157Q2344p9917
14029C412462M7671j24542p3092k01091J42672l09509k21760L19102L37089l34328
14019B994674j43030k16457K58730Q7071m92515K11289k04900J54380J77773p26174
14009B100841N48091j1844j3891l7179k23338j48596J91401l5362k15447J72218
13999B326894J07725k52872m3157J85667N0907r505J70438m0811N0339P96702
13989C342327J650300L984423Q537999J3963791R892679j6291682j0734456m762034
13981I583347k663293j277703r85449n60111m65378j97864l32887o160k92253
13972B802249J39748k07555J79449P2764l77860j1482k21513K88185m95455J55869
$$ plain form
13962 2324399 2410300 2242840 2305739 2237387 2579467 2318236 2250098 2257300 2203177 2164786 1976209
13951 1976209 1931678 2044154 2096461 1858519 2176419 1959833 2005616 2135568 1870866 1994065
13941 1994065 1741997 1490011 1864967 2048964 1812240 1866208 1842787 2023027 2037538 2014049
13931 2014049 1593189 1896199 1861703 1403619 1656553 1636754 1913155 1832267 1981243 1701311
13921 1701311 1703161 1430677 1624432 1576753 1737401 1549564 1273314 1586284 1440906 1574245
13911 1574245 1330058 1402755 1438453 1290077 1488045 1641502 1363575 1816839 1289786 1417391
13901 1417391 1281882 1562671 1343295 1296227 1275078 1583839 1728252 1338129 1406812 1341753
13891 1341753 1635718 1393860 1350417 1342884 1499082 1489128 1098751 919179 1213135 1087814
$$ packed form
13962B324399Q5901j67460O2899o8352L42080k61231o8138P202n4123l8391j88577
13951A976209m4531J12476N2307k37942L17900k16586M5783J29952k64702J23199
13941A994065k52068k51986L74956J83997k36724N3968k3421J80240J4511k3489
13931B014049m20860L03010l4496m58084K52934j9799K76401q0888J48976k79932
13921A701311J850k72484J93755m7679J60648j87837k76250L12970j45378J33339
13911A574245k44187P2697L5698j48376J97968J53457k77927M53264n27053J27605
13901A417391j35509K80789k19376m7068k1149L08761J44413l90123O8683o5059
13891A341753K93965k41858m3443p533J56198r954l90377j79572K93956j25321
$$ plain form
13881 1087814 1200402 1546314 1120276 1387806 1281931 1417624 1165584 1111985 1247246 1319268
13871 1319268 1066441 1330460 1211542 1356844 1105571 1080871 1190106 1053424 1250382 1297282
13861 1297282 1209772 964421 1072043 1026503 1300119 942191 1067314 1210772 1317353 1257145
13851 1257145 1166607 1056932 1214910 960622 1176964 1064112 1091066 811409 780609 881168
13841 881168 993960 1251039 1047691 1015880 920710 887439 1171881 988615 1450170 923989
13831 923989 1011593 902954 716644 975318 1166936 1173167 814791 1120798 1132991 1085634
13821 1085634 1059443 1029719 945758 932306 1076454 1140878 831858 819031 1170241 785910
13811 785910 1052694 947919 1025618 780949 686343 794313 968677 445422 759108 598884
$$ packed form
13881A087814J12588L45912m26038K67530j05875J35693k52040n3599J35261P2022
13871A319268k52827K64019j18918J45302k51273k4700J09235j36682J96958M6900
13861A297282q7510k45351J07622m5540K73616l57928J25123J43458J06581o0208
13851A257145r0538j09675J57978k54288K16342j12852K6954k79657l0800J00559
13841H81168J12792K57079k03348l1811r5170l3271K84442j83266M61555n26181
13831I23989Q7604j08639j86310K58674J91618O231l58376L06007J2193m7357
13821A085634k6191k9724q3961j3452J44148O4424l09020j2827L51210l84331
13811G85910K66784j04775P7699k44669r4606J07970J74364D45422L13686j60224
$$ plain form
13801 598884 966161 978537 1099590 668137 894429 839796 941618 607001 716284 761632
13791 761632 822510 812622 521588 927058 619913 1015271 638490 843023 824811 831947 747587
13780 747587 1037712 830530 854033 889510 319712 706087 935014 863384 665211 814654
13770 814654 835101 569690 644010 545868 689223 958949 575836 395971 744440 804607
13760 804607 697590 456360 870609 798302 599361 913655 594171 744766 832293 395874
13749 583644 373919 394544 595945 539725 911234 723720 745752 326144 538039 330240
13739 330240 555354 350994 745635 453286 673173 363887 400240 460824 536583 515284
13729 515284 630386 592008 657276 464409 544469 815570 661249 584064 435724 610364
$$ packed form
13801E98884L67277J2376J21053m31453K26292n4633J01822l34617J09283M5348
13791G61632O0878r888k91034M05470l07145L95358l76781K04533j8212P136q4360
13780G47587K90125k07182K3503L5477C19712L86375K28927p1630j98173J49443
13770H14654K0447k65411P4320r8142J43355K69726l83113j79865L48469O0167
13760H04607j07017k41230M14249p2307j98941L14294l19484J50595Q7527C95874
13749E83644k09725K0625K01401n6220L71509j87514K2032C26144K11895k07799
13739C30240K25114k04360L94641k92349K19887l09286L6353O0584P5759k1299
13729E15284J15102l8378O5268j92867Q0060K71101j54321p7185j48340J74640
$$ plain form
13719 610364 559829 539285 445032 536523 649866 493353 745286 379662 818769 603474
13709 603474 565889 740476 717578 648247 572894 661621 475688 364290 375836 436626 503651
13698 503651 603582 284005 621421 503172 574454 466336 595389 434927 894144 688773
13688 688773 801820 223633 564038 483876 528559 778505 247745 454118 738490 505025
13678 505025 421320 638059 390319 767053 756901 706390 391057 476076 426659 436045 600436
13667 600436 701378 438471 252190 358632 555639 414815 464227 944584 218967 668407
13657 668407 425881 560194 302485 373604 412507 712922 432355 292806 420847 555324
13647 555324 346135 630832 319008 226815 214470 400847 458849 752318 347849 548821
$$ packed form
13719F10364n0535k0544r4253R1491J13343j56513K51933l65624M39107k15295
13709F03474l7585J74587k2898o9331p5353Q8727j85933j11398J1546O0790O7025
13698E03651R9931B84005L37416j18249P1282j08118J29053j60462M59217k05371
13688F88773J13047B23633L40405q0162M4683K49946B47745K06373K84372k33465
13678E05025q3705K16739k47740L76734j0152n0511l15333Q5019m9417R386J64391
13667F00436J00942k62907j86281J06442J97007j40824M9412M80357B18967M49440
13657F68407k42526J34313k57709P1119L8903L00415k80567j39549J28041J34477
13647E55324k09189K84697l11824r2193j2345J86377N8002K93469C47849K00972
$$ plain form
13637 548821 365588 839425 413396 545936 445457 533649 344092 438202 248853 499540
13627 499540 189949 531884 189130 171408 439512 296472 311831 370287 426686 519124
13617 519124 259792 406672 326034 232196 331406 353786 306651 325111 637712 651858 254575
13605 478718 287441 531645 646590 150152 364378 359656 399416 570289 434786 247595
13595 247595 176539 397401 377867 939003 49470 247981 644319 300862 139632 134237
13585 134237 292353 501424 241083 414151 446577 275488 268507 444890 457773 131657
13574 517319 251061 45070 391650 549757 363546 488903 331687 572457 450746 359567
13564 359567 183749 246014 188438 68505 273673 601590 399686 142099 463624 184530
$$ packed form
13637E48821j83233M73837D13396J32540j00479Q8192j89557R4110j89349K50687
13627D99540A89949L41935A89130j7722K68104j43040J5359N8456N6399R2438
13617E19124k59332J46880q0638r3838R9210K2380m7135J8460L12601J4146B54575
13605D78718j91277K44204J14945A50152K14226m722L9760J70873j35503j87191
13595B47595p1056K20862j9534N61136D9470J98511L96338C00862A39632n395
13585A34237J58116K09071B41083J73068L2426j71089o981J76383J2883A31657
13574E17319B51061D5070L46580J58107j86211J25357j57216K40770j21711r1179
13564C59567j75818O2265n7576F8505K05168L27917k01904A42099L21525A84530
$$ plain form
13553 325269 270157 401248 515565 396850 295433 353583 292151 382573 190430 460077
13543 460077 411257 419712 669707 330689 282293 131107 81207 211867 304885 489588 471419
13532 471419 307442 262668 180036 515119 196314 334497 581268 376452 260769 519379
13522 519379 602222 437459 423785 488577 272161 562050 435235 515855 256692 639900
13512 639900 150525 185923 -3492 135055 357546 364977 422240 235739 435382 312240 201844
13501 201844 268846 86156 151412 465481 85852 193357 140460 388870 532051 437318 -215527
13489 233139 216069 354706 322426 108179 78084 358280 97920 233322 251124 54012 545895
13478 545895 288518 508144 313846 267229 197361 -10591 406474 337549 -69280 289397
$$ packed form
13553C25269n5112J31091J14317j18715j01417N8150o1432R0422A90430K69647
13543D60077m8820Q455K49995C30689m8396A31107m9900J30660R3018J84703j8169
13532D71419j63977m4774q2632L35083A96314J38183K46771k04816j15683K58610
13522E19379Q2843j64763j3674O4792k16416K89889j26815Q0620B56692L83208
13512F39900A50525L5398c492A35055K22491P431N7263j86501J99643j23142j10396
13501B01844O7002H6156O5256L14069H5852J07505n2897K48410J43181r4733b15527
13489B33139j7070J38637l2280A08179l0095K80196I7920J35402J7802E4012M91883
13478E45895k57377K19626j94298m6617o9868a0591D06474o8925f9280B89397
$$ plain form
13467 109728 352212 -473 -24064 270862 175141 340252 143361 155525 365802 293811 252091
13456 252091 315220 386539 322617 295449 191549 106153 121035 234118 292480 79284 389637
13445 389637 323763 170910 300751 30423 264202 95084 455418 83558 26441 144267
13435 144267 74611 220544 324986 321789 188540 213903 203053 363636 68346 -85 415063
13423 336455 397301 165432 444708 144881 81620 244813 224840 73429 243058 181207
13413 181207 -252426 87291 299274 237872 -100036 464598 12274 199989 205716 419934
13403 419934 -109917 191560 81002 132147 299157 362562 33874 -195095 225328 415603
13393 415603 278257 284435 -28360 -214843 91135 110211 382221 205631 475225 272056
$$ packed form
13467A09728K42484d73k3591B70862r5721J65111A43361J2164K10277p1991m1720
13456B52091O3129P1319o3922k7168j03900q5396J4882J13083N8362G9284L10353
13445C89637o5874j52853J29841C0423K33779I5084L60334H3558B6441J17826
13435A44267o9656J45933J04442l197j33249K5363j0850J60583F8346h5D15063
13423C36455O0846A65432K79276A44881o3261J63193j9973G3429J69629o1851
13413A81207b52426H7291K11983o1402a00036D64598A2274J87715N727K14218
13403D19934a09917A91560H1002N1145J67010O3405C3874a95095B25328J90275
13393D15603j37346O178b8360j86483I1135J9076K72010j76590K69594k03169
$$ plain form
13383 272056 -63381 413300 187919 -113390 -26142 220684 122950 394189 165394 169478
13373 169478 207745 219923 191270 87507 208331 300168 -192170 340824 257552 114126 414960
13362 414960 323173 318633 286631 108278 114476 674571 464778 689539 367858 311825 164346
13351 164346 314970 231268 298043 109640 535223 534865 490334 225731 251638 354635 509566
13340 509566 271342 -91850 316383 -56797 396701 -15737 107666 515440 282613 437886
13330 437886 -39003 154204 215357 317978 84854 258213 -8117 121499 137826 501395 -35615
13318 633256 124680 32636 359556 164212 150490 89707 365363 248835 67146 12273
13307 211572 263961 402672 168067 285715 354018 17452 122612 87444 677548 196593
$$ packed form
13383B72056f3381D13300A87919a13390b6142B20684r7734K71239A65394M084
13373A69478L8267J2178k8653H7507J20824R1837a92170C40824q3272A14126L00834
13362D14960r1787m540l2002A08278O198N60095k09793K24761l21681n6033j47479
13351A64346J50624q3702O6775A09640M25583l58m4531B25731K5907J02997J54931
13340E09566k38224i1850C16383e6797C96701a5737A07666M07774k32827J55273
13330D37886c9003A54204O1153J02621H4854J73359h117A21499J6327L63569c5615
13318F33256A24680C2636L26920A64212j3722o0783K75656j16528F7146A2273
13307B11572N2389J38711A68067J17648O8303A7452J05160l5168N90104A96593
$$ plain form
13296 521005 403328 283228 -4860 123699 131718 213901 155874 36796 242366 253804 56078
13284 29137 170593 -74218 310628 130722 149373 360683 -66100 252119 208559 484156
13274 484156 141018 292299 153891 142240 -270709 299200 85508 312613 -81424 -227405
13264 -227405 262136 198164 -58130 162711 -161890 28918 118048 234798 37276 222282
13254 222282 -269810 285200 243815 -39689 -7956 72755 411952 192571 261057 -37249 207013
13242 28609 120368 164746 -163262 251944 423574 180237 140415 -113921 -2016 456115 -5259
13230 -219575 -45781 173374 96963 -23618 117463 183074 177555 222589 -83069 147543 312228
13219 312228 -1157 168216 71830 334945 356110 -60617 -234894 -146873 -110472 -222707 21392
$$ packed form
13296E21005j17677j20100d860A23699Q019Q2183n8027C6796K05570J1438E6078
13284B9137J41456g4218C10628A30722J8651K11310f6100B52119m3560K75597
13274D84156A41018J51281j38408j1651b70709B99200H5508K27105h1424j45981
13264b27405B62136o3972e8130A62711a61890B8918Q9130J16750C7276J85006
13254B22282b69810B85200m1385c9689g956G2755L39197A92571O8486c7249B07013
13242B8609R1759M4378a63262B51944J71630A80237l9822a13921b016D56115e259
13230b19575d5781A73374p6411b3618A17463O5611n519M5034h3069A47543J64685
13219C12228a157A68216G1830K63115K1165f0617j74277Q8021L6401j12235B1392
$$ plain form
13207 41426 -300089 192630 154723 149781 169364 358557 141718 348932 260617 228720 -123229
13195 193053 57655 93856 146070 185717 36806 136494 59690 -7994 -196157 24348 199030
13184 199030 328169 -361758 265219 93372 -39585 -82312 4706 89722 314348 85005 28168
13172 196765 70460 -21896 100525 -97141 75322 126096 151143 11595 217348 217617 33771
13160 -44649 641636 99721 140667 -191307 23338 351561 -105975 -4489 190865 2216 139400
13149 139400 264678 -128002 100055 9052 212689 -6186 51785 -261554 79080 -96454 226587
13137 120469 145046 74667 180434 -78170 419645 -254077 6256 -32974 422283 23714 -11751
13125 4243 -62837 -63108 -52885 100917 42468 314139 147518 -102470 -67774 -137567 80159
$$ packed form
13207D1426c00089A92630l7907m942J9583J89193A41718K07214q8315l1897a23229
13195A93053E7655L6201N2214L9647C6806R9688E9690g994j88163B4348J74682
13184A99030J29139c61758B65219I3372c9585m2727D706Q5016K24626H5005B8168
13172A96765G0460b1896A00525i7141G5322N0774K5047A1595K05753K69C3771
13160d4649F41636I9721M0946a91307B3338L28223a05975d489A90865B216J37184
13149A39400J25278a28002A00055I052K03637f186E1785b61554G9080i6454B26587
13137A20469K4577p0379J05767g8170D19645b54077F256c2974D22283B3714a1751
13125D243f2837k71J0223A00917D2468K71671A47518a02470L4696o9793H0159
$$ plain form
13113 148933 38513 161143 379471 25668 198933 32974 123565 -19363 161036 260910 -114640
13101 179437 177183 485814 71787 -243475 259422 -96575 451689 215794 33166 117681 398735
13090 398735 91068 -34549 24019 40105 -77782 -44350 -27288 -114045 160308 155230 134905
13079 134905 113465 213270 24176 527371 554666 -32741 110348 138426 277684 16025 119200
13068 119200 77701 300311 -98994 45373 187064 -84342 82905 -75397 -274817 152993 -189528
13056 -248019 149584 141197 -229282 92067 186980 -11447 186878 102274 140847 -25561 153810
13044 276882 344964 154269 -23891 -100512 165400 119642 306295 43437 7734 -20866 154374
13032 153504 222930 -207489 146766 314074 -36200 114524 -142007 67740 16153 233031
$$ packed form
13113A48933C8513J22630K18328B5668J73265C2974R0591a9363A61036R9874a14640
13101A79437k254L08631G1787b43475B59422i6575D51689B15794C3166Q4515K81054
13090C98735I1068c4549B4019J6086g7782L3432J7062q6757A60308n078k0325
13079A34905k1440R9805B4176N03195K7295c2741A10348K8078J39258A6025J03175
13068A19200m1499K22610i8994D5373J41691h4342H2905g5397j99420A52993a89528
13056b48019A49584q387b29282I2067R4913a1447A86878q4604L8573b5561A53810
13044B76882O8082A54269b3891p6621A65400m5758J86653D3437G734b0866A54374
13032A53504O9426b07489A46766J67308c6200A14524a42007F7740A6153K16878
$$ plain form
13022 233031 295075 156320 278130 67046 205615 100102 -221432 545481 286359 2289
13011 -10686 198481 5611 -36215 -191966 -31225 279995 -94637 29597 -27861 -102853 212578
12999 95903 -133047 116769 -209039 385884 80446 309728 24312 429901 29344 166481
12989 166481 209782 354275 214859 186651 15181 -132724 372861 251915 41463 23433
12979 23433 -192042 -234454 -30185 64214 -134443 -56556 65749 200991 436632 -70755 21051
12967 -4478 144222 59218 100677 301086 65420 235512 -188 -193675 -57700 -55387 100774
12955 243279 -21165 227298 79472 304 -80056 -108756 248846 76565 209729 -260232 54443
12943 -161501 99723 51667 111112 143234 11318 -134819 172574 -39264 -35801 -432202 106492
$$ packed form
13022B33031O2044j38755J21810F7046J38569A00102b21432E45481k59122B289
13011a0686A98481E611c6215j55751c1225B79995i4637B9597b7861p4992B12578
12999I5903a33047A16769b09039C85884H0446K29282B4312M05589B9344J37137
12989A66481M3301J44493j39416k8208A5181a32724C72861j20946D1463j8030
12979B3433a92042m2412c0185F4214a34443e6556F5749J35242K35641g0755B1051
12967d478A44222E9218M1459K00409F5420J70092a88j93487e7700K313A00774
12955B43279b1165B27298G9472C04h0056k8700B48846G6565J33164b60232E4443
12943a61501I9723m8056N9445L2122A1318a34819A72574c9264L463l96401A06492
$$ plain form
12931 -86000 -73971 83818 147010 -185670 88238 -110696 -116242 -31064 377556 223047 145547
12920 145547 -9431 99160 282706 -75571 198083 45550 93686 191484 267746 -207226 32589
12908 -100840 32773 70070 10516 -106935 276653 76815 -107500 228654 70336 84881 -85298
12896 -42289 -253751 250444 -569686 -330853 30290 -64821 128770 -336259 223357 -14205
12885 -163168 -190001 -72822 -78452 -92722 -205412 99205 -34564 -484976 -123904 -119915 -60561
12874 -60561 92517 163381 -105266 164182 11226 63101 -43661 60251 -104538 197408 125711
12863 125711 -177669 121401 -174354 244101 379466 28594 148679 -240330 276026 133612
12852 95609 64462 241940 80903 -182637 -76966 -32421 -159075 66080 297593 -94262 -20058
$$ packed form
12931h6000J2029H3818O3192a85670H8238a10696n546c1064C77556j54509p7500
12920A45547i431I9160J83546g5571A98083D5550M8136R7798P6262b07226C2589
12908a00840C2773L7297A0516a06935B76653G6815a07500B28654G0336J4545h5298
12896d2289k11462B50444e69686K38833C0290f4821A28770c36259B23357a4205
12885a63168k6833g2822n630j4270j12690I9205c4564m50412a23904L989N9354
12874f0561I2517P0864a05266A64182A1226N1875d3661F0251a04538A97408p1697
12863A25711a77669A21401a74354B44101J35365B8594J20085b40330B76026A33612
12852I5609l1147J77478H0903a82637g6966c2421j26654F6080K31513i4262b0058
$$ plain form
12840 187329 -125964 91478 240942 60045 55439 -129439 399255 -138921 131 53962 29291
12829 29291 -241444 -17478 222202 96177 156657 61223 -91117 35138 257570 177876 -224918
12817 72874 -27622 -21843 167891 85629 -129089 76334 107344 -367756 48169 -59002 6177
12805 248359 144352 -203906 -248390 37713 -100614 6253 46320 222795 290437 -145341 41614
12793 96064 78411 122814 -37877 45171 31458 66503 51834 -206163 -214975 12910 122318
12782 122318 -69601 112537 5892 -233622 -327669 -154161 -1265 56392 236219 85480 -158793
12770 267619 41014 -66335 24324 -13359 -95660 -306277 103823 209116 -481028 368323
12759 9547 3740 49707 -88488 -84778 -82419 104127 441 15518 260547 147556 -68741 -103891
$$ packed form
12840A87329a25964I1478J49464F0045m606a29439C99255a38921A31N3831k4671
12829B9291b41444a7478B22202I6177O0480F1223i1117C5138K22432p9694b24918
12817G2874b7622N779A67891q2262a29089G6334L1010c67756D8169e9002F177
12805B48359j04007b03906m4484C7713a00614F253M0067J76475O7642a45341D1614
12793I6064j7653M4403c7877D5171j3713L5045j4669b06163q812A2910J09408
12782A22318f9601A12537E892b33622r4047a54161a265E6392J79827H5480a58793
12770B67619D1014f6335B4324a3359q2301k10617A03823J05293d81028C68323
12759I547C740M5967h8488L710K359A04127D41J5077K45029j12991f8741l5150
$$ plain form
12747 -103891 -207041 273255 -191179 -108968 12929 162247 172160 -67172 197792 285494 171661
12736 171661 -44036 62378 110316 45101 -282728 420161 170438 24823 198497 261746 123980
12724 -75262 -215436 9651 25995 37383 188158 197975 325926 76593 178038 138135 151573
12713 151573 47590 291063 153276 194590 109087 105204 92465 157091 -8551 172009 514836
12702 514836 -44711 -155581 337098 102593 156105 242860 -243912 -146472 531401 106080
12691 -39523 28486 -217051 179805 89966 224097 -584558 157930 77862 -38378 -45695 -150930
12680 -150930 469421 232715 -182204 176210 337218 229228 147987 -10843 144188 352890
12670 352890 -115437 195551 -132124 -89027 106944 107136 -16722 287465 298271 -9945 -71189
$$ packed form
12747a03891j03150B73255a91179Q2211A2929J49318R913f7172A97792Q7702j13833
12736A71661d4036F2378M7938D5101b82728D20161A70438B4823J73674O3249A23980
12724g5262j40174I651J6344J1388J50775R817J27951G6593J01445l9903J3438
12713A51573D7590K43473j37787M1314q5503l883j2739O4626h551A72009L42827
12702E14836d4711j10870C37098A02593N3512Q6755b43912R7440E31401A06080
12691c9523B8486b17051A79805q9839J34131e84558A57930G7862c8378p317j05235
12680a50930D69421B32715a82204A76210J61008j07990q1241a0843A44188K08702
12670C52890a15437A95551a32124M3097A06944J92a6722B87465J0806i945o1244
$$ plain form
12659 -71189 -211640 65942 10380 191174 -36709 56410 83643 96114 126895 272993 -53934
12647 -308309 -58236 16535 54727 281442 161097 -416742 -68102 194406 176051 84716 40215
12635 -39454 133861 -67200 198832 -52809 240916 -385435 261479 -65497 240 194967 345588
12624 345588 -66954 -131403 221891 207712 218529 21561 125994 225520 4603 12545 -40064
12612 -95656 105985 -27611 36858 -91637 153375 -113328 -19863 -52853 -39328 133152 -99713
12600 338413 -186035 110115 523294 82733 393938 33232 1204 277902 176716 -112862
12589 118109 278214 -146723 -206885 260360 -214078 -70383 -163626 -11510 -249851 303853
12578 43889 7388 55476 117816 -233064 85321 -67533 -227642 -72277 191365 -84221 70977
$$ packed form
12659g1189j40451F5942A0380J80794c6709E6410K7233J2471L0781J46098e3934
12647c08309e8236A6535L8192K26715j20345d16742f8102A94406j8355H4716D0215
12635c9454A33861f7200A98832e2809B40916c85435B61479f5497B40J94727J50621
12624C45588f6954o4449B21891j4179J0817B1561J04433R9526D603P942d0064
12612i5656A05985b7611C6858i1637A53375a13328a9863l2990J3525A33152i9713
12600C38413a86035A10115M13179H2733L11205C3232A204K76698j01186a12862
12589A18109J60105a46723o0162B60360b14078g0383r3243a1510k38341C03853
12578D3889G388M8088O2340b33064H5321f7533j60109g2277A91365h4221G0977
$$ plain form
12566 -140476 142786 66124 -63803 -64089 -98395 -93176 228963 -60530 -150870 149650 -155025
12554 18154 151540 216692 273551 -2009 -4798 -164036 -62080 317642 10146 -30750 29202
12542 14471 -282846 -188650 -118616 -93755 2591 405894 217371 -224444 -240479 55293 282566
12531 282566 -61328 -412961 249678 171300 -120084 113988 37312 -88762 78237 -159084
12520 109856 -85968 41861 394031 16095 114992 93454 -255035 -280941 -58222 -75020 -105539
12509 -105539 -10459 -112107 -178421 -65043 -96921 -98253 93726 291977 -101278 254419 -98752
12497 220093 62958 317639 -60574 -76012 300567 300532 237642 200064 -31360 228257 21843
12485 -33813 -4612 -264471 182064 -226286 -313314 148715 412222 69113 -113540 -132030 108150
$$ packed form
12566a40476A42786F6124f3803k86l4306N219B28963f0530r0340A49650a55025
12554A8154J33386O5152N6859b009k789j59238f2080C17642A0146c0750B9202
12542A4471b82846R4196P0034K4861B591M03303j88523b24444j6035E5293K27273
12531B82566f1328l51633B49678p8378a20084A13988C7312h8762G8237a59084
12520A09856h5968D1861L52170A6095R8897k1538b55035k5906e8222j6798l0519
12509a05539a0459j01648o6314f5043l1878j332I3726J98251a01278B54419i8752
12497B20093F2958K54681f0574j5438C00567l5o2890l7578c1360B28257B1843
12485c3813d612k59859A82064b26286q7028A48715K63507F9113a13540j8490A08150
$$ plain form
12473 176640 -19889 -33588 131724 -42446 -248749 160782 2818 -179372 -391181 -344524 -15571
12461 -241588 2558 -314336 81233 -261396 -88263 240003 -232552 -230596 132463 -267864 81063
12449 -162717 -19557 169446 -458 172743 194906 155107 10835 -14345 31699 -18243 -142884
12438 -142884 133814 318317 274340 288140 -69314 71072 63154 -45815 -468453 172711 -96296
12426 -21739 14916 23422 -217699 70807 113651 135987 -46967 236725 320924 257755 234599
12415 234599 -134048 66718 128659 -207868 228654 11188 -147363 75512 -248241 -75492
12404 431428 106310 194615 -216010 -70244 368657 -241591 52300 -93164 182247 -38407
12393 80574 -135959 -208167 -22386 213373 105282 77130 213796 -489958 207872 -361935
$$ packed form
12473A76640a9889j3699A31724d2446k06303A60782B818a79372k11809M6657a5571
12461b41588B558c14336H1233b61396h8263B40003b32552J956A32463b67864H1063
12449a62717a9557A69446d58A72743K2163l9799A0835a4345C1699a8243j24641
12438a42884A33814J84503m3977J3800f9314G1072p918d5815m22638A72711i6296
12426b1739A4916Q506b17699G0807M2844K2336d6967B36725Q4199o3169k3156
12415B34599a34048F6718O1941b07868B28654A1188a47363G5512b48241g5492
12404D31428A06310Q8305b16010g0244C68657b41591E2300i3164A82247c8407
12393H0574a35959p2208b2386B13373A05282k8152J36666d89958B07872c61935
$$ plain form
12382 -143339 435196 27648 98364 -445605 -296744 -268849 135425 44249 -15474 82826 254130
12371 254130 77499 36462 6604 -176082 56792 67797 7930 380337 -71514 -12798 -95478
12360 -95478 76708 312687 -139521 75073 -18757 124814 148622 307267 -118264 -29898 19545
12348 -446146 258015 -73621 294085 -220889 -216613 10126 166025 194716 -69866 -130615 -100573
12337 -100573 275860 260541 118260 -120893 -304520 -20291 -111837 76839 17306 -36700 4792
12325 94574 -173526 192461 -175761 -244115 154502 12481 41675 -76008 -102649 -254785 17617
12313 48786 -228152 -61920 -66438 47648 -92564 8743 -246556 -17294 22976 -98431 31717 -416326
12300 -98712 30083 -32240 -11011 130111 -25027 -269727 -162852 32833 151186 104624 -79989
$$ packed form
12382a43339D35196B7648P0716d45605J48861K7895A35425D4249a5474H2826J71304
12371B54130G7499C6462F604a76082E6792J1005G930L72407g1514a2798q2680
12360i5478G6708K35979a39521G5073a8757A24814K3808J58645a18264b9898A9545
12348d46146B58015g3621B94085b20889M276A0126J55899K8691f9866o0749L0042
12337a00573B75860j5319A18260a20893j83627b0291r1546G6839A7306c6700D792
12325I4574a73526A92461a75761o8354A54502A2481K9194g6008k6641j52136A7617
12313D8786b28152f1920m518D7648i2564H743b46556a7294B2976i8431C1717d16326
12300i8712C0083c2240a1011A30111b5027k44700J06875C2833J18353m6562g9989
$$ plain form
12288 208059 317792 153506 213169 -185192 10681 -85837 -55572 98850 70487 152129 217040
12277 217040 111627 92931 97494 264747 95062 41493 210477 -150962 178948 328861
12267 328861 -70724 121880 -90410 -191772 -88780 196110 8171 168110 138929 151964 1385
12255 144905 105580 -197999 25832 -163703 -183602 399686 75848 69561 -221598 261198 -12560
12243 249234 995 61066 47742 -127769 90874 -141720 163052 383962 13234 -24436 452625
12231 152120 -22426 161979 42329 151684 46344 240555 128169 -40032 322286 189811
12221 189811 178489 373587 431176 135077 221381 20252 539903 -61012 323365 221450
12211 221450 97125 104463 -57183 241877 153684 186004 63959 92854 209411 337470 263224
$$ packed form
12288B08059J09733A53506N9663a85192A0681h5837L0265I8850k8363Q1642O4911
12277B17040j05413j8696M563J67253I5062D1493J68984a50962A78948J49913
12267C28861g0724A21880i0410j01362h8780A96110H171J59939k9181J3035A385
12255A44905l9325a97999B5832a63703j9899C99686G5848o287b21598B61198a2560
12243B49234I95O0071j3324a27769I0874a41720A63052K20910A3234b4436D52625
12231A52120b2426A61979D2329J09355D6344J94211j12386d0032C22286j32475
12221A89811j1322J95098N7589A35077Q6304B0252N19651f1012C23365j01915
12211B21450I7125P338e7183B41877q8193L2320F3959K8895J16557J28059p4246
$$ plain form
12200 263224 14291 -107963 34300 118598 -15818 292876 162126 294370 -12216 341251
12189 130241 277341 138657 159336 134667 215782 -115515 111154 85882 -94933 239713
12178 266832 208039 -136062 -100848 327891 -176776 447690 -5507 219424 -46335 -40352 173992
12166 202297 -101574 -37583 345983 102174 38571 -9076 134317 -59855 35576 128745 -274
12154 112680 -129405 42419 59581 234482 -136817 112588 69583 424976 -313528 55474
12143 -140306 -299970 -56602 -93829 85887 -68928 -145963 -137250 -185331 182725 270447 -232150
12131 -285058 -30360 -102530 -1025 248315 16146 338939 -179216 -347826 -226022 80487 51676
12120 51676 14844 -21800 19107 12118 342570 -84537 253604 98137 -70079 -342144 -65009
$$ packed form
12200B63224A4291a07963C4300Q4298a5818B92876j30750J32244a2216C41251
12189A30241J47100A38657K0679k4669Q1115a15515A11154k5272i4933B39713
12178B66832n8793a36062L5214C27891a76776D47690e507B19424d6335N983A73992
12166B02297a01574c7583C45983A02174C8571i076A34317e9855C5576R3169b74
12154A12680a29405D2419J7162J74901a36817A12588m3005L55393c13528E5474
12143a40306j59664e6602l7227H5887f8928p7035Q713m8081A82725Q7722b32150
12131b85058c0360p2170a025B48315A6146L22793a79216j68610J21804H0487k8811
12120E1676A4844b1800A9107o989L30452h4537B53604I8137g0079k72065f5009
$$ plain form
12108 -210641 262688 -243521 -58286 -69281 136928 396441 -77875 117063 -136451 -5296
12097 -80364 -26418 62461 182396 232482 274081 -377522 -267230 -99659 -404071 -28289 -63528
12086 -63528 -86369 -268610 -242210 -42413 173261 -275579 -148245 -63769 101334 17838 -150499
12074 -152798 78178 648226 144266 578697 1156156 1250501 452305 287596 103703 49181
12063 -263819 64361 -312370 394114 -75945 108464 -48513 181489 75449 126210 141235 187843
12052 187843 -43724 -275280 -183101 174849 -271936 11875 31392 146060 106260 98874 62523
12041 62523 -340126 178728 -180603 168507 41612 -158824 -16092 78229 104796 229997
12031 229997 -75815 -21605 -310368 80053 -66865 -306191 7168 164989 -107343 8844 60125
$$ packed form
12108b10641B62688b43521e8286j0995A36928K59513g7875A17063a36451e296
12097h0364b6418F2461J19935N0086M1599c77522J10292i9659l04412b8289l5239
12086f3528k2841j82241K6400d2413A73261b75579J27334f3769A01334A7838a50499
12074a52798G8178N70048A44266M34431N77459R4345D52305j64709A03703D9181
12063b63819F4361c12370C94114g5945A08464d8513A81489G5449N0761J5025M6608
12052A87843d3724k31556R2179A74849b71936A1875J9517J14668l9800p386l6351
12041F2523c40126A78728a80603A68507D1612a58824a6092G8229K6567J25201
12031B29997g5815b1605k88763H0053f6865k39326G168J57821a07343H844N1281
$$ plain form
12020 60125 186122 210652 -99566 -36800 199878 -75668 177410 295930 -197750 132333
12009 -175017 157586 164058 113850 -202667 -103454 84598 38760 -175895 -92225 354320 285285
11998 285285 -256492 -273304 -292355 -2524 192183 27073 44296 160382 35673 135325 -194253
11986 43794 -115036 184387 -221697 94090 -171597 -93387 -241442 9439 170381 93607 204707
11975 204707 62366 180153 73946 -107 -245753 -154157 -59058 -291666 -150591 -249255 -85187
11963 367924 -342009 18804 -117666 243983 242841 71836 -100981 -102228 56147 140378 -21487
11951 -41898 17233 228572 -198476 144570 201334 45650 66549 -124025 -160733 202529 -49695
11939 57603 380868 -260217 -249818 74672 188155 25121 -74480 -91906 109298 70944 -163261
$$ packed form
12020F0125J25997K4530i9566c6800A99878g5668A77410J18520a97750A32333
12009a75017A57586O472n0208b02667R9213H4598C8760a75895Q3670C54320o9035
11998B85285b56492j6812j9051b524A92183B7073J7223J16086C5673R9652a94253
11986D3794a15036A84387b21697I4090a71597P8210j48055I439J60942p6774J11100
11975B04707F2366J17787G3946a07k45646R1596e9058k32608J41075r8664h5187
11963C67924c42009A8804a17666B43983j142G1836a00981j247E6147Q4231b1487
11951d1898A7233K11339a98476A44570N6764D5650K0899a24025l6708B02529d9695
11939E7603L23265b60217J0399G4672J13483B5121g4480j7426A09298l8354a63261
$$ plain form
11927 -11602 -74814 -117693 226451 -86299 4340 -13132 -45262 -186426 -148031 -157482 102299
11915 -185854 121456 -10820 -28963 87725 -129453 195749 -295660 -169948 -106849 -240668
11905 -240668 343451 -224790 19527 -269779 35122 233045 -243959 124450 64594 -328559
11894 131928 283829 -178269 -25983 -25946 -174539 15468 -102632 -238148 63983 -137009 289120
11882 5185 -62965 27731 37925 -326672 226335 145267 398061 -169162 -103739 -13009 -6039
11870 62994 -96609 -273394 131639 77222 -413526 -8076 -133221 -111243 -11174 -131070 72844
11858 218841 -83465 -177525 -66541 -60479 237216 -185859 -210781 -135719 -101976 -8858 -421377
11847 -421377 -181954 405544 -290362 -421203 -116091 -81196 -278053 -136484 -148416 29673
$$ packed form
11927a1602o3212m2879B26451h6299D340a3132l2130j41164L8395r451A02299
11915a85854A21456a0820j8143H7725a29453A95749b95660J25712O3099j33819
11905b40668C43451b24790A9527b69779C5122J97923b43959A24450n9856c28559
11894A31928J51901a78269b5983L7j48593A5468a02632j35516F3983a37009B89120
11882E185f2965B7731J0194c26672B26335q1068K52794a69162O5423a3009f039
11870F2994i6609j76785A31639n4417d13526h076j25145K1978a1174j19896G2844
11858B18841h3465r4060f6541O062B37216a85859k4922P5062L3743h858m12519
11847d21377a81954D05544b90362j30841a16091L4895j96857a36484j1932B9673
$$ plain form
11836 -175359 279849 -175514 290523 -249918 76656 31413 -34192 104423 -346090 200410
11825 -241005 -10140 180 -267128 -352948 44867 -86814 168412 275657 -51785 274405 91339
11813 100833 11072 102331 -354254 145596 -249217 -46826 -61169 -16454 225277 -301761
11802 132433 -202889 -103491 -183249 -27344 -152996 -37770 -104298 -146137 -211920 132503 88570
11791 88570 -109982 -260437 129431 277088 -1856 -203816 -3385 -33818 -12299 88416 -60569
11779 203249 -6105 145592 158298 -42373 -43668 124470 286803 75754 -311400 -128776 349162
11767 -232644 -46276 69219 -148588 -238476 -17720 -74302 -195315 -112511 -35600 -235044 59341
11755 160924 -10653 37256 -150013 -15306 -32411 76124 -184714 -33708 171287 -361741 -8143
$$ packed form
11836a75359B79849a75514B90523b49918G6656C1413c4192A04423c46090B00410
11825b41005a0140A80b67128q5820D4867h6814A68412J07245e1785B74405I1339
11813A00833A1072R1259c54254A45596b49217d6826j4343a6454B25277c01761
11802A32433b02889R9398p9758b7344j25652c7770o6528m1839o5783A32503m3933
11791H8570a09982j50455A29431J47657a856k01960c385l0433a2299H8416f0569
11779B03249f105A45592J2706d2373j295A24470J62333G5754c11400a28776C49162
11767b32644d6276F9219a48588q9888a7720n6582j21013Q2804c5600j99444E9341
11755A60924a0653C7256a50013a5306j7105G6124a84714c3708A71287c61741h143
$$ plain form
11743 -70957 12720 144028 142173 -140727 68411 -110226 -406845 93955 -85505 37649 -147508
11731 -27653 -255091 -309531 -100665 153896 -164879 -393458 11066 -39150 -42941 -610101 -190871
11719 -185669 180875 65529 174130 -47194 38006 44676 139544 173908 -71656 139915 81447
11708 81447 71048 -110355 81449 -54892 -29300 -44822 -198215 184636 -26997 374981 -278484
11696 22218 344057 177850 -57648 39213 -109323 128416 -231915 186344 -251279 213407
11685 302378 262269 397433 -62410 528837 418411 125872 -83394 -2763 143053 -55944 177555
11673 111515 280158 118865 -204619 78578 -47403 244650 -58557 120828 113046 3600 62327
11662 62327 97671 -157194 -126028 -232886 -87370 135622 -307779 -96921 -74973 -26560 -46958
$$ packed form
11743g0957A2720J31308j855a40727F8411a10226k96619I3955h5505C7649a47508
11731b7653k27438n4440a00665A53896a64879k28579A1066c9150l791n67160a90871
11719a85669A80875F5529J08601d7194C8006O670R4868L4364g1656A39915n8468
11708H1447j0399a10355H1449e4892K5592j5522j53393A84636b6997C74981b78484
11696B2218L21839j66207e7648C9213a09323A28416b31915A86344b51279B13407
11685C02378m0109J35164f2410E28837j10426A25872h3394b763A43053e5944A77555
11673A11515J68643A18865b04619G8578d7403B44650e8557A20828p782C600N8727
11662F2327L5344a57194L1166j06858h7370A35622c07779i6921K1948b6560k0398
$$ plain form
11651 -46958 -223634 9221 -2412 86280 -33540 92719 206919 53608 -34503 11770 -106501
11639 -50159 97655 111038 113443 91200 23873 -87116 200339 59791 -131756 -158518 244680
11627 -334552 53414 -225297 231294 79082 72961 360468 272937 -24231 -164349 42552 -21830
11615 124422 -166369 -227563 -18030 -66942 -77511 124951 -77106 40227 228333 110859 163073
11604 163073 -803 261323 105202 197932 -68213 281541 296067 22188 188941 -11576 61565
11592 -24703 437195 287582 163152 159771 244595 270122 25905 56914 145960 64932 58174
11581 58174 202873 -97496 106960 -244954 -139361 -212567 78109 22291 63743 83711 -146064
11569 -129112 86550 -194577 -142901 64988 209185 -144961 66078 165579 -147205 438418
$$ packed form
11651d6958j76676I221b412H6280c3540I2719J14200E3608c4503A1770a06501
11639e0159I7655J3383K405k2243B3873h7116B00339E9791a31756k6762B44680
11627c34552E3414b25297B31294G9082o121K87507q7531b4231j40118D2552b1830
11615A24422a66369o1194a8030m8912j0569A24951g7106D0227J88106A10859N2214
11604A63073h03B61323A05202R2730f8213B81541J4526B2188J66753a1576F1565
11592b4703D37195j49613j24430l381Q4824K5527B5905L1009Q9046F4932o758
11581E8174J44699i7496A06960b44954J05593p3206G8109B2291M1452J9968a46064
11569a29112H6550a94577N1676F4988J44197a44961F6078R9501a47205D38418
$$ plain form
11558 -171035 315075 -98067 51022 30902 -136382 384210 3058 390486 -69409 184732 -170097
11546 226995 177676 81386 367971 142243 31816 222169 -6162 -89844 -127459 -216968 145465
11534 -123569 183010 155370 226704 159996 8234 173803 111039 -98796 123686 116929 276901
11523 276901 251047 108331 -99002 32140 195267 -12639 121759 194782 -167558 37774 -65506
11511 406496 -190213 282706 288720 422461 86559 227723 4866 295447 142609 202988 333824
11500 333824 347809 198372 29807 -98480 37836 251077 112660 -15874 91276 -181922 -104267
11489 -104267 189691 115554 -2952 163527 412954 12235 293220 42530 184425 -107125
11478 139524 86515 582782 247161 182776 22444 136433 303942 -180415 158379 -197464
$$ packed form
11558a71035C15075i8067E1022k0120a36382C84210C058L87428f9409A84732a70097
11546B26995m9319H1386K86585A42243C1816J90353f162q3682l7615q9509A45465
11534a23569A83010k7640P1334o6708H234J65569o2764i8796A23686o757J59972
11523B76901k5854A08331i9002C2140J63127a2639A21759P3023a67558C7774f5506
11511D06496a90213B82706O014J33741H6559J41164D866K90581A42609O0379J30836
11500C33824J3985j49437B9807i8480C7836K13241A12660a5874I1276a81922P7655
11489a04267A89691p4137b952A63527K49427A2235K80985D2530J41895a07125
11478A39524n3009M96267B47161o4385B2444J13989J67509a80415A58379a97464
$$ plain form
11467 -234934 158863 404858 55588 97838 89214 -176882 67400 127283 55340 -15497 234286
11455 188979 -240338 198239 42727 -126132 -198266 185707 -163852 269083 179680 -114886
11444 -354653 103564 326450 140665 -100951 24759 192701 253280 197093 104676 409562
11434 409562 -187125 100551 -54148 66709 321729 18978 152431 138264 -60986 -143847 -16040
11422 35993 431821 -249256 -160554 99103 -237259 38523 142982 -89447 -92327 -154 133170
11410 -96457 14426 -268664 162611 220974 -183996 -18193 374941 64092 144640 356933 5905
11398 421236 138299 -32523 44023 -177690 -423497 172602 -24612 -131610 2623 -145870
11387 167503 8748 417435 -124829 14287 -13059 -196230 319550 172063 2796 -214573 -316029
$$ packed form
11467b34934A58863K45995E5588M2250q624a76882F7400N9883E5340a5497B34286
11455A88979b40338A98239D2727a26132p2134A85707a63852B69083q9403a14886
11444c54653A03564K22886A40665a00951B4759J67942O0579n6187r2417L04886
11434D09562a87125A00551e4148F6709K55020A8978J33453j4167f0986q2861a6040
11422C5993L95828b49256Q8702I9103b37259C8523J04459h9447k880a54A33170
11410i6457A4426b68664A62611N8363a83996a8193C74941F4092Q0548K12293E905
11398D21236A38299c2523D4023a77690k45807A72602b4612j06998B623a45870
11387A67503H748M08687a24829A4287a3059j83171C19550j47487B796b14573j01456
$$ plain form
11376 -316029 37295 208800 -3759 -185463 101088 -62935 108258 255621 -19943 -287076
11366 -287076 -22293 -32284 -183849 103536 -58066 -172174 526213 285662 -210041 23939
11355 -45684 93881 -129335 2528 79790 -310818 -112000 144738 -200092 436752 161194
11344 -160384 -11126 26909 -78239 -108166 71597 -116640 -126266 -164309 -9708 -2434 -571 113606
11331 -87419 -43214 -112958 -232418 -77234 67667 -181138 -300072 62355 -85922 247251 182069
11320 182069 77548 196513 95485 3654 -170741 -265519 252397 -213132 59849 -235016 -420727
11309 -420727 35628 29988 41405 -84249 40791 -277850 171890 226882 123712 -239417 956
11297 -16514 143933 155232 -134292 55041 80022 208526 -49660 194555 45921 224334 -164956
$$ packed form
11376c16029C7295J71505c759j81704A01088f2935A08258J47363a9943k67133
11366b87076b2293r991j51565A03536e8066j14108E26213k40551b10041B3939
11355d5684I3881a29335B528P7262c10818a12000A44738b00092D36752A61194
11344a60384a1126B6909g8239k9927G1597a16640r626l8043i708b434e71A13606
11331h7419d3214o9744j19460g7234F7667a81138j18934F2355h5922B47251o5182
11320A82069G7548J18965I5485C654a70741r4778B52397b13132E9849b35016j85711
11309d20727C5628n640J1417h4249D0791b77850A71890N4992j03170b39417I56
11297a6514A43933J1299a34292E5041K4981J28504d9660A94555D5921J78413a64956
$$ plain form
11285 -158549 186675 123380 118376 111110 -214414 -207989 248960 -215858 -79606 145970 64542
11273 -146366 119227 7470 2358 -321441 -106126 83312 157447 63129 -244810 -3800 -20276
11262 -20276 -155816 -123123 1350 -65590 -213009 -286534 -293574 78727 134767 -20768 51530 224311
11250 224311 -371803 -3990 -211881 -104639 97018 -216824 170821 -98927 181934 -1064 -47514
11239 -47514 -196319 81757 -49812 20774 126950 10123 -145715 -211819 20312 -25400 -168787
11228 -168787 23849 -108817 -200851 -66886 -18478 -68176 -211404 34228 -50970 115529 -47473
11216 -123769 -320545 -361425 -112611 13708 114004 -302226 -26976 422621 -42504 -50626 -21634
11204 -11804 -333107 -241643 -369011 126446 -243513 -93823 53742 -81405 -416640 -218232
$$ packed form
11285a58549A86675o3295n004p266b14414O425B48960b15858g9606A45970F4542
11273a46366A19227G470B358c21441a06126H3312P4135F3129b44810c800j6476
11262b0276j35540L2693A350f5590j47419p3525p040G8727N6040b0768E1530J72781
11250B24311c71803c990k07891a04639I7018b16824A70821i8927A81934a064m6450
11239d7514j48805H1757d9812B0774J06176A0123a45715o6104B0312b5400j43387
11228a68787B3849a08817r2034f6886a8478m9698j43228C4228e0970A15529d7473
11216a23769j96776m0880a12611A3708J00296c02226b6976D22621d2504q122b1634
11204a1804l21303R1464j27368A26446b43513i3823E3742h1405l35235J98408
$$ plain form
11194 -218232 -105059 148933 -291 -214270 -126696 47058 41073 -98247 -142991 148869 -194324
11182 18719 -189243 -151989 -145605 -127588 -193005 -144248 -214926 -118473 -19578 1774 -37833 180817
11169 65972 -50651 -103412 -282370 51981 105462 -152101 232685 139735 -327867 -174436 167024
11157 -48476 365903 139939 71422 9299 -166794 286706 -116414 -115679 286943 4568 -43521
11145 -84655 -23452 -27457 134382 -201434 287778 246228 97790 33096 -151378 26035 -136680
11133 -6928 55612 -419775 -56465 183498 29488 296041 -44801 230993 -87784 -61349 96949
11121 24539 -472689 33795 -32910 -118807 -43574 129536 417240 308260 -212227 -259665 389716
11109 -43887 201505 -73676 182825 241268 -56666 -4614 120927 -15967 117444 218417 485020
$$ packed form
11194b18232a05059A48933b91k13979Q7574D7058n985i8247m4744A48869a94324
11182A8719a89243L7254O384J8017o5417M8757p0678R6453a9578A774c7833A80817
11169F5972e0651n2761j78958E1981N3481a52101B32685r2950c27867J53431A67024
11157d8476C65903A39939o8517I299a66794B86706a16414P35B86943D568d3521
11145h4655b3452m005A34382b01434B87778m1550I7790C3096a51378B6035a36680
11133f928E5612d19775e6465A83498B9488K66553d4801B30993h7784K6435I6949
11121B4539d72689C3795c2910q5897d3574A29536K87704j08980b12227m7438C89716
11109d3887B01505g3676A82825N8443e6666d614A20927a5967A17444J00973K66603
$$ plain form
11098 485020 285314 553208 -65497 175663 -36712 309462 57374 240119 194969 266063
11088 266063 357897 250349 36090 221881 260208 169578 243654 -12883 290353 354867 187457
11077 187457 499260 265537 -13478 237265 293079 376319 125535 497709 521312 483354
11067 483354 350239 296692 67982 306991 626073 589001 552203 738361 453143 660563
11057 660563 376614 367961 531438 511876 705371 839930 860157 734637 497306 666965
11047 666965 488912 604941 790393 440247 861461 648858 768618 523097 724645 693139
11037 693139 708323 714707 811997 557000 433609 521053 702777 730164 841666 723518 564715
11026 564715 676207 611806 737264 765176 760557 695389 804034 649557 454823 653349
$$ packed form
11098D85020j99706K67894f5497A75663c6712C09462E7374J82745m5150P1094
11088B66063R1834j07548C6090J85791L8327r0630P4076a2883B90353O4514j67410
11077A87457L11803k33723a3478B37265N5814Q3240A25535L72174K3603l7958
11067D83354j33115n3547F7982K39009L19082l7072l6798J86158k85218K07420
11057F60563k83949q653J63477j9562J93495J34559K0227j25520k37331J69659
11047F66965j78053J16029J85452l50146M21214k12603J19760k45521K01548l1506
11037F93139J5184O384R7290k54997j23391Q7444J81724K7387J11502j18148j58803
11026E64715J11492o4401J25458K7912m619o5168J08645j54477j94734J98526
$$ plain form
11016 653349 861139 775907 583627 900150 562323 746749 287030 916704 718315 910530
11006 910530 418619 558995 574587 743633 484479 617151 410555 418386 384593 628358
10996 628358 625745 849950 670701 826040 777507 540318 767064 604986 552111 689273
10986 689273 733973 775469 927325 978073 822563 1068820 1609703 1264631 1448122 1561081
10976 1561081 1986090 2150531 2184905 2836833 2651155 2741564 2383680 2687853 2277879 2323444
10966 2323444 1931340 1949661 1668704 1668249 2068374 1911492 1866396 1673749 2106494 1884625
10956 1884625 1652852 1995227 1894272 1535209 1068847 718430 736308 777059 625155 405014
10946 405014 368487 340316 407341 594715 109528 422233 38797 496723 381954 -52281
$$ packed form
11016F53349K07790q5232j92280L16523l37827J84426B87030O29674j98389J92215
11006I10530D18619J40376J5592J69046k59154J32672k06596P831l3793K43765
10996F28358k613K24205j79249J55339m8533k37189K26746j62078n2875J37162
10986F89273M4700M1496J51856N0748j55510K46257N40883l45072J83491J12959
10976A561081M25009J64441L4374O51928j85678R0409l57884L04173m09974M5565
10966B323444l92104J8321k80957m55M00125j56882m5096j92647M32745k21869
10956A884625k31773L42375j00955l59063m66362l50417J7878M0751j51904k20141
10946D05014l6527k8171O7025J87374A09528L12705C8797M57926j14769e2281
$$ plain form
10935 -38930 333115 278908 -20294 301068 46216 166098 -70756 191036 -146039 237747
10924 -214326 -5997 -182749 19118 39612 380481 217282 104784 -240514 129333 167253
10914 167253 -139609 123996 -276290 -235174 -128970 -22138 283559 -178976 -55919 -24825
10903 -259818 11762 32681 -160348 -283137 31328 296311 -92730 -139151 -143017 -285928 -4487
10891 115483 -259843 -67086 -28056 106827 180622 19813 -240894 -300085 269774 -118965
10880 -118220 -68203 6784 -178480 -46021 -82337 89974 -39193 79161 -154698 71821 149464
10869 149464 -194913 -326939 -323047 -80056 27657 -199718 76946 -334201 -71632 34279 -67329
10857 -106237 191512 -202642 -231144 -356306 -117243 255255 63074 -117165 -194398 172282
$$ packed form
10935c8930C33115n4207b0294C01068D6216J19882g0756A91036a46039B37747
10924b14326e997j76752A9118K0494L40869j63199A04784b40514A29333L7920
10914A67253a39609A23996b76290M1116J06204b2138B83559a78976e5919b4825
10903b59818A1762K0919a60348j22789C1328K64983i2730m6421l866j42911d487
10891A15483b59843f7086b8056A06827P3795A9813b40894n9191B69774a18965
10880a18220N0017F784a78480d6021l6316H9974c9193G9161a54698G1821P7643
10869A49464a94913j32026L892h0056B7657a99718G6946c34201g1632C4279f7329
10857a06237A91512b02642k8502j25162a17243B55255F3074a17165p7233A72282
$$ plain form
10846 -66461 -64234 -10523 297525 -16911 -125878 307810 135613 345967 -248593 -106512
10835 91593 -289005 -33433 -204587 77748 -297602 18464 -192636 -33744 -75485 -134022 -204568
10824 -204568 -340222 60938 -188174 -21073 -168658 50445 -115306 -269103 -100793 75427
10813 -531864 -55058 288470 -79594 -241347 -80741 -39236 -228301 -23383 -123655 -41368 173950
10801 118877 -264487 -148681 -181242 91663 23585 -20764 -247008 -262109 111048 -106941
10790 13352 394615 70274 -27884 -133580 416051 -377249 26663 177166 317438 236876
10780 236876 -87675 11696 -264789 -198540 -211733 102064 -5661 128711 72501 -14770 -2324
10768 -205064 67003 -60537 8326 -152703 -176137 -98648 -121253 -402389 -347079 -161684 -120326
$$ packed form
10846f6461K227a0523B97525a6911j08967C07810A35613K10354b48593a06512
10835I1593b89005c3433j71154G7748b97602A8464a92636c3744m1741n8537p0546
10824b04568j35654F0938a88174b1073j47585E0445a15306j53797a00793G5427
10813e31864e5058B88470g9594j61753h0741c9236j89065b3383j00272d1368A73950
10801A18877b64487J15806l2561I1663B3585b0764k26244j5101A11048a06941
10790A3352L81263G0274b7884j05696D16051c77249B6663J50503J40272q0562
10780B36876h7675A1696b64789O6249j3193A02064e661A28711n6210a4770b324
10768b05064F7003f0537H326a52703k3434P7489k2605k81136N5310a61684M1358
$$ plain form
10757 -120326 -42222 169769 -4251 -185970 -34041 -97679 119108 -95281 70197 24884 104657
10746 104657 -48298 -214733 173815 -52720 87599 160055 -237723 -28082 -251655 -70698 -28928
10734 18451 -442897 91832 -195755 -49474 -138420 -247978 58555 21873 -60462 220842 -56241
10722 -12466 -144968 42134 257006 -3257 -31087 306051 19601 169550 -27157 -17406 -71218
10711 -71218 -168597 69163 -19207 130506 -39656 185625 46522 98153 -274989 161341 24053
10699 -337370 -105789 112922 -246593 130932 123953 -71127 -163717 -151293 -60198 -279688 67577
10687 -268658 -72003 -52512 -128339 -71039 -98009 236621 -65387 -22333 -115936 -284124 49929
10675 -135738 -310000 -164464 -59919 -293364 -53138 10099 5172 72293 -81669 -121170 -293085
$$ packed form
10757a20326d2222A69769d251j81719c4041o3638A19108i5281G0197B4884P9773
10746A04657d8298j66435A73815e2720H7599P2456b37723b8082k23573g0698b8928
10734A8451d42897I1832a95755d9474q8946j09558E8555B1873f0462B20842e6241
10722a2466j32502D2134K14872c257k7830C06051A9601J49949b7157R751n3812
10711g1218r7379F9163a9207A30506c9656A85625D6522N1631b74989A61341B4053
10699c37370a05789A12922b46593A30932o979g1127r2590J2424f0198k19490F7577
10687b68658g2003J9491p5827N7300k6970B36621f5387b2333r3603j68188D9929
10675a35738j74262J45536e9919k33445e3138A0099m927O7121h1669l9501j71915
$$ plain form
10664 -293085 -292644 -216464 -199822 -110943 -130489 124910 47973 -267487 -94581 -104745 -135903
10653 -135903 -26390 -223583 -56989 -137641 116034 -114417 -200280 -302384 -219616 -9192 24690
10641 -13742 -57213 -219760 -122779 -208730 233213 85512 207879 90013 -77340 -114353 -345923
10630 -345923 -197820 10391 -107825 -49869 -390991 -834 -108187 -79562 -12599 -246913 -221597
10619 -221597 -13837 13169 -123410 -11939 -54900 159157 -19684 175533 -300428 219171
10608 -84887 -95689 57207 -107960 -220138 292338 136540 -156532 -192415 117235 208367
10598 208367 -100810 39372 144967 -204664 -392975 227791 146578 -173599 39492 -325968
10587 66586 16400 -231521 91878 -28567 57385 141535 -8834 -337253 -230309 -17445 -72852
$$ packed form
10664b93085M41P6180J6642Q8879j9546A24910D7973b67487i4581j0164l1158
10653a35903b6390j97193e6989q0652A16034a14417q5863j02104Q2768i192B4690
10641a3742m3471j62547R6981q5951B33213H5512J22367I0013g7340l7013k31570
10630c45923J48103A0391a07825d9869l41122h34j07353K8625a2599k34314K5316
10619b21597a3837A3169a23410a1939m2961A59157a9684A75533c00428B19171
10608h4887j0802E7207a07960j12178B92338A36540a56532l5883A17235R1132
10598B08367a00810C9372J05595b04664j88311B27791q1213a73599C9492c25968
10587F6586A6400b31521I1878b8567E7385Q4150h834l28419J06944a7445n5407
$$ plain form
10576 -72852 -102715 -106510 -40908 106455 229172 64806 -272869 136929 -78715 -54166 -15298
10564 -90353 -310309 -22873 -225631 241318 119376 -210808 182236 -70827 -256054 -176265
10554 -176265 -13315 -266089 -241800 74096 -692 284693 -224971 221133 29070 -237829 -64399
10542 45412 -314853 68817 -140161 54858 -15635 -286399 -137588 -107333 -124507 49636 -114576
10530 -100234 -27253 259648 -88080 439656 -33328 98260 59577 85090 27187 92207 -157106
10518 -267633 -95234 -10854 -422839 -103753 147927 67850 -134112 26789 -205340 179184
10507 290582 -91292 -264888 -372123 98832 85598 -228073 -156867 -52326 -86224 -161677 100984
10495 -22084 -117609 -319769 54802 46014 -214501 27831 48253 233333 155438 101958 260732
$$ packed form
10576g2852k9863l795d0908A06455J22717F4806b72869A36929g8715K4549a5298
10564i0353k19956b2873k02758B41318A19376b10808A82236g0827j85227P9789
10554a76265a3315k52774K4289G4096f92B84693b24971B21133B9070b37829f4399
10542D5412c14853F8817a40161E4858a5635k70764a37588L0255j7174D9636a14576
10530a00234b7253B59648h8080D39656c3328I8260l8683K5513B7187O5020a57106
10518b67633i5234a0854m11985a03753A47927F7850a34112B6789b05340A79184
10507B90582i1292j73596j07235I8832j3234b28073P1206e2326l3898p5453A00984
10495b2084r5525k02160E4802q788b14501B7831K0422J85080p7895n3480J58774
$$ plain form
10484 260732 165722 270135 644597 161478 585291 275523 140151 207961 408225 173170
10473 478488 -95928 -291769 482538 -191754 49390 161612 -43334 -255190 -383568 128325
10462 -17245 -243980 17951 -7090 -63724 -153029 38393 -92757 -136924 71347 177676 202947
10451 202947 -31805 -77244 -122158 -177413 30996 -169386 -135609 -275284 -275016 -230096 -90324
10439 -154516 -156841 -110957 32533 -8799 66796 -244850 -250894 -401707 -352835 29618 -177506
10427 -3855 179402 224144 268375 -124246 -29840 234772 -82084 124608 -60502 -113557 217034
10415 -15692 3414 -409938 -313635 114756 234392 -104122 158336 -248085 -132500 9109 -135173
10403 278365 -269747 200369 42992 -159607 -144014 198461 257871 28515 182774 55821
$$ packed form
10484B60732r5010J04413L74462A61478M23813B75523j35372O7810K00264A73170
10473D78488i5928j95841D82538a91754D9390J12222d3334k11856j28378A28325
10462a7245k26735A7951g090n6634q9305C8393i2757m4167G1347J06329K5271
10451B02947c1805m5439m4914n5255C0996a69386L3777j39675K68M4920i0324
10439a54516k325M5884C2533h799F6796b44850o044j50813M8872B9618a77506
10427c855A79402M4742M4231a24246b9840B34772h2084A24608f0502n3055B17034
10415a5692C414d09938R6303A14756J19636a04122A58336b48085J15585I109a35173
10403B78365b69747B00369D2992a59607J5593A98461N9410B8515J54259E5821
$$ plain form
10392 293859 319658 279771 -103119 179709 187271 199021 -69688 84599 102110 162835 -45457
10380 195609 453915 18737 268212 -88413 151366 53025 394551 488461 388637 420214 348690
10369 348690 462816 250480 671351 552935 520712 410050 411325 193602 73717 381287
10359 381287 97401 487044 316056 417102 466385 143954 78272 323548 372457 716520
10349 716520 295759 337222 70108 193658 423801 399273 585341 726529 51253 202731
10339 202731 454394 112348 96909 258164 5452 148372 -163252 -42316 88624 170405 48609
10327 -33246 335109 99236 63424 341247 324023 45140 171457 258162 -12239 296098 85956
10315 537934 284639 374150 161384 -152206 100748 228944 -88309 -213070 -233545 22970
$$ packed form
10392B93859K5799l9887a03119A79709P562J1750f9688H4599J7511O0725d5457
10380A95609K58306A8737K49475h8413A51366E3025L41526R3910r9824L1577p1524
10369C48690J14126k12336M20871j18416l2223j10662J275A93602G3717L07570
10359C81287I7401L89643j70988J01046M9283A43954o5682K45276M8909L44063
10349G16520B95759M1463G0108J23550K30143k4528J86068J41188E1253J51478
10339B02731K51663A12348j5439J61255E452J42920a63252d2316H8624Q1781D8609
10327c3246C35109I9236l5812K77823j7224D5140J26317Q6705a2239B96098H5956
10315E37934k53295Q9511A61384a52206A00748J28196h8309j24761k0475B2970
$$ plain form
10304 -104835 28376 309536 -100952 -194586 -19078 -128449 -51861 240197 94622 -18109 101733
10292 121681 -170328 -52776 -65025 47535 -83772 295611 -106170 -49304 -51156 -76719 -189680
10281 -189680 -263934 -1143 -108302 175300 -227743 16748 122029 96693 -84808 -27961 -3371
10269 134379 200143 -65293 161720 -208115 -203465 21146 -24761 263253 303913 289167 -1399
10257 420696 197497 316843 126683 385011 207214 240488 -17611 213993 59321 265984
10247 265984 217237 36631 -83553 68138 -78942 39300 88534 33345 150877 -130712 2371
10235 -148318 244585 -187687 -148232 -67829 50151 -38601 -37922 -197653 -161164 -66152 -3010
10223 -98215 295733 -147067 -11557 -289080 51382 230431 -212756 -56534 -191683 -269586
$$ packed form
10304a04835B8376K81160a00952r3634a9078j09371e1861B40197I4622a8109A01733
10292A21681a70328e2776j2249D7535h3772B95611a06170d9304j852k5563j12961
10281a89680p4254a143j07159A75300b27743A6748J05281k5336h4808b7961c371
10269A34379O5764f5293A61720b08115M650B1146b4761B63253M0660j4746a399
10257D20696A97497J19346A26683K58328j77797L3274a7611B13993E9321K06663
10247B65984m8747C6631h3553F8138g8942C9300M9234C3345J17532a30712B371
10235a48318B44585a87687L9455f7829E0151c8601O79j59731L6489f6152c010
10223i8215B95733a47067a1557k77523E1382J79049b12756e6534j35149p7903
$$ plain form
10213 -269586 -194888 -158775 58088 -62900 -22266 -263421 -84957 -266546 291268 -344218 -92762
10201 -141440 -268246 -134538 302447 -198476 72562 445956 -374578 -174098 -51942 62904
10190 -190691 -101443 -59268 -582026 50947 5107 -17265 -160603 -41062 199709 -679664 -69108
10178 203767 -124339 -23365 12737 49100 -184537 -26008 -89234 -287968 85338 -481794 -99219
10166 -35255 44706 -173448 -133404 169980 79603 91047 -415976 -131493 -143428 94174 -211854
10154 -34841 -140704 -211223 -57298 -52141 -21094 112955 56237 89087 -88506 21965 -64303
10142 -87704 78598 51214 -101039 -348234 222303 -175135 271796 -460351 -312201 -266205
10132 -266205 -48122 -120209 -89681 179339 50259 149494 -65662 -95987 2112 408672 -66112
$$ packed form
10213b69586P4698L6113E8088f2900b2266k41155h4957j81589B91268c44218i2762
10201a41440j26806J33708C02447a98476G2562L73394c74578a74098e1942F2904
10190a90691Q9248M2175n22758E0947E107a7265j43338d1062A99709f79664f9108
10178B03767a24339b3365A2737L6363a84537b6008o3226j98734H5338d81794i9219
10166c5255D4706a73448M0044A69980G9603J1444d15976a31493j1935I4174b11854
10154c4841j05863p0519e7298N157b1094A12955E6237L2850h8506B1965f4303
10142h7704G8598k7384a01039k47195B22303a75135B71796d60351J48150M5996
10132b66205d8122p2087L0528A79339E0259R9235f5662l0325B112M06560f6112
$$ plain form
10120 235114 -231999 40996 205922 -46373 -344015 -111780 -208208 383664 -132723 -29996
10109 -254522 -425016 -183811 -4340 61562 121994 -258384 -62494 -95710 -15987 30486 -111889
10097 -93104 226158 227901 165301 -224997 164825 83978 -122412 136591 -84492 -124278 -46603
10085 35243 -135928 -487069 -348859 -154048 -121174 -220239 69615 -151599 216294 -101839
10074 -85082 19870 -42682 37363 -2695 -140883 -450658 14447 -74957 -198741 108090 -441927
10062 71514 -105592 -212140 14643 -58028 141541 205389 -371875 72929 6073 225875 -156414
10050 -75536 -67984 -78295 -73396 65755 93935 24224 51429 99593 181738 106556 -236495 -213115
10038 -213115 -289195 -9240 264906 -116750 -66530 -5113 -159507 -211321 171355 23871 -279191
$$ packed form
10120B35114b31999D0996J64926d6373k97642a11780r6428C83664a32723b9996
10109b54522j70494a83811d340F1562O0432b58384f2494l3216a5987C0486a11889
10097i3104B26158J743o2600b24997A64825q0847a22412A36591h4492l9786d6603
10085C5243a35928l51141J38210a54048L2874r9065F9615a51599B16294a01839
10074h5082A9870d2682C7363b695j38188l09775A4447g4957j23784A08090d41927
10062G1514a05592j06548A4643e8028A41541O3848c71875G2929F073K19802a56414
10050g5536P552j0311M899F5755K8180B4224K7205M8164Q2145p5182b36495K3380
10038b13115p6080i240B64906a16750N0220e113j54394n1814A71355B3871b79191
$$ plain form
10026 -211592 190457 -59046 -2156 -212464 100626 114929 -193153 -126629 89606 -89384 -36775
10014 -364590 -101058 270200 -370857 -115682 -332913 -450764 -1814 -220873 26371 99008
10004 99008 -131983 -11651 -5070 220269 -80856 -25022 45127 56040 -60006 -98154 -4198 155665
9991 -155846 187071 82716 -188544 47759 -349486 -244492 -114302 40042 -397202 60790
9980 -128320 -19589 -11947 -125293 95374 15594 -339297 102749 -82925 -26392 10373 136201
9969 136201 226843 -175416 -85239 -364376 -13898 -271020 117102 13 282303 37023 -133654
9957 -223694 -31044 237186 261024 -300122 -80724 -182522 -111457 -142231 -264731 -231792 -18887
9945 42552 -2232 -200796 -87087 -101707 -252166 106074 -131269 37816 -183613 -11642 -104637
$$ packed form
10026b11592A90457e9046b156k10308A00626J4303a93153O6524H9606h9384c6775
10014c64590a01058B70200c70857a15682k17231j17851a814k19059B6371P2637
10004I9008a31983a1651e070B20269h0856b5022D5127J0913f0006l8148d198A55665
9991a55846A87071H2716a88544D7759c49486J04994a14302D0042c97202F0790
9980a28320a9589P642j13346I5374A5594c39297A02749h2925b6392A0373J25828
9969A36201R0642a75416h5239k79137a3898k57122A17102A3K82290C7023a33654
9957b23694c1044B37186K3838c00122h0724j01798P1065l0774j22500L2939a8887
9945D2552b232j98564h7087j4620j50459A06074a31269C7816a83613a1642r2995
$$ plain form
9934 -104637 -177718 -134101 -208935 -111533 -386050 150011 -94065 326840 214077 -37715 18445
9922 -439338 216469 19161 -163540 -121935 -194316 178695 26248 65033 -6333 82211 -97366
9910 -34783 -116027 -80093 45662 23142 -148479 200201 -185252 6878 -19111 92568 -273281
9898 79567 26606 -122695 -129922 27568 -100117 82463 -489270 -356 81482 103450 24567 -185118
9885 -320237 -48599 -233021 -37354 65494 12503 207067 -199927 -196279 231452 -19608 254053
9873 2512 247842 126242 -627 174379 -345020 43663 -124444 165486 78155 1597 -219863
9861 215414 -130528 68205 -308599 56296 206858 -9843 17097 -243125 -332022 129686 -177677
9849 16914 -119917 -481411 -66218 -145426 353636 54332 -264043 -54804 -5954 -140594 -457195
$$ packed form
9934a04637p3081M3617p4834R7402k74517A50011i4065C26840j12763c7715A8445
9922d39338B16469A9161a63540M1605p2381A78695B6248L8785f333H2211i7366
9910c4783q1244L5934D5662k2520a48479B00201a85252F878a9111I2568b73281
9898G9567B6606a22695p227B7568a00117H2463d89270c56H1482K1968B4567a85118
9885c20237d8599j84422c7354F5494A2503J94564a99927L648B31452a9608B54053
9873B512K45330j21600f27A74379c45020D3663a24444A65486G8155A597b19863
9861B15414a30528F8205c08599E6296J50562i843A7097b43125q8897A29686a77677
9849A6914a19917l61494f6218p9208C53636E4332b64043e4804e954j34640l16601
$$ plain form
9838 -457195 -3753 -190212 12459 26018 -273780 -73177 -185972 -49234 -398989 -135221 148018
9826 362656 -273393 -342590 -170379 180656 109420 -63815 91504 -64854 127072 -70445 88181
9814 -68823 -260803 57097 -133032 -57569 -132966 31017 -364404 -12554 -77957 -82765 6364 217121
9802 217121 29758 160586 -99759 -41032 35990 110757 -213326 -6865 38732 52029 -295913
9790 -248891 217936 -77867 105231 -200348 -42554 -100031 65703 34278 -201224 -104179 151289
9778 -98055 -189918 -70920 -285363 -212547 -159010 -153152 -207918 166891 -94219 -93531 38600 -57841
9765 1928 -190825 -348332 -249044 -36400 364488 15353 -91813 -158083 -48777 -93001 -200674
9754 -200674 -101054 -152170 -85236 -124514 24029 -24545 -17570 196036 225315 -177787 67070
$$ packed form
9838d57195c753j86459A2459J3559b73780g3177j12795d9234l49755a35221A48018
9826C62656b73393o9197a70379A80656p1236f3815I1504f4854A27072g0445H8181
9814f8823j91980E7097a33032e7569p5397C1017c64404a2554o5403m808F364K10757
9802B17121B9758J30828i9759d1032C5990P4767b13326f865C8732J3297b95913
9790b48891B17936g7867A05231b00348d2554n7477F5703l1425b01224R7045A51289
9778i8055r1863g0920k14443P2816N3537N858n4766A66891i4219O88C8600e7841
9765A928a90825j57507R9288c6400C64488A5353i1813o6270d8777m4224j07673
9754b00674R9620n1116O6934l9278B4029b4545O975A96036K9279a77787F7070
$$ plain form
9742 -197698 13712 -225639 -133605 27847 -99948 112205 198601 19339 3835 72430 -149096
9730 -27060 -207017 -272070 95860 -181673 151273 -88756 84609 -126026 45937 6490 153572
9719 153572 -94213 -281309 -45835 112385 -287071 -65224 281546 206403 94232 139485 -63942
9707 -185673 -237714 -195193 -163122 -119196 -217968 -244556 67838 25097 126102 -58220 -31959
9696 -31959 -216409 -120716 -51757 -111382 76932 -189833 -286841 -288069 106719 85139 -72805
9684 -110680 224084 -185578 135947 17696 -222768 35056 -52178 92713 129801 -84233 -296938
9673 -296938 324661 -88655 -43821 -63328 168537 5912 -175119 -120664 13339 -106287 -2118
9661 -240318 -87130 18142 52891 345406 -170325 -290378 -137192 261320 -69434 -2654 -253865
$$ packed form
9742a97698A3712b25639R2034B7847i9948A12205Q6396A9339C835O8595a49096
9730b7060j79957o5053I5860a81673A51273h8756H4609a26026D5937F490J47082
9719A53572i4213j87096d5835A12385b87071f5224B81546p5143I4232M5253f3942
9707a85673n2041M2521L2071M3926r8772k6588F7838B5097J01005e8220K6261
9696c1959j84450R5693e1757n9625G6932a89833r7008j228A06719k1580g2805
9684a10680B24084a85578A35947A7696b22768C5056e2178I2713L7088h4233k12705
9673b96938C24661h8655d3821j9507A68537E912a75119N4455A3339a06287b118
9661b40318h7130A8142L4749K92515a70325j20053a37192B61320f9434b654k51211
$$ plain form
9650 -253865 -218652 110856 141513 -255146 57327 -82865 -209683 30262 59569 96602 -169321
9638 139419 -96913 -308827 -270309 -268869 282583 225760 -304325 70308 -278678 -176982 -230336
9627 -230336 -243245 166449 -193790 66419 -66446 24453 -436756 -8138 -46343 -193063 -113928
9616 -113928 -44659 36156 332202 -225827 70825 -259736 -73463 73740 179001 -427056 -14193
9604 -35640 -416288 -156354 -9436 -167608 -148494 -19441 -316446 -188082 144976 99760 -168515
9592 216968 -102016 -279102 5487 -88466 -65783 -140832 -213113 -279823 14971 56534 122827
9581 122827 171076 42928 -82482 212729 -140080 31394 132459 -35 167385 -195124 192075
9569 -17938 283674 98392 3591 -240245 -265247 -46912 336117 -16396 -267906 -48058 -154996
$$ packed form
9650b53865L5213A10856L0657b55146E7327h2865j26818C0262K9307L7033a69321
9638A39419i6913k11914L8518J440B82583n6823c04325G0308b78678J01696n3354
9627b30336j2909A66449a93790F6419f6446B4453d36756h138l8205j46720P9135
9616a13928d4659C6156K96046b25827G0825b59736g3463G3740J05261d27056a4193
9604c5640l80648a56354i436j58172J9114a9441k97005J28364A44976m5216a68515
9592B16968a02016j77086E487h8466K2683p5049p2281o6710A4971M1563O6293
9581A22827M8249D2928h2482B12729a40080C1394J01065c5A67385a95124A92075
9569a7938B83674I8392C591b40245k5002d6912C36117a6396k51510d8058j06938
$$ plain form
9558 -154996 -3265 102545 -129205 -354227 -123320 -180317 28336 45104 -56726 125555 -8075
9546 87647 -92789 -119066 -219406 -142689 -231360 -125278 -163858 -8355 169020 51812 -102871
9534 -92401 92304 -8644 203192 -50437 -64678 53587 63298 -114865 -234496 -124995 81672
9522 -102561 -38310 97521 158817 2962 77187 -396214 -229739 -127690 18036 26922 155480
9511 155480 369853 140184 -115340 62324 -36421 -70356 -156124 -16528 -96235 -106957 -305897
9500 -305897 202620 224449 -212262 418192 52683 117237 -191476 33583 -91653 -22765 194115
9488 -177384 -131636 -178765 -114895 -154139 11623 -368820 -166 -225292 -213173 22592 53156 35638
9476 35638 50400 143857 -123268 -160438 5268 59001 -102209 -101947 -144786 -226040 45467 52944
$$ packed form
9558a54996c265A02545a29205k25022a23320n6997B8336J6768e6726A25555h075
9546H7647i2789k6277j00340P6717q8671J06082l8580h355A69020E1812a02871
9534i2401I2304h644B03192e0437j4241E3587R711a14865j19631J09501H1672
9522a02561c8310I7521O1296B962P4225c96214J66475J02049A8036Q886J28558
9511A55480K14373A40184a15340F2324c6421l3935q5768a6528p9707j0722j98940
9500c05897B02620K1829b12262D18192E2683O4554a91476C3583i1653b2765A94115
9488a77384M5748m7129O3870l9244A1623c68820a66k25126J2119B2592L0564j7518
9476C5638J4762R3457a23268l7170E268N3733a02209K62m2839q1254D5467P477
$$ plain form
9464 52944 -239803 -117067 11516 -16541 -126808 -44102 -154977 -55923 -51408 -113660 -33845
9452 -387764 -27334 -326725 -262706 -33203 -197077 353426 -444599 -290590 -225828 -53474 -58237
9441 -58237 22416 81609 63662 -136491 208880 -131412 -154302 127557 311969 -61573 35795
9429 38296 -224552 -106623 12100 -33505 45771 -32791 191498 -308575 -82704 61965 95418
9418 95418 -206422 179443 -217653 -82613 -228140 175024 75581 -256620 -24929 106136
9407 -191687 49191 51534 -156765 -99149 -213721 -316073 -82588 64789 4533 -88932 217687
9395 -365925 288317 -59280 98076 74625 -142848 40016 -367150 -119550 -11982 66544 -338435
9383 -306806 -94884 -417826 -195892 -133440 164785 -224349 -147340 16934 35823 20306 248777
$$ packed form
9464E2944b39803a17067A1516a6541j10267d4102j10875e5923M515o2252c3845
9452c87764b7334k99391O4019c3203j63874C53426d44599J54009O4762e3474m763
9441e8237B2416N9193j7947a36491B08880a31412k2890A27557J84412f1573C5795
9429C8296b24552a06623A2100c3505D5771c2791A91498c08575h2704F1965L3453
9418I5418b06422A79443b17653h2613j45527A75024G5581b56620b4929A06136
9407a91687D9191K343a56765N7616j14572j02352h2588F4789D533h8932B17687
9395c65925B88317e9280I8076k3451a42848D0016c67150a19550a1982F6544c38435
9383c06806i4884l22942a95892O2452A64785b24349P7009A6934J8889j5517K28471
$$ plain form
9372 248777 -46972 112429 9329 -175150 -45466 324079 -170470 -17376 -114010 -93406 8541
9360 105910 -33536 22771 46960 -205636 -155942 -228407 -228415 -442264 -72548 -41738 65386 38349
9348 38349 142406 -28858 -248338 -41863 -148459 158677 98974 -258903 -39018 -137295 -19247
9336 -59607 -38927 -29159 -64932 -9430 -19766 4126 -162514 -213788 -41561 -190945 27557 -78068
9323 -287623 -12592 30942 69660 11438 -29026 -270780 -459926 -223052 -112321 -58592 -21390
9311 -62288 -15227 -246410 -80459 -95203 -24391 -25715 168735 112595 -135798 83942 56347
9300 56347 -74356 -225933 -176100 -149161 89690 -195249 -173356 -169269 19627 119638 35636
9288 179669 34434 -52721 -151586 12211 82420 133535 -153969 62590 -72715 -22841 -142742
$$ packed form
9372B48777d6972A12429I329a75150d5466C24079a70470a7376r6634K0604H541
9360A05910c3536B2771K4189b05636M9694p2465qk13849g2548L0810F5386k7037
9348C8349J04057b8858k19480d1863j06596A58677n9703b58903c9018r8277a9247
9336e9607K0680R768l5773i430j0336D126a62514n1274d1561j49384B7557g8068
9323b87623a2592C0942L8718A1438b9026k41754j89146b23052J10731N3729b1390
9311f2288a5227k31183h0459j4744b4391j324A68735n6140a35798H3942k7595
9300E6347g4356j51577M9833K6939H9690a95249K1893M087A9627J00011C5636
9288A79669C4434e2721r8865A2211P0209N1115a53969F2590g2715b2841j19901
$$ plain form
9277 -142742 91886 -109924 133796 -191784 -100300 85867 -161025 246139 -207218 -127446
9267 -127446 -141863 -189646 -164963 -185188 -106343 56901 58790 -92918 -354294 -25014 24108 -39065
9254 -70352 123591 75627 -20315 -194780 58245 -370181 89783 -24852 -84459 -203147 -358792
9243 -358792 28980 -166804 170622 18684 -106562 12614 -157477 -106333 100346 -158143
9232 -22504 251851 44876 -341983 207658 11523 -70199 -7004 -343301 -54673 119910 122794
9221 122794 -79622 282732 -182884 52003 -225187 -9821 -439034 -106206 165498 -5896 115841
9209 -123467 -201029 -264043 -26844 -246024 -233967 67351 -361462 16695 51169 -165841 172316
9197 -251947 -69555 105877 124652 60215 -67468 -81414 31335 175500 -577660 -197457 -74686
$$ packed form
9277a42742I1886a09924A33796a91784R1484H5867a61025B46139b07218P9772
9267a27446j4417m7783K4683k0225P8845E6901J889i2918k61376b5014B4108c9065
9254g0352A23591m7964b0315j74465E8245c70181H9783b4852n9607j18688j55645
9243c58792B8980a66804A70622A8684a06562A2614a57477N1144A00346a58143
9232b2504B51851D4876c41983B07658A1523g0199g004l36297e4673A19910K884
9221A22794g9622B82732a82884E2003b25187i821m29213a06206A65498e896A15841
9209a23467p7562o3014b6844k19180J2057F7351c61462A6695L4474a65841A72316
9197b51947f9555A05877J8775F0215f7468j3946C1335J44165e77660a97457g4686
$$ plain form
9185 -44558 228024 86645 173 -267161 -115743 -235877 -88376 -157828 -153147 -32507 -100629 -135151
9173 -135151 76332 -121958 18545 -365058 -49362 140900 -289601 56827 -141868 118212
9162 -75251 142702 -108241 49204 118815 59079 15865 211279 -102215 -19583 -30582 132906
9150 -112453 81245 -204451 43767 102918 68045 12493 -47850 -254912 -316484 48805 108662
9139 108662 -2674 18312 129834 233273 -179821 53909 17081 -181206 161961 -118336 29558
9127 -44122 996 239680 -247182 -131969 -132837 -103024 17161 11164 127522 -6670 213897 -255764
9114 -252842 -23619 -120659 -110625 97871 240063 58698 -7481 -220161 -62411 -201004 218997
9102 -77665 -222169 -194001 -306866 -61277 52214 226172 -312828 -318546 -21350 -47429 2313
$$ packed form
9185d4558B28024H6645A73b67161a15743j20134h8376o9452M681c2507o8122l4522
9173a35151G6332a21958A8545c65058d9362A40900b89601E6827a41868A18212
9162g5251A42702a08241D9204O9611E9079A5865J95414a02215a9583j0999A32906
9150a12453H1245b04451D3767N9151l4873A2493d7850k07062o1572D8805N9857
9139A08662b674A8312J11522J03439a79821E3909A7081a81206A61961a18336B9558
9127d4122I96K38684b47182J15213q68K9813A7161n997J16358f670B13897b55764
9114b52842b3619r7040J0034I7871J42192E8698g481k12680f2411j38593B18997
9102g7665j44504K8168j12865f1277E2214J73958c12828n718b1350k6079B313
$$ plain form
9090 -43481 -7575 -133342 -150173 -341949 69652 -140040 72098 -247627 -123244 275620 179060
9079 179060 -228203 -98331 -229302 186438 -176833 -120438 -286534 -195981 69873 267588
9069 267588 127101 -32416 -242339 -516735 -152584 -47180 -234618 -93396 -10544 -252946
9059 -252946 -451495 -125332 -34844 204236 89192 -46630 -50030 13930 190205 -143256 -281517
9048 -281517 -183556 -128497 -279416 -340705 -216824 251814 130376 337531 189692 173605
9038 173605 -262687 38969 100831 83438 -70824 -172197 -119853 -122840 -171315 -206005 -108747
9027 -108747 6897 81604 142788 -76290 171894 -301321 -211577 -7614 -83234 1139 -88916 65706
9014 -72503 -104066 -157535 -174818 -212768 -95844 -56006 24291 34157 -66990 138693 -247532 -86212
$$ packed form
9090d3481g575j25767j6831j91776F9652a40040G2098b47627a23244B75620r6560
9079A79060b28203i8331j30971A86438a76833N6395j66096R0553F9873J97715
9069B67588A27101c2416k09923k74396a52584d7180j87438i3396a0544k42402
9059b52946j98549a25332c4844B04236H9192d6630l400A3930J76275a43256j38261
9048b81517R7961N5059j50919o1289J23881B51814j21438K07155j47839j6087
9038A73605b62687C8969O1862j7393g0824j01373N2344k987m8475l4690R7258
9027a08747F897P4707O1184g6290A71894c01321Q9744g614p5620A139h8916F5706
9014g2503l1563n3469j7283l7950i5844L9838B4291R866f6990A38693b47532h6212
$$ plain form
9001 -171467 -134991 -101522 2445 106480 233933 -7343 -237705 228163 -43314 -55392 -228022
8990 -228022 -143313 -112712 -137654 165577 1191 -260015 -98965 62087 -18626 137121 148501
8979 148501 24053 56399 -200942 -167342 -73291 316091 -52849 -43035 10121 21153 248164
8968 248164 84616 -113876 -139661 -143226 -331534 -92414 -90330 -198353 263956 -95188 244090
8956 -249752 -48645 189932 -56912 -357216 -321754 -268295 -101740 -6741 200859 -61848 -129423
8945 -129423 -119615 -184248 -121583 -523824 -148 -81837 53278 364542 -66518 46633 497295 225124
8932 182892 120289 -229873 -202438 -424488 -18514 276487 -103109 437942 1600108 4279433
8922 4279433 9937413 13490251 3319430 1382845 1186519 350710 476312 381678 195387
$$ packed form
9001a71467L6476L3469B445J04035J27453g343k30362B28163d3314j2078j72630
8990b28022Q4709L0601k4942A65577A191b60015i8965F2087a8626A37121J1380
8979A48501B4053L2346b00942L3600g3291C16091e2849R814A0121J1032K27011
8968B48164H4616a13876k5785l565j88308i2414K084j08023B63956i5188B44090
8956b49752d8645A89932e6912l00304L5462N3459a01740f741B00859f1848o7575
8945a29423R808o4633O2665m02241a48q1689E3278L11264f6518D6633M50662B25124
8932A82892o2603b29873K7435k22050a8514B76487a03109D37942J162166K679325
8922D279433N657980L552838C319430A382845j96326C50710J25602r4634j86291
$$ plain form
8913 195387 88974 -131361 -158124 124860 212361 449477 31458 -71346 -78106 -34144 219151
8901 269866 -403116 177000 191098 267047 145207 -43026 98551 -40694 -192472 -54637 -227002
8890 -227002 -217142 -49483 155726 -211293 -219320 -200019 -433841 71476 -83318 -87683 117951
8878 -140055 -34679 -80180 -356595 77152 69728 -28107 278214 -162542 252588 -294739 -219694
8867 -219694 -121373 205853 127506 -262882 131374 -218567 97701 61068 198320 -164400
$$ packed form
8913A95387H8974a31361k6763A24860Q7501K37116C1458g1346o760c4144B19151
8901B69866d03116A77000J4098P5949j21840d3026I8551d0694j51778e4637j72365
8890b27002R860d9483A55726b11293q027J9301k33822G1476h3318m365A17951
8878a40055c4679m5501k76415G7152p424b8107B78214a62542B52588b94739P5045
8867b19694R8321B05853p8347b62882A31374b18567I7701l6633J37252a64400
$$ [...]
##END NTUPLES=NMR SPECTRUM
##END=
