##TITLE=AC1533_ROEFFECT0009_8214086_iX1p2NjASO
##JCAMPDX= 6.0         $$ Bruker NMR JCAMP-DX V2.0
##DATA TYPE= NMR SPECTRUM
##DATA CLASS= NTUPLES
##ORIGIN= BRUKER
##OWNER= Administrator
$$ 1.72 TOPSPIN		Version 2.1
$$ 2013-10-04 21:22:22.801 -0700  Administrator@X
$$ Compression mode = diff/dup
##.OBSERVE FREQUENCY= 400.02188249412
##.OBSERVE NUCLEUS= ^1H
##.ACQUISITION MODE= SIMULTANEOUS (DQD)
##.ACQUISITION SCHEME= undefined
##.AVERAGES= 64
##.DIGITISER RES= 22
##SPECTROMETER/DATA SYSTEM= spect
##.PULSE SEQUENCE= noesygpps1d.comp
##.SOLVENT NAME= COFFEE_meoh
##.SHIFT REFERENCE= INTERNAL, COFFEE_meoh, 1, 14.96095
##AUDIT TRAIL= $$ (NUMBER, WHEN, WHO, WHERE, PROCESS, VERSION, WHAT)
$$ ##TITLE= Audit trail, TOPSPIN		Version 2.1
$$ ##JCAMPDX= 5.01
$$ ##ORIGIN= Bruker BioSpin GmbH
$$ ##OWNER= Administrator
$$ $$ E:\/data/COFFEE/nmr/AC1533_ROEFFECT0009_8214086_iX1p2NjASO/12/pdata/1/auditp.txt
$$ ##AUDIT TRAIL=  $$ (NUMBER, WHEN, WHO, WHERE, PROCESS, VERSION, WHAT)
(   1,<2013-10-04 21:22:18.145 -0700>,<Administrator>,<X>,<go>,<TOPSPIN 2.1>,
      <created by zg
	started at 2013-10-04 21:10:48.893 -0700,
	POWCHK enabled, PULCHK disabled,
       configuration hash MD5:
       C8 4E 4E 5D D3 5C D8 9E 9F 52 82 E0 59 8A DE 15
       data hash MD5: 64K
       14 7B C8 A8 61 9D 74 62 1D 56 11 16 91 4D 06 78>)
(   2,<2013-10-04 21:22:20.973 -0700>,<Administrator>,<X>,<proc1d>,<TOPSPIN 2.1>,
      <Start of raw data processing
       efp LB = 0.3 FT_mod = 6 PKNL = 1 PHC0 = 0 PHC1 = 0 SI = 128K 
       data hash MD5: 128K
       6B 4E FC 74 5F 73 6F 12 95 02 FE D6 A7 6E 3E 16>)
(   3,<2013-10-04 21:22:21.895 -0700>,<Administrator>,<X>,<proc1d>,<TOPSPIN 2.1>,
      <pk PHC0 = -82.2821 PHC1 = 0 
       data hash MD5: 128K
       FD 89 5C F5 69 7D 02 39 CD 24 27 7C 03 BA 52 C6>)
(   4,<2013-10-04 21:22:22.286 -0700>,<Administrator>,<X>,<proc1d>,<TOPSPIN 2.1>,
      <abs ABSG = 1 
       data hash MD5: 128K
       33 4F DB 62 8B 6D 04 8F 1E CA B0 38 06 F3 F4 21>)
(   5,<2013-10-04 21:22:22.380 -0700>,<Administrator>,<X>,<proc1d>,<TOPSPIN 2.1>,
      <abs ABSG = 2 
       data hash MD5: 128K
       23 F2 24 9B 10 82 BF 4B A1 7C AD A7 F8 5F 49 5C>)
(   6,<2013-10-04 21:22:22.473 -0700>,<Administrator>,<X>,<proc1d>,<TOPSPIN 2.1>,
      <abs ABSG = 3 
       data hash MD5: 128K
       E3 27 58 AA CA 0C 6E B9 CB 24 C1 21 92 81 7F 1C>)
(   7,<2013-10-04 21:22:22.551 -0700>,<Administrator>,<X>,<proc1d>,<TOPSPIN 2.1>,
      <abs ABSG = 4 
       data hash MD5: 128K
       01 55 2C BC 30 11 17 65 31 8A FB 01 70 5A 14 5C>)
(   8,<2013-10-04 21:22:22.630 -0700>,<Administrator>,<X>,<proc1d>,<TOPSPIN 2.1>,
      <abs ABSG = 5 
       data hash MD5: 128K
       96 21 3F 5B AB 57 6B 19 3A D2 40 2C 32 D6 E3 C6>)
$$ ##END=
$$ 
$$ $$ hash MD5
$$ $$ 15 DB DC 7C 10 F3 33 0D BA 93 B9 70 87 AA 5A 55
##$RELAX= 
##$RELAX= 
##$RELAX= 
##$RELAX= 
##$RELAX= 
##$RELAX= 
##$RELAX= 
##$RELAX= 
$$ Bruker specific parameters
$$ --------------------------
##$DU= <E:\>
##$EXPNO= 12
$$ [...]
##$TP07= 0
##$TPNAME0= <>
##$TPNAME1= <>
##$TPNAME2= <>
##$TPNAME3= <>
##$TPNAME4= <>
##$TPNAME5= <>
##$TPNAME6= <>
##$TPNAME7= <>
##$TPOAL= (0..7)
0.5 0.5 0.5 0.5 0.5 0.5 0.5 0.5
##$TPOFFS= (0..7)
0 0 0 0 0 0 0 0
##$TUNHIN= 0
##$TUNHOUT= 0
##$TUNXOUT= 0
##$USERA1= <user>
##$USERA2= <user>
##$USERA3= <user>
##$USERA4= <user>
##$USERA5= <user>
##$V9= 5
##$VALIST= <valist>
##$VCLIST= <CCCCCCCCCCCCCCC>
##$VD= 0
##$VDLIST= <DDDDDDDDDDDDDDD>
##$VPLIST= <PPPPPPPPPPPPPPP>
##$VTLIST= <TTTTTTTTTTTTTTT>
##$WBST= 2048
##$WBSW= 25
##$XGAIN= (0..3)
0 0 0 0
##$XL= 0
##$YL= 0
##$YMAX_a= 6649613
##$YMIN_a= -12292490
##$ZGOPTNS= <>
##$ZL1= 120
##$ZL2= 120
##$ZL3= 120
##$ZL4= 120
##$ABSF1= 14.96095
##$ABSF2= -5.597232
##$ABSG= 5
##$ABSL= 3
##$ALPHA= 0
##$AQORDER= 0
##$ASSFAC= 0
##$ASSFACI= 0
##$ASSFACX= 0
##$ASSWID= 0
##$AUNMP= <proc_prof1d_extract.lims>
##$AXLEFT= 0
##$AXNAME= <>
##$AXNUC= <1H>
##$AXRIGHT= 0
##$AXTYPE= 0
##$AXUNIT= <>
##$AZFE= 0.1
##$AZFW= 0.1
##$BCFW= 0
##$BC_mod= 0
##$BYTORDP= 0
##$COROFFS= 0
##$CY= 15
##$DATMOD= 1
##$DC= 0
##$DFILT= <>
##$DTYPP= 0
##$F1P= 0
##$F2P= 0
##$FCOR= 0.5
##$FTSIZE= 131072
##$FT_mod= 6
##$GAMMA= 0
##$GB= 0
##$INTBC= 1
##$INTSCL= 1
##$ISEN= 128
##$LB= 0.3
##$LEV0= 0
##$LPBIN= 0
##$MAXI= 10000
##$MC2= 0
##$MEAN= 0
##$ME_mod= 0
##$MI= 0
##$NCOEF= 0
##$NC_proc= -2
##$NLEV= 6
##$NOISF1= 0
##$NOISF2= 0
##$NSP= 0
##$NTH_PI= 0
##$NZP= 0
##$OFFSET= 14.96095
##$PC= 1
##$PHC0= -82.2821
##$PHC1= 0
##$PH_mod= 1
##$PKNL= yes
##$PPARMOD= 0
##$PPDIAG= 0
##$PPIPTYP= 0
##$PPMPNUM= 2147483647
##$PPRESOL= 1
##$PSCAL= 4
##$PSIGN= 0
##$PYNMP= <proc.py>
##$REVERSE= no
##$SF= 400.020009657321
##$SI= 131072
##$SIGF1= 0
##$SIGF2= 0
##$SINO= 400
##$SIOLD= 131072
##$SPECTYP= <>
##$SREGLST= <1H.CDCl3>
##$SSB= 0
##$STSI= 131072
##$STSR= 0
##$SW_p= 8223.68421052631
##$SYMM= 0
##$S_DEV= 0
##$TDeff= 65536
##$TDoff= 0
##$TI= <>
##$TILT= no
##$TM1= 0
##$TM2= 0
##$TOPLEV= 0
##$USERP1= <user>
##$USERP2= <user>
##$USERP3= <user>
##$USERP4= <user>
##$USERP5= <user>
##$WDW= 1
##$XDIM= 131072
##$YMAX_p= 411906838
##$YMIN_p= -12507
##$CURPLOT= <Network HP LaserJet P1505>
##$CURPRIN= <$Network HP LaserJet P1505>
##$DFORMAT= <normdp>
##$LAYOUT= <+/1D_H.xwp>
##$LFORMAT= <normlp>
##$PFORMAT= <normpl>
##$SURQMSG= 1
$$ End of Bruker specific parameters
$$ ---------------------------------
##NTUPLES= NMR SPECTRUM
##VAR_NAME=  FREQUENCY,     SPECTRUM/REAL,   SPECTRUM/IMAG
##SYMBOL=    X,             R,               I
##VAR_TYPE=  INDEPENDENT,   DEPENDENT,       DEPENDENT
##VAR_FORM=  AFFN,          ASDF,            ASDF
##VAR_DIM=   131072,        131072,          131072
##UNITS=     HZ,            ARBITRARY UNITS, ARBITRARY UNITS
##FACTOR=    0.0627417313425164, 1,          1
##FIRST=     8223.62146879497, 861,          -59985
##LAST=      0,             2540,            -59983
##MIN=       0,             -12507,          0
##MAX=       8223.62146879497, 411906838,    0
$$ Real data points
##PAGE= N=1
##DATA TABLE= (X++(R..R)), XYDATA
$$ [...]
63945A126225J01647J15983J31355J47494J63948J79847J94217K06361K15848
63936B582925K22423K26116K27135K25246K19306K07852J90240J67145J39960
63927D408348J09938P7927M4604J0681k3165n6351q8344j18523j46103j70133
63917D048879j89614k03771k12433k16194k16043k12663k06225j96887j85330
63908B209719j72466j58717j44037j28668j13499r9424q6750p5463o5703n7542
63898A107450n0571m4255l8593l3995l0537k7938k6170k5403k5160k4259k2175
63887G58394j9921j8858j8894j8596j7076j4994j3424j2410j1063q765n727k484
63875E96182O76L690O450Q763J0550J2021J3607J5548J7559J9034J9732K0079
$$ plain form
63945 1126225 1227872 1343855 1475210 1622704 1786652 1966499 2160716 2367077 2582925
63936 2582925 2805348 3031464 3258599 3483845 3703151 3911003 4101243 4268388 4408348
63927 4408348 4518286 4596213 4640817 4651498 4628333 4571982 4483638 4365115 4219012 4048879
63917 4048879 3859265 3655494 3443061 3226867 3010824 2798161 2591936 2395049 2209719
63908 2209719 2037253 1878536 1734499 1605831 1492332 1392908 1306158 1230695 1164992 1107450
63898 1107450 1056879 1012624 974031 940036 909499 881561 855391 829988 804828 780569 758394
63887 758394 738473 719615 700721 682125 665049 650055 636631 624221 613158 604393 598666 596182
63875 596182 596858 600548 606998 615761 626311 638332 651939 667487 685046 704080 723812 743891
63863G43891K0631K1365K1715K1171J9617J7194J4228J1244Q698O561M428K099
63851I12842k61k581n060p755j0331j2574j4773j7168j9347k0671k1244k1893
63839G59184k3107k4461k5216k5200k4884k4803k5050k5225k4824k3824k2752
63828D89838k2001k1207j9725j7665j5911j4917j4057j2562j0713r508r355r607
63816C12610r398q517p434o744o706p060p217o755n794m709l647k529j482q62
63802B33756p52q06p51p84j199j862k343k482k495k501k274j694j168j270j934
63787B09441k288j586j73P47M01p77j787k197k272k226j822r36k9K57k03j006
63771A93544j672j863j343j72R87J248M30n77p09R1Q16N11p47k000k388j886j105
$$ plain form
63863 743891 764522 785887 807602 828773 848390 865584 879812 891056 899754 906315 910743 912842
63851 912842 912581 910000 904940 897185 886854 874280 859507 842339 822992 802321 781077 759184
63839 759184 736077 711616 686400 661200 636316 611513 586463 561238 536414 512590 489838
63828 489838 467837 446630 426905 409240 393329 378412 364355 351793 341080 331572 322217 312610
63816 312610 303212 294695 287261 280517 273811 266751 259534 252779 246985 242276 238629 236100 234618 233756
63802 233756 233004 232198 231447 230663 229464 227602 225259 222777 220282 217781 215507 213813 212645 211375 209441
63787 209441 207153 205567 205394 206141 206542 205765 203978 201781 199509 197283 195461 194525 194496 194753 194550 193544
63771 193544 191872 190009 188666 188494 189481 190729 191159 190582 189873 189964 190780 191291 190544 188544 186156 184270 183165
63754A83165n73k96K1N13J028J373J501J399J025M73R8J93O16R26R00P64P71Q35
63736A94732Q01Q97J569K743L619L450K438J546J411J766K012K043K184K530K776
63721B26517K789K923L528M393M918M777M187L588L242L083K806K115J039p1r67
63706B68867j743k446k729k297j586j458k101k761k756k262j754j206l86M26P57
63691B44565Q78J564K813L570L170K408K528L501M110L601K515J732J388J129
63677B79472R10Q99R06N38p3l40q1J26k05p39p78j86N28R11R25P42N19L80K75
63658B84729q5r09j892k475k509k360k375k609l028l596l995l744k849j948j554
63643B48801j433j045k88M77R32R98P61N22P47J581K564L147L390L775M462N106
$$ plain form
63754 183165 182592 182296 182317 182830 183858 185231 186732 188131 189156 189629 189727 189920 190536 191462 192362 193126 193897 194732
63736 194732 195533 196430 197999 200742 204361 207811 210249 211795 213206 214972 216984 219027 221211 223741 226517
63721 226517 229306 232229 235757 240150 245068 249845 254032 257620 260862 263945 266751 268866 269905 269834 268867
63706 268867 267124 264678 261949 259652 258066 256608 254507 251746 248990 246728 244974 243768 243382 243808 244565
63691 244565 245443 247007 249820 253390 256560 258968 261496 264997 269107 272708 275223 276955 278343 279472
63677 279472 280382 281281 282187 282725 282652 282312 282231 282357 282152 281413 280635 280449 280977 281888 282813 283555 284074 284454 284729
63658 284729 284644 283735 281843 279368 276859 274499 272124 269515 266487 262891 258896 255152 252303 250355 248801
63643 248801 247368 246323 246035 246512 247444 248442 249203 249725 250472 252053 254617 257764 261154 264929 269391 274497
63627B74497N412N492N662O117O859P720Q421Q791Q948R119R399R857J0690J2031
63613C89015J3684J5345J6937J8568K0234K1998K4197K7068L0142L2547L3991
63602F43726L5028L6151L6913L6255L3504K8829K2851J6095Q983K211l207o566
63590H90773q086q617q717q525q491r498j1817j4596j7055j9650k3155k6995k9561
63577F96010l0107k9373k8202k6576k4286k1634j9014j6467j4054j1990j0035
63566D64272p479m253j405J70Q62J619K680L750M947O631Q563J0059J0916J1527
63552E12859J2152J2824J3860J5743J8360K1034K3530K6371K9917L3688L7013
63541G57351L9829M2283M3645M2288L7075K8561J8705R403J468n033r942j2875
$$ plain form
63627 274497 279909 285401 291063 297180 304039 311759 320180 328971 337919 347038 356437 366294 376984 389015
63613 389015 402699 418044 434981 453549 473783 495781 519978 547046 577188 609735 643726
63602 643726 678754 714905 751818 788073 821577 850406 873257 889352 898335 900546 897339 890773
63590 890773 882687 874070 865353 856828 848337 838839 827022 812426 795371 775721 752566 725571 696010
63577 696010 665903 636530 608328 581752 557466 535832 516818 500351 486297 474307 464272
63566 464272 456793 452540 451135 451305 452167 453786 456466 460216 465163 471794 480357 490416 501332 512859
63552 512859 525011 537835 551695 567438 585798 606832 630362 656733 686650 720338 757351
63541 757351 797180 839463 883108 925396 962471 991032 1009737 1019140 1020608 1015575 1005633 992758
63529I92758j3774j3061j1230q783o694o354q508j2564j7292k2006k6662l1153
63517H14677l5048l7935l9490l9316l7266l4013l0809k8407k6484k4302k1679
63506D59928j9097j7013j5325j3563j1554r773q858q780q714p920o505n178m391
63493C23257m057l930l876l713l116j955o64j0l55j146j429q98j81J44M22J290
63477B99783K470K978K556K059K168K512K456K077J782J542J129O25J22o82j938
63462C21639l100l559l535l598l633l061j930r64n72m59k52P6M79R10J208J280
63446C00929J479K253L474M580N288N787O324P049Q103R405J0615J1745J3425
63433C90456J5978J8706K0878K2931K5580K8067K8605K6593K3223J9713J6189
$$ plain form
63529 992758 978984 965923 954693 945910 939216 932862 924354 911790 894498 872492 845830 814677
63517 814677 779629 741694 702204 662888 625622 591609 560800 532393 505909 481607 459928
63506 459928 440831 423818 408493 394930 383376 373603 364745 355965 347251 339331 332826 327648 323257
63493 323257 319200 315270 311394 307681 304565 302610 301946 301936 301581 300435 299006 298108 297927 298071 298493 299783
63477 299783 302253 305231 307787 309846 312014 314526 316982 319059 320841 322383 323512 324137 324259 323577 321639
63462 321639 318539 314980 311445 307847 304214 301153 299223 298259 297687 297228 296976 297052 297531 298441 299649 300929
63446 300929 302408 304661 308135 312715 318003 323790 330114 337163 345266 354671 365286 377031 390456
63433 390456 406434 425140 446018 468949 494529 522596 551201 577794 601017 620730 636919
63422F36919J2630R782Q515R077J1429J5444K0398K5121K9153L2981L6764L9716
63410H87929M1306M2025M2275M1256L7791L1686K3641J4555N559j933p132j0368
63398A148590j2175j2538j1813j1504j3074j6337k0068k3800k8024l2863l7559
63387I28835m1180m3090m2858m0651l7594l4928l2789l0455k7618k4619k1604
63376E51449j8351j4970j1933r329o809m340k296o47J174L406N589P346Q963J0946
63362E20198J3398J6026J8438K0384K2059K4119K6922K9952L2520L4833L7602
63351G96451M0682M3021M3977M3727M2200L8594L2568K5043J7287R831K820l208
63339A132993p710j0763j2725j3553j3221j2506j2652j4330j7415k1528k6228
$$ plain form
63422 636919 649549 659331 667846 676923 688352 703796 724194 749315 778468 811449 848213 887929
63410 887929 929235 971260 1013535 1054791 1092582 1124268 1147909 1162464 1168023 1166090 1158958 1148590
63398 1148590 1136415 1123877 1112064 1100560 1087486 1071149 1051081 1027281 999257 966394 928835
63387 928835 887655 844565 801707 761056 723462 688534 655745 625290 597672 573053 551449
63376 551449 533098 518128 506195 496866 490057 485717 483421 482774 483948 487354 492943 500289 509252 520198
63362 520198 533596 549622 568060 588444 610503 634622 661544 691496 724016 758849 796451
63351 796451 837133 880154 924131 967858 1010058 1048652 1081220 1106263 1123550 1133381 1136201 1132993
63339 1132993 1125283 1114520 1101795 1088242 1075021 1062515 1049863 1035533 1018118 996590 970362
63328I70362l0763l4359l6814l8339l8869l8003l5712l2552k9070k5433k1734
63317F08714j8201j4912j1749r003p681q719j1849j5577j8290j9304j8944j7919
63305D36566j6732j5488j4055j2378j0617r001p591o293n082m113l600l615m000
63292C24001m355m179l258k024j287j424j946k106j791j573j942k811l736m318
63278B87251m310l654k603j561p11M1O63Q75N58R7M8N62J292J700J456P51K85
63261B82740O24J481K005J907J885K558L511L869L594L532M262N405O149O120
63247C29642N647N420N936P085Q275R115R834J0937J2552J4371J5991J7125J7711
63234D69641J8167J9262K1328K3736K5521K6433K6942K7352K7442K7029K6398
$$ plain form
63328 970362 939599 905240 868426 830087 791218 753215 717503 684951 655881 630448 608714
63317 608714 590513 575601 563852 554849 547168 538449 526600 511023 492733 473429 454485 436566
63305 436566 419834 404346 390291 377913 367296 358295 350704 344411 339329 335216 331616 328001 324001
63292 324001 319646 315467 312209 310185 308898 307474 305528 303422 301631 300058 298116 295305 291569 287251
63278 287251 282941 279287 276684 275123 274412 274453 275116 275991 276549 276646 276694 277256 278548 280248 281704 282455 282740
63261 282740 283364 284845 286850 288757 290642 293200 296711 300580 304174 307706 311968 317373 323522 329642
63247 329642 335289 340709 346645 353730 362005 371120 380954 391891 404443 418814 434805 451930 469641
63234 469641 487808 507070 528398 552134 577655 604088 631030 658382 685824 712853 739251
63223G39251K5980K5891K5892K5657K5147K4761K5061K6065K7125K7668K7728
63212A026226K7337K5810K2264J6716J0041K982m200j1138j7251k2389k6932l1046
63200A018420l4353l6519l7593l7559l6070l3016k8989k4859k1077j7592j4175
63189F96618j0657p162m151j925oK585O285J0553J4517J7637J9692K0628K0742
63176G85356K0628K0667K0757K0688K0451K0152J9881J9674J9234J7847J5115
63165A000450J1744Q839O381L196j381o654j1757j6772k2016k6981l0817l3413
63153H80819l5165l6000l5507l3909l2067l0411k8519k5959k3104k0777j9258
63142E60143j7914j5894j3141j0533q868p900o818n418m282l812l756l841m094
$$ plain form
63223 739251 765231 791122 817014 842671 867818 892579 917640 943705 970830 998498 1026226
63212 1026226 1053563 1079373 1101637 1118353 1128394 1131376 1127176 1116038 1098787 1076398 1049466 1018420
63200 1018420 984067 947548 909955 872396 836326 803310 774321 749462 728385 710793 696618
63189 696618 685961 678799 674648 672723 672717 675302 681587 692140 706657 724294 743986 764614 785356
63176 785356 805984 826651 847408 868096 888547 908699 928580 948254 967488 985335 1000450
63165 1000450 1012194 1021033 1027414 1030610 1029229 1022575 1010818 994046 972030 945049 914232 880819
63153 880819 845654 809654 774147 740238 708171 677760 649241 623282 600178 579401 560143
63142 560143 542229 526335 513194 502661 493793 485893 479075 473657 469375 465563 461807 457966 453872
63129D53872m301l890k799j780j403j264p62m1L87N13P05J196K127L558M903N020
63113D56041L621K012J601K193K616K505K433K618K691K640K879L310L304K743
63099D93207K210K072K099K077K033J815J257P58R12J528J798J540J330J391J308
63084E17335R90R35J247J401J339J751K851L816M044M066M523N141N443N745O600
63069E67227P844R000J0077J1225J2166J2789J3770J5685J7932J9524K0636K2341
63057G40216K5009K7945L0624L3309L6358L9769M3593M7905N2217N5664N8138
63046A190747O0483O3174O5453O6316O5867O5095O4698O4647O4744O4999O5393
63035A901616O5805O6240O6780O7127O6438O3907N9414N3417M6118L7005K5408
$$ plain form
63129 453872 449571 445681 442882 441102 439699 438435 437673 437632 438019 438532 439237 440433 442560 446118 451021 456041
63113 456041 459662 461674 463275 465468 468084 470589 473022 475640 478331 480971 483850 487160 490464 493207
63099 493207 495417 497489 499588 501665 503698 505513 506770 507528 508440 509968 511766 513306 514636 516027 517335
63084 517335 518325 519260 520507 521908 523247 524998 527849 531665 535709 539775 544298 549439 554882 560627 567227
63069 567227 575071 584071 594148 605373 617539 630328 644098 659783 677715 697239 717875 740216
63057 740216 765225 793170 823794 857103 893461 933230 976823 1024728 1076945 1132609 1190747
63046 1190747 1251230 1314404 1379857 1446173 1512040 1577135 1641833 1706480 1771224 1836223 1901616
63035 1901616 1967421 2033661 2100441 2167568 2234006 2297913 2357327 2410744 2456862 2493867 2519275
63024B519275J1432l891j9361l4279m8334o1077p1819p9958q5235q7709q7581
63013A951463q5101q0629p4708o7982o0822n3167m4878l6233k7710j9390j1069
63002A389774k996M046R674J4483J9259K3966K7923L0727L2570L3827L4781L5571
62990A653605L6073L5957L5142L4036L2982L1712K9693K6766K2955J7986J1529
62979A968436L769m820j4098k4015l3941m2972n0824n7698o3340o7071o8813o9179
62967A475434o8349o5858o1873n7693n4314n1279m7649m3430l9259l5299l1439
62956I18992k8080k5680k3808k1697j9609j8522j8474j8357j7594j6935j7044
62945F93192j7315j6813j5685j4753j4240j3645j2684j1525j0284q965p873p417
$$ plain form
63024 2519275 2530707 2526816 2507455 2473176 2424842 2363765 2291946 2211988 2126753 2039044 1951463
63013 1951463 1866362 1785733 1711025 1643043 1582221 1529054 1484176 1447943 1420233 1400843 1389774
63002 1389774 1386778 1390824 1400498 1414981 1434240 1458206 1486129 1516856 1549426 1583253 1618034 1653605
62990 1653605 1689678 1725635 1760777 1794813 1827795 1859507 1889200 1915966 1938921 1956907 1968436
62979 1968436 1972205 1967385 1953287 1929272 1895331 1852359 1801535 1743837 1680497 1613426 1544613 1475434
62967 1475434 1407085 1341227 1279354 1221661 1167347 1116068 1068419 1024989 985730 950431 918992
62956 918992 890912 865232 841424 819727 800118 781596 763122 744765 727171 710236 693192
62945 693192 675877 659064 643379 628626 614386 600741 588057 576532 566248 557283 549410 541993
62933E41993p389p035o028m880m186l880l472k757j957j396j198j209j064n68
62919D94974l8r0r04j945k508k387j831j162o75o59j179j899k386k548k609k720
62903D69434k908l228l703m079m045l648l284l210l338l447l335k766j664n16
62889D26263j03o10j260j128j50R25J410J224P10K37k7j26j27P9O49J381J713
62872D31060J314N54Q5J52N28R59J253J097K86p85j326j081p21j040j968k661
62856D27706k412j301nQ39J089J077J184J434J540J301Q83O13O05O98O99N99N02
62839D37051L90R8m54j028j296j286j369j723k064k055j743j317o75L19J372J983
62823D26203K093K018J795J183M07K11Q88J819K369K711L267L831L881L538L485
$$ plain form
62933 541993 534604 527569 521541 516661 512475 508595 505123 502366 500409 499013 497815 496606 495542 494974
62919 494974 494936 494846 493942 491997 489489 487102 485271 484109 483434 482775 481596 479697 477311 474763 472154 469434
62903 469434 466526 463298 459595 455516 451471 447823 444539 441329 437991 434544 431209 428443 426779 426263
62889 426263 426160 425550 424290 423162 423012 423937 425347 426571 427281 427518 427491 427365 427238 427317 427966 429347 431060
62872 431060 432374 432928 433013 433165 433693 434652 435905 437002 437288 436503 435177 434096 433375 432335 430367 427706
62856 427706 425294 423993 423988 424827 425916 426993 428177 429611 431151 432452 433335 433948 434553 435251 435950 436549 437051
62839 437051 437441 437539 437085 436057 434761 433475 432106 430383 428319 426264 424521 423204 422529 422848 424220 426203
62823 426203 428296 430314 432109 433292 433699 433910 434798 436617 438986 441697 444964 448795 452676 456214 459699
62808D59699M023M762N317N750O246O804P389Q005Q521Q792R061R807J1034J2108
62794E67318J2568J2848J3859J6057J9047K1994K4258K5896K7715L0673L5014
62783H07247M0150M5430N0819N6617O2852O9260P5716Q2307Q8983R5391J01011
62772A575783J05257J07473J07139J04177R8872R1360Q1301O8173N1944L3440
62762B424919J4047m993k3072m0058n5731o9495q0657q8878r4328r7532r9008
62751A785214r8951r7284r4106r0004q5581q0775p5129o8789o2710n7513n2722
62740I21650m7623m2500l8270l5139l2391k9518k6745k4246k1554j8333j5163
62729E90168j2927j1682j0654r259p587n945m394k920j661p62j35M03R83J721
$$ plain form
62808 459699 463722 468484 473801 479551 485797 492601 499990 507995 516516 525308 534369 544176 555210 567318
62794 567318 579886 592734 606593 622650 641697 663691 687949 713845 741560 772233 807247
62783 807247 847397 892827 943646 1000263 1063115 1132375 1208091 1290398 1379381 1474772 1575783
62772 1575783 1681040 1788513 1895652 1999829 2098701 2190061 2271362 2339535 2391479 2424919
62762 2424919 2438966 2433973 2410901 2370843 2315112 2245617 2164960 2076082 1981754 1884222 1785214
62751 1785214 1686263 1588979 1494873 1404869 1319288 1238513 1163384 1094595 1031885 974372 921650
62740 921650 874027 831527 793257 758118 725727 696209 669464 645218 623664 605331 590168
62729 590168 577241 565559 554905 545646 538059 532114 527720 524800 523139 522377 522242 522645 523628 525349
62715E25349K809M335O119P873R510J1170J2971J4839J6646J8454K0577K3384
62703F74036K7006L1151L5315L9280M3430M8351N4089N9935O5122O9454P3149
62692A220318P6213P8322P9245P8977P7349P3876O8083N9812M9108L6272K2129
62681A919704P857n903j9484l3350m6943n8811o7826p3951p7815p9968q0579p9648
62669A303283p7323p4070p0380o6255o1250n5325m9388m4501m0735l7329l3859
62658F92868l0645k7983k5674k3497k1590j9981j8240j5979j3427j1225r832r307
62646D65488r355r408q971q135p401o917o277n272m314l822l612l291k816k210
62632C83687j219K04J446J835J503J063P46L10l20r33j358j398p27N49J539J532
$$ plain form
62715 525349 528158 532493 538612 546485 555995 567165 580136 594975 611621 630075 650652 674036
62703 674036 701042 732193 767508 806788 850218 898569 952658 1012593 1077715 1147169 1220318
62692 1220318 1296531 1374853 1454098 1533075 1610424 1684300 1752383 1812195 1861303 1897575 1919704
62681 1919704 1927561 1921658 1902174 1868824 1821881 1763070 1695244 1621293 1543478 1463510 1382931 1303283
62669 1303283 1225960 1151890 1081510 1015255 954005 898680 849292 804791 764056 726727 692868
62658 692868 662223 634240 608566 585069 563479 543498 525258 509279 495852 484627 474795 465488
62646 465488 456133 446725 437754 429619 422218 415301 409024 403752 399438 395616 392004 388713 385897 383687
62632 383687 382468 382672 384118 385953 387456 388519 389265 389575 389255 388322 386964 385566 384839 385388 386927 388459
62616C88459J092J307K140K592K510K990M552O149O749O941P900R433J0325J0443
62602D63582J1207J3632J6889J9386K0771K2211K4868K8679L2675L6158L9189
62591G29247M2137M5008M7465M9254N0350N0659M9799M7318M3024L6981K9310
62580A220552K0155R890o60j0406j8657k5639l2076l8107m2931m5806m7023m7471
62568I41821m7437m6469m4336m1495l8494l5467l2429k9551k6932k4482k2250
62557E52479k0403j8753j6813j4608j2777j1548j0218q225o184n087m815m259
62545D18789k848j212k62k20p02j222j369r20n4O89Q70M83n9j70M78J521K068
62528D15860J723J262J774L299M886O011P193Q971J0995J2658J4190J6414J9583
$$ plain form
62616 388459 389551 390858 392998 395590 398100 401090 405642 411791 418540 425481 433381 442814 453139 463582
62602 463582 474789 488421 505310 524696 545467 567678 592546 621225 653900 690058 729247
62591 729247 771384 816392 863857 913111 963461 1014120 1063919 1111237 1154261 1191242 1220552
62580 1220552 1240707 1250597 1249937 1239531 1220874 1195235 1163159 1125052 1082121 1036315 989292 941821
62568 941821 894384 847915 803579 762084 723590 688123 655694 626143 599211 574729 552479
62557 552479 532076 513323 496510 481902 469125 457577 447359 439134 432950 427863 423048 418789
62545 418789 415941 414729 414467 414247 413545 412323 410954 410034 409980 410669 411539 412022 411963 411793 412271 413792 415860
62528 415860 417583 418845 420619 423918 428804 434815 442008 450979 461974 474632 488822 505236 524819
62515E24819K3039K6111K8853L1819L5311L9087M2520M4986M6210M6403M5901
62504I35059M4593M1875L7367L1504K5134J8561J1421L564m372j1576j7840k3247
62492A092043k7367k9517k9795k9098k7924k5843k2556j8720j5086j1362o785
62481H47990j476L613P971J1893J5507J8346K0130K1281K2116K2173K0834J8211
62469A028589J4844J0813N758k35o338j1763j6504k1074k5635k9748l2927l5246
62457H80534l7038l8140l7901l6168l3813l1829l0161k7964k4928k1623j8606
62446E42363j5824j3130j0650q362n887l212j051L7N43J402K823M229N159N601
62432E04041N640N356N008M739M146K711O65j204k652m226o236q202r643j0736
$$ plain form
62515 524819 547858 573969 602822 634641 669952 709039 751559 796545 842755 889158 935059
62504 935059 979652 1021527 1058894 1090398 1115532 1134093 1145514 1149078 1144706 1133130 1115290 1092043
62492 1092043 1064676 1035159 1005364 976266 948342 922499 899943 881223 866137 854775 847990
62481 847990 846514 850127 858098 869991 885498 903844 923974 945255 967371 989544 1010378 1028589
62469 1028589 1043433 1054246 1060004 1059769 1053431 1041668 1025164 1004090 978455 948707 915780 880534
62457 880534 843496 805356 767455 731287 697474 665645 635484 607520 582592 560969 542363
62446 542363 526539 513409 502759 494397 488510 485298 484247 484284 484827 486229 489052 493281 498440 504041
62432 504041 509681 515037 520045 524784 528930 531641 532306 531102 528450 524224 517988 509786 500143 489407
62418D89407j1728j2237j1791j0656r424q180o751n541n190n444n288m426l701
62405C89050l654l531k518j219q88j555k020j667j193j309j677j645j239p54k0
62390C64161J171K345K822K656K401K147J564Q12N52R86J612K055K481K942L125
62375C93832L085L545N005O944Q440R191R506R673R827J0192J0924J1941J3178
62362E05283J4871J7181J9887K2760K5975K9688L3614L7497M1683M6560N1671
62351H46670N6082N9523O2419O4780O5750O4411O0439N3928M5182L4901K3995
62340A438080J2998K175p706j5554k1279k6255l1835l7836m3026m6676m8939m9965
62328A124182m9467m7258m3711l9499l5215l1256k7768k4632k1718j9211j7502
$$ plain form
62418 489407 477679 465442 453651 442995 433571 425391 418640 413099 407909 402465 397177 392751 389050
62405 389050 385396 381865 379347 378128 377240 375685 373665 371998 370805 369496 367819 366174 364935 364181 364161
62390 364161 365332 367677 370499 373155 375556 377703 379267 380079 380631 381617 383229 385284 387765 390707 393832
62375 393832 396917 400462 405467 412411 420851 430042 439548 449221 459048 469240 480164 492105 505283
62362 505283 520154 537335 557222 579982 605957 635645 669259 706756 748439 794999 846670
62351 846670 902752 962275 1024694 1089474 1155224 1219635 1280074 1334002 1379184 1414085 1438080
62340 1438080 1451078 1453253 1445547 1429993 1408714 1382459 1350624 1312788 1269762 1223086 1174147 1124182
62328 1124182 1074715 1027457 983746 944247 909032 877776 850008 825376 803658 784447 766945
62317G66945j6759j6850j7549j8628j9730k0454k0649k0450k0027j9378j8412
62306E58059j7121j5665j4234j2843j1305r633q326p835p735o942n111l252k446
62293D35611k425k080j137m31n55j015r90k88P88J926K827L193L120L184L700
62278D45428M237M208L669L184L126L491M204N090N731N830N678N871O590P550
62264E13887Q636J0137J2236J4700J7212J9731K2407K5440K9102L3560L8512M3389
62252G88949M8049N2939N8254O3351O7273O9538O9873O7572O1862N3041M2551
62241A443252L1759K1093J0575N74q466j6687k4631l2524m0215m7604n4560o0402
62229A222164o4114o5281o4367o1943n8097n3018m7577m2680l8247l3485k8258
$$ plain form
62317 766945 750186 733336 715787 697159 677429 656975 636326 615876 595849 576471 558059
62306 558059 540938 525273 511039 498196 486891 477258 468932 461097 453362 446420 441309 438057 435611
62293 435611 433186 431106 429969 429538 428983 427968 426978 426690 427478 429404 432231 435424 438544 441728 445428
62278 445428 449665 453873 457542 460726 463852 467343 471547 476637 482368 488198 493876 499747 506337 513887
62264 513887 522523 532660 544896 559596 576808 596539 618946 644386 673488 707048 745560 788949
62252 788949 836998 889937 948191 1011542 1078815 1148353 1218226 1285798 1347660 1400701 1443252
62241 1443252 1475011 1496104 1506679 1507253 1498787 1482100 1457469 1424945 1384730 1337126 1282566 1222164
62229 1222164 1158050 1092769 1028402 966459 908362 855344 807767 765087 726840 693355 665097
62218F65097k3548k0339j8446j6811j4719j2370j0319q690p070n093k861q25P24
62205E24730J842K652L107L164L023K931K880K717K540K618K930L064K649J711
62191E62558N60m10p91l77M93J150J284J266J639K567L884N321O449O724O048
62176E98365N059M551M665M943N036N033N221N954P593J0226J3440J6765K0327
62163G07178K4603K9542L4338L8321M1628M4790M7828M9985N0202M7783M2809
62152A159007L6069K8459K0409J2056L866l405r461j4828k0170k5512l0384l4456
62140A121650l7690m0037m1315m1345m0020l7287l3342k8664k3702j8613j3541
62129G66094r033n819m099l325k757k057j321o66M5J085K461L713M214L736K555
$$ plain form
62218 665097 641549 621210 602764 585953 571234 558864 548545 539855 532785 527692 524831 524006 524730
62205 524730 526572 529224 532331 535495 538518 541449 544329 547046 549586 552204 555134 558198 560847 562558
62191 562558 563118 562708 561917 561540 562033 563183 564467 565733 567372 569939 573823 579144 585593 592317 598365
62176 598365 603424 607975 612640 617583 622619 627652 632873 638827 646420 656646 670086 686851 707178
62163 707178 731781 761323 795661 833982 875610 920400 968228 1018213 1068415 1116198 1159007
62152 1159007 1195076 1223535 1243944 1256000 1259866 1256461 1247000 1232172 1212002 1186490 1156106 1121650
62140 1121650 1083960 1043923 1002608 961263 921243 883956 850614 821950 798248 779635 766094
62129 766094 757061 751242 747143 743818 741061 739004 737683 737017 737062 738147 740608 744321 748535 752271 754826
62114G54826R71r77l119m820n457n158m598m195l864l668m126n615p749r658j0660
62099F82133j0508r296p499n831m676l672k135Q2K482M519N906O407N943N078
62085F68933M897N837O981P082O225N865P086R293J0971J1418J1393J2151J4140
62072G82272J6705J8842K0081K0656K0952K1002K0697K0321K0449K1338K2777
62061A006092K4635K7144L0282L3351L5616L7095L8079L8069L5820L0666K3298
62050A360147J5153P378N24n366j0689j6091k1953k8171l4445m0473m5745m9572
62038A130697n1604n2141n1670n0360m8250m5610m2802l9904l6788l3447l0027
62027F48094k6662k3514k0759j8350j5987j3582j1510j0139r335q806q605q870
$$ plain form
62114 754826 755797 754820 751701 746881 741424 736266 731668 727473 723609 719941 715815 710200 702451 692793 682133
62099 682133 671625 662329 654830 648999 644323 640651 638516 638598 641080 645599 651505 657912 663855 668933
62085 668933 673830 679667 686648 693730 699955 705820 712906 722199 733170 744588 755981 768132 782272
62072 782272 798977 817819 837900 858556 879508 900510 921207 941528 961977 983315 1006092
62061 1006092 1030727 1057871 1088153 1121504 1157120 1194215 1232294 1270363 1306183 1336849 1360147
62050 1360147 1375300 1382678 1383202 1377836 1367147 1351056 1329103 1300932 1266487 1226014 1180269 1130697
62038 1130697 1079093 1026952 975282 924922 876672 831062 788260 748356 711568 678121 648094
62027 648094 621432 597918 577159 558809 542822 529240 517730 507591 498256 489450 480845 471975
62015D71975r256r149q409p474o728o135n539m948m480m223m180m101l529k285
62001C91539p71N76J895L542N298O502O902O761O158M902L262K045J647J572J215
61986D43045O39J98r0m63j097k184l844n602o476o057n028m168l405k413j614
61971D01441j707k529l289l734m223m685m540l788l168k930k328r00N01P40j20
61956C64741j043j416j430j270p47J03P61Q22N56N87J237K296L327M044M550N188
61940C82306O105P033P679Q244R236J0760J2261J3089J3108J2678J2255J2033
61928E06787J1856J1360J0397R285Q401P552O124L953J643k02j693l264m888o140
61914E61171o770o823o376n569m726l948k764p98J403K930L890N337P621R744
$$ plain form
62015 471975 462719 453570 445161 437687 430959 424824 419285 414337 409857 405634 401454 397353 393824 391539
62001 391539 390768 391344 393239 396781 402079 408581 415483 422244 428402 433304 436566 438611 440258 441830 443045
61986 443045 443684 443882 443792 443329 442232 440048 436204 430602 424126 418069 413041 408873 405468 403055 401441
61971 401441 399734 397205 393916 390182 385959 381274 376734 372946 369778 366848 364520 363620 364121 364861 364741
61956 364741 363698 362282 360852 359582 358835 358938 359699 360521 361077 361664 362901 365197 368524 372568 377118 382306
61940 382306 388411 395444 403123 411367 420603 431363 443624 456713 469821 482499 494754 506787
61928 506787 518643 530003 540400 549685 558086 565638 571762 575715 577358 577156 575463 572199 567311 561171
61914 561171 554401 547578 541202 535633 530907 526959 524195 523397 524800 527730 531620 536957 544578 554322
61900E54322J0762J0946J0825R933P581M405J929N68q45l265o126q277r449j0235
61886E73074j1016j1564j1483j0575q933p010n585n215n758o511o856o655o184
61873D69729n916o153o715o964o378n098l817l093k829k401j306L56J965L034
61859D24414L633M167M860N676O583P647Q843J0071J1398J3055J5143J7437J9571
61846E52498K1172K1973K2053K1870K1776K1533K0623J8958J6862J4432J1490
61835G65240Q154M834J547k104n957r009j0505j0784j0469r515p629n206k940
61822G05657q42J548M087N980O857P119P127O529M738J648k206n996r096j1615
61808G21535j4221j7122j9493k0524k0710k1191k1924k1602j9612j7009j5048
$$ plain form
61900 554322 565084 576030 586855 596788 604369 608774 610703 611271 610426 607161 601035 592758 583309 573074
61886 573074 562058 550494 539011 528436 519503 512493 506908 501693 495935 489424 482568 475913 469729
61873 469729 463813 457660 450945 443981 437603 432505 428688 425595 422766 420365 419059 419415 421380 424414
61859 424414 428047 432214 437074 442750 449333 456980 465823 475894 487292 500347 515490 532927 552498
61846 552498 573670 595643 617696 639566 661342 682875 703498 722456 739318 753750 765240
61835 765240 773394 778228 779775 777671 771714 762705 752200 741416 730947 721432 713803 708597 705657
61822 705657 704815 706363 710450 716430 723287 730406 737533 744062 748800 750448 748242 742246 733150 721535
61808 721535 707314 690192 670699 650175 629465 608274 586350 564748 545136 528127 513079
61797E13079j3668j2152j0485r175q246p295o220n223m271l372k964l306l672
61784D23030l153k124j888k741l468l093k190j759j722j344o28l06n67o89j04
61769C97254P81J102M97n84j309j149l02M97P87Q95J429K381L117L154K553J607
61753D12710O48K42R37K419L450L078J712N22M3j17l78o33p24q34j170j577j765
61736D18563j778j872k104k267k166j779j200n46RL15L45J89k5j05K25J106K282
61719D09192L123L161K574K022J925K038J857J385J171J540K072K050J255Q4r61
61704D34488j600j744j524j407j865k777l430l351k868k615k696k677k371k164
61690D01399k500l226l669l333k393j523j330j826k451k549j946j117p38j028
$$ plain form
61797 513079 499411 487259 476774 467599 459353 452058 445838 440615 436344 432972 430008 426702 423030
61784 423030 419877 417753 415865 413124 409656 406563 404373 402614 400892 399548 398920 398614 398047 397358 397254
61769 397254 398035 399137 399634 399050 397741 396592 396290 396787 397574 398469 399898 402279 405396 408550 411103 412710
61753 412710 413358 413600 414537 416956 420406 423484 425196 425718 425761 425644 425266 424633 423909 423075 421905 420328 418563
61736 418563 416785 414913 412809 410542 408376 406597 405397 404851 404860 405175 405520 405709 405684 405579 405804 406910 409192
61719 409192 412315 415476 418050 420072 421997 424035 425892 427277 428448 429988 432060 434110 435365 435449 434488
61704 434488 432888 431144 429620 428213 426348 423571 420141 416790 413922 411307 408611 405934 403563 401399
61690 401399 398899 395673 392004 388671 386278 384755 383425 381599 379148 376599 374653 373536 372798 371770
61676C71770j573j793j516j039p32p64j086j480j600j262p56o47j083j615j816
61661C53008j775j727j519q87n2M11K75j28l11j2P46J548J699R16j02k98N52J655
61643C53999K219K184J921J754J920K475L041L097K664K242J983J454N30j67j45
61628C81171J39j23j007j873k261k339k529l051l675l869l337k488k001j887j547
61613C49323q81n76j015j653k016k520l586m588m629l920l432l513l717l811l951
61598C05515m029l738l272l067k924k318j485j282j812k283k382k699l404l567
61584B67253k531j050l19m95r05j211j575k018k368k595k700k428j611n95J01
61569B44953L19J04n66j422j669q09N13J169R60O60P65R02O89M57P44J504K188
$$ plain form
61676 371770 370197 368404 366888 365849 365117 364353 363267 361787 360187 358925 358169 357522 356439 354824 353008
61661 353008 351233 349506 347987 347100 347048 347459 347734 347606 347295 347283 348029 349577 351276 352192 352090 351792 352344 353999
61643 353999 356218 358402 360323 362077 363997 366472 369513 372610 375274 377516 379499 380953 381483 381316 381171
61628 381171 381310 381187 380180 378307 376046 373707 371178 368127 364452 360583 357246 354758 352757 350870 349323
61613 349323 348442 347866 346851 345198 343182 340662 337076 332488 327859 323939 320507 316994 313277 309466 305515
61598 305515 301486 297748 294476 291409 288485 286167 284682 283400 281588 279305 276923 274224 270820 267253
61584 267253 264722 263672 263353 262858 261953 260742 259167 257149 254781 252186 249486 247058 245447 244852 244953
61569 244953 245272 245376 244810 243388 241719 240910 241423 242592 243552 244212 244977 245879 246568 247025 247769 249273 251461
61552B51461K352J892R69M4k74K04Q95J001M68O5M26J279J816J626J029O12O16
61535B66481Q07P22P0r07j530j362p88n57q07r15m99j0j8l14k84J10K91r7p30
61516B59663r80m90N14J208P86n33j442j029j3J80o57j383j221o44l93m92n93
61499B52481n90m40K5P46J239J172O94J00m22n66j69K26j81j130j315k10J100
61482B52760J491J305J391J502Q70j70m65J96Q61J012J168J687K018J638Q86L58
61466B68508J01j05k39k96n90j217j584j143l49k23r54j541j069J26R74J028Q49
61449B62276R91J201R41L53J17M46Q12P82O77R98J610J900J596J033P06Q08J212
61432B78459J665J974K104K084J844J382J013J090J459J609J483J570J977K058
$$ plain form
61552 251461 253813 255705 256674 256718 256444 256648 257543 258544 259012 259077 259503 260782 262598 264224 265253 265865 266481
61535 266481 267288 268010 268080 267173 265643 264281 263493 262936 262129 261214 260715 260705 260687 260373 260089 260199 260490 260393 259663
61516 259663 258683 258193 258707 259915 260701 260168 258726 257697 257684 257864 257207 255824 254603 253959 253566 253074 252481
61499 252481 251891 251451 251476 252222 253461 254633 255327 255427 255005 254439 254270 254496 254315 253185 251870 251660 252760
61482 252760 254251 255556 256947 258449 259319 259149 258684 258880 259741 260753 261921 263608 265626 267264 268150 268508
61466 268508 268609 268504 268265 267969 267379 266162 264578 263435 263086 262863 261909 260368 259299 259425 260399 261427 262276
61449 262276 263267 264468 265409 265762 265879 266325 267137 267919 268596 269594 271204 273104 274700 275733 276439 277247 278459
61432 278459 280124 282098 284202 286286 288130 289512 290525 291615 293074 294683 296166 297736 299713 301771
61418C01771J432P84R26J564J797J543J573K091K325J763R89Q61J317J526Q98
61403C23160l80j636k219j889j030m02n36j270j953k054j616j124r60r89q25m11
61387C03866o1Q0K23M06K21n09j220j226n98R1O33J181J624J644J360J253J356
61370C10324J147M22k92m09Q9Q96J754K352K309J673J074J011J248J235R23P84
61354C26540J177J956K760L411L934M360M577M532M426M524M717M506L661K638
61340C77719K074K051K243K539L081L781M274M410M341M132L705L226L018K976
61326D23570K461J092p16k154k764k652k185j642j032k06P82J608K168K851L954
61311D25135N068N592N688O003O632P129P567Q665J0544J2232J2860J2659J2208
$$ plain form
61418 301771 303203 303987 304913 306477 308274 309817 311390 313481 315806 317569 318558 319419 320736 322262 323160
61403 323160 322780 321144 318925 317036 316006 315604 315068 313798 311845 309791 308175 307051 306091 305102 304277 303866
61387 303866 303805 303885 304108 304514 304735 304226 303006 301780 301182 301273 301906 303087 304711 306355 307715 308968 310324
61370 310324 311471 311893 311601 311192 311281 312177 313931 316283 318592 320265 321339 322350 323598 324833 325756 326540
61354 326540 327717 329673 332433 335844 339778 344138 348715 353247 357673 362197 366914 371420 375081 377719
61340 377719 379793 381844 384087 386626 389707 393488 397762 402172 406513 410645 414350 417576 420594 423570
61326 423570 426031 427123 426407 424253 421489 418837 416652 415010 413978 413772 414554 416162 418330 421181 425135
61311 425135 430203 435795 441483 447486 454118 461247 468814 477479 488023 500255 513115 525774 537982
61298E37982J1413R924Q027O314M727K744L74j695k952l556l961m523n443o692
61284E52683p924q792r297r600r604r111q382q014q172q274p641o218m528l092
61270D44034k040j214m74J46N44P18Q37J099J636K379L066L472L785M500N646
61255D68134O410O004M718L547K829K022R28K71O22J591K585L636M785N298M523
61240E17903L128K359K249J682K79q85r06l92m97j256j709j385q75q71j156q08
61224E16860P43K940M453M465L584L266M225N804P017P726Q407R084R233Q707
61210E96514Q096P952P978P419O007M237K827K230K535L507M560N070M916M632
61196F68480M833N606O553P366Q099Q862R431R367Q485P139N896M976M017K574
$$ plain form
61298 537982 549395 559319 567346 573660 578387 581131 581505 579810 576858 573302 569341 564818 559375 552683
61284 552683 544759 535967 526670 517070 507466 498355 489973 481959 473787 465513 457872 451654 447126 444034
61270 444034 441994 440780 440306 440452 440996 441714 442551 443650 445286 447665 450731 454203 457988 462488 468134
61255 468134 474544 480548 485266 488813 491642 493664 494592 494863 495485 497076 499661 503297 508082 513380 517903
61240 517903 521031 523390 525639 527321 527600 526715 525809 525417 524920 523664 521955 520570 519695 518824 517668 516860
61224 516860 517603 520543 524996 529461 533045 536311 540536 546340 553357 561083 569490 578574 587807 596514
61210 596514 604610 612562 620540 627959 633966 638203 641030 643260 645795 649302 653862 658932 663848 668480
61196 668480 673313 678919 685472 692838 700937 709799 719230 728597 737082 744221 750117 755093 759110 761684
61182G61684P93n95j095j102j524k798m407n483n718n637n992o914p801q036p699
61167F97676p327p115o753o154n841o291p256q072q446q544q510q416q556r168
61153E91227r792r478p869n768m292l739l477k876k060j751k387l606m684n423
61139E24025o205p064p268o204m310k596j498q01l86l55m29l2R42K021K891L692
61123D96423M536N385O446Q020R793J0983J1426J1873J2936J4463J6165J8089
61111F26538K0090K1529K2056K2112K2183K2174K1940K1714K1474K0555J8604
61100H60969J6267J4219J2058R101N747L023J012j172l906o478q208r398j0928
61087H82306j3346j6446j9399k1233k1602k1059k0289j9309j7872j6318j5406
$$ plain form
61182 761684 762477 761882 760787 759685 758161 755363 750956 745473 739755 734118 728126 721212 713411 705375 697676
61167 697676 690349 683234 676481 670327 664486 658195 650939 642867 634421 625877 617367 608951 600395 591227
61153 591227 581435 571957 564088 558320 554028 550289 546812 543936 541876 540125 537738 534132 529448 524025
61139 524025 517820 510756 503488 497284 492974 490378 488880 488079 487693 487338 486909 486877 487819 489840 492731 496423
61123 496423 500959 506344 512790 520810 530603 541586 553012 564885 577821 592284 608449 626538
61111 626538 646628 668157 690213 712325 734508 756682 778622 800336 821810 842365 860969
61100 860969 877236 891455 903513 912614 918361 921384 922396 921224 917318 910840 902632 893234 882306
61087 882306 868960 852514 833115 811882 790280 769221 748932 729623 711751 695433 680027
61076F80027j5305j5395j5052j4168j2950j1700j0695r837q580o735n048m344
61064E50218m191l327j419N01J481J742J972K302K578L038M034N354O340O763
61050E77386P133Q102R724J1364J2350J2703J3191J4537J6687J8920K0626K1782
61038G44505K2790K4102K5851K7785K9610L1456L3764L6618L9595M2372M5000
61027A103448M7321M8753M9194M9566N0880N3205N6330O0873O7729P6657Q6334
61016A750290R5892J05665J16727J30574J49205J74513K07553K49109L00806L64765
61006C645099M42438N34993O44570P73520R22414J090736J279051J484799J688674
60997A2506294J842615J876508J728441J383602Q96741L80833l5425k59484k69160
$$ plain form
61076 680027 664722 649327 634275 620107 607157 595457 584762 574925 566345 559610 554562 550218
61064 550218 546027 542700 541281 541782 543263 545005 546977 549279 551857 554895 558929 564283 570623 577386
61050 577386 584519 592621 602345 613709 626059 638762 651953 666490 683177 702097 722723 744505
61038 744505 767295 791397 817248 845033 874643 906099 939863 976481 1016076 1058448 1103448
61027 1103448 1150769 1199522 1248716 1298282 1349162 1402367 1458697 1519570 1587299 1663956 1750290
61016 1750290 1846182 1951847 2068574 2199148 2348353 2522866 2730419 2979528 3280334 3645099
61006 3645099 4087537 4622530 5267100 6040620 6963034 8053770 9332821 10817620 12506294
60997 12506294 14348909 16225417 17953858 19337460 20234201 20615034 20579609 20320125 20050965
60988B0050965j15363J00629K60168K60883M8417l59894q73893j362774j710419
60979A6298719j862553j836534j692572j493688j283099j084152r08274p59151
60971E378696o34549n30148m43162l72024l14262k66905k28364j98109j74714
60962B216459j55649j38990j24098j10623r8145q6769p6885o8114n9509n0981
60952A246696m3569l8036l4058l1074k9024k7743k6452k4390k1562j8463j5450
60941I36875j2728j0458q592o893n402m525m417m665m802m776m680m283l190j360
60927H56104P42K410L135L065L083M065O026Q192J0042J1793J3708J5358J5988
60914I53711J5366J3908J2072J0039P915N869L915J797o78l320n767p949j0096
$$ plain form
60988 20050965 19935602 20036231 20296399 20557282 20605699 20245805 19371912 18009138 16298719
60979 16298719 14436166 12599632 10907060 9413372 8130273 7046121 6137847 5378696
60971 5378696 4744147 4213999 3770837 3398813 3084551 2817646 2589282 2391173 2216459
60962 2216459 2060810 1921820 1797722 1687099 1588954 1502185 1425300 1357186 1297677 1246696
60952 1246696 1203127 1165091 1131033 1099959 1070935 1043192 1016740 992350 970788 952325 936875
60941 936875 924147 913689 905097 898204 892802 888277 883860 879195 874393 869617 864937 860654 857464 856104
60927 856104 856846 859256 862391 865456 868539 872604 878630 886822 896864 908657 922365 937723 953711
60914 953711 969077 982985 995057 1005096 1013011 1018880 1022795 1024592 1023914 1020594 1014827 1006878 996782
60901I96782j2267j4165j5546j6588j7488j7950j7607j6822j6495j6914j7365
60890H17575j7118j6305j5465j4781j4265j4146j4557j5043j5011j4437j3691
60879F52756j2945j2265j1950j2085j2037j1139r753q826q506q011o906n695m919
60866E27719m542m499n031o022o633o128m687l098k014j795k495l652m485m709
60852D67929m762m924m831m195l471l200l220l168l262l831m375m054l004k349
60838D15283k760l755m595n122n446n396m759l744k774k081j742j841k279k625
60824C66364k445j697o44M48J298J564J146M83K00M63Q98J164J319J556J834J933
60808C75884J769J449J039M74l04j144j703j677j109m71l50r11j680j949j482
$$ plain form
60901 996782 984515 970350 954804 938216 920728 902778 885171 868349 851854 834940 817575
60890 817575 800457 784152 768687 753906 739641 725495 710938 695895 680884 666447 652756
60879 652756 639811 627546 615596 603511 591474 580335 570582 561756 553250 545239 538333 532638 527719
60866 527719 523177 518678 513647 507625 500992 494864 490177 487079 485065 483270 480775 477123 472638 467929
60852 467929 463167 458243 453412 449217 445746 442546 439326 436158 432896 429065 424690 420636 417632 415283
60838 415283 412523 408768 404173 399051 393605 388209 383450 379706 376932 374851 373109 371268 368989 366364
60824 366364 363919 362222 361578 362026 363324 364888 366034 366517 366717 367180 368078 369242 370561 372117 373951 375884
60808 375884 377653 379102 380141 380615 380311 379167 377464 375787 374678 374207 373857 372946 371266 369317 367835
60793C67835p09k88m73r93j454j745k041k439k734k670k370k358k928l697l976
60778C36960l606l107k987l136l123k819k454k197k034j934j819j404m52P22J430
60763C08040J454J322J457J445P32k28k44J018K418K678J911J233J264J708K284
60748C28492L187M454N520N939O028O268O424N895M673L297J911R9k240m463n892
60733C69592o500o614o428o125o027o180o103n393m396l825l874m088m055l772
60719B96212l375k918k490k211k017j642r44j12N08O17Q7r48k013k552k323j540
60703B72339o62j04n9l69o11m53M0N35P99Q45P80P06O68N76L08JJ32J013K293
60684B78777L238L461L200K961L125L799M669N085M662L943L981N046O122O061
$$ plain form
60793 367835 367126 366838 366365 365372 363918 362173 360132 357693 354959 352289 349919 347561 344633 340936 336960
60778 336960 333354 330247 327260 324124 321001 318182 315728 313531 311497 309563 307744 306340 305888 306610 308040
60763 308040 309494 310816 312273 313718 314450 314222 313978 314996 317414 320092 322003 323236 324500 326208 328492
60748 328492 331679 336133 341653 347592 353620 359888 366312 372207 376880 380177 382088 382187 379947 375484 369592
60733 369592 363092 356478 350050 343925 337898 331718 325615 320222 315826 312001 308127 304039 299984 296212
60719 296212 292837 289919 287429 285218 283201 281559 280615 280503 281011 281628 281715 280767 278754 276202 273879 272339
60703 272339 271677 271573 271514 271145 270534 270081 270121 270656 271455 272300 273080 273786 274454 275030 275338 275339 275471 276484 278777
60684 278777 282015 285476 288676 291637 294762 298561 303230 308315 312977 316920 320901 325947 332069 338130
60670C38130N040M369M827N613N262L358R84n32r41r61j217j697k100k244k052
60655C55839j554j088j162j856k651k960k609j709n04M95P42L41O9K54J89p79
60639C41057k115k819k899l179l811m063l630l142l036k878k316j796j660j268
60625C02445J09J879K568J600l9j060j144q61p55q13o60n9P77J339J334R74O60
60608C08294N52N24M70M18L96L62L19L88O26Q42O97J33l62j28Q69J853K017J385
60590C19655O59L38L39L18L2n95j349j646j034J90J181J437J143P03L40K92P95
60573C22798J718K590L203L816M629N563O621P903Q992R110Q305P739Q182Q782
60559D09951Q095N923L326J120p37k386l628m335m638m513l762k544j361m24N18
$$ plain form
60670 338130 343170 347539 352366 357979 363241 366599 367583 367051 366110 365149 363932 362235 360135 357891 355839
60655 355839 354285 353197 352035 350179 347528 344568 341959 340250 339746 340241 340983 341324 341393 341647 341836 341057
60639 341057 338942 336123 333224 330045 326234 322171 318541 315399 312363 309485 307169 305373 303713 302445
60625 302445 302554 304433 307001 308601 308562 307502 306358 305497 304742 303929 303269 303210 303987 305326 306660 307634 308294
60608 308294 308846 309370 309840 310258 310654 311016 311335 311723 312349 313191 313888 314021 313659 313531 314400 316253 318270 319655
60590 319655 320314 320652 320991 321309 321341 320746 319397 317751 316717 316907 318088 319525 320668 321371 321711 322003 322798
60573 322798 324516 327106 330309 334125 338754 344317 350938 358841 367833 376943 385248 392987 401169 409951
60559 409951 418046 423969 427295 428415 427678 425292 421664 417329 412691 408178 404416 401872 400511 400087 400605
60544D00605J598K595L441M406N633O916Q199R767J1660J3297J4061J3985J3471
60531E09634J2589J1006Q497N241J754j307l414m502m977n277n515n640n698n714
60517E06677n512m929m097l324k756k333j932j378m50Q38K069K822L242L934N293
60502D98164P204R464J2114J5153J8254K1133K4104K7736L1889L5511L7604L8186
60490G76516L7956L7226L5620L2717K8471K2925J5987P802j011r805j8340k6428
60478I39636l3512l8977m2665m4574m4343m1694l7407l3123k9879k7314k4523
60467E41625k1311j8227j5811j4247j3399j2833j1921j0441q906q005p689p221
60455C91614o100m618l467l037l159l358l267k937k698k701k718k547k346k299
$$ plain form
60544 400605 402203 404798 408239 412645 418278 425194 433393 443160 454820 468117 482178 496163 509634
60531 509634 522223 533229 541726 546967 548721 547414 544000 539498 534521 529244 523729 518089 512391 506677
60517 506677 501165 496236 492139 488815 486059 483726 481794 480416 479966 480804 482873 485695 488937 492871 498164
60502 498164 505368 514832 526946 542099 560353 581486 605590 633326 665215 700726 738330 776516
60490 776516 814472 851698 887318 920035 948506 971431 987418 995220 994209 984404 966064 939636
60478 939636 906124 867147 824482 779908 735565 693871 656464 623341 593462 566148 541625
60467 541625 520314 502087 486276 472029 458630 445797 433876 423435 414529 406524 398835 391614
60455 391614 385514 380896 377429 374392 371233 367875 364608 361671 358973 356272 353554 351007 348661 346362
60441C46362k250k019j862k084k330j943j057o28j105j732j605q92l84k98j69
60426C26004L17R74J485J557Q78m62j592j585n93L27N73N79R02J479J984K307
60410C35134K295J701P73L26O96J147R15K95K7R6m9l73l11K42Q59J428K220K999
60392C50420L035K255J552J597K018K182K136K239K398K250J844J626J931K745
60378C80228L718M208L734K635J853J813J920J535R01O50Q75J256J702K243K551
60363D11822K211J339M49j39k85J80J138J912J994J822K214L232M332N350O502
60348D44073P555P966P887Q037Q390P981O306M030J863l87k935n092o018n965
60334D83691n922o341o869p126p011o410n259l945l127l026l248l329l151k870
$$ plain form
60441 346362 344112 342093 340231 338147 335817 333874 332817 332189 331084 329352 327747 326855 326471 326173 326004
60426 326004 326321 327295 328780 330337 331215 330753 329161 327576 326983 327310 327883 328462 329364 330843 332827 335134
60410 335134 337429 339130 339903 340229 340925 342072 342987 343282 343309 343405 343356 342983 342672 342914 343773 345201 347421 350420
60392 350420 353455 355710 357262 358859 360877 363059 365195 367434 369832 372082 373926 375552 377483 380228
60378 380228 383946 388154 391888 394523 396376 398189 400109 401644 402545 403195 404070 405326 407028 409271 411822
60363 411822 414033 415372 415821 415682 415397 415577 416715 418627 420621 422443 424657 427889 432221 437571 444073
60348 444073 451628 459594 467481 475518 483908 491889 498195 502225 504088 503701 500766 495674 489656 483691
60334 483691 477769 471428 464559 457433 450422 444012 438753 434808 431681 428655 425407 422078 418927 416057
60320D16057k634k407k034j523j212j340j449p47P08J847K007J863K425L707N153
60305D20421O862R346J2311J4734J6131J6804J6851J5859J3773J1084P862L570
60293E65608j753p016j1298j4740j7547j8994j8322j6009j3171j0209p094m608
60281D24847l936m824n358m143j937n36n96j246j519j412j475j839k048j753j316
60266C90909j417k102k566k201j483j371j980k400k000j244r44j200j439j276
60252C67286q63n33m90p90j356j848j761q51N32J604J781J226O60N87Q85J236
60236C67305J621K064K142J418L00j84L13R95J038O69P09J391K145K381K033J426
60220C87766R62Q70J044J207J358J839K765L694M160M285M511M980N463N753N745
$$ plain form
60320 416057 413423 411016 408982 407459 406247 404907 403458 402711 403419 405266 407273 409136 411561 415268 420421
60305 420421 427283 436629 448940 463674 479805 496609 513460 529319 543092 554176 562038 565608
60293 565608 563855 556839 545541 530801 513254 494260 475938 459929 446758 436549 429455 424847
60281 424847 420911 416087 410729 406586 404649 404113 403517 402271 400752 399340 397865 396026 393978 392225 390909
60266 390909 389492 387390 384824 382623 381140 379769 377789 375389 373389 372145 371201 370001 368562 367286
60252 367286 366423 365890 365400 364610 363254 361406 359645 358794 359326 360930 362711 363937 364597 365184 366069 367305
60236 367305 368926 370990 373132 374550 374850 374666 374979 375974 377012 377681 378390 379781 381926 384307 386340 387766
60220 387766 388728 389598 390642 391849 393207 395046 397811 401505 405665 409950 414461 419441 424904 430657 436402
60205D36402N400M944M858N307N861O106O191O341O266N675M994M797M812M315
60191E12269L325K528K147J858J748K167K533J614n76k338k505j970k211l222
60177E17367m031m435m950n471n305m398l415k673j973j493j701k324k443j941
60163D70814j851k717l609l405k388j689j671j648j054j41N11O71N45N35R24J510
60147D55337J635R39j7l01K14O30K33n08m66P56K424L609M164M534M888M877M329
60130D87277L740L728M184M356L817L002K553K456K181J568J056R19P58J88l01
60115E21482J84J557K556K305J487J380K049K334J549L96q7K16O63P56L77m30
60099E38774j352j802j621j495k151l198l526k801j887j573j532j030p6O47Q37
$$ plain form
60205 436402 441802 446746 451604 456911 462772 468878 475069 481410 487676 493351 498345 503142 507954 512269
60191 512269 515594 518122 520269 522127 523875 526042 528575 530189 529613 527275 524770 522800 520589 517367
60177 517367 513336 508901 503951 498480 493175 488777 485362 482689 480716 479223 477522 475198 472755 470814
60163 470814 468963 466246 462637 459232 456844 455155 453484 451836 450782 450641 451152 451823 452368 452903 453827 455337
60147 455337 456972 457911 457894 457593 457807 458437 458670 458162 457696 458452 460876 464485 468649 473183 478071 482948 487277
60130 487277 491017 494745 498929 503285 507102 510104 512657 515113 517294 518862 519918 520837 521595 521783 521482
60115 521482 521666 523223 525779 528084 529571 530951 533000 535334 536883 537279 537192 537408 538071 538827 539204 538774
60099 538774 537422 535620 533999 532504 530353 527155 523629 520828 518941 517368 515836 514806 514730 515377 516214
60084E16214Q94J159J333R51J45l76j53M78Q13N45o4o86j280j918k577l272m165
60067E08041n291o347o958p060o818o390n930n654n502n014l920k746k320k701
60053D35390l097k982k719k808l025k702j621k15R76J665J784J502J312J750K842
60038D28052L993M537M369L983L958M401M816M541L408J983R26K30o82k047l343
60023D63125l971m060m196m477m425l849l236k988k819k321j766j787k463l328
60009D17439m085m741n032m522l401k519k297k246j924j714k056k448k031r37
59995C77486k50o13j485j913j555p54K2N78J040J596K201K545K489K351K505K845
59979C89088K900K446J737J157Q96Q59O56j30j430k493k588j832r97n71l56K1
$$ plain form
60084 516214 517108 518267 519600 520551 520696 520320 520167 520645 521458 522003 521939 521253 519973 518055 515478 512206 508041
60067 508041 502750 496403 489445 482385 475567 469177 463247 457593 452091 447077 443157 440411 438091 435390
60053 435390 432293 429311 426592 423784 420759 418057 416436 416221 417197 418862 420646 422148 423460 425210 428052
60038 428052 432045 436582 440951 444934 448892 453293 458109 462650 466058 468041 468967 469197 468515 466468 463125
60023 463125 459154 455094 450898 446421 441996 438147 434911 431923 429104 426783 425017 423230 420767 417439
60009 417439 413354 408613 403581 399059 395658 393139 390842 388596 386672 384958 382902 380454 378423 377486
59995 377486 377236 376623 375138 373225 371670 370916 370938 371516 372556 374152 376353 378898 381387 383738 386243 389088
59979 389088 391988 394434 396171 397328 398224 399083 399739 399609 398179 395686 393098 391266 390269 389698 389342 389363
59963C89363N91J081J254J110R45J118J602J910J739J452J517J650J087l48j894
59948D04177k684k464j520l22O09R30P54M30O2m50q91p77q7N59O20K38j27k88
59930C98769l12j75K28Q41J501K087K576L018L521M122M647M908M964N049N240
59915D40984N468N803O384P070P457P256O448N108L354J460l01j824k980l413
59901D88274k995k266j934k016j966j566j103p43l85j50k69m41l9Q71J481J488
59885D76241J590K385L525M422N083N668N881N451M798M498M456M183L652L283
59871E35116L214L044K226N08j687l207l036j625p27j453l014l979m065l891l537
59856E13887k524j043j5K42N05J495K965M207M961N405N628N376M233K049n90
$$ plain form
59963 389363 389954 391035 392289 393399 394344 395462 397064 398974 400713 402165 403682 405332 406419 406071 404177
59948 404177 401493 399029 397509 397187 397796 398726 399480 399910 399972 399522 398631 397854 397767 398326 398946 399184 399057 398769
59930 398769 398457 398282 398510 399351 400852 402939 405515 408533 412054 416176 420823 425731 430695 435744 440984
59915 440984 446452 452255 458639 465709 473166 480422 486870 491978 495332 496792 496491 494667 491687 488274
59901 488274 485279 483013 481079 479063 477097 475531 474428 473685 473300 473150 472881 472440 472401 473272 474753 476241
59885 476241 477831 480216 483741 488163 493246 498914 504795 510246 515044 519542 523998 528181 531833 535116
59871 535116 538330 541374 543600 544108 542421 539214 536178 534553 533826 532373 529359 525380 521315 517424 513887
59856 513887 511363 510320 510305 510547 511052 512547 515512 519719 524680 530085 535713 541089 545322 547371 546781
59841E46781k478k806k055j413j375j463j327j430k358l941n452o317o339n597
59827E02430m484l582l133k830k387k092k345k857k823k052j319j276j451r27
59813D68872K04P66O8j184j836j711j465j501j669j841k069k220k135k157k799
59798D47323l806m320m040l495l031k399j646j412j810j951j276n06m42o40k20
59783D16329N84Q77O46O61J055J217J045J197J855K333K195J893J906K007J815
59768D37615J445J257J291J360J293J004O08N45J150K021K415K308K467L229L868
59753D63876L597K657J986K115K831L679M399M959N459N993O452O527N988M940
59739E25458L824L146L091L335L368L120K928K788K134P52n73r91p06n23o15o56
$$ plain form
59841 546781 544303 541497 539442 538029 536654 535191 533864 532434 530076 526135 520683 514366 508027 502430
59827 502430 497946 494364 491231 488401 486014 483922 481577 478720 475897 473845 472526 471250 469799 468872
59813 468872 469076 469842 469910 468726 466890 465179 463714 462213 460544 458703 456634 454414 452279 450122 447323
59798 447323 443517 439197 435157 431662 428631 426232 424586 423174 421364 419413 418137 417631 417189 416549 416329
59783 416329 416913 417790 418436 419097 420152 421369 422414 423611 425466 427799 429994 431887 433793 435800 437615
59768 437615 439060 440317 441608 442968 444261 445265 445873 446418 447568 449589 452004 454312 456779 460008 463876
59753 463876 467473 470130 472116 474231 477062 480741 485140 490099 495558 501551 508003 514530 520518 525458
59739 525458 529282 532428 535519 538854 542222 545342 548270 551058 553192 553944 553371 552380 551674 551151 550536 549880
59723E49880q30j550k320k050q27j26q08j963k375k191k302k852l234l068k348
59708E21036j079M47J337R07l53j283j381j018n95j96M8O0K85J299K861L925L880
59691E30180L185K637K464K389K186J835J387R85Q05P79N21k23j162j750j831
59676E44387j841k302l231m118m503m433m281m191l996l658l509l767m106m014
59662D92437l466k891k539k277j998j778j475o65P08J955K345K026J788K050K560
59647D88780L021L397L461K703J166j69m71k58p87k319l786m255m052m020m305
59632D78106m370l896l128k472k093j851j486r89q07j431k601l378l173k346j488
59617D42597o82J53O22K03j059k617l997m783m477k973j033L16P73P25N19L01
$$ plain form
59723 549880 549050 547500 545180 543130 542303 542177 541369 539406 537031 534840 532538 529686 526452 523384 521036
59708 521036 519957 520404 521741 522648 522295 521012 519631 518613 518018 517822 517870 517930 518215 519514 522375 526300 530180
59691 530180 533365 536002 538466 540855 543041 544876 546263 547248 548053 548832 549353 549130 547968 546218 544387
59676 544387 542546 540244 537013 532895 528392 523959 519678 515487 511491 507833 504324 500557 496451 492437
59662 492437 488971 486080 483541 481264 479266 477488 476013 475348 476056 478011 480356 482382 484170 486220 488780
59647 488780 491801 495198 498659 501362 502528 502359 501888 501630 500843 498524 494738 490483 486431 482411 478106
59632 478106 473736 469840 466712 464240 462147 460296 458810 457821 457014 455583 452982 449604 446431 444085 442597
59617 442597 441915 442068 442690 442893 441834 439217 435220 430437 425960 422987 421954 422270 423043 423768 424287 424588
59601D24588L41P86J280J342J027O08k8r90j669j369m63k0k15j39P15J746K226
59584D29766K103J494L24j128k100k257k053j895j694j551k022l097l792l376
59570D08722k378j739j594j576j659j914j905j250l82j6n2J48O72J012R21O08
59554C97618J79l73o01J19J650L009L466L214K846K625K543K666L089L725M435
59539D30210N286O465P970R542J1017J2716J5185J8215K0172J8839J3284M923
59527E73824l388r236j1861j2004j0875r196p032m511k369j384j381j380q05q0
59513D98322J12l97j407k734m125n201n811o118o165n779n054m450m163l908l546
59498D39576l373l432l247k606k041k007k100j757j153q48q09n09K52J134J760
$$ plain form
59601 424588 424929 425715 426995 428337 429364 429972 429944 428954 427285 425916 425453 425433 425218 425079 425794 427540 429766
59584 429766 431869 433363 433687 432559 430459 428202 426149 424254 422560 421009 418987 415890 412098 408722
59570 408722 406344 404605 403011 401435 399776 397862 395957 394707 394325 394309 394257 394405 395077 396089 397010 397618
59554 397618 397797 397424 396823 396942 398592 401601 405067 408281 411127 413752 416295 418961 422050 425775 430210
59539 430210 435496 441961 449931 459473 470490 483206 498391 516606 536778 555617 568901 573824
59527 573824 570436 561200 549339 537335 526460 517264 510232 505721 503352 501968 500587 499207 498402 498322
59513 498322 498434 498037 496630 493896 489771 484570 478759 472641 466476 460697 455643 451193 447030 443122 439576
59498 439576 436203 432771 429524 426918 424877 422870 420770 419013 417860 417012 416203 415694 415946 417080 418840
59483D18840J986J923J894K156K470K409K238K762L988M869M871M885N751O748
59469D67790O695N760M959M333L113J395K11j88o87j665k205j522j10J100K000
59454D90979L041M281N321N884O009N981O178O841P680Q058P677O790N733M549
59440E75002L147J423p26l203n474o954p571p638p239o340n347m978n337n690
59426E13075n302m186k867j787j015k03J175L244N440P152Q541J0291J2609J4942
59412E61109J6704J7827J8661J9738K1477K3513K4226K1624J4961N382m852j3327
59400G27043j8113j8429j5030r546l336K699P526R941R172N055k124j1089j9191
59387F64578k3732k4180k2317k0043j7769j5114j2154r371p097n528m701m165
$$ plain form
59483 418840 420826 422749 424643 426799 429269 431678 433916 436678 440666 445535 450406 455291 461042 467790
59469 467790 474485 480245 485204 489537 492650 494045 494256 494068 493381 491716 489511 487989 487879 488979 490979
59454 490979 494020 498301 503622 509506 515515 521496 527674 534515 542195 550253 557930 564720 570453 575002
59440 575002 578149 579572 578846 575643 570169 563215 555644 548006 540767 534427 529080 524102 518765 513075
59426 513075 507773 503587 500720 498933 497918 497715 498890 502134 507574 514726 523267 533558 546167 561109
59412 561109 577813 595640 614301 634039 655516 679029 703255 724879 739840 745222 740370 727043
59400 727043 708930 690501 675471 665925 662589 665288 672814 682755 691927 696982 694858 683769 664578
59387 664578 640846 616666 594349 574306 556537 541423 529269 519898 512801 507273 502572 498407
59375D98407l244j918q04L3J332L217M510M217K991K235K286K493K637L214M329
59360E25935N269N470N221N221N779O705P605Q129Q142P865P794Q323R385J0419
59346F27262J0866J0825J0995J1711J2347J2132J1321J0794J0590R813Q133O422
59334G53211N370M332K338m06k865m597o051p568q942r877j0348j0408j0148r801
59320F84240r525r125q320p232o232n501n039m917n091n075m361l060j719m59
59306F08584J171L449O001Q253J0019J1415J2474J2995J2553J0513O290rp122
59293F96586j3143j6661j7568j6725j5099j3280j1678j0600r955r262q232p099
59281E47284o115n059l717k465j771j325m25R58K242L359M856O715Q008Q225Q089
$$ plain form
59375 498407 495163 493245 492441 492474 493806 497023 501533 505750 508741 510976 513262 515755 518392 521606 525935
59360 525935 531204 536674 541895 547116 552895 559600 567205 575334 583476 591341 599135 607458 616843 627262
59346 627262 638128 648953 659948 671659 684006 696138 707459 718253 728843 738656 746789 753211
59334 753211 758581 762913 765251 764845 761980 757383 751332 743764 734822 724945 714597 704189 694041 684240
59320 684240 674715 665590 657270 650038 643806 638305 633266 628349 623258 618183 613822 610762 609043 608584
59306 608584 609755 613204 619205 627458 637477 648892 661366 674361 686914 697427 703717 703708 696586
59293 696586 683443 666782 649214 632489 617390 604110 592432 581832 571877 562615 554383 547284
59281 547284 541169 536110 532393 529928 528157 526832 526407 527365 529607 532966 537822 544537 552545 560770 568859
59266E68859Q479R148R185Q285O905N540M395L477K497R80j054k876m011m935
59252F14874o226p431p656p006o478o439o143n022l661k959k923k821k267j566
59238E46276j041n17L31J353K007J989J546J086P50O14J002K092L291L527K347
59223E66653L55j498k673l075k840k370k152k276k431k487k625k732k326j446
59209E36077r65j441k203k198j377n84l14k94j89m9J6R0K86O36J100J445J276
59192E31312N16l18o12l14K02O72R77R37N00J6j13J25N34J120J852K361K350K129
59174E44246K134K189J851J348J408K174L011L555M248N543P081Q024P918P008
59160F01738N926N250N106N112M796M052K986J533l23k091l123l510m022m998
$$ plain form
59266 568859 577338 586486 595671 603956 610861 616401 620796 624273 626770 627750 626696 623820 619809 614874
59252 614874 608648 601217 593561 586555 580077 573638 567495 562473 558812 555853 552930 550109 547842 546276
59238 546276 545235 544718 545049 546402 548409 550398 551944 553030 553780 554394 555396 557488 560779 564306 566653
59223 566653 567008 565510 562837 559762 556922 554552 552400 550124 547693 545206 542581 539849 537523 536077
59209 536077 535112 533671 531468 529270 527893 527309 526995 526701 526512 526463 526479 526569 526855 527491 528591 530036 531312
59192 531312 531828 531510 530898 530584 530786 531458 532435 533372 533872 533888 533775 533900 534434 535554 537406 539767 542117 544246
59174 544246 546380 548569 550420 551768 553176 555350 558361 561916 566164 571707 578788 586812 594730 601738
59160 601738 607664 612914 618020 623132 627928 631980 634966 636499 636176 634085 630962 627452 623430 618432
59146F18432n843n927n470n138n122n191n355n912o817p502p513o990o385n954
59132E33313n745n782n933n708m686l165k036j728j679j139j62O55J152J731K543
59117E01631L237L672M295N487O981Q206Q911R081Q592P356N653M070L110K923
59103E83205L225L375K860J800Q51N27Q01J285J392N51j182k773l185k650k295
59088E87787k433k264j489j034j537k190j972j237j068j711k563l317m068m645
59074E56259m785m798n171n711n837n521n156m749m028l185k678k505k387k511
59060D97237l175l883l703k594j530j223j441j674j712j570j382j487k083k780
59046D67000l002k666j999j026J22P62M45j63q6N01O89M94Q53J931K662K314J437
$$ plain form
59146 618432 612589 606662 601192 596054 590932 585741 580386 574474 567657 560155 552642 545652 539267 533313
59132 533313 527568 521786 515853 510145 505459 502294 500258 498530 496851 495712 495550 496205 497357 499088 501631
59117 501631 504868 508540 512835 518322 525303 533509 542420 551501 560093 567449 573102 577172 580282 583205
59103 583205 586430 589805 592665 594465 595316 595843 596644 597929 599321 599872 598690 595917 592732 590082 587787
59088 587787 585354 583090 581601 580567 579030 576840 574868 573631 572563 570852 568289 564972 560904 556259
59074 556259 551474 546676 541505 535794 529957 524436 519280 514531 510503 507318 504640 502135 499748 497237
59060 497237 494062 490179 486476 483882 482352 481129 479688 478014 476302 474732 473350 471863 469780 467000
59046 467000 463998 461332 459333 458307 458429 459191 459636 459473 459387 459888 460577 461071 461924 463855 466517 468831 470268
59029D70268R44J090J676K436K999L222L729N275P445Q968R462R842J0662J1222
59015E49240J0775R641Q523P526O386M987L166Q13j480k645k506k142k406k877
59001E87001k745j947q89J55R09J073R59J394K513L477L773L851L935L339J780
58986F08578K61l38o14j516k747l405l538l731l702k595l89K065M174N774O610
58971F04887O727P093Q591J0624J1891J2331J2973J3954J4128J3008J1668J1162
58959G39037J1074J0382Q954P372N793L764J040j958m453n944o628p341q848j1078
58945G41166j3124j4060j3691j2652j1862j1721j1640j0636q617o666n786n744
58933F14967n665n199m498l481k051p98n15j052j478j405j285j284q07M42J697
$$ plain form
59029 470268 471212 472302 473978 476414 479413 482635 486364 491639 499084 508052 517514 527356 538018 549240
59015 549240 560015 569656 578179 585705 592091 597078 600244 601057 599577 596932 594426 592284 589878 587001
59001 587001 584256 582309 581420 581575 582484 583557 584516 585910 588423 591900 595673 599524 603459 606798 608578
58986 608578 608839 608501 607887 606371 603624 600219 596681 592950 589248 586653 586264 588329 592503 598277 604887
58971 604887 611614 618707 627298 637922 649813 662144 675117 689071 703199 716207 727875 739037
58959 739037 750111 760493 769447 776819 782612 786376 787416 785458 781005 775061 768433 761092 752244 741166
58945 741166 728042 713982 700291 687639 675777 664056 652416 641780 633163 626497 620711 614967
58933 614967 609302 604103 599605 596124 594073 593275 592760 591708 590230 588825 587540 586256 585449 585891 587588
58918E87588J977J206J13o00o86l08Q4J15q0m4L20O74R57J571K673L821M713N736
58900F09830P332R202J0662J1513J2061J2433J2465J2190J1936J1853J1756J1566
58888G44799J1548J1938J2624J3375J4162J4991J5563J5481J4694J3446J1741
58877H94362R330O391L763K051P69j079l673o180p926r143j0304j1286j1594j1040
58863H44441r806q132o415n363n516o595p713q255q332q381q566q660q407p957
58849G36343p843q373r130r353q784p835o887n987n296n261n969o804p194p320
58835F34307p661q248q786r155r305r004q157p146o254n176l591j952j041r22
58821E47909r75p48j65Q90K451M006M883N157N458N931O064N669N241N102M920
$$ plain form
58918 587588 589565 590771 590884 590284 589598 589290 589374 589489 589409 589365 589685 590359 591316 592887 595560 599381 604094 609830
58900 609830 617162 626364 637026 648539 660600 673033 685498 697688 709624 721477 733233 744799
58888 744799 756347 768285 780909 794284 808446 823437 839000 854481 869175 882621 894362
58877 894362 903692 910083 913846 915897 916666 915587 911914 905734 897808 888665 878361 867075 855481 844441
58863 844441 834635 826503 820088 814725 809209 802614 794901 786646 778314 769933 761367 752707 744300 736343
58849 736343 728500 720127 710997 701644 692860 685025 678138 672151 666855 661594 655625 648821 641627 634307
58835 634307 626646 618398 609612 600457 591152 582148 573991 566845 560591 555415 551824 549872 548831 547909
58821 547909 546934 546186 546021 546911 549362 553368 558251 563408 568866 574797 580861 586530 591771 596873 601793
58806F01793M330L568L036K681K114J113j98j463k271k534k756l498m584n222
58792E96109n083m840n357o629p759p884o959n723m845m114k720m97J535K369
58778E37603K370K745L840M793M891M394L773K904J433n72k696m569n904o569
58764E48436o851p181p435p047n967m954m533m281l576k551j742j205o20K8M55
58749D90976O64J021J737K626L360L664L398K706K048J841K093K511K836L013
58735E24494L198L673M506N274N480N316N471N994O020N059L918L634L967L832
58721E89836K994K388K700L486M028M307M724N338N927O509P304Q221Q738Q364
58707F64864P094N418L867K507Q82j353l856n902p350q827j0801j2810j3990j4124
$$ plain form
58806 601793 606123 609691 612727 615408 617522 618635 618437 616974 614703 612169 609413 605915 601331 596109
58792 596109 591026 586186 580829 574200 566441 558557 551598 545875 541030 536916 534196 533699 535234 537603
58778 537603 539973 542718 546558 551351 556242 560636 564409 567313 568746 568174 565478 560909 555005 548436
58764 548436 541585 534404 526969 519922 513955 509001 504468 500187 496611 494060 492318 491113 490493 490521 490976
58749 490976 491640 492661 494398 497024 500384 504048 507446 510152 512200 514041 516134 518645 521481 524494
58735 524494 527692 531365 535871 541145 546625 551941 557412 563406 569426 574485 578403 582037 586004 589836
58721 589836 592830 595218 597918 601404 605432 609739 614463 619801 625728 632237 639541 647762 656500 664864
58707 664864 671958 677376 681243 683750 684632 683279 679423 673521 666171 657344 646543 633733 619743 605619
58693F05619j3746j3337j2903j2356j1832j1391j0782r790q651p824p375o815
58681D78817n631l897k354j862k610l794m231l433j947n98L48J131J892K503K890
58666D57224L221L753M723O219P916R051R019P946O333M290J594j473m049n549
58652E10218o155o253n916n265m793m831m978m550l463k309j707j808k316k734
58638D53140k652k030j130k24M67O62L02mN13J768K861L306L490L621L093J645
58622D68828K47P9R89J874K132J925J440R08J015K210L750M404M144M043M512
58607E02500M733M113L153K471J910J153M74K12J22j44m32m15j20L11Q86J329
58591E22256R53l87j638j542j38J390K194K586L332M662O075O926P057P002P367
$$ plain form
58693 605619 591873 578536 565633 553277 541445 530054 519272 509482 500831 493007 485632 478817
58681 478817 473186 469289 466935 465073 462463 458669 454438 451005 449058 448460 448808 449939 451831 454334 457224
58666 457224 460445 464198 468921 475140 483056 492107 501126 509072 515405 519695 521289 519816 515767 510218
58652 510218 504063 497810 491894 486629 481836 477005 472027 467477 464014 461705 459998 458190 455874 453140
58638 453140 450488 448458 447328 447104 447571 448233 448535 448531 449044 450812 453673 456979 460469 464090 467183 468828
58622 468828 469075 469154 470143 472017 474149 476074 477514 478422 479437 481647 485397 489801 493945 497988 502500
58607 502500 507233 511346 514499 516970 518880 520033 520507 520719 520841 520697 520265 519850 519730 520041 520927 522256
58591 522256 523209 522822 521184 519642 519504 520894 523088 525674 529006 533668 539743 546669 553726 560728 568095
58576E68095Q021Q165P455O636O616P169P266O585O059O619Q009R254J0042J1043
58562F77034J2909J5472J8043K0048K1232K1554K1329K1097K0878J9801J6993
58551H86390J2799Q497M812J413j962m683o002o116n930o095o679p417p962q226
58537H52839q818j0546j3126j5054j5348j4874j5102j6072j6526j5708j4043j2199
58525F85423j0454q979p887o919n691m318l218k410j641j033q80j001r88r66j334
58510F27704j915k170k121k158k082j342j90M23J41m71r52j289j363j071j003
58495F10141j762k634k225o03O17O47N52J299K318K805L134L926M807N195N467
58480F33684O272P374Q178Q839R850J1081J2017J2503J2534J1851J0484R052P786
$$ plain form
58576 568095 576116 584281 591736 598372 604988 612157 619423 626008 632067 638686 646695 655949 665991 677034
58562 677034 689943 705415 723458 743506 764738 786292 807621 828718 849596 869397 886390
58551 886390 899189 907686 912498 913911 911949 907266 901264 895148 889218 883123 876444 869027 861065 852839
58537 852839 844021 833475 820349 805295 789947 775073 759971 743899 727373 711665 697622 685423
58525 685423 674969 665990 658103 651184 645493 641175 637957 635547 633906 632873 631993 630992 630004 629038 627704
58510 627704 625789 623619 621498 619340 617258 615916 615726 616149 616290 615819 614867 613578 612215 611144 610141
58495 610141 608379 605745 603520 602917 603534 604181 604733 606032 608350 611155 614289 618215 623022 628217 633684
58480 633684 639956 647330 655508 664347 674197 685278 697295 709798 722332 734183 744667 753719 761505
58467G61505N824K495j303l945m978n262n505n571n120m064k418k73K096M454
58453G37935O743Q646R532R211Q371P702P056N950M378K550L46k325m984p070
58439G94041q459r074q553o980n334m416l855k921j786j037m29Q02K602M150N116
58424G53867N976P037P999Q601R014R388R475Q832P205M830K453P31n45k153m181
58409H28529n701o146o136o405o621o149n252m591m079l250k379k126k303j979
58395G65412p72Q56K395L662M525N000N473O096O224N207L532K372K166K424K779
58380H17351L382M328N381O293O848O827O417O334O890P313O771N633M901M783
58366H99452M811N026N971P550Q909R566R760R720R402R085R360J0332J1435J2095
$$ plain form
58467 761505 767329 769824 768521 764576 759598 754336 748831 743260 738140 734076 731658 731385 733481 737935
58453 737935 744678 753324 762856 772067 780438 788140 795196 801146 805524 808074 808420 806095 801111 794041
58439 794041 785582 776508 767955 760975 755641 751225 747370 744449 742663 741626 741197 741999 744601 748751 753867
58424 753867 759843 766880 774879 783480 792494 801882 811357 820189 827394 832224 834677 835408 834863 832710 828529
58409 828529 822828 816682 810546 804141 797520 791371 786119 781528 777449 774199 771820 769694 767391 765412
58395 765412 764640 765496 767891 771553 776078 781078 786551 792647 798871 804078 807610 809982 812148 814572 817351
58380 817351 820733 825061 830442 836735 843583 850410 856827 863161 870051 877364 884135 889768 894669 899452
58366 899452 904263 909289 915260 922810 931719 941285 951045 960765 970167 979252 988612 998944 1010379 1022474
58352A022474J2103J1314R629P336N056L338K555K893M063N318O210P005P921
58339A107215Q539Q507Q300Q587R365J0306J1433J2695J3542J3746J4039J4999
58327A241273J5962J6043J5605J5571J5728J5011J3211J1263R960R371R298R454
58315A397750R367Q987R022R907J0982J1493J1762J2405J3163J3633J4377J5914
58303A538762J7400J7735J7429J7852J9113K0209K0763K1084K0991K0258J9811
58292A751407K0770K2591K3773K4152K4776K5879K6775K7514K8776L0219L0771
58281B037403L0524L0632L1363L1940L2178L2549L2749L2112L1318L1841L3735
58270B388344L5860L8111M1415M5553M9161N2032N5297N9189O2631O5310O8116
$$ plain form
58352 1022474 1034577 1045891 1055520 1062856 1067912 1071250 1073805 1076698 1080761 1086079 1092289 1099294 1107215
58339 1107215 1115754 1124261 1132561 1141148 1150513 1160819 1172252 1184947 1198489 1212235 1226274 1241273
58327 1241273 1257235 1273278 1288883 1304454 1320182 1335193 1348404 1359667 1369627 1378998 1388296 1397750
58315 1397750 1407117 1416104 1425126 1435033 1446015 1457508 1469270 1481675 1494838 1508471 1522848 1538762
58303 1538762 1556162 1573897 1591326 1609178 1628291 1648500 1669263 1690347 1711338 1731596 1751407
58292 1751407 1772177 1794768 1818541 1842693 1867469 1893348 1920123 1947637 1976413 2006632 2037403
58281 2037403 2067927 2098559 2129922 2161862 2194040 2226589 2259338 2291450 2322768 2354609 2388344
58270 2388344 2424204 2462315 2503730 2549283 2598444 2650476 2705773 2764962 2827593 2892903 2961019
58259B961019P1305P4176P6733P9710Q2842Q5129Q6806Q8958R1316R2756R3870
58248C884620R6538J00881J05227J09213J14194J20447J26763J33140J40971J50215
58238E082209J59237J67852J77595J88640J99544K10462K23374K38607K54424
58229F901944K70581K88879L09624L31194L53712L79420M08635M39462M72184
58220A0155635N09739N52904N99618O50222P08547P76470Q52356R36616J033653
58211A6775760J146640J275809J423927J597855J802710K040724K318541K649534
58203C1031500L047123L523606M098763M801331N658313O691746P930291R413250
58195G6195923J1176472J3243334J5632592J8356198K1393511K4674047K8078649
$$ plain form
58259 2961019 3032324 3106500 3183233 3262943 3345785 3430914 3517720 3606678 3697994 3790750 3884620
58248 3884620 3981158 4082039 4187266 4296479 4410673 4531120 4657883 4791023 4931994 5082209
58238 5082209 5241446 5409298 5586893 5775533 5975077 6185539 6408913 6647520 6901944
58229 6901944 7172525 7461404 7771028 8102222 8455934 8835354 9243989 9683451 10155635
58220 10155635 10665374 11218278 11817896 12468118 13176665 13953135 14805491 15742107 16775760
58211 16775760 17922400 19198209 20622136 22219991 24022701 26063425 28381966 31031500
58203 31031500 34078623 37602229 41700992 46502323 52160636 58852382 66782673 76195923
58195 76195923 87372395 100615729 116248321 134604519 155998030 180672077 208750726
58188B08750726L1396479L4197352L5720270L4954966L0972127K3361140J2553778
58181D11906838j33609j2804068k3555180l1079905l4985416l5695189l4080254
58174B39573217l1084025k7492567k3847239k0450460j7429865j4818331j2604514
58167I1846216j0749427r198848p901917o818335n910856n142792m486350l925201
58159C7712490l445938l033725k677779k373313k114791j892935j700371j534212
58151A8939426j390707j262863j145884j040118r46102q61150p83003p12479o50046
58142A0147074n93580n41808m96362m58252m25478l96124l70587l48777l28106
58133F188000l06447k84634k64214k45169k27336k11686j98454j86141j73744
$$ plain form
58188 208750726 240147205 274344557 310064827 345019793 375991920 399353060 411906838
58181 411906838 411773229 398969161 375413981 344334076 309348660 273653471 239573217
58174 239573217 208489192 180996625 157149386 136698926 119269061 104450730 91846216
58167 91846216 81096789 71897941 63996024 57177689 51266833 46124041 41637691 37712490
58159 37712490 34266552 31232827 28555048 26181735 24066944 22174009 20473638 18939426
58151 18939426 17548719 16285856 15139972 14099854 13153752 12292602 11509599 10797120 10147074
58142 10147074 9553494 9011686 8515324 8057072 7631594 7235470 6864883 6516106 6188000
58133 6188000 5881553 5596919 5332705 5087536 4860200 4648514 4450060 4263919 4090175
58124D090175j62039j51586j41651j32089j23986j17415j10897j04079r8485r4549
58114B853399r0438q5102p9989p6285p2863o8583o4411o1489n9077n6148n3302
58103B085712n1506n0449m9553m9086m9003m8295m6778m5890m6456m7195m6751
58092A554750m5462m3910m1479l7901l4507l2335l0477k7887k5393k4182k3743
58081A187474k3009k2252k2055k1635k0116j8464j8222j9087j9616j9578j9748
58070I63692j9922j9124j7532j6395j6050j5576j4508j3432j2686j1773j0483
58059G96211r535r643j0513j1219j1173j0605j0197j0341j0746j0900j0774j0592
58047F69973j0175r211q113p600p436o677n360m614m760m738m033l741m771o215
$$ plain form
58124 4090175 3928136 3776550 3634899 3502810 3378824 3261409 3150512 3046433 2947948 2853399
58114 2853399 2762961 2677859 2597870 2521585 2448722 2380139 2315728 2254239 2195162 2139014 2085712
58103 2085712 2034206 1983757 1934204 1885118 1836115 1787820 1741042 1695152 1648696 1601501 1554750
58092 1554750 1509288 1465378 1423899 1385998 1351491 1319156 1288679 1260792 1235399 1211217 1187474
58081 1187474 1164465 1142213 1120158 1098523 1078407 1059943 1041721 1022634 1003018 983440 963692
58070 963692 943770 924646 907114 890719 874669 859093 844585 831153 818467 806694 796211
58059 796211 786676 777033 766520 755301 744128 733523 723326 712985 702239 691339 680565 669973
58047 669973 659798 650587 642474 634874 627438 620761 615401 610787 606027 601289 597256 593515 588744 582529
58033E82529o708o374o271o694p234p863q837r909j0544j0599j0147r227q313
58020D73809q199q807q970q033o760n885m972l711l080l873n013m949l916l273
58006C94368l203k829k185k294l270l963l712l168l040l237l413l428k994j793
57992C51839k02Q75J149J193J459J722J629J208O78J61k93p25j269j859k179k219
57976C53167k394k712k495j530q22j291k319k679k397k461k965k915j959r95q01
57961C22432j052j056o41QO67R46M87m51j178j398j356j127n45Q8L6q71j872k239
57943C10878k013j529p78M01J842L115L825L788L244K922L499M849O181O893O994
57928C54111O665N909M703L228J786O46q2o26j397k404l132l276l263l568l917
$$ plain form
58033 582529 575821 569447 563176 556482 549248 541385 532548 522639 512095 501496 491349 482122 473809
58020 473809 465610 456803 447833 439800 433040 427155 422183 418472 415392 411519 406506 401557 397641 394368
58006 394368 391165 388336 386151 383857 380587 376624 372912 369744 366704 363467 360054 356626 353632 351839
57992 351839 351637 352512 353661 354854 356313 358035 359664 360872 361550 361711 361418 360693 359424 357565 355386 353167
57976 353167 350773 348061 345566 344036 343214 341923 339604 336925 334528 332067 329102 326187 324228 323233 322432
57961 322432 321380 320324 319683 319691 320358 321304 321791 321340 320162 318764 317408 316281 315736 315824 315860 314989 313117 310878
57943 310878 308865 307336 306558 306959 308801 311916 315741 319529 322773 325695 329194 334043 340224 347117 354111
57928 354111 360776 366685 371388 374616 376402 377048 376966 376340 374943 372539 369407 366131 362868 359300 355383
57913C55383l794l364l151l058k533j660j230j596k200k399k193j982k111k749
57899C21363l734m414m213l365k672k529k623k612k481k225j768j265r59p37l46
57884B85420j6k41r14j341j174p14k04M65J204J524J222O91K77j35o83j137j260
57867B82984j136r55p65n93m49k12J04J08m07p69r3J315K085J585P15N72J070
57850B85159J484J668J967K369K382J674L62j137k283k668k467k324k575k828
57836B80783k575j939j513j685k342l013l138k541j808j771k358k441j224O17
57822B53052J702J608J205J426K230K914L048K846K639K296J358k03j743k649
57808B71729l055l461l880l895l484l162l207l269k955k315j618j064q09q90r70
$$ plain form
57913 355383 351589 348225 345074 342016 339483 337823 336593 334997 332797 330398 328205 326223 324112 321363
57899 321363 317629 313215 309002 305637 302965 300436 297813 295201 292720 290495 288727 287462 286503 285766 285420
57884 285420 285404 285163 284249 282908 281734 281020 280816 281281 282485 284009 285231 285922 286199 286064 285381 284244 282984
57867 282984 281848 280893 280128 279535 279086 278874 278978 279086 278679 277910 277817 279132 281217 282802 283517 284089 285159
57850 285159 286643 288311 290278 292647 295029 296703 297065 295928 293645 290977 288510 286186 283611 280783
57836 280783 278208 276269 274756 273071 270729 267716 264578 262037 260229 258458 256100 253659 252435 253052
57822 253052 254754 256362 257567 258993 261223 264137 267185 270031 272670 274966 276324 276121 274378 271729
57808 271729 268674 265213 261333 257438 253954 250792 247585 244316 241361 239046 237428 236364 235555 234665 233695
57793B33695o26J8M81P08J123J745K028J856J876K407K722K076Q56M0r2K8J78
57776B51119N71J263J981K499K695K361J437L86j26j3K11J01k92p10j016j228
57760B61239j484j919k453k755k624k259j924j534q94k43j19o30j129q14M46J932
57744B42836K776K800K613K808L238L293K802K238K048K167K236J994J304K42
57730B75395p43j114q99p50j133j808k185j914j014J46Q85P24L8l39k90o10j719
57713B62670k899l283k991k687k517k196j752j540j656j926k290k722l013l049
57699B28149l057l147k935k160j289q85p08j45O87J048O46j24r80j970k831k890
57683B07409j976q57l70m68l60N85K286M140N688P154R219J2204J5711J9280K3085
$$ plain form
57793 233695 233069 233087 233568 234276 235399 237144 239172 241028 242904 245311 248033 250109 250965 251005 250913 250941 251119
57776 251119 251690 252953 254934 257433 260128 262489 263926 264312 264186 264173 264384 264485 264193 263483 262467 261239
57760 261239 259755 257836 255383 252628 250004 247745 245821 244287 243393 243150 243031 242401 241272 240458 240904 242836
57744 242836 245612 248412 251025 253833 257071 260364 263166 265404 267452 269619 271855 273849 275153 275395
57730 275395 274652 273538 272639 271889 270756 268948 266763 264849 263835 263981 264866 265590 265628 265289 264999 264389 262670
57713 262670 259771 256488 253497 250810 248293 246097 244345 242805 241149 239223 236933 234211 231198 228149
57699 228149 225092 221945 219010 216850 215561 214676 213968 213823 214510 215558 216204 216080 215100 213130 210299 207409
57683 207409 205433 204576 204206 203738 203378 203963 206249 210389 216077 223231 232450 244654 260365 279645 302730
57668C02730K7563L2700L8073M3335M7918N0380M8622M0979K7114Q314j2424l0961
57656F24343m3737m9548m9552m5812m0213l4276k8985k4456k0387j6901j4386
57645B56090j2547j0458p863n633m515m057l347k212j188n58j47J60K73L04O35
57630B04937J373K100K270J794J038L83j10n78j123j742k381k810k721k198j956
57615A98276k546l381l277k094j091j170j639j375n19q3l40o73p56q77j139j278
57599A76038j276j326j206n71J81J91n79j363j864k461l011k673j444o68j294
57584A56674k521k970k463j803j401r99m05K43P21P12j1j048j508j216j135j979
57568A38891l033l212k695k503k780k591j475j45N45N74M29M14N73Q49J029Q56
$$ plain form
57668 302730 330293 362993 401066 444401 492319 542699 591321 632300 659414 667728 655304 624343
57656 624343 580606 531058 481506 435694 395481 361205 332220 307764 287377 270476 256090
57645 256090 243543 233085 225222 219589 215074 211017 207670 205458 204270 203712 203565 203725 203998 204302 204937
57630 204937 206310 208410 210680 212474 213512 213895 213785 213207 212084 210342 207961 205151 202430 200232 198276
57615 198276 195730 192349 189072 186978 185887 184717 183078 181703 181184 181101 180761 180088 179332 178455 177316 176038
57599 176038 174762 173436 172230 171659 171840 172031 171452 170089 168225 165764 162753 160080 158636 157968 156674
57584 156674 154153 151183 148720 146917 145516 144517 144112 144355 145076 145788 145777 144729 143221 142005 140870 138891
57568 138891 135858 132646 129951 127448 124668 122077 120602 120457 121002 121576 122005 122419 122992 123841 124870 125726
57552A25726M06J18K91P67J135J154R12P11P24O73R4r81j814j753j001k98l3N
57534A26836J46M70P96Q25L79k84o03m06k09m80r43r73n00jK57M87R38J566K183
57515A30484K651K892K894K662K083J099J14j55M39J122J126N80P5k64o95j153
57499A45954j306j107p19j19O35R44K93q47j535j666j941k512k735k415k300k784
57483A25840l057k239p31K95L97J25O6K60N17P36Q32P10L54k25j049k014k789
57466A18028l082k889k389j718j063p09p32p71l83L93J096J415J441J364J134
57451A11135N87j64o54n03M9K94j63q46r19j70P54J176J125J107J338J467J091
57434A16704L10l14l74r6l5l91p93q35n26j16K18K87r9p31r30l62M04O08L71L16
$$ plain form
57552 125726 126132 126250 126541 127308 128443 129597 130509 131220 131944 132617 132711 131730 129916 128163 127162 126864 126831 126836
57534 126836 126982 127452 128248 129073 129452 129168 128565 128159 127950 127470 126527 125554 125054 125053 125310 125797 126735 128301 130484
57515 130484 133135 136027 138921 141583 143666 144765 144879 144724 145163 146285 147411 147991 148066 147802 147107 145954
57499 145954 144648 143541 142822 142703 143338 144282 144575 143728 142193 140527 138586 136074 133339 130924 128624 125840
57483 125840 122783 120544 119813 120108 120505 120630 120696 120956 121473 122209 123041 123751 124105 123880 122831 120817 118028
57466 118028 114946 112057 109668 107950 106887 106178 105446 104675 104292 104685 105781 107196 108637 110001 111135
57451 111135 111722 111558 110904 110401 110450 110744 110581 109735 108816 108646 109400 110576 111701 112808 114146 115613 116704
57434 116704 117014 116700 116326 116230 116195 115804 115011 114176 113650 113534 113752 114039 113940 113209 112279 111917 112321 112929 113300 113616
57414A13616M19Q8o49r31l55L91O50P86J420K224K249J241n9q36r43p11m54k74
57396A17872j07P0J10j14l93l18J56O52R83J423K109K661K729K578K670K945K962
57379A38988K501J663O54j47k54K95O67K04o37r22o15m73p62r30n95l1N36J200
57361A41342J718J426K94p11q58o05o17n83J72J316J759J174L50P2L70R44J605
57344A49168K058J915J183L19l82r29j157p91j83k23j023j436n73P52R63k17j486
57327A47958j714j109n28l44l21j21M14J139J601J394O48p2m46n70m58M9P76J077
57309A49373O31o0l12l1L79O71Q77J010J041R85Q40N78M08O94J399J931J879J559
57291A63852J469J523J321R46R12J409K051K366K179J639J136J096J520J967K182
$$ plain form
57414 113616 114035 114123 113474 112543 112188 112579 113229 114015 115435 117659 119908 121149 121090 120254 119311 118600 118146 117872
57396 117872 117765 117835 117945 117831 117438 117120 117276 117928 118911 120334 122443 125104 127833 130411 133081 136026 138988
57379 138988 141489 143152 143806 143659 143405 143700 144367 144571 143934 143012 142397 141924 141162 140232 139637 139606 140142 141342
57361 141342 143060 144486 144780 144069 143211 142606 141989 141406 141578 142894 144653 145827 146177 146249 146619 147563 149168
57344 149168 151226 153141 154324 154643 154261 153332 152175 151384 151201 150978 149955 148519 147946 148698 149661 149444 147958
57327 147958 146244 145135 144607 144263 143942 143821 144235 145374 146975 148369 149017 148945 148499 147929 147471 147520 148296 149373
57309 149373 150004 149944 149632 149601 149980 150651 151528 152538 153579 154564 155404 155982 156390 157084 158483 160414 162293 163852
57291 163852 165321 166844 168165 169111 170023 171432 173483 175849 178028 179667 180803 181899 183419 185386 187568
57276A87568K432K864L083K900K994L963N059M917L462K104J904K476K903K918
57262B31547K760K692K954L643M236L962K923K157K274K734K936L160L839M606
57248B76423M834M577M199L616K729K168K646L768M388M108L609L491L580L549
57234C27685L508L706M137M666N203N603N715N715O024O801P735Q370Q450P972
57220D11290P224O709O720O987O957O510O054O011O401O919P260P420P829Q966
57206E09257J0533J1391J0773R407Q774R349J0169J0269R900R957J0719J1639
57194F32137J2206J2513J2958J3654J4290J4481J4158J3529J2853J2401J2468
57183G77648J3053J3504J2975J1453R906R099Q767Q360Q074Q411R097R293Q835
$$ plain form
57276 187568 190000 192864 195947 198847 201841 205804 210863 215780 219242 221346 223250 225726 228629 231547
57262 231547 234307 236999 239953 243596 247832 251794 254717 256874 259148 261882 264818 267978 271817 276423
57248 276423 281257 285834 290033 293649 296378 298546 301192 304960 309348 313456 317065 320556 324136 327685
57234 327685 331193 334899 339036 343702 348905 354508 360223 365938 371962 378763 386498 394868 403318 411290
57220 411290 418514 425223 431943 438930 445887 452397 458451 464462 470863 477782 485042 492462 500291 509257
57206 509257 519790 531181 541954 551361 560135 569484 579653 589922 599822 609779 620498 632137
57194 632137 644343 656856 669814 683468 697758 712239 726397 739926 752779 765180 777648
57183 777648 790701 804205 817180 828633 838539 847638 856405 864765 872839 881250 890347 899640 908475
57170I08475Q457Q732R435J0127J0686J1072J1106J0745J0209R704R387R587J0497
57157A038219J1690J2484J2859J3284J3643J3211J1989J1094J1354J2246J2917
57146A174990J3463J4437J5675J6497J6779J6990J7443J8134J9140K0379K1217
57135A365144K1147K0706K0920K1855K2592K2677K2720K3313K4159K4683K4804
57124A614720K4628K4007K2994K2275K2588K3925K5827K8286L1855L6951M3387
57113A921443N0558N7762O4431P0320P5587Q0701Q6536R4704J07339J26057J51316
57102B886754J83092K21950K68989L25163L91407M69504N61747O69144P90189
57093F767939R21599J059570J199836J337002J464863J577467J669401J734971
$$ plain form
57170 908475 916932 925664 935099 945226 955912 966984 978090 988835 999044 1008748 1018135 1027722 1038219
57157 1038219 1049909 1062393 1075252 1088536 1102179 1115390 1127379 1138473 1149827 1162073 1174990
57146 1174990 1188453 1202890 1218565 1235062 1251841 1268831 1286274 1304408 1323548 1343927 1365144
57135 1365144 1386291 1406997 1427917 1449772 1472364 1495041 1517761 1541074 1565233 1589916 1614720
57124 1614720 1639348 1663355 1686349 1708624 1731212 1755137 1780964 1809250 1841105 1878056 1921443
57113 1921443 1972001 2029763 2094194 2164514 2240101 2320802 2407338 2502042 2609381 2735438 2886754
57102 2886754 3069846 3291796 3560785 3885948 4277355 4746859 5308606 5977750 6767939
57093 6767939 7689538 8749108 9948944 11285946 12750809 14328276 15997677 17732648
57085A7732648J768134J764134J721147J639369J517582J350847J133225Q65001
57077B9492087N58436K35682q0716l76834o48615q96190j118174j310451j467800
57068B4387425j585054j657660j683154j663243j604448j516520j409837j293261
57060A1974248j173312j054596r40724q34472p37123o48402n67753m95471m32207
57051E090188l77786l31277k92052k60008k34617k14490j98149j84688j73437
57042B823684j63530j54161j44929j35614j26012j16175j06457r6925q7121p6705
57032A616055o5929n4957m3086k9453j4612j067P791R087J308j4946l6330n7346
57020A316515p2611p9385p8408p2575o4898n7247n0358m4431l9496l5390l1719
$$ plain form
57085 17732648 19500782 21264916 22986063 24625432 26143014 27493861 28627086 29492087
57077 29492087 30050523 30286205 30205489 29828655 29180040 28283850 27165676 25855225 24387425
57068 24387425 22802371 21144711 19461557 17798314 16193866 14677346 13267509 11974248
57060 11974248 10800936 9746340 8805616 7971144 7234021 6585619 6017866 5522395 5090188
57051 5090188 4712402 4381125 4089073 3829065 3594448 3379958 3181809 2997121 2823684
57042 2823684 2660154 2505993 2361064 2225450 2099438 1983263 1876806 1779881 1692760 1616055
57032 1616055 1550126 1495169 1452083 1422630 1408018 1406951 1414742 1423829 1425137 1410191 1373861 1316515
57020 1316515 1243904 1164519 1086111 1013536 948638 891391 841033 796602 757106 721716 689997
57009F89997k8133k4619k1456j8923j7114j5933j5068j4082j2738j1274j0154
56998E00503r576r336r206r196r314r337q990q230p146n747m083k479j328o53
56984D05882j44L29N67M07j05j157l262o493r851j1978j2429j1804j0714r243
56970C30005p506n978m908l935k728j562o70M91K619N375P701R277J0892J3018
56956C52091J4814J4936J2911R155M120j898q085j3017j5560j5718j4445j2784
56944C26520j1256r863q396o694m712k456R6K996O217R534J2601J5132J7061J8419
56930C65199J9116J8820J7015J3184P144m95q265j4615j8877k1339k2380k1969
56918C32538k0175j7664j5286j3368j1754j0299q985p733o572n804n635n694n405
$$ plain form
57009 689997 661864 637245 615789 596866 579752 563819 548751 534669 521931 510657 500503
56998 500503 490927 481591 472385 463189 453875 444538 435548 427318 420172 414425 410342 407863 406535 405882
56984 405882 405738 406067 406634 407041 406936 405779 402517 396024 386173 374195 361766 349962 339248 330005
56970 330005 322499 316521 311613 307678 304950 303388 302718 303209 305828 311203 318904 328181 339073 352091
56956 352091 366905 381841 394752 403907 408027 406129 398044 385027 369467 353749 339304 326520
56944 326520 315264 305401 297005 290311 285599 283143 283239 286235 292452 301986 314587 329719 346780 365199
56930 365199 384315 403135 420150 433334 440478 439983 431718 417103 398226 376887 354507 332538
56918 332538 312363 294699 279413 266045 254291 243992 235007 227274 220702 214898 209263 203569 198164
56905A98164m657l765k879j966j250j036j079o77M44J866L164M337N458O523P749
56890B10396R420J1162J2092J2057J2023J2722J3454J2902J0705P521L836l41
56878C27949m647p946r187q402o630n029m009l097j562P50L336N805Q406J1583
56864C07320J5285J9138K2988K6865L0401L2710L2861L0253K4681J6463O584l544
56852E62005j2559j9345k3108k3790k2257j9649j6395j2187o973j487L408P637
56840D15300J1885J6851K2677K9057L5653M2276M8614N3745N6047N3773M5878
56829H31756L2499J4971m368k2679l7436m7146n1437n0775m6334l9940l3467k7828
56817E17816k2592j6743r905k791L530Q691J3381J8644K4835L1228L6469L9218
$$ plain form
56905 198164 193507 189742 186863 184897 183647 182611 181532 180855 181299 183165 186329 190666 196124 202647 210396
56890 210396 219816 230978 243070 255127 267150 279872 293326 306228 316933 324454 328290 327949
56878 327949 323302 315356 306169 297767 291137 286108 282099 279002 277440 278190 281526 287331 295737 307320
56864 307320 322605 341743 364731 391596 421997 454707 487568 517821 542502 558965 565549 562005
56852 562005 549446 530101 506993 483203 460946 441297 424902 412715 405742 404255 407663 415300
56840 415300 427185 444036 466713 495770 531423 573699 622313 676058 732105 785878 831756
56829 831756 864255 879226 874858 852179 814743 767597 716160 665385 619051 579111 545644 517816
56817 517816 495224 478481 468576 465785 469315 478006 491387 510031 534866 566094 602563 641781
56805F41781L8447L3448K4027J0838m409j9252l1316l9210m2822m2847m0179l5803
56793D92703l0839k6166k1956j7876j3706r444m982k34M421Q313J1325J3989J6585
56780D22133J8572J9111J7568J3426O446k502j1441j8692k3914k7349k8735k7782
56768C56841k5231k2453k0156j8181j6385j4863j3354j1407r242p671o945o384
56756A84569n448m531m310m717m986m437l066j606j011j561k452k619j967j266
56742A40592r84q12m71k50m50q76j250j615j954j842r72K82J187J394J066N73
56726A33618L50P38J591K218K047J246M08j30m53o58o61l72J38O41Q81Q09O53
56709A43064O37O45M51K43M56J061J497J467J295J215Q58m6q69o98M03J348J338
$$ plain form
56805 641781 680228 713676 737703 748541 744132 724880 693564 654354 611532 568685 528506 492703
56793 492703 461864 435698 413742 395866 382160 372716 367734 367500 371921 380234 391559 405548 422133
56780 422133 440705 459816 477384 490810 497256 494754 483313 464621 440707 413358 384623 356841
56768 356841 331610 309157 289001 270820 254435 239572 226218 214811 205569 197898 190953 184569
56756 184569 179121 174590 170280 165563 160577 156140 153074 151468 150457 148896 146444 143825 141858 140592
56742 140592 139608 138796 138325 138075 137625 136749 135499 133884 131930 130088 129116 129398 130585 131979 133045 133618
56726 133618 133968 134706 136297 138515 140562 141808 142216 142086 141633 140975 140314 139942 140080 140721 141602 142411 143064
56709 143064 143701 144346 144797 145040 145496 146557 148054 149521 150816 152031 152889 152843 151974 151276 151679 153027 154365
56692A54365P01K66L06L99J83j66l16l95q51j639j975j243J16J071J275J184J082
56675A54363P29J16k01lJ07l57q40n22M38J198J432J500J594J546J450J647J988
56658A66185J924J462J348J900K397K106J331Q70Q37P34M33L16M70M01j97q72
56642A81645r99n67o0K18L25L72L46K92L27M46N52O54P60O13n7r07j164o96l26
56623A81774o62j103q08j60l05j331k010j584p69m54m02j3M16K34k57j52N38Q03
56605A73755J86n16m64Q1L24P2k13k03j9J02J11J21K68N67Q24P78M20nl32o09
56585A75248p66n45L0L61j20j102j549q37M66J220J005M90N48J205J778J845J707
56568A80984J790K028K174K358K939L815M422M453M317M705N921P702R395J0279
$$ plain form
56692 154365 155066 155332 155638 156037 156220 156054 155738 155343 154492 152853 150878 149635 149751 150822 152097 153281 154363
56675 154363 155092 155208 155007 155004 155111 154754 153914 153392 153830 155028 156460 157960 159554 161100 162550 164197 166185
56658 166185 168109 169571 170919 172819 175216 177322 178653 179523 180360 181094 181527 181843 182313 182714 182517 181645
56642 181645 180646 180079 180019 180237 180562 180934 181280 181572 181899 182345 182897 183551 184311 184924 184867 183960 182796 182100 181774
56623 181774 181112 180009 179201 179041 178736 177405 175395 173811 173042 172588 172186 172173 172589 172823 172566 172414 172952 173755
56605 173755 173941 173425 172961 173042 173366 173438 173225 173022 173003 173105 173216 173337 173605 174172 174996 175774 176194 176189 175857 175248
56585 175248 174482 173937 173967 174328 174208 173106 171557 170720 171186 172406 173411 173901 174449 175654 177432 179277 180984
56568 180984 182774 184802 186976 189334 192273 196088 200510 204963 209280 213985 219906 227608 237003 247282
56554B47282R998Q883P597O324M596K128m15j900j905j139o56q76j413j719j692
56539B75093j662j889k243k431k402k336k297k203k120k278k713l208l665m143
56525B39503m381l756k195o79k67q49j450j627j811k239k418j962j304j024j017
56510B12524q66o37o97r49q80l37K57M94L02k00p47q60l12L25J64q20j635j505
56492B03621p56j71k5j24l42n59m24K36R47J120Q96R37J378J596J080Q0p62j015
56474B07713o07K45R55Q84K8p69o39L84J470J874J505P73K09J74O31J086R83L00
56456B17199l36k58N64J451J658J005J9n61l92J89N53M61K77L75N55L94O2K46
56438B23461J010J383N89p02j128m47K59K78J61N68J074Q52J3n41l90NQ3k04n35
$$ plain form
56554 247282 257280 266163 273760 280084 284680 286808 286393 284493 282588 281449 280793 279917 278504 276785 275093
56539 275093 273431 271542 269299 266868 264466 262130 259833 257630 255510 253232 250519 247311 243646 239503
56525 239503 235122 231366 229171 228492 228225 227376 225926 224299 222488 220249 217831 215869 214565 213541 212524
56510 212524 211658 211021 210324 209375 208495 208158 208415 208909 209211 209011 208264 207404 207092 207417 207581 206761 205126 203621
56492 203621 202865 202694 202669 202545 202203 201644 201220 201456 202403 203523 204419 205356 206734 208330 209410 209490 208728 207713
56474 207713 207106 207351 208306 209190 209218 208449 207810 208194 209664 211538 213043 213816 214025 214199 214830 215916 216899 217199
56456 217199 216863 216605 217169 218620 220278 221283 221302 220741 220349 220538 221091 221552 221829 222204 222759 223153 223215 223461
56438 223461 224471 225854 226443 225741 224613 224166 224425 224703 224864 225432 226506 227358 227371 226830 226440 226445 226528 226324 225789
56419B25789n66j38N18Q91Q22P91J186J574J252L31l51l20J43O68J136J328R26
56402B35980J40k55J32Q00J047P87M41L33N12Q68J151J139Q86O46M53J94P2N10
56384B45836J373J841J464Q34Q17J335J514Q65j39o79m28K42O88O11L52N16J181
56367B58223J733J608J098R94J552K185K254J855J512J363J060M85R6K72O60P47
56351B77697P47J283K177K461J826J234J518K130K031J236N23J33k18l53K04J120
56335B95749J461J138J030J495J853J739J864K788L827M007L431K940K888K994
56321C29204L033K945K530J644O62J66K87O76J081J532K002K193J772Q44J36N37
56305C51244K143L925M710M418L875L591L370L040K852K994L354L876M494M757
$$ plain form
56419 225789 225223 225085 225603 226494 227316 228107 229293 230867 232119 232450 232099 231779 231922 232590 233726 235054 235980
56402 235980 236120 235865 235997 236797 237844 238631 239072 239405 239917 240785 241936 243075 243961 244607 245060 245254 245326 245836
56384 245836 247209 249050 250514 251348 252165 253500 255014 255879 255740 255061 254633 254875 255563 256174 256526 257042 258223
56367 258223 259956 261564 262662 263656 265208 267393 269647 271502 273014 274377 275437 275922 276018 276290 276950 277697
56351 277697 278444 279727 281904 284365 286191 287425 288943 291073 293104 294340 294863 294996 294778 294425 294629 295749
56335 295749 297210 298348 299378 300873 302726 304465 306329 309117 312944 316951 320382 323322 326210 329204
56321 329204 332237 335182 337712 339356 340018 340184 340471 341147 342228 343760 345762 347955 349727 350571 350707 351244
56305 351244 353387 357312 362022 366440 370315 373906 377276 380316 383168 386162 389516 393392 397886 402643
56291D02643M244L432L242L663L800L450L516M455N498O016O449P187P654P456
56277D72705P457Q471R768J0156R928J0379J1704J2751J2859J2759J3446J5034
56265F07417J6975J8814K0503K2345K4606K7034K9032L0615L2759L6269M0837
56254I07206M5724N0897N6854O3725P1369P9957Q9729J00350J11164J21945J32718
56243A831638J43103J52312J59735J65114J68337J69262J67352J61350J50114
56234C268317J34020J14689R2958O8223M0428J1455j6484m2739o7298q9163j07126
56223C407280j21417j32918j41379j46014j47305j46579j44100j39356j33005
56214B155207j26648j20618j13700j05346r6571q8332q0515p2982o6297o0809
$$ plain form
56291 402643 406887 410319 413561 417224 421024 424474 427990 432445 437943 443959 450408 457595 465249 472705
56277 472705 480162 488633 498401 508557 518485 528864 540568 553319 566178 578937 592383 607417
56265 607417 624392 643206 663709 686054 710660 737694 766726 797341 830100 866369 907206
56254 907206 952930 1003827 1060681 1124406 1195775 1275732 1365461 1465811 1576975 1698920 1831638
56243 1831638 1974741 2127053 2286788 2451902 2620239 2789501 2956853 3118203 3268317
56234 3268317 3402337 3517026 3609984 3678207 3718635 3730090 3713606 3670867 3603569 3514406 3407280
56223 3407280 3285863 3152945 3011566 2865552 2718247 2571668 2427568 2288212 2155207
56214 2155207 2028559 1907941 1794241 1688895 1592324 1503992 1423477 1350495 1284198 1223389
56204A223389n6178n2170m8838m5693m1808l7219l3045k9832k6891k3718k0967
56193H07030j9342j8473j7489j5989j4015j1751r613q062p030o103n315m936m622
56180F64290l754k653k342k904l222k649j839j537j562j435j035k85Q84J962K170
56165F44089J724J776K723L634L793L800M551N943P205P823P749P384P596Q984
56151G18774J0940J2258J2854J3842J5881J8544K1543K5217K9452L3488L7472
56140I50265M2812N0174N8137O4699O9101P1394P1209O8087O2401N5193M7486
56129A610958M0357L4947L1697L0029K9066K8142K6378K2671J6776R749K983k738
56117A881015p226j0929j5114k1060k8717l6992m5262n3391o0249o3812o3306
$$ plain form
56204 1223389 1167211 1115041 1066203 1020510 978702 941483 908438 878606 851715 827997 807030
56193 807030 787688 769215 751726 735737 721722 709971 700358 692296 685266 679163 673848 668912 664290
56180 664290 660536 657883 655541 652637 649415 646766 644927 643390 641828 640393 639358 639073 639957 641919 644089
56165 644089 645813 647589 650312 653946 657739 661539 666090 672033 679238 687061 694810 702194 709790 718774
56151 718774 729714 741972 754826 768668 784549 803093 824636 849853 879305 912793 950265
56140 950265 993077 1043251 1101388 1166087 1235188 1306582 1377791 1445878 1508279 1563472 1610958
56129 1610958 1651315 1686262 1717959 1747988 1777054 1805196 1831574 1854245 1871021 1880770 1883753 1881015
56117 1881015 1873789 1862860 1847746 1826686 1797969 1760977 1715715 1662324 1602075 1538263 1474957
56106A474957n9976n5244m9449m2871l6516l1025k6012k1237j7230j4120j1068
56095A110209p628m522k368p47P77J971K820L821M857N202N168O109Q075R313
56081A143057R028Q745R736J1000J1228J1102J1886J3208J3961J4197J4463J4427
56069A286038J3823J3618J4677J6194J7012J7468J8380J9289J9332J8984J9274
56058A474089K0041K0506K0809K1537K2510K3364K4453K5823K6363K5451K4431
56047A729377K4816K5982K6275K5597K5236K5802K6888K8138K9299K9866K9831
56036B027107L0094L1025L1690L1500L1306L1793L2344L2904L5116L9891M5366
56025B400136M9244N1705N4140N6561N8362O0187O2784O5333O7092O9343P3415
$$ plain form
56106 1474957 1414981 1359737 1310288 1267417 1230901 1199876 1173864 1152627 1135397 1121277 1110209
56095 1110209 1102581 1098059 1095691 1094944 1095721 1097692 1100512 1104333 1109190 1114392 1119560 1125669 1133744 1143057
56081 1143057 1152085 1160830 1170566 1181566 1192794 1203896 1215782 1228990 1242951 1257148 1271611 1286038
56069 1286038 1299861 1313479 1328156 1344350 1361362 1378830 1397210 1416499 1435831 1454815 1474089
56058 1474089 1494130 1514636 1535445 1556982 1579492 1602856 1627309 1653132 1679495 1704946 1729377
56047 1729377 1754193 1780175 1806450 1832047 1857283 1883085 1909973 1938111 1967410 1997276 2027107
56036 2027107 2057201 2088226 2119916 2151416 2182722 2214515 2246859 2279763 2314879 2354770 2400136
56025 2400136 2449380 2501085 2555225 2611786 2670148 2730335 2793119 2858452 2925544 2994887 3068302
56014C068302P8071Q1288Q3339Q5819Q8884R1944R5748J01154J07010J11811J16347
56003D109717J22170J28742J34686J40613J47893J55985J63759J72174J82647
55994E458386J94116K04736K15246K27610K41677K56299K72360K91415L12746
55985G674591L35018L59355L87333M17726M48877M82535N21539N65582O13328
55976A1805884O66678P28575P98724Q76257R64415J067753J187092J322709J480117
55967B0898204J666992J887302K145182K452244K824520L275385L819160M478198
55959D3447187N277808O238054P380807Q740784J0357281J2256726J4453019J6955381
55951A25107047J9753781K2793790K5969765K9099937L1817956L3434821L2961786
$$ plain form
56014 3068302 3146373 3227661 3311000 3396819 3485703 3577647 3673395 3774549 3881559 3993370 4109717
56003 4109717 4231887 4360629 4495315 4635928 4783821 4939806 5103565 5275739 5458386
55994 5458386 5652502 5857238 6072484 6300094 6541771 6798070 7070430 7361845 7674591
55985 7674591 8009609 8368964 8756297 9174023 9622900 10105435 10626974 11192556 11805884
55976 11805884 12472562 13201137 13999861 14876118 15840533 16908286 18095378 19418087 20898204
55967 20898204 22565196 24452498 26597680 29049924 31874444 35149829 38968989 43447187
55959 43447187 48724995 54963049 62343856 71084640 81441921 93698647 108151666 125107047
55951 125107047 144860828 167654618 193624383 222724320 254542276 287977097 320938883
55944C20938883K9418331K2310993J2013210j71095j2323723k2517061k9458377
55937C20211161l2839661l3208718l1512566k8663783k5345958k2008261j8908690
55930A27723524j6157291j3774124j1744378j0038504q611239p412517o404338
55923E3581133n559093m847281m239086l715225l265660k879242k543198k250570
55915B4281778j999197j783964j596761j432893j290980j167530j057359r58449
55907A2994645q71146p93616p22848o58829o03058n54151n09304m68604m33459
55898G379630m02253l72046l43289l18395k96756k75592k54740k36255k19959
55889D660345k03667j87372j73115j60951j48861j36697j26657j19857j15450
$$ plain form
55944 320938883 350357214 372668207 384681417 384510322 372186599 349669538 320211161
55937 320211161 287371500 254162782 222650216 193986433 168640475 146632214 127723524
55930 127723524 111566233 97792109 86047731 76009227 67397988 59985471 53581133
55923 53581133 48022040 43174759 38935673 35220448 31954788 29075546 26532348 24281778
55915 24281778 22282581 20498617 18901856 17468963 16177983 15010453 13953094 12994645
55907 12994645 12123499 11329883 10607035 9948206 9345148 8790997 8281693 7813089 7379630
55898 7379630 6977377 6605331 6262042 5943647 5646891 5371299 5116559 4880304 4660345
55889 4660345 4456678 4269306 4096191 3935240 3786379 3649682 3523025 3403168 3287718
55880C287718j12983j12474j12296j10011j05426j00247r5000q8872q2235p6616
55870B291558p2293o8412o5128o3203o1867n9570n6512n3926n1480m8042m4446
55859A646679m2632m2310m1390l9618l8846l9560l9968l9049l7807l6916l5575
55848A213008l3477l1807l1376l1454l1091l0150k8632k6459k4220k2791k2028
55837H99523k1079j9883j8990j8212j6929j5477j4646j4106j3016j1792j1489
55826G23904j1754j1293j0129r452r512r596r892j1233j3022j3647j3023j2629
55814E88722j2830j2356j0710q992p879o842n785n469n794n536m385l415l041
55801D95688k321q53N29J458K516L420K816P15q61o63J33J60n5M10J075J163J131
$$ plain form
55880 3287718 3174735 3062261 2949965 2839954 2734528 2634281 2539281 2450409 2368174 2291558
55870 2291558 2219265 2150853 2085725 2022522 1960655 1901085 1844573 1790647 1739167 1691125 1646679
55859 1646679 1604047 1561737 1520347 1480729 1441883 1402323 1362355 1323306 1285499 1248583 1213008
55848 1213008 1179531 1147724 1116348 1084894 1053803 1023653 995021 968562 944342 921551 899523
55837 899523 878444 858561 839571 821359 804430 788953 774307 760201 747185 735393 723904
55826 723904 712150 700857 690728 681276 671764 662168 652276 641043 628021 614374 601351 588722
55814 588722 575892 563536 552826 543834 535955 529113 523328 517859 512065 506529 502144 498729 495688
55801 495688 493367 492514 493043 494501 497017 500437 503253 503968 503107 502444 502577 502737 502682 503092 504167 505330 506461
55784E06461J558J684N44j327k780l937n850q757j1758j3883j4579j3611j1285
55771D22480q453n765l224p56J423L160M253L792P58m295r200j2369j4019j4781
55757C63004j4362j2504j0058q040o389m720l433l073l228l108k778k826l320
55744B85165l881m445n060n291m639l334k116j420j272j576j994j979j464j156
55730B45538j658k654l468m026m700n542o129o046n183l883k943l011l712l859
55716A88724k822j183J76J067J737K294K804L429M012M082L577L032K701K110
55702B15740Q73o82k145l633n263o572o968o389n187l846l074l384m250m415l468
55687A57337k376j953j690p41O61J646J939J859J608J299J183J192P71k09q75
$$ plain form
55784 506461 508019 509703 510247 508920 506140 502203 496353 487596 475838 461955 447376 433765 422480
55771 422480 414027 408262 405038 404282 405705 408865 413118 416910 417668 413373 404173 391804 377785 363004
55757 363004 348642 336138 326080 318040 311651 306931 303498 300425 297197 294089 291311 288485 285165
55744 285165 281284 276839 271779 266488 261849 258515 256399 254979 253707 252131 250137 248158 246694 245538
55730 245538 243880 241226 237758 233732 229032 223490 217361 211315 206132 202249 199306 196295 192583 188724
55716 188724 185902 184719 184895 185962 187699 189993 192797 196226 200238 204320 207897 210929 213630 215740
55702 215740 216613 215931 213786 210153 204890 198318 191350 184961 179774 175928 172854 169470 165220 160805 157337
55687 157337 154961 153008 151318 150577 151238 152884 154823 156682 158290 159589 160772 161964 162735 162526 161651
55672A61651m98L90P92O35N01M54J14l86n14l13l42p28j013q45j83J031K600L676
55654A67022L411K143J179J257J837J978J430O48J46M4K9k50p27r48o97k41R7
55637A78358K69J62n33j778k980l740m308m854m953m415l948m242m776m484l257
55622A30521j952j151p74p51j153j681j826j587j353j173q65o85j068j719j882
55607A10901j535j429j787j909j406r26j154j815k205k263k417k732k792k316
55593H4215j521q49n49m71k24L54R24J066Q51O98O83M91R7k9L51P47N54o1k97
55574H7030L78J694K921L574L741L877M367N229O143O612O179M717K607M81j265
55559A38285k574l349l408k951k664l026l780m350m454m086l300k430k082k377
$$ plain form
55672 161651 161153 161543 162335 162970 163471 163925 164039 163653 163139 162826 162484 161756 160743 159898 159715 160746 163346 167022
55654 167022 170433 172576 173755 175012 176849 178827 180257 180905 181051 181095 181124 180874 180147 179199 178502 178261 178358
55637 178358 178627 178789 178256 176478 173498 169758 165450 160596 155643 151228 147280 143038 138262 133778 130521
55622 130521 128569 127418 126644 125893 124740 123059 121233 119646 118293 117120 116255 115570 114502 112783 110901
55607 110901 109366 107937 106150 104241 102835 101909 100755 98940 96735 94472 92055 89323 86531 84215
55593 84215 82694 81845 81296 80825 80601 80955 81879 82945 83796 84494 85177 85668 85765 85736 86087 86834 87388 87327 87030
55574 87030 87408 89102 92023 95597 99338 103215 107582 112811 118954 125566 131745 136462 139069 139550 138285
55559 138285 135711 132362 128954 126003 123339 120313 116533 112183 107729 103643 100343 97913 95831 93454
55545I3454k561j922q13j16kRJ4l49r54j072m24L89Q01R24J012Q92L82j81k92
55526H9191J47Q22J334J332O86k27p52p32o96j186k091k899l178k747j743p99
55510G6462p06j488k173j872q67k46n86j379j717j267m91o2j37k88j01K87N12
55493F3881N58O48O82L32k67n44l68k43m65o13l06J47K99K74L23J76m97j256j321
55474F1440o95j10J14M41J145J723J530O06m74j199j388j167r54j128j555j661
55458E6668j216o51l83k02K57P69P99L44LJ45N05O41M54N6m73j010j298j218r39
55439E3251o51l05J68N52N57K26o0l4K22M07K85j05l92k22K78N48L22Q0M01J125
55419E6653J563J469J258J226J152Q36N55O18Q57Q85O78N30N53N22J32p20j781
$$ plain form
55545 93454 90893 88971 88158 88042 88040 88049 88063 87714 86760 85688 85264 85653 86454 87378 88390 89282 89664 89483 89191
55526 89191 89338 90160 91494 92826 93512 93285 92533 91801 91105 89919 87828 84929 81751 79004 77261 76462
55510 76462 75756 74268 72095 70223 69356 69110 68524 67145 65428 64161 63670 63608 63471 63183 63082 63369 63881
55493 63881 64439 65087 65769 66101 65834 65290 64922 64679 64214 63601 63295 63442 63741 64015 64338 64514 64017 62761 61440
55474 61440 60745 60635 60749 61190 62335 64058 65588 66194 65720 64521 63133 61966 61012 59884 58329 56668
55458 56668 55452 54801 54418 54216 54473 55242 56041 56385 56388 56533 57038 57679 58133 58189 57716 56706 55408 54190 53251
55439 53251 52600 52295 52463 53015 53572 53798 53738 53704 53926 54333 54618 54513 54121 53899 54177 54725 55047 55127 55528 56653
55419 56653 58216 59685 60943 62169 63321 64157 64712 65330 66187 67072 67750 68280 68833 69355 69487 68767 66986
55402F6986k492k386j661j043q64n78M20J722K156J167m55j428j296p47o61j083
55386E7757j254o51K69N93J05n10n74j91Q7qk92m13j23N73J301J637J571J397
55368F1274J121M14o35j397j530j466j572j517r83m12l09l29R2O20M96j03k70
55351E3494J90N22L44J35J90J00l58o59m04N0K60L67M97K41o62j601j752j108
55333D9846l08K70O79R96J258J531J636J096j21j193j302o68j42l7PJ98L36L81
55315E4463N50Q10Q26N23K14O4j35n16q81j022r09n34N8N18M90K35L62Q19P97
55296E6732K9n43k0J058J396P89K90O05J139J021K68n33j100j442j313n08N09
55279E8377Q76L97k20l03N4L77M23K24r7k94j03K84L05j73m46Q2R28J064L06n08
$$ plain form
55402 66986 64494 62108 60447 59404 58540 57962 58382 60104 62260 63427 62972 61544 60248 59501 58840 57757
55386 57757 56503 55852 56121 56714 56819 56309 55735 55544 55631 55623 55331 54918 54795 55368 56669 58306 59877 61274
55368 61274 62395 62809 62174 60777 59247 57781 56209 54692 53709 53297 52988 52659 52751 53371 53867 53764 53494
55351 53494 53684 54206 54550 54685 54875 54975 54617 53958 53554 53604 53864 54231 54728 54969 54307 52706 50954 49846
55333 49846 49538 49808 50487 51483 52741 54272 55908 57004 56883 55690 54388 53720 53578 53541 53548 53746 54082 54463
55315 54463 55013 55823 56649 57172 57386 57450 57315 56799 55918 54896 53987 53453 53511 54029 54519 54754 55116 55935 56732
55296 56732 56761 56218 56198 57256 58652 59441 59731 60336 61475 62496 62764 62231 61131 59689 58376 57868 58377
55279 58377 59253 59650 59430 59127 59181 59558 59981 60205 60108 59814 59711 59995 60300 60127 59681 59763 60691 61755 62061 61553
55259F1553o57k77J63N04P52P42L31k12l57J51R55J281O03p22j653j554q43l33
55241F0427j59N5K44q2q26j218r41o06p09q14l55L61O42M88M77Q16J148J180R34
55222F1062M88k8l05j53J03L0k61k79P4L65K54k21r05j628j984j538l27J066K064
55203E7877K435K161J356L34n92j397k085k286j623m61K44R0k93q8P17J437J492
55186E9318Q37j07p43p44l38J3K24N80J096J390J340J349J657J795J179k6j080
55169F7740j504j380r57m02P4K88K83K66L23L77M18N35P07P20L79k60q42r78o85
55150F5102m80p72j239j199o03r7Q2N25J512K208J743O50K19O50R14M13k39l52
55132F9037j24jP2K29J55l74q91q62m57j94j69k41n07q85o75N49J900J981P94
$$ plain form
55259 61553 60896 60619 60782 61286 62038 62780 63111 62899 62542 62693 63648 64929 65532 64810 63157 61603 60760 60427
55241 60427 60268 60323 60567 60485 59659 58441 57500 56894 56185 55371 55016 55377 56019 56507 56984 57800 58948 60128 61062
55222 61062 61550 61522 61217 61064 61167 61197 60936 60657 60731 61096 61350 61129 60224 58596 56612 55074 54747 55813 57877
55203 57877 60312 62473 63829 64163 63571 62174 60089 57803 56180 55719 55963 56053 55760 55672 56389 57826 59318
55186 59318 60155 60048 59305 58561 58223 58236 58460 59040 60136 61526 62866 64215 65872 67667 68846 68820 67740
55169 67740 66236 64856 63899 63497 63571 63859 64142 64408 64731 65108 65526 66061 66768 67488 67867 67607 66765 65787 65102
55150 65102 64622 63850 62611 61412 60809 60712 60794 61319 62831 65039 66782 67432 67651 68301 69215 69628 69389 69037
55132 69037 68913 68912 68984 69213 69368 68994 68103 67241 66784 66590 66421 66180 65673 64788 64113 64662 66562 68543 69337
55113F9337k62l07L6k5k02J51Q36J148R42O45M46J76j28k19j28k04n95j057j265
55094F9325j038l95L37O24L04o5J28O92J000J005J300K036K506K090J095K59j84
55077H1019m85p08o26k26J37J94J03J28K20N6m42q45o04K75J114J223O41M6k8
55058H1192K61L29r3n46l08P40J781J877J064K32j42n70j551k488k354j136J17
55041G8405O57O94O53N43K72L1m8j50l86o00p40r88j241j048l74J14rk61p4J79
55021G5629j92r87j322r10l61j58p8J82N44Q44J102J228R18J85l89k39N73J468
55003G8037J840J366J73j111j780j728j480j407j252o33L29J218J872K328K418
54988H0190J923J118O61P71Q59K91o95j176o72K24N27No18n72J45R09J143P01
$$ plain form
55113 69337 69075 68768 68804 68779 68577 68728 69564 70712 71654 72299 72745 72921 72793 72574 72446 72242 71647 70590 69325
55094 69325 68287 67892 68229 68853 69157 69092 69220 69912 70912 71917 73217 75253 77759 79849 80944 81203 81019
55077 81019 80534 79826 79200 78974 79111 79305 79408 79536 79756 79812 79370 78525 77921 78196 79310 80533 81174 81220 81192
55058 81192 81453 81782 81689 81143 80835 81575 83356 85233 86297 86529 86387 85817 84266 81778 79424 78288 78405
55041 78405 79062 79756 80409 80952 81224 81255 81207 81057 80671 80071 79331 78343 77102 76054 75680 75794 75785 75524 75450 75629
55021 75629 75437 74450 73128 72218 71857 71699 71621 71803 72347 73191 74293 75521 76439 76624 76235 75996 76569 78037
55003 78037 79877 81243 81416 80305 78525 76797 75317 73910 72658 72025 72354 73572 75444 77772 80190
54988 80190 82113 83231 83892 84663 85522 85813 85118 83942 83270 83494 84021 84026 83408 82836 82981 83890 85033 85734
54970H5734j53q70q92j91N63O71K47k5O7kn44r64n47M19R01N41J55N52J348J420
54950H8430L65r32j296m84O93J269R45K05k43j71k7l06p63o11L17J037N93n97
54932H8424j264j028p33r16q71J68J649K287J708P83M77R79J830K366K157J521
54916I9537J384K176L097L242L118L962N659O502N517L791K796K316J145q52k543
54901A40847l250l484l844m102l838l281l009l108l081k510j555p97p45j380k109
54886A00754k168j281J4P31K94q20j403o67R21K201K603K522K422K238J948K113
54870A12422L179M571N178M704L852L220K630J715N87l96j110j627k019k392k865
54855A31649l325l483l344l276l433l477l161k780k728k847k645k035j403j074
$$ plain form
54970 85734 85581 84711 83819 83628 84191 84862 85109 85084 85151 85149 84605 83641 83094 83513 84414 84955 85110 85662 87010 88430
54950 88430 88795 87863 86567 86083 86776 88045 88990 89195 88952 88781 88754 88448 87685 87074 87391 88428 89021 88424
54932 88424 87160 86132 85399 84483 83612 83780 85429 87716 89424 90207 90684 91663 93493 95859 98016 99537
54916 99537 100921 103097 106194 109436 112554 116516 122175 128677 134194 137985 140781 143097 144242 143390 140847
54901 140847 137597 134113 130269 126167 122329 119048 116039 112931 109850 107340 105785 104988 104243 102863 100754
54886 100754 98586 97305 97319 98050 98344 97524 96121 95454 96375 98576 101179 103701 106123 108361 110309 112422
54870 112422 115601 120172 125350 130054 133906 137126 139756 141471 142058 141662 140552 138925 136906 134514 131649
54855 131649 128324 124841 121497 118221 114788 111311 108150 105370 102642 99795 97150 95115 93712 92638
54841I2638j029j123j245j307j266j155q89l24L31M30l24j254j386o55J45N52
54825H2139Q39J173J099K87p93j361j151l79O24J352J188J15r68j208q13n47n04
54808H1092j53N75J076J043Q61Q35P12K81j70l60m70p08q05m33K16O70P95P86
54790H5843P47O53N13L44J23n8l4O1j18m69l26N73J484J554R42M28K44N3j59P3
54770I2471Q23J559J892K014K262K691L238L778L978L601L052L034L540L851L700
54755A35484L721M326M856M392K980J330k63k041l965n496o187o076n481m758
54741A22822m227l944l580k818j844j133q18o30l99k36j87j02O4J36P2Q8K92M92
54723A04048N66P98J428K080K026J145K57L13J412K887M133M951N180M595L424
$$ plain form
54841 92638 91609 90486 89241 87934 86668 85513 84624 84300 84631 85061 84737 83483 82097 81442 81587 82139
54825 82139 82978 84151 85250 85537 84744 83383 82232 81853 82477 83829 85017 85132 84164 82956 82143 81596 81092
54808 81092 80939 81514 82590 83633 84494 85329 86041 86322 86152 85792 85322 84614 83809 83376 83592 84262 85057 85843
54790 85843 86590 87243 87756 88100 88223 88165 88131 88192 88074 87605 87279 87852 89336 90890 91832 92260 92504 92557 92398 92471
54770 92471 93294 94853 96745 98759 101021 103712 106950 110728 114706 118307 121359 124393 127933 131784 135484
54755 135484 139205 143531 148387 152779 155759 157089 156826 154785 150820 145324 139137 133061 127580 122822
54741 122822 118595 114651 111071 108253 106409 105276 104458 103828 103429 103193 103006 102904 102968 103104 103176 103264 103556 104048
54723 104048 104614 105412 106840 108920 110946 112091 112348 112661 114073 116960 121093 126044 131224 135819 139243
54708A39243K459K130J810N77j428l119l890m246m750n069m585l446k394j779
54694A11513j327q67p13j164j973k475k188j248l10ml16o39m63J06N91O72L94
54677I9589Mj96m0K21M5p49j547j523n92M46P29J63o16r27o50j91J05K86M37K50
54657I5244n64j528j664p33L98Q66P82P08P12N42K80J82J21j67n16n17j95R5K46
54638I4292L01J05l56m57L62J499J678N87p85j540j699j446n88O90J384P64n64
54621I4227j390j260o26L8N20O37L78J80M82J034J134N86n2k19J1K05J70Q9K15
54602I6359N46Q32Q67P01M98K40j76o09p24m58j32l1j30l82q33j315j355p62L6
54583I3172N15O54P10O77M04M7k7K68O84R66R95O74M0n94q82q43p68p50o35l39
$$ plain form
54708 139243 141702 143832 145642 146219 144791 141672 137782 133536 128786 123717 119132 115686 113292 111513
54694 111513 110186 109319 108606 107442 105469 102994 100806 99558 99248 99244 98928 98289 97826 97932 98523 99195 99589
54677 99589 99593 99397 99357 99578 99623 98874 97327 95804 95212 95658 96387 96550 95934 95007 94357 94166 94271 94557 94994 95244
54657 95244 94680 93152 91488 90755 91153 92019 92801 93509 94221 94763 95043 95225 95346 95179 94663 94146 93951 94046 94292
54638 94292 94593 94698 94342 93885 94247 95746 97424 98011 97226 95686 93987 92541 91953 92643 94027 94791 94227
54621 94227 92837 91577 90951 90989 91509 92146 92524 92704 93186 94220 95354 95940 95888 95669 95680 95885 96055 96144 96359
54602 96359 96905 97737 98604 99305 99803 100043 99867 99258 98534 98076 97944 97913 97783 97401 96568 95253 93898 93136 93172
54583 93172 93687 94341 95051 95728 96132 96179 96152 96420 97104 98070 99065 99739 99779 99185 98303 97460 96692 95942 95307 94968
54563I4968p6j20m75p70n01M32J375J440N31m74p37l43J15M35Q34J315J550J316
54545A00815O78j62q11p27K57J494K065J763J128O17K55P6L23J003J676J892J614
54528A13956J083N15L7l35p14j147j444j439j290j261j223q04l3N65N17j92j180
54511A05611j835j586m82N98Q35M50K28K35j16p61p71J95J164J189O00K93L67
54494A06214K93q8n20j001j611j926j414l33M84P62R36J173J031L22l69m30PM10
54476A03940N90P35R27J045R70O69J70l47n43k30L86R34J250J397J410J223Q66
54459A15392N52L83J79k22n31k02P35J354Q21m52j196r06m28o65j369j695j516
54442A10234j354j349j113n81k24k42k04J89N68M48r9o46j000j196j231j080q20
$$ plain form
54563 94968 94892 94772 94297 93527 93026 93458 94833 96273 96804 96330 95593 95250 95365 95800 96634 97949 99499 100815
54545 100815 101493 101331 100520 99793 100050 101544 103609 105372 106500 107117 107372 107448 107771 108774 110450 112342 113956
54528 113956 115039 115554 115591 115256 114542 113395 111951 110512 109222 107961 106738 105934 105901 106466 106983 106791 105611
54511 105611 103776 102190 101708 102306 103141 103591 103819 104054 103938 103177 102406 102601 103765 104954 105554 105847 106214
54494 106214 106507 106419 105899 104898 103287 101361 99947 99614 100098 100860 101796 102969 104000 104322 103953 103523 103530 103940
54476 103940 104530 105265 106192 107237 108207 108876 109046 108699 108156 107926 108312 109246 110496 111893 113303 114526 115392
54459 115392 115944 116327 116506 116284 115753 115551 116286 117640 118461 118009 116813 115907 115479 114814 113445 111750 110234
54442 110234 108880 107531 106418 105837 105613 105371 105167 105356 105924 106372 106273 105627 104627 103431 102200 101120 100300
54425A00300m34K31J112J719J639J095P05P84J133J391J321Q62J96k19M4Q77J567
54408A14323J395L70o83q93k20N36P15N27N64Q87J076J015J001J091R83P04O94
54391A24085R51Q67L04N1N86J112P42M9K53J236J620P97l27q85j143j560j802
54374A26936j400o29jN11J028J155N68k08m77m27o78j038p03L88J305J423J083
54357A28836Q04N46K06P5L76Q42J224J805K828L803M016L536L100L012K757J821
54341A59587M15q44j642k124k504k851l122l229l091k765k496k492k601k434j872
54326A25935j253r48q63o41k59j34m83r36r62m67K59R27J341J263O31j83o96q87
54308A21644j070j234r64j40O98R82P21L07J0j33j73l01o99j121r00K00J434J833
$$ plain form
54425 100300 99866 100097 101209 102928 104567 105662 106367 107151 108284 109675 110996 111858 112054 111835 111879 112756 114323
54408 114323 115718 116088 115405 114512 114292 114828 115543 116070 116634 117521 118597 119612 120613 121704 122687 123391 124085
54391 124085 125036 125903 126207 126258 126844 127956 128698 128747 129000 130236 131856 132653 132326 131441 130298 128738 126936
54374 126936 125536 124907 124906 125417 126445 127600 128168 127960 127483 127056 126378 125340 124637 125025 126330 127753 128836
54357 128836 129640 130186 130392 130467 130843 131685 132909 134714 137542 141345 145361 148897 151997 155009 157766 159587
54341 159587 160002 159158 157516 155392 152888 150037 146915 143686 140595 137830 135334 132842 130241 127807 125935
54326 125935 124682 123734 122871 122230 121971 121837 121354 120418 119456 118989 119248 120175 121516 122779 123410 123227 122531 121644
54308 121644 120574 119340 118376 118236 118934 119916 120637 120944 120954 120821 120648 120347 119648 118527 117627 117827 119261 121094
54290A21094J375Q86R02J116R71M08j87l98n7O21J086Q89K19l04l55k16k50m11
54272A27389n02n28n92o18n14m28n60q21r29p36k74M11J203J755J754J335R88
54255A28333R58J016Q89O91O78P95O90J89m62q58q00l79J57N38N70K36k88p64
54237A32189j054j128j027q62p54o57l69J02L21j12q99j204o59J12K42l56j003
54220A22882j126o91J03J077J931K227J820J072M71J27j64n05p41p14n06l13j87
54203A26763L2M09O41L61l11p77o82l89m13p03q06n76k75l3J86J76l80j205j479
54184A20539q78l5L55M08N85P94O20J27j78j58j47k69j58M18J066J194P07O0k54
54165A24796q7L56P04N98q6j045j626j336m09L41M06J56J64K29k85j245j635r77
$$ plain form
54290 121094 122469 123355 124257 125373 126344 126752 126565 126167 126110 126731 127817 128706 128925 128621 128266 128050 127800 127389
54272 127389 126887 126359 125767 125149 124635 124207 123647 122826 121897 121161 120887 121298 122501 124256 126010 127345 128333
54255 128333 129291 130307 131196 131887 132565 133360 134050 134239 133777 132919 132119 131740 131897 132435 133005 133241 132953 132189
54237 132189 131135 130007 128980 128118 127364 126707 126338 126440 126761 126649 125750 124546 123887 123999 124241 123885 122882
54220 122882 121756 121065 121168 122245 124176 126403 128223 129295 129766 129893 129729 129224 128483 127769 127263 126950 126763
54203 126763 126795 127204 127845 128206 127895 127118 126436 126047 125634 124931 124125 123549 123274 123241 123427 123603 123223 122018 120539
54184 120539 119661 119626 119981 120389 120974 121768 122388 122515 122337 122179 122032 121763 121605 122023 123089 124283 124990 125050 124796
54165 124796 124709 125065 125769 126367 126281 125236 123610 122274 121865 122206 122612 122768 122932 123161 122876 121631 119996 119019
54147A19019r9L6l73m96j82N2N7J57L50K73lR4O45R74O36N9j35K4J18Oj60k54
54125A20798k20J2L85Q04J416K410L388L490K465J134L71N2m37j049j124m88J98
54108A33605K70j40l93r9N18Q99O99J52k13k48l86j005j775j961j262j04Q07J054
54090A30418P08K79L55J009J689J829J488J072O53L4o07p47k98J54K03K66R32
54073A39437J987K644K656K579K799K897K381J628J449J846J957J463J270K245
54059A69238L792M498L995L289L155L058K054J61j743k974l434l221k475j508
54045A77885o82j34J56J25j44j24P14K143L246L404L033L147M291N962P049O877
54029B16948N828M833M342M044L592L100K698K104J142K73P7M27P42Q59J026J065
$$ plain form
54147 119019 118920 118956 118583 118087 117905 117957 118014 118171 118521 118794 118791 118885 119530 120504 121140 121199 121064 121088 121206 121212 121052 120798
54125 120798 120578 120590 120975 121779 123195 125605 128993 132483 134948 136082 136453 136505 136068 135019 133895 133407 133605
54108 133605 133875 133735 133342 133243 133761 134660 135359 135511 135298 135050 134664 133659 131884 129923 128661 128557 129364 130418
54090 130418 131126 131405 131760 132769 134458 136287 137775 138847 139500 139534 138927 138180 137882 138036 138239 138505 139437
54073 139437 141424 144068 146724 149303 152102 154999 157380 159008 160457 162303 164260 165723 166993 169238
54059 169238 173030 177528 181523 184812 187967 191025 193079 193240 191497 188523 185089 181868 179393 177885
54045 177885 177203 177069 177225 177350 177206 177082 177796 179939 183185 186589 189622 192769 197060 203022 210071 216948
54029 216948 222776 227609 231951 235995 239587 242687 245385 247489 248631 248904 248981 249408 250150 251009 252035 253100
54013B53100L73j121k593l258l320l588m440n424n823n447m837m647m808m549
53999A99618l431k087j480j708k043j999j750j530j309j134j206j435j433j183
53985A75890j134j410j460p93L96J580K374K419J416k66j503j454m37O23J208
53970A77449J392J420J561J980K323J858N36n68m79L36O24K1o76p78m60k25l10
53953A86004o73j028r12k39L26J91m9P22K390L453L025K024J798K426L101L539
53937B06098M000M352M152L686L897N046O136O133N268M651M847N306N230M611
53923B73413M298N019O539P907Q510Q679R120J0028J1070J2040J3019J3778J3503
53910C96923J1480P892L746P2k626m309n148n420n464n619o051o517o367n160
$$ plain form
54013 253100 253473 252352 249759 246501 243181 239593 235153 229729 223906 218459 213622 208975 204167 199618
53999 199618 196187 194100 192620 190912 188869 186870 185120 183590 182281 181147 179941 178506 177073 175890
53985 175890 174756 173346 171886 171093 171489 173069 175443 177862 179278 179012 177509 176055 175618 176241 177449
53970 177449 178841 180261 181822 183802 186125 187983 188519 187951 187472 187808 188432 188453 187777 186999 186539 186314 186004
53953 186004 185331 184303 183391 183152 183478 183669 183620 184342 186732 190185 193210 195234 197032 199458 202559 206098
53937 206098 210098 214450 218602 222288 226185 231231 237367 243500 248768 253419 258266 263572 268802 273413
53923 273413 277711 282730 289269 297176 305686 314365 323485 333513 344583 356623 369642 383420 396923
53910 396923 408403 416295 420041 420113 417487 413178 408030 402610 397146 391527 385476 378959 372592 367432
53896C67432l466k663l533n285o497o816p092p829q405q164p557p408p585p221
53882B77911o128n100m776m887m881m679m494m350m161l966l788l454k804j964
53868B18479j231q51r61j504k164k616k910l284l635l566l039k423j864j211p41
53853A86479j183k490l370k744j189j48q7k84k01j04k79n53p01p28n66j11L87
53836A72128N12M11N94R42O75l51j109p44J62L70l14q82o21p0j72q97j098R8K051
53817A71685L134K555J262P06J077J433J245J035J294J757K076K532L528M813
53803B00132N773O128N902N103L927K997K854L331L882M294M678M891M561L598
53789B62051K358J242M44L5l7O1K17L91L22m25j806l074l588l569l600l705l531
$$ plain form
53896 367432 363966 361303 357770 352485 345988 339172 332080 324251 315846 307682 300125 292717 285132 277911
53882 277911 271783 266683 261907 257020 252139 247460 242966 238616 234455 230489 226701 223247 220443 218479
53868 218479 217248 216397 215436 213932 211768 209152 206242 202958 199323 195757 192718 190295 188431 187220 186479
53853 186479 185296 182806 179436 176692 175503 175355 175268 174984 174783 174679 174400 173847 173146 172418 171852 171741 172128
53836 172128 172640 173051 173645 174587 175262 174911 173802 173058 173220 173590 173276 172394 171773 171703 171531 170634 169536 169634 171685
53817 171685 174819 177374 178636 179342 180419 181852 183097 184132 185426 187183 189259 191791 195319 200132
53803 200132 205905 212033 217935 223038 226965 229962 232816 236147 240029 244323 249001 253892 258453 262051
53789 262051 264409 265651 266095 266130 266093 266154 266371 266762 267084 266659 264853 261779 258191 254622 251022 247317 243786
53772B43786l233l389m073m644m577m026l456l211l398l733l560k574j487j264
53758A97161j761j854j146n23p41j323j519j544k012k691k742k011j147n50l4
53743A75563M68O23L37P3J96N35Q32J099J253R02l9q13n72M88J342J495J555K090
53725A87427K565K025O77m9O93J982K338J669J192J571K081J933J492J555K004
53710B11155K124J925K157K992L566L187K198J376R74R27J357K258K993K851K047
53695B44087J574J996K920L662L929L734L132K328J665J199O40p7m67j49M44M60
53679B71077l23j333j998k331k562k607k274j682j225j111j195j196r98p25o90
53664B48827j156k005k615k309j071L53J150J155P95M91L60M37P45J006O48m64
$$ plain form
53772 243786 240553 237164 233091 228447 223870 219844 216388 213177 209779 206046 202486 199912 198425 197161
53758 197161 195400 193546 192400 191877 191136 189813 188294 186750 184738 182047 179305 177294 176147 175597 175563
53743 175563 176031 176654 176991 177064 177260 177795 178627 179726 180979 181881 181842 181029 180457 180945 182287 183782 185337 187427
53725 187427 189992 192017 192694 192645 193338 195320 197658 199327 200519 202090 204171 206104 207596 209151 211155
53710 211155 213279 215204 217361 220353 223919 227106 229304 230680 231654 232581 233938 236196 239189 242040 244087
53695 244087 245661 247657 250577 254239 258168 261902 265034 267362 269027 270226 270866 270789 270322 270173 270617 271077
53679 271077 270754 269421 267423 265092 262530 259923 257649 255967 254742 253631 252436 251240 250242 249517 248827
53664 248827 247671 245666 243051 240742 239671 240024 241174 242329 243124 243615 243975 244412 245157 246163 246811 246347
53648B46347j493j342RJ339J581R78N79Q80J495J952K199K319K208J829J449J378
53632B63707J590J804J805J608J418J497J906K318K349K012J756J902K344K834
53618B90850L284L662L958M401N318O497P043O356M994M085M007M173M088M036
53604C56752M472N229N656N405M723M049L522K903J921O14o67j559j947j979j961
53589C87133k255k966l677l808l331k840k675k488j980j553j593j586q57P1j1
53574C55584j177k124k040j616j665j825j474j052j319j881j647n20M96Q95J174
53559C39809J641J791J254N08R7j15l81l68K58J013J077M77J52P84K082L247L891
53542C57217M259M768N416N749N472M935M774N111N521N866O508P566Q481Q904
$$ plain form
53648 246347 244854 243512 243521 244860 246441 247419 247998 248878 250373 252325 254524 256843 259051 260880 262329 263707
53632 263707 265297 267101 268906 270514 271932 273429 275335 277653 280002 282014 283770 285672 288016 290850
53618 290850 294134 297796 301754 306155 311473 317970 325013 331369 336363 340448 344455 348628 352716 356752
53604 356752 361224 366453 372109 377514 382237 386286 389808 392711 394632 395246 394579 393020 391073 389094 387133
53589 387133 384878 381912 378235 374427 371096 368256 365581 363093 361113 359560 357967 356381 355524 355595 355584
53574 355584 354407 352283 350243 348627 346962 345137 343663 342611 341292 339411 337764 337244 337740 338635 339809
53559 339809 341450 343241 344495 345003 345100 344985 344604 344236 344494 345507 346584 347061 347213 347997 350079 353326 357217
53542 357217 361476 366244 371660 377409 382881 387816 392590 397701 403222 409088 415596 423162 431643 440547
53528D40547R387J0534J1895J2481J2291J2323J3038J3744J3802J3671J4192J5341
53516E93246J6344J6740J6857J7305J8425K0152K2098K3822K5180K6272K7005
53505H23446K7024K6299K5435K4984K4770K4329K3698K3260K2959K2383K1550
53494A090137K0998K0902K0738K0103J9341J8976J8928J8716J8182J7612J7352
53483A301985J7545J8085J8587J8626J8295J8119J8129J7393J5065J1623Q371
53472A481823N813L322M88k174m180n993q271j0718j2478j3443j4366j5706j7031
53459A387086j7722j7662j7093j6334j5947j6621j8420k0480k1815k2294k2442
53448A180256k2567k2517k2036k0984j9300j7285j5671j4788j3823j1618q327
$$ plain form
53528 440547 449934 460468 472363 484844 497135 509458 522496 536240 550042 563713 577905 593246
53516 593246 609590 626330 643187 660492 678917 699069 721167 744989 770169 796441 823446
53505 823446 850470 876769 902204 927188 951958 976287 999985 1023245 1046204 1068587 1090137
53494 1090137 1111135 1132037 1152775 1172878 1192219 1211195 1230123 1248839 1267021 1284633 1301985
53483 1301985 1319530 1337615 1356202 1374828 1393123 1411242 1429371 1446764 1461829 1473452 1481823
53472 1481823 1487636 1490958 1491446 1489272 1485092 1479099 1470828 1460110 1447632 1434189 1419823 1404117 1387086
53459 1387086 1369364 1351702 1334609 1318275 1302328 1285707 1267287 1246807 1224992 1202698 1180256
53448 1180256 1157689 1135172 1113136 1092152 1072852 1055567 1039896 1025108 1011285 999667 991340
53437I91340n449l967l260k308j160m06J27J082K298K943K980L435M945O962Q766
53422A008328J0485J2460J4312J5386J5764J6157J6942J8021J9383K1227K3412
53411A191877K5454K7161K8847L0776L2776L4598L6321L8135L9956M1535M2910
53400A570346M4533M6824M9658N2378N4455N6021N7560N9077N9956N9815N9101
53389B169724N8588N8432N8137N7202N5485N3158N0653M8478M6638M4437M1300
53378B742232L7542L3768K9721K4585J8387J2221O851J944l019p976j2961j8638
53366B864657k5317l2068l7761m2516m7173n1630n4831n6411n7195n7780n7703
53355B344272n6584n5140n4238n3400n1319m7755m4101m1845m1094m0919m0731
$$ plain form
53437 991340 985891 981924 978664 976356 975196 974790 974917 975999 978297 981240 984220 987655 992600 999562 1008328
53422 1008328 1018813 1031273 1045585 1060971 1076735 1092892 1109834 1127855 1147238 1168465 1191877
53411 1191877 1217331 1244492 1273339 1304115 1336891 1371489 1407810 1445945 1485901 1527436 1570346
53400 1570346 1614879 1661703 1711361 1763739 1818194 1874215 1931775 1990852 2050808 2110623 2169724
53389 2169724 2228312 2286744 2344881 2402083 2457568 2510726 2561379 2609857 2656495 2700932 2742232
53378 2742232 2779774 2813542 2843263 2867848 2886235 2898456 2905307 2907251 2904232 2896256 2883295 2864657
53366 2864657 2839340 2807272 2769511 2726995 2679822 2628192 2573361 2516950 2459755 2401975 2344272
53355 2344272 2287688 2232548 2178310 2124910 2073591 2025836 1981735 1939890 1898796 1857877 1817146
53344A817146m0724m1092m1349m0687l8784l6038l3126l0526k8473k6905k5375
53333A434067k3294k0552j7737j5509j3981j2955j2467j2719j3576j4587j5405
53322A261285j5792j5392j4063j2484j1749j2137j2756j2632j1527r553o711l377
53310A123112n88R13J580K289L087L541M044N611Q317J0936J2571J3737J5391
53297A204541J7622J9976K2320K4620K6366K7128K7454K8236K9322K9651K8864
53286A486100K7894K7492K6995K5160K1870J8329J5651J3720J1517Q293M268L16
53274A687605l000n939r070j2374j5195j7113j8477j9913k1628k3487k5381k7136
53262A488892k8275k8376k7710k7141k7254k7886k8567k9166k9857l0615l1009
$$ plain form
53344 1817146 1776422 1735330 1693981 1653294 1614510 1578472 1545346 1514820 1486347 1459442 1434067
53333 1434067 1410773 1390221 1372484 1356975 1342994 1330039 1317572 1304853 1291277 1276690 1261285
53322 1261285 1245493 1230101 1216038 1203554 1191805 1179668 1166912 1154280 1142753 1133200 1126489 1123112
53310 1123112 1122524 1123437 1125017 1127306 1130393 1133934 1137978 1143589 1151906 1162842 1175413 1189150 1204541
53297 1204541 1222163 1242139 1264459 1289079 1315445 1342573 1370027 1398263 1427585 1457236 1486100
53286 1486100 1513994 1541486 1568481 1593641 1615511 1633840 1649491 1663211 1674728 1683021 1687289 1687605
53274 1687605 1684605 1678666 1669596 1657222 1642027 1624914 1606437 1586524 1564896 1541409 1516028 1488892
53262 1488892 1460617 1432241 1404531 1377390 1350136 1322250 1293683 1264517 1234660 1204045 1173036
53251A173036l0570k9316k7806k6690k6237k6322k6649k6835k6403k5145k3492
53240H77571k2201k1453k0675j9444j8189j7553j7333j6670j5134j3177j1407
53229F84335r964q726p775p346p545q237r167j0103j0963j1844j2767j3551j4024
53216E52323j4307j4564j4670j4408j3859j3242j2425j1132r581q402p848p578
53204D10307p378p456p891q225q067p634p357p348p507p805q049p825p066o306
53190C04393n885n394m424l502l441m034m233l625k942k869l128l042k499j919
53176B53456j658j822k323k769k584j621n64l23j050k011k423k163j667j307j114
53161B28057r57q03o93n58l28j33k07n43q46r26q81p96n36q6K08Ko01j218j582
$$ plain form
53251 1173036 1142466 1113150 1085344 1058654 1032417 1006095 979446 952611 926208 901063 877571
53240 877571 855370 833917 813242 793798 775609 758056 740723 724053 708919 695742 684335
53229 684335 674371 665645 657870 650524 642979 634742 625575 615472 604509 592665 579898 566347 552323
53216 552323 538016 523452 508782 494374 480515 467273 454848 443716 434135 425733 417885 410307
53204 410307 402929 395473 387582 379357 371290 363656 356299 348951 341444 333639 325590 317765 310699 304393
53190 304393 298508 293114 288690 285188 281747 277713 273480 269855 266913 264044 260916 257874 255375 253456
53176 253456 251798 249976 247653 244884 242300 240679 240115 239792 238742 236731 234308 232145 230478 229171 228057
53161 228057 227100 226297 225604 225046 224718 224585 224378 223835 222989 222063 221182 220386 219850 219764 219972 219974 219373 218155 216573
53142B16573j478o35Q20K037K155J335N49L35L27N6l34m33k00R7K69L28L32K95
53124B22428R9m10j077j289o29M23R32O77L39L91M96J79m08p92p67l70L12R63
53106B21497J023K77q95k060l097l739l400j949k90N17L35k20o90r24p23p2N26
53089B06116O52O37R76J283P98k17n42L52J591K165K043J667J107L44j65N9O95
53072B19561Q56J13j067j838j756j087n19n09q89j206j305j310j183p76l50m29
53056B06306j061j645j759j555j191m79N06J094Q89M35M36O93N41J3j92J58M90
53039B03679L14j45l73j72K69N76M53Mj94J73N60J80q49j565j442r51o48m19j
53020A99449L24J45k94l13L41J265J954K194J939J236L79j52q6L71P40O93L24
$$ plain form
53142 216573 215095 214460 215280 217317 219472 220807 221356 221691 222018 222074 221740 221307 221107 221204 221473 221801 222133 222428
53124 222428 222527 222117 221040 219751 219122 219545 220477 221154 221493 221884 222380 222559 222151 221359 220592 220222 220534 221497
53106 221497 222520 222797 221902 219842 216745 213006 209606 207657 207367 207884 208219 207999 207309 206385 205662 205590 206116
53089 206116 206768 207405 208381 209664 210462 210245 209703 210055 211646 213811 215854 217521 218628 218972 218807 218866 219561
53072 219561 220417 220530 219463 217625 215869 214782 214263 213754 212865 211659 210354 209044 207861 207085 206735 206306
53056 206306 205245 203600 201841 200286 199095 198616 199122 200216 201105 201540 201976 202669 203210 203223 203031 203189 203679
53039 203679 203993 203848 203475 203303 203572 204148 204601 204605 204411 204584 205144 205324 204475 202910 201468 200517 199869 199450 199449
53020 199449 199773 199918 199624 199311 199652 200917 202871 205065 207004 208240 208619 208467 208381 208752 209492 210185 210509
53003B10509N2J82N47P02M93K49K93M69L64j00n84p48n55j28M51J086J543J543
52985B16368J031K93k67m63l69n1N66J363J846J574P53M9k27l76o61q09m32L78
52967B20566J156J588J749J910K279K753K843K128Q85q0m18n73r39j162q58m95
52951B33332q16j598j924j590j443k053k862l017k472j786j322j028p85m65J00
52936B10271Q50J347J179M44l96r60j193j304j588k010j944p52J102K121J445
52921B08612K7m32N07J664J772P17p17j740j979j498o90P5P59J386J593R23l62
52904B10617j276j205o50n15r23j168p18J53P68P88M22N7j00o3P4J72O5k36l73
52885B05889N3Q94J485J442J115R07N44m47j666j984r43N79J382J237Q18P21R76
$$ plain form
53003 210509 210561 210743 211290 211992 212485 212734 213027 213496 213860 213760 213176 212428 211873 211745 212196 213282 214825 216368
52985 216368 217399 217692 217425 216962 216593 216542 217108 218471 220317 221891 222644 222693 222466 222090 221429 220620 220188 220566
52967 220566 221722 223310 225059 226969 229248 232001 234844 236972 237857 237777 237359 236786 235847 234685 233827 233332
52951 233332 232516 230918 228994 227404 225961 223908 221046 218029 215557 213771 212449 211421 210636 210171 210271
52936 210271 211121 212468 213647 214091 213695 212735 211542 210238 208650 206640 204696 203944 205046 207167 208612
52921 208612 208639 208207 208714 210378 212150 212867 212150 210410 208431 206933 206243 206318 207077 208463 210056 210979 210617
52904 210617 209341 208136 207486 206971 206048 204880 204162 204315 205083 205871 206293 206350 206250 206187 206261 206433 206498 206262 205889
52885 205889 205942 206836 208321 209763 210878 211785 212329 211882 210216 208232 207289 207868 209250 210487 211305 212026 213002
52868B13002J332J592J610J233M48m82j052q72j73K22k38j091j377r15m72n36
52852B12231o22j79M84P47O36M86R4q72j882j976j267r82j702k523k477j935j857
52835A96404k256k282j585p03j35K07N58Q47Q90O27N4p36j389j501j123o69l31
52818A86877L5L70L06k02n86l49L31J000J541K015K199J835J147O38M32K37j10
52801A97716m65p35r68j105j007q13q51j107j182q29k38K88N99N66J34l83m78
52784A89142q8L11M29N00P39R48R51R48J072J039O59K79K37L41L38M82Q82Q22
52766B00031m04k147k846j969o18n7l67q86j201j299j153p14j16L56M71J25m91
52749A86715q50n74N3N00P96J394K180K374J703R14P58J039J165J107J252J707
$$ plain form
52868 213002 214334 215926 217536 218769 219217 218735 217683 216811 216638 216860 216622 215531 214154 213239 212767 212231
52852 212231 211609 211430 211914 212661 213297 213783 213877 213005 211123 209147 207880 206898 205196 202673 200196 198261 196404
52835 196404 194148 191866 190281 189578 189443 189650 190208 191055 191945 192572 192626 191890 190501 189000 187877 187208 186877
52818 186877 186912 187282 187588 187386 186800 186451 186782 187782 189323 191338 193537 195372 196519 197157 197589 197826 197716
52801 197716 197251 196516 195548 194443 193436 192623 191772 190665 189483 188654 188416 188704 189303 189869 190003 189620 189142
52784 189142 189054 189365 189794 190294 191033 191981 192932 193880 194952 195991 196650 196929 197166 197507 197845 198327 199209 200031
52766 200031 199627 197480 194634 192665 192047 191990 191623 190737 189536 188237 187084 186370 186254 186610 187081 187206 186715
52749 186715 185865 185291 185344 185844 186640 188034 190214 192588 194291 195205 195963 197002 198167 199274 200526 202233
52733B02233K271K754K932K490J498O45M92P73Q43N12k3o77j344j601j172n51
52717B12075m75q83j028n51J30N38O33N22J52m76j126j493j414r23l21J5M8J39
52699B05562M65P17P12Q50J385J736J245L14j15k4k44r34j194m92M97Q82N96P8
52681B12036m53q54q81o24n65p58n36M22J326J226L42l21l18j20k06m82o43n80
52663B08011l53m9K79N86P39M03n58j497j359QJ416J741J291J184J682J939J350
52646B16813L62k23k40j96n77j268j608j068L2P35N37l5k25QK70N34J029J594
52628B16474J860J951K307K903L306L553M123M947N107L893J609r31l148m660
52614B43294n102m434l138j821q97o53j119j641j291o8Q77P28R2m1K29R8m20m36
$$ plain form
52733 202233 204504 207258 210190 212680 214178 214823 215315 216088 216931 217443 217420 216743 215399 213798 212626 212075
52717 212075 211600 210717 209689 209138 209268 209806 210439 210961 211113 210637 209511 208018 206604 205681 205360 205375 205423 205562
52699 205562 206027 206744 207456 208306 209691 211427 212672 212986 212871 212847 212603 211669 210475 209983 210480 211362 211958 212036
52681 212036 211583 210729 209848 209224 208659 207901 207365 207787 209113 210339 210681 210360 210042 209922 209716 209234 208591 208011
52663 208011 207658 207609 207888 208474 209213 209616 209058 207561 206202 206210 207626 209367 210658 211842 213524 215463 216813
52646 216813 217175 216952 216712 216516 215939 214671 213063 211995 212027 212762 213299 213264 213039 213047 213317 213851 214880 216474
52628 216474 218334 220285 222592 225495 228801 232354 236477 241424 246531 250424 252033 251102 247954 243294
52614 243294 238192 233758 230620 228799 227902 227249 226130 224489 223198 223130 224007 224735 224827 224786 225015 225113 224693 224257
52596B24257L80J256J423R84M33j1k71k22q0l84j150j542r33J03M89R2k89j97
52578B24338L1J10L10P11P50P9o45n51J87N65J91k97l12j50l74r01j164q74j94
52559B21810O07J278J481J033K00n17q92j025r49o00r8K43K81J61ok50n21n97
52541B21639m25k77l91o15o24l28O8K93K04j29l79j63N00J090J148Q38P05Q85
52523B24039Q84K64p32j437j487j065n23k9L38M81M01L63O92J450K392L169L452
52506B32652L093K362J884J958K094J634P29J45pn64k002l451l695k727j583r22
52490B31600n00l9K52J56k07o89j244j540j072N7J015J236J028Q71O29K4n39l72
52472B30666M57J078R01K47j45N2N57Q60P26M74O73J488K391K767K624K411K311
$$ plain form
52596 224257 224637 225893 227316 228300 228733 228722 228451 228229 228149 227765 226615 225073 224140 224243 224732 224824 224535 224338
52578 224338 224369 224479 224789 225500 226250 226329 225684 225133 225320 225885 226076 225779 225467 225317 224943 224042 222878 222004 221810
52559 221810 222417 223695 225176 226209 226409 225892 225000 223975 223026 222426 222328 222571 222852 223013 223007 222757 222236 221639
52541 221639 221214 220937 220546 219931 219307 218979 219047 219340 219544 219415 219036 218873 219373 220463 221611 222449 223154 224039
52523 224039 224923 225187 224455 223018 221531 220466 219943 219914 220252 220733 221134 221497 222189 223639 226031 229200 232652
52506 232652 235745 238107 239991 241949 244043 245677 246406 246551 246544 245980 243978 240527 236832 234105 232522 231600
52490 231600 231100 231061 231313 231469 231262 230573 229329 227789 226717 226774 227789 229025 230053 230924 231553 231577 231038 230666
52472 230666 231123 232201 233102 233349 233204 233256 233813 234673 235399 235873 236546 238034 240425 243192 245816 248227 250538
52455B50538K113J738J419J188N65q46k603l601l178j959j338k017l214l576k727
52440B32502j538q06k82O34J703J955R17p62j969k054j148J15J005J171Q32M88
52424B32763M49P57J306J783J635N74r10j830j632n87O24J406J442R25O44J325
52408B40674K712L806M194M626N885P611Q729Q740P922O520M424J751q43k790
52394C03961m157n304o252o642o181m923l208j549m57j07j80k04q8p5j51R8Q65
52377B65446J631J751J359J228J679K218K397K555L296M513N422N508N034M637
52363C08674M635M809M664L901K721J550M93o29j622j833j062p2M12P21J579K749
52347C31690L251K860K370K318K421K570L270M655N863O169O022O287O981P605
$$ plain form
52455 250538 252651 254389 255808 256996 257561 256715 254112 250511 247333 245374 244036 242019 238805 235229 232502
52440 232502 230964 230158 229876 230510 232213 234168 235085 234323 232354 230300 229152 229267 230272 231443 232275 232763
52424 232763 233212 233969 235275 237058 238693 239267 238357 236527 234895 234308 234932 236338 237780 238705 239349 240674
52408 240674 243386 247192 251386 256012 261897 269508 278237 286977 294899 301419 305843 307594 306751 303961
52394 303961 299804 294500 288248 281606 275425 270502 267294 265745 265288 265181 265001 264797 264709 264634 264483 264581 265446
52377 265446 267077 268828 270187 271415 273094 275312 277709 280264 283560 288073 293495 299003 304037 308674
52363 308674 313309 318118 322782 326683 329404 330954 331447 330818 329196 327363 326301 326229 326641 327362 328941 331690
52347 331690 334941 337801 340171 342489 344910 347480 350750 355405 361268 367437 373459 379746 386727 394332
52333C94332Q216R321J0919J2455J3661J4785J6062J7505J9103K0660K1642K1801
52321E80462K1809K2569K3940K4900K5004K4916K5260K5607K4983K3039K0423
52310H42912J8237J7206J7077J6767J5409J3306J1485J0448R802R011P905O438
52298I96003M627K869J741J243P29k37j574l277n563q073r715r891r352r239r722
52283I40569j0076r663q312o147l645j433M52K710N632Q350R990J1051J2660J4735
52269I66873J6067J6172J5923J6117J6471J6477J6253J5988J5275J3837J2335
52258A137788J1607J1366J0456Q367N887M115L308K881K180J041k50j377k390
52245A194979l681n568p983j0632j3234j5467j6858j7091j6483j5833j5650j5653
$$ plain form
52333 394332 402548 411869 422788 435243 448904 463689 479751 497256 516359 537019 558661 580462
52321 580462 602271 624840 648780 673680 698684 723600 748860 774467 799450 822489 842912
52310 842912 861149 878355 895432 912199 927608 940914 952399 962847 972649 981660 989565 996003
52298 996003 1000630 1003499 1005240 1006483 1007212 1006975 1005401 1002124 996561 988488 978773 968882 959530 950291 940569
52283 940569 930493 920830 912518 906371 902726 901293 901745 904455 910087 918437 928427 939478 952138 966873
52269 966873 982940 999112 1015035 1031152 1047623 1064100 1080353 1096341 1111616 1125453 1137788
52258 1137788 1149395 1160761 1171217 1179584 1185471 1189586 1192894 1195775 1197955 1198996 1198746 1197369 1194979
52245 1194979 1191298 1185730 1177747 1167115 1153881 1138414 1121556 1104465 1087982 1072149 1056499 1040846
52233A040846j5183j4010j2529j1182r884q236o284m734m267m639m791l934k400
52220I38773j211r12j049q33j29M81N51M35R27K392M374N993O596O188N467N308
52204I73351N863O286N681M333L422L464L723L413K873K829L128L041K552K387
52190A026346K727K823K193J417J255J585J735J478J153R27N33l28j592k914l974
52175A035364m766n625o802p943q299p627o581n881n401m483l012j695j201j362
52161I64686j421q85M7Q33J285J777K665L669M090L672K924K438K203J789J018
52146I90790J08o06q06k40J043K446L206L061K511K366L117M596O130P149P756
52131A032627Q551R828J1293J2766J4689J7436K0443K2690K3985K5171K6938K9060
$$ plain form
52233 1040846 1025663 1011653 999124 987942 978058 969822 963538 958804 954537 949898 945107 941173 938773
52220 938773 937562 936650 935601 934768 934639 935120 935671 936106 937033 939425 943799 949792 956388 962576 968043 973351
52204 973351 979214 985500 991181 995514 998936 1002400 1006123 1009536 1012409 1015238 1018366 1021407 1023959 1026346
52190 1026346 1029073 1031896 1034089 1035506 1036761 1038346 1040081 1041559 1042712 1043639 1044172 1043844 1042252 1039338 1035364
52175 1035364 1030598 1024973 1018171 1010228 1001929 994302 987721 981840 976439 971956 968944 967249 966048 964686
52161 964686 963265 962380 962427 963260 964545 966322 968987 972656 976746 980418 983342 985780 987983 989772 990790
52146 990790 990898 990292 989486 989246 990289 992735 995941 999002 1001513 1003879 1006996 1011592 1017722 1024871 1032627
52131 1032627 1041178 1051006 1062299 1075065 1089754 1107190 1127633 1150323 1174308 1199479 1226417 1255477
52119A255477L0906L2175L2780L2514L1352K9809K8494K7384K5902K3696K1025
52108A571514J8250J5272J1709P527L298k56k919n131p346r388j0617j0749j0349
52095A570815j0329j1004j1873j2302j2235j2136j2309j2568j2573j2355j2241
52084A438890j2398j2608j2550j1985j0680q411n244j643J894N146P996J0190
52072A388597J1560J2398J3274J4532J6049J7506J8646J9304J9395J8834J7586
52061A567681J5869J4281J3308J2492J0635P268L522Q80o58k415n126q084j0311
52048A619342j1767j3048j4526j6249j8161j9927k1012k1416k2016k3572k5704
52037A411944k7291k7735k7265k6223k4675k2755k0834j9165j7637j6006j4155
$$ plain form
52119 1255477 1286383 1318558 1351338 1383852 1415204 1445013 1473507 1500891 1526793 1550489 1571514
52108 1571514 1589764 1605036 1616745 1624272 1627570 1627314 1624395 1619264 1611918 1602530 1591913 1581164 1570815
52095 1570815 1560486 1549482 1537609 1525307 1513072 1500936 1488627 1476059 1463486 1451131 1438890
52084 1438890 1426492 1413884 1401334 1389349 1378669 1370258 1365014 1363371 1365265 1370411 1378407 1388597
52072 1388597 1400157 1412555 1425829 1440361 1456410 1473916 1492562 1511866 1531261 1550095 1567681
52061 1567681 1583550 1597831 1611139 1623631 1634266 1641534 1645056 1645936 1645278 1642863 1637737 1629653 1619342
52048 1619342 1607575 1594527 1580001 1563752 1545591 1525664 1504652 1483236 1461220 1437648 1411944
52037 1411944 1384653 1356918 1329653 1303430 1278755 1256000 1235166 1216001 1198364 1182358 1168203
52026A168203j2192j0513r636r668j0067j0282j0451j1032j1842j2149j1769j1463
52014A037139j1888j2741j3291j3346j3190j2952j2663j2721j3637j5205j6529
52003H88976j7063j7174j7370j7488j7068j6223j5606j5541j5744j5860j5780
$$ plain form
52026 1168203 1156011 1145498 1135862 1126194 1116127 1105845 1095394 1084362 1072520 1060371 1048602 1037139
52014 1037139 1025251 1012510 999219 985873 972683 959731 947068 934347 920710 905505 888976
52003 888976 871913 854739 837369 819881 802813 786590 770984 755443 739699 723839 708059
$$ [...]
##END NTUPLES=NMR SPECTRUM
##END=
