##TITLE=AC1533_ROEFFECT0009_8214086_iX1p2NjASO
##JCAMPDX= 6.0         $$ Bruker NMR JCAMP-DX V2.0
##DATA TYPE= NMR SPECTRUM
##DATA CLASS= NTUPLES
##ORIGIN= BRUKER
##OWNER= Administrator
$$ 1.72 TOPSPIN		Version 2.1
$$ 2014-07-31 19:36:57.475 -0700  Administrator@X
$$ Compression mode = diff/dup
##.OBSERVE FREQUENCY= 400.02188249412
##.OBSERVE NUCLEUS= ^1H
##.ACQUISITION MODE= SIMULTANEOUS (DQD)
##.ACQUISITION SCHEME= undefined
##.AVERAGES= 8
##.DIGITISER RES= 22
##SPECTROMETER/DATA SYSTEM= spect
##.PULSE SEQUENCE= zg30
##.SOLVENT NAME= COFFEE_meoh
##.SHIFT REFERENCE= INTERNAL, COFFEE_meoh, 1, 14.98509
##AUDIT TRAIL= $$ (NUMBER, WHEN, WHO, WHERE, PROCESS, VERSION, WHAT)
$$ ##TITLE= Audit trail, TOPSPIN		Version 2.1
$$ ##JCAMPDX= 5.01
$$ ##ORIGIN= Bruker BioSpin GmbH
$$ ##OWNER= Administrator
$$ $$ E:\/data/COFFEE/nmr/AC1533_ROEFFECT0009_8214086_iX1p2NjASO/20/pdata/1/auditp.txt
$$ ##AUDIT TRAIL=  $$ (NUMBER, WHEN, WHO, WHERE, PROCESS, VERSION, WHAT)
(   1,<2014-07-31 19:36:50.616 -0700>,<Administrator>,<X>,<go>,<TOPSPIN 2.1>,
      <created by zg
	started at 2014-07-31 19:35:35.455 -0700,
	POWCHK enabled, PULCHK disabled,
       configuration hash MD5:
       16 EA D6 F4 BB 67 03 14 9B FF E7 A0 43 5B 48 2E
       data hash MD5: 64K
       F1 D8 60 10 21 79 02 9A 32 CF 2F 1E D3 D6 84 7C>)
(   2,<2014-07-31 19:36:53.585 -0700>,<Administrator>,<X>,<proc1d>,<TOPSPIN 2.1>,
      <Start of raw data processing
       efp LB = 0 FT_mod = 6 PKNL = 1 PHC0 = 0 PHC1 = 0 SI = 32K 
       data hash MD5: 32K
       97 61 66 57 10 0C 0B 95 16 74 63 1C A8 EB 5A ED>)
(   3,<2014-07-31 19:36:53.929 -0700>,<Administrator>,<X>,<proc1d>,<TOPSPIN 2.1>,
      <pk PHC0 = 92.4884 PHC1 = 0 
       data hash MD5: 32K
       20 C2 8E 5C 7A CC 8B 42 66 4E 11 15 44 3C 01 09>)
(   4,<2014-07-31 19:36:54.022 -0700>,<Administrator>,<X>,<proc1d>,<TOPSPIN 2.1>,
      <abs ABSG = 1 
       data hash MD5: 32K
       D3 86 D0 6B A1 DD EA D5 53 26 C1 B3 D4 57 8B BF>)
(   5,<2014-07-31 19:36:54.100 -0700>,<Administrator>,<X>,<proc1d>,<TOPSPIN 2.1>,
      <abs ABSG = 2 
       data hash MD5: 32K
       08 40 32 25 20 CB 76 09 2A 14 C1 EC 0C 0D 27 19>)
(   6,<2014-07-31 19:36:54.210 -0700>,<Administrator>,<X>,<proc1d>,<TOPSPIN 2.1>,
      <abs ABSG = 3 
       data hash MD5: 32K
       81 F2 B6 01 72 D9 21 4F A9 2A FE 17 68 7A 53 7D>)
(   7,<2014-07-31 19:36:54.272 -0700>,<Administrator>,<X>,<proc1d>,<TOPSPIN 2.1>,
      <abs ABSG = 4 
       data hash MD5: 32K
       F2 3F 2D 04 7C 07 2B 25 E2 CB A2 CA 27 D5 9A E0>)
(   8,<2014-07-31 19:36:54.350 -0700>,<Administrator>,<X>,<proc1d>,<TOPSPIN 2.1>,
      <abs ABSG = 5 
       data hash MD5: 32K
       FA 86 B0 DA 05 74 FC E5 E8 B4 2C B1 9F BE D4 DD>)
$$ ##END=
$$ 
$$ $$ hash MD5
$$ $$ 88 09 F1 7D 5D 1D 98 58 CB 9F E5 CD 6C 81 A9 15
##$RELAX= 
##$RELAX= 
##$RELAX= 
##$RELAX= 
##$RELAX= 
##$RELAX= 
##$RELAX= 
$$ Bruker specific parameters
$$ --------------------------
##$DU= <E:\>
##$EXPNO= 20
##$NAME= <AC1533_ROEFFECT0009_8214086_iX1p2NjASO>
$$ [...]
##$TP= (0..7)
150 150 150 150 150 150 150 150
##$TP07= 0
##$TPNAME0= <>
##$TPNAME1= <>
##$TPNAME2= <>
##$TPNAME3= <>
##$TPNAME4= <>
##$TPNAME5= <>
##$TPNAME6= <>
##$TPNAME7= <>
##$TPOAL= (0..7)
0.5 0.5 0.5 0.5 0.5 0.5 0.5 0.5
##$TPOFFS= (0..7)
0 0 0 0 0 0 0 0
##$TUNHIN= 0
##$TUNHOUT= 0
##$TUNXOUT= 0
##$USERA1= <user>
##$USERA2= <user>
##$USERA3= <user>
##$USERA4= <user>
##$USERA5= <user>
##$V9= 5
##$VALIST= <valist>
##$VCLIST= <CCCCCCCCCCCCCCC>
##$VD= 0
##$VDLIST= <DDDDDDDDDDDDDDD>
##$VPLIST= <PPPPPPPPPPPPPPP>
##$VTLIST= <TTTTTTTTTTTTTTT>
##$WBST= 1024
##$WBSW= 4
##$XGAIN= (0..3)
0 0 0 0
##$XL= 0
##$YL= 0
##$YMAX_a= 651785
##$YMIN_a= -555917
##$ZGOPTNS= <>
##$ZL1= 120
##$ZL2= 120
##$ZL3= 120
##$ZL4= 120
##$ABSF1= 14.98509
##$ABSF2= -5.573092
##$ABSG= 5
##$ABSL= 3
##$ALPHA= 0
##$AQORDER= 0
##$ASSFAC= 0
##$ASSFACI= 0
##$ASSFACX= 0
##$ASSWID= 0
##$AUNMP= <proc_prof1d_extract_pilot.lims>
##$AXLEFT= 0
##$AXNAME= <>
##$AXNUC= <1H>
##$AXRIGHT= 0
##$AXTYPE= 0
##$AXUNIT= <>
##$AZFE= 0.1
##$AZFW= 0.1
##$BCFW= 0
##$BC_mod= 0
##$BYTORDP= 0
##$COROFFS= 0
##$CY= 15
##$DATMOD= 1
##$DC= 0
##$DFILT= <>
##$DTYPP= 0
##$F1P= 0
##$F2P= 0
##$FCOR= 0.5
##$FTSIZE= 32768
##$FT_mod= 6
##$GAMMA= 0
##$GB= 0
##$INTBC= 1
##$INTSCL= 1
##$ISEN= 128
##$LB= 0
##$LEV0= 0
##$LPBIN= 0
##$MAXI= 10000
##$MC2= 0
##$MEAN= 0
##$ME_mod= 0
##$MI= 0
##$NCOEF= 0
##$NC_proc= -8
##$NLEV= 6
##$NOISF1= 0
##$NOISF2= 0
##$NSP= 0
##$NTH_PI= 0
##$NZP= 0
##$OFFSET= 14.98509
##$PC= 1
##$PHC0= 92.4884
##$PHC1= 0
##$PH_mod= 1
##$PKNL= yes
##$PPARMOD= 0
##$PPDIAG= 0
##$PPIPTYP= 0
##$PPMPNUM= 2147483647
##$PPRESOL= 1
##$PSCAL= 4
##$PSIGN= 0
##$PYNMP= <proc.py>
##$REVERSE= no
##$SF= 400.02
##$SI= 32768
##$SIGF1= 0
##$SIGF2= 0
##$SINO= 400
##$SIOLD= 32768
##$SPECTYP= <>
##$SREGLST= <1H.CDCl3>
##$SSB= 0
##$STSI= 32768
##$STSR= 0
##$SW_p= 8223.68421052631
##$SYMM= 0
##$S_DEV= 0
##$TDeff= 65536
##$TDoff= 0
##$TI= <>
##$TILT= no
##$TM1= 0
##$TM2= 0
##$TOPLEV= 0
##$USERP1= <user>
##$USERP2= <user>
##$USERP3= <user>
##$USERP4= <user>
##$USERP5= <user>
##$WDW= 1
##$XDIM= 32768
##$YMAX_p= 467057919
##$YMIN_p= -678970
##$CURPLOT= <Network HP LaserJet P1505>
##$CURPRIN= <$Network HP LaserJet P1505>
##$DFORMAT= <normdp>
##$LAYOUT= <+/1D_H.xwp>
##$LFORMAT= <normlp>
##$PFORMAT= <normpl>
##$SURQMSG= 1
$$ End of Bruker specific parameters
$$ ---------------------------------
##NTUPLES= NMR SPECTRUM
##VAR_NAME=  FREQUENCY,     SPECTRUM/REAL,   SPECTRUM/IMAG
##SYMBOL=    X,             R,               I
##VAR_TYPE=  INDEPENDENT,   DEPENDENT,       DEPENDENT
##VAR_FORM=  AFFN,          ASDF,            ASDF
##VAR_DIM=   32768,         32768,           32768
##UNITS=     HZ,            ARBITRARY UNITS, ARBITRARY UNITS
##FACTOR=    0.250966925370066, 1,           1
##FIRST=     8223.43324360094, -415925,      -153405
##LAST=      0,             18361,           -47959
##MIN=       0,             -678970,         0
##MAX=       8223.43324360094, 467057919,    0
$$ Real data points
##PAGE= N=1
##DATA TABLE= (X++(R..R)), XYDATA
$$ [...]
23815 -49727 -193754 98297 -45339 -62005 29047 -216172 -246879 -120265 36067 -180062 -9855
23803 -190887 -120126 -54726 -56779 -37329 -155035 84155 -223226 3667 83957 -46984 -129408
23792 -129408 26439 30933 -93541 -103935 159833 -138522 140404 34712 -111091 58353 81023
23781 81023 104949 73992 -123331 86057 110221 165241 -42848 -239393 -272794 -47858 -147961
23770 -147961 397359 197650 -39633 -242170 -76841 -149750 305331 -4910 -52472 -250846 80570
23758 -82285 112440 -286344 269721 159898 151342 -63873 14058 106961 61917 -160988 -408178
23747 -408178 -88011 209716 -231290 -169981 16059 28348 299385 -105688 -123652 29703 -238314
23735 -192401 -48592 43514 -35305 146094 170077 285840 15005 -108406 -55300 -234839 -166662
23724 -166662 -75771 48434 -141019 59292 82912 354973 -234359 -224964 -14283 -70375 -80335
23713 -80335 -141883 -271169 -148234 -130819 23777 -71269 30252 372762 -43317 192028 -271201
23701 -194046 -91473 292027 106313 83556 117200 -21154 -58126 204682 2253 283613 227758
23690 227758 293206 96369 -37535 -261404 -114325 97187 -191068 120876 74534 -56227 -142718
23679 -142718 -44201 -21671 -284935 8564 -46005 350097 -26781 55180 -396097 108603 -117556
23667 70072 -290179 -259043 67050 216822 -303011 -255900 -41573 217202 -247638 -187608 138017
23655 -247167 86815 -260438 17717 69415 179381 326006 -17776 -97202 -98805 -214234 197467
23643 -136544 129303 -362664 182406 -82836 -164170 -79045 -15247 -89095 250651 81529 -197386
23631 -142618 88026 22686 -48862 96471 -9919 183734 -87126 -60599 -220295 70640 -165947
23619 -518424 -7946 88722 45302 -114180 -77528 -80047 -231148 143803 62751 186052 -26321
23607 143731 1218 -193812 157216 390360 -5254 133323 2652 8372 62763 66574 -20771 186741
23594 -42295 28123 34618 -144442 -188738 230566 179206 -52421 199085 -235408 213630 -221232
23582 -77966 122030 24274 -67044 -113701 -308748 211758 76006 -105232 86288 84790 -78160
23570 -427324 -247155 42221 -111050 5318 132115 -2733 66825 -6942 150679 -352721 49380
23558 -176391 213342 17464 163214 257731 -131384 267102 -168150 -33074 66942 105372
23548 105372 -47939 -267833 -44878 -30729 79301 -49445 -74339 7475 360095 -1391 -87325
23537 -87325 -228600 77160 68835 180343 10517 -175587 -226787 100046 -401031 95436 69431
23526 69431 116324 -11141 -68116 34955 11869 -139598 73810 -17556 -61462 -186152 118914
23514 131165 168788 -99851 161486 192228 -350735 9342 -150917 73175 122728 -23225 -280549
23503 -280549 152632 -409387 -158430 -363257 -79592 -55431 128025 419108 13287 40580
23493 40580 -74433 -70934 -108605 -60684 57463 27986 -244690 60985 -64001 -83478 -59510 130552
23480 -296011 -168066 170 -81015 -178521 -254332 190489 -17366 35878 -296718 248426 -253021
23468 61435 -66439 -95736 68187 114364 38963 -238413 259596 -45103 232644 124624 379062
23457 379062 112015 100270 152048 142117 41623 132413 459846 -64470 -403109 103789 -13212
23445 -177019 -131105 -88340 -175597 -233763 169576 -73966 240536 748 -1191 -340782 530805
23433 -218300 -3600 -75923 -35631 -331698 -105380 116937 -103554 -205228 11310 -41099 -126030
23422 -126030 300223 109073 119864 -186806 -11709 72193 134028 -10977 153633 -17259 44973
23410 255339 117644 -3009 257183 103891 251597 66248 -80155 -35402 75256 -157388 103162
23398 -338682 -38986 -58307 128049 107303 102266 401350 -33731 -112034 250769 -421347 165753
23386 -213869 48814 -70336 201246 -198384 -117992 42244 88789 32243 -256768 -104097 -169849
23375 -169849 11876 205073 -112709 -31759 -200195 -136539 185495 121772 -261984 -73926
23364 165151 -111528 -17630 -106230 -200567 39602 -269654 124911 -278777 -255743 174177
23353 203877 -110660 -176845 -208122 229274 248739 97497 -244374 -81778 -29925 90005 131099
23342 131099 110636 -350257 -52004 -318767 107534 149016 88159 365416 -17288 -289981
23332 -289981 -62759 128757 -155526 -111986 233026 -250825 117703 113693 159397 171824 -345963
23320 20325 238672 -243886 146609 6930 -24303 132736 -233648 -53219 195548 -26832 136518
23308 47674 -279357 -245545 19137 36141 -233019 -61316 230326 -227852 87495 121638 207308
23297 207308 107260 -159351 -255322 235577 96947 -76133 -26415 195345 4816 -298614 -80812
23285 177078 -294281 -329698 132670 -57826 -76064 -75318 119280 85474 288062 30316 252418
23274 252418 -223377 113178 -143538 -267283 -65016 92804 6515 67428 -55378 373066 -75222
23262 138707 -271997 -48005 -56304 -328597 -377654 -124102 -212174 302687 -115240 238821
23251 -228441 -29724 156092 -82859 250194 -196398 -337792 166418 14789 137970 -85163
23240 -59928 -45142 -69488 121143 -107576 106734 340849 -358451 112268 -45212 105435
23229 -165968 -48242 356501 75825 -93069 -33808 -58359 27786 -3940 -409952 -93954 -152747
23218 -152747 -86497 60943 -227784 -121673 -46474 83199 102279 -148129 154764 -161517
23207 -129325 103395 -271641 -226849 -14429 105648 147371 158279 -97325 -66392 -303408 -120902
23195 -53050 205852 41250 -184222 -242802 131112 195227 -1021 71344 -199960 18256 239740
23184 239740 214250 107318 -156739 284638 -143771 -150540 -69052 326125 -147164 -299162
23174 -299162 246041 576438 -110609 47351 -339081 -90725 43622 -105767 52393 31733
23164 31733 206443 133440 161300 226355 26994 55450 -13655 121302 94109 18289 255967
23153 255967 162515 55987 -282775 -364878 329918 112905 -53981 257243 -53069 126151
23142 -269388 -211562 3429 56253 61818 -12144 -240846 -345274 292245 143397 -146124 -92635
23131 -92635 -63782 -105742 -225819 254655 9894 -9237 -139932 -125665 -205332 -102820 -181943
23120 -181943 -160762 -348786 -36767 -209094 87664 -87509 211259 8182 41963 10898 196477
23109 196477 335984 224030 14175 91571 -6528 -569 -47749 -179331 29211 160934 12331
23097 60828 -322370 285024 -93297 -138738 -136475 -156940 -32176 -187010 395757 -148834 112563
23085 148129 -228881 2835 125725 132733 -62344 -342713 -110138 97630 20681 -129386 -79438
23074 -79438 122418 201806 54932 77352 -18152 240327 227841 -28734 187164 26898 146894
23063 146894 -69988 48950 -355212 31862 -5197 -36082 361524 298642 69894 -37035 69858
23051 -73396 -42681 -107273 -188404 -173644 -75361 188856 -119373 -241366 -63681 159464 -35812
23039 -98555 -143057 109915 -265936 138675 53436 -157917 -138747 52755 -158048 26753 -185329
23027 6402 108963 56783 47884 115365 -72716 -13305 -434650 -2241 23043 44837 162642 -106862
23014 248320 -4382 -117298 -220808 -371486 186435 -127124 -293444 140783 -109405 -164352
23004 -164352 -67077 67224 279359 -89712 -80566 47547 324528 -44185 104749 241921 -124412
22992 274 -203337 24127 76606 -229404 114007 -110991 102919 130963 -60366 -490187 -176745
22980 10313 -467041 -184599 -32667 -81575 -99013 264552 -299023 103326 -390 157066 26054
22968 -443766 125817 315651 -67536 -93303 41494 -159145 -165473 -161018 -229383 -21231 64687
22956 -163471 -8026 35530 -104049 -63334 -113505 -75266 -125810 41409 82675 104135 -33193
22944 209156 -251020 -279808 300016 296330 -99007 -72206 -26177 59916 -219509 -289738 7674
22932 67281 -35497 -30174 24060 -459319 2390 -305293 1292 114529 -790 -32530 -195235 158225
22919 224648 13275 331812 39994 -20166 28690 -239269 44312 89878 150257 -82737 -109973
22908 -109973 -68075 -45290 53116 379572 85513 -181260 106241 -51471 -33360 -134191 62222
22896 -28623 -136200 13928 -46461 118413 134461 68325 183253 -30288 -48876 -55485 212750
22884 -22326 -187424 224504 83849 -479011 -156726 141097 256901 54293 -37700 108683
22873 -318809 -267208 -62470 -26144 41132 -207946 99628 -36091 -57253 -122428 321765 -678970
22861 -309317 25480 -78427 -11279 -48309 -65783 10753 148177 -14561 165368 -117976 23341
22849 27583 9145 57573 -191849 28540 135572 -83444 14992 -39147 -9666 485949 -7065 36278
22836 -172586 -30953 -115259 186311 266074 21873 -97683 145740 -156058 88957 -114256 -184748
22825 -184748 -158213 108480 132278 35227 -180778 294196 -25054 340776 -281349 -366797
22815 -366797 -55357 144957 -145818 -105284 35716 -73190 -341707 64251 270617 -244621
22804 -108166 -185447 -299042 -175049 94600 -191113 76547 -153109 6766 121085 -178186
22793 -432523 86755 -372917 -295864 41303 -49696 -120397 27866 -370609 85381 -222536 -159684
22782 -159684 316321 -193917 177449 108908 140572 -327432 -343200 7341 -188270 -162255 46248
22770 -98689 -51896 68394 -42410 -279498 31165 -144550 -276061 -227470 110581 -227238 103911
22758 93165 31542 402952 159169 203076 311961 17054 -186103 15019 6907 370480 -279040
22746 47303 -42098 -274491 -385354 -9268 -14436 -65967 113898 -107592 -89808 57509 15799
22734 223617 82135 333102 228089 2585 -341170 129511 140507 1401 269206 -266994 -11725
22722 209582 70729 27601 -221344 110774 -37311 36088 -127493 -202694 -176606 97256 199594
22711 199594 105068 25614 102446 -145974 -35815 -237993 78455 -130362 311560 301270 -378977
22699 -246744 66362 -189560 61243 -49832 215378 -44477 189572 -14425 -244104 24241 -153734
22687 -296702 -151254 325039 -230288 -154176 46 31044 -274928 -279616 -45104 49595 -60869
22675 3848 -36634 41001 -8887 275705 68523 332129 155009 -65716 -13943 -86580 -242997
22664 -242997 -263411 -269483 232986 -109852 153496 123388 417513 -38081 -274462 -147312
22654 -147312 87903 56578 -124888 38751 611 -75885 -25738 -297005 -280124 -168567 65281
22642 -294336 54450 -230264 43681 -119028 -296468 8032 -204320 -103279 -228234 109349
22631 23222 -136280 -1304 77227 -155453 14905 243876 189987 57305 73322 -133113 -92685
22620 -92685 21085 -269615 -160202 -236680 -31710 -253728 123013 -220297 46907 95481 -223820
22608 -189874 -16406 -293741 66330 59918 -80889 -113711 -112999 8189 80680 86310 7933 -248035
22595 86816 6853 -91657 -86433 -287428 -142163 -139083 -93177 251309 134488 126432 15755 -64657
22582 230489 -62394 -4559 -126456 -326170 -370772 -136640 -105057 287204 -117224 192121
22571 17543 -14631 -135933 -775 -63056 -83665 -39145 -249989 -253812 -212452 80854 -168405 32281
22558 -240024 67421 -47580 73370 -158922 121966 59042 -272353 139953 246487 -76525
22547 -216488 -234118 -94691 -86094 296995 242959 -24982 -110586 264805 -226591 333490 -526501
22535 -338385 -123640 -319819 -186687 -21384 -298846 334120 6266 67117 13331 -192168
22524 -176370 -309720 106334 188370 -114854 -8594 -286934 -184132 -73707 15999 200991
22514 200991 -103347 -120118 -237084 153025 -291469 193911 -321074 -265884 -332518 121394
22503 336630 122223 2154 133233 -77363 8973 167194 99390 -48431 -78209 -7513 143989
22491 110590 -121326 11335 -283922 -248668 -201253 -150616 72522 -571938 195256 -15530 -148379
22480 -148379 45046 -1834 -11986 -203681 -158470 90568 -88941 329776 -16995 -175693 35359
22468 40729 89675 -69768 51926 14055 -251812 -85526 -183396 -27277 257141 -242114 -251746
22457 -251746 98824 -207416 -159771 372682 -162138 -59369 349421 175676 -5373 -76805 -189387
22446 -189387 78562 44726 -236896 -151173 -304178 -207013 -88393 -229416 187106 23035 161531
22435 161531 -147064 162822 58322 -391154 -211945 -162128 -113183 -88921 1493 -151889 -188880
22424 -188880 -142065 -85332 -361705 -403512 115838 -150087 129669 -118560 -14704 -31691
22414 -31691 -175983 -26156 67368 -351986 -106410 48138 -196682 306599 79093 -171449
22403 -73990 12735 3264 -286422 -43563 -69013 11624 -236250 -284555 31451 -217455 -187850
22392 -187850 -120045 62242 -62960 -230606 87434 80293 145654 -125346 -115092 -139171 -4050
22380 -221647 -211642 23048 240917 -6234 -3330 -156804 -89665 -133902 -139262 209316 -307509
22368 146139 -246952 72274 203215 -534734 162446 175450 -174162 75084 45838 -159053
22357 -28454 -111093 143507 231449 -81793 -200782 23397 -60962 96736 246025 -153485 -20231
22345 -28687 101066 -54826 -86742 233560 187832 159878 -15542 144358 -36867 -425560 14615
22333 -12860 -27034 50945 -111621 287492 224007 -110700 -191981 -153257 -213916 -209184 -267922
22322 -267922 278821 72317 44243 92593 312417 244089 -101892 -309706 -115107 -295826
22312 -295826 -76224 -42823 -172736 52282 -169707 92773 131136 -195985 -174336 -72588 -3646
22300 -96505 -25576 111156 -152900 -122308 135714 181112 -100024 -43435 182508 -83913 126070
22288 262577 -244581 -12195 -149299 -78837 212055 106140 -463420 202815 -7750 -17786
22278 -17786 -90294 -25262 -165806 66388 -205184 -63415 28487 140259 132160 44390 -251891
22266 -61055 -360480 -33557 107123 285788 24348 -271779 8721 -379512 -148936 111611
22255 75187 188436 150473 18542 -41522 49636 145734 29592 -288669 -164008 -85961 -90678
22244 -90678 -180325 -90817 119061 91066 68842 -93798 61700 229403 98760 59092 138859
22233 138859 79567 -61794 388950 246167 -121427 -125862 -9171 -133092 -367412 287255 -163638
22221 61707 -303024 19461 -46137 -68271 -2328 -57111 -217061 48566 75147 10098 32289
22210 32289 -81360 -26253 -347710 -59871 38762 -207137 -17187 118546 -196923 -286309 -50156
22198 15770 -202439 -140727 116889 -138122 -153123 24547 -201980 -127728 124364 39893 -318722
22186 58581 -353566 151618 77524 -292494 -78227 -134386 75197 34300 -128987 95167 -130375
22174 -310135 -148200 -196457 103876 -157949 140923 68678 157633 122929 40730 -187096
22163 93595 39720 -111831 -32438 178890 127041 14732 210406 131467 50624 182765 149549
22152 149549 147916 98829 -17143 112662 110341 -213128 -473795 92415 90500 8569 26893 78402
22140 78402 -256199 -88525 -176873 20560 -50806 -103277 -225349 150737 -156651 -236204 333624
22128 47574 -161012 -141440 151042 -81811 -219678 252247 66768 -113031 67785 35851 -280324
22116 -105983 -375261 -151327 -320524 -211628 -44177 -320953 351451 178079 311397 -154634
22105 32559 -71093 -145510 2571 69302 98535 -60346 -466147 -303128 237685 -11574 236519
22093 -234461 -146223 111228 225311 93971 -148423 213442 -308 -38329 -57341 -36978 -137931
22082 -137931 197467 -196649 275473 -139317 33449 1771 71813 -320132 -92854 -154501 -387882
22071 -387882 42350 63996 -141201 63494 -443429 30664 43614 -80801 120149 -29911 118737
22059 -177698 12150 89419 41521 215081 50469 220593 -308452 205971 96041 109009 -160705
22047 160898 -242696 -66720 42406 -176953 240758 84626 -145303 86320 -3119 -85012 135066
22035 -59964 -230471 8267 -2483 -310519 77738 169055 136210 -6114 19123 -137587 17433 59950
22023 59950 -149439 -99145 123313 221668 70860 -166933 50700 -178677 173286 -69545 -153816
22012 -153816 55642 331325 -135037 428437 -46712 -19891 1618 18282 -62914 -72929 110521
22000 -221601 125062 -22673 190277 -198164 178217 203820 -4009 -11483 -152133 100350 23837
21988 -76229 -55720 45883 -337167 209395 -145647 -128980 270976 -310339 -19017 77987 -181163
21976 -44542 -381943 -248086 204387 -487191 -299313 150158 -282121 -114851 113934 -90829
21965 -78334 39311 -187046 46659 24218 119150 -371435 126048 18596 -24016 -28802 -238144
21954 -238144 171025 103697 26352 -406824 169328 69303 -128585 2899 159063 43326 -246927
21942 -296672 -139911 2327 -71675 91270 -64438 184753 157524 -257658 -263360 120687 -122
21930 -167803 -62730 3551 40320 -151759 -34953 -271034 297488 -219259 -287366 -32648 141395
21918 -142316 87442 -86394 67853 111469 -234172 -160914 64160 -379878 222896 -89217 124881
21906 -335688 -123570 -47247 341584 -278874 131279 190436 135598 -166641 -8616 -216437
21896 -216437 295574 181258 -180279 180928 -148749 -384528 145020 -70237 231360 -271296
21885 23318 20000 -356469 144316 -154285 172088 -270536 226601 -314872 138784 -134611
21874 198566 -122393 -215670 -250093 -2815 -32577 -78637 -322708 77962 78323 -367073 60646
21862 74736 -133251 -101241 -152745 36883 -210916 187517 -22870 -119698 185460 68434 -197554
21850 -347263 -151631 310870 -334159 -89198 -310701 90244 -51593 -104199 -183533 147146
21839 119843 17757 -155838 -269179 -53871 -361072 -245142 22728 -7168 210025 -286392
21828 -243478 -83264 -256135 59206 51929 -29187 70134 -406514 89209 -110585 -236618 245315
21816 13361 -87527 101715 -40031 -179109 -290002 -125273 -40810 457841 162022 -339355
21805 -125213 66098 -259648 -182812 322936 88628 -27637 -105051 -236759 103312 -234361
21794 94939 321383 11404 -264889 147009 -98314 100819 174276 -37234 54964 -153918 -147207
21783 -147207 -26927 250181 89301 12304 -218137 37851 -132657 254810 24717 -99280 -188867
21772 -188867 -240756 -112985 27194 309450 -571804 -134694 109249 145585 68062 -115188
21761 81999 149023 -132871 -390269 220678 -129531 152727 -92340 -347807 -65142 -168368
21751 -168368 -126335 14772 -19960 8437 19487 180427 -97205 -74176 -160905 -213793 -147215
21740 -147215 180022 -82106 140342 -123667 -284978 17980 -197519 -68745 -14633 -34574
21730 -34574 -28704 62338 -21272 -189322 -116572 -96744 160762 -178780 193121 -144103 -287927
21719 -287927 2032 -176902 46573 -2390 94626 -133656 155732 12938 96846 -25345 -136535
21708 -136535 129253 -173893 61414 503768 97643 32166 221318 -119295 -29053 161892
21697 -6154 -232913 138721 -228058 46480 -63628 219792 95681 -313330 -154960 306264
21686 -115760 118993 93125 -220255 185771 15073 -213060 -82830 84084 5960 -89067 -38291
21674 70556 170174 61936 -65132 -134219 208641 -44830 -128319 -67858 -143907 44465 78281
21663 78281 -83789 -450549 91471 163131 179113 123877 30371 141087 -105898 -251832 -127156
21652 -127156 171733 -156760 30858 -74043 146730 -141605 99177 -273947 -366025 -251825
21642 -251825 340016 -332264 26950 -41002 -48717 -99197 80555 -146302 -8216 -87396 -20518
21630 -165440 -117999 69020 16378 -148561 -198499 -89683 108843 330659 -44908 221125 -114616
21618 -153091 -227439 363550 -279244 -205273 -421745 -84034 -181518 -107702 205066 217360 6596
21606 240492 -74441 67016 136047 -322153 -57766 -72023 91709 -48099 182918 -184247 -108862
21595 -108862 -7637 -90735 -88755 -87146 20326 23185 -439533 -144124 155844 -349735 721 -287332
21582 -55087 174463 -39191 107598 -129913 -179765 -144248 -156598 -31813 213370 23747 158364
21571 158364 172900 -155739 -101465 -217835 -69416 -164649 132086 -271187 -97726 -214895
21561 -214895 -115790 143838 271906 -8504 -59648 -119361 -29835 204593 -339870 -19814 -413189
21550 -413189 -13071 -408781 -36704 -208211 -295954 169070 69592 -310755 -112487 -80770
21540 -80770 211715 -202610 -114343 232289 114297 52276 209148 35153 -313798 -102537
21529 -25536 -64578 22557 33256 140530 6841 26615 -197792 -173736 52435 10525 -130481
21517 -58698 -89184 479594 -31475 -67380 -89460 125884 -132139 40894 6141 -172009 -112899
21506 -112899 92441 255165 -182919 11449 -85729 -18767 154319 -24576 -128545 -222970 -260106
21495 -260106 -115401 77168 -115194 -384887 -195565 -96857 -132811 26177 32821 -112035 -109069
21484 -109069 -108483 8366 249060 -158223 296143 145748 -32155 60222 29924 118313 16026
21472 -235094 200406 60701 34393 73602 89175 57535 -98600 104092 104522 153266 57954
21460 -266713 252293 -121271 148953 -207822 104911 16659 -185589 -59636 -223315 1298
21449 -34810 -299890 -172736 166258 12521 42448 -218572 76213 -41956 375271 419410 90513
21437 156835 -208757 -159898 -64991 -234806 -53855 335404 -3906 -170765 -251612 -110125 -85379
21426 -85379 -211452 243013 34854 -119913 -23990 -55176 -135317 -126674 306986 148188 -80982
21414 26885 131124 31255 72179 221469 161301 228085 163528 59070 -244223 165178 127805
21403 127805 56670 58059 214822 -159407 191826 -85362 -186788 -117162 -261385 -105665
21392 -103307 -240830 140281 -179883 -244736 -80059 -105596 115591 4853 132069 -68738 -43227
21381 -43227 -395385 97616 -104521 158723 611845 -63345 -75031 -10364 -132877 208483
21370 170045 1094 272254 271129 49532 -212512 -218480 261209 -70903 -11194 -287306 -48321
21358 -49247 498889 -209027 -137768 -69151 397490 -104309 -98240 -472210 336767 -141647
21347 -338025 212124 78758 -178558 14444 1808 -368778 -131433 -38629 251502 -312577
21336 -100899 -52930 -307407 175160 16039 -167120 -451456 25926 -283719 -186036 165 -312863
21324 -425824 135866 -177351 -106805 -60865 -212874 -355022 -78687 -325783 -74137 99604
21313 -154699 -196579 -15444 -62367 -106327 -97919 -24336 -265526 -184580 172864 36341 -179969
21301 15720 -169197 63180 -37995 -92477 46014 96848 -114138 -343595 51065 93948 -23838
21289 212660 -39936 -61649 -120919 -118993 -24548 -203838 -214907 179726 -110067 93794 -111073
21277 -232474 291266 55487 -99713 77668 228885 -418861 -72424 -2773 20576 -200729 -145347
21266 -145347 -139808 -210593 -165811 -57735 -216733 -300864 -4251 170824 -222351 -351660 96070
21254 -47689 -74309 -219508 -162384 204373 162711 -205646 136817 125994 -54980 -10817 163070
21242 -6649 -412743 -58022 -342460 -236306 -152111 161621 200987 -69950 -110129 286235 -307961
21230 15743 -140150 -27913 383989 -233772 49898 154407 -177744 -285558 -283473 100696
21219 32995 126845 -145912 293967 93133 -132698 -323898 -115438 2294 171027 -35230 -114502
21208 -114502 -57302 38734 -22357 193143 22006 -119453 567052 -174868 -161577 -135946 -114808
21197 -114808 -141590 -172666 -70505 338624 -120905 351671 90985 459622 164034 -59204
21186 79667 -23892 89073 -101807 116581 -225702 -272386 171709 -99416 -256189 222890
21175 -8729 -125233 311526 27786 45803 -170691 -280101 -218042 122915 -139477 -267461
21165 -267461 166542 -260992 -184593 53415 -257508 -33068 60546 295933 -107373 14330
21154 -142849 -161120 -151461 -41213 -59117 -85943 -142224 -284379 -220687 86974 -221925 220962
21142 -71349 13269 -33934 136843 3897 46256 -146428 229690 -215458 106625 50993 187661
21131 187661 3547 245616 -34260 -35256 24973 -115854 -253144 92155 -25745 183047 138183
21120 138183 -137761 32676 -3623 160858 280500 231779 -271037 106024 -111188 110199
21109 39890 -296013 -33404 -159052 -112953 152348 -164399 -238672 -36067 108945 8976 -118770
21097 -281323 54352 -208832 -91828 -163860 394912 -110963 -48966 -242146 -170599 442531
21086 89732 91658 -451433 -472363 -190696 -140595 -162658 -93711 -196978 -129601 16488 186582
21075 186582 20394 -184414 -251986 -36080 -73016 6568 -22284 145899 -11925 5679 -36512
21063 -26971 -40072 176801 263506 -198444 64672 -97925 -230339 130316 -242854 -319446 -428677
21052 -428677 -307399 206509 114169 -84404 -143754 -8109 -239437 50185 -86212 -7224 -141253
21041 -141253 -109894 -112235 -131829 243777 314517 -312204 163062 -70445 31436 122230 -64569
21029 233472 -320529 -32690 -204927 -1547 -124745 62915 -71753 -118378 -363676 8340 -332206
21017 -359569 76364 -245290 -142816 -321633 -117648 549952 190863 256181 -121039 59959
21006 -221795 38665 158375 -61267 -191528 -122766 11286 109503 22858 -232788 -74045 -194489
20995 -194489 -177295 29840 164721 -261414 -214804 -35350 -30488 -200778 -85449 50089 165212
20984 165212 -235331 241992 -95218 -46790 106153 -63882 204831 -114447 -108643 -51356 135366
20972 242783 -48857 106336 74430 100474 109095 -43008 -44819 50672 78710 -43253 124223
20960 -37543 -86018 -72874 66875 -209935 43675 -212707 118390 33932 170760 234550 391426
20949 391426 -78532 -427816 -72669 -100408 105256 -31284 39794 -129046 -50792 -383709 -259965
20938 -259965 -459887 254585 68896 104333 -252434 -244181 -60058 -114016 -112065 119370 -166047
20926 -311464 -110134 -153686 -93761 119363 -280947 -262389 162079 228889 -270836 128872
20915 -136475 -68051 -208466 -391646 25639 -235667 -269401 -270357 78123 38912 25785 -232138
20903 -219582 15686 -247357 -53044 166365 243844 117065 120982 -116455 212119 68982 -14715
20891 40919 101001 -61103 -4260 218742 -113266 23172 40988 -101933 152732 -112972 -51902
20879 237003 -183597 173805 -56559 154710 379646 -182192 56779 -71842 -70908 -146151 20548
20867 -297673 -198508 56140 -268058 179064 -96218 -145542 191590 -513 -210218 180951 -141478
20855 -124153 16272 -159746 43777 103849 -95190 27386 -240269 -94815 -182441 -89104 261235
20843 -2024 237949 -106111 97619 -20718 -208115 -147592 -23889 -257246 -360469 -93695 173957
20831 -62112 121912 101191 -136960 -213493 -200680 -209995 55477 -75139 195247 -227688 -85108
20819 12536 -99783 -124207 21995 -117352 -537795 -176672 5859 -87725 20655 -217391 220413
20807 -92950 4782 71579 62831 -160303 -293532 205676 93815 35011 -38681 -207512 -9080
20795 171995 -112980 29679 -61995 91881 111678 38414 -129099 -156811 -91450 53450 74935
20784 74935 -182332 -101106 190352 -88895 20739 222101 -240225 224138 -261942 -294405
20774 -294405 -36717 -96220 288724 -228895 -314470 -39550 19251 223962 -64535 -34257 211504
20762 132197 113629 -190205 144533 58094 -162995 -534839 -37571 54996 -360188 -30823
20751 -13329 -111991 73299 -18706 -19259 52803 -101140 26892 -59180 -91585 95458 55259 -305978
20738 2365 -72632 -80277 -114932 81906 -22909 -96642 34158 -207315 -152617 -205817 82473 -303230
20725 -162751 -238620 -215746 -135560 118607 -140303 77853 -54736 -112880 142960 -15736 39064
20713 -336249 112319 294244 122119 -200309 -41561 -139713 2006 -10469 -197637 -285012 144436
20701 105260 -231113 -171220 -59714 -242638 -475603 -163532 19911 1681 78930 -29641 -174295
20690 -174295 -93104 173412 70526 -26984 174726 -43974 18167 -134041 -92781 -268578 -231795
20679 -231795 54244 180427 73370 371030 -17261 -199270 43880 -193940 8734 -279831 -110090
20667 -389450 104140 -118013 -287361 -114261 135881 -375230 -57339 -142612 59064 -195205
20656 -42997 -37523 190002 -218775 -152712 -222700 320638 -8438 120954 240840 -38655 282035
20644 139225 -96932 -59160 19784 243081 -4024 39828 111066 -215776 -387299 -229250 -155352
20633 -155352 200990 32825 58294 32804 5920 -182155 -201682 176443 255078 -309136 188818
20621 -143752 -31472 -235244 58261 -125912 -117423 151012 104369 14117 116027 -116230 -272781
20610 -272781 -195022 -106043 20234 -256293 159637 3392 -264434 63847 470478 -64708 -332036
20599 -332036 -234278 18816 -456810 -218565 -127887 -71198 109869 -248959 -15488 -119048
20589 -119048 239600 -104277 -126065 -200909 -163861 -251476 -81670 213070 -87982 -50274 -230575
20578 -230575 31156 208821 299109 -27862 -23375 94293 43332 176005 143379 -361591 43285
20566 -46877 222626 -245703 200756 186422 62642 10112 155202 169058 200286 117024 -121388
20554 -385801 221927 -286424 -57030 7309 243788 119785 -122336 -75517 -187040 -64511
20543 -500731 -230659 28872 -16371 -228353 -134380 -40665 -112295 -10651 35638 -87047 -52190
20532 -52190 271719 5031 -267713 -240036 -61640 81532 -179252 122085 -324971 94187 -207550
20520 -552211 2470 -68801 57533 -165470 -193802 104465 -233971 -180298 78951 -83735 65399
20508 -65604 93210 7923 129138 -262014 16994 32019 -267145 -313489 63707 1962 -163611
20496 238323 56068 -18431 -305217 -119951 87869 -375815 267660 -208101 -209378 188664
20485 -338301 -68642 -81158 -140931 88889 -175648 -274521 -318297 -47339 128549 -163097 218109
20473 -244957 122230 -127462 -139647 170233 84241 22656 -48934 17056 -10308 48636 188968
20462 188968 -198978 4573 -433364 -231395 -174184 169380 -219422 -28460 169530 -353737
20451 11035 -114108 -52686 -9105 51203 -51409 93052 28333 287540 130587 -314510 41065
20439 -41324 -16662 -36174 -1279 233353 -329637 -78640 -20001 109337 195736 -228337 -95029
20427 120132 12372 -309903 28709 188510 -56924 15666 -312259 88448 -62651 75611 -311653
20415 -49606 -54231 -127729 48852 -96486 -116098 -53666 -91240 -327610 65452 152016 -412810
20403 -107619 -187249 -198326 3074 -87149 -241598 25002 -152716 373367 261426 3415 -166007
20391 111893 -56447 -59385 -131239 -165250 -125286 -234213 79183 303115 -18208 -53792 209926
20379 8145 17292 -149216 56482 -214660 -32257 14034 -146676 -111561 -67269 -50026 63727
20367 -99043 12940 51067 -79554 -257552 25592 226133 107252 136376 -14296 48915 -59280
20355 -102424 381946 -1037 -131585 -95625 -23955 -110350 -1779 71507 82142 -88686 5300 -199188
20342 24819 -355773 56922 4682 199962 -167140 22177 242576 -91351 -257741 -195924 -256613
20331 -256613 -25689 -251423 -83165 -85875 86120 -63039 62998 -236561 -22964 79043 -282269
20319 -174429 -88885 -47970 -228855 -12014 79126 -161935 -92547 22940 129858 223436 -108630
20307 -101761 237088 -195116 72396 -278548 51319 -57938 302995 67618 -47929 52587 185283
20296 185283 -143575 62085 118058 -257884 -196317 -60267 26662 -193289 -49416 -196591 11797
20284 -21771 86696 108903 -335494 -346695 288081 175757 -217533 181486 -185163 98052
20273 -135558 -161295 212275 43658 448820 5392 -145159 -176782 -64875 -620 35174 -40320
20261 -21348 -235070 -275493 -51562 148869 152452 -366105 -108560 29553 225573 -20928 -140319
20250 -140319 -169606 -127923 -155025 -73289 -81825 129513 -119776 -152247 238971 -286689 -42621
20238 -273994 -184097 -1013 -15973 430271 -93322 -230756 -156328 -136221 -283564 -480817 -263769
20227 -263769 74435 401648 -202467 2190 19081 128450 2329 -160427 105120 -208500 -42286
20215 -86556 -130656 -116532 126872 139105 64882 13353 -69556 156898 218420 -265584 398579
20203 -319469 -99773 -101471 -46883 -223444 29001 214659 -176130 -232188 -73645 -60874 22840
20191 -152309 -305843 -273240 48044 -41766 -88329 -93656 -77372 -222180 -126003 -1521 188402
20179 166545 -22103 170016 -136591 86005 -291261 146926 17844 -273361 204787 -31703
20168 -376672 90482 -337432 126003 -31615 -125700 119953 -364065 -198020 -178471 -142591
20158 -142591 -91781 -145852 -26139 -21887 -201865 -111374 -195064 -340682 88314 113795 -249688
20146 389386 -242013 -12118 -85363 -233967 -143116 -576593 -62546 -135115 -100165 -190297 -108742
20135 -108742 295320 -147988 -200887 -90971 -41822 44143 239326 -62130 -296929 -109153
20124 -61565 439895 46346 131616 148367 -230493 41865 134456 -1877 11633 -84700 194496
20112 318421 -279552 447973 -54236 -155183 87337 -199293 -302273 2063 146884 -259329
20101 24599 -11122 -73435 -174870 -96946 -1102 -271649 -70603 195721 58472 -258758 -87424
20089 46374 -49364 -171091 3137 -135616 129410 -110285 281859 -263489 -68319 -400267
20079 -400267 -363010 -308963 -215591 -57961 7599 182797 -109121 -77695 -98937 181621 -71490
20067 -248223 27974 -98823 -211734 -99779 -34503 -7812 75802 121311 112746 -241471 -50975
20055 116871 273326 -411025 27147 3031 -233983 -123038 108165 265993 -10959 266439
20044 57615 39336 -170565 -145177 -71799 46147 243645 -67986 132281 -74645 54381 -388244
20032 -18851 -122372 -272170 -278384 302785 56843 81535 -31172 -37211 -15516 169837 -58558
20020 -148508 -53644 123452 39972 134598 -88974 -249909 -340965 -279659 -106059 -35535 -381495
20009 -381495 -14876 18503 -31198 33861 -423585 105364 -24641 -115166 183081 -2472 123321
19997 16166 -208347 123393 -138643 161601 -78718 -218873 -328838 -90102 104320 168627
19987 168627 221684 102089 163596 -110740 -170360 34776 12806 -12931 -32979 -28909 -56099
19976 -56099 -126811 -228592 -44835 127138 449253 76786 -133649 -346932 -86994 205316
19965 -153395 172928 106607 65535 -63189 -364866 128745 336065 -146722 -173934 -155297
19955 -155297 -58357 -56899 47112 -199317 202054 -73484 -139896 27218 -99057 -54031 -42304
19944 -42304 40312 54637 206916 261039 -254021 348654 98960 -221013 -290177 -103788 -90737
19933 -90737 -50040 299125 53922 -199128 -185833 -208773 -199624 -245479 -102802 109140 237022
19922 237022 -10395 -266989 -50722 354946 -73030 -25035 -166607 194015 -214749 -246667
19912 -246667 -29483 -28289 -47779 213524 -6773 -173432 190471 -83759 -282387 -126874 -110561
19901 -110561 -138492 190840 169001 -227691 -314030 -129209 -83562 13384 -182455 235973
19890 -161585 -402391 -37213 -104623 -91609 -13516 90941 -52702 -40763 -254033 204425 -62107
19878 668 162592 -165557 -213372 -233372 -204496 28885 -36740 -211350 -153744 -142346 -36037
19866 -66554 -73424 30003 -13957 295453 -146604 -16943 114087 -123727 -155977 -139772 -138897
19855 -138897 -151758 -215807 -14594 -328627 -209142 -144566 -259729 57551 -177028 -278402
19845 -278402 -189472 -167279 237251 108479 -71256 -130320 168561 81772 -251294 -127564
19835 -127564 -243395 281139 110202 163520 100198 -83751 -106118 -224915 -93913 139534
19824 -127831 -454095 -159225 -10376 -10253 264636 297360 -154686 199525 -153595 48159 -241318
19812 69169 110132 -309213 193757 -257347 -146452 -152074 -14322 -13385 -164860 13780 4582
19800 -70503 -311593 57019 -63516 143056 163645 -136067 -120703 -57264 184689 -29724 -253507
19789 -253507 -161692 -173947 -94732 -401368 20651 -7807 -193729 -359694 181033 144110 -12614
19777 183880 -123310 -272355 -97126 -118137 -210280 7011 255761 -36187 -58326 -43450 3780
19765 233119 -78605 -139463 -77705 -60729 -331019 -204208 25551 16942 -62376 -201721 -364759
19754 -364759 -414240 180437 73246 -51238 -116118 39237 -240128 -154360 -16148 -422198 20008
19742 6696 145493 -113783 -154765 -324645 -107763 -37772 60649 -263483 -280162 28244 -41029
19730 -71107 -31460 -62292 -87345 194454 24262 266458 -37993 229580 357362 -166341 -65974
19718 374455 -95971 207404 -2625 352639 81526 -78872 -201243 96514 196905 67857 -44394
19706 -50130 167839 -114252 -101326 -11549 11907 -127774 36802 -132233 -70655 19065 349703
19695 349703 203144 -245606 67513 -153641 -15587 -178907 187092 -64241 51962 -384866
19684 -86392 -151846 -73751 -184089 60063 55920 -133016 86908 -311710 -115654 194405 -5815
19672 -68915 -145619 51614 -97924 -14894 -274454 -16510 201298 -308871 464288 -101249 -316043
19661 -316043 390013 -39254 -46895 225245 -202767 -124730 227828 -353093 -332850 90935 -103251
19649 -177822 -511432 -227934 -142249 -148174 27099 -388404 -39826 193454 -181168 183174
19638 65259 -88114 -286095 -84634 112092 -120558 -192468 -54632 -33921 82016 -235983 83907
19626 -93526 142700 62012 97662 8223 -79180 -75634 170341 -147873 -52987 -123410 -58638
19614 -53812 97366 -185753 44865 -223281 11037 121359 -169840 -81026 -475192 -25226 -260527
19603 -260527 -331817 89527 190484 179659 -142063 -60542 139035 -230288 20059 -146499
19592 -18939 26303 -198428 -42003 -92927 159684 53171 -85988 -342204 208470 110637 1448
19580 161017 -26114 263166 -136902 -95941 -363814 39139 -166917 -45142 195660 -144505
19569 9706 135409 22303 -166253 -12719 -13688 265541 -81705 41721 140479 -215863 -80323
19557 -102873 110943 -13488 65469 309505 -197102 -150151 77871 -209987 6602 -69443 -184805
19546 -184805 -42424 -206946 -189698 14183 124694 258820 -148313 -98731 -93983 -50738 -95382
19535 -95382 -30650 -100910 -23095 5501 -7948 -208202 144413 68538 37908 -254838 73424
19523 4725 -88452 -329857 -167829 -75471 -329059 -388286 169818 121563 -51445 -95536 149934
19511 255115 -86709 267451 -116264 -324402 -6302 155107 -14077 -335646 -381096 556 -159731
19499 34727 -89889 141960 -24252 -803 -24076 -163267 -204600 -114649 138279 123953 54251
19487 -409067 -98563 -188458 90653 -95988 291366 -333612 -77108 -122600 -147405 -80832 -36825
19475 -110904 47507 10563 189929 -379271 -23573 -115369 195005 52232 19492 -96564 69262
19463 49257 -54335 1521 -3700 -326148 46470 -60371 149195 115145 35403 -179868 34983
19451 -443546 -18005 140504 4280 70636 -182284 -202088 -47560 -450615 121287 -93990 -192069
19440 -192069 -160779 -162783 -124857 -29761 -23985 37539 -98536 -312848 -56159 -14170 -312880
19429 -312880 -186572 151046 -97459 -100547 73011 -95368 -343139 -94891 14699 -91322 50950
19417 -245071 110936 51430 58940 -110174 360350 140418 -99723 35856 -33914 -149801 -205847
19406 -205847 232363 -117786 132252 -200980 57722 -104163 -44253 -76498 -143659 -264198
19396 -264198 -104231 -357392 -36989 -64579 -35 -217085 -71782 97511 -4250 103534 -340139
19384 -223756 -120449 -77461 61820 193122 -57356 12213 -163519 -223088 977 -41616 150058
19372 -129294 90691 -68050 -360999 -2193 -169938 -136708 -326821 28423 -133453 -164281 221087
19360 207564 19788 212608 -311316 84766 27910 -53096 -343749 14732 -240971 50557 75656
19349 75656 -28392 -129894 367486 -217114 -2176 -151733 93402 242577 176969 -170601 -300644
19338 -300644 -162523 54472 136519 -127235 -144577 -113746 -98414 -296524 94253 -172219 104663
19326 91669 -140639 -203164 -43663 78059 106947 -416900 -394502 -47184 -264556 -19612 -327740
19315 -327740 -236646 -91478 -223015 -111579 21459 281053 -51860 123534 -7971 -147808 162851
19303 -60931 292414 290320 -69550 64785 456320 -105318 -46107 -9324 -128655 -166150 -3730
19291 137265 66885 -558024 23694 -33258 -183700 -304531 773 -180095 69687 -261336 -46114
19279 99538 -376973 -73763 -41170 108848 33237 -130108 9808 107166 99116 -61801 59006
19267 -289969 -343540 -108589 19120 -32599 -203009 198448 -71836 162987 -361971 85919
19256 112496 308894 -209083 -334057 76376 -240844 236712 211551 -148438 -31112 79461
19245 112613 -139438 -194479 -373808 -56481 -79526 80421 -78343 -342192 -169015 276630
19234 -137876 -315561 183381 5727 -384868 164700 -84547 -110113 -170888 -240326 10217 -51095
19222 -192951 -398318 35983 -244601 -185394 -224925 51727 -71402 -1715 51051 198766 180990
19211 180990 -575576 -1812 -93350 197629 -97158 16755 310481 -31450 142710 -149525 236062
19199 -176042 -63707 117436 22512 56358 -188482 -260563 -91089 -434743 -217664 -272153 93683
19187 -143280 323438 99831 -122524 197246 62266 34758 -199583 -56190 176908 69438
19176 9462 201072 67178 54063 -178644 -96555 -80505 108959 -116456 -237388 -256580 89896
19164 136608 14587 -124993 -122857 -101537 99269 102883 -7051 -99192 24041 150186 -364703
19152 57334 -142094 167623 -12122 -138892 135872 -37396 -210850 -183328 -268013 37078 -209213
19140 65885 -167767 160750 -161519 -249617 -222324 -442197 -248655 -280592 -277313 -197027 -280150
19129 -280150 23676 151002 -87140 -147652 -139741 92969 -41287 -195709 -42300 182207 -104557
19117 -97140 -333071 128962 -136899 -76932 45506 -94537 -79793 -125780 -146404 246106 233698
19106 233698 72900 -123654 -199936 -186999 18670 -401501 279308 -49162 41157 -104852 -4568
19094 143298 65925 42018 159782 194203 -53090 89807 -360565 -36859 -99496 94310 -60770
19082 -195063 35036 -144137 223312 58210 82939 -77533 243353 -102061 -20406 -102829 -52176
19071 -52176 -156688 -243814 -64833 -301910 -34735 51787 47706 -108078 -328657 -90782 -155348
19060 -155348 -235650 109758 167073 -398740 -220724 -72888 -300969 -130757 -237467 233364
19049 -76007 24994 -142248 -197653 -148877 3710 110385 -45181 794 -271592 7233 -172818 -30648
19036 115662 -92468 78906 -165850 100024 -189376 -117368 -198415 -102585 19708 40498 -8014
19024 -136560 205949 -214472 -226081 392468 -290479 5870 -279924 54206 -353674 208688
19013 163222 290319 -33881 91517 -268943 -148519 -370290 74980 -73201 9460 -95332 6890
19001 -57382 72795 -41218 213901 -62353 89250 59913 98189 -123070 102320 -4336 -10264
18990 -10264 -212154 -83442 138795 -183033 14903 -232331 -150080 45387 -89861 -138621 57824
18978 -195332 -122884 -556768 208028 -279164 37012 68473 -75518 -322807 -145471 77642
18967 -55900 -94559 -15193 28069 -69733 78732 195549 -62915 -271397 -170284 -293989 -190253
18956 -190253 266309 120607 -197066 -51309 -65537 -2212 142172 -182050 95197 69494 -128258
18944 104428 196621 26551 -513632 -71484 37186 209751 174338 -364801 183442 -155776
18933 -366184 98019 -44258 -57402 109321 -15517 -326682 -192937 -236367 133370 76785 188010
18922 188010 -86958 -261406 -39638 158127 -330018 169087 24307 -101739 -25470 -280526
18912 -280526 -119251 72540 8628 -214839 -88194 -139495 171622 -7216 249109 -416078 59975
18900 229063 -183372 -55792 -194103 207212 -251269 -279702 16238 -234423 -292397 143215
18889 -136016 309522 -138629 -210100 -179320 -112678 112455 37276 -175608 -236578 -124400
18879 -124400 3047 -180173 -186683 116033 -39305 -54849 -319395 212925 -188686 -128796 2225
18867 -195700 84184 -242030 25976 -71342 -175042 -39477 95179 -13127 39514 -337259 -81651
18855 23451 -286071 -283068 -25858 -209690 -347228 -33604 -99507 5964 33397 298544 242914
18844 242914 47985 -104907 281020 -156952 -160623 197030 -36569 -66313 -132553 -152914 279443
18832 -101689 -146770 -183333 -212932 -89233 84270 -31201 -370762 194723 75826 228698 86886
18820 -19413 -13421 250219 -282765 -98625 -4944 -179610 263810 43269 49181 114893 -74345
18808 13281 -261299 -154825 -416843 -84227 -62265 199984 290041 103059 971 234307 -79589
18796 -31482 -128624 -150031 205636 333942 9110 -106687 119559 271880 110515 348505
18786 348505 260617 -117947 -131163 34243 35976 12631 -30048 243166 -69142 122439 -103697
18774 -243771 333792 426344 -69076 -268383 -118803 -130560 -58473 -121480 140152 190412 23163
18762 -1423 -103586 -232355 217017 -341238 -64971 -332593 3090 -87466 160853 -76870 37909
18750 30572 -494073 -15354 -88087 11076 -132387 -63640 114439 19245 96094 3690 -63836
18738 -190257 -176192 97955 -87939 -371524 296840 -8168 108851 52306 -36623 -151940 -166773
18727 -166773 -126811 -177201 -530903 54940 -309383 -112342 -271996 -303327 219476 -10010
18716 1315 67276 -59042 -59755 160259 -236617 3250 -205237 236993 -263450 -310567 309662
18704 -37311 74070 -69494 -231901 359240 152660 -227349 -242572 134719 -465535 28459
18693 -267929 -341787 -135590 -1347 -152805 -24598 172343 -230738 -127833 -282063 -28965
18682 -114010 -34724 -137791 -260663 -310611 142136 -92759 132561 174719 -192901 66716
18671 61375 -66549 100056 96679 10294 -151382 68988 99579 -89173 -90741 -122420 13027 -193747
18658 -509493 222281 161672 -147555 79528 -101893 -279512 -63331 492388 -24033 -82869
18648 -82869 27279 -16587 -348397 -124836 -198608 -53289 -109819 -382228 221798 103781 51662
18636 38678 64969 -115249 -471694 -83444 52523 -165032 78616 -263156 -43616 100459 -147373
18624 121699 832 220332 -101258 -70976 -200623 -239117 -312471 386392 -44064 -45875 211119
18612 -85258 -267997 148132 62104 5479 188827 -146656 -46351 6574 28735 -190508 256810
18600 83334 159815 -96864 -109065 -170345 -204006 -190836 -245112 -220372 -116559 -269178 -314220
18589 -314220 -209417 12361 -9820 -188077 -70202 -191638 185175 10504 -195036 31459 296730
18578 296730 -215232 -201816 -129914 100284 13173 215929 -183595 102025 107598 -146809
18567 92618 88746 -169171 -51214 -13846 -185444 18864 -15833 256002 -26252 -57724 18993
18555 -108327 118225 -23736 249389 -99790 -60248 -15000 -365301 231400 180890 161380 -3023
18543 -195547 -373749 -111223 -24743 -36684 126669 -20123 123775 -252782 76371 214269
18533 214269 -274198 -284961 -51274 18307 288591 373492 -60331 -32147 -29653 142659 77109
18522 77109 -74026 166715 -11812 -192838 171906 15089 -363143 3498 -170074 -159526 54500
18510 147833 -249 -213917 -3388 -20252 -70719 195390 -210951 39601 -293204 -15806 -167277
18499 -167277 30869 24451 -178667 -62587 -237952 -282006 -46774 -86012 -4265 -101656 96009
18487 76157 89608 156734 -92674 -221659 118338 150852 -89327 -261428 44101 -51632 46238
18475 -431885 -35116 -139982 267868 222047 -360398 444315 405657 -132634 -149713 -76554
18465 -76554 -171098 -283114 -181086 -274584 183194 -226661 21356 -59220 -311983 9025 -98230
18453 59368 -362840 -303055 -76357 -28854 -475834 -87899 178380 123013 -198021 185701 -117980
18441 -5484 -114310 220766 -186027 -76866 197231 37002 91146 58083 69004 -220621 -67641
18429 -214857 -35875 177454 204027 -354073 -72231 167587 -217019 246608 237903 284623 276356
18418 276356 17080 -58276 121761 110995 194177 -148094 -361 -156251 297924 30668 64383
18407 64383 -301191 -4087 -50073 -46925 5567 -318381 123604 -44414 -64266 -204420 -173912
18396 -173912 192175 -222974 383846 -76877 -358223 8904 252101 -250962 200006 -60972
18385 38843 -149818 228389 226904 229133 -219388 -14115 -152465 20093 -53348 12875 14239
18374 14239 -33225 -106137 62407 24222 -237860 -175381 25604 148657 181 -133281 232393
18362 -53631 84513 -206133 -243267 -299099 -347537 444215 -7946 -142961 -102716 135153 -182476
18350 81549 -413991 -416612 -94521 66330 -154992 -160307 83768 -279556 -220515 118349 -112174
18338 123714 -175223 -255135 -151331 5270 -177310 294007 199161 26694 96967 215881 194626
18327 194626 -81610 152776 -297346 182090 -25290 201822 -75602 -190048 -236372 -95050
18316 6527 -55680 -71496 71367 -271106 -228107 -285284 -308646 253855 -92559 -214000 -302200
18305 -302200 316171 149921 -174464 149411 -352215 -138649 -225040 -78480 60679 228450
18295 228450 146010 -28836 216383 -276294 -42748 -191150 -57654 -63814 -208963 -235271 99253
18283 56777 114394 5239 126259 230705 -119427 35476 -42702 -71295 -121235 -135434 106932
18271 116162 83410 -555934 -148735 -106068 -56044 -80732 416449 -80149 -124389 -175187 -97379
18260 -97379 -181490 -133670 -287864 -44941 -15097 -163766 -87555 107868 -74273 153758 -460772
18248 -22613 -376939 95390 -283977 275767 15873 -182480 250816 86799 121152 -140387
18237 5175 86437 -139238 -103171 228819 92804 278418 366183 -6962 -83227 -16810 -16119 286040
18224 -23326 -76822 151543 10137 -182014 -159059 19813 -123106 -259960 36985 34988 -206974
18212 -41685 96794 -171107 -104992 5323 -25626 -389518 -210686 -134212 -192863 -285845 -32258
18200 -19063 -148880 -23794 18171 -19513 152632 141939 -44686 154445 -188841 137924 -99851
18188 199143 -167745 -14594 -60185 190282 -210282 176279 -109301 215693 -221577 -237387
18178 -237387 -116334 63241 -329395 -85323 38920 84384 -231378 173332 -332011 -49430
18167 -318763 336780 -8696 -131568 37521 -148406 -2537 193579 87706 -296930 63221 133105
18156 133105 136229 -215724 -170181 -161227 184683 31832 206273 -11990 -67252 46152 -98742
18144 96758 153734 -245468 20224 -132207 -220732 160318 -271022 -297539 79850 31768 -21523
18132 43198 -234347 -64005 -130169 21922 -236922 209138 -194527 134304 -294411 -58550
18121 -19581 144095 -38704 -100032 29680 271301 -200690 -266381 -16336 -3196 70288 -391907
18109 -2019 17330 -67581 -281963 -130247 126244 -116652 -159188 81526 133169 -92303 -297654
18098 -297654 270378 -18515 -222245 56776 -5923 23466 -15015 -61383 -83146 -202011 -13782
18086 18206 -271012 68586 -120806 -154316 143767 -57147 165358 -73614 -120288 -90616 30254
18074 7216 -94594 -85196 -86960 234477 108278 9049 -409736 31864 186087 119909 -141573
18062 -135829 -67172 117613 -170636 150836 127495 -291288 33468 -37303 106313 -35726
18051 180311 40473 23977 -3289 -110792 -430394 52432 -8038 17305 -60613 122744 -310256
18039 106687 131947 113850 -257116 90274 40604 -131939 73412 -302051 -161082 9852 -33181
18027 -115542 112605 -122833 59872 18336 -24902 238885 -208868 -5419 23481 96394 3272
18015 119434 -95473 17486 -143061 -115786 -43386 -42297 69697 87804 64503 -94635 -127136
18004 -127136 91056 132170 376647 -25398 298846 -184713 -39623 71209 33981 131358 175995
17993 175995 -106640 22476 232830 -265539 471941 -271746 -123398 49188 214977 71684
17982 -280720 -71079 792 -8156 296987 -65910 -59999 -15088 71023 72795 90616 84814 -267437
17969 71986 78847 -72809 68366 -384599 22847 156522 117742 22692 -306404 219119 270919
17958 270919 -81793 80167 151197 -34345 -74542 -68460 -23041 34254 407128 -124233 -65082
17947 -65082 182311 -352099 -19303 -182207 113182 -106464 121747 -3948 -96940 197814
17936 -261937 30409 -282909 -78053 203960 -129494 -46752 -147665 -329943 45145 117898
17926 117898 -236335 -37002 -51077 -170949 217511 -202085 214062 61306 -122814 -219945
17916 -219945 -201224 58201 69159 -139815 -79808 -385319 115706 155268 23119 -161553 -205250
17905 -205250 -16380 10247 98232 136643 18496 229922 -340647 97739 35948 -140174 12614
17893 -325354 -266649 83568 -222402 43991 -49057 -361863 218473 -31399 155585 -88471 -77308
17882 -77308 197844 -78931 -286599 285835 -173407 51782 28258 -90725 -8484 340333 182200
17871 182200 -176860 -52515 -144157 -264625 -30862 -143452 -41538 -273822 22778 -315096
17860 33128 208885 178043 -171379 -135109 -34975 122728 -202048 -202559 -22453 379919 258642
17849 258642 24129 -223980 -210000 126883 112258 367439 -259933 54792 -45083 -204539
17839 -204539 -193774 -87069 408352 348910 -107723 56241 80208 -34837 47783 -324645 -2187
17827 152661 -4746 -178669 -137516 289467 63742 -47462 -551179 -131971 23644 208927 -23119
17815 38902 -80328 97163 -5803 -431997 -102968 139996 -139057 -255007 208806 56743 -118576
17803 -21419 54231 410930 57318 -34781 -134059 -428979 117713 19208 -181628 33521 -21009
17791 -226966 -75422 -102717 246506 -317465 122093 -57064 -147053 285293 47007 -3812 -265603
17780 -265603 -114116 78606 53548 -63027 -33475 -229003 159835 193362 70510 26568 -191965
17768 146665 144009 -67020 48195 -93729 401535 -80109 -84187 -280349 197311 -55448 198326
17756 194152 -34415 -75737 -435828 -79400 -23408 28623 22185 -19454 -232084 122693 6388
17744 -79739 239553 16951 14439 -246591 -114577 349580 -91960 -164807 -66826 92071 13341
17732 56532 9289 156888 361796 -199016 26418 -170907 165254 -108820 -81174 386085
17721 202449 77346 -181579 -217305 -158476 35198 -36019 81844 -232937 104386 -248909 236552
17709 267339 -46160 285102 -21611 173615 61328 8685 -49545 -318429 111458 -179728 107073
17697 -24764 -15850 -179530 317050 -255677 -122034 9442 100073 -81791 174401 177940 380381
17686 380381 -284408 56861 23116 82288 140423 -235407 116949 -200795 -120428 -7573 47069
17674 -130584 140324 87557 287154 -22649 63064 112038 -204571 -234901 83890 -117060 57819
17662 -149119 131889 160534 213691 -41417 52383 141862 11247 -255034 -77681 -142413 182928
17650 -186533 95470 129402 217204 -34761 -29279 164168 -143516 -82896 200311 -190800 303384
17638 -82444 -264209 -32849 -5331 -25171 57142 294813 -105655 85871 41337 261882 -60791
17626 77326 45463 43021 -53040 225954 158805 24645 303837 204883 28202 73153 206028
17615 206028 -177871 32965 76128 24339 10869 -43105 267534 190359 300956 269870 -77529
17603 -117760 -134289 533296 291694 74964 26585 -58624 157916 145287 174061 94972 102589
17592 102589 149129 -15844 -91759 241912 281801 -65198 -30045 354444 27080 -47316 -5347
17580 324247 -200315 313795 55268 208884 129354 -14408 229667 85639 -356436 73407
17569 -78586 -115319 406442 -123100 43921 -144229 264930 6558 243972 -118355 -202090 -75745
17557 51061 35678 125366 -89069 43499 36278 264044 161609 137695 205400 -159802 -141783
17546 -141783 56052 724 160523 144545 -3114 420 68303 -15771 -220858 157243 201945 133355
17534 133355 273682 162684 -218967 -96670 231931 158418 241738 175329 51758 53820 155108
17523 155108 274648 -169290 16534 57499 174699 154592 -127444 37175 -5168 -30204 -231869
17512 -231869 -21390 -127860 -438714 251758 91745 -114078 13643 291451 8970 86645 -92921
17500 -171364 154084 46700 86571 33791 -80891 340796 -251952 129674 77934 185388
17490 185388 -12797 -17962 132111 -38371 -50094 -10116 130353 344924 -217161 -77863 26765
17478 196882 401864 348189 20066 127622 240896 265264 -209367 288081 -106085 201475
17467 393638 141200 160967 47842 250998 255852 73704 61096 121758 253634 -6617 44753
17455 266672 -23616 -21990 134416 266875 6999 123179 374578 59659 235817 310365 477068
17444 477068 104669 147916 -87699 269473 8062 374424 51891 45887 106442 115409 74356
17433 74356 162708 284829 145235 166885 -167447 241190 -108854 567520 272570 555936
17423 555936 159274 182602 220246 209772 347001 35544 267927 -127107 378565 104807
17412 360623 331368 390543 439217 458836 178729 354648 116361 343163 64148 111686 476834
17401 476834 124843 149504 -35863 337416 33361 126960 98323 110133 310482 -24078 19236
17389 52980 495702 254401 283399 189269 120304 189149 489543 300657 466265 -21481 -273448
17378 -273448 -127283 184772 50423 223233 433680 23368 247597 38799 198010 21383
17367 279582 98250 -23761 378344 32610 407215 42842 181140 222289 372809 209364
17357 209364 105942 352717 270033 73917 195455 88697 695025 204218 254358 229582
17347 229582 284360 256315 250628 88038 183168 -141754 323851 332854 -199411 -15857 -44617
17336 -44617 226659 -234248 -132357 99849 257986 113222 98646 16256 58918 316102
17326 316102 -41945 365038 -144709 -14810 -18649 328783 335951 648454 301393 105982 444499
17315 444499 334721 121667 197086 254925 181256 -132847 239541 297668 114609 29733
17304 378639 272486 81414 -73825 189933 252083 -52297 307485 306433 160234 375941 126054
17292 -39353 267686 154987 434142 -54505 -8475 55909 162343 315545 213230 348924
17282 348924 166366 96003 118712 322086 9809 152936 -167138 85195 424696 -67919 38895
17270 81173 42604 104106 157605 259548 452756 163210 426021 581603 3510 109632 400746
17259 400746 145648 526366 392583 430855 15087 145462 379460 227709 226334 55117
17248 -153589 150236 448753 67707 453289 -37306 158923 403950 249430 359254 61778
17237 272490 125458 149252 159526 247946 266560 297077 682309 172520 612942 388693
17227 388693 122812 350514 142011 309391 211513 633338 69753 243180 -54089 445191
17216 343165 505011 135872 283587 341962 417473 519967 322877 -94437 196732 442406
17206 442406 74260 124502 102348 204451 381436 131551 162163 143766 299908 243838 364317
17195 364317 198870 321476 188974 168648 345749 293587 413196 233508 227271 253096
17185 253096 294218 681512 575401 15657 260873 257948 421935 412516 65805 466475 151708
17173 269444 427237 365656 283858 -20422 232301 499759 490065 -20949 238021 371208 220666
17162 220666 145650 186849 643208 586470 306624 356620 167179 184532 276072 347905 409913
17151 409913 650767 223559 68419 363449 386039 289514 583617 212563 133335 217826
17141 217826 158197 340977 390344 195473 304866 279023 679625 250954 151622 394145
17131 394145 543501 291641 90309 348835 263938 494756 390401 428429 642583 286148
17120 311992 344210 603293 660616 291052 294369 166431 415576 503897 594985 277558 97120
17108 386426 621857 659779 650052 439237 670723 358585 349324 542276 398940 492008 259254
17097 259254 411886 510097 273675 346014 425965 321268 548134 613478 372479 603811
17087 603811 102550 458938 154055 736609 318334 611060 282386 373211 361995 295358
17077 295358 260681 582008 862506 422947 205397 377357 593563 474424 533410 659040
17067 659040 586785 598266 503208 828164 667160 212474 1060026 453070 732247 468895
17057 468895 491989 589902 692027 402932 374847 642584 712398 441136 757041 536221
17047 536221 803279 524567 576791 782274 590758 583531 869191 542900 409711 574634
17037 574634 507101 169370 767662 426446 424002 418307 759074 511122 851372 351944
17026 534330 591207 672041 607255 521627 467179 1007888 878701 825878 468230 1011683 404658
17014 634491 489968 551907 871460 837048 744910 716487 738087 783945 930884 686980 732708
17003 732708 788929 920782 599971 1035553 735586 927321 688280 792664 957431 994035
16993 994035 992593 1042948 768562 839225 871600 775507 837068 1108433 554925 805616 1053985
16982 1053985 836329 881953 760475 845189 1182849 1280675 736184 686119 896802 1020612
16972 1020612 1122410 980415 870121 985156 814676 1031503 1346923 1312566 863382 1118377
16962 1118377 1115893 1274222 933163 1285540 1337055 1119142 1187166 1351813 1060005 950779
16952 950779 999423 1168059 1266895 1376009 1275665 1219370 1056920 1082650 1047086 1335299
16942 1335299 1377884 1318173 1201455 1128859 844787 1172161 1729870 1133728 1443942 1372661
16932 1372661 1164216 1695967 1286946 1125661 1366694 1353890 1509800 1596452 1538291 1444550
16922 1444550 1492218 1406582 1550124 1579778 1488072 1719305 1441420 1548845 1487878 1565803
16912 1565803 1574437 1581237 1811646 1804414 1800303 1607562 1501414 1988173 2125019 1537684 1978610
16901 1978610 1785268 1738448 2007980 1784735 1980293 1901438 1663901 1844361 1869324 1932741
16891 1932741 1962532 1865116 2050041 1941191 2054061 2026502 1878118 2265018 2280809 1866039
16881 1866039 1891057 2199222 2409962 2560018 2387992 2695476 2211208 2309422 2514175 2554893
16871 2554893 2405182 2448247 2354521 2823499 2788970 2703449 2839565 2520785 2772485 2798850
16861 2798850 2851612 2852827 2729683 3236705 2873701 3235130 3198653 3192328 3036446 2865122
16851 2865122 3092106 2988512 3340822 3561278 3541260 3209236 3835689 3208648 3030409 3291685
16841 3291685 3433511 3740101 3541820 3273299 3625617 3506342 3680420 3980705 3819919
16832 3819919 4109165 4107816 4267408 4093409 4250576 4193359 4167315 4343469 4585070 4428970
16822 4428970 4680648 4641137 4624269 4826427 4919087 4863263 5047595 5203204 5139379 5125213
16812 5125213 5591717 5521331 5576171 5510165 6038525 5663962 6074385 6090648 5677614 6161574
16802 6161574 6185348 6349438 6471215 6705804 6505524 6670114 6581891 7245427 6835982 7422929
16792 7422929 7356551 7841492 7612997 7760153 8303192 8211862 8390576 8313624 8729678 8631413
16782 8631413 8793090 9091257 9559910 9453966 9766397 10203856 10298946 10356306 10443752 10992935
16772 10992935 11485933 11654255 11783852 12100475 12394746 12362157 12532188 13309371 13606866
16763 13606866 14130060 14410537 14657447 14963623 15477019 15716240 16099301 16516338 16991098
16754 16991098 17573434 18392988 18265085 19108339 19930360 20404438 21401295 21479898 21922773
16745 21922773 23155462 23765060 24474465 25213158 25891206 27306952 28143196 28975454 29902071
16736 29902071 31153747 32158660 33415241 34327751 35735683 37283163 38421634 40389742
16728 40389742 42049621 43222797 45128569 47059359 48945423 50797529 53302701 55196238
16720 55196238 57908846 60571361 63007268 65949055 68481249 71717097 74635625 78552094
16712 78552094 81904571 85900860 89629797 93401857 97724342 101562039 105684924 110406203
16704 110406203 114606059 118804684 123180825 127612856 131530171 135201876 139101159 142194655
16696 142194655 144789191 147905982 149545656 151037394 152274069 152519933 152483947 151528434
16688 151528434 150490741 148508007 146217171 143427244 140439599 136507077 132983094 128658804
16680 128658804 124619571 120287881 115804880 111504105 107129248 102918868 98389659 94703596
16672 94703596 90480326 86687897 82917765 78884672 75992843 72550033 69121658 66488352
16664 66488352 63317346 60669642 57868485 55516416 52761819 51210600 48720584 46606682
16656 46606682 45020619 42729313 41653258 39657190 38143599 36899713 35495716 34065372
16648 34065372 32898277 31616931 30437453 29474570 28316519 27538128 26315243 25373229
16640 25373229 24820565 23974872 23111495 22619407 21802425 21110002 20436868 19771480 19052002
16631 19052002 18657880 17875682 17678992 17306646 16398783 15928148 15417474 14911528 14908620 14582309
16621 14582309 14005421 13688723 13463894 12948314 12563412 12407820 12423109 11637183 11575456 11353834
16611 11353834 10816528 10871027 10376098 10172845 9839738 9835758 8998908 9155169 8908449 8962996
16601 8962996 8678328 8610210 8431848 7948031 7847688 7816276 7785682 7740715 7212836 7277670
16591 7277670 6790146 7372949 6559648 6457987 6263307 6428555 6120252 6043856 5783939 5915768
16581 5915768 5966472 5486345 5209711 5196927 5358892 5400472 5222042 5322199 4868946 4917067
16571 4917067 4776669 4672909 4494124 4618219 4374380 4469484 4390496 4145993 4393047 4021753
16561 4021753 4050952 3987382 3889584 3820877 3580858 4052055 3566398 3842222 3585758 3804555
16551 3804555 3438106 3638129 3444253 3588428 3236685 3017998 3224927 3135836 3323826 3325418
16541 3325418 2933759 2983944 3101527 2953509 2489843 2933376 2812127 2749396 2625627 2616319
16531 2616319 2791074 2995742 2430090 2737773 2321214 2541079 2598355 2548507 2396702 2270554
16521 2270554 2106395 2459714 2426288 2153762 2171360 2135151 2204569 2112568 2339650 2173131
16511 2173131 2146907 1796517 1975311 1694517 2159289 2134082 1759306 1864240 1502878 1522683
16501 1522683 1634975 1845149 1601313 2027419 1775742 1797072 1932844 1785877 1952336 1479493
16491 1479493 1558070 1509135 1714187 1581436 1715692 1662867 1533326 1843380 1798190 1418316
16481 1418316 1670751 1419017 1089622 1549960 1582450 1355937 1346435 1378837 1177768 1364705
16471 1364705 1500643 867889 1595803 1191349 1391575 1180402 1121069 1304999 1516230 1247876
16461 1247876 1265279 1118877 1396516 897353 1052624 1108736 1299998 1166354 1146394 1078656
16451 1078656 1222538 796291 1346774 1109070 1295332 1451503 995773 950995 906556 1187611
16441 1187611 984123 987716 807447 1108460 827835 1048402 933643 892213 1042604 946735
16431 946735 724992 819684 880746 1081424 613425 586074 901391 652092 974281 767252
16421 767252 1094697 671269 765040 744040 541390 574692 964321 738093 906936 700735
16411 700735 530506 775946 785808 787270 562726 563601 584925 684033 569992 652834 594890
16400 594890 722319 621726 706641 992197 558384 773494 737667 661492 760313 828372
16390 828372 477087 681346 401707 566331 965741 822487 107493 620789 508289 292071
16380 292071 765813 549775 1031017 682196 290317 657598 665606 370832 576035 805484
16370 805484 512490 35793 611416 531009 497380 627250 192646 539612 286374 673887
16360 673887 430871 508269 412326 694974 144288 531923 609416 138729 420089 291220
16350 291220 464739 627115 443740 870246 540723 361722 562578 341101 599219 511931
16340 511931 698880 585061 309177 369491 258091 564342 270401 394483 401102 349566
16330 349566 204477 704211 568509 320499 514635 386162 505206 490207 295170 638629
16320 638629 531836 355689 474685 238652 440863 461340 157106 302414 307031 561476
16310 561476 496754 105057 170309 571542 350202 30203 500398 391152 -79868 402991
16299 555722 308094 436102 158336 203413 525062 633612 180186 343331 127822 246988
16289 246988 27498 615532 357996 212708 305812 102283 339847 269520 309424 393813
16279 393813 21880 430689 -5194 343453 50496 245193 115805 401221 272916 736890
16269 736890 77657 549262 220152 300437 34422 296741 219447 86522 207161 58907 223450
16258 223450 -39799 302096 381497 182368 280521 24331 219703 512811 109839 348452
16248 348452 123489 147664 241340 68519 476208 235794 262557 589949 220938 85594
16237 143296 -120539 129083 205891 378360 190257 89534 6536 154734 332651 351631
16227 351631 372014 184363 -39581 366347 230157 100010 22462 123032 413506 -361 120235
16215 393063 35347 110530 227338 485746 266586 55699 77902 -126213 81967 139704 202521
16204 202521 495924 151618 199798 94794 227098 61757 307560 406606 -73952 1924 415779
16193 415779 100940 187891 65067 -125612 175923 144568 305454 -87177 33344 583582
16183 583582 459572 183675 227393 186186 110777 38388 359692 295712 91564 318146 4182
16171 275809 493583 237725 456382 205670 563764 276546 145555 210834 80055 -35632
16160 383682 -5359 85988 -6051 -243714 93133 -705 152124 227357 40776 178737 28349 273994
16148 273994 -281607 -18449 33419 -80554 -237437 371110 20770 -76293 -377552 -182445
16137 -159426 318623 -119986 -247721 185276 -287433 361425 3100 199090 204069 257004
16127 257004 276543 78263 171152 -218298 119543 -182346 397784 131182 -158480 -180502
16117 -180502 218214 15337 56703 303051 73859 224255 20335 -249300 -24472 -19299 -15387
16106 -15387 114895 -89019 180151 101291 117031 -118281 -36564 278068 49055 167334 30438
16094 113326 198911 209081 429140 288059 119838 234143 37490 -141547 12059 158561
16084 158561 343566 133731 -75549 439 64589 -162363 415767 -98415 -2362 224139 83822
16072 34029 -189550 360198 -9747 49237 -8343 198887 84678 314678 117978 -22328 -31976
16061 -31976 163325 42641 54297 171856 1529 170615 38026 -82093 -182960 137738 202345
16050 202345 -122996 264704 93379 -25485 -65969 151892 -182873 65766 -26006 177780
16039 -26919 263250 95035 243096 100580 -30527 119435 322111 18023 2802 185964 -273586
16027 -153742 137665 59535 75746 28032 281368 24200 141269 202000 503690 7887 -80430
16015 12856 -326995 -24641 359169 -28882 -18827 -88635 -99953 103073 -113171 -69900 -92919
16004 -92919 77340 -29747 -179617 230522 93873 -75649 -124566 -202793 -6488 -174940 18204
15992 228044 -258653 -146631 -8215 106560 95989 264071 123884 -214332 -245100 123876
15981 35053 -65206 -132923 -53872 -8217 -369329 58297 260625 54975 -126490 110141 -109208
15969 -64670 -467725 198953 -85016 298822 281138 -49989 338297 153546 14297 249247
15959 249247 485200 252355 484738 60820 46703 547117 -160469 140483 -142920 -151996
15949 -151996 277639 179319 223131 -66347 -198457 338087 -37709 195321 -232193 -69442
15938 234671 72538 -157266 132728 15260 31382 5871 107631 -97990 107332 163011 -34675
15926 -134090 -3146 94266 -46498 -91102 -113510 -241394 14186 -114769 220359 -152139 107669
15914 -78428 -99214 -411978 163083 -118716 125239 233197 14141 126599 -15602 -184558
15904 -184558 -104829 -150029 -264811 16346 263958 -5838 -248238 122750 69903 -26592 349734
15892 -235016 -96694 -222107 -270150 56663 134146 -49415 -104993 138978 254086 260790 24176
15880 -53474 -75035 131107 159248 292500 130407 166585 22210 329618 317331 -133321 -317495
15869 -317495 329399 -187984 44930 -85738 -23755 109459 -266859 143143 -124768 -210045
15859 -210045 312342 140443 -53678 -87231 -44256 -207828 -203176 155291 198228 88681 -65793
15847 -103691 168254 -133692 -109475 217117 -129498 42276 75098 -213700 -54251 -70636
15837 -70636 122728 -154760 -147142 204199 172030 -306872 -223703 124647 -56098 178581 -23364
15825 256718 13141 -366152 -236830 125307 -109404 88796 -226550 -170866 40961 -233306
15814 207225 102421 -186172 65612 115220 79634 -158748 197141 54620 -542143 45262
15803 112826 -379131 -16020 249925 -268576 155454 -204214 -18315 -307080 8946 157104
15793 157104 -125000 1296 120301 -187873 -287534 -145538 126563 -84706 -90605 31003 -211751
15781 115623 -49164 327514 -30084 37099 -42114 -147439 -95769 301422 6511 51465 -55540
15769 159540 176858 -61568 -149305 378072 -83186 -168135 267092 473799 -173928 -130184 -235851
15758 -235851 -62907 55552 14105 -102914 -274109 25056 42251 157175 -99974 -552621 22077
15746 -39575 -44685 231661 10121 -151644 -51204 -986 15423 -118142 96315 -151121 81580
15734 -129645 -314369 -200706 320974 -123988 -108369 -91778 365248 -8966 -70863 267758
15723 83278 36304 91874 26344 -59988 172484 209464 160515 -145092 -179736 96913 185687
15712 185687 -2227 -64222 28306 -2399 -157190 -136189 -96990 -73022 -87154 -76555 48807 -287387
15699 10145 112864 52040 -381929 95098 303930 -24272 -177866 -260692 36979 12940 -88790
15687 -61884 -94500 -73781 -188048 109551 -14682 11168 26834 47059 -131940 -16895 311153
15675 155999 76836 -56740 -15956 -160911 79489 101391 -329060 249550 322885 235470 60991
15663 254719 210290 -44078 326955 -321690 82757 -205302 -84407 199593 -47763 230269
15652 -182471 -92656 51705 -17057 -118922 355421 -166771 166743 42462 13763 52823 -227156
15640 -88003 119021 -46097 -277955 -90837 272146 118931 177499 -77048 -31974 92752 -112555
15628 230958 -51766 -57856 -240429 -86420 -157323 -48251 162801 -331129 -52987 -152897 -204439
15617 -204439 189392 37439 329288 -331722 20310 128398 -43313 -7255 300189 -314517
15606 21452 -93916 -1984 -101422 -357502 -84569 -64659 -90887 -262682 -3037 -12260 -132485 -60137
15593 -151518 65801 259070 157570 -338129 193604 142570 187742 -127857 14024 206228
15583 206228 -128981 -8141 76953 57883 47290 65716 133447 -7767 41520 96362 19477 -311779
15570 -175898 193107 231202 -57320 -71309 25623 125797 -69431 192909 40476 127368 -52123
15558 54960 40293 -21594 -226303 123708 -209193 -111775 -30102 -22229 -197883 7153 -12906
15546 -301234 421106 193751 92753 31295 -155605 -24003 -210913 28976 -224104 -72961
15535 -29244 -34922 -203137 107619 219729 -297710 -141400 -65083 -44045 -161249 100019
15524 219897 184215 -112012 62943 163880 -30847 -255666 -137994 217467 189861 180713 -83600
15512 68164 -193150 130061 -198619 -197526 110225 18255 -3868 148990 35634 -379795 288239
15500 188796 -103130 -127968 200206 -182199 17781 -172168 147369 -248658 11969 -315333
15489 375963 17895 62236 -109520 54381 -441225 13559 -66336 -137338 86931 -21992 -109509
15478 -109509 6656 38528 -219412 55839 -228003 -289038 -232763 -70900 -236798 -36903 -192426
15467 -192426 -17698 72493 73607 63344 -198788 9134 149523 -122017 -137883 152963 80232
15456 80232 -47743 -382394 -57666 112109 135401 -2391 130178 100043 -121796 -75254 -64352
15445 -64352 -114469 -112122 -31635 -75012 22146 -119802 108744 -280627 -63083 -42234 -2377
15433 -248281 -237543 257669 142996 -285869 -291548 -75033 -57412 2311 -70732 -131551 350406
15421 -85257 35802 -223816 -4269 51099 -298122 -262219 -202399 337925 -13952 25390 -135515
15409 -192125 -17762 224296 281520 105727 -72854 -314101 -18711 -17464 338565 155222 -158010
15397 42585 2452 224021 3588 -76743 33638 28132 325684 318750 402097 -152447 22344 -253232
15384 161729 -376520 203363 134653 3130 -93986 52858 58757 -1038 -32853 -73408 219532
15372 -221178 -39791 227599 51326 97123 118320 -249 102746 -19948 -81370 103751 -86526
15360 216305 -248404 -98623 244922 89129 -15316 -501368 177394 84635 459760 -159775
15349 -254153 91843 -35104 -123816 113428 -172579 -191845 -37203 151140 -12847 -238657 -204486
15338 -204486 -39909 -92457 333027 307410 -112529 -341204 103962 248303 -280481 -149316
15328 -149316 -43597 144543 58083 -146656 -76307 -46759 224948 -16645 91184 281288 -30072
15316 40248 17297 485640 45910 224570 -52618 285581 -51615 -22834 188641 206015 -58665
15304 159038 -147884 114558 86766 43124 -193923 274839 9816 -140456 205611 200996 39801
15292 67680 -274505 -94065 -223984 60106 124626 164282 -25183 -368179 283088 -82396 -28564
15280 -93074 -52895 311735 -42613 -8566 258036 204410 278315 245717 -105694 -30856 259980
15268 -77275 209191 48124 177054 -29755 -65786 77444 -359853 207637 36140 -127124 297578
15256 9995 83969 6372 187911 56979 -296925 172658 46129 122314 172998 83112 145999
15245 145999 -69793 45744 134225 15105 271076 -62343 22339 -225879 224880 -13720 186246
15233 -22884 -62683 -4451 127977 -120040 -115234 -238756 149930 -94306 196928 419028 1276916
15222 1276916 1774084 1022487 1505670 913073 349384 285661 55971 25108 -68441 110770
15211 -116409 -35478 145277 -2546 -38898 -91831 -19609 246216 2807 29241 -211608 315710
15199 -22705 266463 164207 -250018 -181972 -121492 284468 91064 -550 -76792 246413 83090
15187 439313 4692 286523 -194876 185419 -80435 -90341 113062 197818 130328 214119 338953
15176 338953 100554 -175699 12544 18126 121453 19274 -55769 -92714 189928 264683 125326
15164 149581 -98215 129393 -34281 150419 273903 181586 191798 148230 229750 255304 -42347
15152 110836 78006 -209308 -187426 85428 19572 244962 -176339 -507980 -155983 241589
15141 520963 -53035 -106328 211932 181500 202397 174671 13728 141366 -48014 -22406 321675
15129 331247 205766 199283 90216 89619 88401 45548 22329 282478 38922 150373 -123634
15117 37449 -87678 203091 111382 57102 229251 103359 -195730 363999 204676 39614
15106 271944 278086 321488 83053 47044 206157 373007 141934 -297188 129111 325363
15096 325363 96699 50027 276077 102433 65214 301899 183770 4135 294894 132840
15085 239527 -346621 107105 -3713 406093 483771 40168 31367 331478 390689 -81322 151346
15073 -103072 426110 130723 -24551 223085 -180246 -57990 56003 187159 308390 55628
15062 73426 550268 -85085 252823 -150853 150802 95795 178739 120105 350283 162523
15051 48776 103232 145587 351183 217672 -122504 80404 171416 169736 16121 -71592 -286183
15040 -286183 108825 -80000 -136769 -48912 241875 -9087 -1159 256899 187945 407068 271821
15029 271821 449444 -70689 -116725 50467 210950 379959 241946 -135311 -79415 255039
15018 -113907 46582 97573 589966 272277 249784 94036 120760 221049 -200674 44740 235976
15007 235976 493982 111877 259408 221141 50436 49216 509303 432683 62073 414188 62443
14995 7553 236428 628071 281910 579524 37230 238459 495147 593391 128931 376219
14985 376219 330297 -20373 613864 48900 -40829 48959 -129517 105446 508840 289145
14975 289145 89173 279181 541528 169380 393977 180639 517124 199068 385143 -68100
14964 385364 -23628 110099 186116 261803 59748 25560 102029 32100 73613 313474 54656
14952 112488 -97780 245769 791090 51594 304851 286681 280040 178866 435712 449289 463845
14941 463845 149947 192656 111547 14654 241387 444270 504838 237081 263529 -95359 189184
14929 432533 308778 287723 212809 221246 15377 84974 232828 543042 330777 311566 72328
14917 -59969 236917 14009 181374 299280 24704 373099 370270 186089 561746 71112 417059
14906 417059 434243 71297 216995 254989 397306 196003 377292 486672 422518 497857
14896 497857 331293 430499 -28046 526239 353474 430940 159584 166359 402922 274367
14886 274367 333967 310402 378532 354593 199304 191749 186145 445576 340578 202269 270297
14875 270297 421615 387652 386885 601341 -101515 451055 302895 164413 -9202 152139 497616
14864 497616 455504 439939 371732 303737 339943 11715 444853 199256 114802 319469 413208
14853 413208 271155 182424 484655 264404 408757 174748 503864 373134 108124 222430
14843 222430 359239 505856 502352 629723 331259 -6846 354996 438378 384097 406299 488641
14832 488641 336821 590086 244700 375200 526806 260205 412069 495922 596172 533062
14822 533062 475991 494397 326359 263317 793694 398414 481073 581760 541145 471234 461896
14811 461896 335716 535696 554592 299873 761110 516084 457225 157162 665881 667355
14801 667355 653221 316911 583799 306529 666246 738680 510322 406805 577937 455640
14791 455640 594743 350645 622188 415103 660068 537484 499027 702812 560995 718498
14781 718498 420293 430449 754275 677931 526396 437317 435219 586778 558407 505016 578735
14770 578735 575691 457979 491795 826726 390648 752032 372468 762623 800445 512703
14760 512703 664764 755667 522792 442542 557230 607423 621768 307146 333200 670883
14750 670883 633927 580993 791126 417873 622351 394257 637725 566780 395181 810215
14740 810215 716621 577786 408586 352594 816802 599315 573303 620488 593495 676788 317575
14728 574718 696049 586846 985312 955928 362766 602432 748606 591649 759788 804320
14718 804320 688823 707806 611439 331838 739455 748882 591144 742974 759612 515419
14708 515419 875522 905009 599594 611758 690490 656350 512329 780851 504690 475340
14698 475340 527705 1195310 414733 554873 765278 591576 863849 903536 281308 482495
14688 482495 906309 1075644 764084 833830 916443 947481 602005 763153 808732 794391
14678 794391 717706 1024218 828502 1069667 685493 843290 837565 847078 736614 940912
14668 940912 719251 984853 811748 859283 898424 935618 1065375 858328 635433 733055
14658 733055 1072574 858257 922948 939116 854758 1056022 1049043 785107 1134222 929032
14648 929032 1033824 872546 1008820 1062954 1030381 1267471 735346 1184129 1159933 1143380
14638 1143380 1464543 1261497 1314780 1102874 1342629 1385472 1121120 1156467 1087716 1027396
14628 1027396 1066868 1110284 910055 1246653 1372029 1162976 1009457 961960 1022673 1104147
14618 1104147 1139947 1124185 1255864 1073773 1349265 1192647 1353405 1129112 1259672 1264672
14608 1264672 1323048 1271087 1261462 1173308 1475146 1472538 1633698 1431121 1265701 1199868 1061308
14597 1061308 1520559 1514199 1255332 1652188 1627891 1460655 1364849 1321186 1242351 1458997
14587 1458997 1588068 1760627 1219409 1288597 1792599 1443022 1698817 1463558 1536188 1785309
14577 1785309 1861168 1670101 1712632 1436269 1738857 1736065 1646384 2132614 1975667 1704150
14567 1704150 1553482 1665094 1700555 1819253 1792305 1757154 1981473 1790064 2077687 1871192
14557 1871192 2103340 1707887 2063055 2140395 2081303 2052850 2097160 2100801 2227856 2166463 2159593
14546 2159593 2189202 2109723 2366453 2254032 2480656 2432972 2476072 2634034 2289010 2418219
14536 2418219 2347955 2498560 2973186 3008939 3072945 2950644 3301972 3639213 3554563 3717429
14526 3717429 3888486 4729773 5921033 8406342 14073067 27296446 52339437 38183930
14518 38183930 16148952 6396762 3749930 2930801 2047495 2076003 2037926 1850047 1889135
14509 1889135 1953702 2003059 2004208 2121037 2316961 2234013 2036577 2186211 2323695 2092677
14499 2092677 2577532 2061416 2692605 2472900 2901971 2498935 2800390 2475327 2255767
14490 2255767 2430849 2666470 2501743 2956298 2805047 2664788 2755217 2918225 3047186 3152947
14480 3152947 2904793 3052561 2749307 2956206 2911975 3124922 2909213 2989248 3465672 3183652
14470 3183652 3401741 3262218 3479781 3337075 3542444 3327106 3699935 3831242 3569040
14461 3569040 3561026 3537571 3909503 4076322 3821136 3828084 4070275 4274343 4007001 4451863
14451 4451863 4370161 4255244 4504188 4331912 4318035 4354641 4541638 4388243 4487775 4525543
14441 4525543 4415307 4312244 4662749 4783948 4786394 4994351 5146600 5114361 5118508 5064584
14431 5064584 5125022 4970768 5188245 5192257 5368584 5539072 5378709 5504789 5708262 5821759
14421 5821759 5855715 5448056 6052414 5877763 5900198 6028725 6267436 6145627 6317733 6088833
14411 6088833 6532883 6548392 6589083 6783826 6839062 6878281 6851118 7273151 6882973 7090776
14401 7090776 7313201 7433110 7443842 7651487 7785280 7837649 7920487 8240323 8203868 8528549
14391 8528549 8009291 8636193 8856782 8476043 8883191 8990337 9006812 9344045 9190276 9563572
14381 9563572 9676317 9986826 10204036 10360392 10257867 10520542 10504783 10788806 10778945 11060357
14371 11060357 11241427 11450882 11586877 11746926 12167863 12134710 12438950 12863163 12778097 13052833
14361 13052833 12989497 13813730 13257343 14079096 14246924 14333755 14508162 14931870 15212941 15626845
14351 15626845 15579120 16361190 16568484 16930018 16992315 17360329 17889118 17668192 18745053
14342 18745053 18872088 19035961 19417508 19733392 20408050 20696869 21344962 21779993 21995840
14333 21995840 22686285 23167062 23703327 24239861 24961355 25546590 25970164 26532986 27570966
14324 27570966 28256959 28505114 29498463 29976712 31054614 31909895 32420666 33427460 34540102
14315 34540102 35207755 36132990 37237629 38307305 39350439 40473612 41655794 43066184
14307 43066184 43790394 45478000 46824877 48260990 49814712 51724992 53164572 55092295
14299 55092295 57080135 58759957 60974014 62682577 64975163 67251675 69891141 72656998
14291 72656998 74887403 77964583 80997188 84231889 87677798 91251744 94902735 99337171
14283 99337171 102965268 107555033 112121648 117244333 122650357 128039544 133955174 140427488
14275 140427488 147240862 154167041 161618885 169659423 178142822 187070826 196955870 206822258
14267 206822258 217399886 228609062 239891691 252350787 264709590 278201939 292148706
14260 292148706 306472831 321099174 335931618 351527503 366834330 382076861 396784614
14253 396784614 411257629 424882825 437069061 448042498 457064034 463997806 466871635
14246 466871635 467057919 466040229 465520789 459960020 455261276 451261966 444544728 434558057
14238 434558057 422469624 409291401 395176918 380825183 365316719 349590273 333983094
14231 333983094 318266827 303183704 289378202 275407686 262172483 249356599 236641016
14224 236641016 225048366 214102653 203693617 193565710 184018500 175603619 167563800
14217 167563800 159502894 152053767 145204660 138361623 132344626 127076695 121428664 116121859
14209 116121859 110905933 106530825 102069827 98726915 94995735 90748929 87287620 83814041
14201 83814041 80589361 77814240 74671801 72234407 69727312 67329735 65054296 62989544
14193 62989544 60816484 58595352 56557274 54850182 53370935 51959444 50834139 48645969
14185 48645969 47208373 45803693 44225602 43042281 42627869 41311498 40036441 38271977
14177 38271977 37969572 36877580 36104514 35266794 34043437 33125107 32161927 31485440 30579510
14168 30579510 30043638 29292951 28564229 27852789 26912600 26585058 25879906 25556360 24706573
14159 24706573 23796807 23939612 23214820 22781777 22032759 21610035 21195754 20764680 20437968
14150 20437968 20031789 19624714 19158960 18948706 18546206 18234234 17673191 17486869 17267812
14141 17267812 16622878 16488158 16309792 15707214 15769236 15368444 14985416 14557894 14526909 14060532
14131 14060532 13955608 13484127 13386892 13037427 13014201 12826780 12526920 12250632 12178446 11890913
14121 11890913 11739817 11392181 11367192 11429911 11054359 10672605 10704212 10742570 10533972 9832664
14111 9832664 10109747 9903321 9946747 9888492 9742221 9301689 9419003 9589171 9015999 9010081
14101 9010081 8884813 8598192 8494605 8315995 8473139 8348937 8082629 8211932 8094366
14092 8094366 7606332 7853123 7687587 7498140 7403044 7314430 7168415 7119300 7142282 6971612
14082 6971612 7007250 6605474 6590484 6511447 6424906 6216988 6274698 6249697 6075919 6248141
14072 6248141 5779956 6120792 5953669 5893421 5821018 5496889 5294340 5592784 5063300 5753842
14062 5753842 5262441 5384616 5186089 5234069 5081494 5230590 5127563 5138426 4983063 4903095
14052 4903095 4901254 4766518 4728432 4910150 4867733 4485000 4343130 4447592 4303471 4573658
14042 4573658 4447468 4505573 3914468 4140680 4461410 4127380 3820091 4043615 4391580 4348430
14032 4348430 4169435 4075152 3917423 4087686 4026852 3668963 3610980 3528907 3838228 3806162
14022 3806162 3388486 3695288 3220899 3354784 3481444 3213505 3427888 3287494 3513414
14013 3513414 3313113 3399889 3102146 3173310 3349007 3115540 2991004 2984383 3183367 3322368
14003 3322368 2854942 2845543 2764860 2699338 2679207 2473234 2884240 2442690 2867820 2823772
13993 2823772 2929799 2539577 2638273 2544632 2300512 2547010 2464543 2554923 2513643 2335604
13983 2335604 2637138 2303403 2570314 2202785 2372609 2283669 2041148 2269241 1941004 2186257
13973 2186257 2228423 2035834 2062919 2094944 2024373 1969721 1820315 2177550 1956065 2221292
13963 2221292 3719773 6629961 16827709 43115326 44928691 22184906 11981422 7091448
13955 7091448 5285643 4352401 4152363 3695392 3312190 3055264 2870567 2753223 2642654
13946 2642654 3034924 2736823 2495609 2606704 2720582 2658783 2258637 2174173 2321497 2053556
13936 2053556 2117514 1813390 2125589 2491170 2152006 2271468 2000004 2383859 2089842 1699703
13926 1699703 1713432 1989976 2100376 2111875 2109198 1846202 2109570 1745560 2089232 2124874
13916 2124874 1835997 2007535 1893978 1685077 1699285 1731360 1728067 1929644 1597320 1481749
13906 1481749 1421731 1825763 1638887 1630445 1818203 1703183 1485550 1575569 1721549 1548224
13896 1548224 1649692 1509030 1276658 1660055 1670584 1585340 1351999 1082833 1519328 1541294
13886 1541294 1367725 1201932 1752011 1434731 1516214 1709251 1435932 1302454 1509222 1606425
13876 1606425 1447691 1130455 1346795 1532864 1662086 1437598 1259372 1803653 1421142
13867 1421142 1280568 1318206 1173487 1373007 1252876 1226826 1259304 1274646 1027657 1517787
13857 1517787 1273522 1180587 1536575 926724 1337044 1359119 1157123 902128 1215695 1165285
13847 1165285 1307676 999851 1020972 1254367 1474032 1271342 1295335 1066098 996628 1188107
13837 1188107 1120381 1247782 1017867 1134670 822891 1127932 1192730 1230860 1188144 999974
13827 999974 1248048 869191 899786 913809 907287 1056071 1181503 838281 554537 845936
13817 845936 714409 887435 1099040 1233918 1257829 1223038 893767 953178 1324324 685098
13807 685098 916418 1296343 845010 969017 1030343 1002414 1010173 1151791 1110326 1006304
13797 1006304 929272 1189304 795992 683923 1096068 684965 581713 924024 917535 802636
13787 802636 848914 642253 567416 788325 1155017 1117262 905531 1010612 725813 938461
13777 938461 1076406 574263 770504 780092 1020207 747830 772200 777891 880314 664351
13767 664351 664569 656722 970569 857900 667365 613505 897856 1057841 494231 380227 699334
13756 699334 651540 880832 808269 649021 993870 877033 910585 825853 935350 789236
13746 789236 751013 1101015 708266 865555 739056 559029 811005 626324 795178 768991
13736 768991 709784 398660 761358 929186 766128 682200 781685 796329 621575 606427
13726 606427 499146 515854 566696 766283 867192 597639 705449 752403 665699 624135
13716 624135 600472 316969 685012 507959 876423 804215 320384 797140 447325 645871
13706 645871 379102 572070 828002 607815 605706 580134 564457 633562 813455 632025
13696 632025 603203 495086 470148 645253 602644 490412 716130 687117 615877 648113 383938
13685 383938 518964 471814 216568 854297 523234 319838 740148 484570 145636 794639
13675 794639 358606 380291 635660 331893 373612 612439 272106 571381 547094 657916
13665 657916 399041 761934 554135 556625 792792 366275 550265 528092 507412 463091
13655 463091 529874 602642 696589 552609 567603 488018 331513 437247 858128 156405
13644 744390 401522 846175 210762 574970 498390 448506 288222 429292 581211 347434
13634 347434 713061 565278 408571 403607 598468 90006 305134 394540 494935 325452
13624 325452 350524 162535 -43314 435967 404269 275447 527850 727571 565515 509095
13614 509095 540477 617701 586814 422124 372030 385504 275994 712698 523997 639695
13604 639695 268449 262425 210927 423179 437912 493323 688860 329902 508346 452080 906046
13593 906046 382061 354339 439464 245348 299140 575775 617187 477767 309822 460828
13583 460828 352144 311772 244449 214120 437914 280840 618508 568459 550975 470301 558798
13572 558798 188459 373963 172033 681974 422621 -29164 215097 188053 344080 349772
13562 349772 494514 227895 394966 143509 98192 535771 474741 371349 671850 230144
13551 500526 398284 495931 376438 395573 312310 182185 265585 329219 224688 362388
13541 362388 283350 352647 258772 200358 222993 156006 321112 299602 141292 10807 181381
13530 181381 175135 270465 325221 406131 239048 316900 317396 297143 268404 422079 69151 26548
13517 145008 510904 467242 229293 62730 357936 209509 357880 548746 289667 154992
13507 154992 170816 -12769 236403 249760 213150 290308 602341 372218 301017 350896 136070
13495 520840 287239 391865 316463 38933 324029 593870 207038 182132 -3776 539490
13484 307083 -83269 308763 444205 278143 314887 189154 193788 -50323 92615 283464 494267
13473 494267 371070 294843 286200 350441 231376 102976 337975 371562 146751 486101
13463 486101 -170866 41410 453057 427747 214562 520828 268662 432682 254492 280366
13453 280366 206016 239222 255329 228587 337739 155489 -166051 304827 97077 383124
13443 383124 255363 455675 114784 247448 631498 347558 268177 353482 138757 195543
13433 195543 235562 278058 7595 438612 362613 321274 196670 80783 352117 -43172 231567
13421 2591 49126 90073 362332 -117478 225122 -5139 349925 10887 257195 499919 94552
13409 217211 -29057 251225 427182 605120 105233 -31846 248916 186721 315849 429349
13399 429349 108271 288239 198386 333407 149086 202267 90305 107198 86358 221230
13389 221230 277179 295480 10771 63390 122086 184834 -35480 344426 33184 25795 -14198
13377 25143 279214 129179 131458 69525 19161 137426 559610 376715 117225 65238 16904
13365 458912 354579 197228 499404 387268 398449 306814 102267 86897 -191137 -23771
13354 138816 402648 350659 325980 226158 262563 332858 405510 -98339 558235 542169 194448
13342 203457 73093 253327 385607 -123060 396355 198111 -103917 223426 574966 -28525
13331 415923 116945 124588 -47363 312419 -2132 341499 -238114 275876 128914 376262
13321 376262 300289 21856 411487 269450 83993 383166 237640 336452 642052 306109
13310 259159 339041 425540 181353 130800 -93312 522329 281901 83755 166157 590359 317838
13299 317838 -86056 145197 -163330 93512 545038 429401 -79033 292886 99935 50815
13289 50815 252660 299714 11808 286903 362914 154123 151736 505437 478501 251637 299035
13278 299035 713326 387890 202645 99731 269398 -65038 256584 -70232 -88966 30987
13267 194502 71297 46854 -188876 291646 -5154 97037 -40657 539708 -4392 138097 372671
13256 372671 229040 138355 250125 5580 243684 -8105 176484 232620 188032 320666 387269
13245 387269 83511 448497 85871 68710 185926 376503 240431 -187265 180640 189109
13235 189109 285760 180036 -120082 382949 74500 342321 271785 173571 -162155 264469
13224 411244 348155 48040 63516 24735 266139 184756 -10371 474988 -6859 -2670 -30827
13213 -30827 319993 -150715 63150 145082 237910 -29209 174461 85604 147957 -117321 -54754
13201 246021 165616 -75355 31141 437897 458041 218750 -61123 253774 108368 220385
13191 220385 -141970 126580 338098 37600 -90690 369592 93603 -186574 -23712 14021
13180 -248484 300256 74351 105449 85535 6624 369369 77957 -137315 190105 -150466 19633
13168 -40626 337039 127690 119149 67778 123696 -127054 219984 127113 -13148 -223531 -65228
13156 256022 78113 118891 33584 -97997 223180 319081 18118 31650 101523 171795 47172
13144 48243 155515 255806 -41168 41306 184064 254770 58346 283389 97655 376956 -168940
13132 46032 -152921 141982 -268228 48595 -157386 208706 125694 204394 32725 133276
13122 133276 155934 42081 -45454 210543 43497 -218585 69788 216936 307095 228111 166099
13111 166099 -82217 270317 139637 -120749 51350 -181213 316872 139117 -185763 198795
13100 123576 -50551 281842 353464 143329 -362463 -354421 42390 34517 125459 -35539 157385
13088 -112461 420284 45894 -199581 260658 -46761 -201746 442599 98659 -88478 28677
13077 -379712 316194 102848 195555 353223 98927 123270 73695 243930 139110 -69234
13066 71390 126533 -24238 -55408 -120312 -33548 219691 27274 -2872 116074 124329 216723 -230
13053 283269 174877 -43332 150895 162778 197183 -42885 255484 338886 163514 -127147
13042 129749 69678 -163918 32161 153150 423852 122316 417722 -10034 408183 136985
13031 250212 358923 -157124 6144 436437 183715 187345 -32475 288184 -182171 135525
13020 15839 10516 189619 -105710 313920 453012 -15022 -64629 -184992 34686 380455 -64381
13008 158166 282375 6140 277389 115970 791 226530 124206 1757 56157 249230 -27859
12996 121517 38877 259882 245847 -26992 207144 -72529 -197941 434989 190390 300943
12986 300943 220017 256493 368288 218789 354428 -206466 -96285 -64671 229136 171097
12976 171097 159139 -27365 -94835 -83843 -110409 105195 -246396 248791 -2577 137960 -10306
12964 -192417 9882 -71248 113325 177173 268272 -95228 113 137494 -134129 -321202 -33384
12952 158149 31420 316644 -250794 -15722 -74375 186247 -44558 -87587 -65140 182416 -7593
12940 172999 65593 -29022 151789 -139836 158634 -296413 -239284 -32597 -467357 5017 -4671
12928 307310 36712 -33786 183065 280355 -300803 83000 -111192 -46308 485292 -110684
12917 34843 296382 -242294 29711 -64256 57921 -126688 22524 40487 243559 -10889 8558
12905 260587 -47302 -24646 153789 -90308 284441 54125 397885 -4834 152244 -181107 36054
12893 -49802 61748 -74258 -283335 29029 -143508 -139439 348229 1295 482274 -47799 -38749
12882 -38749 132244 -97470 3653 465498 -106079 -4082 117839 82555 282408 -153313 -69595
12870 92390 350789 -126957 257363 221176 -13341 -34914 -283347 11440 -75996 48705 50527
12859 50527 -10840 430953 235216 -228284 6866 -144837 96464 -42770 -100715 -68264 -30713
12847 -50436 -284449 337500 60951 -35947 42811 105021 -308759 74459 158353 -11359 28530
12835 -276308 35194 -146132 92346 -57868 184023 -149530 100515 20682 -327559 -62494
12824 -233737 65448 99211 130821 -257740 -53564 -250428 -3973 -171870 177097 118687 -117210
12812 142218 -177217 89031 12107 26617 271915 454621 -73188 -103148 145465 -207851
12801 -140098 389906 -85488 66805 154694 232006 101175 -118175 -422139 -88158 171108
12790 -107760 118690 174391 -90167 23544 179978 73760 -13324 13383 105513 32371 -242579
12778 -11057 1165 25125 38750 -77416 166886 -173749 9777 -412256 95858 -67085 -131426
12767 -131426 -11797 -325300 79931 54237 -194986 -54786 133143 41085 63443 74251 111113
12756 111113 323011 -258658 59219 104542 155658 -124401 305280 261886 28967 -73516 -149421
12745 -149421 222020 79003 161103 26039 133981 167428 64449 28227 77751 -31060 47943
12733 -162058 -122091 84824 -194370 -100250 63005 72866 130192 232834 -20665 52990 74535
12722 74535 180890 129949 -8768 55583 315602 172341 354323 225217 299530 326407 34814
12710 187939 426639 146467 122758 193923 93770 6036 -92317 -40735 39853 4237 7059 151473
12698 151473 364226 248395 167360 -269521 309134 352323 24798 -97041 591435 -128517
12687 254717 209063 40066 203740 354672 -24287 327572 330655 49603 216559 563478 173288
12675 -42855 90733 21820 274510 -96257 16863 -109836 37541 85096 -96852 24926 -87001
12663 15545 207825 -133135 162246 -137182 -191198 142815 43010 179291 150780 -167237
12652 24653 -155466 253190 172689 152224 200893 62639 347209 -15572 206547 -137583 300044
12640 87969 -210745 140337 255186 382510 49309 215522 146240 62522 352332 75582
12629 34009 -47063 -66054 25911 -207558 -92278 77769 18765 -85206 -10456 -188561 -386398
12618 -386398 -275638 -60344 -193536 -227696 303515 -145029 -108499 68132 249382 233508
12608 233508 170247 72765 174196 -19253 -1999 112484 -180908 222763 41597 164033 721592
12597 721592 -960 293822 258007 47200 31692 -278915 -97730 -38467 -90055 136653 165383
12586 165383 305096 -44025 -93238 138996 170956 -126181 -80718 -147591 221813 324871
12576 324871 -130380 204712 25365 -47777 -201004 213466 185290 30456 256589 184370
12566 184370 -398712 132646 91071 102473 -470738 -105077 -4737 -390511 -43176 222531
12555 -81142 -145351 209564 165157 -214635 183220 -69332 -307983 -71500 -329301 -76239 -17085
12543 -82855 76328 236261 -45477 -269724 -30597 213187 268936 20487 202046 -70368 -115992
12532 -115992 77398 92719 -112254 81594 -25198 170914 24243 133390 295800 -178451
12521 71880 202341 27012 -115634 144369 93635 -55676 -103876 -61893 -125377 109578 -98753
12509 57675 177932 13321 166778 194213 45097 -1202 -213222 22984 -205978 -236993 93315
12497 121983 13199 128171 -8114 -47902 221077 -121452 27286 -50523 -81857 55819 -549
12485 253014 55039 -185578 259671 169128 -292385 50438 262581 -84255 96734 142727 100873
12474 100873 -53902 -407157 18749 -116700 181854 -333639 96590 98286 -21580 65525 134592
12463 134592 -171393 162463 -249019 -146568 -69760 61143 -220678 -641683 202130 -37375
12452 44454 180952 177082 177189 -239423 206888 5846 -291785 245184 -90476 210449 -58746
12440 313861 -232330 -27298 -132660 37549 -251208 -290429 -4656 -275643 -77764 -46391 -63362
12429 -63362 66355 -88237 -101819 -360466 -28553 -283312 -40512 135314 190363 124564 -84814
12417 -133129 -118399 -165390 -72030 -120153 150315 -221884 -439521 29646 -77424 -19381 -19761
12406 -19761 42083 -409094 47703 293833 64549 -77260 -280304 47234 -43744 -289568 132605
12394 -83269 157887 -131622 -45477 112949 343706 45681 -165384 -46467 -29484 -89303 -222096
12383 -222096 380667 -186083 162815 96365 -146545 -1911 136167 -84524 -18203 -189787
12373 -189787 234217 -6700 91390 -93004 215149 -137921 -107038 178098 -95581 -159141 -94124
12362 -94124 132324 -249425 -228515 -184064 -260147 -144629 95049 336299 19739 126038 -73724
12350 -107977 -232262 -150530 -288381 -82855 -5836 416095 -11508 -138200 -267208 -331762 220766
12338 -95022 183136 163 -144897 485036 269154 141451 51951 66401 -201744 189240 -186333
12326 51330 116544 204770 61986 236790 137308 70350 109741 -41755 115176 78863 -176337
12314 79794 245751 133910 93818 -162689 -278777 -40142 -342639 91851 -36207 54429 186918
12303 186918 -87274 298914 -167527 -82639 157191 2935 -35799 -362464 63359 135341 -34076
12291 -6777 62175 293506 -197479 50084 198891 41610 -148572 -31835 -12003 -7821 -65980
12280 -65980 -101162 64900 -79210 104182 -16541 192582 242911 68681 4499 -63293 -119162
12269 -119162 83534 87604 -134714 165131 -171978 21382 51973 192866 327441 167340
12259 167340 135471 99254 107667 -20985 282650 114474 -278745 -11679 1534 125282 161989
12248 161989 229343 117517 144139 -179806 -95677 -113840 246302 -68608 403219 24334 -111835
12236 115986 19457 -163218 145354 180236 -172010 23873 -12488 -24071 359975 62385 -294431
12224 411823 259672 299906 72701 -204493 251430 -43266 258814 214289 118459 -188988
12213 -206602 306556 -159712 8841 -32146 19890 -2507 -48985 -13791 209999 -160400 343341
12201 260782 285705 181831 133517 71375 65899 -28979 310934 22905 266410 115702 254177
12190 254177 169501 -26095 256854 -177558 16395 -37950 159946 357372 -97986 29260 228845
12179 228845 -52244 198563 -36224 -101918 199434 289058 447863 468471 271504 212369 47170
12167 373237 221946 371330 228191 174791 327215 264129 92505 37174 -190549 -101942
12157 -101942 -12246 99586 279471 61371 -146311 55556 194618 -177101 70538 133582 2266
12145 -10145 70976 393625 -72761 399889 -13687 149800 82125 239114 143931 222003 -303966
12133 247665 391820 101675 249714 20267 -184924 184410 228716 -322004 125660 444005
12123 444005 -226745 36225 16009 -11747 -5314 -172635 264022 344980 30695 120537 210904
12112 210904 324412 -166689 -1670 -237940 322107 -74068 95185 102376 90461 99475 -3650
12100 -239154 -159059 107168 -101353 73531 43200 49887 181833 50057 -266657 87274 -24347
12088 43956 57392 -140900 -93305 -7069 117119 -241134 291048 39947 -103005 158809 137069
12077 137069 -41730 108993 273447 -170169 133661 279711 -26282 -123780 271902 -187468
12066 -38599 -334185 -106144 -277897 -57730 112678 164650 -235 -236154 66389 139958 1549
12054 370964 1138430 1171875 307068 126658 -50736 298021 353545 308838 4400 -231383 99167
12042 166183 -105442 36108 73818 -27626 -353930 -23972 130370 -100013 -51088 -57314 65513
12030 54334 -121137 -31563 -91638 134594 -300499 -13362 122136 168900 -90003 -157731 16528
12018 -66840 103242 -217086 -166500 301765 -167135 219212 20367 -75208 -183909 -120909
12008 -120909 -156947 381347 -315951 -180215 38947 -49123 44780 61108 19434 -12218 -16981
11997 -16981 149547 126418 -16800 318267 60323 13 -178586 110610 -63150 188226 186778
11986 186778 87791 74940 58535 -192133 355445 196290 -295705 -376496 122810 -28666
11975 92356 5647 250949 -124896 -197878 -162088 213288 -168025 63341 -120715 286466 53774
11963 175780 207484 -190620 -271765 -77518 155228 -211633 -220745 222109 192584 -248843 305421
11951 276632 -11114 -147306 -226944 71891 -32614 11482 -35665 88580 -43383 284458 -152093
11939 -87962 -13401 -103576 190384 -156319 -110312 -142674 167379 -223897 -143205 7329 -234613
11927 -124946 -113663 -26778 -41821 108774 -21854 -175674 -170779 -341354 158915 295674 -105091
11915 -240563 89207 270754 -222565 -56300 68191 286033 98914 -14152 -52768 142238 4422
11903 3028 22982 -37642 -217688 129766 -139951 -202114 213761 -462489 -301537 141706
11892 233061 -59064 322 -313391 180247 156013 34409 -136339 55278 109276 -178719 108800
11880 269470 272051 -156106 -97828 -214129 32413 -71370 -338295 -251432 126695 276819 -302899
11868 -161643 203981 28400 44067 -191883 60275 -47444 243353 -83625 -126962 78075 118634
11857 118634 194743 -157393 85374 -196789 113364 -241326 -412241 96229 258069 145286
11847 145286 -352117 164940 72498 -2327 -119582 -134844 -178475 -253235 4460 186962 -114776
11835 -93662 107244 57431 -40261 -70921 -79905 95304 -34285 -212905 169439 -204624 133179
11823 -100290 -394609 -460439 -107969 -215255 123763 -196580 -86133 76322 -279335 32537
11812 -122772 -156101 -54425 -216237 -125716 -75110 55416 44237 -200097 -53050 -253155 -2011
11800 -277220 229985 -41838 -83316 -158694 -26779 73626 -47349 114329 13248 -390132 -34504
11788 -54856 1117 27783 -492281 -354941 -23199 46050 -275417 -68660 -79680 -10141 221983
11776 202120 -456736 -111610 -38943 218061 -65998 -15456 46605 246134 112094 35959
11765 313434 169089 -306147 -44543 44217 -10929 -261862 228444 -3696 2582 101231 -44643
11753 -161557 145211 25675 -94803 -160223 932 -184573 -108249 39314 10412 118842 -105962
11741 -79418 309383 -136729 -184289 98770 22197 148653 145122 -178903 -108887 352848 140357
11729 -7792 -136870 49619 -126206 -426123 183583 -27603 172261 -270596 -79624 -30078 83138
11717 -224546 123435 327649 216376 -176635 170478 41717 76448 247083 339516 -127750
11706 33206 43832 -92544 -111330 73219 120729 37711 -324070 121013 183045 9629 120307
11695 120307 -111454 134983 -145784 -1997 68959 -200299 -186968 126209 153104 -101136
11684 168276 -237570 -37596 98164 -10558 144573 218413 473252 -79611 -62213 -69206 234590
11672 -149602 -44811 140389 43171 -120782 -136241 224212 -79114 185814 212577 330 -187969
11660 258805 181871 -155256 -89866 -204823 202681 356810 390707 -99661 -27337 -90815 210039
11648 -34279 172911 77141 121759 23170 -109267 -155396 -194072 -23924 -100574 -9927 20965
11636 19629 103672 -267563 9570 16875 15210 179725 -76310 95244 189208 18379 -288185 -148582
11624 -148582 124951 72091 41054 127824 60030 -73997 130286 55675 -273567 224242 168769
11613 168769 -399715 146351 -85192 -147862 -75546 -114972 -137515 96127 -111562 24773 -117834
11601 8269 466453 3387 164618 -126409 19158 59033 37623 -365901 15653 -261611 5970
11589 122002 -59245 -138593 122310 104940 15539 -414041 87010 -40991 1078 -3314 75084
11577 249168 42556 160979 109626 -69264 -94610 -101670 61825 70780 231745 -57106 157747
11565 157007 183164 283178 146752 395681 116714 305864 29543 301565 -132699 -130590
11555 -130590 212387 92709 45443 245969 401643 16960 170432 1843 108799 244384
11545 244384 -25521 198779 99538 386703 6990 123438 -22924 -32058 86758 164968 245339
11534 245339 104411 -2722 58021 33162 352141 -76379 -181672 -71605 -60614 211208 53577
11522 -73842 178791 258496 173317 131825 -28870 181526 239120 310685 262477 -19146 -15426
11511 -15426 71069 156841 206262 134234 -52278 65646 -242153 44261 106796 324624 -95012
11499 -80995 -26135 152064 39856 192800 12729 -83168 220265 -43027 185932 -217310 -150463
11488 -150463 38476 56688 264751 16597 87794 227800 151419 -9194 44828 192371 -9978
11476 4903 258109 226654 71863 272907 55179 56738 77822 43333 204722 40450 434502
11465 434502 -19085 -95605 166319 77611 154989 232716 -24457 217586 218308 -18853 122103
11453 147496 -41057 264459 242142 -81615 -105869 197605 -42950 139179 213889 202335 213109
11442 213109 187106 251720 -72807 42727 290765 -75600 -180966 6257 209465 129983 -16566
11430 164443 -27724 194341 175310 150597 175026 -46736 245787 7356 67023 -191345 59669
11418 160526 -362949 -168782 60307 -403077 -126046 31366 47588 122919 107290 243206
11408 243206 211443 139956 165353 -3232 56581 -321915 69981 139274 377225 -77863 192680
11396 -259856 148522 311613 192453 196057 -13235 111050 147047 261735 -94571 -124768 247768
11384 297471 20705 -120119 152196 -50898 -139312 -99389 81851 57260 81215 -242186 38803
11372 53892 55876 189813 28345 -47348 26838 -144283 -167698 84586 148828 116520 250487
11361 250487 228608 76880 -287326 36864 49064 -45299 -257896 -97705 73675 156283 13108
11349 -137792 -227302 189006 -218192 78105 -176963 -2215 -117767 -138789 -844 34122 59704
11338 59704 -88204 252831 -9573 -60798 102352 -202789 331565 66888 35165 -254075 143169
11326 68261 45360 -70838 -28912 -74661 2992 402944 -71327 -95617 39246 -104841 -48127
11314 203372 288138 -141962 -51824 -181812 120242 -127137 18107 115449 162172 91812 -82433
11302 -181597 -209600 145817 95575 -186453 95799 -60470 192906 51335 -26119 232308 -125384
11290 -4038 17870 -82879 77148 -108133 -88617 -52533 204447 54259 175691 -53565 68303
11278 -199335 -83434 2335 -50564 -381306 -104582 -97190 -220257 72754 -1854 115765 -101451
11266 166551 -104940 -12477 66507 -122482 -121096 -228336 -114631 -346375 31305 349676
11256 349676 77233 87959 176559 -104882 97790 -49182 66586 98014 -231687 -246891 -132054
11245 -132054 113707 115125 -121839 -154880 -197172 -179581 -183494 14936 68989 -275600 118332
11233 -88556 120918 -80159 -16679 -173793 -178326 -135046 -10571 -183649 -71149 1786 -1891 -298635
11221 -298635 -66664 67046 181298 -187009 -406069 -297219 28066 -239768 122859 343044
11211 343044 -286501 367387 -38504 10110 11103 148233 62072 -174424 -193026 -372486 -293860
11200 -293860 -105534 -141654 92505 -79177 -199716 -307286 80103 -10803 -133439 -306227
11190 -306227 -47603 -23093 -248364 149669 93277 244495 -321955 -74721 -361625 145006
11179 10496 204839 -220462 -87201 -71410 -330480 -342182 420677 -22039 46888 14702 -186084
11167 36949 -8406 -269052 -77648 85258 -530743 85907 -150919 56624 -149595 174011 88823
11156 88823 104213 -28778 45780 -75096 -166834 -60066 125334 -42422 204930 -329209 384959
11144 -62714 -221740 -97228 -282278 -63573 -378522 -182275 311562 45430 302485 -121015
11133 -328422 -35024 -24559 -48155 -98670 -34373 183629 -100880 239192 -94421 36986 -165980
11121 -272165 189374 180297 142532 -205167 39369 -11237 133425 -117426 182170 -210777
11110 -633 262039 8574 -68302 -172814 -125798 -128357 257798 -77904 -19537 24170 321656 -227337
11097 203104 -241022 86801 134487 152845 453571 49515 -6581 -18714 -76296 -106214 91511
11085 -187299 -6469 -24249 -31478 26258 -8813 34158 -100041 134338 -67116 -45761 236003
11073 159246 -22863 201845 292926 465858 188165 263665 216759 5301 -171439 170999 345078
11062 345078 259998 72852 165288 -377339 240556 275351 204823 156751 517112 23787 502841
11051 502841 414096 321060 148295 -33740 216140 563879 -86325 -125655 147423 254775
11041 254775 183394 333169 346788 358636 529248 248560 405427 58780 343685 561383
11031 561383 461454 532473 708276 461569 645570 610628 529272 410872 835128 533911
11021 533911 559784 337565 656076 511849 391127 461051 361155 927615 765730 668945
11011 668945 853363 604597 826636 540080 544604 636721 575923 475798 702329 778269
11001 778269 524232 640699 440375 711090 559814 675314 501254 676601 365821 346244
10991 346244 685623 514239 623654 610862 534557 357238 591587 315504 508890 680106
10981 680106 684072 628450 564896 682110 315210 442916 426864 299171 603540 812444
10971 812444 707475 589235 965276 508771 171676 711458 913913 313645 786200 710059
10961 710059 582775 921448 577547 1117113 901088 997766 1063096 1151830 1110307 1127295
10951 1127295 1055778 1244439 1345409 1477229 1870613 1930905 2348400 2460076 2411049 2199422
10941 2199422 2033917 2511431 2036001 1823208 1899855 1582439 1635246 1706531 1588806 1886481
10931 1886481 1949008 1974373 1747192 2013059 1642912 1857683 1458194 1305338 911935 759516
10921 759516 975216 726944 353572 247905 441959 354805 187255 310759 293626 199895
10911 199895 96763 -18170 -131869 -50172 -7067 68360 368529 -105203 24484 69156 39482
10900 39482 322079 88598 -70076 -29157 337487 -276086 35884 151447 -92528 428313 504501
10889 504501 -313633 67838 -140503 -81995 67349 234019 -115250 319153 218546 -230744
10878 -102762 215914 -197340 -139446 -25950 100729 -52720 119131 -217738 15405 -359577
10867 -41044 -87345 -229630 -107561 231941 160762 220627 62069 124142 108436 -79243 -192578
10856 -192578 -314317 152690 -260010 7893 -267012 25737 -161695 129617 14636 22182 102977
10845 102977 131658 -123232 -107126 118895 -47911 50427 183155 42830 124785 -47527 198598
10833 161551 -352372 106611 -23759 -28875 -113100 -93473 192408 -175433 -40922 -399091 -169830
10821 224014 -46662 74439 -44077 37378 6428 -137674 114539 -123013 -24577 -49728 -17429
10809 -214921 282672 -124105 -38935 -80503 158333 -100975 -164147 -166821 152322 -195510
10798 141329 11513 -9322 -163201 133274 158068 103651 -349315 167864 -265703 91621 215527
10787 215527 214257 40441 -259816 -205731 -257278 -204098 -177056 110993 95942 -125663 -45311
10775 -212040 -88222 -213877 -323760 10077 -259482 -388795 -1653 -41144 69593 -74295 222519
10763 -73359 219785 67259 194034 -340128 -190478 52854 -207776 9264 -187263 -12941 -399095
10752 -399095 -134412 -301636 87831 40377 121498 -381885 -121530 59280 -269795 -166741
10742 -166741 115176 -98004 -154303 3736 -62569 -368817 -43104 -196618 -296945 25621 117097
10731 117097 323872 -22191 -158503 72090 -126419 87649 -223775 -334732 32018 113981
10721 113981 -236951 175124 125163 199018 -13497 139623 -219544 136349 -12906 154102
10710 91723 -31685 54159 -202518 32432 -180274 101273 -101514 -111327 -253840 171148 55276
10698 -32990 -110381 82540 -373016 -86118 3479 -434178 48313 -24125 171254 -316067 136808
10686 -58947 -333555 43191 -201432 202576 -94436 122063 115577 39452 111176 -125222 -24103
10674 384844 -561706 174780 -271129 -332309 247037 27321 -238554 -22380 -161663 -194918
10664 -194918 -78771 -219620 268787 365889 -20092 -91395 -1561 289475 -126668 238115 171621
10653 171621 -218872 -10903 -122751 108545 -100407 15473 -134024 165408 -92109 -15022
10642 139618 -100730 -507418 -110901 79186 -134790 51855 -46274 222028 -42556 93560
10631 -229623 -161122 -77422 -171917 -109697 -92212 135626 25248 -246460 -60330 -15760 71043
10619 -130035 1740 -234327 -248563 67192 -14321 29585 183755 -64185 -105353 110322 -78745
10607 -157409 -30599 162773 23861 -33891 -356222 -235979 -236888 -34528 391398 -231764 170594
10595 -153409 -225297 334666 -172488 -238827 -469823 -170350 38446 -20279 -211646 -79855
10584 -57353 6992 240929 -287985 95546 111218 -239800 -175067 -248200 -61823 -65569 64846
10572 296399 -328229 106695 -85147 83022 -24634 -247960 -251141 -62546 27338 -206453 97862
10560 -39003 -41081 -417868 -4584 -180947 93102 -234379 -321328 -30164 -320428 -122183 -89002
10549 -89002 -5383 68988 -69273 100840 -47166 -32158 135108 63117 -29281 172142 148351
10538 148351 251786 -452988 65982 -80368 -206141 -3376 228211 -341337 145073 122360
10528 122360 -57068 1961 -133640 13656 248535 341379 -17621 -67107 -134282 -141915 67995
10516 -221659 81102 51254 53591 -127516 -17590 83696 10589 -58372 -73334 402553 -288228
10504 273128 38813 -194439 -37427 -51868 -256400 6929 -902 427219 -153966 -60948 72567
10492 -120452 156197 -311808 -436009 -38286 251553 57885 -43910 -103111 -338865 -53910
10481 -186278 121446 -46768 -595955 21 -233973 111923 35590 -463516 -70309 -119319 -89826
10470 -89826 -71434 -133 5326 -219481 220596 -149340 -282778 124892 -350570 -246077 -3789
10458 136670 -24218 -26208 250713 348652 508702 184795 391058 331796 438939 368483 247765
10447 247765 30303 112385 -37629 -64069 58237 278202 -141343 -244329 -256427 -53136 182859
10435 22305 32957 89704 -120041 -59442 -239510 -383360 64735 157340 192986 -209443 -230039
10424 -230039 -376523 136112 70689 21442 -11934 52663 51706 302956 281046 157038 -122525
10412 40147 -34091 -265819 146396 -95369 -174107 185202 114006 95549 -318240 521500 28972
10400 -244300 253831 91776 50187 392590 -174226 -180872 190886 94950 -228688 248890
10389 98614 -184195 -139970 21459 48153 -68436 -173324 -17740 -111655 53181 -248784 -233338
10378 -233338 51490 86020 188558 -168374 59377 -121800 68516 -332549 58052 -35442 165405
10366 325121 90785 46255 -18578 224120 130755 261315 24731 101275 -15973 304275 333372
10355 333372 93743 -134815 -9875 350946 -53823 25259 162927 93230 -161506 5399 514626
10344 514626 75420 420319 562184 390605 493972 629272 592075 124770 235141 -109570
10333 10642 275533 8633 -243640 329948 85877 135388 126694 -84524 30531 491654 437501
10322 437501 516494 500134 61552 309024 345751 45472 577959 368122 80441 -15316 50441
10310 593091 56999 -39916 72629 243821 310871 -88317 360082 357244 128218 -243442 297042
10298 -30726 56095 104042 432427 184019 -62521 -240566 299791 -171465 253605 183385
10288 183385 98437 113960 303028 185793 90226 35173 148928 -234014 -37371 -14466 -67726
10277 -67726 -106833 74892 -194719 90359 -197998 -68892 -101613 -126661 215396 60897 -298552
10265 -72281 -219678 -27171 -219156 -125551 -54592 -197870 -21134 -137995 255731 144972
10255 144972 5376 249557 197365 9278 23557 167934 -46258 -35705 -348318 348192 128435
10243 -133155 26430 212805 -77242 -82031 224657 -70693 132498 -185912 138397 87736 133254
10232 133254 111133 422717 93761 -58901 474277 165240 450242 83533 -316733 23957
10221 -177811 -14678 -65032 221664 -155189 -346101 -44014 -29309 99187 99075 66453 -267322
10209 99152 -4571 487 -178898 -35228 -191786 141032 -44338 59358 87056 -26378 75511 -112566
10196 -32770 -66873 -31578 -1746 -263396 731307 -122431 29666 -24370 -151691 275298 196906
10185 196906 -501185 -6125 -94788 16445 135112 -145829 111711 -228433 -106992 -39795
10174 -103152 -130976 -151968 -146806 -357910 -188328 158027 -229319 62320 227018 187485 -227740
10162 -47083 -120106 -63857 26538 -43418 3921 -165434 -203984 -29387 -86620 -64570 43877 -126257
10149 10694 -36937 -43073 75108 -8389 47590 -228127 -84142 -148977 -178127 -126493 -433542 -113520
10136 61170 -52210 167507 -46957 -59738 -97090 -90412 13770 -248892 -25758 -80071 64886
10124 64576 -87262 209354 6782 -102086 108365 -171089 229550 263607 27587 94184 -171704
10112 -54825 43384 -40573 -206401 -26239 201335 -270685 35082 -103826 -61634 190718 261434
10101 261434 -218311 -177245 347904 -260671 -168849 -210093 -56784 -475775 -251714 -105415
10090 -281306 -86738 -234632 -105577 -21897 -56087 -96901 -55585 -126808 -58898 -138078 -208373
10079 -208373 13346 16538 10573 139002 -317181 76926 -279704 -389223 23362 62110 -123630
10067 -146848 148250 38232 131143 -197919 -310833 172172 -212303 -88856 -293657 -393027
10057 -393027 -87639 -125163 -66037 -72284 -78465 -441693 -88018 -27574 -450925 -280458 86433
10045 -151004 -202348 105780 -46375 14901 -184466 -118070 -413140 118404 54905 -19011 11752
10033 186893 -173570 -54234 -167828 -110191 13520 -525150 -348832 20473 7675 -91653 -91579
10022 -91579 -40644 -269008 219503 20173 -390091 -174015 -221276 98362 -226267 302438
10011 161895 217729 -90719 -319695 -233661 -360048 -832 19340 -232095 -77533 -180489 60936
9999 23786 141817 -432990 -124543 -126231 31275 -223648 -11776 -212451 -538065 65360 99510
9988 99510 99965 -156094 27526 92075 -105781 106361 177942 -43088 -167787 11005 -288943
9976 -102369 -260094 40961 -111984 -30577 -45110 -304381 14964 -144841 -431279 67483 7639
9964 248244 -319919 33223 156121 260491 3342 -179523 -218276 -257542 -220328 82072 -110642
9952 68542 -56961 -223830 -96188 -145019 -176156 -342700 -33015 121653 -66332 292632 -46566
9940 -495070 -14949 -175818 -53436 90088 51728 -317922 196488 -231174 -23460 -170829 -89090
9929 -89090 -13861 84015 2918 -197968 73901 194829 130474 -351795 111970 -170513 -176076
9918 -176076 -123546 148631 -284570 -166799 77996 -9371 -168770 172183 -158713 -230207 -12598
9906 -171188 -89351 -111435 156600 -14829 6031 -3426 8457 -239698 -8026 -205676 -141168 -150903
9894 -150903 -88492 100771 -22948 -36623 111765 -132783 247900 -228433 -157896 63256 61906
9883 61906 -82656 -93464 70540 155034 9039 -56171 77702 27263 -229136 150076 -24401 13361
9870 -6814 -244551 -81949 -179531 -119907 186214 73460 48678 38361 -320802 -217505 78472
9858 127192 19805 -89923 112079 48854 196030 -49773 -75582 -190512 112988 82488 -295887
9846 -110802 360499 29581 87366 198696 246118 -159178 -227318 135090 120651 27992 2575
9834 -50885 76894 -40294 110820 -318843 106241 -474769 -105550 112184 -19583 -20327 49939
9822 -56479 -21084 -102709 -84486 -409603 -262550 -249274 63215 -245868 -150330 75014 -66275
9810 92596 54973 -113753 -98728 -93880 -381945 17977 -242406 -243948 -41706 203559 85617
9798 -115392 -361077 72512 -10962 92869 60204 -174597 -222384 -135180 32094 -234550 105527
9786 -188637 -159613 8322 -47463 -140157 -457559 4962 -138719 -316747 -113950 32290 45174
9775 45174 27842 -197309 134077 -182113 -214492 -372980 201973 -203479 -426999 146407
9764 -44736 61627 -150447 -98860 -222098 -126155 45999 -151906 75678 -9627 -480861 -34031
9752 -232814 -95097 45358 -48331 -36076 103818 251449 -122090 -104500 -231184 -115618 -279625
9741 -279625 128449 -200497 -180929 -200989 -299812 129933 -202938 37504 -57500 -88735 -26019
9729 -169854 -218206 -481829 -80411 -426650 57102 192108 -9991 86321 21655 -103061 -106365
9718 -106365 -74988 -246024 117353 -170976 -129460 -341220 -109190 99819 -86139 -304686
9708 -304686 -5752 -128214 -195994 227627 -176590 -15684 172070 -105211 130130 -236173
9697 -239889 -13478 167035 248577 -182436 -139776 111382 -153821 129364 -165714 -178097
9687 -178097 -155296 -245472 59364 310437 54633 -186257 205037 -61516 301764 -26259 -197025
9676 -197025 -105091 -394216 -90741 -252971 -6687 37788 -306584 -530086 -279293 20933 -90537
9664 8924 -326679 31690 164774 -95467 -79792 -124870 -146803 -103151 41590 -323711 85515
9652 -127948 87086 -216832 68392 150499 -131401 -109195 157750 136970 -154239 -44888 -309617
9641 -309617 33168 -35390 -311668 237818 56719 83149 6762 37666 -399473 86480 109188
9630 109188 -2460 105560 123148 -161405 -157340 -70003 254079 251294 -188376 323707 -320447
9618 28657 12838 -91500 -144711 -161810 -451557 -156733 -54620 165501 -38755 185077 283142
9607 283142 -225748 -424061 -14523 -6451 -26285 -159358 139751 -449329 108559 -41720 389
9595 173253 -198129 -15458 -57201 -20289 108378 -495529 -210769 -88496 29359 -197076 -120139
9584 -120139 -2916 -31400 -135021 -288742 -30802 -331211 122413 -31448 -215396 -433409 -390830
9573 -390830 6128 186169 -398283 66092 -171767 163655 138123 22321 56176 -78615 -267069
9562 -267069 153144 -61666 -31620 -205807 -21531 -86414 -363400 -165643 -131552 -26106 -93223
9551 -93223 -99268 94336 -461715 74497 -43806 45000 157993 527303 37734 -86142 281190
9539 -314058 -25194 47406 -67015 123615 -153972 -122559 -135656 -96888 -537870 133822 -374441
9527 -35827 -19941 -307276 107495 85068 -8480 -65424 -225888 75862 -53558 -130170 -87950
9516 -87950 -103433 -82308 -80693 -26228 151011 124016 19004 348831 -233103 -201932 -155555
9505 -155555 -29619 -158755 -8089 -116632 25302 -94397 -190951 85456 139815 -24678 -95897
9494 -95897 136712 -49868 -317156 -2088 192093 -97389 67038 -131054 84674 -258583 -92247
9482 -433256 194425 160219 -175379 143215 149839 274739 24639 -311849 -316714 40026 -16203
9470 -109364 -32020 -146206 46164 32813 -102129 45163 -121855 -239509 -329324 -85169 174324
9458 -86128 -74887 -118991 -97210 -418503 15062 -283422 -233364 -180527 338227 -43971 -308635
9447 -308635 222093 442895 -131232 -75091 -263602 -112195 156839 129039 -100410 -415973
9437 -415973 -92944 -172345 92043 -92421 79157 -192520 146054 155892 -224753 48813 76984
9426 76984 68698 -317284 238534 47100 32051 -166136 63741 -126525 9236 -224251 -114346
9415 -114346 -468716 -153766 -122490 85962 263389 -80265 -271516 -127443 -6277 200933 -27948
9403 -188766 -7456 -99709 -145287 97235 -153151 -67153 -430756 -244450 -41241 344437 -104361
9391 -380667 -92810 -261278 -121845 -390981 72292 -154776 -118512 -388819 -280503 -166762
9381 -166762 -211585 -8254 94832 -15818 -243568 2287 198298 -74486 103886 -482741 -209699
9369 -398309 -36402 40884 96146 172458 205506 373040 136395 -131593 31007 -109308 -307727
9358 -307727 -119287 -117466 -286138 -91791 -81432 -262556 -7323 -618932 -81392 90070 -177127
9346 52985 -279461 -167274 -291148 -137105 -54199 -44572 -52457 -241019 -249374 -45413 270056
9334 -55792 -252106 75584 176243 4444 -162786 105988 -346332 -113003 -5856 165016 -21278
9322 -394378 -64170 -161847 -62704 -91245 -77316 -149 -52486 -129047 199584 10059 120874 36627
9309 10100 135300 62335 51488 -334657 -168286 -479501 150945 -182559 161338 139114
9299 139114 -162318 -240382 219545 115755 -40447 -67917 -181423 -12323 -41603 -399484 364158
9287 -241023 -15976 236563 70988 8771 197610 -431327 38185 -195112 -155038 43743 157915
9276 157915 -193981 111863 -195195 138595 -100876 311391 -254621 -333818 160816 -460095
9265 -82822 -170526 143142 73122 -1539 158525 -367250 -116015 -143 -47676 54860 -91347 40411
9252 -122179 -269029 -8181 -37049 -386080 158024 80962 87224 -193950 -175445 -157107 -70997
9240 -207980 80355 -70074 -72304 -265653 -99328 21404 -62515 143375 -92467 -159410 6377 -246765
9227 -58268 -233408 -9932 65298 -272108 -150210 -180561 53147 -199556 93890 142788 -292183
9215 -146896 -139595 214007 -16860 231260 -66987 134870 3072 -197835 -50493 -41483 -146272
9204 -146272 -8368 56267 -9825 -88808 -71971 -236097 2492 -201971 -49881 70787 216695 -63052
9191 -107497 -164755 86739 -78197 -20073 3679 102596 100625 -36383 -117717 -274932 -86440 411107
9178 -212434 -215097 -139639 -292815 -183162 21968 9067 6941 -11167 -215282 -170019 -394407
9167 -394407 -195596 -171751 -93347 295403 -36605 -163674 -247637 -432271 54874 8925 -66221
9155 -10438 2378 151132 -1084 39256 -16399 -77698 91900 -353310 98907 -95300 -137253 -64487
9142 100370 -60799 30068 -200218 -179445 -390867 -231900 75761 144837 194049 -177809 76545
9130 -191955 54404 33441 365741 124414 -99871 -159334 -91451 -211119 89245 39109 63190
9119 63190 -158734 -54980 4390 84255 102803 -100174 -65946 60762 57003 -213537 -22467 -96073
9107 -96073 -161307 -226273 103443 103195 104488 -252731 62573 -149305 -336562 -230101 -450247
9096 -450247 -128984 27410 -231478 19827 -138913 -277242 -245951 -18002 80657 -34893 -239105
9085 -239105 -66838 -375025 39195 -47571 181464 82605 -145861 -259271 -119238 403267
9074 -34367 -258298 3213 216737 -187611 -67088 -406275 -15652 -52877 -113363 -42742 15133
9062 -68111 146039 -165278 -58025 -32388 -78823 242073 -69885 -5801 -117087 -268155 107242
9050 107662 173621 -52183 -66075 -271518 -144044 -261112 -153297 25729 84613 127110 -171387
9038 -154115 -298993 -226417 -357278 13648 38766 112078 -151189 88110 140853 -247182 -75897
9026 -306756 -20595 28132 106233 -187548 -19598 -165748 179504 -69601 -103633 -224759 -102704
9014 67575 23709 192713 -132753 -74582 20242 37540 170542 -271639 -235223 172622 -169690
9002 225069 388370 45416 -169250 -165299 152484 -140851 -328907 -317920 -100387 -196879 90196
8990 206879 -40165 340617 -95500 -325671 -75141 169836 -341704 -35263 -262428 85807 -18426
8978 20281 -113226 -182361 -61601 -42421 -243819 -349280 -151947 387148 -47246 -142235 -31110
8966 5776 -11292 36135 -328103 -291562 135622 -403071 -448811 133429 -58621 -38340 68290
8954 310370 341224 308564 -23565 -282956 15793 28239 69006 -134230 330009 -120567 12985
8942 22509 -8363 -126600 35440 106536 -48470 -211227 347525 -75640 -26578 -124188 -65230
8931 -65230 -217765 176740 82265 384681 -88623 219703 220248 -167066 111448 -225205 -166008
8920 -166008 -172201 84119 -1189 -261297 -68298 -57925 90997 168229 -107477 172681 218888
8909 218888 115013 32762 309462 -42352 -54070 273912 4730 -289615 -85770 16181 -23734
8897 -206232 158425 3218 114406 245501 33865 -223837 221983 -76174 -354414 -33378 51623
8885 -251430 -181463 49249 88879 -92428 48798 -174334 123752 -237234 -65791 -21108 -392748
8874 -392748 -19960 -91107 -108666 -161928 210894 94412 -70448 -105045 77985 -394949 56046
8862 -61593 230058 219218 -39418 -53983 114306 -250045 153242 -155969 -88936 -141933 131403
8850 164617 -519815 -195748 -485664 -165237 -29107 -159392 -94820 -314559 2851 -319602
8839 -61275 -85605 -340861 -331757 -334393 -118155 -173522 163902 31625 -82023 -44807 -88068 -80464
8827 -80464 -136265 -1595 75319 -72443 86478 -71433 253597 35252 45989 -93926 -123387 -184743
8815 -184743 204349 -225683 -12541 -22325 -13971 -27722 23645 359 -66088 -327471 321887 -13237
8802 41104 -258477 -169459 -32723 -75903 -83105 -13318 267688 357456 -78557 13818 -229707
8790 -253583 -86147 83932 -188774 199901 29468 -14001 -253091 32429 98150 -100043 -120729
8779 -120729 20712 30825 283482 -22324 -240045 -244839 -225186 -388113 -54877 48860 58167
8768 58167 114794 -241872 -151868 -191406 94838 -184765 26621 -214299 -21295 -155835 -66505
8756 27223 -108287 -61274 75562 -141156 66069 357629 -107353 -286345 -29270 296052 -181391
8744 91594 38510 -232012 -107073 -7490 -309605 -54124 103662 211505 -328513 103888 285603
8733 285603 226648 155212 -67212 -127909 77746 -252337 -67036 -42866 -167968 243323 -460815
8721 -150904 -225460 -231683 -129759 -375137 130096 -264538 -29250 24050 -104166 -88514 -233067
8710 -233067 -257109 57651 -352136 -109416 307047 -58316 81821 -153607 372849 -101036
8699 -12845 85993 9338 -235443 -297590 95970 -249239 28187 63033 -54751 -131654 -127648 96506
8686 1386 42868 117252 42227 -189288 -44224 -206894 12363 -276668 -26547 -145401 91835
8674 -148555 168505 35285 78204 -145915 104881 -240567 -197496 -114268 -87305 164649 -189443
8662 88426 362015 -39750 -183555 -263786 122125 -59111 -86111 -61066 76779 -278165 -184013
8651 -184013 9615 -190050 -375477 -379497 -94244 89221 -159396 57114 -292735 -295399 -16432
8639 -207504 -243102 -215391 -137602 119284 -158853 80748 -166820 -38783 -61225 -77587 -196505
8628 -196505 -97715 -365642 -36948 -193145 51530 -14140 -374725 -230180 46790 -37701 -174428
8617 -174428 -65814 3609 -90082 211292 -15159 102968 -267507 -46330 -246745 -81881 -192851
8606 -192851 -233642 71078 -44837 73631 35061 -222017 116738 -155186 -161991 -60917 -172162
8595 -172162 18693 -195518 -13457 -257763 160502 -286513 -267220 28031 107484 -118159 -102271
8584 -102271 -35897 -228056 -158333 -47462 -235364 -16703 -113504 -61905 200224 281339 139539
8572 275819 -115793 63670 -60437 82732 78860 -516 -134584 -2688 275565 -325664 -29379 20589
8559 -19317 -156047 -97511 -103005 -205277 -50277 211531 74456 122520 -168332 -136711 149101
8547 -312206 -156394 3702 74256 -94851 -224967 133816 72708 -86509 235460 -134101 171112
8535 78374 -73241 -156611 360159 -30399 157042 -71169 -301602 42733 128698 266549 -87716
8523 214558 14502 -138150 -342025 -25925 57770 49538 -117901 -20103 324319 14083 176805
8512 176805 -163948 -324371 -104652 -49173 -181381 -55337 -201478 -24804 199668 -12384
8501 -140902 -17602 -115752 55125 -164783 -55780 186096 -25669 -137365 24034 -29563 -215015
8490 -215015 -275029 -48310 -129534 -116876 213654 162040 -157198 306658 -185664 -87508 52096
8478 -155252 66667 228491 -88892 -176849 -157949 134423 -219198 202335 -413969 -301467
8468 -301467 -175053 252111 -107682 178165 117710 133115 -45223 26353 -47066 28928 -264921
8456 -378007 -190670 -495207 -43005 -423112 -110303 -204148 -66815 175554 -157505 55676
8445 -27352 -117842 20388 -121237 -360756 -493908 264779 -366275 85602 102248 118176 161932
8434 161932 -156185 -185065 -117291 178673 -26049 -113020 -5635 -67628 -89905 -37858 4841 -392096
8421 -140475 121439 -125339 63652 140051 -101041 78070 -220857 -141072 63523 -359009 -163767
8409 -104037 -40378 -84041 70402 -174476 -245751 -130621 -169368 341804 -223985 137978 -148981
8397 59364 -16873 -411792 -213120 212306 25260 63139 43539 5740 16624 154747 278142
8386 278142 146150 -132652 -127429 -239361 266079 228381 -39467 205624 27069 -112154 13335
8374 27728 -151246 54696 -168133 -23225 142357 -79028 -98917 -211852 22422 -69921 -203084
8363 -203084 -238583 114288 44712 -204358 118668 -101296 174313 134201 -8432 -7394 108790
8351 -237364 -231116 92979 -187399 -317946 247207 -103069 -32682 139589 135313 -28014 -314758
8340 -314758 95195 56150 -297820 77937 -136499 125619 191596 176523 56431 -51687 -210081
8329 -210081 20127 34182 -115342 292891 -292627 52092 -8246 4524 -157657 -11744 176700
8317 -126647 214479 -48251 -124602 -68996 -165540 -99300 64926 58080 -187903 -35987 -250499
8306 -250499 -77529 -592975 -92759 -71734 -159552 -104009 23955 159961 -132255 -107795 -295838
8295 -295838 -218059 -49225 -292276 -122345 -27558 -345446 63238 -60891 21808 -23313 73182
8283 -206058 -122222 38225 -58240 63315 99338 129168 -344778 136230 -145644 -184452 -27100
8271 173100 -425178 50141 30162 -114854 104332 69968 -69105 251014 231768 70257 -196117
8259 10470 -21706 -79475 -54484 -231757 48510 335944 -166555 88163 95576 -144184 -6422
8247 -169771 121140 -123634 -94398 -17116 211915 119958 -149164 25346 -265765 -45252 7286
8235 22758 24044 -206380 -75968 -120541 -16839 -42316 -193773 148346 -96295 -71481 -322022
8224 -322022 -114506 -21438 75504 220907 281335 -171784 -349018 -168873 -21500 -123233
8214 -123233 -151012 -115029 134105 -483131 16689 -53313 192921 -111394 108760 113270 -314762
8202 -220722 165343 -35590 201194 -305120 -180463 -199823 70503 -97418 -228104 -149839 5433
8190 -366150 38588 27401 7888 -19157 53830 -303049 90568 -195747 137749 65938 103684
8179 103684 85515 120614 -55912 -115600 98624 93167 88643 128561 -164494 -211746 206064 -197120
8166 179951 -211875 -39577 143942 -11351 38009 -139458 -103339 -116817 -49476 9113 43096
8155 43096 27244 146332 86089 39205 118606 -3016 25361 222544 30786 197172 192698 -150973
8142 -127315 -332597 -381684 -159118 51553 -122992 -130840 10905 51019 -60168 -102258 141176
8130 17444 -66653 134669 -59667 79842 -178754 205995 12437 347249 168045 120510 123996
8119 123996 -284533 -283790 -214790 -258079 91134 -191752 -490157 -31207 -167724 40703 -114571
8107 -183773 -112528 2181 -233328 60058 -380829 57008 -150660 77968 151897 -292593 -27177
8095 10000 55754 -120647 10848 375867 -267737 158833 -246979 -48101 -60581 -15028 257236
8083 -95277 212919 58417 -286321 123227 405884 125992 506290 -163839 40578 159290
8073 159290 -122766 -228496 81318 -110815 -84017 -60589 -200676 58996 -99946 -49322 -165208
8062 -165208 -314241 148686 -238946 -114831 -343464 -202365 16047 -237272 -70730 -201868
8052 -201868 -170877 -328605 140918 53994 13936 -375830 57330 -113733 -262134 152876
8041 107245 180648 -24585 -215302 21610 187159 342425 -172846 107791 30082 46066 -159345
8029 -92781 -271607 -93662 -33259 -104517 -122714 -199173 -278064 -85577 -173763 -120132 97512 152889
8017 152889 206075 51395 157272 -44335 129805 -15281 -223717 268344 -471655 -59013 143237
8005 -148331 99396 -110991 -79969 -223739 159612 -24379 66437 -223409 239523 -64628 -222020
7994 -222020 -76784 -254913 -391054 68319 -252546 114355 -58064 -132099 159012 -12775 -91186
7983 -91186 -62210 155388 73287 -281388 -251378 -125908 15907 -244451 -309822 -174167 48295
7971 123631 25446 -127062 -260747 -156014 -159892 -188656 118622 -11755 61081 -182658 -217101
7960 -217101 -232733 -327447 149294 24323 -97481 -47872 -93350 40311 28857 -4664 -292602
7949 -292602 6343 147721 -361076 89817 147880 -213910 156723 -330501 -58822 -34822 -79784
7938 -79784 -367917 -174002 -102327 -45728 -311903 -208473 -93395 -20675 -105882 -216339 -66168
7926 51320 13096 82169 -15665 -8730 46079 -72716 -29315 -123647 -250663 -147324 51471 -71979
7913 97860 -169492 313419 10024 84687 -60620 181837 -43697 46285 273345 -58586 -62853
7902 -62853 -124258 161357 273243 -110911 5908 -131306 12624 -64423 394819 82002 -157534
7890 68969 -240352 309756 -29609 -175994 184006 -262750 34371 35577 -153392 -199494 -65164
7878 -223199 267990 -33744 105045 161035 -166176 114291 -14962 -16907 -115394 -333169 71269
7866 71379 -47496 -157021 1486 -105399 53474 -20337 3578 31215 68517 -231276 3199 -158365
7853 47738 191313 -173015 -2051 25635 81049 330855 122348 -174725 -392472 39602 143612
7842 143612 -250581 -191226 52028 -46745 -59009 -77716 308688 137455 164544 59924 77322
7831 77322 96732 27297 64019 -137130 112527 -8644 -334572 46824 -441657 -305498 266163
7819 -118975 -7768 284329 30768 63454 -613845 -151951 241347 -141022 -273642 1213 -44881
7807 -380668 -20053 157928 -97459 286100 40958 -162787 -192781 -3429 -30240 -13927 -83401
7796 -83401 -410179 132434 22876 -228925 -130513 147394 221170 -156372 -77039 -172943 -113410
7785 -113410 194471 94428 342099 73441 132899 -109061 -329779 12880 265843 -64573 39499
7773 -166841 105224 -278638 218497 344373 189708 123791 -464757 -89654 33342 -80926
7762 162524 16762 41069 214512 -47167 234669 22649 124748 -164542 -378102 183845
7751 -156050 57288 -65929 -446056 75958 40046 -2262 14627 -198998 96868 101414 -108484
7739 52249 43724 -42168 -101093 17076 -20405 344164 -18844 -37122 -173690 193594 155019
7728 155019 2061 24828 -270870 -19216 -153925 18855 -111391 -83570 -196843 -23621 68841
7716 -91441 -215987 -210063 214655 234893 18339 123748 58670 201156 -173585 363540 -207433
7704 -16464 -38723 -8341 -11158 -99947 -61520 -309078 27855 147169 182287 -166753 -189048 -44004
7691 347623 -504256 -429752 36635 -88505 139935 -116746 140248 352531 -173188 257437
7680 -67157 137451 26432 -35057 138091 199778 -27719 -54407 -352050 -270021 204026 156085
7669 156085 207138 -86931 45003 -181852 -129168 76205 35987 -50958 -176439 105531 275244
7658 275244 -73328 35080 244966 -176382 -70449 78891 -16351 114999 113148 -140703 -28602
7646 207177 58407 123657 75915 -143876 67096 -118582 -336641 -3633 -285389 122862 262234
7635 262234 -279300 10137 25585 175504 -81177 -200648 -218784 -27822 166773 60202 -167123
7623 -111276 91713 15569 -67415 -190320 -136692 -198037 223533 62664 -38632 -274087 365000
7611 54943 -35308 3290 -207867 -99010 53572 83653 37426 -54754 -412 148433 231478 133435
7599 133435 149984 100331 -88134 -290646 -97706 -8843 -174000 214866 -243356 -4080 -386710
7588 -386710 -161527 -104642 321376 -237575 49922 106322 -420704 -42556 -120691 11266 -38924
7576 -91105 47020 -292379 80918 -78911 -7979 78241 -159753 125033 -9342 -412230 55158
7564 37785 -155821 -194764 190018 23314 -186807 34440 -93449 76095 -143228 -194389 -127958
7553 -127958 16626 -164587 32434 9071 128930 -51158 -151101 201885 -256901 -211175 91912
7541 31426 73028 -121422 -244217 65209 227431 20631 229605 -78236 -72004 206345 -176530
7529 -94124 -26412 121176 -37506 -322576 12643 126377 -228595 89045 192954 -67101 -269898
7518 -269898 206836 186239 -207584 -244709 -43789 -204463 255676 -95662 -235448 -150637 -52352
7506 -419599 -203103 -54210 -227311 -271440 8997 53546 -192004 -65416 -72547 21822 81040
7495 81040 60448 -60470 -146915 9957 -16100 -140842 -166747 -29201 -313788 -161141 -147857
7484 -147857 -28513 65048 -45406 56696 -151569 98712 90431 -64676 -114377 10515 145105
7473 145105 -128491 279443 129684 -157957 -115814 58120 -39257 43672 -85094 -265290 96242
7461 -34998 157542 68387 193929 -225063 16272 134793 171702 -72740 -158420 -134602 83864
7449 -108727 -43145 -155469 24660 12381 173540 -321587 37633 -86941 -65662 12279 147620
7438 147620 6466 219192 -308329 139976 305774 -128705 63940 -68980 -95268 -93541 97075
7426 83727 -26377 -153856 -168146 182594 28182 -33200 -80517 203933 -66095 -310571 151145
7414 59812 16891 109891 -119546 -20893 313200 -87196 -136266 199239 975 49072 182047
7403 182047 25108 65767 -168820 -179353 -6500 182331 -126317 5112 155600 156103 -54907 24256
7390 97576 -276840 -18330 -33762 -423694 117798 -365078 -162373 44627 -11813 -235899 -167046
7379 -167046 36079 164178 4674 -69689 -92564 -53296 227382 -217822 -280018 61118 6933
7367 -167737 67632 -249368 186776 50655 126163 188286 -222360 100235 -110442 47360 32049
7356 32049 143748 -73551 -116003 13 182034 80013 -531133 47881 7071 29502 -103351 -350514
7344 -350514 -75839 -352682 77264 -19862 111346 180562 -29753 -151764 147230 46662 159408
7333 159408 125957 -259225 168339 -333835 186712 63448 -34729 50429 -47499 -9707 -10453
7322 -10453 155803 -275971 -117067 43088 -240483 29036 -190588 277492 151914 -120929
7311 -366651 -64116 168542 -106989 109350 22138 39619 83013 -136324 -100120 -104875 -20440
7299 23997 108028 -413874 -39684 -355914 75125 140215 -66311 51437 -358428 59242 113888
7288 113888 -44436 -39987 -213276 176006 -413964 -240767 20167 65081 -214532 189354 -41448
7276 126817 153504 -138092 -111670 -114080 -238032 164592 -90995 -66144 -88656 38294 250845
7265 250845 -37783 67450 47522 -108052 -355872 2328 -101946 -171407 97471 230491 -105239
7253 91439 -5145 -157433 236077 -182882 -311903 88992 -217638 -345855 -75020 150353 -134863
7241 -55775 45176 -319172 -106564 40991 94407 -2503 187649 -364788 -275069 -8627 -175161
7230 -175161 252401 -5410 -150314 -912 312441 -366077 141134 -76876 325855 -58766 45043
7218 171641 -178407 79131 -153390 -273554 -38294 86505 63319 467688 -198181 -130497 -101957
7207 -101957 167231 434974 -28189 -256996 -7838 -144114 -38579 194149 -135762 -167144 -152083
7196 -152083 150616 -187028 115403 90287 225779 339635 -123833 36838 -176094 24872
7185 36060 1688 44990 -83414 -219902 -266173 91930 185610 62132 -206887 -123414 -14920 -4570
7172 230875 183586 -94809 -11572 -200044 -85444 4305 -54180 -221375 -107545 67818 -66768
7160 -248855 60137 -27700 -124074 -87414 -62310 -94258 -163596 -259343 31712 -390231 35966
7148 -186370 70842 299697 -41200 -159030 -23330 -173011 293710 -163415 83530 170276 -117894
7136 -143743 48135 124025 -309062 231493 228111 -70775 153418 -66343 -58553 -76444 98253
7124 30383 349509 85188 -238222 -71537 85885 76744 -8199 -138509 -482067 -98960 -252945
7113 -252945 149465 5693 -94067 182417 -201938 -117851 -157107 120521 -169747 -301137 -373904
7102 -373904 978 -45223 -3057 20202 -187568 -133960 -59726 158445 -35013 89924 40383 -70110
7089 -282228 80707 -93694 -128566 124148 -220383 -41180 229067 -40373 396791 64321 34124
7078 34124 -16352 -290075 -55185 -70352 77553 -178036 -62321 -90312 24670 205659 -44977
7066 204798 -197900 -88991 42372 43932 -95991 -156277 10350 99371 135153 237429 -27601
7054 69125 191943 -31492 -44958 32099 -122582 228385 -199336 313655 -160741 -78178 357561
7042 -210973 -338490 -146517 -182434 -233775 -381290 -205435 5436 -142106 -188614 256288 4570
7030 -64466 150031 284396 230666 -73719 -292134 244953 11155 -398957 109936 101135 -18127
7018 -145356 -150430 -351617 -154216 -86028 180377 15301 184986 -181304 -76773 -127197 -580639
7007 -580639 -5016 -75900 -85582 168 -152256 18412 -45703 -247665 -26316 -280428 112078 -12732
6994 303996 -24258 238592 -299313 86071 -154772 198651 88479 -190550 83088 2578 -123150
6982 70464 115560 -344031 153649 134477 78384 -252400 -32449 -276309 -79576 91498 61944
6971 61944 -34570 -123830 -203578 -160851 -302735 -260055 71971 218639 -205141 109650 -97828
6959 -28499 -90677 23959 -229901 148346 215677 404121 -104739 -75319 -50304 25309 342589
6948 342589 64690 41401 221322 81772 -152228 -92756 88828 -329102 340518 215725 202869
6937 202869 71707 -37756 -57790 332864 83222 14967 -36264 -253390 229413 -206922 -23996
6925 62720 147083 -144647 -223852 -165848 159358 34968 50282 -241889 18392 73617 123910
6914 123910 26613 -123846 -105233 303282 -62693 -43042 -13959 -277616 135461 -220137 83043
6902 -236199 -111835 -71050 52222 42708 -168150 153926 -156470 -59184 -147081 -426055 140662
6890 -138867 -62120 9869 -433678 -106560 -185775 -40885 400715 190250 69675 -98794 -368610
6879 -368610 128533 130107 26996 -130425 -139563 130073 79457 85553 33785 -323600 1103 -3574
6866 -96581 -343138 -182014 24385 308550 -10882 117461 -296580 77886 -59707 -172127 -357212
6855 -357212 298890 -47907 -10539 -5379 439788 -74732 94602 30461 -44472 232600 -164610
6843 38886 -351132 -47527 128826 158734 -282872 119519 -66308 -45384 77080 235791 169746
6832 169746 91384 175426 62170 225910 -70576 -13304 -62042 129780 61755 -251496 -205694
6821 -205694 -245305 -37920 65721 -253156 -218239 -170885 -136750 -35453 -454669 -81739 -93329
6810 -93329 112330 -109002 133240 -156905 -266869 -353816 16046 -287407 -122994 75451
6799 242772 -124769 64945 -192705 -129545 32151 126313 -214918 62601 225486 -301709 -85322
6787 180171 -225584 45849 120617 31578 -143855 216092 -241358 43444 -48522 -180277 -93484
6776 -93484 -17526 -221790 -167401 72815 85194 243008 -235163 -97522 -171644 84648 -89329
6764 129105 28857 -188422 -85483 -166446 -263757 401832 128706 -278582 27642 -5568 -113029
6753 -113029 -54389 -8538 -9535 109591 298229 -28890 -3206 118008 -8365 -246203 -109934 172244
6740 -10700 -48692 -109325 350031 38088 -102747 -7212 -90442 4611 -102616 -97010 -110388 -191563
6728 -191563 -48154 -20613 164984 312872 -210527 136063 124874 -102202 48136 -3647 130132
6716 -185564 -36814 -88410 -389544 82758 -1993 33455 -59852 -169762 -115805 -149753 -112299
6705 -112299 -353886 -304513 -297482 -205967 72431 91983 238570 -37155 -65889 -199247 72571
6693 -115454 -176967 -12092 206721 150 -224034 201655 199097 42135 265720 30272 -88831
6681 20097 14638 214099 136211 -99199 92380 -149716 -198269 -176488 118186 -105288 244058
6669 -164280 -50203 -203284 215958 84417 -256001 72680 10617 -171113 487641 223381
6658 6652 22662 -306523 36509 -329091 279549 154303 87407 30084 -277228 20569 118423
6647 118423 127761 726 -119956 -25422 314851 -47474 146283 -271563 -86107 41529 160625
6636 160625 274764 -538898 210167 -75554 -400 255024 -211200 -144815 -347672 27190 -84251
6624 50487 -123252 -230094 -123137 66839 9024 25435 -166398 90878 287991 -50546 -269160
6613 -269160 32910 -80577 79231 127677 -140419 -300722 -34389 -265538 -133249 49377 287697
6602 287697 -70015 -176891 -169609 105579 -237619 75151 41659 110863 42676 -79969 -47168
6591 -47168 -126307 61278 -102459 191291 187505 33355 37703 186683 113971 -3875 -67403 -120617
6579 -120617 130225 -162890 -82487 -130662 291543 -82446 4263 -184361 15535 258250 -255537
6567 -166585 183261 -146829 157142 -292500 -56974 -61590 218141 36617 -186044 120574
6556 57290 17475 -149790 -137046 283435 275713 -48843 128130 -85403 -88676 -175989 55931 -66256
6543 -136577 -67773 -127742 29631 128494 -215815 57031 -48376 -240688 166447 -205914 58356
6531 -116911 120291 -23595 1457 -162055 -433799 50461 -79950 110563 -86164 351116 70652
6519 -87675 260089 200001 146489 87716 -9326 183852 87274 18295 -130075 206388 39796
6507 -231637 -320861 228190 -333390 -38158 -25485 -25123 -34038 -113418 22667 219225 -4146 144389
6494 185319 -117651 -23429 147279 -321222 74995 30645 -200633 -187654 -217137 -271201 27616
6482 -185551 -118318 -148497 -118010 245292 126187 14423 96980 -139202 51395 -28326 184573
6470 -62571 -88727 -290308 53135 40549 -396139 -83164 -240119 -272072 -61445 96909 -245337
6458 -61862 79614 -133637 -86444 -157131 -116678 11525 25765 -97954 31090 88271 -38640 -167188
6446 -167188 -65239 -49116 244090 72519 20623 188585 -172156 -59663 198288 -104348 -173451
6435 -173451 198520 137519 3544 220393 223182 271585 373456 -98088 13651 45712 143138
6424 143138 16864 358601 -14477 62935 50036 -239696 165596 -70774 -110301 -318141 201915
6412 -100673 120941 96858 75684 -52684 -190053 29379 -351473 76045 -57306 39350 -81672
6400 45376 -229809 -80798 -196253 -245878 -60194 79059 -292699 127955 -13191 71263 -303085
6388 -107911 -107902 139766 -229917 -237492 -307381 131484 48921 -154469 -93765 109894 13527 -184512
6375 110775 61039 54101 -43090 33214 18765 -115337 10663 280891 46471 50097 226267
6364 226267 -205609 15672 -18572 -177369 288924 -168295 -214714 306697 -5582 -118776 -121912
6353 -121912 -354882 175363 51288 187128 -7837 -16356 227647 -263218 -275538 -106273 -138368
6342 -138368 128627 -142738 -152043 -253018 -22403 167557 -179819 13994 -36801 224456 -251070
6330 -5097 -28261 59865 142570 93932 83350 151399 -175914 71698 92620 -27905 -10020 -108183
6318 -108183 -202708 120949 267112 -31071 66014 -154198 -43421 -75748 5197 -274415 104711
6306 327937 108625 -75002 5820 260753 12879 130046 -42583 -100073 70639 -198989 179510
6294 -8410 -202055 -74132 107687 129675 -82537 -27629 -273112 55281 -110920 193262 -10441
6282 -153900 -349410 103853 -159651 9684 183786 -174539 -123611 -32413 -99754 -242266 -152492
6271 -152492 10666 151952 176957 -270440 106391 -18591 -28951 -218128 164315 -158461
6260 -278805 2898 -137438 196591 -13541 141098 -52847 -222712 -66787 136436 156464 205381
6249 205381 -311153 -169339 137405 -76060 -243263 -76605 -256798 -231988 -81110 -239210
6239 -239210 167777 25897 -44100 219532 -78149 167263 -138565 46199 17389 74896 30763
6227 281983 -144791 -84805 -210543 152183 -111194 312212 122295 247389 -50033 386209
6216 -195881 -66952 -120563 -164072 35843 -194941 112546 128016 174648 -219223 36055 -80935
6204 35810 121875 128174 364703 69142 46809 349293 -372855 -238443 -88434 -51359 350476
6192 -135687 149480 2688 -13995 54106 -62167 198331 -291185 168753 180045 -547859 78459
6180 214534 -62371 -178421 -90554 -79796 72020 -38867 41056 -236398 -144612 -148169 -111086
6169 -111086 -216207 141555 -109999 103876 -215243 -122963 85320 -285408 -116353 -156492
6159 -156492 -76073 291888 42650 -40841 -101198 -337788 198314 337051 -83262 36174 -86720
6147 18109 -207879 147789 -32747 15234 70851 170520 61420 160676 -115715 -32809 -252266
6136 -252266 -181684 128218 72625 311715 -40531 -68591 -130453 117878 -13999 243215 -120645
6124 134066 -180264 59882 319300 79759 66054 -275134 -25020 -133092 330337 -54645 111650
6112 87753 139929 8099 238356 92653 -404387 -55011 -249438 -60275 -73495 17129 40623
6101 40623 -89822 171989 46129 58488 174746 124320 -185015 52044 -212333 -13940 -1204
6089 -143244 65200 49122 36616 143346 22803 -50301 -251706 -209993 107531 142083 140303
6078 140303 -289699 -247452 -1308 189195 15596 -217144 294276 101230 226761 207784 192356
6067 192356 -23610 -195744 -388042 89874 -102661 45179 -241183 -26177 -91519 -11705 145117
6055 17067 -88184 146773 -174243 310118 -44165 90634 -266827 -64212 -94447 -170496 198297
6043 99335 -206802 -149856 -48806 361387 353454 376202 37715 -349157 -27254 53473 -106638
6031 42211 79032 23985 85356 -401905 -173983 266013 7220 244669 -126761 215726 -36642
6019 158179 -32866 119129 61917 -12493 164786 105619 88926 114712 -157544 -125967 17110
6007 -246554 99329 191556 378860 55035 -140731 296448 -179506 61877 -343642 -260117 201323
5995 -26447 -58465 -77584 -236510 52429 -237486 -31041 -47987 -300274 133131 -83264 -137549
5984 -137549 208034 -187318 64039 -39039 -147599 42074 -33017 20995 -202762 -83577 -38962
5972 -263710 44514 222376 -407005 -41682 220250 -40607 -63702 -41739 82877 17984 4175
5960 43712 -35532 107251 -235764 136408 -359677 -176836 195793 -199512 -519534 -256496
5949 -4188 -157768 -87115 126409 -405 -112971 86868 -223709 -222742 -164627 42538 -87587 -161730
5937 -161730 57971 68183 189599 383113 32962 21499 -13367 -189503 283629 -75524 -305670
5926 -305670 6547 261139 -125601 139934 -61198 92104 314557 -219256 129771 134907 60932
5914 -152466 291295 92934 287531 -122062 -298401 -170688 -70731 347288 216426 33166
5903 -331020 145899 -124556 -203271 313592 54496 49412 -71005 -439617 -8438 69256 165623
5892 165623 349304 -93374 -184458 3788 -105433 578540 141136 275620 110750 -65882 1132
5880 -267872 214015 -301043 123026 -274549 107310 -40972 68136 -97931 -94652 -183408 -221846
5869 -221846 207689 -149817 -389634 43047 274486 -37160 -289352 -362609 37334 -325670
5858 70653 -340234 -183331 -145486 -261904 472619 -153413 -193327 -93413 163443 8462 16758
5847 16758 62899 -368103 -366707 -209191 23935 99425 -251595 -4687 -293103 4412 -109394
5835 -68574 -252158 -39231 285446 -202789 -190941 141636 -64263 -58989 -136725 -9386 -147355
5824 -147355 103376 -20679 -267897 71016 79170 6268 -104921 -29829 -82862 -246892 -466544
5813 -466544 45979 347999 208007 -39619 6846 207118 -97797 102161 181156 -73422 25839
5801 -51946 -165927 12816 389690 51746 -14864 -47683 49260 14315 -42060 -167576 13922
5789 -454910 44869 -20398 123228 -344834 36118 207345 -123020 113506 -187635 -216276
5779 -216276 40879 -51514 -192495 195432 115833 -87141 -182603 -88922 132627 65006 85542
5768 85542 90340 -83377 396310 -449375 55155 50846 -129730 -151570 -34721 34788 55676 -308195
5755 185726 125054 -109489 70600 9873 -40080 -14702 -131168 -56129 -97191 9041 232140
5744 232140 -242562 -129246 -138667 331723 17360 -8932 110926 24344 -99866 -114664 -50628
5732 18650 232903 129804 -219942 -107206 -30320 111537 -33363 40819 -37840 -277261 -29670
5720 -170494 132106 336024 -221609 1780 128345 -105099 -142393 88379 -29273 22437 -95510
5708 -36895 72374 70443 185866 240791 -218272 220900 168880 -61911 -88571 -211923 62376
5696 -146865 -182306 -59097 73031 115583 -221806 144148 -282957 162903 -223911 -185972 83725
5684 189020 -20005 59762 130335 201548 -70989 185188 37370 -44485 15486 209871 75399
5672 224791 221757 19243 6614 -97422 81473 29939 -13583 300339 121578 233948 46895
5660 -75358 -70319 -16816 -305716 10808 207166 -179993 -216565 -113084 32751 105009 127450
5649 127450 -173867 -65064 -49700 -17298 275856 373433 78928 -34906 44420 123391 -3495
5637 -145705 69176 31883 52947 159564 -301393 167476 -207520 -162086 -29071 144007 36751
5625 103210 6405 -31276 26079 109723 -50576 -48147 252839 -40096 98037 -129761 244086
5613 168766 121530 180319 171565 -205744 -233075 206546 25936 -33576 181803 57522 35802
5602 35802 -180572 194625 -99861 131803 131727 -227572 -103433 -110345 -134491 252488 8134 -162628
5589 -350311 -531098 109923 229613 199340 -269677 -274627 14919 -47314 202113 -3020 -136259
5578 -136259 234035 79344 -322772 137856 44816 -209029 63264 365853 -356793 -22141
5567 -12934 197234 -190150 16881 2560 68034 93826 259972 -18439 -10041 -141546 334832
5555 158715 11499 -221663 70503 235593 311808 28103 53645 -56469 91916 -371681 100245
5543 -268641 -336597 261490 -46862 -123717 71989 -273944 -95109 -182969 -420875 -79938 131238
5531 18064 311773 267924 -5161 24705 -105840 -85830 -11067 209190 136329 125018 596500
5520 596500 25517 -238165 -268651 -76855 480822 -211108 -152898 322991 16416 -313365 71755
5508 39277 208344 133412 10292 -107010 -198953 -362604 -41583 -46377 62902 35735 -157005
5496 51593 62163 -162024 273094 80553 40086 -253331 140250 -279731 -232615 -39111 90398
5484 35668 233995 82990 -231484 29597 125007 -165625 -214939 -146084 -109764 -259307 221476
5472 1218 102508 -297817 116709 -18894 167224 9790 -83127 -138192 160115 -234407 238162
5460 74515 122036 -404872 -97589 -50704 -170882 -99535 -46743 -268449 -216884 482518 279538
5449 279538 107892 73375 3669 108206 87513 -127306 -30925 285904 208928 -183367 -77785
5437 274280 -83752 -271758 -102566 -117073 -16284 316270 27272 540472 8466 10293 35933
5426 35933 -15889 -387729 -83803 17934 107976 141485 -334104 117812 5823 14864 45906 159087
5414 159087 -169104 42696 -261723 -144098 97546 297831 231570 -56919 -196539 -40964 94600
5402 237015 12974 -126060 235678 32777 -86723 45369 165982 143315 99978 54278 -153471
5390 -246828 243862 -107821 -125388 -58339 205163 169577 179099 -328 -79260 78243 -21060 -188092
5378 -188092 88144 -157658 -29748 -40650 -81208 387054 -81462 38493 -39708 288227 -375831
5366 148626 112888 -45904 -164238 97494 200051 -21893 -49864 -80370 -12252 -37458 46704
5354 -163194 181012 -197770 -106741 -66113 164796 375247 139933 -140239 -75114 -134039
5344 -134039 70346 -17622 189905 -39978 48528 50479 -30733 -8086 153697 -6007 -87716 25256
5331 -117487 128609 27823 -270029 -509222 209128 -195616 -28994 -189120 -258900 38980
5320 -52025 233453 -312093 21340 -74163 -388094 47491 -72558 12446 197092 149764 -285170
5308 -163308 87766 33020 43609 198205 48092 -64568 -281230 -213821 61386 339295 -171495
5296 -28272 127718 102227 -108099 134075 157769 248519 -107980 -182259 122199 90766 -71187
5284 -44890 -189476 -97581 238733 -148826 183458 -56515 -50386 24177 20274 76509 -74833
5272 62869 104622 -148264 38915 129984 242870 -240446 -22132 129985 133705 60258 199994
5261 199994 7605 57991 26958 28100 -250070 -101451 -150673 -115449 87769 167329 191536 -2529
5248 44482 -430109 -241398 -115889 3855 -170670 -200950 -228927 47172 122571 -203342 36136
5236 107234 -342285 129557 94771 -109942 79388 176514 -145996 246236 -85163 390230
5225 -37360 174848 32376 205837 272798 -164937 287680 -22734 -86123 45749 507163 -69841
5213 -184005 -33939 -509692 155082 402610 -17334 199951 22973 -69654 -154732 73414 193706
5202 193706 -219395 120098 -307865 72374 359 44394 49965 -1564 89853 -135187 -141394 153159
5189 274096 -152709 12275 12182 202223 127754 -202752 135500 13256 -25244 -62207 215812
5177 -328240 155559 -193255 142820 362623 268918 12030 186209 12468 -8108 -279220 167261
5165 207118 15628 60920 -47686 90537 -113160 -54448 69987 104474 -177924 39780 138383
5154 138383 13554 98006 -66659 123014 -1401 -179718 83450 -250910 -129552 -115268 174450
5142 119915 -114515 -263914 -39801 123731 -2591 -135504 2032 198979 181104 189785 -66180
5130 -199925 222107 -95187 -81812 27898 135604 3258 -188707 -131514 -203578 67428 -265893
5118 -234709 715 347730 -131193 -72957 -107568 -116994 -80172 92767 78072 -110650 -114588 113291
5105 -52865 -71862 -214032 222045 -210621 122216 -85267 181661 -180200 -23514 249210
5094 409478 -22731 140710 -118014 224439 162819 201904 -232246 180723 130898 -83004 309399
5082 -244771 210030 394904 128593 -385710 90636 -184463 -155184 218148 74443 -245142
5071 325384 -96157 224913 -424558 43814 -188279 259616 -132890 -92317 298789 323189
5061 323189 123554 -19188 -23511 -153003 363347 -203060 -178529 -62446 108892 56969 -210977
5049 186138 130424 174176 454506 -208026 100632 -89241 -151633 16425 -257041 10696 124194
5038 124194 133440 31820 -158127 -238088 -37286 14369 38152 -91083 -259394 -118781 -156207
5027 -156207 -48384 -307729 -39202 162595 28662 -34314 214961 92265 58610 31065 -60450
5015 3550 67620 -11384 68013 33748 137741 -207816 19437 -231282 270619 79107 42178
5004 42178 73050 165474 228921 -19023 -25698 -213130 62629 -50536 134422 178535 106007 177979
4992 177979 445531 152471 -170779 385395 29022 -189799 158620 -188539 67164 95366
4982 95366 138151 31437 -52686 104166 5574 -110530 121885 169434 133032 46185 -50239
4970 -162993 -244279 299544 -83817 -167151 63928 37766 -25626 -104567 86316 121533 -127310
4958 -174848 38906 530854 -28908 -15022 -98979 66661 14501 68473 331524 -83723 -212725
4947 -212725 7979 -289158 -21345 123646 216217 -17706 -302101 -37008 54010 11801 139570
4936 139570 336886 -65746 -101230 -328903 -64905 -195361 -141486 -47027 96620 43541 -114647
4924 276429 -28528 -148206 -232325 121105 -199157 -245315 -43309 -240258 87563 -435 -12115
4913 -12115 22537 -30111 370743 8952 20436 -225032 -30784 -137354 18466 73494 69732 5139
4900 -23722 -134161 -452889 -384733 14341 137559 -177687 -12354 -258490 -238187 7913 -316964
4888 41501 136687 225032 -241560 160753 278410 110724 143039 112687 157045 308503 96840
4876 48815 25318 123616 359994 -56337 -455876 77083 89580 -181707 -141163 243067 283164
4865 283164 -4075 69111 -102976 -322488 110076 28732 212114 -417402 4909 -20587 26828
4853 -208872 15645 -85533 -119208 -105112 157912 -175323 78447 -57441 135849 -145810 30620
4841 4100 -10212 -9478 -233254 57447 -99031 19978 136551 6402 28363 -37633 -81445 106195
4828 -184959 -165334 89940 -280209 55911 35950 90879 -122404 -208396 50998 154372 54528
4816 -51872 66921 250536 167405 50448 -240112 4343 19641 -270210 16361 212202 -110245
4804 -207261 -70109 159822 -161278 12193 41635 -13943 -13057 -248933 71847 -134450 140972
4792 121149 332828 229320 -243191 53243 228396 -50320 -406662 -1384 23172 203345 65459
4780 -13633 18493 277151 363275 253248 -389426 305356 50914 -66967 165357 -204095 -83805
4768 348533 22827 -136011 -28752 -109062 45201 175556 -161894 26824 260889 135863 562490
4757 562490 -294007 -474561 -57920 107465 -224141 174360 338386 -111547 261444 34663
4746 58645 -446358 49525 -87958 67770 -13631 190894 -406053 87228 -261211 60935 248588
4735 248588 125199 179354 28036 -42346 156029 188941 -176414 -360368 -182040 -88993 272362
4723 -275092 257121 53838 192791 289273 50671 105352 -194373 -223416 -165215 98940 84771
4712 84771 -201072 -295655 220495 72548 -27348 -93281 -123005 134692 -54642 25311 -30196
4700 22569 -139818 268314 -25745 99902 -157197 -121927 11169 -129820 245222 121518 321924
4689 321924 161511 131540 354547 -191256 120626 90600 71978 66072 321104 -113945 185120
4677 122712 -55479 -47617 357130 -227093 -89651 35436 -25460 287790 -140256 71062 126476
4666 126476 111652 129474 -355803 92857 -25289 299111 316319 -80538 150059 181784 196647
4655 196647 -29219 -178656 -29671 7678 -37467 310091 189462 160590 -110336 32485 -133435
4643 -24237 -18321 -486467 128719 -100809 -28870 -123263 94895 203643 -36839 -326202 325428
4631 -136972 101590 -19483 -82892 -131924 -54953 18167 42619 -83502 382579 47772 -43860
4619 146490 -70694 5274 97134 -117870 -57117 3523 368424 196482 -326746 -11861 -141789
4608 -141789 -54088 -296019 69767 -395952 136921 52815 65552 276681 142752 210919 142191
4597 142191 -131271 -104981 161409 208057 -124766 46124 82685 32024 -269047 -106379 -195567
4586 -195567 101754 123475 18818 -34538 -165790 -172676 248775 49321 -186469 379939 6612
4574 -306331 216898 143413 -100991 216246 -72087 118697 8389 -66283 217996 122016 -202688
4562 -205346 -190232 -28954 -21120 55525 -119785 117323 9523 260446 51420 -214063 -30534
4550 -47946 -171750 133907 -4290 -260716 -88601 -39100 196852 -40090 7088 365022 271008
4539 271008 -92388 276817 74552 41684 -155353 -238803 248160 74755 8975 -32450 -105842
4528 -105842 -236473 261413 -280644 -492358 131964 -215934 44372 -5000 210066 -49869
4517 92452 -184039 95137 -85615 14308 -210083 122770 306540 -81387 197451 -100065 40660
4505 -34405 -87423 -338191 24369 56515 84752 -222723 -53581 151493 -127223 -14615 4421
4493 376475 -120459 373095 -36937 8491 148682 -5027 287541 -36693 26 33952 103621 -151614
4480 -272384 242615 -35028 -42358 262158 249159 -315879 69030 290326 93846 -156677 141231
4468 25894 167738 250759 85654 265698 -151776 -123661 -55003 -166769 -1970 124208 128539
$$ [...]
##END NTUPLES=NMR SPECTRUM
##END=
