##TITLE=AC1533_ROEFFECT0009_8214086_iX1p2NjASO
##JCAMPDX= 6.0         $$ Bruker NMR JCAMP-DX V2.0
##DATA TYPE= NMR SPECTRUM
##DATA CLASS= NTUPLES
##ORIGIN= BRUKER
##OWNER= Administrator
$$ 1.72 TOPSPIN		Version 2.1
$$ 2014-07-31 19:50:04.771 -0700  Administrator@X
$$ Compression mode = diff/dup
##.OBSERVE FREQUENCY= 400.02188249412
##.OBSERVE NUCLEUS= ^1H
##.ACQUISITION MODE= SIMULTANEOUS (DQD)
##.ACQUISITION SCHEME= undefined
##.AVERAGES= 64
##.DIGITISER RES= 22
##SPECTROMETER/DATA SYSTEM= spect
##.PULSE SEQUENCE= noesygpps1d.comp
##.SOLVENT NAME= COFFEE_meoh
##.SHIFT REFERENCE= INTERNAL, COFFEE_meoh, 1, 14.97783
##AUDIT TRAIL= $$ (NUMBER, WHEN, WHO, WHERE, PROCESS, VERSION, WHAT)
$$ ##TITLE= Audit trail, TOPSPIN		Version 2.1
$$ ##JCAMPDX= 5.01
$$ ##ORIGIN= Bruker BioSpin GmbH
$$ ##OWNER= Administrator
$$ $$ E:\/data/COFFEE/nmr/AC1533_ROEFFECT0009_8214086_iX1p2NjASO/22/pdata/1/auditp.txt
$$ ##AUDIT TRAIL=  $$ (NUMBER, WHEN, WHO, WHERE, PROCESS, VERSION, WHAT)
(   1,<2014-07-31 19:49:59.294 -0700>,<Administrator>,<X>,<go>,<TOPSPIN 2.1>,
      <created by zg
	started at 2014-07-31 19:38:23.481 -0700,
	POWCHK enabled, PULCHK disabled,
       configuration hash MD5:
       16 EA D6 F4 BB 67 03 14 9B FF E7 A0 43 5B 48 2E
       data hash MD5: 64K
       77 AE E9 14 62 77 B0 B5 87 06 79 7A 19 A5 27 3E>)
(   2,<2014-07-31 19:50:02.205 -0700>,<Administrator>,<X>,<proc1d>,<TOPSPIN 2.1>,
      <Start of raw data processing
       efp LB = 0.3 FT_mod = 6 PKNL = 1 PHC0 = 0 PHC1 = 0 SI = 128K 
       data hash MD5: 128K
       CD EB 4B 66 7C E2 D0 F3 48 8B 38 BB 91 0C 8D B8>)
(   3,<2014-07-31 19:50:03.283 -0700>,<Administrator>,<X>,<proc1d>,<TOPSPIN 2.1>,
      <pk PHC0 = -85.6604 PHC1 = 0 
       data hash MD5: 128K
       5E 75 83 9C E0 54 B7 F3 29 B0 FF FE 51 1A 43 2B>)
(   4,<2014-07-31 19:50:03.665 -0700>,<Administrator>,<X>,<proc1d>,<TOPSPIN 2.1>,
      <abs ABSG = 1 
       data hash MD5: 128K
       9A 1F 6A 6A 03 D3 56 9E 5A 17 96 E3 8D C7 0A 36>)
(   5,<2014-07-31 19:50:04.072 -0700>,<Administrator>,<X>,<proc1d>,<TOPSPIN 2.1>,
      <abs ABSG = 2 
       data hash MD5: 128K
       3C B1 73 35 F2 B7 85 55 89 5C 1B D0 CE FD 5E 5F>)
(   6,<2014-07-31 19:50:04.148 -0700>,<Administrator>,<X>,<proc1d>,<TOPSPIN 2.1>,
      <abs ABSG = 3 
       data hash MD5: 128K
       C7 FA D6 46 3B 27 AE 42 21 88 FF 3C B9 FE F2 D2>)
(   7,<2014-07-31 19:50:04.212 -0700>,<Administrator>,<X>,<proc1d>,<TOPSPIN 2.1>,
      <abs ABSG = 4 
       data hash MD5: 128K
       E0 8C CF A6 26 19 7D 7F 6E 40 65 FB 6C 92 DC 4F>)
(   8,<2014-07-31 19:50:04.313 -0700>,<Administrator>,<X>,<proc1d>,<TOPSPIN 2.1>,
      <abs ABSG = 5 
       data hash MD5: 128K
       E7 F8 5C 40 08 56 58 1D 63 8C CB 81 A6 B0 D7 03>)
$$ ##END=
$$ 
$$ $$ hash MD5
$$ $$ 3C CA 35 01 81 DE 7C 87 02 C6 4D FB 2E FC C8 34
##$RELAX= 
##$RELAX= 
##$RELAX= 
##$RELAX= 
##$RELAX= 
##$RELAX= 
##$RELAX= 
##$RELAX= 
$$ Bruker specific parameters
$$ --------------------------
##$DU= <E:\>
##$EXPNO= 22
$$ [...]
##$TP07= 0
##$TPNAME0= <>
##$TPNAME1= <>
##$TPNAME2= <>
##$TPNAME3= <>
##$TPNAME4= <>
##$TPNAME5= <>
##$TPNAME6= <>
##$TPNAME7= <>
##$TPOAL= (0..7)
0.5 0.5 0.5 0.5 0.5 0.5 0.5 0.5
##$TPOFFS= (0..7)
0 0 0 0 0 0 0 0
##$TUNHIN= 0
##$TUNHOUT= 0
##$TUNXOUT= 0
##$USERA1= <user>
##$USERA2= <user>
##$USERA3= <user>
##$USERA4= <user>
##$USERA5= <user>
##$V9= 5
##$VALIST= <valist>
##$VCLIST= <CCCCCCCCCCCCCCC>
##$VD= 0
##$VDLIST= <DDDDDDDDDDDDDDD>
##$VPLIST= <PPPPPPPPPPPPPPP>
##$VTLIST= <TTTTTTTTTTTTTTT>
##$WBST= 1024
##$WBSW= 4
##$XGAIN= (0..3)
0 0 0 0
##$XL= 0
##$YL= 0
##$YMAX_a= 12459707
##$YMIN_a= -13668450
##$ZGOPTNS= <>
##$ZL1= 120
##$ZL2= 120
##$ZL3= 120
##$ZL4= 120
##$ABSF1= 14.97783
##$ABSF2= -5.580352
##$ABSG= 5
##$ABSL= 3
##$ALPHA= 0
##$AQORDER= 0
##$ASSFAC= 0
##$ASSFACI= 0
##$ASSFACX= 0
##$ASSWID= 0
##$AUNMP= <proc_prof1d_extract.lims>
##$AXLEFT= 0
##$AXNAME= <>
##$AXNUC= <1H>
##$AXRIGHT= 0
##$AXTYPE= 0
##$AXUNIT= <>
##$AZFE= 0.1
##$AZFW= 0.1
##$BCFW= 0
##$BC_mod= 0
##$BYTORDP= 0
##$COROFFS= 0
##$CY= 15
##$DATMOD= 1
##$DC= 0
##$DFILT= <>
##$DTYPP= 0
##$F1P= 0
##$F2P= 0
##$FCOR= 0.5
##$FTSIZE= 131072
##$FT_mod= 6
##$GAMMA= 0
##$GB= 0
##$INTBC= 1
##$INTSCL= 1
##$ISEN= 128
##$LB= 0.3
##$LEV0= 0
##$LPBIN= 0
##$MAXI= 10000
##$MC2= 0
##$MEAN= 0
##$ME_mod= 0
##$MI= 0
##$NCOEF= 0
##$NC_proc= 0
##$NLEV= 6
##$NOISF1= 0
##$NOISF2= 0
##$NSP= 0
##$NTH_PI= 0
##$NZP= 0
##$OFFSET= 14.97783
##$PC= 1
##$PHC0= -85.6604
##$PHC1= 0
##$PH_mod= 1
##$PKNL= yes
##$PPARMOD= 0
##$PPDIAG= 0
##$PPIPTYP= 0
##$PPMPNUM= 2147483647
##$PPRESOL= 1
##$PSCAL= 4
##$PSIGN= 0
##$PYNMP= <proc.py>
##$REVERSE= no
##$SF= 400.020002906213
##$SI= 131072
##$SIGF1= 0
##$SIGF2= 0
##$SINO= 400
##$SIOLD= 131072
##$SPECTYP= <>
##$SREGLST= <1H.CDCl3>
##$SSB= 0
##$STSI= 131072
##$STSR= 0
##$SW_p= 8223.68421052631
##$SYMM= 0
##$S_DEV= 0
##$TDeff= 65536
##$TDoff= 0
##$TI= <>
##$TILT= no
##$TM1= 0
##$TM2= 0
##$TOPLEV= 0
##$USERP1= <user>
##$USERP2= <user>
##$USERP3= <user>
##$USERP4= <user>
##$USERP5= <user>
##$WDW= 1
##$XDIM= 131072
##$YMAX_p= 90839153
##$YMIN_p= -303404759
##$CURPLOT= <Network HP LaserJet P1505>
##$CURPRIN= <$Network HP LaserJet P1505>
##$DFORMAT= <normdp>
##$LAYOUT= <+/1D_H.xwp>
##$LFORMAT= <normlp>
##$PFORMAT= <normpl>
##$SURQMSG= 1
$$ End of Bruker specific parameters
$$ ---------------------------------
##NTUPLES= NMR SPECTRUM
##VAR_NAME=  FREQUENCY,     SPECTRUM/REAL,   SPECTRUM/IMAG
##SYMBOL=    X,             R,               I
##VAR_TYPE=  INDEPENDENT,   DEPENDENT,       DEPENDENT
##VAR_FORM=  AFFN,          ASDF,            ASDF
##VAR_DIM=   131072,        131072,          131072
##UNITS=     HZ,            ARBITRARY UNITS, ARBITRARY UNITS
##FACTOR=    0.0627417313425164, 1,          1
##FIRST=     8223.62146879497, 450,          -7616
##LAST=      0,             594,             -7536
##MIN=       0,             -303404759,      0
##MAX=       8223.62146879497, 90839153,     0
$$ Real data points
##PAGE= N=1
##DATA TABLE= (X++(R..R)), XYDATA
$$ [...]
63310A94419j494j750j716j315p57m04m74r29j623k456l366m255n022n606o017
$$ 194419 192925 191175 189459 188144 187387 186983 186509 185580 183957 181501 178135 173880 168858 163252 157235
63295A57235o256o299o159n934n714n426m894m095l283k721k391k080j677j266
$$ 157235 150979 144680 138521 132587 126873 121447 116553 112458 109175 106454 104063 101983 100306 99040
63281I9040q98n19j08K66N84R08J232J482J671J947K354K732K948L085L331L756
$$ 99040 98142 97623 97515 97781 98365 99273 100505 101987 103658 105605 107959 110691 113639 116724 120055 123811
63265A23811M329N014N747O373O731O784O590O179N543M642L459K100Q22j19p00
$$ 123811 128140 133154 138901 145274 152005 158789 165379 171558 177101 181743 185202 187302 188124 188005 187305
63250A87305j086j359j448j349j206j114j036r98j208j780k571l360m103m817
$$ 187305 186219 184860 183412 182063 180857 179743 178707 177709 176501 174721 172150 168790 164687 159870
63236A59870n381n644n644n511n236m708l938l077k205j290l85K30K06n59j767
$$ 159870 154489 148845 143201 137690 132454 127746 123808 120731 118526 117236 116851 117081 117287 116728 114961
63221A14961k883l535l738l712l549l222k830k561k394k103j660j334j302j368
$$ 114961 112078 108543 104805 101093 97544 94322 91492 88931 86537 84434 82774 81440 80138 78770
63207G8770j263j044r01q25o67m55l53l91m30l82k56p0J39K50K03J16J32K03K28
$$ 78770 77507 76463 75562 74737 74070 73615 73262 72871 72441 72059 71803 71733 71872 72122 72325 72441 72573 72776 73004
63188G3004K44L25L56J77j32l22l19k85l42m59n54n80m84k66p0l7j02q7MJ1q2
$$ 73004 73248 73573 73929 74106 73974 73652 73333 73048 72706 72247 71693 71113 70629 70363 70293 70256 70154 70067 70071 70082 70000
63167G0000j06M0K54M16N06N25M45L28L10M39O10P28P98Q31Q01P52Q19J043J290
$$ 70000 69894 69934 70188 70604 71110 71635 72080 72408 72718 73157 73767 74495 75293 76124 76925 77677 78496 79539 80829
63148H0829J399J391J401J507J640J703J681J673J776J989K250K539K898L315
$$ 80829 82228 83619 85020 86527 88167 89870 91551 93224 95000 96989 99239 101778 104676 107991
63134A07991L692M000M352M833N368N841O243O573O755O756O713O754O760O535
$$ 107991 111683 115683 120035 124868 130236 136077 142320 148893 155648 162404 169117 175871 182631 189166
63120A89166O144N887N916O122O364O639O961P237P386P414P308O955O280N336
$$ 189166 195310 201197 207113 213235 219599 226238 233199 240436 247822 255236 262544 269499 275779 281115
63106B81115M241L036J678Q8j749l685n430o757p684q387q940r238r192q841q284
$$ 281115 285356 288392 290070 290158 288409 284724 279294 272537 264853 256466 247526 238288 229096 220255 211971
63091B11971p566o723n841n003m222l420k508j473m31M51J127J699K259K809L350
$$ 211971 204405 197682 191841 186838 182616 179196 176688 175215 174784 175235 176362 178061 180320 183129 186479
63076A86479L946M581N085N316N361N400N481N517N490N484N524N527N386N027
$$ 186479 190425 195006 200091 205407 210768 216168 221649 227166 232656 238140 243664 249191 254577 259604
63062B59604M414L609K762J957J107O9j164k479l811n122o328p325q039q415q410
$$ 259604 264018 267627 270389 272346 273453 273522 272358 269879 266068 260946 254618 247293 239254 230839 222429
63047B22429q128p793p493p087o481n847n373m995m525l942l304k549j649q79
$$ 222429 214301 206508 199015 191928 185447 179600 174227 169232 164707 160765 157461 154912 153263 152384
63033A52384n63o35p32o94o70p60q67r01q88q19o47m66m06l68j60J38K24Q8M2
$$ 152384 151821 151186 150454 149760 149090 148330 147463 146562 145674 144855 144208 143742 143336 142968 142808 142946 143170 143258 143300
63014A43300K43M46M49L94M71N78M97K50k5k92n48o74n89m15l19l00k60k03k02
$$ 143300 143543 143989 144438 144832 145303 145881 146378 146628 146603 146311 145763 145089 144500 144085 143766 143466 143206 143003 142801
62995A42801k38k34j78j05k5M9R8J71L27M95N06L62K86L86N00N04N54Q47J255
$$ 142801 142563 142329 142151 142046 142021 142070 142168 142339 142666 143161 143667 144029 144315 144701 145201 145705 146259 147106 148361
62976A48361J463J366J163J048J052J154J351J602J843K061K317K640L000L341
$$ 148361 149824 151190 152353 153401 154453 155607 156958 158560 160403 162464 164781 167421 170421 173762
62962A73762L609L793L961M223M611N082N621O267O994P681Q282Q921R701J0547
$$ 173762 177371 181164 185125 189348 193959 199041 204662 210929 217923 225604 233886 242807 252508 263055
62948B63055J1350J2163J3102J4106J4936J5429J5628J5664J5622J5524J5414
$$ 263055 274405 286568 299670 313776 328712 344141 359769 375433 391055 406579 421993
62937D21993J5337J5272J5167J5031J4989J5155J5463J5695J5686J5409J4804
$$ 421993 437330 452602 467769 482800 497789 512944 528407 544102 559788 575197 590001
62926E90001J3712J2052R927P417M404Q07l078o782j0110j3199j6044j8345j9888
$$ 590001 603713 615765 625692 633109 637513 638320 635242 628460 618350 605151 589107 570762 550874
62913E50874k0798k1283k1338k0869j9947j8726j7241j5476j3547j1635r780p865
$$ 550874 530076 508793 487455 466586 446639 427913 410672 395196 381649 370014 360234 352369
62901C52369n806l686j697PJ451K808M208N559O669P494Q148Q670Q998R155R308
$$ 352369 346563 342877 341180 341187 342638 345446 349654 355213 361882 369376 377524 386194 395192 404347 413655
62886D13655R550R768R835R768R616R315Q763P922O795N392L740J857l19k788
$$ 413655 423205 432973 442808 452576 462192 471507 480270 488192 494987 500379 504119 505976 505657 502869
62872E02869n354p746r898j1917j3781j5289j6364j7102j7486j7345j6703j5920
$$ 502869 497515 489769 479871 467954 454173 438884 422520 405418 387932 370587 353884 337964
62860C37964j5251j4584j3784j2997j2351j1632j0582r401q526q033p614p077
$$ 337964 322713 308129 294345 281348 268997 257365 246783 237382 228856 220823 213209 206132
62848B06132o562o181n818n377m937m578m209l712l137k647k338k185k107j994
$$ 206132 199570 193389 187571 182194 177257 172679 168470 164758 161621 158974 156636 154451 152344 150350
62834A50350j754j389r87o27l20j8K84N40O73O78O04M98L50J62qj61m19q97j460
$$ 150350 148596 147207 146220 145593 145273 145255 145539 146079 146752 147430 148034 148532 148882 149044 149036 148875 148456 147559 146099
62815A46099j827j863j719j609j618j707j783j730j506j245j127j141j113r95
$$ 146099 144272 142409 140690 139081 137463 135756 133973 132243 130737 129492 128365 127224 126111 125116
62801A25116r17r49r94r93j006j046r94q23o40n10l49j15Q6J97K71L05J96ko8
$$ 125116 124199 123250 122256 121263 120257 119211 118217 117394 116754 116244 115895 115780 115866 116063 116334 116639 116835 116833 116765
62782A16765L4P0o3j34K5K22K46K19L16M08K98J07M6L4j06k36q2K57M03K66J41
$$ 116765 116799 116869 116806 116672 116697 116919 117165 117384 117700 118108 118406 118513 118559 118593 118487 118251 118169 118426 118829 119095 119236
62761A19236K15L39L64L46L63L63L03K53K55K64K51K48K64K72K60J99J1k76m51
$$ 119236 119451 119790 120154 120500 120863 121226 121529 121782 122037 122301 122552 122800 123064 123336 123596 123795 123806 123530 123079
62742A23079l74k37l09n35o45n82n33n65n37m13l34l57l53k37j03k6N8J80K67
$$ 123079 122705 122468 122159 121624 120979 120397 119864 119299 118762 118349 118015 117658 117305 117068 116965 116939 116997 117177 117444
62723A17444K84K98L46M07N25P87J110J270J188J029R40R07Q87R33J078J237J334
$$ 117444 117728 118026 118372 118779 119304 120091 121201 122471 123659 124688 125628 126535 127422 128355 129433 130670 132004
62706A32004J395J435J402J274J132J088J205J508J927K262K373K400K610L077
$$ 132004 133399 134834 136236 137510 138642 139730 140935 142443 144370 146632 149005 151405 154015 157092
62692A57092L620M113M609N167N740O328P047P926Q843R726J0659J1749J2993
$$ 157092 160712 164825 169434 174601 180341 186669 193716 201642 210485 220211 230870 242619 255612
62679B55612J4362J5892J7543J9188K0723K2154K3457K4541K5354K5894K6027
$$ 255612 269974 285866 303409 322597 343320 365474 388931 413472 438826 464720 490747
62668D90747K5428K3856K1336J8030J4087R711N207P82l586p947j2119j5793j8790
$$ 490747 516175 540031 561367 579397 593484 603195 608402 609184 605598 597651 585532 569739 550949
62655E50949k1102k2735k3692k4072k4061k3783k3226k2366k1252k0042j8862
$$ 550949 529847 507112 483420 459348 435287 411504 388278 365912 344660 324618 305756
62644C05756j7726j6508j5107j3571j2081j0767r644q696p911p230o542n798n053
$$ 305756 288030 271522 256415 242844 230763 219996 210352 201656 193745 186515 179973 174175 169122
62631A69122m387l810l304k881k524k180j819j493j265j108r17o15k31J52M75
$$ 169122 164735 160925 157621 154740 152216 150036 148217 146724 145459 144351 143434 142819 142588 142740 143215
62616A43215P39R64J146J339J691K301L027L583L872M128M590N208N796O329O962
$$ 143215 143954 144918 146064 147403 149094 151395 154422 158005 161877 166005 170595 175803 181599 187928 194890
62601A94890P795Q794R944J1265J2679J4021J5217J6334J7482J8650J9681K0317
$$ 194890 202685 211479 221423 232688 245367 259388 274605 290939 308421 327071 346752 367069
62589C67069K0335J9730J8666J7187J5116J2331R027N501J848j950n723r153j2089
$$ 367069 387404 407134 425800 442987 458103 470434 479461 484962 486810 484860 479137 469984 457895
62576D57895j4573j6591j8032j8904j9341j9396j9047j8398j7652j6837j5833
$$ 457895 443322 426731 408699 389795 370454 351058 332011 313613 295961 279124 263291
62565B63291j4681j3592j2615j1506j0159q866p986p520p174o723o144n485m803
$$ 263291 248610 235018 222403 210897 200738 191872 183886 176366 169192 162469 156325 150840 146037
62552A46037m192l749l480l277l021k672k284j945j662j376j109r87j083j291
$$ 146037 141845 138096 134616 131339 128318 125646 123362 121417 119755 118379 117270 116283 115200 113909
62538A13909j476j618j679j511j078o85o28p71p21l98j04MQ8K58L28J54r4j82
$$ 113909 112433 110815 109136 107625 106547 105862 105234 104463 103742 103344 103240 103244 103332 103590 103918 104072 103978 103796
62520A03796j25p9j16k19l61m26k66R2M09N97Q49J305J753J873J674J464J512
$$ 103796 103671 103592 103476 103257 102896 102470 102204 102296 102705 103302 104151 105456 107209 109082 110756 112220 113732
62503A13732J883K462L052L489L816M250M880N574O223O949P886Q932R883J0716
$$ 113732 115615 118077 121129 124618 128434 132684 137564 143138 149361 156310 164196 173128 183011 193727
62489A93727J1524J2287J2868J3147J3068J2553J1531J0033Q120N858L392R97
$$ 193727 205251 217538 230406 243553 256621 269174 280705 290738 298858 304716 308108 309105
62477C09105j141l090n010o886q513r734j0538j1008j1239j1298j1173j0818j0267
$$ 309105 307964 304874 299864 292978 284465 274731 264193 253185 241946 230648 219475 208657 198390
62464A98390r643r005q284p470o698o105n624n108m506l871l253k712k338k172
$$ 198390 188747 179742 171458 163988 157290 151185 145561 140453 135947 132076 128823 126111 123773 121601
62450A21601k080j906j638j405j293j259j217j100q95o72n35n45o70q03q17o53
$$ 121601 119521 117615 115977 114572 113279 112020 110803 109703 108808 108136 107601 107056 106386 105583 104766 104113
62434A04113l78j77j44j48ML21O65R82J308J602J782J921K183K559K886L178L647
$$ 104113 103735 103558 103414 103266 103270 103591 104256 105238 106546 108148 109930 111851 114034 116593 119479 122657 126304
62417A26304M342N043N625O256P055P853Q490R107R889J0675J1142J1247J1196
$$ 126304 130646 135689 141314 147570 154625 162478 170968 180075 189964 200639 211781 223028 234224
62404B34224J1032J0517R453P930O217M499K793R92r57k926m695o175p437q480
$$ 234224 245256 255773 265226 273156 279373 283872 286665 287657 286700 283774 279079 272904 265467 256987
62390B56987r121r237q961q535q056p526p033o700o495o257n889n483n229n199
$$ 256987 247866 238629 229668 221133 213077 205551 198518 191818 185323 179066 173177 167694 162465 157266
62376A57266n241n084m668m249m040l873l418k744k285k203k162j871j504j346
$$ 157266 152025 146941 142273 138024 133984 130111 126693 123949 121664 119461 117299 115428 113924 112578
62362A12578j326j171q69n96m12k50j25p2K4K86O29Q65R72J079J243J471J808
$$ 112578 111252 110081 109212 108616 108204 107954 107829 107757 107781 108067 108696 109561 110533 111612 112855 114326 116134
62345A16134K240K572K651K613K685K850K901K735K436K038J514Q91K45m29j147
$$ 116134 118374 120946 123597 126210 128895 131745 134646 137381 139817 141855 143369 144260 144505 144076 142929
62330A42929j814k343k778l157l345l212k881k601k424k235k033j902j830j718
$$ 142929 141115 138772 135994 132837 129492 126280 123399 120798 118374 116139 114106 112204 110374 108656
62316A08656j575j464j306r87o13m11l85l31j59%O0R0J18Q2J4N2K37M15N06N86
$$ 108656 107081 105617 104311 103324 102711 102300 101915 101584 101425 101425 101485 101575 101693 101775 101789 101841 102078 102493 102999 103585
62296A03585P20Q14P83P10P53R67J233J394J416J432J633J978K178K007J620J368
$$ 103585 104305 105119 105902 106612 107365 108332 109565 110959 112375 113807 115440 117418 119596 121603 123223 124591
62280A24591J380J463J415J249J089R86R28R10R89J214J553J886K136K413K903
$$ 124591 125971 127434 128849 130098 131187 132173 133101 134011 135000 136214 137767 139653 141789 144202 147105
62265A47105L585M224M689N141N778O591P456Q343R242J0060J0715J1194J1337
$$ 147105 150690 154914 159603 164744 170522 177113 184569 192912 202154 212214 222929 234123 245460
62252B45460J0847R677Q233O920N734M517L406K626K020J235K83n21j126j825
$$ 245460 256307 265984 274217 281137 286871 291388 294794 297420 299440 300675 300958 300437 299311 297486
62238B97486k729l542m059m445m872n196n214n001m816m769m804m884n042n334
$$ 297486 294757 291215 287156 282711 277839 272643 267429 262428 257612 252843 248039 243155 238113 232779
62224B32779n775o279o662o798o780o783o839o846o773o650o421n971n318m604
$$ 232779 227004 220725 214063 207265 200485 193702 186863 180017 173244 166594 160173 154202 148884 144280
62210A44280l920l300k829k537k228j692j046o22n27n33m43k63m0K47N25O44O01
$$ 144280 140360 137060 134231 131694 129466 127774 126728 126106 125579 125046 124603 124340 124300 124547 125072 125716 126317
62193A26317N53N31L96J17j26k16k29k35j95j29j35j86j30L4J24R2J45L81O15
$$ 126317 126870 127401 127797 127914 127788 127572 127343 127108 126913 126784 126649 126463 126333 126367 126491 126583 126728 127109 127724
62174A27724O81P03Q80J187J514J881K340K798L177L627M338N222N991O533P068
$$ 127724 128405 129108 129988 131175 132689 134570 136910 139708 142885 146512 150850 156072 162063 168596 175664
62159A75664P870Q956J0064J0932J1515J1944J2239J2179J1512J0261Q674O974
$$ 175664 183534 192490 202554 213486 225001 236945 249184 261363 272875 283136 291810 298784
62147B98784N280L705K347J099k56j793l380m923o462q005r390j0388j0884j0906
$$ 298784 304064 307769 310116 311215 310959 309166 305786 300863 294401 286396 277006 266618 255734 244828
62133B44828j0600j0146r625q972q187p431o834o249n505m715m118l675l143k520
$$ 244828 234228 224082 214457 205485 197298 189867 183033 176784 171279 166564 162446 158771 155628 153108
62119A53108k046j769j483j139r56r99j015q41o24n24m33k37kK25N74J053J406
$$ 153108 151062 149293 147810 146671 145715 144716 143701 142860 142236 141712 141279 141042 141040 141265 141839 142892 144298
62102A44298J434J286J227J275J334J423J608J816J948K027K073K019J861J746
$$ 144298 145732 147018 148245 149520 150854 152277 153885 155701 157649 159676 161749 163768 165629 167375
62088A67375J753J785J781J838J975J967J679J299J067R17O97M79M36N21N98P22
$$ 167375 169128 170913 172694 174532 176507 178474 180153 181452 182519 183436 184133 184612 185048 185569 186167 186889
62072A86889J069J633K297L073M042N093N970O590P074P472P619P325O540N396
$$ 186889 187958 189591 191888 194961 199003 204096 210066 216656 223730 231202 238821 246146 252686 258082
62058B58082M108K903J885J012K71l06p91j406k288l290m169m812n236n479n622
$$ 258082 262190 265093 266978 267990 268261 267955 267164 265758 263470 260180 256011 251199 245963 240484 234862
62043B34862n735n701n249m342l384k768k419k000j481j164j205j409j550j635
$$ 234862 229127 223426 218177 213835 210451 207683 205264 203264 201783 200619 199414 198005 196455 194820
62029A94820j751j868j871j711j421j056o58k34K39P74J341J899K442K979L501
$$ 194820 193069 191201 189330 187619 186198 185142 184484 184250 184489 185263 186604 188503 190945 193924 197425
62014A97425L922M037L614K619J341J75p12j347j686j628j295j050j151j591k257
$$ 197425 201347 205384 208998 211617 212958 213133 212421 211074 209388 207760 206465 205415 204264 202673 200416
61999B00416l025l653l858l669l374l055k447j475n13P2L87P02R90J082J075J175
$$ 200416 197391 193738 189880 186211 182837 179782 177335 175860 175347 175419 175806 176508 177498 178580 179655 180830
61983A80830J297J213J006J038J407J847K119K284K519K909L435M005M477M795
$$ 180830 182127 183340 184346 185384 186791 188638 190757 193041 195560 198469 201904 205909 210386 215181
61969B15181N054N322N492N473N409N480N589N446M913M053K931J620L52o17j276
$$ 215181 220235 225557 231049 236522 241931 247411 253000 258446 263359 267412 270343 271963 272315 271698 270422
61954B70422j790k236k569k880l346l967m524m899n190n514n861o181o429o503
$$ 270422 268632 266396 263827 260947 257601 253634 249110 244211 239021 233507 227646 221465 215036 208533
61940B08533o311n921n566n387n338n293n174m964m700m437m169l815l372l002
$$ 208533 202222 196301 190735 185348 180010 174717 169543 164579 159879 155442 151273 147458 144086 141084
61926A41084k822k717k484k122j830j757j863k015k087j997j779j576j465j392
$$ 141084 138262 135545 133061 130939 129109 127352 125489 123474 121387 119390 117611 116035 114570 113178
61912A13178j277j169j111j031q34n51k41Q4L62M45L37K70M01O01P10P86Q84Q27
$$ 113178 111901 110732 109621 108590 107756 107205 106964 107048 107410 107855 108192 108462 108863 109464 110174 110960 111844 112671
61894A12671M63nk78l75n33p82r82j152j408j636j616j438j412j563j555j189
$$ 112671 113134 113129 112851 112476 111943 111161 110179 109027 107619 105983 104367 102929 101517 99954 98399 97210
61878I7210o55k42n2o3j95k54r0J35J10k05n02n49m07j90N7K36K04jj53j66j66
$$ 97210 96555 96313 96261 96198 96003 95749 95659 95794 95904 95699 95197 94648 94241 94051 94108 94344 94548 94547 94394 94228 94062
61857I4062k20k10r4oQJ02L79P21R67J109J184J205J275J568K076K544K779K854
$$ 94062 93842 93632 93538 93532 93540 93642 94021 94742 95709 96818 98002 99207 100482 102050 104126 106670 109449 112303
61839A12303K968L219L579L935M128M064L862L706L605L433L192K979K734K295
$$ 112303 115271 118490 122069 126004 130132 134196 138058 141764 145369 148802 151994 154973 157707 160002
61825A60002J714J217Q05K51m57r73j085j020j074j195j158q81m27J66Q31J421
$$ 160002 161716 162933 163738 163989 163532 162559 161474 160454 159380 158185 157027 156146 155719 155885 156716 158137
61809A58137J921K478L104L503L448L078K673K222J544O47k32r39j495j949k290
$$ 158137 160058 162536 165640 169143 172591 175669 178342 180564 182108 182755 182523 181584 180089 178140 175850
61794A75850k535k729k878k976l040l052k953k752k574k491k431k335k307k453
$$ 175850 173315 170586 167708 164732 161692 158640 155687 152935 150361 147870 145439 143104 140797 138344
61780A38344k685k799k702k439k092j749j492j313j111q41n59l08k1L33O64Q90
$$ 138344 135659 132860 130158 127719 125627 123878 122386 121073 119962 119121 118562 118254 118233 118566 119230 120120
61764A20120J057J245J446J669J988K434K901L315L742M222M649M953N281N794
$$ 120120 121177 122422 123868 125537 127525 129959 132860 136175 139917 144139 148788 153741 159022 164816
61750A64816O369O754O898O965P016O887O441N759N024M295L489K492J283Nj099
$$ 164816 171185 177939 184837 191802 198818 205705 212146 217905 222929 227224 230713 233205 234488 234493 233394
61735B33394j838k198k285k182j902j423p71lQ08J585K235K639K702K441J985
$$ 233394 231556 229358 227073 224891 222989 221566 220795 220792 221600 223185 225420 228059 230761 233202 235187
61720B35187J407O37m06j629k818l862m773n522n978o092n970n772n581n431n285
$$ 235187 236594 237231 236825 235196 232378 228516 223743 218221 212243 206151 200181 194409 188828 183397 178112
61705A78112n048m656m192l788l405k901k324j917j784j735j558j270r96p69n68
$$ 178112 173064 168408 164216 160428 157023 154122 151798 149881 148097 146362 144804 143534 142538 141769 141201
61690A41201m49m57n15m85l37j47oLj41l52n13n90o50o89o40n11l80k31K2L27
$$ 141201 140752 140295 139780 139295 138958 138811 138805 138808 138667 138315 137802 137212 136562 135873 135233 134722 134342 134111 134133 134460
61670A34460M98N09N56P46R00Q43O77N97O05N97O06P34R21R57P38L63K3j58k48
$$ 134460 134958 135467 136023 136769 137669 138512 139189 139786 140391 140988 141594 142328 143249 144206 144944 145307 145330 145172 144924
61651A44924m68r62j535j810j682j463j436j492j372j094q80p92p08n93n23m96
$$ 144924 144456 143494 141959 140149 138467 137004 135568 134076 132704 131610 130730 129938 129230 128637 128114 127618
61635A27618l84j93o4o3p4J1J17J48J57L20O76J005J023O79K71J21K54M26M67
$$ 127618 127234 127041 126977 126914 126840 126851 126968 127116 127273 127593 128269 129274 130297 130976 131247 131368 131622 132048 132515
61616A32515M36M11L27J33n9j36j88l66o19p79q00q15r34j119j266j303j228j101
$$ 132515 132951 133362 133689 133822 133763 133627 133439 133073 132454 131675 130875 130060 129126 128007 126741 125438 124210 123109
61598A23109j040j128j294j386j302j101r49r86j167j261j106q24o84p63r11j013
$$ 123109 122069 120941 119647 118261 116959 115858 114909 113923 112756 111495 110389 109565 108881 108118 107207 106194
61582A06194j108j182j091p90m76l47l68m11m32m29l28j39l5q4q5J37L87L34j2
$$ 106194 105086 103904 102813 102023 101547 101200 100832 100421 99989 99560 99232 99093 99058 98974 98889 99026 99413 99747 99735
61563I9735l02l39k69k69l04k97l00l65m01l01r1J18K79M13N12N38N01N07O58
$$ 99735 99433 99094 98825 98556 98252 97955 97655 97290 96889 96588 96497 96615 96894 97307 97819 98357 98858 99365 100023
61544A00023R16J083R61O05K87K16L14L06K6m56r65j334j488j426j233j031r09
$$ 100023 100939 102022 102983 103588 103875 104091 104405 104711 104737 104281 103316 101982 100494 99068 97835 96804 95895
61527I5895q93r31r14p74n46l41k00q1L6J01R7R3J39J75J29Jj66l73o31q93j081
$$ 95895 95002 94071 93157 92383 91837 91496 91296 91215 91251 91352 91449 91542 91681 91856 91985 91986 91820 91447 90816 89923 88842
61506H8842j137j075r85r57r78r23p27n38n76q32j065j061q19m69j44K1m0k26
$$ 88842 87705 86630 85645 84688 83710 82787 82060 81522 80946 80114 79049 77988 77169 76700 76556 76577 76537 76311
61488G6311l48l40k89k33j30j2mj20j95j33k8J0nn3j57k65k32m2J06O7o8j59k27
$$ 76311 75963 75623 75334 75101 74971 74959 74955 74835 74640 74507 74479 74489 74484 74431 74274 74009 73777 73735 73841 73908 73840 73681 73454
61465G3454l12l31k24p4L4J55L15L61J85m2m5J88M17M52L21J59R0J28J57O0q6
$$ 73454 73142 72811 72587 72513 72547 72702 73017 73378 73563 73521 73476 73664 74081 74533 74854 75013 75103 75231 75388 75448 75362
61444G5362o1J91M53N36M91M50M00L12K86M21O35P81Q25P90O74N12L84K67M0k46
$$ 75362 75301 75492 75945 76481 76972 77422 77822 78134 78420 78841 79476 80257 81082 81872 82546 83058 83442 83709 83749 83503
61424H3503l60k55k04l99o63p82q26q87p89l90L8J37J2K8K32L35K42J46J33M5
$$ 83503 83143 82888 82684 82285 81622 80840 80014 79127 78338 77948 77986 78123 78135 78163 78395 78730 78972 79118 79251 79296
61404G9296j63l10k87k14j97j74r4rN4J72L48M65M62M03L77L99M40M37L07Q1q5
$$ 79296 79133 78823 78536 78322 78125 77951 77857 77848 77902 78074 78422 78887 79349 79752 80129 80528 80968 81405 81712 81793 81708
61383H1708r9j16k93n08n24l58k50k98l48k45lK67M29L64J12p8n6K2n7j78r7J19
$$ 81708 81609 81493 81200 80692 80168 79810 79560 79262 78914 78669 78666 78933 79362 79726 79838 79760 79704 79726 79669 79491 79394 79513
61361G9513J42q9k63j38J47L49L85L12J88J01J12J46R8L7J37L85N53N42N10N99
$$ 79513 79655 79566 79303 79165 79312 79661 80046 80358 80546 80647 80759 80905 81003 81040 81177 81562 82115 82657 83167 83766
61341H3766P45Q32Q59Q84R14R34R41R22Q89R16J023J084R63P43O32O42N93L83
$$ 83766 84511 85343 86202 87086 88000 88934 89875 90797 91686 92602 93625 94709 95672 96415 97047 97689 98282 98665
61323I8665J34j7n4m7n4j00j21j5J64J86n0l16l67k69k12j18J62M55M33J49kJ32
$$ 98665 98799 98782 98728 98681 98627 98527 98406 98391 98555 98741 98691 98375 98008 97739 97527 97409 97571 98026 98459 98608 98606 98738
61301I8738K84K74K34K60J95n8k90k74p5J06J91K04J75J61J79J04j94n59o78n43
$$ 98738 99022 99296 99530 99790 99985 99927 99637 99363 99288 99394 99585 99789 99964 100125 100304 100408 100214 99655 98977 98434
61281I8434m75o14o99n30k96k52l31l16k04j35j05k1J02J97L06N16P84R69R91
$$ 98434 97959 97345 96646 96116 95820 95568 95237 94921 94717 94582 94477 94456 94558 94755 95061 95577 96361 97330 98321
61262I8321Q84P55P48R30J155J233J199J300J600J864J900J839J859J870J677
$$ 98321 99205 99960 100708 101638 102793 104026 105225 106525 108125 109989 111889 113728 115587 117457 119134
61247A19134J305R73P88O76N57M56M11L93L31J68o9k74l86m35m76m78m44m76o07
$$ 119134 120439 121412 122200 122876 123433 123889 124300 124693 125024 125192 125123 124849 124463 124028 123552 123074 122630 122154 121547
61228A21547o36l92l6J14N6N9K04K71J38k7r5j13o2K30P43J143J243J302J638
$$ 121547 120911 120519 120483 120597 120653 120712 120916 121187 121325 121298 121203 121090 121028 121258 122001 123144 124387 125689 127327
61209A27327K185K677L033L287L357L129K727K398K215K084J959J849J698J432
$$ 127327 129512 132189 135222 138509 141866 144995 147722 150120 152335 154419 156378 158227 159925 161357
61195A61357J108Q32N92L00p1m68q50j172j372j460j562j768k029k245k354k300
$$ 161357 162465 163297 163889 164189 164118 163650 162800 161628 160256 158796 157234 155466 153437 151192 148838 146538
61179A46538k039j649j309j114j012r33q58p02l78mJ78J48J85M80R19J357J837
$$ 146538 144499 142850 141541 140427 139415 138482 137624 136922 136544 136540 136718 136866 137051 137531 138450 139807 141644
61162A41644K357K673K582K199J741J204N05k09o89r23j094j275j387j424j488
$$ 141644 144001 146674 149256 151455 153196 154400 154905 154696 154007 153084 151990 150715 149328 147904 146416
61147A46416j621j752j787j651j296p90l51j18nJ46L18L91L45L00L47N11P69J024
$$ 146416 144795 143043 141256 139605 138309 137519 137168 137050 137045 137191 137509 137900 138245 138545 138892 139403 140172 141196
61129A41196J125J034Q97Q73R62J096J289J517J658J635J595J744K073K395K593
$$ 141196 142321 143355 144252 145125 146087 147183 148472 149989 151647 153282 154877 156621 158694 161089 163682
61114A63682K665K617K414K101J801J622J598J705J874K059K307K695L157L491
$$ 163682 166347 168964 171378 173479 175280 176902 178500 180205 182079 184138 186445 189140 192297 195788
61100A95788L626L711L897M138M291M271M041L550K870K212J701J248O98O6n36
$$ 195788 199414 203125 207022 211160 215451 219722 223763 227313 230183 232395 234096 235344 236042 236108 235572
61085B35572j047j459j769k028k362k800l244l618l989m410m782m981n004m898
$$ 235572 234525 233066 231297 229269 226907 224107 220863 217245 213256 208846 204064 199083 194079 189181
61071A89181m682m417m229m157m094l918l619l223k758k327k035j809j451r35
$$ 189181 184499 180082 175853 171696 167602 163684 160065 156842 154084 151757 149722 147913 146462 145527
61057A45527m51q6L06P97J205J366J388J395J286R12L39k49p58j116j162q81n36
$$ 145527 145076 144990 145296 146093 147298 148664 150052 151447 152733 153645 153984 153735 152977 151861 150699 149818 149282
61040A49282l51j99J77P63J329J779K196K612K978L334L754M176M423M457M424
$$ 149282 148931 148732 148909 149672 151001 152780 154976 157588 160566 163900 167654 171830 176253 180710 185134
61025A85134M513M827N349N894O204O173N967N823N810N874N962O026O020O000
$$ 185134 189647 194474 199823 205717 211921 218094 224061 229884 235694 241568 247530 253556 259576 265576
61011B65576O064O136N985N567N172N050N087M981M603M006L286K618K277K382
$$ 265576 271640 277776 283761 289328 294500 299550 304637 309618 314221 318227 321513 324131 326408 328790
60997C28790K724L053L385L833M306M608M748M908N180N498N815O098O244O130
$$ 328790 331514 334567 337952 341785 346091 350699 355447 360355 365535 371033 376848 382946 389190 395320
60983C95320N728N050M129L081K078J123K0j297k593l633m490n349o177o813p252
$$ 395320 401048 406098 410227 413308 415386 416509 416529 415232 412639 409006 404516 399167 392990 386177 378925
60968C78925p611p912q107q243q350q316p993p431o834o314n849n364m779m062
$$ 378925 371314 363402 355295 347052 338702 330386 322393 314962 308128 301814 295965 290601 285822 281760
60954B81760l292k639k161j770j428j150q52l88J57N11O15P40J053J394J561J605
$$ 281760 278468 275829 273668 271898 270470 269320 268468 268080 268237 268748 269363 270103 271156 272550 274111 275716
60938B75716J621J580J499J523J689J847J977K308K935L654M326N091O063P085
$$ 275716 277337 278917 280416 281939 283628 285475 287452 289760 292695 296349 300675 305766 311829 318914
60924C18914P954Q596Q932Q968R109R900J1390J3169J5157J7687K0720K3689K6386
$$ 318914 326868 335464 344396 353364 362473 372373 383763 396932 412089 429776 450496 474185 500571
60911E00571K9266L2615L6298M0735M7097N6002O6961P9778R5337J14338J36706
$$ 500571 529837 562452 598750 639485 686582 742584 809545 889323 984660 1098998 1235704
60900A235704J63425J97640K42658L00739L74985M67327N66594O38271O36484
$$ 1235704 1399129 1596769 1839427 2140166 2515151 2982478 3549072 4187343 4823827
60891D823827N37605L64898J76657K8416n3476o7769k2698O4493J56066J97468
$$ 4823827 5361432 5726330 5902987 5931403 5877927 5810158 5787460 5851953 6008019 6205487
60881F205487J46968O535j78093l48941m68684n29430n41061n18239m75293m24453
$$ 6205487 6352455 6358990 6180897 5831956 5363272 4833842 4292781 3774542 3299249 2874796
60871B874796l73464l25180k80375k39985k04490j73108j45038j20638j00490
$$ 2874796 2501332 2176152 1895777 1655792 1451302 1278194 1133156 1012518 912028
60862I12028q4200p0914o0236n1851m4958l8946l4020l0413k7518k4520k1446
$$ 912028 827828 756914 696678 644827 599869 560923 526903 496490 468972 444452 423006
60851D23006j8815j6655j4671j3008j2115j1952j2002j1936j1755j1411j0800
$$ 423006 404191 387536 372865 359857 347742 335790 323788 311852 300097 288686 277886
60840B77886j0083r519r101q624q035p404o727o018n434n036m639m136l708l494
$$ 277886 267803 258284 249183 240559 232524 225120 218393 212375 206941 201905 197266 193130 189422 185928
60826A85928l293k897k401j947j493j073r60j226j480j373j082r30r18r40j113
$$ 185928 182635 179738 177337 175390 173897 172824 171864 170638 169158 167785 166703 165773 164855 163915 162802
60811A62802j467j682j546j397j631k041k165k037k054k292k490k568k694k869
$$ 162802 161335 159653 158107 156710 155079 153038 150873 148836 146782 144490 142000 139432 136738 133869
60797A33869k882k700k519k429k355k267k145j903j527j234j171j129q66n11l45
$$ 133869 130987 128287 125768 123339 120984 118717 116572 114669 113142 111908 110737 109608 108742 108231 107886
60782A07886l25j86J08L88O10Q28R51Q87Q15R45J100R37N43L63N79Q70R24P98
$$ 107886 107561 107375 107483 107871 108481 109309 110260 111147 111962 112907 114007 114944 115487 115850 116429 117299 118223 119021
60764A19021P26Q11J003J186J268J250J249J295J236R43N24J55j41l94m95l39
$$ 119021 119747 120558 121561 122747 124015 125265 126514 127809 129045 129988 130512 130667 130526 130132 129637 129298
60748A29298m5J93L50M83N01K73j41o02j078j591k047k357k568k746k805k692
$$ 129298 129253 129446 129796 130279 130780 131053 130912 130310 129232 127641 125594 123237 120669 117923 115118 112426
60732A12426k532k451k381k239k095j966j714j312j042j096j240j158r18p68p06
$$ 112426 109894 107443 105062 102823 100728 98762 97048 95736 94694 93598 92358 91200 90282 89514 88808
60717H8808n75m27m52n98o66o60p00p07n29k80k09k91k55KL24N94Q06R26R14Q68
$$ 88808 88233 87806 87354 86756 86090 85430 84730 84023 83494 83214 83005 82714 82459 82461 82785 83379 84185 85111 86025 86893
60697H6893R13R83R70R47J004J008Q09N67N32O10N17K47N3Jj38m75q50j103j238
$$ 86893 87806 88789 89759 90706 91710 92718 93527 94094 94626 95236 95753 96000 96053 96054 95916 95441 94591 93488 92250
60678I2250j276j237j226j332j415j262r14o66o89r01j113j164r37m97j46j30
$$ 92250 90974 89737 88511 87179 85764 84502 83588 82922 82233 81332 80219 79055 78118 77621 77475 77345
60662G7345k96l21j36M4R1Q5J07J62K44L12K59P8%K04N55P89Q72R35R74Q79O60
$$ 77345 77049 76728 76592 76636 76727 76812 76919 77081 77325 77637 77896 77974 77974 78178 78733 79522 80394 81329 82303 83182 83842
60641H3842L96Q1k78n28n76n76o50o31l94j66j81k21O5N20O85N23M37O03P72P65
$$ 83842 84238 84319 84041 83513 82937 82361 81711 81080 80686 80520 80339 80118 80183 80703 81388 81911 82348 82951 83723 84488
60621H4488P09P03O81O62P84R64R20O04K86J27ok00l50m16n31p18q21q01q70j120
$$ 84488 85197 85900 86581 87243 88027 88991 89911 90515 90801 90928 90922 90722 90372 89956 89425 88707 87886 87085 86215 85095
60601H5095j324j232r20o65o20p35q62r01q56p89o90m86k32j28j92j57J03L07
$$ 85095 83771 82539 81619 80954 80334 79599 78737 77836 76980 76191 75501 75015 74783 74655 74463 74306 74409 74716
60583G4716K03PM8K33K64K45N18J032J352J319J206J188J133R43P00M21K7l51
$$ 74716 74919 74926 74974 75207 75471 75716 76234 77266 78618 79937 81143 82331 83464 84407 85107 85528 85555 85204
60565H5204m84m41m89n98m98k43k02m24n25l27j29j25j05J14L28L71M16O13P82
$$ 85204 84720 84279 83790 83192 82694 82451 82249 81825 81300 80973 80844 80719 80614 80728 81056 81427 81843 82456 83238
60546H3238P45O11M99K71j74o02p75p68p64p47o45n36m90m33l68m43o43o88m56
$$ 83238 83983 84594 85093 85364 85190 84588 83813 83045 82281 81534 80889 80353 79863 79430 79062 78619 77976 77288 76832
60527G6832k09j58j17J46M72N58M47L89M21L52J61M3J04K29K44Q5j85m01m22k88
$$ 76832 76623 76465 76348 76494 76966 77524 77971 78360 78781 79133 79294 79337 79441 79670 79914 79999 79814 79413 78991 78703
60507G8703j71j64k10k60l02k73r4Q9N2j57k41q9J07K32M12O31O17L28J85N10
$$ 78703 78532 78368 78158 77898 77596 77323 77229 77318 77370 77213 76972 76883 76990 77222 77634 78265 78882 79210 79395 79905
60487G9905J005J193J058R28Q77P23M36K07Q7o6k57l19k06o3L4K17N44Q24Q48
$$ 79905 80910 82103 83161 84089 84966 85689 86125 86332 86419 86353 86096 85777 85571 85508 85542 85759 86303 87127 87975
60468H7975O98O69R06J233J404J445J588J900K172K227K164K131K004J579R60
$$ 87975 88673 89342 90248 91481 92885 94330 95918 97818 99990 102217 104381 106512 108516 110095 111055
60453A11055M78K31Rk83m86m74l53k41j00J04K93M16N24O42P68J005J480K082
$$ 111055 111533 111764 111773 111490 111004 110530 110177 109936 109836 109940 110233 110649 111173 111815 112583 113588 115068 117150
60435A17150K597L081L813M821N770O409O771O815O270N088L643K295R67m67j730
$$ 117150 119747 122828 126641 131462 137232 143641 150412 157227 163497 168585 172228 174523 175490 175023 173293
60420A73293k410k518k445k471k567k634k630k539k366k170j971j705j348r72
$$ 173293 170883 168365 165920 163449 160882 158248 155618 153079 150713 148543 146572 144867 143519 142547
60406A42547n93j32M10R13J330J764K266K768L320M140N295O555P700Q774R868
$$ 142547 141954 141822 142232 143145 144475 146239 148505 151273 154593 158733 164028 170583 178283 187057 196925
60391A96925J0845J1536J1958J2207J2214J1880J1248J0371R102P223M702J713
$$ 196925 207770 219306 231264 243471 255685 267565 278813 289184 298286 305509 310211 311924
60379C11924j490m623p430r839j1897j3524j4452j4545j4015j3204j2331j1477
$$ 311924 310434 305811 298381 288542 276645 263121 248669 234124 220109 206905 194574 183097
60367A83097j0641r722q621p505o644o023n354m564l934l584l238k692k181j973
$$ 183097 172456 162734 154113 146608 139964 133941 128587 124023 120089 116505 113267 110575 108394 106421
60353A06421j915j702j377j179j099r22o30m29m32n66p20q31q44p52o23m86l18
$$ 106421 104506 102804 101427 100248 99149 98227 97597 97168 96736 96170 95450 94619 93775 93023 92400 91914 91596
60336I1596k05k99n38o08l72q9m2j81k86k96k42r0J53L56M52N33N94M46Q2j84
$$ 91596 91391 91092 90554 89946 89574 89485 89443 89262 88976 88680 88438 88348 88501 88857 89309 89842 90436 90882 90964 90780
60316I0780j17J22L03M56O31O43L74P1oRr9k01n2K29L48L40M75P80R95R95Q97
$$ 90780 90663 90785 91088 91544 92175 92818 93192 93263 93257 93266 93167 92966 92914 93143 93491 93831 94306 95086 96081 97076 97973
60295I7973Q09P52P43P52O60M68L94N36O35M70K79M00P21Q75Q18P71P95P60P14
$$ 97973 98782 99534 100277 101029 101689 102157 102551 103087 103722 104192 104471 104871 105592 106467 107285 108056 108851 109611 110325
60276A10325P94Q86P80N75N30N66M12J66K33O38R12P80N31M93N74N30L75K83L02
$$ 110325 111119 112005 112785 113360 113890 114456 114868 115034 115267 115905 116817 117597 118128 118621 119195 119725 120100 120383 120685
60257A20685M26P00J129J566J893K167K502K876L144L160K854K266J548Q27J34
$$ 120685 121111 121811 122940 124506 126399 128566 131068 133944 137088 140248 143102 145368 146916 147743 147877
60242A47877n28j091j527j935k361k640k606k367k150j986j790j627j630j682
$$ 147877 147349 146258 144731 142796 140435 137795 135189 132822 130672 128686 126896 125269 123639 121957
60228A21957j513j107p59o65p32p94q01p43n96m06k53j04J72N67R70J358J805
$$ 121957 120444 119337 118578 117913 117181 116387 115586 114843 114247 113841 113588 113484 113656 114223 115193 116551 118356
60211A18356K270K568K588K413K162J839J375P25p7q50j328j394j195r58p23m40
$$ 118356 120626 123194 125782 128195 130357 132196 133571 134296 134219 133369 132041 130647 129452 128494 127771 127331
60195A27331j78p7j56l48o52j077j493j740j812j842j875j862j780j617j351j031
$$ 127331 127153 127076 126920 126572 125920 124843 123350 121610 119798 117956 116081 114219 112439 110822 109471 108440
60179A08440p85o51n35m12m43o79q64p63n05l76m17m82n04m71k71J01L75L15Q1
$$ 108440 107655 107004 106469 106057 105614 104935 104071 103308 102803 102427 102010 101528 101024 100553 100282 100383 100758 101073 101154
60160A01154lO4O1JQ5L10M31L63K42J66R3L0K2oj50k98k89k07k41l50l14j18O4
$$ 101154 101151 101215 101276 101277 101362 101672 102103 102466 102708 102874 102967 102997 103019 103013 102863 102565 102276 102069 101828 101478 101164 101046 101110
60137A01110J81L25M55M43L61M31O70R01J033J123J155J104J118J358J660J757
$$ 101110 101291 101616 102071 102514 102875 103306 103976 104877 105910 107033 108188 109292 110410 111768 113428 115185
60121A15185J674J664J741J705J582J610J769J768J518J306J339J469J466J281
$$ 115185 116859 118523 120264 121969 123551 125161 126930 128698 130216 131522 132861 134330 135796 137077
60107A37077R77O39M34M61N62M93K80J27K2k17n61p97r00j040j198j204j128j213
$$ 137077 138054 138693 139127 139588 140150 140643 140923 141050 141072 140855 140294 139497 138597 137557 136359 135155 134027 132814
60089A32814j395j317r11n56m92m97l37j14j4OP0J72K65L79M96N46N50N68N19
$$ 132814 131419 130102 129191 128635 128143 127646 127309 127195 127181 127187 127257 127429 127694 128073 128569 129115 129665 130233 130752
60070A30752L06J22K49N60O36L65P6l8j39l41m97n60p00q80p56k49K28L27K07
$$ 130752 131058 131180 131429 131989 132625 132990 133066 133028 132889 132548 132051 131491 130791 129911 129155 128906 129134 129461 129668
60051A29668J70K11K32L42O51R95J169J195J177J069Q44O26M98L94L38N40J026
$$ 129668 129838 130049 130281 130623 131274 132269 133438 134633 135810 136879 137723 138349 138847 139241 139579 140119 141145
60034A41145J463J560J406J204R68O89N06M74L68K4m01p10r59j230j376j273j107
$$ 141145 142608 144168 145574 146778 147746 148435 148941 149415 149783 149807 149406 148696 147737 146507 145131 143858 142751
60017A42751j119j230j214j051q83p21n14l29k54k34j90j99l33m76m94m60m79
$$ 142751 141632 140402 139188 138137 137254 136533 136019 135690 135436 135202 135012 134813 134480 134004 133510 133050 132571
60000A32571m40j75K74P27J084J310J333J161R87R97J106J118R84P81N43K98J70
$$ 132571 132131 131956 132230 132957 134041 135351 136684 137845 138832 139829 140935 142053 143037 143818 144361 144659 144829
59983A44829K56M42N17L78Q1l03p09j101j489j887k231k436k528k608k631k443
$$ 144829 145085 145527 146044 146422 146503 146200 145491 144390 142901 141014 138783 136347 133819 131211 128580 126137
59967A26137k051j674j457j347j246j120r12n61k04m7l7Q8L64N27M56L72M48N49
$$ 126137 124086 122412 120955 119608 118362 117242 116330 115769 115565 115518 115481 115569 115933 116460 116916 117288 117736 118285
59949A18285N36N17N89O20N00L19J59p6m16o68p25p59r26j085j059r30q61q09
$$ 118285 118821 119338 119927 120547 121047 121366 121525 121449 121033 120365 119640 118881 117955 116870 115811 114881 114020 113211
59931A13211o79n37m62l90k86k62l79n00n76q02j274j728j853j674j419j196j016
$$ 113211 112532 111995 111533 111143 110857 110595 110216 109716 109140 108338 107064 105336 103483 101809 100390 99194 98178
59914I8178r20q58o73l61j71k21k65r1J19P8j24j91o7P5J32J65K24L42N58P98
$$ 98178 97258 96400 95727 95366 95195 94974 94709 94618 94737 94815 94691 94500 94433 94508 94640 94805 95029 95371 95929 96727
59894I6727Q48O65M80M70N20M54L26K31O9k11m14l77k41k13k37j85j27j54j32
$$ 96727 97575 98240 98720 99190 99710 100164 100490 100721 100790 100579 100165 99788 99547 99334 99097 98912 98785 98631 98499
59875I8499M3J73L0k43l42k39j13RK27M70O09P20R84J368J665J777J729J484J034
$$ 98499 98542 98715 98745 98502 98160 97921 97808 97817 98044 98514 99123 99843 100827 102195 103860 105637 107366 108850 109884
59856A09884N20J05k38n51p23p06p04r19j190j241j104j021j062j088j019q53
$$ 109884 110404 110509 110271 109720 108997 108291 107587 106668 105478 104237 103133 102112 101050 99962 98943 98090
59840I8090n21k3M05N21M16L81N20P54J044J377J611J640J632J834K177K348K160
$$ 98090 97569 97546 97951 98472 98888 99269 99789 100543 101587 102964 104575 106215 107847 109681 111858 114206 116366
59823A16366J660R78K56l47p72j117j377j339r05l54MK40N94J036J321J388J335
$$ 116366 118026 119004 119260 118913 118141 117024 115647 114308 113403 113049 113053 113293 113887 114923 116244 117632 118967
59806A18967J181Q94N94M32L30J35j00k24l11n42q64j029r39p23n25l73k54r2
$$ 118967 120148 121042 121636 122068 122398 122533 122433 122209 121898 121356 120492 119463 118524 117801 117276 116903 116649 116557
59788A16557K10N70P43P06P62J109J523J739J840J976K021J824J585J515J413
$$ 116557 116767 117337 118080 118786 119548 120657 122180 123919 125759 127735 129756 131580 133165 134680 136093
59773A36093J005N00L33M76N25L68K56K76K11k8k82m43n81o94p04o68o86o90n60
$$ 136093 137098 137598 137931 138407 138932 139300 139556 139832 140043 140015 139733 139290 138709 138015 137311 136643 135957 135267 134707
59754A34707m20m28m24j39L56P70J115J642K312K798K995L096L112K804K134J416
$$ 134707 134287 133859 133435 133296 133652 134422 135537 137179 139491 142289 145284 148380 151492 154296 156430 157846
59738A57846Q99N57L92N74J124J767K142K027J352L03o37j107j318j760k490l052
$$ 157846 158745 159302 159694 160268 161392 163159 165301 167328 168680 168983 168346 167239 165921 164161 161671 158619
59722A58619l162l055l030l064k981k732k389k026j768j672j623j491j341j267
$$ 158619 155457 152402 149372 146308 143327 140595 138206 136180 134412 132740 131117 129626 128285 127018
59708A27018j116o75j05K19K28J88K26J92L2r8j12r5p8k6m2k58n01m76k63k52
$$ 127018 125902 125227 125122 125341 125569 125757 125983 126175 126207 126109 125997 125902 125824 125798 125756 125498 124997 124521 124258 124006
59688A24006m96o11l59K3K20K06M1k83o29p16m83k32j95k48j87n9ql2l1K6J45
$$ 124006 123510 122899 122540 122563 122783 122989 123030 122747 122118 121402 120919 120687 120492 120244 120057 119998 119990 119958 119927 119953 120098
59667A20098L17M51M57M45O43J082J557J888K049K037J859J646J540J496J427
$$ 120098 120415 120866 121323 121768 122411 123493 125050 126938 128987 131024 132883 134529 136069 137565 138992
59652A38992J442J711K106K328K336K339K396K380K314K341K331J974J347R38
$$ 138992 140434 142145 144251 146579 148915 151254 153650 156030 158344 160685 163016 164990 166337 167275
59638A67275R90J186J135Q64O04M17K12m4l30n96p20o31m67m36n03m90m23m93
$$ 167275 168265 169451 170586 171450 172054 172471 172683 172639 172309 171713 170993 170362 169895 169459 168956 168466 168043 167550
59620A67550o87p85p54p72q50p81n49l97m06l52r8K24M60O15O58N24L49L91O29
$$ 167550 166863 166078 165324 164552 163702 162921 162372 161975 161569 161217 161119 161343 161803 162418 163076 163600 163949 164340 164969
59601A64969P81P47P21P86P88P06P38Q96Q91O12K99J44K8j35j86k2J96K83K40
$$ 164969 165750 166497 167218 168004 168792 169498 170236 171132 172023 172635 172934 173078 173106 172971 172785 172763 172959 173242 173482
59582A73482N7l48q69j213j304j390j622j837j894j894j922j904j869j973k143
$$ 173482 173539 173191 172322 171109 169805 168415 166793 164956 163062 161168 159246 157342 155473 153500 151357
59567A51357k050j594j106q48o97m66k26o2J01K62K59J12J12L63N33L47m9m00
$$ 151357 149307 147713 146607 145759 145062 144596 144370 144308 144409 144671 144930 145042 145154 145517 146050 146397 146348 145948
59549A45948p03j029j264j332j397j595j791j848j844j823j596j069m94j83j44
$$ 145948 145245 144216 142952 141620 140223 138628 136837 134989 133145 131322 129726 128657 128163 127980 127836
59534A27836k02k96m31n80p86j164j657j999k085k073k068j915j546j171r66q18
$$ 127836 127634 127338 126907 126327 125541 124377 122720 120721 118636 116563 114495 112580 111034 109863 108897 108079
59518A08079o23n13o00p39p54o93o38m97k11Q7K39K71K54J80J01J54L21M14L89
$$ 108079 107456 106943 106343 105604 104850 104157 103519 103022 102811 102898 103137 103408 103662 103842 103943 104097 104418 104832 105221
59499A05221M07N10N36M26L10K49J71J56L75O94P53N38M45O35P83O67M87M18K75
$$ 105221 105628 106138 106674 107100 107410 107659 107830 107986 108361 109055 109808 110346 110791 111426 112209 112876 113363 113781 114056
59480A14056n2l14l28k98m26n44m62l11k68k60k16k46l38k68j5Q7j08l00k57j69
$$ 114056 114004 113690 113362 113064 112638 112094 111632 111321 111053 110793 110577 110331 109993 109725 109710 109797 109689 109389 109132 108963
59460A08963k07k11j01j36m03n39l24q9j25j78L7K80K79K77N99J019J191J273
$$ 108963 108756 108545 108444 108308 107905 107366 107042 106953 106828 106650 106687 106967 107246 107523 108122 109141 110332 111605
59442A11605J631K203K804L672N047O405O759N707L691J418n38j704j967j710
$$ 111605 113236 115439 118243 121915 126962 133367 140126 145833 149524 150942 150404 148700 146733 145023
59428A45023j429j173q02m74m53o00o03n17o43j003j371j691k040k272k195j946
$$ 145023 143594 142421 141619 141145 140692 140092 139489 138972 138329 137326 135955 134264 132224 129952 127757 125811
59412A25811j786j676j459j248j242j287j129r04q94r87q50n51m31n10m78k65
$$ 125811 124025 122349 120890 119642 118400 117113 115984 115080 114186 113199 112349 111798 111367 110857 110379 110114
59396A10114r5l5O7J98J81O3P9K24K73J73Q7O2Nn7rJ09J78K32L15K68Kk18q5K55
$$ 110114 110019 109984 110051 110249 110430 110493 110572 110796 111069 111242 111329 111391 111396 111339 111330 111439 111617 111849 112164 112432 112434 112216 112131 112386
59372A12386M65N54P40R58R83Q75Q79R72R83R96J214J476J474J306J329J559J691
$$ 112386 112851 113405 114145 115103 116086 116961 117840 118812 119795 120791 122005 123481 124955 126261 127590 129149 130840
59355A30840J674J728J805J582J040N30K39Ok66m76o11p76q94q06o74q20j161
$$ 130840 132514 134242 136047 137629 138669 139199 139438 139444 139178 138702 138091 137315 136421 135615 134941 134121 132960
59338A32960j237q82l99m3K72O45R59J118J196J266J371J646K150K619K771K750
$$ 132960 131723 130841 130442 130399 130671 131316 132275 133393 134589 135855 137226 138872 141022 143641 146412 149162
59322A49162K904L204L319L273L419L819M164M453N135O256P004O468M602K188
$$ 149162 152066 155270 158589 161862 165281 169100 173264 177717 182852 189108 196112 202580 207182 209370
59308B09370P6j291j841j773j400r07k29P81K022L011L037J653q16l399n226o127
$$ 209370 209446 208155 206314 204541 203141 202234 202005 202786 204808 207819 210856 212509 211693 208294 203068 196941
59292A96941o369o127n469m655l993l500l006k518k192k020j844j649j520j400
$$ 196941 190572 184445 178976 174321 170328 166828 163822 161304 159112 157092 155248 153599 152079 150679
59278A50679j178r10o90m38r3J51J03n9k5K08M52P14J071J373J462J522J803K178
$$ 150679 149501 148591 147901 147463 147370 147521 147624 147565 147540 147748 148200 148914 149985 151358 152820 154342 156145 158323
59260A58323K386K534K886L330L523L483L499L607L616L563L637L743L622L366
$$ 158323 160709 163243 166129 169459 172982 176465 179964 183571 187187 190750 194387 198130 201752 205118
59246B05118L255L190K808K065J254M51m97j496k270k883l629m403m771m668m507
$$ 205118 208373 211563 214371 216436 217690 218141 217644 216148 213878 210995 207366 202963 198192 193524 189017
59231A89017m507m474m281m061l853l523l126k897k800k599k345k299k379k227
$$ 189017 184510 180036 175755 171694 167841 164318 161192 158295 155495 152896 150551 148252 145873 143646
59217A43646j839j619j679j701j520j337j257j125r37q84q68n57O2N99R25J283
$$ 143646 141807 140188 138509 136808 135288 133951 132694 131569 130632 129748 128880 128323 128385 128984 129909 131192
59201A31192J736K023K176K651L621M611N014M573L263J243q69k265k732k769
$$ 131192 132928 134951 137127 139778 143399 148010 153024 157597 160860 162103 161234 158969 156237 153468
59187A53468k769k587k058j419r08m22J75P82J292J736K062K155K138K297K587
$$ 153468 150699 148112 146054 144635 143727 143305 143480 144262 145554 147290 149352 151507 153645 155942 158529
59172A58529K686K560K486K480K247J827J664J870K009J782J428J202J021Q13
$$ 158529 161215 163775 166261 168741 170988 172815 174479 176349 178358 180140 181568 182770 183791 184604
59158A84604P25O98M09j79o74q94j103j411j517j344j288j533j639j244o80m68
$$ 184604 185329 186027 186436 186257 185583 184689 183586 182175 180658 179314 178026 176493 174854 173610 172930 172462
59142A72462o17q13r58j097j157j101j114j318j598j860k172k508k657k579k475
$$ 172462 171845 171032 170074 168977 167820 166719 165605 164287 162689 160829 158657 156149 153492 150913 148438
59127A48438k392k179j894j814j891j757j370j107j050q03k67Q1k1j37J37N45
$$ 148438 146046 143867 141973 140159 138268 136511 135141 134034 132984 132181 131914 131995 131974 131837 131974 132519
59111A32519O61N40M23L16K04L00O31P98N38J32q2j73k77k47m1K6k23m74m75m48
$$ 132519 133180 133720 134143 134459 134663 134963 135594 136392 136930 137062 136980 136807 136530 136283 136242 136268 136045 135571 135096 134648
59091A34648o21p35n07j69r2j94j73l0P8J81L48M12K57O6Ml7j17l2K72M61L11
$$ 134648 134027 133292 132785 132616 132524 132330 132157 132127 132205 132386 132734 133146 133403 133469 133473 133436 133319 133287 133559 134020 134331
59070A34331R0R2K03K40L00M18K73l07r76j340j478j608j628j409j196j264j460
$$ 134331 134421 134513 134716 134956 135256 135674 135947 135640 134664 133324 131846 130238 128610 127201 126005 124741 123281
59053A23281j505j456j486j504j356j142r90q03n44m38o29q84r61r43r60q88o46
$$ 123281 121776 120320 118834 117330 115974 114832 113842 113039 112495 112057 111428 110544 109583 108640 107680 106792 106146
59036A06146l93k34o9P2l4k79j97L09P10O47M47M94O64P75J013J461J737J609
$$ 106146 105753 105519 105450 105522 105488 105209 105012 105321 106031 106678 107125 107619 108283 109058 110071 111532 113269 114878
59018A14878J472J733K207K575K943L465L863L888L784L797L722L391L137L162
$$ 114878 116350 118083 120290 122865 125808 129273 133136 137024 140808 144605 148327 151718 154855 158017
59004A58017L013K277J329P63M91N3n50j041j473k025k435k316j815j351j030
$$ 158017 161030 163307 164636 165399 165890 165943 165393 164352 162879 160854 158419 156103 154288 152937 151907
58989A51907p46o30p94r84r58r55j253j617j697j622j686j776j673j531j551j535
$$ 151907 151161 150531 149737 148753 147795 146840 145587 143970 142273 140651 138965 137189 135516 133985 132434 130899
58973A30899j264r92r84j013q52p71r79j090q10o09r79j497j460j044r43j190
$$ 130899 129635 128643 127659 126646 125794 125023 124044 122954 122144 121535 120556 119059 117599 116555 115612 114422
58957A14422j239r49o56m27q6K01J31p6J8K80K70Q9J94M98N24K59J35K07J43n2
$$ 114422 113183 112234 111578 111151 111065 111266 111397 111321 111339 111619 111889 111978 112172 112670 113194 113453 113588 113795 113938 113886
58937A13886l4J88K69K43M83R94J411J666K011K439K698K824L097L422L407L008
$$ 113886 113852 114040 114309 114552 115035 116029 117440 119106 121117 123556 126254 129078 132175 135597 139004 142012
58921A42012K545K129J625J068N91P0o44j252j387j229j244j417j387j138r16
$$ 142012 144557 146686 148311 149379 149970 150040 149396 148144 146757 145528 144284 142867 141480 140342 139426
58906A39426o68j99L17N92P83J161J461J290Q97P98R00P60M85N14P05N35O8j57
$$ 139426 138758 138559 138876 139468 140251 141412 142873 144163 145060 145858 146758 147518 148003 148517 149222 149757 149825 149668
58888A49668j31l27p21p53l27M7J67L68Q03J199J491J911K381K558K518K714L162
$$ 149668 149537 149210 148489 147736 147409 147456 147623 147991 148794 149993 151484 153395 155776 158334 160852 163566 166728
58871A66728L428L413L453L595L520L234L077L039K766K316K108K101J783J069
$$ 166728 170156 173569 177022 180617 184137 187371 190448 193487 196253 198569 200677 202778 204561 205630
58857B05630L98j04p86j681k364k737l168l733m034l989l984m131m058l651l262
$$ 205630 206028 205924 205138 203457 201093 198356 195188 191455 187421 183432 179448 175317 171259 167608 164346
58842A64346l017k592j921j378j135r44p04o13o32m25o0J9k31l54j98j45l74o08
$$ 164346 161329 158737 156816 155438 154303 153359 152655 152042 151410 150985 150925 150944 150713 150359 150161 150016 149642 149034
58824A49034p37r98j349j370r86o31n43m87l43l00l68l04j52j80k43Q6P24J104
$$ 149034 148297 147299 145950 144580 143594 142963 142420 141933 141590 141290 140922 140618 140466 140286 140043 140129 140853 141957
58806A41957J127J295J815K345K748L281L915M247M244M316M516M446M160M225
$$ 141957 143084 144379 146194 148539 151287 154568 158483 162730 166974 171290 175806 180252 184412 188637
58792A88637M774N250N370N463N666N595N098M509L900K934J681P49K54m22j544
$$ 188637 193411 198661 204031 209494 215160 220755 225853 230362 234262 237196 238877 239626 239880 239458 237914
58777B37914k541k992l233l574l699l358k846k414j862j154p38q06r55q99r00
$$ 237914 235373 232381 229148 225574 221875 218517 215671 213257 211395 210241 209503 208697 207742 206843 205943
58762B05943j113j248j211j363j779j992j839j831k236k580k504k378k588k935
$$ 205943 204830 203582 202371 201008 199229 197237 195398 193567 191331 188751 186247 183869 181281 178346
58748A78346l149l397l755l880l639l465l593l655l346k970k813k675k370k120
$$ 178346 175197 171800 168045 164165 160526 157061 153468 149813 146467 143497 140684 138009 135639 133519
58734A33519k006j685j048n22l43j59K65N98O17O19Q19R74R76J151J563J743J470
$$ 133519 131513 129828 128780 128258 127915 127756 128021 128619 129236 129855 130674 131648 132624 133775 135338 137081 138551
58717A38551J136J000P81M03L00O14Q15N81K76J51j30o97j051r35q39j109j349
$$ 138551 139687 140687 141468 141871 142171 142785 143600 144181 144457 144608 144478 143781 142730 141795 140956 139847 138498
58700A38498j254j219j561j911j964k033k300k281j723j198j171j216q16k33J02
$$ 138498 137244 136025 134464 132553 130589 128556 126256 123975 122252 121054 119883 118667 117851 117618 117720
58685A17720L34O46P04L25OJ10K36O2M2N31J001R04N76N33M81l7p29j111j352
$$ 117720 118054 118700 119404 119729 119735 119845 120081 120143 120185 120716 121717 122621 123197 123730 124211 124174 123445 122334 120982
58666A20982j743j924j487q34n46m69j84P3r9m06l26n5j17m19n15m28m68n56m38
$$ 120982 119239 117315 115828 114994 114448 113979 113795 113868 113769 113363 113037 112982 112865 112446 111931 111503 111035 110479 110041
58647A10041k58k42j57K61P46R78J169J602K005K063K037K265K512K498K489K749
$$ 110041 109783 109541 109384 109645 110391 111369 112538 114140 116145 118208 120245 122510 125022 127520 130009 132758
58631A32758K928K670K293K190K065J563J027R16R60P15M40O05J004J148J134
$$ 132758 135686 138356 140649 142839 144904 146467 147494 148410 149370 150085 150525 151130 152134 153282 154416
58616A54416J324J554J466J202J079Q95L42l35p38j028j553k204k751l347m109
$$ 154416 155740 157294 158760 159962 161041 161936 162278 161943 161205 160177 158624 156420 153669 150322 146213
58601A46213m664m755m728m854m775m245l752l689l582k966k298k160k228j932
$$ 146213 141549 136794 132066 127212 122437 118192 114440 110751 107169 104203 101905 99745 97517 95585
58587I5585j493j415j481j261r85j022j012n38k2k9k11L8M54M87M36R30J704K049
$$ 95585 94092 92677 91196 89935 88950 87928 86916 86378 86356 86327 86116 86154 86608 87095 87531 88461 90165 92214
58569I2214K057K328K814L037L112L444L745L358K397J473O62l47j336j836k021
$$ 92214 94271 96599 99413 102450 105562 109006 112751 116109 118506 119979 120641 120294 118958 117122 115101
58554A15101k375k745k665k319k195k139j714j162j024j098q08l09j94l73k81
$$ 115101 112726 109981 107316 104997 102802 100663 98949 97787 96763 95665 94857 94548 94354 93981 93700
58539I3700M1P8j76l30m18o86q56n30o0o9l67l13P8L11L81N98P96O48M49O36Q93
$$ 93700 93741 93819 93643 93313 92895 92209 91353 90823 90763 90694 90327 90014 90092 90403 90784 91382 92178 92826 93275 93911 94804
58518I4804P15M29O24R76P84K39L9J28k8k59k7M13L39j17k14Q4J90K9J4P0j79
$$ 94804 95519 95948 96572 97548 98332 98571 98610 98738 98710 98451 98424 98837 99176 99059 98845 98929 99119 99148 99162 99232 99053
58497I9053m80l22L2j6k38K3O27R82J244J937K713K830K533K651L068K980K438
$$ 99053 98573 98251 98283 98267 98029 98052 98679 99661 100905 102842 105555 108385 110918 113569 116637 119617 122055
58480A22055K237K397K153J455J074J228J395J476J889K536K907L172L943N074
$$ 122055 124292 126689 128842 130297 131371 132599 133994 135470 137359 139895 142802 145974 149917 154991
58466A54991N847O259O850P442P308O531N819N127L762J829K02q28j677k281k192
$$ 154991 160838 167097 173947 181389 188697 195228 201047 206174 209936 211765 211967 211139 209462 207181 204989
58451B04989j720j671j983j941j640j849k565l065l336l962m733m830m373m274
$$ 204989 203269 201598 199615 197674 196034 194185 191620 188555 185219 181257 176524 171694 167321 163047
58437A63047m596m521l971l671l630l108k186j767j917j734j051o91q66q61n00
$$ 163047 158451 153930 149959 146288 142658 139550 137364 135597 133680 131946 130895 130204 129338 128477 127977
58422A27977m14o60n67j24q6m77n57l35o13j322j490r97p88j071r97l83j25n03
$$ 127977 127563 126903 126336 126212 126126 125649 125092 124757 124144 122822 121332 120335 119547 118476 117479 117096 116971 116468
58404A16468p19m70m19p31o73j03K13O4J33N36N74K36L45R39J105P59Q96J722
$$ 116468 115749 115279 114860 114129 113456 113353 113566 113630 113763 114299 114873 115109 115454 116393 117498 118257 119153 120875
58386A20875K264K217K483L337L854L643L482L631L258K092J047M91l61j756k720
$$ 120875 123139 125356 127839 131176 135030 138673 142155 145786 149044 151136 152183 152674 152313 150557 147837
58371A47837k756k656k918k926k368j915j825j372l25M97P44J139J962K484K429
$$ 147837 145081 142425 139507 136581 134213 132298 130473 129101 128776 129273 130017 131156 133118 135602 138031
58356A38031K502K875K732J879J193R46K79j064k099k340k462k745k511j693j263
$$ 138031 140533 143408 146140 148019 149212 150158 150437 149373 147274 144934 142472 139727 137216 135523 134260
58341A34260j445j263m41N0j20k4O27Q50L65K37Q40J116O64N50J224J599J141
$$ 134260 132815 131552 131111 131161 131041 131017 131644 132494 132859 133096 133936 135052 135716 136266 137490 139089 140230
58324A40230Q55J247J271L64m54n77q96j870k409j893j395j715k012j582j192
$$ 140230 141085 142332 143603 143967 143513 142936 142040 140170 137761 135868 134473 132758 130746 129164 127972
58309A27972j454j636j221r34j110q26K27Q99O06L91Q73J118O06L99J078J557
$$ 127972 126518 124882 123661 122727 121617 120791 121018 121917 122523 122914 123787 124905 125511 125910 126988 128545
58293A28545J124P13R34R03K10K8Q84J453R35N16J090J619J259R79J524J850J173
$$ 128545 129669 130382 131316 132219 132429 132457 133341 134794 135729 136245 137335 138954 140213 141192 142716 144566 145739
58276A45739N43Q01J008M68K34J006J600J179R18J725K442K047J594K102K589
$$ 145739 146282 147083 148091 148559 148793 149799 151399 152578 153496 155221 157663 159710 161304 163406 165995
58261A65995K005J190J063Q56j05q20n59l75r63j159k60M16Pj33R39J807J343
$$ 165995 168000 169190 170253 171109 171004 170184 169625 169250 168287 167128 166868 167284 167291 167158 168097 169904 171247
58244A71247R02J774K768K581K225K865L488L010K469K839K960J867R12J256J587
$$ 171247 172149 173923 176691 179272 181497 184362 187850 190860 193329 196168 199128 200995 201907 203163 204750
58229B04750O46l00M6N14j22o50J13Q65L76J5J086K142J703J093J795K518J844
$$ 204750 205396 205096 205142 205656 205534 204884 204997 205862 206238 206253 207339 209481 211184 212277 214072 216590 218434
58212B18434J143J905K754K154J514K425L445K862K051K732L534K719J707K350
$$ 218434 219577 221482 224236 226390 227904 230329 233774 236636 238687 241419 244953 247672 249379 251729
58198B51729L296K661J748K422L390K825K127L177M477L949K962L629M673M066
$$ 251729 255025 257686 259434 261856 265246 268071 270198 273375 277852 281801 284763 288392 293065 297131
58184B97131L194M157N517N062M169N077O425N951N062O086P624P268O348P244
$$ 297131 300325 304482 309999 315061 319230 324307 330732 336683 341745 347831 355455 362723 369071 376315
58170C76315Q645Q227P437Q596J0068R317Q005Q863J0321R610Q281R097J0422
$$ 376315 384960 393187 400624 409220 419288 428605 436610 445473 455794 465404 473685 482782 493204
58157D93204R395P779Q701J0577J0255R268J0686J2797J2425J1407J3181J5945
$$ 493204 502599 510378 519079 529656 539911 549179 559865 572662 585087 596494 609675 625620
58145F25620J6102J5343J7209J9858J9604J8434K0298K3244K3152K1945K3873
$$ 625620 641722 657065 674274 694132 713736 732170 752468 775712 798864 820809 844682
58134H44682K7036K7217K6620K9840L4591L5845L5670L9202M4444M6258M6862
$$ 844682 871718 898935 925555 955395 989986 1025831 1061501 1100703 1145147 1191405 1238267
58123A238267N1657N8294O1062O2421O8488P6873Q1368Q4716R3708J05645J13494
$$ 1238267 1289924 1348218 1409280 1471701 1540189 1617062 1698430 1783146 1876854 1982499 2095993
58112B095993J20311J33876J51322J64751J77647J99006K25842K49614K75220
$$ 2095993 2216304 2350180 2501502 2666253 2843900 3042906 3268748 3518362 3793582
58103C793582L13985L62846M11948M67853N45916O45230P57069Q92411J071910
$$ 3793582 4107567 4470413 4882361 5350214 5896130 6541360 7298429 8190840 9262750
58094I262750J294996J552590J864678K268057K775711L395563M178748N181390
$$ 9262750 10557746 12110336 13975014 16243071 19018782 22414345 26593093 31774483
58086C1774483O369701P622207Q804965R711282R889638Q726657N938063K002157
$$ 31774483 38144184 45766391 54571356 64282638 74172276 82898933 88836996 90839153
58078I0839153k027579n204438p173986q085464q234524p873358p217097o444042
$$ 90839153 88811574 83607136 76433150 68347686 60113162 52239804 45022707 38578665
58070C8578665n653505m880301m154117l509263k952385k467258k050124j708939
$$ 38578665 32925160 28044859 23890742 20381479 17429094 14961836 12911712 11202773
58062A1202773j434443j203393j007053q50310p27003o20977n28472m56702m02683
$$ 11202773 9768330 8564937 7557884 6707574 5980571 5359594 4831122 4374420 3971737
58053C971737l54005l08462k73604k48492k23672j97842j77890j63534j47439
$$ 3971737 3617732 3309270 3035666 2787174 2563502 2365660 2187770 2024236 1876797
58044A876797j29561j16735j08765r8728q6279p7578p2687o5665n6710n2036n1843
$$ 1876797 1747236 1630501 1521736 1423008 1336729 1259151 1186464 1120799 1064089 1012053 960210
58033I60210m9916m5141m2465m2443m0322l5797l3567l3886l2070k7743k5429
$$ 960210 910294 865153 822688 780245 739923 704126 670559 636673 604603 576860 551431
58022E51431k5594k3974k0148j8290j8900j8004j5094j3945j5004j4622j2364
$$ 551431 525837 501863 481715 463425 444525 426521 411427 397482 382478 367856 355492
58011C55492j1735j3061j2820j0626r916j1098j0797q527p559q504q399o823o615
$$ 355492 343757 330696 317876 307250 297334 286236 275439 266912 259353 250849 242450 235627 229012
57998B29012p954p787n840n202o309o186m400l930n324n640m102l376m208m163
$$ 229012 221058 213271 207431 202229 195920 189734 185334 181404 176080 170440 166338 162962 158754 154591
57984A54591k652k100l111l397k476k577m034m476l479l366m542m678l345k911
$$ 154591 151939 149839 146728 143331 140855 138278 134244 129768 126289 122923 118381 113703 110358 107447
57970A07447l927m120k903k449l307l356k042j468k232k329j232r11j844j999
$$ 107447 103520 99400 96497 94048 90741 87385 85343 83875 81643 79314 78082 77171 75327 73328
57956G3328q68m86j472j904j170j075k056k186j000n37j456j836r90p46j753k154
$$ 73328 72460 71974 70502 68598 67428 66353 64297 62111 61111 60574 59118 57282 56292 55546 53793 51639
57940E1639j251q66j769k238j452j008j664j892j012n74j236j431n17j25j009
$$ 51639 50388 49522 47753 45515 44063 43055 41391 39499 38487 37913 36677 35246 34729 34604 33595
57925C3595j585r81o00j235j526p22j49n38o17K34O19k22r55p01n05j002j124
$$ 33595 32010 31029 30429 29194 27668 26946 26797 26259 25642 25876 26495 26273 25318 24617 24112 23110 21986
57908B1986l89m1o11q17o0L89j08l22L61O89J1m21J48N95K24Q6P43J039L30k37
$$ 21986 21597 21556 20945 20128 20068 20457 20349 20027 20388 21077 21088 20667 20815 21410 21634 21720 22463 23502 23832 23595
57888B3595QJ3p92j239o77k80p68j043l71J72k12n75j71J16l74p47l59n8m02n59
$$ 23595 23603 23616 22824 21585 20908 20628 19860 18817 18446 18618 18406 17831 17660 17776 17402 16655 16296 16238 15836 15277
57868A5277j16p3q49j272p82n37j180j513p64r0m47r12n82k37o38r84n54j96o70
$$ 15277 15161 15088 14239 12967 12185 11648 10468 8955 8191 8101 7654 6742 6160 5923 5285 4301 3747 3551 2881
57849B881j151p79k06j53m5N81Q89L33j27L00Q53P83P48J345J793J438J038J256
$$ 2881 1730 951 745 592 547 1128 2017 2350 2223 2523 3376 4159 4907 6252 8045 9483 10521 11777
57831A1777J337O53K0J47K44m15j091j024r22j497j994j626j103j294j590D64
$$ 11777 13114 13767 13787 13934 14178 13763 12672 11648 10726 9229 7235 5609 4506 3212 1622 464
57814h1n94q76o39k46l25m82k00M9k41n47l66k43o15p95k93N6m76j116r06k97
$$ -81 -675 -1551 -2190 -2436 -2761 -3243 -3443 -3394 -3635 -4182 -4548 -4791 -5406 -6201 -6494 -6438 -6914 -8030 -8936 -9233
57794i233j69k86n4K02k3l19j70M9n8l3M42P26L84Q2L33N04J18q5M88J074R26
$$ -9233 -9402 -9688 -9742 -9540 -9563 -9882 -10052 -10003 -10061 -10094 -9652 -8926 -8542 -8460 -8127 -7623 -7505 -7590 -7102 -6028 -5102
57773e102O55R93J408h18A82J388J811J559J114J143J183O82K54N45Q88M75j18
$$ -5102 -4447 -3454 -2046 -818 182 1570 3381 4940 6054 7197 8380 9062 9316 9861 10749 11224 11106
57756A1106j3L64J88k22j70n5n60j235j256r33j022j325j256j095A194b82r78
$$ 11106 11093 11457 11645 11423 11253 11198 10638 9403 8147 7214 6192 4867 3611 2516 1194 -282 -1260
57739a260l39l17n22k37K00J26p4L10R20a93F07R78J286J159R48J231J554J200
$$ -1260 -1599 -1916 -2438 -2675 -2475 -2349 -2423 -2113 -1193 -193 607 1585 2871 4030 4978 6209 7763 8963
57721H963N78N40Q47P07K09l1j37n33q39n00l7l28j156j676j841k160I2b404k431
$$ 8963 9541 10081 10928 11635 11844 11813 11676 11143 10304 9804 9767 9439 8283 6607 4766 2606 92 -2404 -4835
57702d835k734k937k434j749j733k091j982j561j549j771j506q87o50p76o93m83
$$ -4835 -7569 -10506 -12940 -14689 -16422 -18513 -20495 -22056 -23605 -25376 -26882 -27769 -28419 -29195 -29888 -30371
57686c0371o24q61n86oK15J75M12P48O58L92N24P82N21k1j33P7j7k92k09pk90
$$ -30371 -30995 -31856 -32442 -32448 -32233 -32058 -31646 -30898 -30240 -29848 -29324 -28542 -28021 -28042 -28175 -28098 -28115 -28407 -28616 -28623 -28913
57665b8913q01q25n24o03r35q20l51j84k78n9L18K30j42l9M96P41O10O73R46R34
$$ -28913 -29714 -30539 -31063 -31666 -32601 -33421 -33772 -33956 -34234 -34293 -33975 -33745 -33887 -33926 -33430 -32689 -32079 -31406 -30460 -29526
57645b9526P08Q17J167J167Q89R49J314J370J072R17R36P25L83L14L01j62p82
$$ -29526 -28818 -28001 -26834 -25667 -24778 -23829 -22515 -21145 -20073 -19156 -18220 -17495 -17112 -16798 -16497 -16659 -17441
57628a7441q68n83o50j014r87n54l77n50n82m71o52r44p61k83k23n44n73l24m43
$$ -17441 -18309 -18892 -19542 -20556 -21543 -22097 -22474 -23024 -23606 -24077 -24729 -25673 -26434 -26717 -26940 -27484 -28057 -28381 -28824
57609b8824r11j007o29m00m59k85J49K94J12J41L88K86j26j56K92N38L36J69K08
$$ -28824 -29735 -30742 -31371 -31771 -32230 -32515 -32366 -32072 -31960 -31819 -31431 -31145 -31271 -31427 -31135 -30597 -30261 -30092 -29884
57590b9884P8k42l18j94l79p96q01l74j96m57o03m42l95n34l80J25N07P68J448
$$ -29884 -29806 -30048 -30366 -30560 -30939 -31735 -32536 -32910 -33106 -33563 -34166 -34608 -35003 -35537 -35917 -35792 -35285 -34517 -33069
57571c3069K525L341L813M684O339c964F735J3488J6248J7415J5698J1149M743
$$ -33069 -30544 -27203 -23390 -18706 -12367 -3964 6735 20223 36471 53886 69584 80733 85476
57558H5476k201q127j1838j3416j3850j3651I768a179r406q281p139n858m907
$$ 85476 83275 75148 63310 49894 36044 22393 9768 -1179 -10585 -18866 -26005 -31863 -36770
57545c6770m390l775k935k409k363k240j779j415j375j247q78p22r83j161r27
$$ -36770 -41160 -44935 -47870 -50279 -52642 -54882 -56661 -58076 -59451 -60698 -61576 -62298 -63281 -64442 -65369
57530f5369o08m74l27r9j03l40l54k2K01J07M0J46J20q7j09Q5L9l35n74n68p70
$$ -65369 -65977 -66451 -66778 -66877 -66980 -67320 -67674 -67696 -67495 -67388 -67348 -67202 -67082 -67169 -67278 -67193 -67154 -67489 -68063 -68631 -69401
57509f9401j268j500j217r16r32r51p42n78o39o34m40l69n41o42n99p35j077j202
$$ -69401 -70669 -72169 -73386 -74302 -75234 -76185 -76927 -77505 -78144 -78778 -79218 -79587 -80128 -80770 -81369 -82104 -83181 -84383
57491h4383j017r36j081j088q59p76r44j023j000j259j714j754j317j087j347
$$ -84383 -85400 -86336 -87417 -88505 -89364 -90140 -91084 -92107 -93107 -94366 -96080 -97834 -99151 -100238 -101585
57476a01585j531j270r56r15q75o46n31o55o53m14l29m89m68j96k16o66r34o93
$$ -101585 -103116 -104386 -105342 -106257 -107132 -107778 -108309 -108964 -109617 -110031 -110360 -110849 -111317 -111513 -111729 -112395 -113329 -114022
57458a14022m48n69o83m97m05o72q68o56m45o31q91q17n97n27m37j38J12J00N5
$$ -114022 -114470 -115039 -115722 -116219 -116624 -117296 -118164 -118820 -119265 -119896 -120787 -121604 -122201 -122728 -123165 -123303 -123191 -123091 -123036
57439a23036J50J29j46l33k15q5j75k86k98m17o57o30k54Np1j10Q0J16k33n74
$$ -123036 -122886 -122757 -122903 -123236 -123451 -123536 -123711 -123997 -124295 -124712 -125369 -125999 -126253 -126248 -126319 -126429 -126349 -126233 -126466 -127040
57419a27040n64m14l74l08j73k02l57k32J64K81k0j95OQ2k61n49l83j20j51k91
$$ -127040 -127604 -128018 -128392 -128700 -128873 -129075 -129432 -129664 -129500 -129219 -129239 -129434 -129428 -129346 -129607 -130156 -130539 -130659 -130810 -131101
57399a31101l30n01q76j049q53p47j002j223j127j061j246j309j037q79j122j347
$$ -131101 -131431 -131932 -132808 -133857 -134710 -135457 -136459 -137682 -138809 -139870 -141116 -142425 -143462 -144341 -145463 -146810
57383a46810j214j087j279j421j196r74j099j226j011p90r17j095r95r01j123
$$ -146810 -148024 -149111 -150390 -151811 -153007 -153981 -155080 -156306 -157317 -158107 -159024 -160119 -161114 -162015 -163138
57368a63138j337j192r64j002j070q82o89p57p87n01k07k39l75l83n34r83j254
$$ -163138 -164475 -165667 -166631 -167633 -168703 -169585 -170274 -171031 -171818 -172319 -172526 -172765 -173140 -173523 -174057 -175040 -176294
57351a76294j011o81p43r41q58o67o83p36o12n66p67q25m73j62l07n78n71n53
$$ -176294 -177305 -177986 -178729 -179670 -180528 -181195 -181878 -182614 -183226 -183792 -184559 -185384 -185857 -186019 -186326 -186904 -187475 -188028
57333a88028q47j077q26m52n02p90q30p05p83r70j003j027j234j328j055q01r71
$$ -188028 -188875 -189952 -190778 -191230 -191732 -192522 -193352 -194057 -194840 -195810 -196813 -197840 -199074 -200402 -201457 -202258 -203229
57316b03229j268j222r97r78j008p93n55o14p29n38l07m66q36r93j009j145j213
$$ -203229 -204497 -205719 -206716 -207694 -208702 -209495 -210050 -210664 -211393 -211931 -212238 -212704 -213540 -214533 -215542 -216687 -217900
57299b17900r55o78p94j087j115r45r08r47q53q07j023j252j222j159j322j442
$$ -217900 -218855 -219533 -220327 -221414 -222529 -223474 -224382 -225329 -226182 -226989 -228012 -229264 -230486 -231645 -232967 -234409
57283b34409j258j089j299j571j493j308j438j660j531j222j197j381j404j304
$$ -234409 -235667 -236756 -238055 -239626 -241119 -242427 -243865 -245525 -247056 -248278 -249475 -250856 -252260 -253564
57269b53564j343j408j284j153j248j371j277j167j230j194q93p71j128j483j365
$$ -253564 -254907 -256315 -257599 -258752 -260000 -261371 -262648 -263815 -265045 -266239 -267132 -267903 -269031 -270514 -271879
57254b71879j181j512k057k155j862j656j550j283j078j288j650j690j548j630
$$ -271879 -273060 -274572 -276629 -278784 -280646 -282302 -283852 -285135 -286213 -287501 -289151 -290841 -292389 -294019
57240b94019j789j688j542j742k026j924j639j710k062k228k221k400k686k732
$$ -294019 -295808 -297496 -299038 -300780 -302806 -304730 -306369 -308079 -310141 -312369 -314590 -316990 -319676 -322408
57226c22408k620k674k771k611k363k368k494k404k218k256k417k476k581k854
$$ -322408 -325028 -327702 -330473 -333084 -335447 -337815 -340309 -342713 -344931 -347187 -349604 -352080 -354661 -357515
57212c57515k939k635k456k832l283l196k864k894l069k821k340k255k533k687
$$ -357515 -360454 -363089 -365545 -368377 -371660 -374856 -377720 -380614 -383683 -386504 -388844 -391099 -393632 -396319
57198c96319k751l079l490l501l254l260l474l504l430l594l843l852l878m320
$$ -396319 -399070 -402149 -405639 -409140 -412394 -415654 -419128 -422632 -426062 -429656 -433499 -437351 -441229 -445549
57184d45549m846m861m543m526m796m843m637m531m453m069l520l180k881k253
$$ -445549 -450395 -455256 -459799 -464325 -469121 -473964 -478601 -483132 -487585 -491654 -495174 -498354 -501235 -503488
57170e03488j523j155j022p76o70j120j803k149k325k823l423l569l486l812m462
$$ -503488 -505011 -506166 -507188 -507964 -508634 -509754 -511557 -513706 -516031 -518854 -522277 -525846 -529332 -533144 -537606
57155e37606m850m984n309n724n789n654n811o122o117n958o144o481o407o068
$$ -537606 -542456 -547440 -552749 -558473 -564262 -569916 -575727 -581849 -587966 -593924 -600068 -606549 -612956 -619024
57141f19024o053o258o122n708n588n786n861n837o054o355o358o289o562o895
$$ -619024 -625077 -631335 -637457 -643165 -648753 -654539 -660400 -666237 -672291 -678646 -685004 -691293 -697855 -704750
57127g04750o750o372o364o582o540o498p024p848q226q191q282q435q280q160
$$ -704750 -711500 -717872 -724236 -730818 -737358 -743856 -750880 -758728 -766954 -775145 -783427 -791862 -800142 -808302
57113h08302q651r406r635r450r541r883r996j0081j0616j1223j1235j0964j1147
$$ -808302 -816953 -826359 -835994 -845444 -854985 -864868 -874864 -884945 -895561 -906784 -918019 -928983 -940130
57100i40130j1533j1379j0972j1174j1809j2005j1831j2083j2736j3071j3139
$$ -940130 -951663 -963042 -974014 -985188 -996997 -1009002 -1020833 -1032916 -1045652 -1058723 -1071862
57089a071862j3565j4189j4353j4330j4929j5937j6505j6753j7481j8509j8984
$$ -1071862 -1085427 -1099616 -1113969 -1128299 -1143228 -1159165 -1175670 -1192423 -1209904 -1228413 -1247397
57078a247397j9036j9537k0364k0613k0334k0381k0690k0407j9595j9185j9354
$$ -1247397 -1266433 -1285970 -1306334 -1326947 -1347281 -1367662 -1388352 -1408759 -1428354 -1447539 -1466893
57067a466893j9537j9927k1232k3158k4770k6172k8196l0640l2558l4017l5824
$$ -1466893 -1486430 -1506357 -1527589 -1550747 -1575517 -1601689 -1629885 -1660525 -1693083 -1727100 -1762924
57056a762924l7804l9165m0221m1919m4009m5549m6861m8986n1627n3727n5625
$$ -1762924 -1800728 -1839893 -1880114 -1922033 -1966042 -2011591 -2058452 -2107438 -2159065 -2212792 -2268417
57045b268417n8489o2027o5066o7910p1811p6448q0393q3739q7763r2357r6352
$$ -2268417 -2326906 -2388933 -2453999 -2521909 -2593720 -2670168 -2750561 -2834300 -2922063 -3014420 -3110772
57034c110772j00085j04958j10781j16205j21452j27886j35263j42297j49535
$$ -3110772 -3210857 -3315815 -3426596 -3542801 -3664253 -3792139 -3927402 -4069699 -4219234
57025d219234j58686j69455j80200j91257k04371k19321k34547k50673k69769
$$ -4219234 -4377920 -4547375 -4727575 -4918832 -5123203 -5342524 -5577071 -5827744 -6097513
57016f097513k91607l14481l39220l68450m02289m39084m79857n27552n82391
$$ -6097513 -6389120 -6703601 -7042821 -7411271 -7813560 -8252644 -8732501 -9260053 -9842444
57007i842444o42932p11386p92835q89703j002583j136420j300240j501537j747627
$$ -9842444 -10485376 -11196762 -11989597 -12879300 -13881883 -15018303 -16318543 -17820080 -19567707
56998a9567707k052734k437254k920430l520867m262860n171962o261784p531447
$$ -19567707 -21620441 -24057695 -26978125 -30498992 -34761852 -39933814 -46195598 -53727045
56990e3727045q973193j0569497j2280336j4043423j5785922j7421004j8832982
$$ -53727045 -62700238 -73269735 -85550071 -99593494 -115379416 -132800420 -151633402
56983a51633402j9887486k0466673k0482706j9861622j8552462j6574228j4020831
$$ -151633402 -171520888 -191987561 -212470267 -232331889 -250884351 -267458579 -281479410
56976b81479410j0979893p465072l480384Q38928N185654R199412J2615073J5308877
$$ -281479410 -292459303 -299924375 -303404759 -302565831 -297380177 -288180765 -275565692 -260256815
56968b60256815J7258770J8504598J9129173J9231723J8898650J8200423J7207214
$$ -260256815 -242998045 -224493447 -205364274 -186132551 -167233901 -149033478 -131826264
56961a31826264J5992637J4625146J3168401J1688136J0246707Q889645P644125
$$ -131826264 -115833627 -101208481 -88040080 -76351944 -66105237 -57215592 -49571467
56954d9571467O527767N550307M708696L990278L382387K874082K451011K096707
$$ -49571467 -43043700 -37493393 -32784697 -28794419 -25412032 -22537950 -20086939 -17990232
56946a7990232J799396J552076J346564J173236J026193R03083P99937P11107
$$ -17990232 -16190836 -14638760 -13292196 -12118960 -11092767 -10189684 -9389747 -8678640
56938h678640O33874N68231N12261M62289M17311L78738L45880L15862K87929
$$ -8678640 -8044766 -7476535 -6964274 -6501985 -6084674 -5705936 -5360056 -5044194 -4756265
56929d756265K63622K42725K23011K03964J86800J70801J53769J36723J24279
$$ -4756265 -4492643 -4249918 -4026907 -3822943 -3636143 -3465342 -3311573 -3174850 -3050571
56920c050571J19352J20309J23747J27139J28341J25728J19905J13076J06179
$$ -3050571 -2931219 -2810910 -2687163 -2560024 -2431683 -2305955 -2186050 -2072974 -1966795
56911a966795R8641R0796Q4063P8659P3444O8245O3984O0547N6815N2900N0010
$$ -1966795 -1868154 -1777358 -1693295 -1614636 -1541192 -1472947 -1408963 -1348416 -1291601 -1238701 -1188691
56900a188691M8035M5569M2429L9905L8300L6491L4154L2269L1109K9782K8058
$$ -1188691 -1140656 -1095087 -1052658 -1012753 -974453 -937962 -903808 -871539 -840430 -810648 -782590
56889g82590K6738K5946K4890K3556K2785K2535K1838K0640J9880J9619J8902
$$ -782590 -755852 -729906 -705016 -681460 -658675 -636140 -614302 -593662 -573782 -554163 -535261
56878e35261J7667J6959J7021J6908J6281J5810J5641J5085J4149J3678J3741
$$ -535261 -517594 -500635 -483614 -466706 -450425 -434615 -418974 -403889 -389740 -376062 -362321
56867c62321J3397J2410J1614J1334J0961J0357J0183J0518J0591J0182R928R976
$$ -362321 -348924 -336514 -324900 -313566 -302605 -292248 -282065 -271547 -260956 -250774 -240846 -230870
56855b30870R752R214R030R199Q900P911O959O385N778N107M919N179N166M761
$$ -230870 -221118 -211904 -202874 -193675 -184775 -176864 -169905 -163520 -157742 -152635 -147716 -142537 -137371 -132610
56841a32610M600M810M780M406M326M689M906M830N011N558N939O045O398P037
$$ -132610 -128010 -123200 -118420 -114014 -109688 -104999 -100093 -95263 -90252 -84694 -78755 -72710 -66312 -59275
56827e9275P332P044O502N660M137K259R70N08K68K1J16M78N81M94P88J350J500
$$ -59275 -51943 -44899 -38397 -32737 -28600 -26341 -25371 -24863 -24595 -24574 -24458 -23980 -23399 -22905 -22117 -20767 -19267
56810a9267J307J543K204K435K048J816K036K119J868c9B193K354K006J765J842
$$ -19267 -17960 -16417 -14213 -11778 -9730 -7914 -5878 -3759 -1891 -39 2193 4547 6553 8318 10160
56795A0160J683J125Q10J033J269J203J207J454J580J580K005K929L673L856L771
$$ 10160 11843 12968 13778 14811 16080 17283 18490 19944 21524 23104 25109 28038 31711 35567 39338
56780C9338L505K728J605Q49N85J91m50o49j73L16M40O44J170J554J590J722K116
$$ 39338 42843 45571 47176 48025 48610 48801 48351 47702 47529 47845 48285 48929 50099 51653 53243 54965 57081
56763E7081K329K301K694L728M723N240N701O375O665O020M664K954Q78j326k886
$$ 57081 59410 61711 64405 68133 72856 78096 83797 90172 96837 102857 107521 110475 111353 110027 107141
56748A07141l421l416l337k991k221j413q79l84K68Q65J348K060L083M064M976
$$ 107141 103720 100304 96967 93976 91755 90342 89463 89079 89347 90212 91560 93620 96703 100767 105743
56733A05743O290Q067R696J0785J1399J1145R050M932R9l862o375p620p863p480
$$ 105743 112033 120100 129796 140581 151980 163125 172175 177107 177206 173344 166969 159349 151486 144006
56719A44006p004o547n775m660l686k977k069p89L53J032J628K501L493M470N636
$$ 144006 137002 130455 124680 120020 116334 113357 111288 110499 110852 111884 113512 116013 119506 123976 129612
56704A29612O912P688P484O296M097Q77k643n227o390o735o758o260n212m197
$$ 129612 136524 144212 151696 157992 162089 162966 160323 155096 148706 141971 135213 128953 123741 119544
56690A19544l526k818j901j249j072q66k93L30Q32J602K720L580L887M118M432
$$ 119544 116018 113200 111299 110050 108978 108112 107819 108149 108981 110583 113303 116883 120770 124888 129320
56675A29320M109K627N73j246k704l863m348m034l539l411l379l056k640k400
$$ 129320 133429 136056 136629 135383 132679 128816 124468 120434 116895 113484 110105 107049 104409 102009
56661A02009k086j551j210j313j389j042o21n34n36l24j41k34k91q1L4k14m14
$$ 102009 99923 98372 97162 95849 94460 93418 92797 92263 91727 91403 91262 91028 90737 90656 90690 90476 90062
56644I0062k08O1M4J9K82M85K90K5O5J52l5k24r8P9J1m2J59K61m5l56k08J72L45
$$ 90062 89854 89915 89959 89978 90260 90745 91035 91060 91125 91277 91242 91018 90920 90999 91010 90968 91127 91388 91343 90987 90779 90951 91296
56621I1296L77M96N73N01N31P33O95K85L9K60M75L30K51N32O42J77k80j23K02
$$ 91296 91673 92169 92742 93243 93774 94507 95202 95487 95526 95786 96261 96591 96842 97374 98016 98193 97913 97790 97992
56602I7992Rm18l78qQ5p3l1J33Kl18m10l25l78m44k05J70K74J73J54J54K0l2J66
$$ 97992 98001 97583 97205 97197 97282 97209 97178 97311 97313 96995 96585 96260 95882 95438 95233 95403 95677 95850 96004 96158 96178 96146 96312
56579I6312K81M2j57O7L42J63j65q7K14J56j87k76l2J83K81M34N51M44K91L06
$$ 96312 96593 96635 96478 96545 96887 97050 96885 96798 97012 97168 96981 96705 96673 96856 97137 97571 98122 98566 98857 99163
56559I9163K91O3o6J81M14J68k96m47l46l39l24n2K47K37J60L89O85O00K78J68
$$ 99163 99454 99517 99451 99632 100046 100214 99918 99471 99125 98786 98462 98410 98657 98894 99054 99443 100128 100728 101006 101174
56539A01174K29J75R7J56P4l68p37n95k99l60n41l54m3j27l96l20r4k29n25l93
$$ 101174 101403 101578 101675 101831 101905 101537 100800 100205 99906 99546 99005 98651 98608 98481 98085 97765 97671 97442 96917 96524
56519I6524J3L4l21m24j67l7j65k05j02j16j54R8M44L87L9l0K27L21J12n2p4j73
$$ 96524 96537 96571 96250 95826 95659 95622 95457 95252 95150 95034 94880 94978 95422 95809 95848 95818 96045 96366 96478 96426 96352 96179
56497I6179k90j56Q4L9k22k76j08n8j30m9R9J9j40J3L76M98L46K31J48r3k84r4
$$ 96179 95889 95733 95817 95856 95634 95358 95250 95192 95062 95013 95112 95131 94991 95004 95380 95878 96224 96455 96603 96510 96226 96132
56475I6132K31J84j31j95K3J29Q0J37K06J1j94L8N28P05N55N05N54L94K18M94
$$ 96132 96363 96547 96416 96221 96244 96373 96453 96590 96796 96807 96613 96651 97179 97884 98439 98944 99498 99892 100110 100604
56455A00604J033J188R51R30J232J353J136R89J046R38N75L32L70M21L60L05J79
$$ 100604 101637 102825 103776 104706 105938 107291 108427 109416 110462 111400 111975 112307 112677 113098 113458 113763 113942
56438A13942j69m91m02j16j65n26p47p90r63j164j028p18p06q98p89m40l69n58
$$ 113942 113773 113282 112880 112764 112599 112073 111326 110536 109573 108409 107381 106663 105957 105059 104270 103830 103461 102903
56420A02903n03j84r6l07l91l09m63p95q14n32m80p33p92n34l65m23m02l02m32
$$ 102903 102400 102216 102120 101813 101422 101113 100650 99855 99041 98509 98029 97296 96504 95970 95605 95182 94780 94478 94046
56401I4046o82o27l57l49n10l15J33K02q0j1N13P92N58L75N26N70K70J1mj17m17
$$ 94046 93364 92737 92380 92031 91521 91206 91339 91541 91461 91450 91963 92755 93313 93688 94214 94784 95054 95065 95061 94944 94527
56380I4527m63j37J01O9J24L57L61L2j71r1j15l60m20j93j00k62k75l1M8j52k12
$$ 94527 94064 93927 94028 94097 94221 94578 94939 94971 94800 94709 94594 94234 93814 93621 93521 93259 92984 92953 93001 92849 92637
56359I2637j4M3j46j40J70L45K44K59M99N36K32pl7k05n67o88m66k69j58J89O20
$$ 92637 92623 92666 92520 92380 92550 92895 93139 93398 93897 94433 94665 94658 94621 94416 93849 93161 92695 92426 92268 92457 93077
56338I3077N44lk95j24n9l24m00r3R6k5K5L91N34K56O7J97J86j29k24R5L17K23
$$ 93077 93621 93618 93323 93199 93140 92816 92416 92323 92419 92394 92419 92810 93344 93600 93667 93864 94050 93921 93697 93792 94109 94332
56316I4332K67N65N36K1k79k1J74j29m23k47M4M2J6K02L01J34P1K72L38J47J47
$$ 94332 94599 95164 95700 95721 95442 95421 95595 95466 95043 94796 94840 94882 94898 95100 95401 95535 95606 95878 96216 96363 96510
56295I6510M35M64R0m3L32N90L39P1J42J44j60k65O2K25j20m05j94O8k3q5J65
$$ 96510 96945 97409 97499 97456 97788 98378 98717 98788 98930 99074 98914 98649 98711 98936 98816 98411 98217 98285 98262 98177 98342
56274I8342K96N2o0K59M88K67Q7K81L43o0l73j67J03K3j5K46K79j84m45j6M69
$$ 98342 98638 98690 98630 98889 99377 99644 99731 100012 100355 100295 99922 99755 99858 99881 99866 100112 100391 100207 99762 99746 100215
56253A00215L88K00M91Q64P23L20J55O7j85k46R3K97K9j71J13L75J90P8M59P67
$$ 100215 100603 100803 101294 102158 102881 103201 103356 103423 103238 102992 103085 103382 103411 103240 103353 103728 103918 103996 104455 105222
56233A05222M84J39L04N38L16Q1L44O19L45l2R5L66K51J46N59J021Q79N06N72
$$ 105222 105706 105845 106149 106687 107003 107084 107428 108047 108392 108360 108455 108821 109072 109218 109777 110798 111677 112183 112755
56214A12755Q32P40N34O76Q56O60M69P30J003P77N07P82J184J094Q66J086J412
$$ 112755 113587 114327 114861 115537 116393 117053 117522 118252 119255 120032 120539 121321 122505 123599 124465 125551 126963
56197A26963J276J036J269J578J351R94J209J684J670J336J320J516J455J358
$$ 126963 128239 129275 130544 132122 133473 134467 135676 137360 139030 140366 141686 143202 144657 146015
56183A46015J670K050J933J580J529J601J439J450K044K703K799K732L146L709
$$ 146015 147685 149735 151668 153248 154777 156378 157817 159267 161311 164014 166813 169545 172691 176400
56169A76400L815L784M208M792N050N396O353P418P933Q410R633J1234J2452J3610
$$ 176400 180215 183999 188207 192999 198049 203445 209798 217216 225149 233559 243192 254426 266878 280488
56155B80488J5466J7747J9777K1841K4596K7690L0367L2858L5720L8481M0339
$$ 280488 295954 313701 333478 355319 379915 407605 437972 470830 506550 545031 585370
56144E85370M1570M2823M3608M2991M1152L8764L5434L0382K4070J7592J0950
$$ 585370 626940 669763 713371 756362 797514 836278 871712 902094 926164 943756 954706
56133I54706L549m098j0827j6569k1998k6893l0446l2856l4980l6713l7311l6962
$$ 954706 958255 954157 943330 926761 904763 877870 847424 814568 779588 742875 705564 668602
56121F68602l6499l5861l4440l2542l0994k9610k7661k5430k3751k2381k0474
$$ 668602 632103 596242 561802 529260 498266 468656 440995 415565 391814 369433 348959
56110C48959j8300j6804j5796j4315j2481j1263j0678r877q837q237p909p079
$$ 348959 330659 313855 298059 283744 271263 260000 249322 239445 230608 222371 214462 207383
56098B07383n935n304n014m228l154k712k808k588k177k353k816k574j801j543
$$ 207383 201448 196144 191130 186902 183748 181036 178228 175640 173463 171110 168294 165720 163919 162376
56084A62376j741j440p25n70r07p55j40l4m43m35J2M4l02j49M04M65J23K71P63
$$ 162376 160635 159195 158470 157900 156993 156238 156098 156064 155621 155186 155198 155242 154940 154791 155195 155660 155783 156054 156817
56065A56817O45J38L48J133J271P22O59J277J572J385J604K241K330J880J927
$$ 156817 157462 157600 157948 159081 160352 161074 161733 163010 164582 165967 167571 169812 172142 174022 175949
56050A75949K565K858K798L340M433N053N235O040P472Q494R172J0661J2958J4822
$$ 175949 178514 181372 184170 187510 191943 196996 202231 208271 215743 224237 233409 244070 257028 271850
56036B71850J5964J7125J7981J7252J5071J3018J1557R802P873P089P462P372
$$ 271850 287814 304939 322920 340172 355243 368261 379818 389620 397493 404582 412044 419416
56024D19416O143M692L367J438q61k213k479k909l819m403n002p057j0421j3248
$$ 419416 425559 430251 433618 435056 434195 431982 429503 426594 422775 418372 413370 406313 395892 382644
56010C82644j4854j6221j7400j7139j5510j4209j3635j2358j0021q068p028n748
$$ 382644 367790 351569 334169 317030 301520 287311 273676 261318 251297 243229 236201 230453
55998B30453m004l137l347l075j845j062j244j105k01K33j57r6P31J039O08Q21
$$ 230453 226449 223312 219965 216890 215045 213983 212739 211634 211433 211666 211509 211413 212144 213183 213791 214612
55982B14612J862K233J693J824K891L193K357K136L065L433K610K212K889L108
$$ 214612 216474 218707 220400 222224 225115 228308 230665 232801 235866 239299 241909 244121 247010 250118
55968B50118K272J853K348K199R70L90J052J320O44O53J776K180J338J178K340
$$ 250118 252390 254243 256591 258790 259760 260150 261202 262522 263166 263819 265595 267775 269113 270291 272631
55953B72631K872K013J679K672L133K277K000L107L681K893K664L819M420L671
$$ 272631 275503 277516 279195 281867 285000 287277 289277 292384 296065 298958 301622 305441 309861 313532
55939C13532L582M916N497M446M014N216N852M921M691O200P058O088N694P118
$$ 313532 317114 322030 327527 331973 335987 341203 347055 351976 356667 362867 369925 376013 381707 388825
55925C88825P894O626N772O896P762O914O615Q219R286Q398Q088R900J1286J0597
$$ 388825 396719 403345 409117 416013 423775 430689 437304 445523 454809 463207 471295 481195 492481 503078
55911E03078J0297J1965J3070J2129J1883J3912J5295J4347J4143J6587J8555
$$ 503078 513375 525340 538410 550539 562422 576334 591629 605976 620119 636706 655261
55900F55261J7969J7910K0474K2462K1633K1217K3544K5381K4463K4327K7531
$$ 655261 673230 691140 711614 734076 755709 776926 800470 825851 850314 874641 902172
55889I02172L0536L0674L1476L5556L9163L9616M0946M6081N0869N2307N4831
$$ 902172 932708 963382 994858 1030414 1069577 1109193 1150139 1196220 1247089 1299396 1354227
55878A354227O1656O8129P0933P5227Q4860R4552J00185J07354J20657J34554
$$ 1354227 1415883 1484012 1554945 1630172 1715032 1809584 1909769 2017123 2137780 2272334
55868B272334J44582J57140J77647K00106K19827K44720K81647L24274L68148
$$ 2272334 2416916 2574056 2751703 2951809 3171636 3416356 3698003 4022277 4390425
55859D390425M24218N02382N96464P02302Q34472J006356J212349J452378J754356
$$ 4390425 4814643 5317025 5913489 6615791 7450263 8456619 9668968 11121346 12875702
55850A2875702K147604K638806L245462M021058M996054O109158P228711Q178582
$$ 12875702 15023306 17662112 20907574 24928632 29924686 36033844 43262555 51441137
55842E1441137Q646322Q128372O193390K952147p98600m032719o132673p096685
$$ 51441137 60087459 68215831 74409221 77361368 76562768 72530049 66397376 59300691
55834E9300691p252299o918083o312726n600095m890073m220066l593646l027528
$$ 59300691 52048392 45130309 38817583 33217488 28327415 24107349 20513703 17486175
55826A7486175k540185k125018j766411j464901j223977j029593q64061p26129
$$ 17486175 14945990 12820972 11054561 9589660 8365683 7336090 6472029 5745900
55818E745900o19429n34576m59460l95285l46950l08164k70244k35865k10807
$$ 5745900 5126471 4591895 4132435 3737150 3390200 3082036 2811792 2575927 2365120
55809B365120j90914j69454j49105j35088j24002j10308r6839q8570q2557p3802
$$ 2365120 2174206 2004752 1855647 1720559 1596557 1486249 1389410 1300840 1218283 1144481
55799A144481o4849o0288n7541n2036m5969m3437m2094l7851l2931l1352l1054
$$ 1144481 1079632 1019344 961803 909767 863798 820361 778267 740416 707485 676133 645079
55788F45079k8143k4493k3765k4059k1701j8345j7410j7187j4377j0828j0233
$$ 645079 616936 592443 568678 544619 522918 504573 487163 469976 455599 444771 434538
55777D34538j1368j0962j0082j1484j3649j3523j2320j2870j3899j2622j0352
$$ 434538 423170 412208 402126 390642 376993 363470 351150 338280 324381 311759 301407
55766C01407r996j0522r263p321p366q352p615o013o018o770n944m507m787n784
$$ 301407 291411 280889 271626 264305 256939 248587 240972 234959 228941 222171 216227 211720 206933 201149
55752B01149n082l578l665m537l861k433k614l759l610k714l139m236l934k858
$$ 201149 196067 192489 188824 184287 180426 177993 175379 171620 168010 165296 162157 157921 153987 151129
55738A51129l050l894l380k130k163k897k346j105j230k203j939p69o73j411j166
$$ 151129 148079 144185 140805 138675 136512 133615 131269 130164 128934 126731 124792 124023 123350 121939 120773
55723A20773j75r7o13j49P89M59o76p29J07J42m40q8R36J089N98R03J655J370
$$ 120773 120598 120501 119888 119739 120528 120987 120311 119582 119689 119831 119391 119303 120239 121328 121926 122829 124484 125854
55705A25854M35L88Q47K04j202j662j298j663k642k751k088k064k582k315j502
$$ 125854 126289 126677 127524 127728 126526 124864 123566 121903 119261 116510 114422 112358 109776 107461 105959
55690A05959j547k227k001q87k98l35Q5P25K63j084j794j641j677j901j400n35
$$ 105959 104412 102185 100184 99297 98999 98664 98749 99474 99737 98653 96859 95218 93541 91640 90240 89705
55674H9705n28j126j060m99o80j422j487j059j392k251k245j451j252j684j456
$$ 89705 89177 88051 86991 86492 85812 84390 82903 81844 80452 78201 75956 74505 73253 71569 70113
55659G0113n34k16o75p54k55j24m12k29K31r1j000j264r25j137j810j689p66l49
$$ 70113 69579 69363 68688 67934 67679 67555 67143 66914 67145 67054 66054 64790 63865 62728 60918 59229 58463 58114
55641E8114o61n98JR5m27n08J3J44k57k48K24K10l17l48J65K27k03j26M28L40
$$ 58114 57453 56855 56856 56951 56524 56016 56029 56173 55916 55668 55892 56102 55785 55437 55602 55829 55626 55500 55928 56268
55621E6268m63p75k95l3l06l04P3o4p35q48k14P9k91l73J61M33J27M7M68O18K40
$$ 56268 55805 55030 54735 54702 54396 54092 54165 54101 53366 52518 52304 52383 52092 51719 51880 52313 52440 52487 52955 53573 53813
55600E3813Q0L55L85O1J02N38M91j42m25j03M1k09j13M66P16M56M49Q64R50N87
$$ 53813 53893 54248 54633 54694 54796 55334 55825 55683 55258 55155 55196 54987 54874 55340 56056 56512 56961 57825 58775 59362
55580E9362N46R18Q86L84L47R52J236Q51N79O96N16p6k17K73M73Q3l1M68P48M38
$$ 59362 59908 60826 61712 62096 62443 63395 64631 65482 66061 66757 67273 67197 66980 67253 67726 67809 67778 68246 68994 69432
55560F9432K83O05O40P2l12j53k50j039j755j792j635j718j659j286j183j568
$$ 69432 69715 70320 70960 71032 70720 70567 70317 69278 67523 65731 64096 62378 60719 59433 58250 56682
55544E6682j794j518j245j205r25l72k51o62p68k85nk85m20l8K00o5j90J92M29
$$ 56682 54888 53370 52125 50920 49995 49623 49372 48710 47942 47657 47652 47367 46947 46909 47109 47044 46854 47046 47475
55525D7475J17j80p1m9l74m87j45k4m67q16o36m42n83n63j19J38j28l29j02K1
$$ 47475 47592 47412 47341 47292 46918 46431 46286 46262 45795 44979 44343 43901 43318 42755 42636 42774 42646 42317 42215 42236
55505D2236k66l96r0j9n55r98p68l38k43j81J42K96jk38o5P2j35k21R5L06J23
$$ 42236 41970 41574 41484 41465 40910 39912 39144 38806 38563 38382 38524 38820 38819 38581 38516 38588 38453 38232 38327 38633 38756
55484C8756N9L95N50J90q9J43L69J75N0L98P28N94M05N55O43L19J1J02K44J76
$$ 38756 38815 39210 39760 39950 39861 40004 40373 40548 40598 40996 41724 42318 42723 43278 43921 44240 44251 44353 44597 44773
55464D4773L03P57R04M36L1J64K78j17n05l76j92m59p88p11n88p86q30k77L48
$$ 44773 45076 45833 46737 47173 47204 47368 47646 47529 47024 46648 46456 45997 45209 44498 43910 43124 42294 42017 42365
55445D2365M61L85N94P46M03oR6M06L40N7k0n6l42n69m05j95l68o57o73o34q10
$$ 42365 42826 43211 43805 44551 44954 44948 45044 45450 45790 45847 45827 45771 45429 44860 44455 44260 43892 43235 42562 41928 41118
55424D1118q82n82l20m61o18l98j51k84m53k58pq8j97K0K06k9l42l07j93l26l73
$$ 41118 40236 39654 39334 38873 38255 37857 37706 37422 36969 36711 36704 36616 36419 36439 36645 36616 36274 35967 35774 35448 35075
55403C5075l6K16n9m10k59J03J30J8J79L80K32NQ9J98m3k92j14J53K5k12o3K14
$$ 35075 35039 35255 35196 34786 34527 34630 34760 34778 34957 35337 35569 35574 35663 35861 35818 35526 35412 35565 35590 35378 35315 35529
55381C5529J25j22p9M9j49m18k98oj2j73j16nj38k05J28M40K05k45k78k8qj24
$$ 35529 35654 35532 35453 35502 35353 34935 34637 34631 34619 34446 34330 34325 34187 33982 34110 34550 34755 34510 34232 34204 34196 34072
55359C4072PJ68l8l52k77l2j15l24j50K16K07o7n2K24L07K30L71O20N53K65J82
$$ 34072 34079 34247 34209 33857 33580 33548 33433 33109 32959 33175 33382 33315 33263 33487 33794 34024 34395 35015 35568 35833 36015
55338C6015K12m7m88o37m97m06l17J6L47K29j67k94q7J09K20M08N21L47J34K01
$$ 36015 36227 36180 35692 35055 34558 34152 33835 33851 34198 34427 34260 33966 33879 33988 34208 34616 35137 35484 35618 35819
55318C5819L28J77JJ71M06K39j02r8R7Mk37j37J84K06l2q7K5m9k09j00Q4q7m12
$$ 35819 36147 36324 36325 36496 36902 37141 37039 36941 37038 37042 36805 36668 36852 37058 37026 36939 36964 36915 36706 36606 36690 36603 36191
55295C6191l53j9K5k23k89j49j99l88l08j2R9J05L64O54M24j40k93L9J74j41l79
$$ 36191 35838 35819 35844 35621 35332 35183 34984 34596 34288 34276 34375 34480 34844 35498 35922 35782 35489 35528 35702 35561 35182
55274C5182k19L8J42K52L96L39J02k4m5k13m20l13pM5j71k15j4Q1J2O0J95Q9j81
$$ 35182 34963 35001 35143 35395 35791 36130 36232 36208 36163 35950 35530 35217 35210 35255 35084 34869 34855 34936 34948 35008 35203 35292 35111
55251C5111j90M3P3j68k83j76j80l50l68k01j67k74j80J45L47L34L56L93J60k20
$$ 35111 34921 34964 35037 34869 34586 34410 34230 33880 33512 33311 33144 32870 32690 32835 33182 33516 33872 34265 34425 34205
55231C4205k63O9K74J23q3j19j15j30p9r2l52n94l72J85N04M43L67M07L41K07
$$ 34205 33942 34011 34285 34408 34325 34206 34091 33961 33882 33790 33438 32844 32472 32657 33161 33604 33971 34378 34719 34926
55211C4926L05N12L95j7k38j91k81n49n45j72J11N7n3q3k26m21k64K46N65M27
$$ 34926 35231 35743 36138 36121 35883 35692 35411 34862 34317 34145 34256 34313 34260 34177 33951 33530 33266 33512 34077 34504
55191C4504J87J42J22R%J54K15R7L7Q9J7k23l61l31l52m14k98q6r9k58j79Q9R1
$$ 34504 34691 34833 34955 34964 34964 35118 35333 35430 35467 35556 35573 35350 34989 34658 34306 33892 33594 33508 33409 33151 32972 33061 33152
55168C3152j86k57OJ78Q5O6K30K03j08k48K2L19L18J94J26%j62q4K13L07Q8l5
$$ 33152 32966 32709 32715 32893 32978 33044 33274 33477 33369 33121 33143 33462 33780 33974 34100 34100 33938 33854 34067 34374 34462 34427
55146C4427J45K95J72J0j0q3k83l25r7R5P6O2J40P3j66k36k5J12Nq2n1j97n46
$$ 34427 34572 34867 35039 35049 35039 34956 34673 34348 34251 34346 34422 34484 34624 34697 34531 34295 34270 34382 34387 34305 34254 34057 33511
55123C3511o24k18K31L44K94K93J59j90m03k70p0j2J45N12O79L53j12k43j28o8
$$ 33511 32887 32669 32900 33244 33538 33831 33990 33800 33397 33127 33057 33045 33190 33702 34381 34734 34622 34379 34251 34183
55103C4183l6R0J40l2k00j12Q2J06pq8j27j50m8J54K15N9l9P5J79Q5o3q0j0Q3
$$ 34183 34147 34237 34377 34345 34145 34033 34115 34221 34214 34126 33999 33849 33801 33955 34170 34229 34190 34265 34444 34529 34466 34386 34376 34459
55079C4459K32L30J64j53k23K8K26J54N8R8Q3q4j72r0o7j75j47Q1J72rj45m6M4
$$ 34459 34691 35021 35185 35032 34809 34837 35063 35217 35275 35373 35456 35372 35200 35110 35043 34868 34721 34802 34974 34965 34820 34774 34818
55056C4818jP2L43M34J65p6L4K23J45n3j09r6j28o5J40K17J6k04k45k95m18l30
$$ 34818 34817 34889 35232 35666 35831 35755 35789 36012 36157 36104 35995 35899 35771 35706 35846 36063 36079 35875 35630 35335 34917 34587
55034C4587M6K64N4k10j19J36J92J41K29L37K53Q4pj34l48l70o6K08J22j11j68
$$ 34587 34633 34897 34951 34741 34622 34758 34950 35091 35320 35657 35910 35994 35987 35853 35505 35135 35069 35277 35399 35288 35120
55013C5120j39k06j94P8L59L57K04J56J26k7j14M6K29J84P2J26J95Q3l0R3K86
$$ 35120 34981 34775 34581 34659 35018 35375 35579 35735 35861 35834 35720 35766 35995 36179 36251 36377 36572 36655 36625 36718 37004
54992C7004K68J52J64K28J54L1Rpp4K1L43N17K72o8o9J72K92K52K04R3j58l03
$$ 37004 37272 37424 37588 37816 37970 38001 38010 38003 37929 37950 38293 38810 39082 39014 38945 39117 39409 39661 39865 39958 39800 39497
54970C9497j32J47K10J17P7M6o6j00N1J43kj63j37j35l17l65n3K31K8m01n02k54
$$ 39497 39365 39512 39722 39839 39916 39962 39896 39796 39847 39990 39988 39825 39688 39553 39236 38871 38818 39049 39077 38676 38174 37920
54948C7920o1k0N9J37N2o7J5J63R5j25k61l43m83m93j83J67J98M2M6J41N6j01
$$ 37920 37859 37839 37898 38035 38087 38020 38035 38198 38293 38168 37907 37564 37081 36588 36405 36572 36770 36812 36858 36999 37055 36954
54926C6954l6J25M2j92k04NR6M1R4K44K17j0j67j73j71j52QJ89J40p8j82j33q7
$$ 36954 36918 37043 37085 36893 36689 36694 36790 36831 36925 37169 37386 37376 37209 37036 36865 36713 36721 36910 37050 36972 36790 36657 36570
54903C6570l9J01J90N6j38j11L3K4p1PJ75J21r6j51kJ01J06J81K63J12k00l19
$$ 36570 36531 36632 36822 36878 36740 36629 36662 36686 36615 36622 36797 36918 36822 36671 36669 36770 36876 37057 37320 37432 37232 36913
54881C6913j28J45L25M08L20J3k51j50K10L99K58mk25l68l18K4M29N43L83K65
$$ 36913 36785 36930 37255 37663 37983 37996 37745 37595 37805 38204 38462 38458 38233 37865 37547 37571 38000 38543 38926 39191
54861C9191K99L36L14K79J61j01k82j30J94L15K09J31J36O1n1RJ86K41J65J52
$$ 39191 39490 39826 40140 40419 40580 40479 40197 40067 40261 40576 40785 40916 41052 41113 41062 41071 41257 41498 41663 41815
54841D1815J85R4k8J12M99Q10Q85Q66Q72R09J074J439J809J926J840J766J628
$$ 41815 42000 42094 42066 42178 42677 43487 44372 45238 46110 47019 48093 49532 51341 53267 55107 56873 58501
54824E8501J200N60Nm11q62j320j585j649j659j602j394j207j231j289j072o61
$$ 58501 59701 60261 60266 59855 58993 57673 56088 54439 52780 51178 49784 48577 47346 46057 44985 44324
54808D4324l71k45j16m0j74k94q4K66K90J1j03P4K02J76K99O73R78J003R38R61
$$ 44324 43953 43708 43592 43552 43378 43084 43000 43266 43556 43567 43464 43538 43740 43916 44215 44888 45866 46869 47807 48768
54788D8768J028J152J458J870K058J882J476R58L50k01n29p54j088j399j412j241
$$ 48768 49796 50948 52406 54276 56334 58216 59692 60650 61000 60799 60270 59516 58428 57029 55617 54376
54772E4376j259j436j419j181j050j109j097r53q88q69o12j91k3j57k02n7q7l88
$$ 54376 53117 51681 50262 49081 48031 46922 45825 44872 43984 43115 42503 42312 42289 42132 41930 41873 41786 41398
54754D1398n29k75j7r6k91k76j67j99k56j40N8J08J3q2j16p1O6J85J01j36k85
$$ 41398 40869 40594 40577 40481 40190 39914 39747 39548 39292 39152 39210 39318 39331 39249 39133 39062 39128 39313 39414 39278 38993
54733C8993k60k10k19k23k51l78m39k20J31K33P9K6J55J81L6L7K85M46K97M5r6
$$ 38993 38733 38523 38304 38081 37830 37452 37013 36793 36924 37157 37236 37262 37417 37598 37634 37671 37956 38402 38699 38744 38648
54712C8648j72j98j5L16M50K75J03J48K30J88J59K29K09Pj77j98j71j39L7K94
$$ 38648 38476 38278 38263 38579 39029 39304 39407 39555 39785 39973 40132 40361 40570 40577 40400 40202 40031 39892 39929 40223
54692D0223L05L5j03J13L61L32K45M10P23Q90R03R49J081J264J494J694J741J740
$$ 40223 40528 40563 40460 40573 40934 41266 41511 41921 42644 43534 44437 45386 46467 47731 49225 50919 52660 54400
54674E4400J962K334K403J992J505J321J295J130Q66O68M50P1l60o68q99j076
$$ 54400 56362 58696 61099 63091 64596 65917 67212 68342 69208 69876 70326 70397 70037 69369 68470 67394
54658F7394j033p13m65o56j197j704j978k054j992j841j698j593j422j128q15
$$ 67394 66361 65648 65183 64527 63330 61626 59648 57594 55602 53761 52063 50470 49048 47920 47105
54643D7105n66l47j42qR6K85N21O80Q32J152J535J666J543J499J631J626J282
$$ 47105 46539 46192 46050 46042 46138 46423 46944 47624 48456 49608 51143 52809 54352 55851 57482 59108 60390
54626F0390P84L01k46q45j242j353j441j642j755j654j512j417j170p49n04o23
$$ 60390 61174 61475 61229 60384 59142 57789 56348 54706 52951 51297 49785 48368 47198 46449 45945 45322
54610D5322q13p93o87o52n34k33op5k33k24j69k35k80j45J3K5K0J20J14j50l94
$$ 45322 44509 43716 43029 42377 41843 41610 41604 41529 41296 41072 40903 40668 40388 40243 40256 40281 40301 40421 40535 40385 39991
54589C9991l20r2m2j58k07j69j26k3J59K01m2l48m64m59m69l76r0J48J17J1J12
$$ 39991 39671 39579 39537 39379 39172 39003 38877 38854 39013 39214 39172 38824 38360 37901 37432 37056 36966 37114 37231 37242 37354
54568C7354L09L17J62N0Nn2j1J97L26J30k06l10j65j5L6N9N3j8m5O0J69J56J20
$$ 37354 37663 37980 38142 38192 38197 38145 38134 38331 38657 38787 38581 38271 38106 38091 38127 38186 38239 38221 38176 38236 38405 38561 38681
54545C8681J59J56Rj22j05r5k26l16j85LK8LJ13K37J78N2O5J21M2q5r1q0k02k97
$$ 38681 38840 38996 39005 38883 38778 38683 38457 38141 37956 37959 37987 37990 38103 38340 38518 38570 38635 38756 38798 38713 38622 38542 38340 38043
54521C8043j53J06K37K65L24L29J73K6L9J3k54n35n11k98k02j85j1K35K83J81
$$ 38043 37890 37996 38233 38498 38822 39151 39324 39350 39389 39402 39148 38613 38102 37804 37602 37417 37406 37641 37924 38105
54501C8105J85K69K25J12J59K80J79j08k55j45K0J46K81L41J56j74l56l11k10
$$ 38105 38290 38559 38784 38896 39055 39335 39514 39406 39151 39006 39026 39172 39453 39794 39950 39776 39420 39109 38899
54482C8899j43p9m7q8p4Q9K43K08J06J25J65L8q6N8L58M61L18J50j2k77n06m37
$$ 38899 38756 38677 38630 38542 38468 38557 38800 39008 39114 39239 39404 39442 39356 39414 39772 40233 40551 40701 40689 40412 39906 39469
54460C9469j36Q2J53K55L65K97J04M1J35J69J29K16M20M91L53J98J41J17Q3O4
$$ 39469 39333 39415 39568 39823 40188 40485 40589 40630 40765 40934 41063 41279 41699 42190 42543 42741 42882 42999 43082 43146
54440D3146qj75k39k4K39J81j48l60l09k02j62j13p1j49k60k07n7n2j60j37K4
$$ 43146 43138 42963 42724 42700 42939 43120 42972 42612 42303 42101 41939 41826 41755 41606 41346 41139 41082 41030 40870 40733 40757
54419D0757Q8K1K4J11R4j0L2K09K29Nj99k13j41q0M7K26L03K48J84J33pj71j57
$$ 40757 40845 40866 40890 41001 41095 41085 41117 41326 41555 41560 41361 41148 41007 40927 40974 41200 41503 41751 41935 42068 42061 41890 41733
54396D1733L1J70J80J59J26J3o8M5K13J39j40k92k01o4J5J21K25J84R1J91M19
$$ 41733 41764 41934 42114 42273 42399 42412 42344 42389 42602 42741 42601 42309 42108 42044 42059 42180 42405 42589 42680 42871 43290
54375D3290M35K04O0J36J94P8m3o3j13k36k37o9K7q9k15j66m8j4k9rK4N4Q9J6
$$ 43290 43725 43929 43989 44125 44319 44397 44354 44291 44178 43942 43705 43636 43663 43574 43359 43193 43145 43131 43102 43093 43117 43171 43260 43276
54351D3276k52n17m69j52R0J47K27L68L19J6k60l07k25j04J51M53M80J45j90k02
$$ 43276 43024 42507 42038 41886 41976 42123 42350 42718 43037 43053 42793 42486 42261 42157 42308 42761 43241 43386 43196 42994
54331D2994%J45J58O8j36l46l46j48n2k01l38k28K8K22L28L97L79K62J82K18K78
$$ 42994 42994 43139 43297 43365 43229 42883 42537 42389 42337 42136 41798 41570 41598 41820 42148 42545 42924 43186 43368 43586 43864
54310D3864K67J89M6j27j54J21M93N77L58K27L68N26M91L98L93L82K50Q3o7k74
$$ 43864 44131 44320 44366 44239 44085 44206 44699 45276 45634 45861 46229 46755 47246 47644 48037 48419 48669 48752 48685 48411
54290D8411m83m74k33l0qj4K2n4k48k92j16k6j90l30j85P8K13K91M45N65N44N38
$$ 48411 47928 47454 47221 47191 47183 47169 47191 47137 46889 46597 46481 46455 46265 45935 45750 45828 46041 46332 46777 47342 47886 48424
54268D8424O96Q69R03R23J048J105R03N62K82N8j32j35Q6K00n6m89p68r12j090
$$ 48424 49120 49989 50892 51815 52863 53968 54871 55433 55715 55773 55641 55506 55592 55792 55736 55247 54479 53567 52477
54249E2477j199j033p22n70n80m95k61p3oM9J30J56J31J41J35m3l81o52o47l90
$$ 52477 51278 50245 49523 48953 48373 47878 47617 47544 47538 47587 47717 47873 48004 48145 48280 48237 47856 47204 46557 46167
54229D6167q4P1M6RJ16K72K39K0j16n1lj63m06n20n03m30k70n1O4K6N2K71M39
$$ 46167 46083 46154 46200 46209 46325 46597 46836 46856 46740 46689 46686 46523 46117 45597 45094 44664 44394 44343 44407 44433 44485 44756 45195
54206D5195K79o4k34j52l7k8o7r6j29j36p6j5m2j12j13l8O8J99L45L88K29m5k43
$$ 45195 45474 45410 45176 45024 44987 44959 44892 44796 44667 44531 44455 44440 44398 44286 44173 44135 44203 44402 44747 45135 45364 45319 45076
54183D5076k68j40M9J81J74Q0M6Q8Q5J6jR0J88K57L95N82O02L60P2KJ38L01L54
$$ 45076 44808 44668 44717 44898 45072 45152 45198 45286 45371 45387 45386 45476 45664 45921 46316 46898 47500 47860 47932 47934 48072 48373 48727
54160D8727K67Q0n7l2M1n9k81l33j30N7L5m6k9l1j91l62l32j48K5J31J54N5j02
$$ 48727 48994 49074 49017 48985 49026 48967 48686 48353 48223 48280 48315 48269 48240 48209 48018 47656 47324 47176 47201 47332 47486 47541 47439
54137D7439j04Q5K37J95J00R2Q8Rj9N2K4j92l45k25k5k2j29p0J56L00K65J32m4
$$ 47439 47335 47420 47657 47852 47952 48044 48132 48141 48122 48174 48198 48006 47661 47436 47411 47389 47260 47190 47346 47646 47911 48043 47999
54114D7999k25k91j69OP3M4lp4j65j78r6n0o3LJ44J27q8j93jK02J04j69l13l02
$$ 47999 47774 47483 47314 47320 47393 47437 47434 47360 47195 47017 46921 46871 46808 46811 46955 47082 46994 46801 46800 47002 47106 46937 46624 46322
54090D6322k49p7K41M35K80K5O1L12L82J68o9j63k09k84l35l35k84j32Q5J49l8
$$ 46322 46073 45996 46237 46672 46952 46977 47038 47350 47732 47900 47831 47668 47459 47175 46840 46505 46221 46089 46174 46323 46285
54069D6285k24j49K2m5l25m94m21k77k00j58j13p9k0P4J09L2k0N5J38J08P0J46
$$ 46285 46061 45912 45934 45889 45564 45070 44649 44372 44172 44014 43901 43822 43802 43876 43985 44017 43997 44052 44190 44298 44368 44514
54047D4514K21J74J39K53L68L02J58J24J46J20J90M77P34P10O06P41R73R25O74
$$ 44514 44735 44909 45048 45301 45669 45971 46129 46253 46399 46519 46709 47186 47920 48630 49236 49977 50950 51875 52549
54028E2549O45R38J219J270J194J053P44L61J74K67M34N47O66Q11Q85Q51P13L63
$$ 52549 53194 54132 55351 56621 57815 58868 59612 59973 60147 60414 60848 61395 62061 62872 63757 64608 65321 65684
54010F5684k60r08j275j402j551j726j703j454j181r50o74m02k76k40j37n8j91
$$ 65684 65424 64516 63241 61839 60288 58562 56859 55405 54224 53274 52600 52198 51922 51682 51545 51487 51296
53993E1296m14m12j88l0j3K6O8p4l21l61j77n7p0J2J93J73q0j83M2K62J81l6j00
$$ 51296 50882 50470 50282 50252 50239 50265 50333 50259 49938 49577 49400 49343 49273 49285 49478 49651 49571 49388 49430 49692 49873 49837 49737
53970D9737k9J5L6Q7J15J16J94L19L01R9n7l7Pl6l8J05K56K82K49K22J46M9J03
$$ 49737 49708 49723 49759 49846 49961 50077 50271 50590 50891 50990 50933 50896 50903 50867 50829 50934 51190 51472 51721 51943 52089 52138 52241
53947E2241L44N34N26N09O87R54J084J064J043J074J076R90Q35P22Q03J107J413
$$ 52241 52585 53119 53645 54154 54841 55795 56879 57943 58986 60060 61136 62126 62961 63683 64486 65593 67006
53930F7006J465J286J089R38P58O23P16R55J033Q59O86O18M51J23o0R5L24K71
$$ 67006 68471 69757 70846 71784 72542 73165 73881 74836 75869 76728 77414 78032 78483 78606 78546 78641 78965 79236
53912G9236j5k42l51m94p10q98j046j260j541j705j584j244r34q43q72p41m04
$$ 79236 79221 78979 78628 78134 77424 76526 75480 74220 72679 70974 69390 68146 67212 66369 65497 64756 64352
53895F4352j77l14o22p57o93o38n58k21K93N93N30L88M03M97O04Q60J318J804
$$ 64352 64175 63861 63239 62482 61789 61151 60593 60372 60665 61258 61788 62176 62579 63076 63680 64540 65858 67662
53877F7662K238K778L375L539K856J486k0j265k130k585k681k558k312j939j510
$$ 67662 69900 72678 76053 79592 82448 83934 83914 82649 80519 77934 75253 72695 70383 68444 66934
53862F6934j236j204j216j055p27l60l2J94K25J01j4p2k02l87l99j48J29K12J83
$$ 66934 65698 64494 63278 62223 61496 61136 61104 61298 61523 61624 61610 61538 61336 60949 60550 60402 60531 60743 60926
53843F0926K30L60N38Q57J311J644J613J341J144J166J368J690K057K271K182
$$ 60926 61156 61516 62054 62911 64222 65866 67479 68820 69964 71130 72498 74188 76245 78516 80698
53828H0698J864J553J425J528J813K120K234K094J811J481J068O10K84K31M37
$$ 80698 82562 84115 85540 87068 88881 91001 93235 95329 97140 98621 99689 100299 100583 100814 101251
53813A01251Q66J514K194K553K395J871J244O62K15rr3k90o67j000j104j112j199
$$ 101251 102117 103631 105825 108378 110773 112644 113888 114550 114765 114756 114663 114373 113706 112706 111602 110490 109291
53796A09291j283j219j075j009j009r83r72j069j220j323j421j606j836j972j983
$$ 109291 108008 106789 105714 104705 103696 102713 101741 100672 99452 98129 96708 95102 93266 91294 89311
53781H9311j945j901j845j767j656j493j321j189j062q63o69o60q21r42r28r01
$$ 89311 87366 85465 83620 81853 80197 78704 77383 76194 75132 74269 73600 72940 72119 71177 70249 69348
53765F9348r15q38o44n40o17o77n54m19m77o28o54n56n00n02m59l82l55l62l15
$$ 69348 68433 67595 66951 66411 65794 65117 64563 64144 63667 63039 62385 61829 61329 60827 60368 59986 59631 59269 58954
53746E8954k31j99k25k26j45MJ41J60K4j28j30l9k8q0NK24L28K12R8J36J76Q8
$$ 58954 58723 58524 58299 58073 57928 57932 58073 58233 58257 58129 57999 57960 57932 57852 57857 58081 58409 58621 58719 58855 59031 59119
53724E9119QO4J06l1k05j92m4M3L5K8L5K5L5Q9J30J66L16N72P33P27P51R39J125
$$ 59119 59127 59191 59297 59266 59061 58869 58825 58868 58903 58931 58966 58991 59026 59115 59245 59411 59727 60299 61032 61759 62510 63449 64574
53701F4574J161J202J417J657J717J685J722J708J435J020P50O54N49M33M59N85
$$ 64574 65735 66937 68354 70011 71728 73413 75135 76843 78278 79298 80048 80702 81251 81684 82143 82728
53685H2728N77L59J06o8k12l60m58n13o10p67r11r97j052j112j202j319j359j203
$$ 82728 83305 83664 83770 83702 83490 83130 82672 82159 81549 80782 79871 78874 77822 76710 75508 74189 72830 71627
53667G1627r18p51p99q57p53o05o06o95o99o29o10o37o26n71n29m83m02l38k98
$$ 71627 70709 69958 69159 68302 67549 66944 66338 65643 64944 64315 63705 63068 62442 61871 61342 60859 60457 60119 59821
53648E9821j98o1o0k33l44k29n2k5q2o3k6j05k12j98j20p6K0K64M87M59K48P3
$$ 59821 59623 59562 59502 59269 58925 58696 58644 58619 58537 58474 58448 58343 58131 57933 57813 57737 57757 58021 58508 58967 59215 59288
53626E9288l2j52k26j74j22j90j98Q1M87O53N22L55K95K46J70J42J51J29J47L13
$$ 59288 59256 59104 58878 58704 58582 58392 58194 58275 58762 59415 59937 60292 60587 60833 61003 61145 61296 61425 61572 61885
53606F1885N31O48P59J042J348J343R92N98L32R3j69l01k36j10%J69M21O23O79
$$ 61885 62416 63064 63823 64865 66213 67556 68548 69146 69478 69571 69402 69101 68865 68755 68755 68924 69345 69968 70647
53587G0647O35N37L95L09M12O45P89P36O02N27N21N08M21K38N1PJ19K09J65J00
$$ 70647 71282 71819 72214 72523 72935 73580 74369 75105 75707 76234 76755 77263 77684 77922 77973 77980 78099 78308 78473 78573
53567G8573J18J14j0j08k9Q9J1k23l88m00l11r5K18L96K65N1O9K34K06n8k70k77
$$ 78573 78691 78805 78795 78687 78658 78747 78758 78535 78147 77747 77436 77341 77559 77955 78220 78271 78340 78574 78780 78722 78452 78175
53545G8175j84k7K27M56M62L52M13O34P00M99K90K85M22N99Q11R93J026R81J058
$$ 78175 77991 77964 78191 78647 79109 79461 79874 80508 81208 81707 81997 82282 82704 83303 84114 85107 86133 87114 88172
53526H8172J242J307J188J061R92Q02M13lk99n01o40o50n59m90m36k70k6Q0j5
$$ 88172 89414 90721 91909 92970 93962 94764 95177 95174 94875 94374 93734 93084 92525 92035 91599 91329 91303 91383 91368
53507I1368j17n8J32L74O29P93P70O75P03Q44R00Q27P54P03N75M57N31P32P63
$$ 91368 91251 91193 91325 91699 92328 93121 93891 94566 95269 96113 97013 97840 98594 99297 99872 100329 100860 101592 102355
53488A02355N80M31M24L38M1k73l84l04j44K7R9l6k75l79l23l05l78l67k26j31
$$ 102355 102935 103366 103790 104128 104169 103896 103512 103208 103064 103091 103190 103154 102879 102500 102177 101872 101494 101127 100901 100770
53468A00770j56j85j93l24n28n54l59k26l15m32m08l50l82m04l19k09j23M3K73
$$ 100770 100614 100429 100236 99912 99384 98830 98471 98245 97930 97498 97090 96740 96358 95954 95635 95426 95303 95346 95619
53449I5619L43J43j12k22k08j44RJ89K24J31J41L05L69K22J14K15L15J99L8J04
$$ 95619 95962 96105 95993 95771 95563 95419 95428 95617 95841 95972 96113 96418 96787 97009 97123 97338 97653 97852 97890 97994
53429I7994L61O06P81R24R77R16Q88J037J328J692K087K367K328K068J983K221
$$ 97994 98355 98961 99742 100666 101643 102559 103447 104484 105812 107504 109591 111958 114286 116354 118337 120558
53413A20558K450K394K235K249K358K366K358K520K789K978L081L204L340L483
$$ 120558 123008 125402 127637 129886 132244 134610 136968 139488 142277 145255 148336 151540 154880 158363
53399A58363L756M178M502M559M525M627M763M751M676M682M660M457M251M318
$$ 158363 162119 166297 170799 175358 179883 184510 189273 194024 198700 203382 208042 212499 216750 221068
53385B21068M563M644M471M269M180M163M189M260M283M166M024M008M052M004
$$ 221068 225631 230275 234746 239015 243195 247358 251547 255807 260090 264256 268280 272288 276340 280344
53371B80344L923L976M117M165M104M049L936L582L008K452K054J729J391J044
$$ 280344 284267 288243 292360 296525 300629 304678 308614 312196 315204 317656 319710 321439 322830 323874
53357C23874O57J45m76j096j659k145k475k551k421k269k258k447k775l047l093
$$ 323874 324531 324676 324200 323104 321445 319300 316825 314274 311853 309584 307326 304879 302104 299057 295964
53342B95964l015l126l509l826l799l615l627l816l881l736l566l455l263k921
$$ 295964 292949 289823 286314 282488 278689 275074 271447 267631 263750 260014 256448 252993 249730 246809
53328B46809k518k115j654j158p70n48m05k48p7R2K64M17N10N60O19P28R31J245
$$ 246809 244291 242176 240522 239364 238594 238046 237641 237393 237316 237408 237672 238089 238599 239159 239778 240506 241437 242682
53310B42682J574J765J873K144K650L110L297L381L662M085M365M429M493M703
$$ 242682 244256 246021 247894 250038 252688 255798 259095 262476 266138 270223 274588 279017 283510 288213
53296B88213N036N481O060O653P097P427P824Q322Q779R145R513R916J0265J0549
$$ 288213 293249 298730 304790 311443 318540 325967 333791 342113 350892 360037 369550 379466 389731 400280
53282D00280J0838J1130J1345J1492J1652J1808J1850J1772J1642J1428J1016
$$ 400280 411118 422248 433593 445085 456737 468545 480395 492167 503809 515237 526253
53271E26253J0449R905R452Q977Q431P918P478O982O303N492M650L789K808J613
$$ 526253 536702 546607 556059 565036 573467 581385 588863 595845 602148 607640 612290 616079 618887 620500
53257F20500J81j393k942m346n620o796p813q601r189r601r780r740r701r879
$$ 620500 620681 619288 616346 612000 606380 599584 591771 583170 573981 564380 554600 544860 535159 525280
53243E25280j0166j0256j0024r623r196q732q221p824p707p850q071q212q244
$$ 525280 515114 504858 494834 485211 476015 467283 459062 451238 443531 435681 427610 419398 411154
53230D11154q221q142p902p435o898o519o289n928n295m621m171l877l486k973
$$ 411154 402933 394791 386889 379454 372556 366037 359748 353820 348525 343904 339733 335856 332370 329397
53216C29397k578k450k559k859l326l822m130m179m108m049l993l849l569l184
$$ 329397 326819 324369 321810 318951 315625 311803 307673 303494 299386 295337 291344 287495 283926 280742
53202B80742k786k448k136j729j213p74n74n65n95n69m37j21L57Q21J179J539
$$ 280742 277956 275508 273372 271643 270430 269656 269082 268517 267922 267353 266916 266795 267152 267973 269152 270691
53186B70691K007K446K710K907L263L775M269M666M992N194N190N059M922M742
$$ 270691 272698 275144 277854 280761 284024 287799 292068 296734 301726 306920 312110 317169 322091 326833
53172C26833M462M218M165M132L808L192K600K167J714J082L84k45q39j469k095
$$ 326833 331295 335513 339678 343810 347618 350810 353410 355577 357291 358373 358757 358512 357673 356204 354109
53157C54109k662l161l578l875m136m479m868n148n318n542n872o123o133n965
$$ 354109 351447 348286 344708 340833 336697 332218 327350 322202 316884 311342 305470 299347 293214 287249
53143B87249n786n667n563n399n085m638m229m072m174m367m531m708m924n094
$$ 287249 281463 275796 270233 264834 259749 255111 250882 246810 242636 238269 233738 229030 224106 219012
53129B19012n140n063m899m631m280l929l659l470l289l001k558k062j705j547
$$ 219012 213872 208809 203910 199279 194999 191070 187411 183941 180652 177651 175093 173031 171326 169779
53115A69779j493j503j665j947k099k015k003k379k963l252l100k886k961l245
$$ 169779 168286 166783 165118 163171 161072 159057 157054 154675 151712 148460 145360 142474 139513 136268
53101A36268l425l331l016k628k324k183k154k113k032j956j926j957k066k204
$$ 136268 132843 129512 126496 123868 121544 119361 117207 115094 113062 111106 109180 107223 105157 102953
53087A02953k249k196k221k406k520k305j865j513j355j250j144j143j243j288
$$ 102953 100704 98508 96287 93881 91361 89056 87191 85678 84323 83073 81929 80786 79543 78255
53073G8255j186r91p62n25l77l86m68m96n13n97o27m66k71k94m62m71l12k88n09
$$ 78255 77069 76078 75316 74791 74414 74028 73560 73064 72551 71954 71327 70861 70590 70296 69834 69363 69051 68763 68254
53054F8254p07o76n31m10k48qJ54J55J17J37J23qj45j75j27p0lJ2j36l61l86j18
$$ 68254 67547 66871 66340 65930 65682 65674 65828 65983 66100 66237 66360 66352 66207 66032 65905 65835 65832 65844 65708 65347 64961 64843
53032F4843J64J73l5j95j59M3L21N44N69M17K88L54N35O49O17M94L93L93M93N67
$$ 64843 65007 65180 65145 64950 64791 64834 65155 65699 66268 66685 66973 67327 67862 68511 69128 69622 70015 70408 70901 71468
53012G1468M90K87P3j10k66l42l12l04m29n49m66k87k68l87l67j48oq7j88j27
$$ 71468 71958 72245 72318 72208 71942 71600 71288 70984 70555 70006 69540 69253 68985 68598 68231 68083 68077 67990 67802 67675
52992F7675rJ6MN0P1m1k25l71m27l80k20p9j30l08l44j50L7J7j18k04k28k30j75
$$ 67675 67666 67682 67686 67736 67807 67766 67541 67170 66743 66363 66143 66064 65934 65626 65282 65132 65169 65186 65068 64864 64636 64406 64231
52969F4231r6j34l05m34l91k79k12j39J3K19M29O11O41L87%j91j05J9L5P1J74
$$ 64231 64135 64001 63696 63262 62871 62592 62380 62241 62254 62473 62902 63513 64154 64541 64541 64350 64245 64264 64299 64370 64544
52948F4544J42q5k37j24N0N6j9%N3M6Q7K26K56O5p3J12L79L08q5l86m00k90j94
$$ 64544 64686 64601 64364 64240 64290 64346 64327 64327 64380 64426 64513 64739 64995 65060 64987 65099 65478 65786 65701 65315 64915 64625 64431
52925F4431q7ko8k61l36j50J88M52N08L68J61M5O6J06R3P5O9nj27j09J22L22K43
$$ 64431 64344 64342 64274 64013 63677 63527 63715 64167 64675 65043 65204 65249 65315 65421 65514 65589 65658 65653 65526 65417 65539 65861 66104
52902F6104k1k08k35k02j45l5Q8J71K67M00M54L55K28K02J92Q2l2k1K2l7q9O2
$$ 66104 66083 65875 65640 65438 65293 65258 65346 65517 65784 66184 66638 66993 67221 67423 67615 67697 67665 67644 67666 67629 67540 67602
52880F7602L27M51L95L54L98L86K40O3j7K1J34K22J47r9k92k29J4K12K78K52J19
$$ 67602 67929 68380 68775 69129 69527 69913 70153 70216 70199 70220 70354 70576 70723 70624 70332 70103 70117 70329 70607 70859 70978
52859G0978j00k28j28L6nk10k87j57k7l5q8q1o2r0j16j05j05j51j91j93j45l4
$$ 70978 70878 70650 70522 70558 70553 70343 70056 69899 69872 69837 69749 69668 69606 69516 69400 69295 69190 69039 68848 68655 68510 68476
52837F8476J30K43J90K7q9p1K8J18J32L1j27j90r6J9K8oK7N0m1j65j66r5j03j70
$$ 68476 68606 68849 69039 69066 68977 68906 68934 69052 69184 69215 69088 68898 68802 68821 68849 68843 68870 68920 68879 68714 68548 68453 68350 68180
52813F8180j44o7j38l63m85l26j0K12K26O6j42k66k32j21m1lL6Q7J64L32N75P06
$$ 68180 68036 67969 67831 67468 66983 66657 66647 66859 67085 67151 67009 66743 66511 66390 66349 66346 66382 66469 66633 66965 67540 68246
52791F8246O01M16L61L65J99j21l27k98k04k00k21j62o2j9n2j32k03j60O6L90
$$ 68246 68847 69263 69624 69989 70188 70067 69740 69442 69238 69038 68817 68655 68593 68574 68522 68390 68187 68027 68093 68483
52771F8483O24O54N17K94O8n3oJ24K13K41K37J49r0l68n12n34o16q10r68r23o67
$$ 68483 69107 69761 70278 70572 70640 70587 70581 70705 70918 71159 71396 71545 71455 71087 70575 70041 69425 68615 67647 66724 66057
52750F6057l00RQ7j22m21n27l59o6J69K39R8j85m02l97k68k06k27j87o9Rj1o8
$$ 66057 65757 65766 65853 65731 65310 64783 64424 64358 64527 64766 64864 64679 64277 63880 63612 63406 63179 62992 62923 62932 62921 62853
52728F2853j23j72j33O9L14M26M38N52P89R47R17Q08P11N59K76q4m32p25q87q41
$$ 62853 62730 62558 62425 62494 62808 63234 63672 64224 65013 65960 66877 67685 68396 68955 69231 69147 68715 67990 67103 66262
52708F6262o63n55n93o43n96m94m05l07j87q9m5l1o0j69k94l01j68l1L1Q3J74
$$ 66262 65599 65044 64451 63808 63212 62718 62313 62006 61819 61730 61685 61654 61594 61425 61131 60830 60662 60631 60662 60745 60919
52687F0919K27J81J10J49L34N51O13M33J37l5j1K0q1j46L6L38M03J50j58l14m07
$$ 60919 61146 61327 61437 61586 61920 62471 63084 63517 63654 63619 63608 63628 63547 63401 63437 63775 64178 64328 64170 63856 63449
52666F3449n72p41p56n91l23n4J08J21Q0J32K81M07M60M94N19M97M85N68O41M93
$$ 63449 62877 62136 61380 60789 60466 60412 60520 60641 60721 60853 61134 61541 62001 62495 63014 63511 63996 64564 65205 65698
52646F5698J48j06j03qpn8pJ35K62L59M58N29N03L88K47J26M8K0K0Ok0m2q6j58
$$ 65698 65846 65740 65637 65629 65622 65564 65557 65692 65954 66313 66771 67300 67803 68191 68438 68564 68612 68632 68652 68658 68638 68596 68510 68352
52622F8352k06j77j43j94k66k40j30m6K0J38K24J14j34k35o4J86K74J82L4o2l5
$$ 68352 68146 67969 67826 67632 67366 67126 66996 66950 66970 67108 67332 67446 67312 67077 67013 67199 67473 67655 67689 67627 67592
52601F7592J04K05J05j07j34J24M15M74L41J93P5p1k12k42j59o5m6r7j77k28k23
$$ 67592 67696 67901 68006 67899 67765 67889 68304 68778 69119 69312 69387 69316 69104 68862 68703 68638 68592 68495 68318 68090 67867
52580F7867j96j96k15j99j53j27j37j90l09m74n21l07O9L44L90K96J93J11N7O1
$$ 67867 67671 67475 67260 67061 66908 66781 66644 66454 66145 65671 65150 64843 64912 65256 65646 65942 66135 66246 66303 66364
52560F6364R0R1J09K22L69L70J95J7j3O6J50J91K10K26K42K15R5n9p7P3K12K17
$$ 66364 66454 66545 66654 66876 67245 67615 67810 67827 67814 67880 68030 68221 68431 68657 68899 69114 69209 69150 69073 69146 69358 69575
52538F9575K52M60O50O11N42Q30J415J821J776J435R27K04o11j127j177j057j080
$$ 69575 69827 70287 70937 71548 72090 72920 74335 76156 77932 79367 80294 80498 79887 78760 77583 76526 75446
52521G5446j181j163j018q31o03l61k57l17l51k31q8m3lJ26K28J72K2r3j40j16
$$ 75446 74265 73102 72084 71253 70650 70289 70032 69715 69364 69133 69045 69002 68999 69125 69353 69525 69547 69454 69314 69198
52501F9198K3K14K77J83J11J18O7o5n5J68L29K47J13J34J60J0j54q9R4J55J41
$$ 69198 69221 69435 69712 69895 70006 70124 70191 70126 70071 70239 70568 70815 70928 71062 71222 71232 71078 70989 71083 71238 71379
52480G1379K53M28M09J74n9j69k13j93m4J72L01L11K81K04M1j29k00k35l37m40
$$ 71379 71632 72060 72469 72643 72584 72415 72202 72009 71965 72137 72438 72749 73030 73234 73275 73146 72946 72711 72374 71934
52460G1934l97k69k37l07l03j51K3J13J22Q9K4m5r3j42k01k12j50r7j25j60r5
$$ 71934 71537 71268 71031 70724 70421 70270 70293 70406 70528 70617 70641 70596 70503 70361 70160 69948 69798 69701 69576 69416 69321
52439F9321M8J94L05L35J89r9k84j70J23L25L43K84K70L48N07O25N22K14l5l5
$$ 69321 69369 69563 69868 70203 70392 70293 70009 69839 69962 70287 70630 70914 71184 71532 72039 72664 73186 73400 73365 73330
52419G3330R6J41R3P2R8J58L41O49Q52P52M84L15K55J43j7q8p0j07k30l32m07
$$ 73330 73426 73567 73660 73732 73830 73988 74329 74978 75830 76582 77066 77381 77636 77779 77762 77674 77604 77497 77267 76935 76528
52398G6528n46p23q03p48o48n25l47j70r9j38j78j68j44j02m5m0j11j46l3J59
$$ 76528 75982 75259 74456 73708 73060 72535 72188 72018 71919 71781 71603 71435 71291 71189 71144 71104 70993 70847 70814 70973
52378G0973K98L85M70M95L82K04R0Q4J91M53P87R40Q03O09N88O05M04P8r0q6j67
$$ 70973 71271 71656 72126 72621 73003 73207 73297 73381 73572 74025 74812 75752 76555 77164 77752 78357 78761 78839 78749 78663 78496
52357G8496m08o28p23p65p70o47m14k31j66j71k23k86j97J28M40M02N3k35k83
$$ 78496 78088 77460 76737 75972 75202 74555 74141 73910 73744 73573 73350 73064 72867 72995 73435 73837 73890 73655 73372
52338G3372k46k35j59K3J34O0r1j71j55m8J63L81M44L48K41J74O3j12k47k92k75
$$ 73372 73126 72891 72732 72755 72889 72949 72858 72687 72532 72484 72647 73028 73472 73820 74061 74235 74298 74186 73939 73647 73372
52317G3372j45J85N83P72O70M88M43N55P69J047J344J638K005K429K606K236J446
$$ 73372 73227 73412 73995 74767 75437 75925 76368 76923 77692 78739 80083 81721 83726 86155 88761 90997 92443
52300I2443O69R3m67j103j590j738j627j401j090p89o89q11q84p23m61k83j65
$$ 92443 93112 93205 92738 91635 90045 88307 86680 85279 84189 83400 82711 81900 81016 80293 79832 79549 79384
52283G9384j5J10J28J07J29J57J50J88L29M75N44N92O92P99Q62R01Q91O97L09
$$ 79384 79369 79479 79607 79714 79843 80000 80150 80338 80667 81142 81686 82278 82970 83769 84631 85532 86423 87120 87429
52264H7429p1k55k74k34j30M5J56J14K5O8K41L95M48M50M86N69O39N98M28K59
$$ 87429 87358 87103 86829 86595 86465 86510 86666 86780 86805 86873 87114 87509 87957 88407 88893 89462 90101 90699 91127 91386
52244I1386K12K27J67J08K92P17J056J028P45M95M04M24M98O34Q39J083J313J441
$$ 91386 91598 91825 91992 92100 92392 93109 94165 95193 95938 96433 96837 97261 97759 98393 99232 100315 101628 103069
52226A03069J441J456J632J900K042K016J977J991J949J851J903K190K490K626
$$ 103069 104510 105966 107598 109498 111540 113556 115533 117524 119473 121324 123227 125417 127907 130533
52212A30533K715K955L283L521L644L747L827L839L879M107M533N007N392N655
$$ 130533 133248 136203 139486 143007 146651 150398 154225 158064 161943 166050 170583 175590 180982 186637
52198A86637N801N844N787N577N179M721M399M235M030L697L399L285L242L057
$$ 186637 192438 198282 204069 209646 214825 219546 223945 228180 232210 235907 239306 242591 245833 248890
52184B48890K717K333J957J588J274J063R48R23R90J045Q56L80r7k73k21k63n48
$$ 248890 251607 253940 255897 257485 258759 259822 260770 261693 262683 263728 264584 264964 264867 264594 264373 264110 263562
52167B63562r51j311j592j759j721j407q71k85J95N57R48J469J998K330K488K704
$$ 263562 262611 261300 259708 257949 256228 254821 253950 253665 253860 254417 255365 256834 258832 261162 263650 266354
52151B66354L066L374L438L342L240L146L043L015L101L137K975K722K584K553
$$ 266354 269420 272794 276232 279574 282814 285960 289003 292018 295119 298256 301231 303953 306537 309090
52137C09090K472K301K113J888J541J111P60N21K70p6m37p15r37j213j601k007
$$ 309090 311562 313863 315976 317864 319405 320516 321276 321797 322067 321991 321554 320839 319902 318689 317088 315081
52121C15081k252k258k182k244k433k538k492k477k594k640k421k086j918j918
$$ 315081 312829 310571 308389 306145 303712 301174 298682 296205 293611 290971 288550 286464 284546 282628
52107B82628j837j539j144p82m43p6K96N91P15O35M68L77M00M03L11K44K84K70
$$ 282628 280791 279252 278108 277326 276883 276807 277103 277694 278409 279044 279512 279889 280289 280692 281003 281247 281531 281801
52089B81801L4l08m71l84k21j24o9m4j06k37l23l08k74l20m44n95p58r41j128
$$ 281801 281835 281527 281056 280672 280451 280327 280258 280214 280108 279871 279548 279240 278966 278646 278202 277607 276849 275908 274780
52070B74780j247j219j047q60q18q94q88p04m58k73j13O4J57R0PQ0K24K24P6l2
$$ 274780 273533 272314 271267 270407 269589 268695 267807 267103 266645 266372 266259 266323 266480 266570 266577 266657 266881 267105 267181 267149
52050B67149mQ0J35J53R2r2l05l98l94m48n62n46l04rJ04J6r4n7J55M39O53P70
$$ 267149 267145 267225 267360 267513 267605 267513 267208 266810 266416 265968 265406 264860 264556 264547 264651 264667 264573 264516 264671 265110 265763 266533
52028B66533R31J244J621J828J767J552J342J239J279J466J716J969K283K766
$$ 266533 267464 268708 270329 272157 273924 275476 276818 278057 279336 280802 282518 284487 286770 289536
52014B89536L337L717L738L529L357L327L362L368L365L396L453L495L543L665
$$ 289536 292873 296590 300328 303857 307214 310541 313903 317271 320636 324032 327485 330980 334523 338188
52000C38188L885M114M235M242M215M203M181M123M027L863L585L259L013K857
$$ 338188 342073 346187 350422 354664 358879 363082 367263 371386 375413 379276 382861 386120 389133 391990
51986C91990K643K294J909J532J025K67n87j291j810k293k783l132l241l164l005
$$ 391990 394633 396927 398836 400368 401393 401660 401073 399782 397972 395679 392896 389764 386523 383359 380354
51971C80354k809k599k389k161j921j721j598j440j104o19j90M2J11J25J52K66
$$ 380354 377545 374946 372557 370396 368475 366754 365156 363716 362612 361993 361803 361845 361956 362081 362233 362499
51955C62499N48J014J528J903K055K104K258K601K974L159L126L042K977K821
$$ 362499 363047 364061 365589 367492 369547 371651 373909 376510 379484 382643 385769 388811 391788 394609
51941C94609K502K161J918J691J335Q90M80Q2m46j113j789k393k921l345l635
$$ 394609 397111 399272 401190 402881 404216 405106 405586 405668 405222 404109 402320 399927 397006 393661 390026
51926C90026l830l979m053m020m000m102m230m199m034l939l983m047m062m115
$$ 390026 386196 382217 378164 374144 370144 366042 361812 357613 353579 349640 345657 341610 337548 333433
51912C33433m251m360m340m245m167m111m040l939l776l497l140k848k727k738
$$ 333433 329182 324822 320482 316237 312070 307959 303919 299980 296204 292707 289567 286719 283992 281254
51898B81254k820k989l307l760m235m614m862n067n364n768o128o324o434o584
$$ 281254 278434 275445 272138 268378 264143 259529 254667 249600 244236 238468 232340 226016 219582 212998
51884B12998o665o421n813n128m661m396m099l615k978k302j668j141q07p30r03
$$ 212998 206333 199912 194099 188971 184310 179914 175815 172200 169222 166920 165252 164111 163304 162574 161671
51869A61671j208j485j656j786j968k193k330k247j938j517j124p97m71r6K64
$$ 161671 160463 158978 157322 155536 153568 151375 149045 146798 144860 143343 142219 141422 140951 140855 141119
51854A41119N17O91R01J178J477J838K424L303M331N345O321P319Q386R522J0535
$$ 141119 141636 142327 143228 144406 145883 147721 150145 153448 157779 163124 169445 176764 185150 194672 205207
51839B05207J0899R961P526M106M70k844n501p177p800p777p607p366o872o216
$$ 205207 216106 226067 233593 237699 238169 235325 229824 222647 214847 207070 199463 192097 185225 179009
51825A79009n765n601n412m981m451l980l449k732j987j469j176r07n86l90n20
$$ 179009 173244 167643 162231 157250 152799 148819 145370 142638 140651 139182 138006 137099 136513 136123 135603
51810A35603r65j494j864k059k280k620k880k821k509k198j961j698j456j410
$$ 135603 134638 133144 131280 129221 126941 124321 121441 118620 116111 113913 111952 110254 108798 107388
51796A07388j491j356q96m39k88k87q6L51P71J051J325J688K045K271K367K359
$$ 107388 105897 104541 103645 103206 102918 102631 102545 102896 103667 104718 106043 107731 109776 112047 114414 116773
51780A16773K168J709J070N33L21L56L49J24j87l51l33k70k57k74k84k82k43j65
$$ 116773 118941 120650 121720 122253 122574 122930 123279 123403 123216 122865 122532 122262 122005 121731 121447 121165 120922 120757
51762A20757j31k41m03m40l65m24p84j324j791k066k198k242k187j976j630j292
$$ 120757 120626 120385 119982 119542 119177 118753 117969 116645 114854 112788 110590 108348 106161 104185 102555 101263
51746A01263j124j123j080q50n25k70p3J71M04M64L40K12K21L60O01Q67R52O87
$$ 101263 100139 99016 97936 97086 96561 96291 96218 96389 96793 97257 97597 97809 98030 98390 98991 99858 100810 101497
51728A01497K39J0J74N07P26P51O23L50Kk91m91p09r58j098j063r79q99o97l14
$$ 101497 101736 101746 101920 102427 103153 103904 104527 104877 104879 104588 104097 103388 102430 101332 100269 99290 98391 97694 97380
51709I7380L4J32N0NP9K18M11O40P81P26N76N10N47N72N29M73M05K69O3j63l63
$$ 97380 97414 97546 97596 97601 97680 97898 98309 98949 99730 100456 101032 101542 102089 102661 103190 103663 104068 104337 104400 104237 103874
51688A03874m98m75k11K39O94J032J252J414J538J599J543J362J099Q10M85O6
$$ 103874 103376 102901 102690 102929 103623 104655 105907 107321 108859 110458 112001 113363 114462 115272 115757 115823
51672A15823m17q52j162j376j536j600j504j270j012q60q76j022j164j184j077
$$ 115823 115406 114554 113392 112016 110480 108880 107376 106106 105094 104234 103358 102336 101172 99988 98911
51657I8911r00o76m40l06l28l88l05j10K3M8J04K09J82o7l62n11n44n88o50o34
$$ 98911 98011 97335 96895 96589 96261 95873 95568 95458 95481 95529 95633 95842 96024 95957 95595 95084 94540 93952 93302 92668
51637I2668n17l34j08J19K53K16N5j21k32k12m9J63K93L43M32N61N72L85J56N0
$$ 92668 92151 91817 91709 91828 92081 92297 92352 92231 91999 91787 91738 91901 92194 92537 92969 93530 94102 94487 94643 94693
51617I4693M4M8R0K55M93O69P53Q49J048J274J314R77L06l91p79p90n54j52M29
$$ 94693 94737 94785 94875 95130 95623 96292 97045 97894 98942 100216 101530 102507 102813 102422 101643 100853 100299 100147 100576
51598A00576J064J465J446J101O15P8m38q23j013j079j090j032r12p84o69n44
$$ 100576 101640 103105 104551 105652 106267 106345 105907 105084 104071 102992 101902 100870 99958 99174 98505 97961
51582I7961m72n42o69o43m45k87k47j34J49L67K73qj81j57p2K1J47K78L51L88
$$ 97961 97489 96947 96278 95635 95190 94903 94656 94522 94671 95038 95311 95303 95122 94965 94893 94914 95061 95339 95690 96078
51562I6078M67N76O73P57P85O66M53M43Q27J442J967K299K563K818K987K939K513
$$ 96078 96545 97121 97794 98551 99336 100002 100455 100898 101725 103167 105134 107433 109996 112814 115801 118740 121253
51545A21253J581K66r91j805k203k460k689k807k772k634k365j930j437j081q75
$$ 121253 122834 123100 122109 120304 118101 115641 112952 110145 107373 104739 102374 100444 99007 97926 97051
51530I7051o98n04l57k54j26l8j48m56p29p72o34n18n48o69p46o99n97n34m56
$$ 97051 96353 95849 95492 95238 95112 95074 94926 94470 93741 92969 92335 91817 91269 90600 89854 89155 88558 88024 87568
51511H7568k42Q3L04L03K06J70K17L46O08R53J190J315J631K383L356M093M316
$$ 87568 87326 87409 87713 88016 88222 88392 88609 88955 89563 90516 91706 93021 94652 97035 100391 104484 108800
51494A08800L938K895J314k92j360j799j910j891j679j250p28j78M32J031J439
$$ 108800 112738 115633 116947 116655 115295 113496 111586 109695 108016 106766 106038 105860 106292 107323 108762
51479A08762J620J721J866K034K178K251K123J690J062M52m8m27n28j52O65J689
$$ 108762 110382 112103 113969 116003 118181 120432 122555 124245 125307 125759 125711 125284 124756 124604 125269 126958
51463A26958K812M039N186N882O006N855N773N809N789N603N256M792M218L444
$$ 126958 129770 133809 138995 144877 150883 156738 162511 168320 174109 179712 184968 189760 193978 197422
51449A97422K366J062j78j159k036l043m108m975n636o253o704o610n924n114
$$ 197422 199788 200850 200672 199513 197477 194434 190326 185351 179715 173462 166758 160148 154224 149110
51435A49110m661m549m489m317m057l739l408l126k867k490j953j431j171j224
$$ 149110 144449 139900 135411 131094 127037 123298 119890 116764 113897 111407 109454 108023 106852 105628
51421A05628j428j526j318q49m14k55k81k42j01m8j58l12m53o13o87m84o9K25
$$ 105628 104200 102674 101356 100507 100093 99838 99557 99315 99214 99166 99008 98696 98243 97630 96943 96459 96390 96615
51403I6615K43J81J90J33r8l08k65n1Q5R4R9J62K59L65M35L70J57q6k61m18o19
$$ 96615 96858 97039 97229 97362 97264 96956 96691 96640 96725 96819 96918 97080 97339 97704 98139 98509 98666 98580 98319 97901 97282
51382I7282q29j012j184j284j149p89m41k69j55J5J08m5l32m92m61l72l29l18
$$ 97282 96453 95441 94257 92973 91824 91035 90594 90325 90170 90185 90293 90248 89916 89424 88963 88591 88262 87944
51364H7944l23l31l09k59k32k01n1K22M57N93P88J143J451J504J435J593K093
$$ 87944 87621 87290 86981 86722 86490 86289 86238 86460 86917 87510 88298 89441 90892 92396 93831 95424 97517
51347I7517K700L126L201K891K318J744J334J019O98M48L30J34m01j171j795k087
$$ 97517 100217 103343 106544 109435 111753 113497 114831 115850 116548 116996 117326 117460 117059 115888 114093 112006
51331A12006k185k229k217k167k195k262k149j763j323j070r84r16q39q03p39
$$ 112006 109821 107592 105375 103208 101013 98751 96602 94839 93516 92446 91462 90546 89707 88904 88165
51316H8165n20j68J43K87L22L70M68N41N07L83K84L24N03P19Q81R85J078J156
$$ 88165 87645 87477 87620 87907 88229 88599 89067 89608 90115 90498 90782 91106 91609 92328 93209 94194 95272 96428
51298I6428J178J119J011R02Q21P83Q19R37J105J267J453J733K112K489K832L280
$$ 96428 97606 98725 99736 100638 101459 102242 103061 103998 105103 106370 107823 109556 111668 114157 116989 120269
51282A20269L941M688N303N762O249O851P435P846Q062Q041P635O736N443L936
$$ 120269 124210 128898 134201 139963 146212 153063 160498 168344 176406 184447 192082 198818 204261 208197
51268B08197K306O07j045k573m030n455o715p614q135q402q444q182p594o786
$$ 208197 210503 211110 210065 207492 203462 198007 191292 183678 175543 167141 158697 150515 142921 136135
51254A36135n885m969m123l453k979k593k176j716j304j025r40j009j131j215
$$ 136135 130250 125281 121158 117705 114726 112133 109957 108241 106937 105912 104972 103963 102832 101617
51240A01617j219j148j009q73q49r78j121j106r30p49o44n49m15l29l78m78m61
$$ 101617 100398 99250 98241 97368 96519 95541 94420 93314 92384 91635 90991 90442 90027 89698 89320 88842 88381
51223H8381k97j20j2J00K79M26M33L92N06Q01J070J137J023P92M37K7k26j96m3
$$ 88381 88084 87964 87952 88052 88331 88757 89190 89582 90088 90889 91959 93096 94119 94911 95348 95375 95149 94953 94910
51204I4910Jn5q9j54m00p34q68p26n23m27l57k08m5N4J50L03M65N96P47R19R92
$$ 94910 94911 94856 94767 94613 94213 93479 92611 91885 91362 90935 90578 90370 90325 90379 90529 90832 91297 91893 92640 93559 94551
51183I4551R24Q56Q73Q29N54J11k85n31o45o63o31n98n36l71j61r7k04k51j02
$$ 94551 95475 96331 97204 98033 98587 98698 98413 97882 97237 96574 95943 95345 94809 94438 94277 94180 93976 93725 93623
51164I3623N4Nj28j08J9L8l8L1K41L12J15r9m9K10L99L81K55K04L33N81P72P71
$$ 93623 93677 93682 93554 93446 93465 93503 93465 93496 93737 94049 94164 94065 94016 94226 94625 95006 95261 95465 95798 96379 97151 97922
51142I7922O13M10J69j70n47p66p51o48o13o22n32l24j28o1p4k2J56L45L58J29
$$ 97922 98535 98945 99114 98944 98397 97631 96880 96232 95619 94997 94465 94141 94013 93952 93878 93856 94012 94357 94715 94844
51122I4844k00m49n58n66m74k20K06O89J064J232J192J052R49R50J021J082J089
$$ 94844 94644 94195 93637 93071 92597 92377 92583 93272 94336 95568 96760 97812 98761 99711 100732 101814 102903
51105A02903J003P88M46N8k48m06m27l83l50l44l15k24j43j54j86q6J44L30L92
$$ 102903 103906 104694 105140 105198 104950 104544 104117 103734 103384 103040 102725 102501 102358 102204 102018 101932 102076 102406 102798
51086A02798M61O55Q38P93N28K25j7k38m45n47n10m49n01o86q98j016j007r24
$$ 102798 103259 103914 104752 105545 106073 106298 106281 106043 105598 105051 104541 104092 103591 102905 102007 100991 99984 99060
51068I9060q20o74m37j76n4j26k84l95m35m21l01n9J84K83K32J61J43J43J09O1
$$ 99060 98240 97566 97129 96953 96899 96773 96489 96094 95659 95238 94937 94878 95062 95345 95577 95738 95881 96024 96133 96194
51048I6194O7J73K85K24k1j74N1N11P61O04L05J41L4j55k79j24J55K41J13J2N0
$$ 96194 96261 96434 96719 96943 96922 96748 96799 97310 98071 98675 98980 99121 99155 99000 98721 98597 98752 98993 99106 99118 99168
51027I9168J18K32N23Q82R66O68L22K67M19M59K53n7l03m06l47j70K6J47J91K22
$$ 99168 99286 99518 100041 100923 101889 102557 102879 103146 103565 104024 104277 104220 103917 103511 103164 102994 103020 103167 103358 103580
51007A03580K81L35L32K73K22K37K78K60K02K33L77M81M32L49L74M54M34L33L26
$$ 103580 103861 104196 104528 104801 105023 105260 105538 105798 106000 106233 106610 107091 107523 107872 108246 108700 109134 109467 109793
50988A09793M43N53N91O09N82M10J25o4n5Kn0j67k16j78j35j20r7K0K93P23J181
$$ 109793 110236 110789 111380 111989 112571 112981 113106 113042 112987 112989 112939 112772 112556 112378 112243 112123 112026 112046 112339 113062 114243
50967A14243J501J650J751J915K128K310K406K410K383K442K584K594K257J674
$$ 114243 115744 117394 119145 121060 123188 125498 127904 130314 132697 135139 137723 140317 142574 144248
50953A44248J195R74Q02M16j50p09j205j708k185k463k434k183j878j634j502
$$ 144248 145443 146417 147219 147635 147485 146776 145571 143863 141678 139215 136781 134598 132720 131086 129584
50938A29584j467j430j269r56n81k48N3L71O58P61O26M36M53P33J121J500J916
$$ 129584 128117 126687 125418 124462 123881 123633 123686 124057 124715 125476 126102 126538 126991 127724 128845 130345 132261
50921A32261K410K863L129L226L281L325L286L129K923K715K468K116J663J195
$$ 132261 134671 137534 140663 143889 147170 150495 153781 156910 159833 162548 165016 167132 168795 169990
50907A69990Q34O19M30J23k68n40o19o79q68j042r83p17m38k03P7L88O02P38R88
$$ 169990 170824 171443 171873 171996 171728 171188 170569 169890 169022 167980 166997 166280 165842 165639 165716 166104 166706 167444 168432
50888A68432J451J993K471K918L447M077M732N289N612N591N246M773M450M499
$$ 168432 169883 171876 174347 177265 180712 184789 189521 194810 200422 206013 211259 216032 220482 224981
50874B24981N009N887O969Q177R544J1002J2326J3385J4316J5308J6311J7174
$$ 224981 229990 235877 242846 251023 260567 271569 283895 297280 311596 326904 343215 360389
50862C60389J7948J8745J9402J9542J9002J7965J6640J5038J3168J1177R229P353
$$ 360389 378337 397082 416484 436026 455028 472993 489633 504671 517839 529016 538245 545598
50850E45598N512L718K014M73p56j512j750j555j095o97p97j565k611l363l702
$$ 545598 551110 554828 556842 557315 556559 555047 553297 551742 550647 549950 549153 547588 544977 541614 537912
50835E37912m003m534n165n746o405p297q352r427j0521j1650j2707j3617j4421
$$ 537912 533909 529375 524210 518464 512059 504762 496410 486983 476462 464812 452105 438488 424067
50822D24067j5112j5495j5404j4899j4160j3308j2447j1692j1031j0318r493q660
$$ 424067 408955 393460 378056 363157 348997 335689 323242 311550 300519 290201 280708 272048
50810B72048p881p087o313n759n467n158m604l959l498l205k888k500k127j765
$$ 272048 264167 257080 250767 245008 239541 234383 229779 225820 222322 219117 216229 213729 211602 209837
50796B09837j352r82p79o67m46j17J54L09M47O29Q07R83J244J589J879J998J971
$$ 209837 208485 207503 206724 206057 205611 205494 205648 205957 206404 207033 207840 208823 210067 211656 213535 215533 217504
50779B17504J915J949K116K362K603K853L220L709M166M512M893N429N970O309
$$ 217504 219419 221368 223484 225846 228449 231302 234522 238231 242397 246909 251802 257231 263201 269510
50765B69510O543O976P701Q507R246J0031J1039J2277J3678J5289J7215J9460
$$ 269510 276053 283029 290730 299237 308483 318514 329553 341830 355508 370797 388012 407472
50753D07472K1921K4484K7094K9735L2389L5010L7473L9643M1471M2977M4131
$$ 407472 429393 453877 480971 510706 543095 578105 615578 655221 696692 739669 783800
50742G83800M4684M4239M2458L9260L4839K9518K3632J7537J1575N965P43m064
$$ 783800 828484 872723 915181 954441 989280 1018798 1042430 1059967 1071542 1077507 1078250 1074186
50730A074186q262j1559j3773j4875j4849j3756j1839r490p008m621k667j563
$$ 1074186 1065924 1054365 1040592 1025717 1010868 997112 985273 975783 968775 964154 961487 959924
50718I59924j503k397m152o793j0199j3958j7669k1270k4854k8346l1478l3955
$$ 959924 958421 956024 951872 945079 934880 920922 903253 881983 857129 828783 797305 763350
50706G63350l5574l6232l6025l5176l3813l1898k9514k6974k4527k2112j9592
$$ 763350 727776 691544 655519 620343 586530 554632 525118 498144 473617 451505 431913
50695D31913j7047j4638j2370j0206q282o739n442m159k951k082j621j369j181
$$ 431913 414866 400228 387858 377652 369370 362631 357189 353030 350079 347997 346376 345007 343826
50682C43826j095j126j215j363j606j862j983j989k061k251k461k646k881l109
$$ 343826 342731 341605 340390 339027 337421 335559 333576 331587 329526 327275 324814 322168 319287 316178
50668C16178l176l107l176l551m047m358m389m235l985l670l288k803k140j308
$$ 316178 313002 309895 306719 303168 299121 294763 290374 286139 282154 278484 275196 272393 270253 268945
50654B68945m61K66R06J612K481L472M450N300N988O592P172P704Q172Q702R480
$$ 268945 268484 268750 269656 271268 273749 277221 281671 286971 292959 299551 306723 314427 322599 331301 340781
50639C40781J0551J1794J3060J4272J5422J6575J7858J9298K0702K1787K2471
$$ 340781 351332 363126 376186 390458 405880 422455 440313 459611 480313 502100 524571
50628E24571K2890K3104K2990K2425K1442K0117J8380J6058J2992R152M684m8
$$ 524571 547461 570565 593555 615980 637422 657539 675919 691977 704969 714121 718805 718757
50616G18757m547q404j1399j3429j4436j4444j3614j2170j0290q162o003m030
$$ 718757 714210 705806 694407 680978 666542 652098 638484 626314 616024 607862 601859 597829
50604E97829k375j067r9M76M40n00k448n129q065j0926j3629j6092j8122j9552
$$ 597829 595454 594387 594288 594764 595204 594704 592256 587127 579062 568136 554507 538415 520293 500741
50590E00741k0402k0732k0462j9489j7942j6208j4600j3112j1535r760p873o023
$$ 500741 480339 459607 439145 419656 401714 385506 370906 357794 346259 336499 328626 322603
50578C22603m272k643j185Q3J274K540L902N217O304P026P278P077O623O160N718
$$ 322603 318331 315688 314503 314586 315860 318400 322302 327519 333823 340849 348127 355204 361827 367987 373705
50563C73705N130M348L593L069K727K399K047J722J392R93O10L93L63M14M76N60
$$ 373705 378835 383183 386776 389845 392572 394971 397018 398740 400132 401125 401735 402128 402491 402905 403381 403941
50547D03941O71Q28J125J651K369L136L891M677N525O377P123P695Q137Q584R091
$$ 403941 404612 405440 406565 408216 410585 413721 417612 422289 427814 434191 441314 449009 457146 465730 474821
50532D74821R468R493R272R219R588J0359J1621J3596J5804J6582J4193Q551J448
$$ 474821 484289 493782 503054 512273 521861 532220 543841 557437 573241 589823 604016 612567 614015
50519F14015m924r433j1996j2947j2714j1816j0654r331p880o477n295m210l001
$$ 614015 609091 599658 587662 574715 562001 550185 539531 530200 522320 515843 510548 506338 503337
50506E03337j723o86j02Q7k7m99j469k969m884p026r190j1170j2795j4018j4941
$$ 503337 501614 500928 500826 500913 500886 500387 498918 495949 491065 484039 474849 463679 450884 436866 421925
50491D21925j5678j6132j6054j5352j4305j3314j2506j1722j0802r725q509p203
$$ 421925 406247 390115 374061 358709 344404 331090 318584 306862 296060 286335 277826 270623
50479B70623n971n014m308l612k759j833j012l37K73R12J609K342L061L747M406
$$ 270623 264652 259638 255330 251718 248959 247126 246114 245777 246050 246962 248571 250913 253974 257721 262127
50464B62127M986N352N494N609N857O089O109O063O311O882P394P622P763Q054
$$ 262127 267113 272465 277959 283568 289425 295514 301623 307686 313997 320879 328273 335895 343658 351712
50450C51712Q333Q260P746O974O124N295M586M053L639L315L192L403L889M469
$$ 351712 360045 368305 376051 383025 389149 394444 399030 403083 406722 410037 413229 416632 420521 424990
50436D24990N051N667O335P020P736Q580R653J0998J2563J4212J5799J7286J8712
$$ 424990 430041 435708 442043 449063 456799 465379 475032 486030 498593 512805 528604 545890 564602
50423E64602K0040K1099K1741K1955K1780K1153J9950J8088J5588J2547R135N544
$$ 564602 584642 605741 627482 649437 671217 692370 712320 730408 745996 758543 767678 773222
50411G73222J911j703n252q667j1864j4685j6887j8313j9010j9117j8622j7451
$$ 773222 775133 773430 768178 759511 747647 732962 716075 697762 678752 659635 641013 623562
50399F23562j5694j3580j1223q623n974l656j801j09J769L810N741P327Q428Q838
$$ 623562 607868 594288 583065 574442 568468 564812 563011 562902 564671 568481 574222 581549 589977 598815
50385E98815Q342O817M220N89l754q217j2282j5782j8709k0943k2355k3053k3206
$$ 598815 607157 613974 618194 618783 615029 606812 594530 578748 560039 539096 516741 493688 470482
50372D70482k2782k1672k0099j8551j7300j6163j4869j3388j1858j0345q840p386
$$ 470482 447700 426028 405929 387378 370078 353915 339046 325658 313800 303455 294615 287229
50360B87229o077m909l787k647j532m88N62J688K780L520L742L655L637L811L996
$$ 287229 281152 276243 272456 269809 268277 267789 268351 270039 272819 276339 280081 283736 287373 291184 295180
50345B95180M057M094M250M483M677M793M778M449L678K583J452M72l14r04j272
$$ 295180 299237 303331 307581 312064 316741 321534 326312 330761 334439 337022 338474 338946 338632 337728 336456
50330C36456j430j445j399j406j512j587j379q26j89K81O63J243K099L002L727
$$ 336456 335026 333581 332182 330776 329264 327677 326298 325472 325283 325564 326227 327470 329569 332571 336298
50315C36298M285M861N626O617P716Q735R578J0282J0894J1358J1583J1544J1260
$$ 336298 340583 345444 351070 357687 365403 374138 383716 393998 404892 416250 427833 439377 450637
50302D50637J0721R973R108Q124O845N132L081Q77j476m057o776r339j1516j3249
$$ 450637 461358 471331 480439 488563 495408 500540 503621 504498 503022 498965 492189 482850 471334 458085
50288D58085j4541j5382j5780j5777j5403j4643j3521j2099j0440q629o781m946
$$ 458085 443544 428162 412382 396605 381202 366559 353038 340939 330499 321870 315089 310143
50276C10143l059j084Q38K508L866M953N750O122N969N249L938K114N6j852l387
$$ 310143 307084 306000 306838 309346 313212 318165 323915 330037 336006 341255 345193 347307 347363 345511 342124
50261C42124m546n376n868o037o033o072o348o971p893q867r603r930r833r339
$$ 342124 337578 332202 326334 320297 314264 308192 301844 294873 286980 278113 268510 258580 248747 239408
50247B39408q543p660o889o215n432m477l532k805k301j847j301o53KN19Q39J036
$$ 239408 230865 223205 216316 210101 204669 200192 196660 193855 191554 189707 188406 187753 187755 188274 189113 190149
50231A90149J248J501J700J828J982K220K431K472K373K337K525K916L324L545
$$ 190149 191397 192898 194598 196426 198408 200628 203059 205531 207904 210241 212766 215682 219006 222551
50217B22551L474L147K686K210J774J384J049P83O05N39O20Q31J076J247J340
$$ 222551 226025 229172 231858 234068 235842 237226 238275 239058 239663 240202 240822 241653 242729 243976 245316
50202B45316J461J670J821J695J277Q41O19N32L56K7l38p26j265j985k696l206
$$ 245316 246777 248447 250268 251963 253240 254081 254700 255232 255588 255615 255277 254551 253286 251301 248605 245399
50186B45399l496l640l651l522l284k913k355j651r71m18P4N90J102J593K139
$$ 245399 241903 238263 234612 231090 227806 224893 222538 220887 219916 219498 219572 220162 221264 222857 224996
50171B24996K775L398L951M540N254O005O705P421Q189Q796R037Q993Q889Q705
$$ 224996 227771 231169 235120 239660 244914 250919 257624 265045 273234 282030 291067 300060 308949 317654
50157C17654Q224P435O606N956N496N165M887M448L539K069K55j637l521n380
$$ 317654 325878 333313 339919 345875 351371 356536 361423 365871 369410 371479 371734 370097 366576 361196
50143C61196p067q344r036r099q605p708o614n561m831m661n040n626o037o133
$$ 361196 354129 345785 336749 327650 319045 311337 304723 299162 294331 289670 284630 279004 272967 266834
50129B66834n981n602m964m145l326k582j886j274q46n92m21l70n53q93j095j019
$$ 266834 260853 255251 250287 246142 242816 240234 238348 237074 236228 235636 235215 234845 234292 233399 232304 231285
$$ [...]
##END NTUPLES=NMR SPECTRUM
##END=
