##TITLE=AC1534_ROEFFECT0009_8214376_YM702Qd0Co
##JCAMPDX= 6.0         $$ Bruker NMR JCAMP-DX V2.0
##DATA TYPE= NMR SPECTRUM
##DATA CLASS= NTUPLES
##ORIGIN= BRUKER
##OWNER= Administrator
$$ 1.72 TOPSPIN		Version 2.1
$$ 2013-10-04 21:43:49.881 -0700  Administrator@X
$$ Compression mode = diff/dup
##.OBSERVE FREQUENCY= 400.02188249412
##.OBSERVE NUCLEUS= ^1H
##.ACQUISITION MODE= SIMULTANEOUS (DQD)
##.ACQUISITION SCHEME= undefined
##.AVERAGES= 8
##.DIGITISER RES= 22
##SPECTROMETER/DATA SYSTEM= spect
##.PULSE SEQUENCE= zg30
##.SOLVENT NAME= COFFEE_meoh
##.SHIFT REFERENCE= INTERNAL, COFFEE_meoh, 1, 14.98509
##AUDIT TRAIL= $$ (NUMBER, WHEN, WHO, WHERE, PROCESS, VERSION, WHAT)
$$ ##TITLE= Audit trail, TOPSPIN		Version 2.1
$$ ##JCAMPDX= 5.01
$$ ##ORIGIN= Bruker BioSpin GmbH
$$ ##OWNER= Administrator
$$ $$ E:\/data/COFFEE/nmr/AC1534_ROEFFECT0009_8214376_YM702Qd0Co/10/pdata/1/auditp.txt
$$ ##AUDIT TRAIL=  $$ (NUMBER, WHEN, WHO, WHERE, PROCESS, VERSION, WHAT)
(   1,<2013-10-04 21:43:43.553 -0700>,<Administrator>,<X>,<go>,<TOPSPIN 2.1>,
      <created by zg
	started at 2013-10-04 21:42:37.928 -0700,
	POWCHK enabled, PULCHK disabled,
       configuration hash MD5:
       C8 4E 4E 5D D3 5C D8 9E 9F 52 82 E0 59 8A DE 15
       data hash MD5: 64K
       42 13 14 CE 17 CC E7 CD B8 51 1E B5 57 8F 8F DC>)
(   2,<2013-10-04 21:43:46.381 -0700>,<Administrator>,<X>,<proc1d>,<TOPSPIN 2.1>,
      <Start of raw data processing
       efp LB = 0 FT_mod = 6 PKNL = 1 PHC0 = 0 PHC1 = 0 SI = 32K 
       data hash MD5: 32K
       44 CB AC 81 AE EA 2B 15 0E A7 66 0F AE 02 DD BB>)
(   3,<2013-10-04 21:43:46.663 -0700>,<Administrator>,<X>,<proc1d>,<TOPSPIN 2.1>,
      <pk PHC0 = 94.87244 PHC1 = 0 
       data hash MD5: 32K
       F8 54 64 47 D6 03 88 27 5E B4 96 DF BE 54 EA 32>)
(   4,<2013-10-04 21:43:46.756 -0700>,<Administrator>,<X>,<proc1d>,<TOPSPIN 2.1>,
      <abs ABSG = 1 
       data hash MD5: 32K
       FE 45 96 53 AB 9B ED 0B 2F 1D A0 A8 74 9D 8A F6>)
(   5,<2013-10-04 21:43:46.819 -0700>,<Administrator>,<X>,<proc1d>,<TOPSPIN 2.1>,
      <abs ABSG = 2 
       data hash MD5: 32K
       67 E4 90 06 EB B5 32 75 83 FD 9E 7D 2E 75 2B F3>)
(   6,<2013-10-04 21:43:46.881 -0700>,<Administrator>,<X>,<proc1d>,<TOPSPIN 2.1>,
      <abs ABSG = 3 
       data hash MD5: 32K
       AF E4 90 ED 1E 40 A1 D4 65 3E 81 DC 07 E5 3B AF>)
(   7,<2013-10-04 21:43:46.944 -0700>,<Administrator>,<X>,<proc1d>,<TOPSPIN 2.1>,
      <abs ABSG = 4 
       data hash MD5: 32K
       EA 4F 34 9D 3C D1 95 0C BD 96 97 5B 83 F5 5F 85>)
(   8,<2013-10-04 21:43:46.991 -0700>,<Administrator>,<X>,<proc1d>,<TOPSPIN 2.1>,
      <abs ABSG = 5 
       data hash MD5: 32K
       E9 6E E9 8A 94 88 D6 FC 41 25 9C C0 DF 59 54 BA>)
$$ ##END=
$$ 
$$ $$ hash MD5
$$ $$ AA 54 30 FB 87 68 6E 10 AE 6F 32 E5 52 E9 F2 BE
##$RELAX= 
##$RELAX= 
##$RELAX= 
##$RELAX= 
##$RELAX= 
##$RELAX= 
##$RELAX= 
$$ Bruker specific parameters
$$ --------------------------
##$DU= <E:\>
##$EXPNO= 10
$$ [...]
150 150 150 150 150 150 150 150
##$TP07= 0
##$TPNAME0= <>
##$TPNAME1= <>
##$TPNAME2= <>
##$TPNAME3= <>
##$TPNAME4= <>
##$TPNAME5= <>
##$TPNAME6= <>
##$TPNAME7= <>
##$TPOAL= (0..7)
0.5 0.5 0.5 0.5 0.5 0.5 0.5 0.5
##$TPOFFS= (0..7)
0 0 0 0 0 0 0 0
##$TUNHIN= 0
##$TUNHOUT= 0
##$TUNXOUT= 0
##$USERA1= <user>
##$USERA2= <user>
##$USERA3= <user>
##$USERA4= <user>
##$USERA5= <user>
##$V9= 5
##$VALIST= <valist>
##$VCLIST= <CCCCCCCCCCCCCCC>
##$VD= 0
##$VDLIST= <DDDDDDDDDDDDDDD>
##$VPLIST= <PPPPPPPPPPPPPPP>
##$VTLIST= <TTTTTTTTTTTTTTT>
##$WBST= 2048
##$WBSW= 25
##$XGAIN= (0..3)
0 0 0 0
##$XL= 0
##$YL= 0
##$YMAX_a= 643250
##$YMIN_a= -546797
##$ZGOPTNS= <>
##$ZL1= 120
##$ZL2= 120
##$ZL3= 120
##$ZL4= 120
##$ABSF1= 14.98509
##$ABSF2= -5.573092
##$ABSG= 5
##$ABSL= 3
##$ALPHA= 0
##$AQORDER= 0
##$ASSFAC= 0
##$ASSFACI= 0
##$ASSFACX= 0
##$ASSWID= 0
##$AUNMP= <proc_prof1d_extract_pilot.lims>
##$AXLEFT= 0
##$AXNAME= <>
##$AXNUC= <1H>
##$AXRIGHT= 0
##$AXTYPE= 0
##$AXUNIT= <>
##$AZFE= 0.1
##$AZFW= 0.1
##$BCFW= 0
##$BC_mod= 0
##$BYTORDP= 0
##$COROFFS= 0
##$CY= 15
##$DATMOD= 1
##$DC= 0
##$DFILT= <>
##$DTYPP= 0
##$F1P= 0
##$F2P= 0
##$FCOR= 0.5
##$FTSIZE= 32768
##$FT_mod= 6
##$GAMMA= 0
##$GB= 0
##$INTBC= 1
##$INTSCL= 1
##$ISEN= 128
##$LB= 0
##$LEV0= 0
##$LPBIN= 0
##$MAXI= 10000
##$MC2= 0
##$MEAN= 0
##$ME_mod= 0
##$MI= 0
##$NCOEF= 0
##$NC_proc= -8
##$NLEV= 6
##$NOISF1= 0
##$NOISF2= 0
##$NSP= 0
##$NTH_PI= 0
##$NZP= 0
##$OFFSET= 14.98509
##$PC= 1
##$PHC0= 94.87244
##$PHC1= 0
##$PH_mod= 1
##$PKNL= yes
##$PPARMOD= 0
##$PPDIAG= 0
##$PPIPTYP= 0
##$PPMPNUM= 2147483647
##$PPRESOL= 1
##$PSCAL= 4
##$PSIGN= 0
##$PYNMP= <proc.py>
##$REVERSE= no
##$SF= 400.02
##$SI= 32768
##$SIGF1= 0
##$SIGF2= 0
##$SINO= 400
##$SIOLD= 32768
##$SPECTYP= <>
##$SREGLST= <1H.CDCl3>
##$SSB= 0
##$STSI= 32768
##$STSR= 0
##$SW_p= 8223.68421052631
##$SYMM= 0
##$S_DEV= 0
##$TDeff= 65536
##$TDoff= 0
##$TI= <>
##$TILT= no
##$TM1= 0
##$TM2= 0
##$TOPLEV= 0
##$USERP1= <user>
##$USERP2= <user>
##$USERP3= <user>
##$USERP4= <user>
##$USERP5= <user>
##$WDW= 1
##$XDIM= 32768
##$YMAX_p= 452845714
##$YMIN_p= -712442
##$CURPLOT= <Network HP LaserJet P1505>
##$CURPRIN= <$Network HP LaserJet P1505>
##$DFORMAT= <normdp>
##$LAYOUT= <+/1D_H.xwp>
##$LFORMAT= <normlp>
##$PFORMAT= <normpl>
##$SURQMSG= 1
$$ End of Bruker specific parameters
$$ ---------------------------------
##NTUPLES= NMR SPECTRUM
##VAR_NAME=  FREQUENCY,     SPECTRUM/REAL,   SPECTRUM/IMAG
##SYMBOL=    X,             R,               I
##VAR_TYPE=  INDEPENDENT,   DEPENDENT,       DEPENDENT
##VAR_FORM=  AFFN,          ASDF,            ASDF
##VAR_DIM=   32768,         32768,           32768
##UNITS=     HZ,            ARBITRARY UNITS, ARBITRARY UNITS
##FACTOR=    0.250966925370066, 1,           1
##FIRST=     8223.43324360094, -34387,       -22218
##LAST=      0,             -168751,         -130697
##MIN=       0,             -712442,         0
##MAX=       8223.43324360094, 452845714,    0
$$ Real data points
##PAGE= N=1
##DATA TABLE= (X++(R..R)), XYDATA
$$ [...]
19536e00215C8945C513a71519a2717o0069j05598b9055B2384a45782B4999b20614
$$ -500215 38945 3513 -171519 -12717 -72786 -178384 -29055 22384 -145782 24999 -220614
19524g5718c7732j65476O0296c8722j65996c1921a3425C82436b16143c2223k45111
$$ -75718 -37732 -203208 -142912 -38722 -204718 -31921 -13425 382436 -216143 -32223 -277334
19513b77334O4099B49546i2594k14640A73780b09280G2851d8522k20002J12990
$$ -277334 -213235 249546 -92594 -307234 173780 -209280 72851 -48522 -268524 -155534
19503a55534r423a5475q5066G6098a81993j45620A28567a46657j98223d8982j16309
$$ -155534 -164957 -15475 -100541 76098 -181993 -327613 128567 -146657 -344880 -48982 -165291
19492a65291o6157b2214o0428b8653k86822A01301f1837q8129B47808d4981A13585
$$ -165291 -231448 -22214 -82642 -28653 -315475 101301 -61837 -149966 247808 -44981 113585
19480h1799c1958j61172f4161C60301j33799r074C002K48222a59681B0172a43991
$$ -81799 -31958 -193130 -64161 360301 226502 217428 3002 251224 -159681 20172 -143991
19468c46521A4343a15640q8916Q057g96A99041a5927j29576e5625k43945a15985
$$ -346521 14343 -115640 -204556 -196499 -796 199041 -15927 -145503 -55625 -299570 -115985
19456c4809k01792a06301b3158A07104b27150C5493a07599o595B59626E3249c52155
$$ -34809 -236601 -106301 -23158 107104 -227150 35493 -107599 -114194 259626 53249 -352155
19444b54971A35975L621I736M0385h7881D2012a84952C85375F9853a29001j57725
$$ -254971 135975 139596 9736 50121 -87881 42012 -184952 385375 69853 -129001 -286726
19433b86726J33658C22g199j3938A18627a70739g0212F954M0353J75020b51075
$$ -286726 -153068 322 -7199 -21137 118627 -170739 -70212 6954 47307 222327 -251075
19421c96928g2478o4969j11784f0390F1136a53251F1195f9868A9890b36739e4916
$$ -396928 -72478 -137447 -249231 -60390 61136 -153251 61195 -69868 19890 -236739 -54916
19409d79230a28325n5180r8540A20353f6764A31186N6060a12563N941q1734c2209
$$ -479230 -128325 -183505 -282045 120353 -66764 131186 187246 -112563 -106622 -188356 -32209
19397b92112D5752N0378f3997j53435l7295A1308N5221J21170p3017C7169b12651
$$ -292112 45752 96130 -63997 -217432 -254727 11308 66529 187699 114682 37169 -212651
19385F3576P5585c12871a53663I0743d4519r5653L3746A0669a36525N4722A19770
$$ 63576 139161 -312871 -153663 90743 -44519 -140172 -106426 10669 -136525 -81803 119770
19373B99617b16800B86042i6719H9545K23509a24742A8325c20077I5939a2119
$$ 299617 -216800 286042 -96719 89545 313054 -124742 18325 -320077 95939 -12119
19362c22653A96253b12616c6176J7593A00734a19721b8098j11531J6595j53684
$$ -322653 196253 -212616 -36176 -18583 100734 -119721 -28098 -139629 -123034 -276718
19352b76718D1483c8402k86765B9025a63240N4604K7000l9395o2226g4001k78144
$$ -276718 41483 -38402 -325167 29025 -163240 -108636 -81636 -121031 -183257 -74001 -352145
19341c52145P4056A31846K0431b82352G1296C622a30836j32299j6917@a29564
$$ -352145 -278089 131846 152277 -282352 71296 3622 -130836 -263135 -280052 0 -129564
19329b9349A73751a27330k03558K8797J8202N0393G0509L0539C1275J26211a38207
$$ -29349 173751 -127330 -330888 -302091 -283889 -233496 70509 101048 31275 157486 -138207
19317b25039J05848H1769e4414A40530K1450f43F3346h7977C1834c83235B19584
$$ -225039 -119191 81769 -54414 140530 161980 -643 63346 -87977 31834 -383235 219584
19305h0222C3522D003P5922a65591j27384O9253i6303B03853H3046a43356l8945
$$ -80222 33522 4003 79925 -165591 -292975 -223722 -96303 203853 83046 -143356 -182301
19294a82301J3910B92912a6071f318H763a55475P409B59041G8826b0797j15115
$$ -182301 -168391 292912 -16071 -6318 8763 -155475 -148066 259041 78826 -20797 -135912
19283a35912H7373a97194B0990R2211b47264m9946c8841n21192A07057D3915c7592
$$ -135912 87373 -197194 20990 113201 -247264 -297210 -38841 -560033 107057 43915 -37592
19271a11017B34965c69545h4764M1230I5122a3698k35284J09952A74451a63l9944
$$ -111017 234965 -369545 -84764 -43534 95122 -13698 -248982 -139030 174451 -163 -40107
19260d0107j61511J4100A39205n8443k8838f8533j31787m829B0004b16685G7914
$$ -40107 -201618 -187518 139205 80762 51924 -68533 -200320 -205149 20004 -216685 77914
19248B62643a7002k0172A3316a95965C53487h2805B84294o7076a18143E466a26569
$$ 262643 -17002 -37174 13316 -195965 353487 -82805 284294 217218 -118143 5466 -126569
19236a04006j79927A16734b09730h9689k49475a18973b2920H0882a92950o4745
$$ -104006 -283933 116734 -209730 -89689 -339164 -118973 -22920 80882 -192950 -257695
19226b57695A19890b05207B29223n7173O6071A12050i7600K6963k87311A39787
$$ -257695 119890 -205207 229223 172050 238121 112050 -97600 -70637 -357948 139787
19215f8018j11358N8709B22420h0108L6680A693i252o009p9373A10195m6918K62530
$$ -68018 -179376 -120667 222420 -80108 -43428 1693 -9252 -15261 -94634 110195 63277 325807
19203C25807b9972b323j22712k70883C1064g4852B3510h3792j00354G1764a72664
$$ 325807 -29972 -2323 -125035 -395918 31064 -74852 23510 -83792 -184146 71764 -172664
19191B89404f0146C6720J11940B2406J9654j0117a93435A44054a67251D2571P1501
$$ 289404 -60146 36720 148660 22406 42060 31943 -193435 144054 -167251 42571 114072
19180A14072b29407E9848N0730D2694a89967a7464j42382G1255l734K89938A12252
$$ 114072 -229407 59848 110578 42694 -189967 -17464 -159846 71255 67521 357459 112252
19168a54434d179j77365B9492a6995H0628J30275p9164a29481E87M51482H457
$$ -154434 -4179 -181544 29492 -16995 80628 210903 131739 -129481 587 452069 8457
19156a82749B95775F4238H681d4034a4573F8529g2644F5450l385c70665F4770
$$ -182749 295775 64238 8681 -44034 -14573 68529 -72644 65450 62065 -370665 64770
19144A72206E802a46913m8520A99660d43200f3464a3508l5473F9907e5884j09000
$$ 172206 5802 -146913 -195433 199660 -443200 -63464 -13508 -48981 69907 -55884 -164884
19133a64884K1818f684A35586b02185l91971a41508d5806j9217l65114J39910
$$ -164884 -143066 -6684 135586 -202185 -594156 -141508 -45806 -65023 -430137 -290227
19123b90227C15861b17385q4191J50393J1682A71850b1196G166a01372l7559A05772
$$ -290227 315861 -217385 -301576 -151183 -139501 171850 -21196 7166 -101372 -138931 105772
19111a50596c767B9546N55593h7578j51621A88816b92485K4463m2430a5543k04098
$$ -150596 -3767 29546 585139 -87578 -239199 188816 -292485 -268022 -310452 -15543 -219641
19100b19641A19058a57964l03262a63815g274A9154K2980d58881g8773j09143
$$ -219641 119058 -157964 -461226 -163815 -7274 19154 42134 -458881 -78773 -187916
19090a87916A16984I537d75235a02885A28199i1075F6547L11454a77996P9170
$$ -187916 116984 9537 -475235 -102885 128199 -91075 66547 378001 -177996 -98826
19080i8826I3984c21245Q3425P9797j35574i6682j99144b767A7218O2736R638
$$ -98826 93984 -321245 -237820 -158023 -293597 -96682 -295826 -2767 17218 79954 89592
19069H9592a3440p3610A813Q9675e0557A45385K01306d0383r2942l18415J56389
$$ 89592 -13440 -87050 1813 91488 -50557 145385 346691 -40383 -133325 -451740 -295351
19058b95351A44477a53869j1976L8014r4044j85498A87515b00567j07715B41947
$$ -295351 144477 -153869 -165845 -127831 -221875 -407373 187515 -200567 -308282 241947
19047g5521l420B0769B795J91378b67452e7674A37388a80307j9031K6680D7317
$$ -75521 -78941 20769 2795 194173 -267452 -57674 137388 -180307 -199338 -172658 47317
19035b97106a19312j996b0962l06650a9602h944j88493a9728A86198H3017O1505
$$ -297106 -119312 -121308 -20962 -327612 -19602 -8944 -197437 -19728 186198 83017 144522
19024A44522i3710l4058D6484a27840A46822O43b12999c1635k2223B87886h1238
$$ 144522 -93710 -127768 46484 -127840 146822 147465 -212999 -31635 -53858 287886 -81238
19012A49479b29058e2804I0393a46118r6056A17929j9742e027m40515i8227p8322
$$ 149479 -229058 -52804 90393 -146118 -242174 117929 98187 -5027 -445542 -98227 -176549
19001a76549L0089h899j26768n8965R4130A86962c39007f404A61108a80175d028
$$ -176549 -146460 -8899 -135667 -194632 -100502 186962 -339007 -6404 161108 -180175 -4028
18989a25979B42324H1804C3820P0461b08389r393j45843a27901q6721A77597G5530
$$ -125979 242324 81804 33820 104281 -208389 -217782 -363625 -127901 -214622 177597 75530
18977H0227C011c379B11128a8278H5786P4175C6592h1944p242j71191D02121A7775
$$ 80227 3011 -3379 211128 -18278 85786 159961 36592 -81944 -89186 -260377 402121 17775
18964b11308A31453i4979A79477a89127A05503a80542Q9800l0812B4335g3216
$$ -211308 131453 -94979 179477 -189127 105503 -180542 -90742 -121554 24335 -73216
18953b81032c8026l15639a41063c029q8123A27891m4010B5535a9046l3713k45559
$$ -281032 -38026 -353665 -141063 -3029 -91152 127891 83881 25535 -19046 -52759 -298318
18942b98318A69915a07859b1807B8040f1975k24193g2768F0320J10384c57896
$$ -298318 169915 -107859 -21807 28040 -61975 -286168 -72768 60320 170704 -357896
18931c3119j5304j91878A97022b5990A6228J11588c09502A11686N0572G3944d2561
$$ -33119 -48423 -240301 197022 -25990 16228 127816 -309502 111686 162258 73944 -42561
18919a59858F4164b9668j91283m7206e5283A5514b27125C9001N6315b2307j37914
$$ -159858 64164 -29668 -220951 -268157 -55283 15514 -227125 39001 95316 -22307 -160221
18908a60221M6512c0767C6694f2696C10397q0982d6708A54743n5647A7487J22790
$$ -160221 -113709 -30767 36694 -62696 310397 229415 -46708 154743 99096 17487 140277
18897A40277a01610m426d1625A18429C899c68885J65943q3832c7497k71422A09322
$$ 140277 -101610 -106036 -41625 118429 3899 -368885 -202942 -286774 -37497 -308919 109322
18885a93446B34479b42705a7676o7687B6821b5150F4348c8902j85218A66354h2456
$$ -193446 234479 -242705 -17676 -85363 26821 -25150 64348 -38902 -224120 166354 -82456
18873b32630A8276a19814M4352m32301D8301J3041a59132g9060K7194B08087A260
$$ -232630 18276 -119814 -75462 -507763 48301 61342 -159132 -79060 -51866 208087 1260
18861a24471J669j3602A81863J25359q8643a62975q2734E4865f5836J1229I07
$$ -124471 -122802 -136404 181863 307222 218579 -162975 -245709 54865 -65836 -54607 907
18849A73244R2563A20957e9972B71232b93221F5446a60906B8024L2618a30865
$$ 173244 265807 120957 -59972 271232 -293221 65446 -160906 28024 60642 -130865
18838i9024A58480c6740F9411e02812a21166J7371j1860k41769e4932j92391e8802
$$ -99024 158480 -36740 69411 -502812 -121166 -103795 -115655 -357424 -54932 -247323 -58802
18826H9851d9053p4720C18398a22642M3633B41285f7418n5773C05401I6042R2055
$$ 89851 -49053 -123773 318398 -122642 -79009 241285 -67418 -123191 305401 96042 188097
18815A88097F6844J17120L950J47476F2910N2883K04652a56130L9378A75230a2626
$$ 188097 66844 183964 187914 335390 62910 115793 320445 -156130 -116752 175230 -12626
18803A73025f8593A00769J59736b38379A35118c1357n8102A61997b27587q0726
$$ 173025 -68593 100769 260505 -238379 135118 -31357 -89459 161997 -227587 -308313
18793c08313B97388C3327h0864n9169J6432G507c62056j54933a66196k47031e1509
$$ -308313 297388 33327 -80864 -140033 -123601 7507 -362056 -516989 -166196 -413227 -51509
18781B71596a06842R309H2715k8765R8274b08772D06528a84126Q4005K5542A57979
$$ 271596 -106842 -97533 82715 53950 152224 -208772 406528 -184126 -100121 -74579 157979
18769a66556J8618A42536i0966A2391J09421a86472K8384d168j67722r1362A17147
$$ -166556 -147938 142536 -90966 12391 121812 -186472 -158088 -4168 -171890 -263252 117147
18757A74920b36611h1373j5346A37790E2365c07643a19166j8832k9320f1745j75456
$$ 174920 -236611 -81373 -96719 137790 52365 -307643 -119166 -137998 -167318 -61745 -237201
18746b37201J17477C4165d2852r4068m4905A56921E082K79944d28813i8518B10018
$$ -237201 -119724 34165 -42852 -136920 -181825 156921 5082 285026 -428813 -98518 210018
18734C80332b04197h2709j24257j26901A46865J7802c92362a47612i408A37714
$$ 380332 -204197 -82709 -206966 -333867 146865 164667 -392362 -147612 -9408 137714
18723a3109C18752b43861J1832A04894d7136A41575a43384H9983i5460q6690A58719
$$ -13109 318752 -243861 -232029 104894 -47136 141575 -143384 89983 -95460 -182150 158719
18711c6194k93301f2802j6653A57387f3943j93208H9875c24184D5671c4183j66049
$$ -36194 -329495 -62802 -79455 157387 -63943 -257151 89875 -324184 45671 -34183 -200232
18700b00232g2704C8897b61740a02891j13812R2273J6096c2632A86328k2608C3420
$$ -200232 -72704 38897 -261740 -102891 -216703 -124430 -108334 -32632 186328 163720 33420
18688B06637a33780A06215R9042b24963C9468a0109k52473j68A04298b6522j66167
$$ 206637 -133780 106215 205257 -224963 39468 -10109 -262582 -262750 104298 -26522 -192689
18677a92689A40015J1645M3510m5343a54895n6538R770I8961J36638a55603e9822
$$ -192689 140015 151660 195170 149827 -154895 -211433 -201663 98961 235599 -155603 -59822
18665a35799d3688A44141a53546p4308l7907e1218p2374r6988a4711A3324Q8991
$$ -135799 -43688 144141 -153546 -227854 -265761 -51218 -123592 -220580 -14711 13324 102315
18654A02315D0374a64971A83536E9114J5804e4509q589K8205j60755k2829K1237
$$ 102315 40374 -164971 183536 59114 74918 -54509 -63098 -34893 -195648 -218477 -197240
18643a97240Q5407H8868a51574A22887J55772a27800k58121R4768J17443A49781
$$ -197240 -111833 88868 -151574 122887 278659 -127800 -385921 -291153 -173710 149781
18632b17669a4355B6552b48958P8846M6552B93451a89849E6924h696j56103k81942
$$ -217669 -14355 26552 -248958 -170112 -123560 293451 -189849 56924 -8696 -164799 -446741
18621d46741a66750A65643j1429b84489A04508A0054a92631p9527H5599h5321
$$ -446741 -166750 165643 154214 -284489 104508 10054 -192631 -272158 85599 -85321
18610A5473c39570J66011d1503H0536a02465d1529J0174A20657m7821c82294a67675
$$ 15473 -339570 -173559 -41503 80536 -102465 -41529 -31355 120657 72836 -382294 -167675
18598c29907Q3816H4701b7090B5851F875a33411j46294J1308l3839J25546o331
$$ -329907 -246091 84701 -27090 25851 6875 -133411 -279705 -268397 -302236 -176690 -183021
18587a83021A35162h6513d2827j18216F3122J07167j9281b98491d7138A20991
$$ -183021 135162 -86513 -42827 -161043 63122 170289 151008 -298491 -47138 120991
18576D54921C1868P5179J29408n1158J11814n4497I0427b13k36197g0259r2518
$$ 454921 31868 107047 236455 185297 297111 242614 90427 -213 -236410 -70259 -162777
18565a62777A22027b7227k98160a3000A71471G2840A2085J0551a14208A54924
$$ -162777 122027 -27227 -325387 -13000 171471 72840 12085 22636 -114208 154924
18554H0770J04762c7256m9091D17702A48365F7967J74566A14062D3684a35029
$$ 80770 185532 -37256 -86347 417702 148365 67967 242533 114062 43684 -135029
18543h4814k56469i0738l9157M6823b7224G9627c51491A7359R9373h0156K9789
$$ -84814 -341283 -90738 -129895 -83072 -27224 79627 -351491 17359 116732 -80156 -50367
18532e0367A67592m6045E4004B5906Q9476f1909B1928c86667C25274A4363J22234
$$ -50367 167592 121547 54004 25906 115382 -61909 21928 -386667 325274 14363 136597
18521A36597J03759b64090E8916b08392M0648l43112b55217j92077G0877J53144
$$ 136597 240356 -264090 58916 -208392 -167744 -510856 -255217 -447294 70877 224021
18511B24021B1509d5995j17658e0015j78232A80767a10861m5240e641k28890A39080
$$ 224021 21509 -45995 -163653 -50015 -228247 180767 -110861 -156101 -5641 -234531 139080
18499g0421b8189o5595j28948L6828D6192a43338H5149a02523B57707l8974a60216
$$ -70421 -28189 -93784 -222732 -185904 46192 -143338 85149 -102523 257707 218733 -160216
18487b47456K5514N9853J5072k8178A8083d0361k06758K5022I1739a13496a5331
$$ -247456 -221942 -162089 -147017 -175195 18083 -40361 -247119 -222097 91739 -113496 -15331
18475d4466c597l9701j59888d94j35657A08370P193M4874R0715c39727I1010h7250
$$ -44466 -3597 -43298 -203186 -494 -136151 108370 115563 160437 251152 -339727 91010 -87250
18462A73900b94439a00369j31539A6478D956Q266K04291a11898j48182b4571j18503
$$ 173900 -294439 -100369 -231908 16478 4956 13222 217513 -111898 -260080 -24571 -143074
18451a43074A39550R957e2257C3665a07393A59514E154J34679a36659c0076k25114
$$ -143074 139550 149507 -52257 33665 -107393 159514 5154 139833 -136659 -30076 -255190
18440b55190n2987I2220a54442B60909a59068I7558b04383b9459j14230m9179
$$ -255190 -308177 92220 -154442 260909 -159068 97558 -204383 -29459 -143689 -192868
18430a92868A10082P0476a04010r5591l209F5855D625K07832a94045A21718L3107
$$ -192868 110082 180558 -104010 -199601 -202810 65855 4625 212457 -194045 121718 154825
18419A54825a30747B6154J61536b81483e2923q5073I6574e7474l39564D3011c32911
$$ 154825 -130747 26154 187690 -281483 -52923 -137996 96574 -57474 -397038 43011 -332911
18407a12165j5858b2457B33489F8078g7480J8232A6178a82632d8953k76958i282
$$ -112165 -128023 -22457 233489 68078 -77480 -59248 16178 -182632 -48953 -325911 -9282
18395b95118B90290g041j33271A3192J08462L7762a01303C3588b69351H6605B1464
$$ -295118 290290 -7041 -140312 13192 121654 159416 -101303 33588 -269351 86605 21464
18383G4159b4173K042j29821B33447a28489A33161a32132D817b21829R4731j13586
$$ 74159 -24173 -22131 -151952 233447 -128489 133161 -132132 4817 -221829 -127098 -240684
18372b40684K470R2608l15467b154F0950p504d3419n73c571k07792r7785A74668
$$ -240684 -238214 -145606 -461073 -2154 60950 53446 -43419 -43992 -3571 -211363 -309148 174668
18359e8643l6177A08649b2205A69458g8389B50612H0115a37246F2590c48619B38671
$$ -58643 -94820 108649 -22205 169458 -78389 250612 80115 -137246 62590 -348619 238671
18347C4996a96729O0509b2950k17321P7356l4564n40J185k44002a14087O628p2852
$$ 34996 -196729 -136220 -22950 -240271 -162915 -197479 -198019 -196834 -440836 -114087 -107459 -180311
18335a80311B6106K31961B1937a93177C594a96702A19634i6115B35568a41416
$$ -180311 26106 258067 21937 -193177 3594 -196702 119634 -96115 235568 -141416
18324b00498L4321L6498j49101J38596M5883C8260J77781a46606f3716j64223
$$ -200498 -166177 -129679 -278780 -140184 -94301 38260 216041 -146606 -63716 -227939
18314b27939j10337A9295a05968J9378m2651C7548b2864D9468A3480L994c0951
$$ -227939 -338276 19295 -105968 -86590 -129241 37548 -22864 49468 13480 17474 -30951
18302G1191F412b21119A14652e0164q445o8220b5317j582D63564F2473a55353
$$ 71191 6412 -221119 114652 -50164 -58609 -126829 -25317 -26899 463564 62473 -155353
18290G8238R0456a53807N1254D001M10862I5976d4647B04795a26800e0043j66
$$ 78238 168694 -153807 -102553 4001 414863 95976 -44647 204795 -126800 -50043 -50209
18279e0209k58654F1460A9855b11488a00874c0645B17450F4584L3172B8651c9006
$$ -50209 -308863 61460 19855 -211488 -100874 -30645 217450 64584 97756 28651 -39006
18267a38446O8324j56137e9974q2417g234j28508A11095b661I9542c3429r8454
$$ -138446 -70122 -226259 -59974 -142391 -7234 -135742 111095 -2661 99542 -33429 -131883
18256a31883I4015h8345j52222a01730A77258a71521c9372A95564c3457k27756
$$ -131883 94015 -88345 -240567 -101730 177258 -171521 -39372 195564 -33457 -261213
18246b61213a01478B2592b98207f3179m2875A53667d4820r4006K3441L637F0016
$$ -261213 -101478 22592 -298207 -63179 -106054 153667 -44820 -138826 -115385 -111748 60016
18234A7617J72936a02769k3138j72234c6262j56980g3433A40789c4028q5129b4933
$$ 17617 190553 -102769 -125907 -298141 -36262 -193242 -73433 140789 -34028 -119157 -24933
18222d4621l5337B82869a70383K2877C1499L33221a35606G7847b03514f0767A48663
$$ -44621 -79958 282869 -170383 -147506 31499 364720 -135606 77847 -203514 -60767 148663
18210B37564d5770I7911a1834k55839B45449D2021p244J36907I904b53027A88531
$$ 237564 -45770 97911 -11834 -267673 245449 42021 34777 171684 9904 -253027 188531
18198b60768J25835A47956L14215e3669a3876m2579E2800b26621B3654a55484
$$ -260768 -134933 147956 462171 -53669 -13876 -56455 52800 -226621 23654 -155484
18187C02239n974a08122j5609j25988G4439f3029n4457j40012A34727C8554J67346
$$ 302239 296265 -108122 -123731 -249719 74439 -63029 -117486 -257498 134727 38554 205900
18176B05900m6764d7511m8267E5478a49031L1419E5045c55128g2035e140p5047
$$ 205900 159136 -47511 -95778 55478 -149031 -117612 55045 -355128 -72035 -5140 -80187
18165h0187L7355O93A45981b21459E2826l018d87942a87723b4601A25823a81889
$$ -80187 -42832 -42139 145981 -221459 52826 49808 -487942 -187723 -24601 125823 -181889
18153C43126B6168R4059C1310a44332B40201n9868b6421j17261F8609c4077A82574
$$ 343126 26168 120227 31310 -144332 240201 180333 -26421 -143682 68609 -34077 182574
18141a78609L0446O1209I9973b52014E0893E398b95184B3544b20544C89951n4770
$$ -178609 -148163 -86954 99973 -252014 50893 5398 -295184 23544 -220544 389951 335181
18130C35181E2694a86286j774A18474c3609A21210a74504f586l36811C4440a09418
$$ 335181 52694 -186286 -188060 118474 -33609 121210 -174504 -6586 -343397 34440 -109418
18118d11917d3520r4780k31529b277o7734G9264b02221A36253k2506e3827Q390
$$ -411917 -43520 -138300 -369829 -2277 -70011 79264 -202221 136253 113747 -53827 -45437
18107d5437p2198e6169B24495H2475l7552a47774A34196J73178a06994j09060
$$ -45437 -117635 -56169 224495 82475 44923 -147774 134196 307374 -106994 -216054
18097b16054J207k0900a7430k27147h5324k12510d9885G4805a00726l4450D19636
$$ -216054 -214847 -235747 -17430 -244577 -85324 -297834 -49885 74805 -100726 -135176 419636
18085E4170b85301B85407E5a88284m5429b2806n0276B93467a92067Q0983k57527
$$ 54170 -285301 285407 55 -188284 -233713 -22806 -73082 293467 -192067 -111084 -368611
18074c68611a48396D3316a02244A55231i3928j56473B23127i5584A9403c7286
$$ -368611 -148396 43316 -102244 155231 -93928 -250401 223127 -95584 19403 -37286
18063b53265D3716b77398A07219e5491B7444Q4209b9872k5116k19247A7879b69068
$$ -253265 43716 -277398 107219 -55491 27444 111653 -29872 -54988 -274235 17879 -269068
18051H0893c4114D9322a34739E2959K91577a05185A48900K8118e9947A33797f907
$$ 80893 -34114 49322 -134739 52959 344536 -105185 148900 177018 -59947 133797 -6907
18039F1773a55493f4584j94695L1261P91D3120k011g3661C48212C2029J12342
$$ 61773 -155493 -64584 -259279 -228018 -227227 43120 41109 -73661 348212 32029 144371
18028A44371e9868B07704a92257K1281j4723P0571D4230L64736D4370j7630d22417
$$ 144371 -59868 207704 -192257 -170976 -185699 -115128 44230 408966 44370 26740 -422417
18016A30895a19995B11637a03619p2454f3588j04022h3297A18847b39327C19711
$$ 130895 -119995 211637 -103619 -176073 -63588 -167610 -83297 118847 -239327 319711
18005I724K11650j02648J39498l2226a75607d6114g118n4062j55871F8309N8412
$$ 9724 221374 118726 258224 225998 -175607 -46114 -7118 -61180 -217051 68309 126721
17994A26721R7621a60610A37687a06119B87582A35460b7384G1800B2583f7829
$$ 126721 224342 -160610 137687 -106119 287582 135460 -27384 71800 22583 -67829
17983B89719D2484h4462k10947i9466n5953r4657J00127A72105b96480E6428a48030
$$ 289719 42484 -84462 -295409 -99466 -155419 -250076 -149949 172105 -296480 56428 -148030
17971c24584A29272b08290A59999a333C4989b11752g6367A10833B7277c07786
$$ -324584 129272 -208290 159999 -1333 34989 -211752 -76367 110833 27277 -307786
17960b87470a8757C03192A35941f4599C00602a75954q2399a16786o9095D76102
$$ -287470 -18757 303192 135941 -64599 300602 -175954 -258353 -116786 -185881 476102
17949F9020J46456b06769i5735F4777A5282J54771d8743J3395n0618L904p2306
$$ 69020 215476 -206769 -95735 64777 15282 170053 -48743 -35348 -85966 -82062 -154368
17938a54368A11810d01488a06569o181j63978A32267K8402d4342A37228R8263
$$ -154368 111810 -401488 -106569 -112750 -276728 132267 160669 -44342 137228 235491
17928B35491a26786D9718a91j5757k45123B59990E552Q2603R6260d4202k49526
$$ 235491 -126786 49718 -191 -15948 -261071 259990 5552 88155 184415 -44202 -293728
17917b93728a26171j88007B4590b5015A47592c0129k50245E0103A3776c2420I5948
$$ -293728 -126171 -314178 24590 -25015 147592 -30129 -280374 50103 13776 -32420 95948
17905E0593M4694b3275l15217J60795j27857g2283a1693A12884a32907f1540l10356
$$ 50593 95287 -23275 -338492 -177697 -305554 -72283 -11693 112884 -132907 -61540 -371896
17894c71896I6099e3956B5142J04343e8803A97209J20710a00626M5821p5792K5625
$$ -371896 96099 -53956 25142 129485 -58803 197209 317919 -100626 -54805 -130597 -104972
17883a04972l09555A33276b62389I7304j3929a01858B54745m3675e8527r2124
$$ -104972 -414527 133276 -262389 97304 83375 -101858 254745 211070 -58527 -150651
17873a50651C4266n773a21323N6201J4626A0251N825c27794B840J47609J3440
$$ -150651 34266 28493 -121323 -65122 -50496 10251 16076 -327794 2840 150449 163889
17862A63889J9394B3406i9083K6312j2918A99059K68867j93113a19140b1828B02964
$$ 163889 183283 23406 -99083 -72771 -85689 199059 467926 274813 -119140 -21828 202964
17850B06341B5456b92237A83648H2929a0882D11910b83829A5038M12147j49840
$$ 206341 25456 -292237 183648 82929 -10882 411910 -283829 15038 427185 277345
17840B77345f9828j3004o2105e1116K1387A08122m8537b17469J06503k2413M1218
$$ 277345 -69828 -82832 -144937 -51116 -29729 108122 59585 -217469 -110966 -133379 -92161
17829i2161F9923i6622L5901A91284p5088J03060l8977a59694E6764J11766Q148
$$ -92161 69923 -96622 -60721 191284 116196 219256 180279 -159694 56764 168530 176678
17818A76678l9230l4261B0298J46607g266D6837F58R7983C039f3691B08471a07371
$$ 176678 137448 103187 20298 166905 -7266 46837 658 98641 3039 -63691 208471 -107371
17805c252C2719g4826I3172c06318J49217J224F2443d511j23465j0213A98322
$$ -3252 32719 -74826 93172 -306318 -157101 -155877 62443 -4511 -127976 -138189 198322
17793a43461A7123J410J27150h9813p2248A86334a58078A4517J30004a36960j68072
$$ -143461 17123 18533 145683 -89813 -162061 186334 -158078 14517 144521 -136960 -305032
17782c05032f1192E4408f5002r6638e6544A01673a00277J9618A5642b0496A24637
$$ -305032 -61192 54408 -65002 -161640 -56544 101673 -100277 -80659 15642 -20496 124637
17770A16844O9945o9279A8871g8441A27344d9856a8599B63566a75427B03414a01376
$$ 116844 186789 117510 18871 -78441 127344 -49856 -18599 263566 -175427 203414 -101376
17758c40711h3272j60432k51178d3466k38385I657K14543a758A43662a0756B8766
$$ -340711 -83272 -243704 -494882 -43466 -281851 9657 224200 -1758 143662 -10756 28766
17746A20909B3319N0671a11092A17566d7153C01952j47041l3980a56560j1733
$$ 120909 23319 73990 -111092 117566 -47153 301952 154911 120931 -156560 -168293
17736a68293C7218M409a71336J6157A62715a16270l1148j14806J10178j816A39818
$$ -168293 37218 41627 -171336 -155179 162715 -116270 -147418 -262224 -152046 -153862 139818
17724A71076j5174h1131J0794J6403k44602h2112F0608g2649B27626k7496b5377
$$ 171076 155902 -81131 -70337 -53934 -298536 -82112 60608 -72649 227626 200130 -25377
17712B62578C5101g0875A76349a35665r7378e1199B2261a8487m1847q5084L7193
$$ 262578 35101 -70875 176349 -135665 -233043 -51199 22261 -18487 -60334 -145418 -108225
17701a08225i421A50837Q7344j03290g327j05345k98553C94146f8006k40356B15733
$$ -108225 -9421 150837 238181 134891 -7327 -112672 -411225 394146 -68006 -308362 215733
17689a08595j73626G5522b58595A59854J11097D8705e0876r0835B1909J4839J65260
$$ -108595 -282221 75522 -258595 159854 270951 48705 -50876 -141711 21909 36748 202008
17678B02008M09C7602D496L20503D8689i7538N309A64558o6616P3303d7591B12775
$$ 202008 202417 37602 4496 324999 48689 -97538 -92229 164558 97942 171245 -47591 212775
17665F9984b66395B66282D3620a30939A7658K11980F1847K05067B1814J11076
$$ 69984 -266395 266282 43620 -130939 17658 229638 61847 266914 21814 132890
17655A32890i376B72618b49527a17591K4765A39196O8112F6530c61767a50130
$$ 132890 -9376 272618 -249527 -117591 -92826 139196 207308 66530 -361767 -150130
17644b66555A01338K30008A25542P6584A8061L2513g4657A12763C9050e3222B08198
$$ -266555 101338 331346 125542 202126 18061 50574 -74657 112763 39050 -53222 208198
17632A10043a12403A40746A2241a19411N5123A57957d2808F4635a04068h531o8519
$$ 110043 -112403 140746 12241 -119411 -64288 157957 -42808 64635 -104068 -8531 -77050
17621g7050L778H0070O348e0892B28572f8772I5193A2818J60498c0460B31696
$$ -77050 -73272 80070 86418 -50892 228572 -68772 95193 12818 173316 -30460 231696
17609B60401a58063A31137L7599e6914A25271E5665J1594f6730B69371b03910
$$ 260401 -158063 131137 168736 -56914 125271 55665 67259 -66730 269371 -203910
17598i7757C4673a58252A14443D5914B0172c225j03681B01664E5353J20771E5586
$$ -97757 34673 -158252 114443 45914 20172 -3225 -106906 201664 55353 176124 55586
17586D11055A49451R2425E1358c36558G1327c6597F140L54891a58300r0618I6812
$$ 411055 149451 241876 51358 -336558 71327 -36597 6140 361031 -158300 -248918 96812
17574g1627j52141g8975m9755L2281C47815g784B20832a95297A950d515D4803
$$ -71627 -223768 -78975 -128730 -96449 347815 -7784 220832 -195297 1950 -4515 44803
17562C57332r3863d8863l3869b3482A95516J15850b46256B11956c02798G7546
$$ 357332 263469 -48863 -82732 -23482 195516 311366 -246256 211956 -302798 77546
17551i125C6674L988K71223j01491L9496a46733A93727F6556b7544F5657O0696
$$ -9125 36674 40662 311885 210394 249890 -146733 193727 66556 -27544 65657 126353
17540A26353J29898e9942o491a29D41809B5074f2878m2488C86101B5068f5026
$$ 126353 256251 -59942 -66433 -129 441809 25074 -62878 -105366 386101 25068 -65026
17528A09155g1161A71686O3708f9956C15242A35812m4743i9911B16141d28686
$$ 109155 -71161 171686 235394 -69956 315242 135812 91069 -99911 216141 -428686
17517C14748A32082a64435A59485D2362K9508e7933b3800D95381h4010j65207
$$ 314748 132082 -164435 159485 42362 71870 -57933 -23800 495381 -84010 -249217
17507b49217B53070a83365c6892A6175L5590b31705A05990J9867A0106L44844
$$ -249217 253070 -183365 -36892 16175 51765 -231705 105990 125857 10106 354950
17497C54950c9499D56946a3508A08097J13806b68175D3482J2569M790K12789g6361
$$ 354950 -39499 456946 -13508 108097 221903 -268175 43482 56051 60841 273630 -76361
17485A86358J58749C8117L00412b54935N2995B92867I4463i2476B92184l9209
$$ 186358 345107 38117 338529 -254935 -201940 292867 94463 -92476 292184 252975
17475B52975h7711I9227M08489j12084A86660K9700A0859K11317R8608r8914A3517
$$ 252975 -87711 99227 507716 395632 186660 216360 10859 222176 320784 221870 13517
17463d0582j16491A34626J31416b9029A84626n1778e3799C18561I866K94767o5437
$$ -40582 -157073 134626 266042 -29029 184626 132848 -53799 318561 9866 304633 239196
17452B39196K31374A04331L03023I2932J26655M58198D5277Q4002K7008F9254
$$ 239196 470570 104331 407354 92932 219587 677785 45277 129279 156287 69254
17441d8130F71637G9445K50139j08599k0280J71153a0990C91637Q783j65800L5243
$$ -48130 671637 79445 329584 220985 200705 371858 -10990 391637 400420 234620 269863
17430B69863J7509Q8654K3995A46954K17925j70567R4437J18949A80704Q8868
$$ 269863 287372 376026 400021 146954 364879 194312 288749 407698 180704 269572
17420B69572O7527A55050N2265E1049O0298n3232L62018M8542H3903a9928A23866
$$ 269572 337099 155050 207315 51049 111347 58115 420133 468675 83903 -19928 123866
17408a82835A03554e4360B93553G0496J4913J59071Q3295P2294C2636K17277j20397
$$ -182835 103554 -54360 293553 70496 85409 244480 327775 400069 32636 249913 129516
17397A29516l8386m4856c11682A39670b0225B69960e4635C88714p1160A45353
$$ 129516 91130 46274 -311682 139670 -20225 269960 -54635 388714 317554 145353
17386A88096Q4923q6467Q2513p127B5933f7326Q698A31515C6568a36058C6308
$$ 188096 273019 186552 269065 261938 25933 -67326 -58628 131515 36568 -136058 36308
17374A36423j9593c2390C06551A14961c9566I1059J43491E7130J88991C0531b78144
$$ 136423 116830 -32390 306551 114961 -39566 91059 234550 57130 246121 30531 -278144
17362E8269J94054r2752k2757a87246B45735g5572l9525A34676d0388C46628A06254
$$ 58269 252323 159571 136814 -187246 245735 -75572 -115097 134676 -40388 346628 106254
17350g4624A11182c270D81198J176i9302B85266C1266K4386J70417i5102H1905
$$ -74624 111182 -3270 481198 482374 -99302 285266 31266 55652 226069 -95102 81905
17338b53434e1542b1009H0431J67914o4330D7311J62559B2391K59326h0772A11717
$$ -253434 -51542 -21009 80431 248345 184015 47311 209870 22391 281717 -80772 111717
17326D76770j84949a23207A96180K54997A3007K24309E956N70905A25341E626
$$ 476770 291821 -123207 196180 451177 13007 237316 5956 576861 125341 5626
17315A87387f4898F7297j6443N0090b9907C14765j38317O9883a92212A87064F0662
$$ 187387 -64898 67297 50854 100944 -29907 314765 176448 246331 -192212 187064 60662
17303B74938K3936r5233G4521J18515r6160L5390k7349a70431d2170B75760p3072
$$ 274938 298874 203641 74521 193036 96876 132266 104917 -170431 -42170 275760 202688
17292B02688r4192B8250O2069k8492J82678R489c0075C56953b3537D29753r3173
$$ 202688 108496 28250 90319 61827 244505 253994 -30075 356953 -23537 429753 336580
17281C36580A02068R2592b1705F5461K73242j00073B125N3723K8066P4559l6411
$$ 336580 102068 194660 -21705 65461 338703 238630 2125 55848 83914 158473 122062
17270A22062E7703K16152a93628E2495L9934d0193J1818A06665K1758J0353K23511
$$ 122062 57703 273855 -193628 52495 92429 -40193 -28375 106665 128423 138776 362287
17259C62287h5619A0749a05286E0376b32510B54585K98564a40438A83736a41480
$$ 362287 -85619 10749 -105286 50376 -232510 254585 553149 -140438 183736 -141480
17248A29139J25078p2303H2766N5878L21412A06559k564m8158K03796J90521j46429
$$ 129139 254217 181914 82766 138644 460056 106559 103995 55837 259633 450154 303725
17237C03725C4093J09981o6701b4215j03748A32188k8709J25597G6880M3311K541
$$ 303725 34093 144074 77373 -24215 -127963 132188 103479 229076 76880 120191 122732
17226A22732M67176H4421J8263m9703a54438B22875L09558B9127L5367M62436
$$ 122732 589908 84421 102684 52981 -154438 222875 532433 29127 64494 526930
17216E26930A79577K06240A36727Q6597j8052J3215j8165L802a00415A98569K1012
$$ 526930 179577 385817 136727 223324 205272 218487 200322 204124 -100415 198569 219581
17205B19581F8245o370K13106o3743o0513L7266J87910o0865K9585A22156J10033
$$ 219581 68245 61875 274981 211238 150725 187991 375901 315036 344621 122156 232189
17194B32189L96131b5411E0902e5154A30505j0896a81235B3091L88912C8419K50254
$$ 232189 628320 -25411 50902 -55154 130505 119609 -181235 23091 412003 38419 288673
17183B88673I5733K69641A39301h667C60527k4151A49798a20432C49450A8088
$$ 288673 95733 365374 139301 -8667 360527 336376 149798 -120432 349450 18088
17172D94525K67271C37172o0372J7148n4622K65796j17966j02080F9480K94197
$$ 494525 761796 337172 276800 293948 239326 505122 387156 285076 69480 363677
17162C63677A03781J67317m0138b8392A50419L4495L75304A33275J51185l0489
$$ 363677 103781 271098 230960 -28392 150419 184914 560218 133275 284460 253971
17152B53971n6492k4359j9819R2349L8821K14622k14870A2695K35711K37709m213
$$ 253971 197479 173120 153301 245650 284471 499093 284223 12695 248406 486115 481902
17141D81902c8582D39973B1267M02283A24489N114R0318N2034p2627K88631k08973
$$ 481902 -38582 439973 21267 423550 124489 129603 219921 271955 199328 487959 278986
17130B78986C192M01859j57570k6584K19236K7891j98784J71760k14122G0508
$$ 278986 3192 405051 247481 220897 440133 468024 269240 441000 226878 70508
17119B06560L5901k4795J80939A71213J46058A29767K24469M71552B30208K31511
$$ 206560 242461 217666 398605 171213 317271 129767 354236 825788 230208 461719
17109D61719j96058j12608M57160j37731O3987F6646L06018l8461K73563B60160
$$ 461719 265661 153053 610213 472482 536469 66646 372664 334203 607766 260160
17098B32542N60751a9988A30929M84953k96006K21452o7666P3278G4496M45990
$$ 232542 793293 -19988 130929 615882 319876 541328 473662 546940 74496 520486
17088E20486L14106k95585K7526k20790Q6161j59781L08109A1125P22812K33876
$$ 520486 834592 539007 566533 345743 431904 272123 580232 11125 733937 967813
17078I67813k91379j83597O493k48820K79618j34792n3376L00283A97213M04408
$$ 967813 676434 492837 499330 250510 530128 395336 341960 642243 197213 601621
17068F01621j94631K11802k7396j71079n6506L5948J70736q9441k1668j01483
$$ 601621 406990 618792 591396 420317 363811 399759 570495 481054 459386 357903
17058C57903j00929J35183P9022A89486K87595O5841J25226J40059Q6528l69004
$$ 357903 256974 392157 471179 189486 477081 542922 668148 808207 894735 525731
17048E25731J63147k7173B05177L79371j47131K69328j46378q1852K30742C20553
$$ 525731 688878 661705 205177 584548 437417 706745 560367 478515 709257 320553
17037E58470k3693o947K70335j48809L7302j51507k2029k9748j90055K85084L2677
$$ 558470 534777 527830 798165 649356 686658 535151 513122 483374 293319 578403 611080
17026F11080J00866l23705O48018m47058L29756l05305N5906K04187j20636j58526
$$ 611080 711946 388241 1036259 589201 918957 613652 669558 873745 753109 594583
17016E94583j4831j13124L10199N0972j92718k63086K06572A87161N99802k27878
$$ 594583 579752 466628 776827 827799 635081 371995 578567 187161 786963 559085
17006E59085J45542J20924J08250m08956l6687Q6560P0578N8924L10896j82938
$$ 559085 704627 825551 933801 524845 488158 574718 645296 704220 1015116 832178
16996H32178q0197M60032C32901L91977k66146m4543J96057k62291J81053J95567
$$ 832178 751981 1212013 332901 724878 458732 414189 610246 347955 529008 724575
16986G24575J3949J64319J27247r0496l62906l577K34268L38497E36078K99690
$$ 724575 738524 902843 1030090 939594 576688 573111 807379 1145876 536078 835768
16976H35768j6107j43334K79176J48952l50901o7279L71327j65407N7217j04941
$$ 835768 819661 676327 955503 1104455 753554 686275 1057602 892195 949412 844471
16966H44471J88716k99439J37904j83102N7664k08789J56451K16745J13577k01970
$$ 844471 1033187 733748 871652 688550 746214 537425 693876 910621 1024198 822228
16956H22228R5190m1707J28691P9283J06482j65873J14149j8198l8621l5305l5520
$$ 822228 917418 875711 1004402 1083685 1190167 1024294 1138443 1120245 1081624 1046319 1010799
16945A010799Q423k24450L67226Q601r9976K42507j97501J05674L4375j2528n2309
$$ 1010799 1019222 794772 1161998 1170599 1070623 1313130 1115629 1221303 1255678 1243150 1190841
16934A190841k07139Q5060J68647j5363o8718J12528m241M4522r8683J06572J80521
$$ 1190841 983702 1068762 1237409 1222046 1153328 1265856 1261615 1306137 1207454 1314026 1494547
16923A494547K53237m00088K6511J8804k60810L98559j49844j28967J78603j51349
$$ 1494547 1747784 1347696 1374207 1393011 1132201 1530760 1380916 1251949 1430552 1279203
16913A279203J87212J53108k53951J65377l28300J26499K98372j17371o2895m998
$$ 1279203 1466415 1619523 1365572 1530949 1202649 1329148 1627520 1510149 1447254 1442256
16903A442256L8609j39413N25571M1291L5069o13996O19841k62989j38479J84081
$$ 1442256 1480865 1341452 1867023 1908314 1943383 1329387 1949228 1686239 1547760 1731841
16893A731841P1545l47426N67627l10209M61856m03306K79942O8620N2878j56057
$$ 1731841 1803386 1455960 2023587 1713378 2175234 1771928 2051870 2120490 2173368 2017311
16883B017311o728K6705J54503j88831O3022n63L14611n31280L54900K29502k15255
$$ 2017311 2010583 2037288 2191791 2002960 2065982 2065419 2380030 1848750 2203650 2433152 2217897
16872B217897j28922K63014J31799m5982J35298l60782K37507L31131l71999k3343
$$ 2217897 2088975 2351989 2483788 2437806 2573104 2212322 2449829 2780960 2408961 2385618
16862B385618L74343K04279k40767k80503L30005k3884J6173n971N037L60374
$$ 2385618 2759961 2964240 2723473 2442970 2772975 2749091 2765264 2759293 2764330 3124704
16852C124704L50393m11955M9282r5948M83246o13344M50608m37126N91784k3165
$$ 3124704 3475097 3063142 3112424 3016476 3499722 2886378 3336986 2899860 3491644 3468479
16842C468479P4629Q2766J27047L42455l81865J97842l9533N41554k27900P6433
$$ 3468479 3543108 3625874 3752921 4095376 3713511 3911353 3871820 4413374 4185474 4261907
16832D261907j02573K80089J0382J18499p9614L38730q6847k55301K40480L90075
$$ 4261907 4159334 4439423 4449805 4568304 4488690 4827420 4740573 4485272 4725752 5115827
16822E115827m4433P013L15206j93324k46515N52929j19932N10439l5018m00706
$$ 5115827 5071394 5078407 5393613 5200289 4953774 5506703 5386771 5897210 5862192 5461486
16812E461486Q41377j37248M53723J03779K38820l36125J63872J11543M00896
$$ 5461486 6302863 6165615 6619338 6723117 6961937 6625812 6789684 6901227 7302123
16803G302123L6915K42303K9293K24494K97462K57356J06099J05716J56744M08889
$$ 7302123 7339038 7581341 7610634 7835128 8132590 8389946 8496045 8601761 8758505 9167394
16793I167394M24603l1564J18868J25852N49736j10919O48612K52165K27145M92932
$$ 9167394 9591997 9560433 9679301 9805153 10354889 10243970 10892582 11144747 11371892 11864824
16783A1864824J43217L67475L64896M34318M47537K70710N16084N06891N93582
$$ 11864824 12008041 12375516 12740412 13174730 13622267 13892977 14409061 14915952 15509534
16774A5509534L05991L64303O58256M97049R04214N24916O30020P27450N75603
$$ 15509534 15815525 16179828 16838084 17335133 18239347 18764263 19394283 20121733 20697336
16765B0697336J102780R36097R68422N03649J208313R55540R24619J400767J236804
$$ 20697336 21800116 22736213 23704635 24208284 25416597 26372137 27296756 28697523 29934327
16756B9934327J508170Q61549J720158J403204J841592J898936K036079K202560
$$ 29934327 31442497 32304046 34024204 35427408 37269000 39167936 41204015 43406575
16748D3406575K214180K295202K369434L044187K711790L526371L007018L789640
$$ 43406575 45620755 47915957 50285391 53329578 56041368 59567739 62574757 66364397
16740F6364397L933178M203713M293011N055760M871066N867473N558844O501430
$$ 66364397 70297575 74501288 78794299 83850059 88721125 94588598 100147442 106648872
16732A06648872O441462O603044P431684P458592P267565Q047050Q067893P686804
$$ 106648872 113090334 119693378 127125062 134583654 141851219 149898269 157966162 165652966
16724A65652966P019353O820651N927471N013484L835803L118051J238575L89121
$$ 165652966 172672319 179492970 185420441 190433925 194269728 197387779 198626354 199015475
16716A99015475j453598k891245l915015m906187o174624o640005p285944p835300
$$ 199015475 197561877 194670632 190755617 185849430 179674806 173034801 165748857 157913557
16708A57913557q086603p692057q035666p691232p442058p028100o891125o098141
$$ 157913557 149826954 142134897 134099231 126407999 118965941 111937841 105046716 98948575
16700I8948575o395052n108386n359023n018632m808033l697712m148621l812020
$$ 98948575 92553523 87445137 82086114 77067482 72259449 68561737 64413116 60601096
16692F0601096l351212l071343k782182k726821k887899k230644k045803k034962
$$ 60601096 57249884 54178541 51396359 48669538 45781639 43550995 41505192 39470230
16684C9470230k197164j783717j712302j101724j774502j317693j595275j000400
$$ 39470230 37273066 35489349 33777047 32675323 30900821 29583128 27987853 26987453
16676B6987453j384964j041465q75826r58176p47789q67359r24620q34354o19250
$$ 26987453 25602489 24561024 23685198 22727022 21979233 21111874 20187254 19352900 18733650
16667A8733650n80883p66768o80595n20705m21115l23793q47915m17779l41011
$$ 18733650 18152767 17385999 16705404 16184699 15763584 15439791 14591876 14174097 13833086
16658A3833086n48644l56782q87797J87896o19409l76052k14844k54422n75828
$$ 13833086 13284442 12927660 12039863 12227759 11608350 11232298 11017454 10763032 10187204
16649A0187204m39897Q6481l29194m17096j04169k21978n74876m1893l62965J15216
$$ 10187204 9747307 9833788 9504594 9087498 8983329 8761351 8186475 8144582 7781617 7896833
16639G896833k89466N1552k58594l76233o4863l89993l9269K16159n16211r2702
$$ 7896833 7607367 7658919 7400325 7024092 6959229 6569236 6529967 6746126 6229915 6137213
16629F137213l61836q2505N910k57600m06254j5965N7479l4820R4373j41701m27409
$$ 6137213 5775377 5692872 5698782 5441182 5034928 5018963 5076442 5041622 5135995 4994294 4566885
16618D566885L8233k59301K6381j23500j5821k86498K97581k19180l58373M27605
$$ 4566885 4605118 4345817 4372198 4248698 4232877 3946379 4243960 4024780 3666407 4094012
16608D094012J8581l81532j88375K6161l53295M21781k93717N2857r8953L4696
$$ 4094012 4112593 3731061 3542686 3568847 3215552 3637333 3343616 3396473 3297520 3332216
16598C332216l21707J24944j50929J58724k17787Q9311k45614k5483p2250L3513
$$ 3332216 3010509 3135453 2984524 3143248 2925461 3014772 2769158 2743675 2671425 2704938
16588B704938j56075N03429q00577K70936j18108l12858L07105l70799L10910
$$ 2704938 2548863 3052292 2251715 2522651 2404543 2091685 2398790 2027991 2338901
16579B338901k47400K63238K06620k98767P0793j64148P3087k61901J79808k73224
$$ 2338901 2091501 2354739 2561359 2262592 2333385 2169237 2242324 1980423 2160231 1887007
16569A887007J48385J0262k61478J4474L91674j78122j99405j34100L34656k86848
$$ 1887007 2035392 2045654 1784176 1798650 2190324 2012202 1812797 1678697 2013353 1726505
16559A726505j54311M75283k31039j32427K20132j19812l41531L24018m5469j72281
$$ 1726505 1572194 2047477 1816438 1684011 1904143 1784331 1442800 1766818 1721349 1549068
16549A549068P0642j86354M64163l94232j40172k08550K48454k20850K65234n28454
$$ 1549068 1619710 1433356 1897519 1503287 1363115 1154565 1403019 1182169 1447403 918949
16539I18949P84027m85825J43176o01506Q44720n28582O4460L7977J42204j99860
$$ 918949 1702976 1217151 1360327 758821 1603541 1074959 1139419 1177396 1319600 1119740
16529A119740P6333K86773O3418n38232K18790L24659k77057k62485K0371R1465
$$ 1119740 1196073 1482846 1546264 1008032 1226822 1551481 1274424 1011939 1032310 1123775
16519A123775j12597K97300j23039j99332q7942J03728j45385n4418j58930J51583
$$ 1123775 1011178 1308478 1185439 986107 898165 1001893 856508 802090 643160 794743
16509G94743P583K17342k20148q0719M0102K62534m51101K45972k5511j65267
$$ 794743 802326 1019668 799520 718801 758903 1021437 570336 816308 790797 625530
16499F25530L54407l39685j4403O6642K2192m1991K4702J10922l8717j29458J66660
$$ 625530 979937 640252 625849 692491 714683 672692 697394 808316 769599 640141 806801
16488H06801k30452M91179n05797L21971K0465l39857M39135m23819L4087J78307
$$ 806801 576349 1067528 561731 883702 904167 564310 1003445 579626 613713 792020
16478G92020k30251r6346K12227j42393M1201J43118M5513j6481k0890p0285j06187
$$ 792020 561769 465423 677650 535257 576458 719576 765089 748608 727718 657433 551246
16467E51246k5338J97997A65934K03152J35628M2055k04138J9990J51325L2322
$$ 551246 525908 723905 165934 369086 504714 546769 342631 362621 513946 546268
16457E46268J01131k09507Q5525L39673l31412o9609N4765K6505n4162J50442
$$ 546268 647399 437892 523417 863090 531678 462069 516834 543339 489177 639619
16447F39619r9331j49644M28443l40534k17396K89318j16257M7471q9997p9163
$$ 639619 540288 390644 819087 478553 261157 550475 434218 481689 391692 312529
16437C12529K14642r4520L98642k97998N4918k61398P5859j9214A48010L04318
$$ 312529 527171 432651 831293 533295 588213 326815 402674 383460 148010 452328
16427D52328J11040k16925J35074G4518J92478K61014j70739K47447j98394q7570
$$ 452328 563368 346443 481517 74518 266996 528010 357271 604718 406324 318754
16417C18754o4392L78905k59320J8079Q0221k1844j14419J28632J45355p0128
$$ 318754 254362 633267 373947 392026 472247 450403 335984 464616 609971 539843
16407E39843B25347M5894J5530K4869k2705K5211J88405A99466L09511K32813
$$ 539843 225347 271241 286771 311640 288935 314146 502551 199466 508977 741790
16397G41790C14123N244q9722P7412J77959A54741k8035M95404j76420C3627L14950
$$ 741790 314123 319367 229645 307057 485016 154741 126706 622110 445690 33627 348577
16386C48577j08570J03164p8412J68872J47412A12439J41609J21319A08218p622
$$ 348577 240007 343171 264759 433631 581043 112439 254048 375367 108218 100596
16376A00596O4431O6694A15382J00402J41031j40452L9841J12347j1390J20691
$$ 100596 165027 231721 115382 215784 356815 216363 256204 368551 357161 477852
16366D77852j84970K31310H9925L47364j76049F277L00841j34571K93637A93624
$$ 477852 292882 524192 89925 437289 261240 6277 307118 172547 466184 193624
16355A84742J78405A18182J46787M6017A38474c3534k9744B79980o1763J53049
$$ 184742 363147 118182 264969 310986 138474 -33534 -63278 279980 218217 371266
16345C71266j4416j78369J8701a481D48246A50363J05282K04260J7362c6932A75342
$$ 371266 356850 178481 197182 -1481 448246 150363 255645 459905 477267 -36932 175342
16333I7455K1451J54693n0944F7282L18260A71754f7839B06049m2684F0839M62818
$$ 97455 118906 273599 222655 67282 385542 171754 -67839 206049 163365 60839 523657
16322E23657A0313a60429O2147A56820J53027A50290C350K70838A22278J10354
$$ 523657 10313 -160429 -98282 156820 309847 150290 3350 274188 122278 232632
16312B32632L6725A0490J37905O6485j02714a13674A75990K74805a93282B29129
$$ 232632 269357 10490 148395 214880 112166 -113674 175990 450795 -193282 229129
16301D37610A0005R5214K708J5497i5417D1168M46027B23520o0149h1396B43351
$$ 437610 10005 105219 107927 123424 -95417 41168 487195 223520 163371 -81396 243351
16289c4168n2485A21569E6940c4866G8585K58050j27860k753n1073f0770j479
$$ -34168 -86653 121569 56940 -34866 78585 336635 208775 206022 154949 -60770 -62249
16278f2249A36655E9999a25154C47202n6788A09538K49112j27620g9378E2536
$$ -62249 136655 59999 -125154 347202 290414 109538 358650 231030 -79378 52536
16267A59911j6434a18432A5089K78070J38328a89817D711K80886b21039h1505
$$ 159911 143477 -118432 15089 293159 431487 -189817 4711 285597 -221039 -81505
16256A91251a7102A98281q7041N2707k7570E35c9379F3941L63057m2235f5480
$$ 191251 -17102 198281 111240 163947 136377 535 -39379 63941 426998 384763 -65480
16244A29858b78961C57691j21345Q6090A54342L4927r0576a13582C71862q4660
$$ 129858 -278961 357691 236346 322436 154342 189269 98693 -113582 371862 287202
16234B87202A30499n755a5598n8611A29451A1513K08934A01065c9696E35099c9142
$$ 287202 130499 124744 -15598 -74209 129451 11513 220447 101065 -39696 535099 -39142
16222A26672M3842f5713A06780a0425j36803b8622l7005E453R6872R7823a04606
$$ 126672 170514 -65713 106780 -10425 -147228 -28622 -65627 5453 102325 200148 -104606
16210b10359B1669J15945I517K239g5412a0544B54405B7477R0714h903C72245
$$ -210359 21669 137614 9517 11756 -75412 -10544 254405 27477 118191 -8903 372245
16198F0156h93A69502J02393J09329j17183a10734A29519p519E6796a08223B16608
$$ 60156 -893 169502 271895 381224 264041 -110734 129519 122000 56796 -108223 216608
16186C42832c1299A12527b5420G0082b4758H9869C1019a25550B59856b9971C9396
$$ 342832 -31299 112527 -25420 70082 -24758 89869 31019 -125550 259856 -29971 39396
16174b35309d9862A53750d0871A90056H9696i1404A47383e9302B52507b50260
$$ -235309 -49862 153750 -40871 190056 89696 -91404 147383 -59302 252507 -250260
16163A07095a98542A16411L9700Q5023l9074D1676r551b65315D5082b30018J03330
$$ 107095 -198542 116411 156111 241134 202060 41676 32125 -265315 45082 -230018 -126688
16152a26688L7610m74L4099g528j83846i833B1228R4611O4574G9974a86516C5645
$$ -126688 -89078 -89552 -55453 -7528 -191374 -9833 21228 115839 180413 79974 -186516 35645
16139C07730q5618b13094g6820A99533j4439K7829a02279A23066b62877Q0844
$$ 307730 222112 -213094 -76820 199533 185094 212923 -102279 123066 -262877 -182033
16129a82033k7337F6701K55695C350a17794l0187C81818j54864H9683c2163P764
$$ -182033 -209370 66701 322396 3350 -117794 -147981 381818 226954 89683 -32163 -24399
16118b4399A86573a5861j009j37417l1305Q8874B8618Q6639L4318f7299r1545
$$ -24399 186573 -15861 -16870 -154287 -185592 -96718 28618 115257 149575 -67299 -158844
16107a58844D61175A6627a09234a5451A92802a92115D4364K1713k7853e2583A91671
$$ -158844 461175 16627 -109234 -15451 192802 -192115 44364 66077 38224 -52583 191671
16095a8916k6154K0639A57882b898D9547b34081P396E9171O2153J18058c53076
$$ -18916 -45070 -24431 157882 -2898 49547 -234081 -226685 59171 121324 239382 -353076
16083a8144B58620a02354N53n986G3127C918d677k31984A89734a74960c3967D697
$$ -18144 258620 -102354 -101801 -107787 73127 3918 -4677 -236661 189734 -174960 -33967 4697
16070B46349f0035l0652a0442j98522D81406b55326J08186j44916a37437M6889
$$ 246349 -60035 -90687 -10442 -208964 481406 -255326 -147140 -292056 -137437 -90548
16060i0548A24807b5481k45199i522H9899k5543g796p2640m3686L0992k64606
$$ -90548 124807 -25481 -270680 -9522 89899 64356 -7796 -80436 -124122 -93130 -357736
16049c57736B58980j09095f8741A2025K75617a42254k064F8112i3066d3020C02188
$$ -357736 258980 149885 -68741 12025 287642 -142254 -144318 68112 -93066 -43020 302188
16037I3126J58695b22373B22993D3917h5205J9849B10914a42668r3887L8573g6988
$$ 93126 251821 -222373 222993 43917 -85205 -65356 210914 -142668 -236555 -197982 -76988
16025B69539a39336j11477C1434b43238p1253L0826i5801A54418b55954Q6911
$$ 269539 -139336 -250813 31434 -243238 -314491 -283665 -95801 154418 -255954 -169043
16015a69043A22392K21792c16637j07703b01429j29033a33821H7171a67486A34304
$$ -169043 122392 344184 -316637 -424340 -201429 -330462 -133821 87171 -167486 134304
16004e2961B25788A10771L6466J52529A19204l3495I948c84565a72586j51589
$$ -52961 225788 110771 147237 299766 119204 85709 9948 -384565 -172586 -324175
15994c24175A32580b59608M1971c596j98068N9554B68959F7219J42639l3363H7827
$$ -324175 132580 -259608 -217637 -3596 -201664 -142110 268959 67219 209858 176495 87827
15982D34132j34143j4276k2767G7693j9188L86905A72541C2073K9764b10147F9646
$$ 434132 299989 285713 262946 77693 58505 445410 172541 32073 61837 -210147 69646
15970B00740b11000B94238R6164d7943A23379J05768N6784f5679D7679a76125
$$ 200740 -211000 294238 390402 -47943 123379 229147 285931 -65679 47679 -176125
15959A02228l5175a90341A37545J08706A16668J76625a39099d2553j8827G1554
$$ 102228 67053 -190341 137545 246251 116668 293293 -139099 -42553 -61380 71554
15948a27886E1152J605J80252H6570b1454r2708q9088A520c71757f4181a2374
$$ -127886 51152 52757 233009 86570 -21454 -114162 -203250 1520 -371757 -64181 -12374
15936B72546a62412B66560a61405A16304d45553e1544A1891b9132A49352a08756
$$ 272546 -162412 266560 -161405 116304 -445553 -51544 11891 -29132 149352 -108756
15925f7027F4286q949k6886a73066g0080j36677d5094h249j64600c2782j58043
$$ -67027 64286 55337 28451 -173066 -70080 -206757 -45094 -8249 -172849 -32782 -190825
15914a90825o8963a22374M9660b1944r6859l7235I2516d9189A45542a91140k6838
$$ -190825 -259788 -122374 -72714 -21944 -118803 -156038 92516 -49189 145542 -191140 -217978
15903b17978b7475O31k03843b5920I8490C0096g6078j0310D0059K2961P9117b21042
$$ -217978 -27475 -26844 -230687 -25920 98490 30096 -76078 -86388 40059 63020 142137 -221042
15890e364C8575l388K3455h4151A06225A5868a42231A42724a21259c1453A82323
$$ -5364 38575 35187 58642 -84151 106225 15868 -142231 142724 -121259 -31453 182323
15878e3215j69048d9581F0822b07036q4855f1403k6103B36879h2398B03447a44003
$$ -53215 -222263 -49581 60822 -207036 -291891 -61403 -87506 236879 -82398 203447 -144003
15866d9779k81374a9008k2709k99379k01300A32846b09775H7823b85753A1576
$$ -49779 -331153 -19008 -41717 -341096 -542396 132846 -209775 87823 -285753 11576
15855i7965K0821A88135o6263K11641h9111l0732M752n9034h6744d1322k00988
$$ -97965 -77144 188135 121872 333513 -89111 -119843 -115091 -174125 -86744 -41322 -242310
15844b42310j1241K9695O7343P7026A2113g1056A60402c94580A14022c05679A31542
$$ -242310 -253551 -223856 -156513 -79487 12113 -71056 160402 -394580 114022 -305679 131542
15832E879a87967A37940Q5116b58633a17568p41A6555a35398C582d1934k27338
$$ 5879 -187967 137940 223056 -258633 -117568 -118309 16555 -135398 3582 -41934 -269272
15821b69272g9564n6831N1163m2523B0377J91954H8955J07389e25152A8268b9279
$$ -269272 -79564 -136395 -85232 -127755 20377 212331 88955 196344 -525152 18268 -29279
15809A38707C1899L8923a43801b4993C2517L98183A01114h4003d0013p4727e6225
$$ 138707 31899 70822 -143801 -24993 32517 430700 101114 -84003 -40013 -114740 -56225
15797A2395a90910d3283B20341p7704a43465H547J53672J82455h086E7737f5611
$$ 12395 -190910 -43283 220341 142637 -143465 8547 162219 344674 -8086 57737 -65611
15785h4230h460k21130o7889F2377K6544N099K5140M0895L0922a45557k05439
$$ -84230 -8460 -229590 -297479 62377 88921 94020 119160 160055 190977 -145557 -350996
15774c50996H7604B9998a54412b2162G6336a77429O2317d8151q1237M1841j70018
$$ -350996 87604 29998 -154412 -22162 76336 -177429 -115112 -48151 -129388 -87547 -257565
15763b57565A35245R0292C9125R1771b25034B83607a22691N8647J9826A20230
$$ -257565 135245 225537 39125 130896 -225034 283607 -122691 -64044 -44218 120230
15752b33961h817j81248e7451a0112A30736b8491A59870e6855A89041A3942a72652
$$ -233961 -8817 -190065 -57451 -10112 130736 -28491 159870 -56855 189041 13942 -172652
15740D01040B6965a48240e8200j6169l03270a72848I69c45052D3275J70223b13436
$$ 401040 26965 -148240 -58200 -74369 -377639 -172848 969 -345052 43275 213498 -213436
15728f6687A11895c59812a58756C4717O3178c36100Q7818J13090m3357b9838k99334
$$ -66687 111895 -359812 -158756 34717 97895 -336100 -248282 -135192 -178549 -29838 -329172
15717c29172J38275i5427k54070a07537H1579j8992M2252m1674b75253e9517k06693
$$ -329172 -190897 -95427 -349497 -107537 81579 62587 104839 63165 -275253 -59517 -266210
15706b66210J20902a8325p2831D5341h4974k41758a03270H6227b1753G5371i4259
$$ -266210 -145308 -18325 -91156 45341 -84974 -326732 -103270 86227 -21753 75371 -94259
15694a65950A83068i4814A29993k987C0636J08368H224K24668l6144b5537B03848
$$ -165950 183068 -94814 129993 127006 30636 139004 8224 232892 196748 -25537 203848
15682B46546a00437A75291k9869i4055c5723A65260d29486B72604d4413A90669
$$ 246546 -100437 175291 145422 -94055 -35723 165260 -429486 272604 -44413 190669
15671e8039A89371e0123G0204J76677a31036G1453A9985a96109k4002o6536A31526
$$ -58039 189371 -50123 70204 246881 -131036 71453 19985 -196109 -220111 -286647 131526
15659a46838B22247h0010b7789r8599j96857J40455q5502A64224G5352a37151
$$ -146838 222247 -80010 -27789 -126388 -323245 -182790 -268292 164224 75352 -137151
15648d5511n4969A33968J55966i6788A32723b1768j88605j52916r861i371A7366
$$ -45511 -100480 133968 289934 -96788 132723 -21768 -210373 -363289 -373150 -9371 17366
15636c8072H9130g2942k38084A42448o8002a31452k96897d8660j52201g388A68783
$$ -38072 89130 -72942 -311026 142448 74446 -131452 -428349 -48660 -200861 -7388 168783
15624f6970A9962a90894C71110h5974k59727i3926k02466f6593D03074E5042A7379
$$ -66970 19962 -190894 371110 -85974 -345701 -93926 -296392 -66593 403074 55042 17379
15612e7152K4744H022J03459b45000f3300M921l4164A83967c49774O9647A2927
$$ -57152 -32408 8022 111481 -245000 -63300 -58379 -92543 183967 -349774 -280127 12927
15600A19213d2758q9802A45397a33898j31925f2592A04911L01988b7323A49883
$$ 119213 -42758 -132560 145397 -133898 -265823 -62592 104911 406899 -27323 149883
15589b00567C4392P796f751C60181h3552j010I4421G576a04407F8126r774g6447
$$ -200567 34392 42188 -6751 360181 -83552 -84562 94421 7576 -104407 68126 58352 -76447
15576b00422A47468b54319C9494a92138O215e49C7093a46395I8314A0004a587
$$ -200422 147468 -254319 39494 -192138 -185923 -549 37093 -146395 98314 10004 -1587
15564e2514F198J36353A1330L34213l7453b44904A58030e51810A15852a33267
$$ -52514 6198 142551 11330 345543 308090 -244904 158030 -551810 115852 -133267
15553A55277e09446b51676A6144J5957R7406q300a75725B49360A00314a93895
$$ 155277 -509446 -251676 16144 32101 129507 121207 -175725 249360 100314 -193895
15542g1244j56371C4439d26576A38356l5956J88835q7361e2225B8969b00163P1726
$$ -71244 -227615 34439 -426576 138356 102400 291235 203874 -52225 28969 -200163 -128437
15531a28437A78818a7591G3752J1488e285j17983l69356H3794N2686b85043R6491
$$ -128437 178818 -17591 73752 85240 -5285 -123268 -492624 83794 136480 -285043 -188552
15520a88552h4470B5629a78738f1899k26795R4316A97072n6768n821K64999j54529
$$ -188552 -84470 25629 -178738 -61899 -288694 -194378 197072 140304 134483 399482 244953
15509B44953l0946D5341N8029K14540d1774A11394b4285G7401L33145b41970A42355
$$ 244953 214007 45341 103370 317910 -41774 111394 -24285 77401 410546 -241970 142355
15497a10497B19690l6967C0341K03718a2841m6164A47953a34901F1052a23824
$$ -110497 219690 182723 30341 234059 -12841 -59005 147953 -134901 61052 -123824
15486d16075G5589J34131d6149j47729D00532a41410A23267i5981e946B65414
$$ -416075 75589 209720 -46149 -193878 400532 -141410 123267 -95981 -5946 265414
15475a41100H6452B8210J62730K39022h9560o3668I3500b21693B48162B3244R646
$$ -141100 86452 28210 190940 429962 -89560 -153228 93500 -221693 248162 23244 32890
15464C2890r404N08210a06412q2590k2073C74857d6859A23708b35318a02911M4278
$$ 32890 23486 531696 -106412 -189002 -211075 374857 -46859 123708 -235318 -102911 -58633
15453e8633H7415J39665p3232d20469b7407j27189H5988P5018a70925P2663B1693
$$ -58633 87415 227080 153848 -420469 -27407 -154596 85988 161006 -170925 -98262 21693
15441H262d19285A74746J17042N34D7261O2941b91706h4606B79651e2740g066
$$ 8262 -419285 174746 291788 292322 47261 110202 -291706 -84606 279651 -52740 -7066
15429A56073i8046j78410a14301l4896j3184A40310a62319B34989I0229b41323
$$ 156073 -98046 -276456 -114301 -149197 -162381 140310 -162319 234989 90229 -241323
15418i93A15825a35730A69079G1394a8779k04036D690L2585b91923k500h3975
$$ -993 115825 -135730 169079 71394 -18779 -222815 4690 37275 -291923 -294423 -83975
15406G4991c08241g4031A01502b68595A30287b30829a3929E6767N0249J25082
$$ 74991 -308241 -74031 101502 -268595 130287 -230829 -13929 56767 107016 232098
15396B32098A04256a37866C11686a04049A13322A1013J53420G4203k6069i3657
$$ 232098 104256 -137866 311686 -104049 113322 11013 164433 74203 48134 -93657
15385i2670A1166J00419a13513p3544C3405N1535P2345b55665N1205j12744c9576
$$ -92670 11166 111585 -113513 -187057 33405 84940 157285 -255665 -204460 -317204 -39576
15373A23581J1612M4643a46445D40838a21691D13338j35208a64037b5077C12558
$$ 123581 135193 179836 -146445 440838 -121691 413338 278130 -164037 -25077 312558
15362H5185e1902b5615k45651A88825i8961o1207o0725C56069b9855j36376I3099
$$ 85185 -51902 -25615 -271266 188825 -98961 -160168 -220893 356069 -29855 -166231 93099
15350A25594m7027Q1646j4068c76824a03301A52254b43716h2045p7914e2894c926
$$ 125594 78567 160213 146145 -376824 -103301 152254 -243716 -82045 -159959 -52894 -3926
15338b7347A20229a96284n2802A00896Q6998R4217C5047b24794A11435a21907
$$ -27347 120229 -196284 -249086 100896 187894 282111 35047 -224794 111435 -121907
15327h5259k44632A55974o6102c5991l5418C75756j17330h762D0638J19116b095
$$ -85259 -329891 155974 89872 -35991 -71409 375756 258426 -8762 40638 159754 -2095
15315B7900G206a600k10735D2276B0900K09J29210i5079j36966e2995E681a07876
$$ 27900 7206 -1600 -212335 42276 20900 21109 150319 -95079 -232045 -52995 5681 -107876
15302d8934G9299g3087b6244A54307J91040A04595a99093c5229I6674a49504B62833
$$ -48934 79299 -73087 -26244 154307 345347 104595 -199093 -35229 96674 -149504 262833
15290B54433P3769g8638j5258B03690q4618J45446N864H4456b16406M9889G9212
$$ 254433 328202 -78638 -93896 203690 119072 264518 270382 84456 -216406 -166517 79212
15278A57455a76369B86236j41705L27933A35376a9191H3966J68308I6421b5921
$$ 157455 -176369 286236 144531 472464 135376 -19191 83966 252274 96421 -25921
15267C70899A44087D4576J99929b0681G7902k0634K89686q7432J46537A82030
$$ 370899 144087 44576 244505 -20681 77902 57268 346954 259522 406059 182030
15256d5362A5278a47247K7871j89058A86544j3301L05762M36988Q26905n98370
$$ -45362 15278 -147247 -119376 -308434 186544 173243 479005 915993 1742898 1144528
15246A144528L40611o23793l58768j87294A0939h4787B99472a46827E1971K1524
$$ 1144528 1485139 861346 502578 315284 10939 -84787 299472 -146827 51971 73495
15236G3495C2939g0099D26397A30201K94860b56028B07922G9709b0502B5212d5434
$$ 73495 32939 -70099 426397 130201 425061 -256028 207922 79709 -20502 25212 -45434
15224B7557N3371a12927m0290B07233J13515M5072A13947f9358p060c8097j86222
$$ 27557 80928 -112927 -153217 207233 320748 365820 113947 -69358 -76418 -38097 -224319
15213b24319A1059J35172B6247J54544o8646a15480A02149J44029a54044F9201
$$ -224319 11059 146231 26247 180791 112145 -115480 102149 246178 -154044 69201
15202C1778J72323J31391a00239F6159B9475K13808D8731Q2255a4795A2768J57569
$$ 31778 204101 335492 -100239 66159 29475 243283 48731 130986 -14795 12768 170337
15191A70337q2898N3928n7744J10804p015a85641M9781C32391a74614C38254A25285
$$ 170337 87439 141367 83623 194427 187412 -185641 -135860 332391 -174614 338254 125285
15179H8712c7788G1855K05743I2755j8405k9419R8748J6545b45165O1614j1503
$$ 88712 -37788 71855 277598 92755 74350 44931 143679 160224 -245165 -183551 -195054
15168a95054b8965m5692l38783g1180j0523A68184c3748D13315F3713J9829m348
$$ -195054 -28965 -74657 -413440 -71180 -81703 168184 -33748 413315 63713 83542 79194
15157G9194i206B54509a66684F7073d11391J16609E6650q751L018b00212P4616
$$ 79194 -9206 254509 -166684 67073 -411391 -294782 56650 47899 50917 -200212 -125596
15146a25596L7928A17422L1146l0169K4589M737O1446M573R2215a21332D5627
$$ -125596 -87668 117422 148568 118399 142988 147725 209171 213744 305959 -121332 45627
15134b50022A96836R2932P1580F0170L05365j18820b7922J3566A7114N3632Q8681
$$ -250022 196836 289768 361348 60170 365535 246715 -27922 -14356 17114 70746 159427
15123A59427c0447G9874L10390j17811J57480j54061l5902a4554A88006J968a67788
$$ 159427 -30447 79874 390264 272453 429933 275872 239970 -14554 188006 189974 -167788
15111A28564a67324B1087P9117J12909I2595l5079M897N3920J75548G6898K89475
$$ 128564 -167324 21087 100204 213113 92595 57516 62413 116333 291881 76898 366373
15100C66373n7743J06881A84901a21942H8826a89267d2773A47897b5070B48560
$$ 366373 308630 415511 184901 -121942 88826 -189267 -42773 147897 -25070 248560
15089a46765A43502P750o9295J17241b9753C75468j87525a42867D51621f0447
$$ -146765 143502 151252 81957 199198 -29753 375468 187943 -142867 451621 -60447
15078a80863A31472a40489B23817F3091B3638L99467n2405J0713a20293j54760
$$ -180863 131472 -140489 223817 63091 23638 423105 370700 381413 -120293 -275053
15068b75053e6517B76489b59553A36531J92162k8452r816a11914N5063B94697
$$ -275053 -56517 276489 -259553 136531 328693 300241 290425 -111914 -56851 294697
15057A32291n6965J63494A07984N435L23111A30272c3139H9417P6337J25557k7668
$$ 132291 75326 238820 107984 113419 436530 130272 -33139 89417 165754 291311 263643
15046B63643A2158J01395J96699p6971J15352j1996q6238A04692O5439l6623N3039
$$ 263643 12158 113553 310252 233281 348633 336637 250399 104692 170131 133508 186547
15035A86547M6350R4066r1929n1808C7977J16148D7215a30115D1494f2291B53099
$$ 186547 232897 326963 235034 183226 37977 154125 47215 -130115 41494 -62291 253099
15023B08314h392D57504A84310J46932I0737K30100r3117J5218K9111J5554j37879
$$ 208314 -8392 457504 184310 331242 90737 320837 227720 242938 272049 287603 149724
15012A49724n5001L04469A53655M7885k1189O8397A20606D1730e2935A00774I216
$$ 149724 94723 399192 153655 201540 180351 248748 120606 41730 -52935 100774 9216
15000D08043j83793M8309F3329J63683m6633J18291J38832p5963A39063j6707
$$ 408043 224250 272559 63329 227012 180379 298670 437502 361539 139063 122356
14990A22356d1209D24446K7002j31284J748P0450A21396b9149J3037A13027J00694
$$ 122356 -41209 424446 451448 320164 321912 392362 121396 -29149 -16112 113027 213721
14979B13721M14456B65583K74478B41530J92560A63561K19261A49843K03777r9992
$$ 213721 628177 265583 540061 241530 434090 163561 382822 149843 353620 253628
14969B53628K36J32286A56452K67129J6454j63544j07015J72389j17288j03441
$$ 253628 253864 386150 156452 423581 440035 276491 169476 341865 224577 121136
14959A21136N8737J58415p1338m3164J02441E3114O3667K90155j02241c9992D38511
$$ 121136 179873 338288 266950 223786 326227 53114 116781 406936 304695 -39992 438511
14947C31929j38779K88377j69356q6476J36292H5069R2772k3536L14095B21438
$$ 331929 193150 481527 312171 225695 361987 85069 177841 154305 468400 221438
14936C91770K81457j14134m7284k6899j37337B5901J32685o3221j4879L36871
$$ 391770 673227 559093 511809 484910 347573 25901 158586 95365 80486 417357
14926D17357n0545O4939r4081l1368j32959K77897A71876E524L12791j32061L55611
$$ 417357 366812 431751 337670 306302 173343 451240 171876 5524 318315 186254 541865
14915E41865K57608C34847j07348L30642o5604q0160B05977M0329k7653K0452
$$ 541865 799473 334847 227499 558141 492537 412377 205977 246306 218653 239105
14905B39105j12098K26738J2786m2077M9964O9017M1989k28298P1009A30907M13135
$$ 239105 127007 353745 366531 324454 374418 443435 485424 257126 328135 130907 544042
14894E44042J3438j10681a64362C45840P1333o7518o263j64147o5082q627M32292
$$ 544042 557480 446799 -164362 345840 417173 349655 343392 179245 114163 105536 537828
14883E37828k55068j01244C7088L49734J8078k0040A64186J32271J52420q6365
$$ 537828 282760 181516 37088 386822 404900 384860 164186 296457 448877 362512
14873C62512j2598L65541k42495A92195a35083A90115K03720j09474J206K30037
$$ 362512 349914 715455 472960 192195 -135083 190115 393835 284361 285567 515604
14863E15604J18439r2513k20917J9608N6540k2970L5461K72642B93683J05490
$$ 515604 634043 541530 320613 340221 396761 373791 409252 681894 293683 399173
14853C99173J11523j22595J01297B38854J51856J0172A81311M48686J58989l79087
$$ 399173 510696 388101 489398 238854 390710 400882 181311 629997 788986 409899
14843D09899J16006k43246o4449J78366m6286L63704B65052J20807L33206k09653
$$ 409899 525905 282659 218210 396576 350290 713994 265052 385859 719065 509412
14833E09412j27247j44812L90309B47053K56459A64418J36442K75523P6409m86
$$ 509412 382165 237353 627662 247053 503512 164418 300860 576383 652792 652306
14823F52306j31184p3013J7598K30665B90080K15788q4750n8611J67325p5092
$$ 652306 521122 448109 465707 696372 290080 505868 421118 362507 529832 454740
14813D54740j454J34354j70764K90468j06334B78106K76508K2025O524p6739n5076
$$ 454740 453286 587640 416876 707344 601010 278106 554614 576639 583163 506424 451348
14802D51348J25080J624m9693j13531J44207j28594o9060j25225M60940j48521
$$ 451348 576428 578052 528359 414828 559035 430441 361381 236156 697096 548575
14792E48575L11351q2719C39884M56935q5932p6623H6331N35510Q9954k68880
$$ 548575 859926 777207 339884 796819 710887 634264 86331 621841 711795 442915
14782D42915J78147j16393j47405J42098K42287L8078j36090J38717r2738k39072
$$ 442915 621062 504669 357264 499362 741649 779727 643637 782354 689616 450544
14772D50544m9105L05986k28597L49970j97743o1043I1982M07461M20946m20520
$$ 450544 401439 707425 478828 828798 631055 570012 91982 499443 920389 499869
14762D99869K10391n4080k74066m3634M07414J0636n4996K16650K1157k68957
$$ 499869 710260 656180 382114 338480 745894 756530 701534 918184 939341 670384
14752F70384J39423l8009K228k29875J62219M42220k97145k60935O4845k14538
$$ 670384 809807 771798 774026 544151 706370 1148590 851445 590510 655355 440817
14742D40817M79507k41283L07258m86981N43072l49293J05447J51624k61148R2565
$$ 440817 920324 679041 986299 499318 1042390 693097 798544 950168 689020 781585
14732G81585k06823L42384j67360j45536n858O0690J8819j56107M20191k09742
$$ 781585 574762 917146 749786 604250 598392 659082 677901 521794 941985 732243
14722G32243l1316K65926k8492o5989k03423K00247k31465L48037k73328N7992
$$ 732243 700927 966853 938361 872372 668949 869196 637731 985768 712440 770432
14712G70432r4598j25648J13411L84176k72063J87410l07669K24563J26828k37756
$$ 770432 675834 550186 663597 1047773 775710 963120 655451 880014 1006842 769086
14702G69086Q9255Q9161n0323r8450J80735j89350M8460O5391J77881k06682M87442
$$ 769086 858341 947502 897179 798729 979464 790114 838574 903965 1081846 875164 1362606
14691A362606k52987l39553K65103j9934K40369l08013n3284k8123P3008J83896
$$ 1362606 1109619 770066 1035169 1015235 1255604 947591 894307 866184 939192 1123088
14681A123088L0091j07207l51339N00451k74516J81006j46538p1095J10432p0074
$$ 1123088 1153179 1045972 694633 1195084 920568 1101574 955036 883941 994373 924299
14671I24299K87412n4377J28347j95450l9928p0875R5393j07874p4244N6517j82576
$$ 924299 1211711 1157334 1285681 1090231 1050303 979428 1074821 966947 892703 949220 766644
14660G66644N6717M92484k8968l53989L21185n7402N4402N0559l6527L60088j67520
$$ 766644 823361 1315845 1286877 932888 1254073 1196671 1251073 1301632 1265105 1625193 1457673
14649A457673k02117r3710N4431J98382l125l58764L76894R4351j57514q3460
$$ 1457673 1255556 1161846 1216277 1414659 1411534 1052770 1429664 1524015 1366501 1283041
14639A283041L21919j84291n35126J97890J31251J41798R8139N6459j74560O7053
$$ 1283041 1604960 1420669 885543 1083433 1214684 1356482 1454621 1511080 1336520 1403573
14629A403573j2051j20920M70025n66212j7010R1426k09465N85374m06863N2230
$$ 1403573 1391522 1270602 1740627 1174415 1157405 1248831 1039366 1624740 1217877 1270107
14619A270107Q3612J40377L73477o02469o8025K65700n5113J64402j6483J11453
$$ 1270107 1353719 1494096 1867573 1265104 1197079 1462779 1407666 1572068 1555585 1667038
14609A667038k35225K73730l32809M41910R4859j53735k66596K71730L2925p6600
$$ 1667038 1431813 1705543 1372734 1814644 1909503 1755768 1489172 1760902 1793827 1717227
14599A717227p0212K05921j93439J9966J75061j99273K03756J61418j79043K91156
$$ 1717227 1647015 1852936 1659497 1679463 1854524 1655251 1859007 2020425 1841382 2132538
14589B132538l63696Q4459j7158K50493m32428J84571K25934j67075l0385O2599
$$ 2132538 1768842 1853301 1836143 2086636 1654208 1838779 2064713 1897638 1867253 1929852
14579A929852j00576M14921l43891O8069K99001j7823m66923K70055K75406m18492
$$ 1929852 1829276 2244197 1900306 1968375 2267376 2249553 1782630 2052685 2328091 1909599
14569A909599O46496j41320l1096K13578J49881j15867L6672q1400J14572J38975
$$ 1909599 2556095 2414775 2383679 2597257 2747138 2631271 2667943 2586543 2701115 2840090
14559B840090o275J65984O0043L45953J44997M5765M26173M59963O88652R75182
$$ 2840090 2833815 2999799 3059842 3405795 3550792 3596557 4022730 4482693 5171345 6146527
14549F146527K455249M559096J0391041J6760497L71463B0152255H334404l457634
$$ 6146527 8601776 13160872 23551913 40312410 40683873 20152255 8334404 4876770
14541D876770j414926r33159n28317m5697L44721l15426o602J64224j00140J34679
$$ 4876770 3461844 2528685 2000368 1954671 2299392 1983966 1977364 2141588 2041448 2176127
14531B176127K76746j19845j18226p5575R1702K11512J8614K38072r9015k41317
$$ 2176127 2452873 2333028 2214802 2139227 2230929 2442441 2461055 2699127 2600112 2358795
14521B358795L22964j47390k77j12769J21949J49728K40021k85728K36976l10269
$$ 2358795 2681759 2534369 2534092 2421323 2543272 2693000 2933021 2647293 2884269 2574000
14511B574000K69179K28192j29459j11848J55494k25973M81331m29501K11187
$$ 2574000 2843179 3071371 2941912 2830064 2985558 2759585 3240916 2811415 3022602
14502C022602J06995k33554M20736K07630k0552j77478j25328L85317k32301K24904
$$ 3022602 3129597 2896043 3316779 3524409 3503857 3326379 3201051 3586368 3354067 3578971
14492C578971j07431O326M59351l39832o3116K42632n3863K95165k29162Q3639
$$ 3578971 3471540 3477866 3937217 3597385 3534269 3776901 3723038 4018203 3789041 3872680
14482C872680J40966l17351J06043N22827l81114L7302K17613j72290M40160j93600
$$ 3872680 4013646 3696295 3802338 4325165 3944051 3981353 4198966 4026676 4466836 4273236
14472D273236K9450j739L12138J39623m30401J93264q2546j4747J76004L51650
$$ 4273236 4302686 4300947 4613085 4752708 4322307 4515571 4433025 4418278 4594282 4945932
14462D945932k76923J64543K99987r9221j00209J57387L05367N2369k50322M05954
$$ 4945932 4669009 4833552 5133539 5034318 4934109 5091496 5396863 5449232 5198910 5604864
14452E604864k99272K66714M2734j12913L8570J12457J5865j451L86187j24603
$$ 5604864 5305592 5572306 5615040 5502127 5540697 5653154 5669019 5667568 6053755 5929152
14442E929152n6742J55313J60782N28253k47478l7316J60774L2240o3608L32432
$$ 5929152 5872410 6027723 6188505 6716758 6469280 6431964 6592738 6624978 6561370 6893802
14432F893802Q2948K46258m23653K47282M190N89409J81808j75134J10278J56367
$$ 6893802 6976750 7223008 6799355 7046637 7050827 7640236 7822044 7646910 7757188 7913555
14422G913555k7171L40890j14102J48688K01954K96158k66336M47232j07159R4708
$$ 7913555 7886384 8227274 8113172 8261860 8463814 8759972 8493636 8940868 8833709 8928417
14412H928417J07533K34691K40079l34131L30689M88479K02684l5252j41719L70607
$$ 8928417 9035950 9270641 9510720 9176589 9507278 9995757 10198441 10163189 10021470 10392077
14402A0392077M35584k05140J79413O0583M614N30387M04433n8123L04026L08090
$$ 10392077 10827661 10622521 10801934 10862517 10867131 11397518 11801951 11743828 12047854 12355944
14392A2355944O6189j78951K29311P04454M0730J74556O26509J40318K47102j89675
$$ 12355944 12422133 12243182 12472493 13176947 13217677 13392233 14018742 14159060 14406162 14216487
14382A4216487N25891L00114J09915O41081K69533J58080L27614K88775O1522
$$ 14216487 14742378 15042492 15152407 15793488 16063021 16221101 16548715 16837490 16899012
14373A6899012N74384L25500J56598M73590K60315N47768K34980M51806M48399
$$ 16899012 17473396 17798896 17955494 18429084 18689399 19237167 19472147 19923953 20372352
14364B0372352O70177K77368K79671Q80840j5778Q69852L20001Q57783J67629
$$ 20372352 21042529 21319897 21599568 22480408 22464630 23334482 23654483 24512266 24679895
14355B4679895O54170P81112L78850O08342O81454P98879P14288P00649P56259
$$ 24679895 25334065 26115177 26494027 27102369 27783823 28582702 29296990 29997639 30753898
14346C0753898J108043M93948Q51092L95014J469721N63127J348138N98128J361968
$$ 30753898 31861941 32355889 33206981 33601995 35071716 35634843 36982981 37581109 38943077
14337C8943077N52298J477077J317318J043522J411594J262331J376805J534730
$$ 38943077 39495375 40972452 42289770 43333292 44744886 46007217 47384022 48918752
14329D8918752J097579J489972J869781J561621K197632J540006K069578K351182
$$ 48918752 50016331 51506303 53376084 54937705 57135337 58675343 60744921 63096103
14321F3096103J751018K686569K116498K481416K618860K941404L038129K938382
$$ 63096103 64847121 67533690 69650188 72131604 74750464 77691868 80729997 83668379
14313H3668379L488025L305911L808218L807326M083323M436959M179293N252972
$$ 83668379 87156404 90462315 94270533 98077859 102161182 106598141 110777434 116030406
14305A16030406M916037N510738O100986N849276O299796O864164P163827P443749
$$ 116030406 120946443 126457181 132558167 138407443 144707239 151571403 158735230 166178979
14297A66178979Q582871Q407059R015232R454217R962300J0856463J0563496J1519045
$$ 166178979 174761850 183168909 192184141 201638358 211600658 222457121 233020617 244539662
14289B44539662J2465695J2452653J2818860J3567496J3503244J4070179J3968960
$$ 244539662 257005357 269458010 282276870 295844366 309347610 323417789 337386749
14282C37386749J4633133J4389283J3882099J3402451J3163012J2193360J0992772
$$ 337386749 352019882 366409165 380291264 393693715 406856727 419050087 430042859
14275D30042859R741160P614263M288055J159377j306494m46188l19406k364844
$$ 430042859 439784019 447398282 451686337 452845714 451539220 451093032 450773626 448408782
14267D48408782n455966p399976q740535r839785j1270437j3013982j3584177
$$ 448408782 442952816 435552840 426812305 416972520 405702083 392688101 379103924
14260C79103924j4736163j5416046j5132389j4902106j4852787j3412999j3798722
$$ 379103924 364367761 348951715 333819326 318917220 304064433 290651434 276852712
14253B76852712j3288196j3177077j1798490j1568265j1354148j0349320r686454
$$ 276852712 263564516 250387439 238588949 227020684 215666536 205317216 195630762
14246A95630762r294047q885522q079145p772980p701441p210961o425932o181684
$$ 195630762 186336715 177451193 169372048 161599068 153897627 146686666 140260734 134079050
14238A34079050n465735n459741n454828n189560m214371m897817l893716l764626
$$ 134079050 128613315 123153574 117698746 112509186 108294815 103396998 99503282 95738656
14230I5738656l689201l564790l662478l195334l260391k928127k353324k713441
$$ 95738656 92049455 88484665 84822187 81626853 78366462 75438335 73085011 70371570
14222G0371570k552700k183848k401315k198859j990240j595365k151811j711152
$$ 70371570 67818870 65635022 63233707 61034848 59044608 57449243 55297432 53586280
14214E3586280j467952j267628j969063j437553j617017j311566j179635m45147
$$ 53586280 52118328 50850700 48881637 47444084 45827067 44515501 43335866 42890719
14206D2890719j834632r60874j483353j152679q53685o91378p95651p24633j544444
$$ 42890719 41056087 40095213 38611860 37459181 36605496 35914118 35118467 34393834 32849390
14197C2849390n55229p33370j034286n22084q33423q17784n91197r13676o96773
$$ 32849390 32294161 31560791 30526505 30004421 29170998 28353214 27762017 26848341 26151568
14188B6151568m22788p24243p57945m49994k20771o90238m67465p79897j48746
$$ 26151568 25728780 25004537 24246592 23796598 23575827 22885589 22418124 21638227 21489481
14179B1489481p71684j13995n64744k51579n68893k4631p23585k46638j02298
$$ 21489481 20717797 20603802 20039058 19787479 19218586 19193955 18470370 18223732 18121434
14170A8121434o71469m1984r01425J44984m09627l03294j31253m41381j17303
$$ 18121434 17449965 17407981 16506556 16651540 16241913 15938619 15807366 15365985 15248682
14161A5248682m53590l35197Q905k57387m79763l56632j08938q2890p2494m25057
$$ 15248682 14795092 14459895 14468800 14211413 13731650 13375018 13266080 13183190 13110696 12685639
14151A2685639j89788l08080j32939J26410j86067k96091k49287k57223J45180
$$ 12685639 12495851 12187771 12054832 12181242 11995175 11699084 11449797 11192574 11337754
14142A1337754n76807l84131J85608J03162n05148j83890K4869l29382J00839
$$ 11337754 10760947 10376816 10562424 10665586 10160438 9976548 10001417 9672035 9772874
14133I772874l76910j24293J6377k12184Q7460m94818J63555l38668o4197j55507
$$ 9772874 9395964 9271671 9288048 9075864 9163324 8668506 8832061 8493393 8429196 8273689
14123H273689L19715m46288q3913j85668l9634J38378m06343J43k78499K16432
$$ 8273689 8593404 8147116 8063203 7877535 7837901 7976279 7569936 7570079 7291580 7508012
14113G508012k71086m093k46891L37652l19809j45515k18591J42600j91623M9996
$$ 7508012 7236926 7232833 6985942 7323594 7003785 6858270 6639679 6782279 6590656 6640652
14103F640652J62969k48164m62928J67506m31096M08173k95614J94289j12386
$$ 6640652 6803621 6555457 6092529 6260035 5828939 6237112 5941498 6135787 6023401
14094F023401k31771K7349k75388k21470K44527m2383k76369j51052Q1838R1988
$$ 6023401 5791630 5818979 5543591 5322121 5566648 5524265 5247896 5096844 5178682 5270670
14084E270670j31621q6176J4862q8203J28075m79746L56668j30775o094j66461
$$ 5270670 5139049 5052873 5067735 4979532 5107607 4627861 4984529 4853754 4847660 4681199
14074D681199k80430J14301Q4600k52391J18694l51071K7986K00876q1196K3114
$$ 4681199 4400769 4515070 4599670 4347279 4465973 4114902 4142888 4343764 4262568 4285682
14064D285682P8115q5665m3835r0367J78982j88106l13793N30906o83200K95526
$$ 4285682 4363797 4278132 4234297 4143930 4322912 4134806 3821013 4351919 3668719 3964245
14054C964245j61475p9808J06653k22814q1654K05195j70673N8148k35843K76936
$$ 3964245 3802770 3722962 3829615 3606801 3525147 3730342 3559669 3617817 3381974 3658910
14044C658910K76285p03609L33245m22092J77057m9461K0317M2776k34558P3419
$$ 3658910 3935195 3231586 3564831 3142739 3319796 3270335 3290652 3333428 3098870 3172289
14034C172289O8990j1865k33160L90532j42277l49836J22999k47545M38658k44446
$$ 3172289 3241279 3229414 2996254 3386786 3244509 2894673 3017672 2770127 3208785 2964339
14024B964339j68920K62296l40126k25191L80991K2686n18472N41349k17752j06246
$$ 2964339 2795419 3057715 2717589 2492398 2873389 2896075 2377603 2918952 2701200 2594954
14014B594954k86383L53111j67575j35275K59465m02326M28381k96516k46654
$$ 2594954 2308571 2661682 2494107 2358832 2618297 2215971 2644352 2347836 2101182
14005B101182K29913J83215j71114j44104M422J06103L0011N8302m04651Q7952
$$ 2101182 2331095 2514310 2343196 2199092 2203514 2309617 2339628 2397930 1993279 2081231
13995B081231J21988P2059L1088k18419K93197Q60920J131162L578317Q509156
$$ 2081231 2203219 2275278 2306366 2087947 2381144 3242064 4373226 7951543 16460699
13986A6460699J7964251O973846j7592742j1137467m277561k160078j273869o53734
$$ 16460699 34424950 41398796 23806054 12668587 8391026 6230948 4957079 4303345
13978D303345m51563k26852k73999l05185Q6655m08788j44728j34875n2136J56208
$$ 4303345 3851782 3624930 3350931 3045746 3132401 2723613 2578885 2444010 2391874 2548082
13968B548082k76418L53836k16917J8718k62623k29284M25101k50131o96R8101
$$ 2548082 2271664 2625500 2408583 2427301 2164678 1935394 2360495 2110364 2109668 2207769
13958B207769L023j69889j40382J06522Q5872J0081J28641m13177N5553R2696
$$ 2207769 2210792 2040903 1900521 2007043 2092915 2102996 2231637 1818460 1874013 1966709
13948A966709j33453J08934m1822l1193J44330j14891k25168R3725J67879k76680
$$ 1966709 1833256 1942190 1900368 1869175 2013505 1898614 1673446 1767171 1935050 1658370
13938A658370j74528M48797J73504n8884l48927k25772L75069l37167M3766M5128
$$ 1658370 1483842 1932639 2106143 2047259 1698332 1472560 1847629 1510462 1554228 1599356
13928A599356L6823j44802K08997L0478k50530K72903P6637o04075N69243j68283
$$ 1599356 1636179 1491377 1700374 1730852 1480322 1753225 1829862 1225787 1795030 1626747
13918A626747j94727J41830j4048j04314J52523j95874l1371m28076P54708m75614
$$ 1626747 1432020 1573850 1559802 1455488 1608011 1412137 1380766 952690 1707398 1231784
13908A231784R0849J7024J54171J94273l39976j5875P6266J46464M9439j30474
$$ 1231784 1322633 1339657 1493828 1688101 1348125 1332250 1408516 1554980 1604419 1473945
13898A473945o622j01850J11641j94369J56835l96497J03039L08543k29611o9291
$$ 1473945 1467323 1365473 1477114 1282745 1439580 1043083 1146122 1454665 1225054 1155763
13888A155763K25968p9187k648p8346k03254P37920m98038J28810j07939J21589
$$ 1155763 1381731 1302544 1299896 1221550 1018296 1756216 1258178 1386988 1279049 1400638
13878A400638K60478n10497M3772k09847J4255K51387k99573J33970l3472j18764
$$ 1400638 1661116 1150619 1194391 984544 998799 1250186 950613 1084583 1051111 932347
13868I32347L59626j91455L09888l66540K68327l83129L03703J79920o76736M79324
$$ 932347 1291973 1100518 1410406 1043866 1312193 929064 1232767 1412687 735951 1215275
13858A215275j24510n5131J03270N7642l05046L8795l8946k9054J37052J07891
$$ 1215275 1090765 1035634 1138904 1196546 891500 930295 891349 862295 999347 1107238
13848A107238R5367r5821L4197j95517j19673K35559j42706k68574m0587L69071
$$ 1107238 1202605 1106784 1140981 945464 825791 1061350 918644 650070 609483 978554
13838I78554K3769l14185L01295j84405K02012J43197m49966K25809K78292K287
$$ 978554 1002323 688138 989433 805028 1007040 1150237 700271 926080 1204372 1206659
13828A206659j41791n08751J34527J71175k04224L07926l23604L55342j01491
$$ 1206659 1064868 556117 690644 861819 657595 965521 641917 997259 895768
13819H95768j10250K57333j80356K31089m39806j06467K21562J81897J4098m2758
$$ 895768 785518 1042851 862495 1093584 653778 547311 768873 950770 964868 922110
13809I22110N6866k98646j98862M72783k57328K45122j60282m8378K89524l10867
$$ 922110 978976 680330 481468 954251 696923 942045 781763 733385 1022909 712042
13799G12042J7164J88551j32472Q5286j01848J42675l68735J33320l73K044Q9027
$$ 712042 729206 917757 785285 870571 768723 911398 542663 675983 675610 677654 766681
13788G66681p3792m8086k4249j00074K29808q311K27366k56403J23598C87697
$$ 766681 692889 644803 620554 520480 750288 741977 969343 712940 836538 387697
13777E22063J85456M1540O4130J81771m29923L99643k11681J50386k95540K63816
$$ 522063 707519 749059 813189 994960 565037 964680 752999 903385 607845 871661
13767H71661k18741N2891l11897M37912k10706L38183j95420k85747J13799J7641
$$ 871661 652920 705811 393914 831826 621120 959303 763883 478136 591935 609576
13757F09576J39867Q28l43186M13359r8687j17998J74577l25800K17704j87583
$$ 609576 749443 750271 407085 820444 721757 603759 778336 452536 670240 482657
13747D82657K90988j44053K14822o3187l9287j2389l08509L35862l53361N43425
$$ 482657 773645 629592 844414 781227 741940 729551 421042 756904 403543 946968
13737I46968r7643l93151N01696m30885p567J84611j37386J73313C60683J15898
$$ 946968 849325 456174 957870 526985 519418 704029 566643 739956 360683 476581
13727D76581J56668R1038C09356J22237P7416M4881N2779j21039M12005j18330
$$ 476581 633249 724287 309356 431593 509009 553890 606669 485630 897635 779305
13717G79305j59281J488j64762K96511k94208P9336P211L39238k4041j49227q4834
$$ 779305 620024 621512 456750 753261 459053 538389 545600 884838 860797 711570 626736
13706F26736B11545N44060j49139B96295L48723M0706j85744N6546j31623Q0505
$$ 626736 211545 755605 606466 296295 645018 685724 499980 556526 424903 505408
13696E05408L32113C33429M53442k26596k5754L14606l48167j15067R2605J01413
$$ 505408 837521 333429 786871 560275 534521 849127 500960 385893 478498 579911
13686E79911j1167k5391n3061r7259m1275K55241k94637J55553L3762J3592K018
$$ 579911 568744 543353 490292 393033 351758 606999 312362 467915 501677 515269 517287
13675E17287L9365k3601k40236K26706j19466J57593k38726K2845J78110B07618
$$ 517287 556652 533051 292815 519521 400055 557648 318922 341767 519877 207618
13664B62761K90081p3066L91371l84574P9516j02062j04623L8354j13894L06784
$$ 262761 552842 479776 871147 486573 566089 464027 359404 397758 283864 590648
13654E90648q6496j08810K6363j61897J08189J0366A54913J61511K2465r9417
$$ 590648 504152 395342 421705 259808 367997 378363 154913 316424 338889 239472
13644B39472j0311J42784J10444N508K17564j53443j77035A61202L03627A68441
$$ 239472 229161 371945 482389 487897 705461 552018 374983 161202 464829 168441
13633D14707I8650R4845J12604K16187k5578L1852A62413K58335j29099G5539
$$ 414707 98650 193495 306099 522286 496708 528560 162413 420748 291649 75539
13622B99988J89376O5653B40721K40612l8725o7475j12084G6406J19513K66751
$$ 299988 489364 555017 240721 481333 442608 375133 263049 76406 195919 462670
13612D62670J33915A28933K05767j55399K28617j91520K39571A89799J00569L2559
$$ 462670 596585 128933 334700 179301 407918 216398 455969 189799 290368 322927
13602C22927n3923M8815N9229a70007A53655J96016N4079J07830L9213k73101
$$ 322927 269004 317819 377048 -170007 153655 349671 403750 511580 550793 277692
13592B77692J40898J38193k56807L4565K57831j22232K24026k85730k01694M2486
$$ 277692 418590 556783 299976 334541 592372 470140 694166 408436 206742 249228
13582B49228K79637B15950J92038A74268J34326j38274L26127j31113Q2463A19469
$$ 249228 528865 215950 407988 174268 308594 170320 496447 365334 447797 119469
13571B22925M7211M1058r4975p2800J84312J6766K41077I0742J39661q0246F1610
$$ 222925 270136 311194 216219 143419 327731 344497 585574 90742 230403 150157 61610
13559F62535B11330O9546l0667J88280A97719D7174M77110l2798j72849N2092
$$ 662535 211330 280876 250209 438489 197719 47174 524284 491486 318637 370729
13549C70729D6182K61182J56304A12909K22805N4108C1671K04053J1243J11328
$$ 370729 46182 307364 463668 112909 335714 389822 31671 235724 246967 358295
13539C58295K3229j74287I8227N27160k16586A96664e05A63549M1469k4715K13024
$$ 358295 381524 207237 98227 625387 408801 196664 -505 163549 205018 180303 393327
13528C93327j84184J23968Q4569A97488m8230J63807P3957c94C21756K8294A58136
$$ 393327 209143 333111 417680 197488 149258 313065 387022 -394 321756 350050 158136
13516E34075j62820A64782K69394D2167M1349H815K52172C3451J76385N1498A6510
$$ 534075 371255 164782 434176 42167 83516 8815 260987 33451 209836 261334 16510
13504C65896j66187L34624A54580Q621P3848J33705A29818J78902j01998J33515
$$ 365896 199709 534333 154580 163201 237049 370754 129818 308720 206722 340237
13494C40237H3198f101E54485k71010l319A38365J79082j7891h8659G3890L78947
$$ 340237 83198 -6101 554485 283475 280156 138365 317447 299556 -88659 73890 452837
13483D52837A44684b9432A46800K13777a31843B82660p1104R9195l9875O4430
$$ 452837 144684 -29432 146800 360577 -131843 282660 211556 310751 270876 335306
13473C35306j7403O7463K4434K6141j95496A6008J76300J43740E376J95938P6676
$$ 335306 317903 385366 409800 435941 240445 16008 192308 336048 5376 201314 277990
13462B77990A03728K5657J83529q2103n1131J1663L62854B03772K28030A08709
$$ 277990 103728 129385 312914 230811 179680 191343 554197 203772 431802 108709
13451A8734J96927o4098E9645K83319q8331A7962L04011L1814m2196A37208E3168
$$ 18734 215661 151563 59645 342964 254633 17962 321973 353787 311591 137208 53168
13439D19026k2326o011A88782b77710B98826J46479j72205p8417q9918P2424k8353
$$ 419026 396700 390689 188782 -277710 298826 445305 273100 194683 104765 177189 148836
13428A48836B3408L05660n0430J70760A1383a514A90759K88906a07290D29303
$$ 148836 23408 329068 278638 449398 11383 -1514 190759 479665 -107290 429303
13417B55233O0317K3437A48915E7396J99725D4282O6313K92007A85852k3956p1822
$$ 255233 315550 338987 148915 57396 257121 44282 110595 402602 185852 161896 90074
13406I0074Q5264P2305A04974J58584L2452M3564H3748P8147J78083A22640L9948
$$ 90074 175338 247643 104974 263558 296010 339574 83748 161895 339978 122640 162588
13395A62588K9056D6735N0052e7237G8989b00597C38400j20399d8519C24894E6347
$$ 162588 191644 46735 96787 -57237 78989 -200597 338400 218001 -48519 324894 56347
13383A64184n196K57345j53597K37656j88547j06570I7291R1472K82987f7651
$$ 164184 158988 416333 262736 500392 311845 205275 97291 188763 471750 -67651
13372A97161J18599E8322J94582p899n1799M70277A91811n7850h4511E54676B9298
$$ 197161 315760 58322 252904 245005 193206 663483 191811 133961 -84511 554676 29298
13360E09995C3825f1393B43833b46683D29920k14509J93210j80138r1278J05824
$$ 509995 33825 -61393 243833 -246683 429920 215411 408621 228483 137205 243029
13350B43029L3570Q8995A32785L69488k18243M1955N024K14092B68731O0468J0609
$$ 243029 276599 365594 132785 502273 284030 325985 331009 545101 268731 329199 339808
13339C39808r2581p0849j6492P7821j8890H3194J95642I5574l396L50456j60051
$$ 339808 247227 176378 159886 237707 218817 83194 278836 95574 92178 442634 282583
13328B82583j3320j5864f994k6213A91905M9556B5076i144A34922K9095j7105
$$ 282583 269263 253399 -6994 -33207 191905 241461 25076 -9144 134922 164017 146912
13317A46912N7133L281M834a5705C77163B3632K49007l2385A576b504C91221A76457
$$ 146912 204045 207326 212160 -15705 377163 23632 272639 240254 1576 -2504 391221 176457
13304B35577j00240j8217a1847j365A15245K08374A55075k2989K68388j74141
$$ 235577 135337 117120 -11847 -13212 115245 323619 155075 132086 400474 226333
13294B26333H5316K6029C6458c6727C79063b68805a19350E5138a58695C03766
$$ 226333 85316 111345 36458 -36727 379063 -268805 -119350 55138 -158695 303766
13283B25146O7969m4055A06937l8684c9601G6025b9986C07759A2875a21481A58381
$$ 225146 293115 249060 106937 68253 -39601 76025 -29986 307759 12875 -121481 158381
13271a8255D69981A12449J89523j26143K25d7798A18234J08621g1516C166M6685
$$ -18255 469981 112449 301972 175829 176054 -47798 118234 226855 -71516 3166 49851
13260D9851J22329L6764b4389k00481B56321j07523O6693H088J57076B6098e2406
$$ 49851 172180 208944 -24389 -224870 256321 148798 215491 8088 165164 26098 -52406
13248H7175J98042K5458b8548c13A77976O4791J4990G7073R4384f763C6235e9202
$$ 87175 285217 310675 -28548 -313 177976 242767 257757 77073 171457 -6763 36235 -59202
13235B16710d7778F773a0814C6066N3717C5451J90698P0802F0011P856K40009
$$ 216710 -47778 6773 -10814 36066 89783 35451 226149 296951 60011 67867 307876
13224C07876j5280P8545a1145B0677J74991K15793G1405a8657A04436J79948A28939
$$ 307876 292596 371141 -11145 20677 195668 411461 71405 -18657 104436 284384 128939
13212F8804M8211c2930B6419b5598C19629b23160B29771B1802h5583C14410k8342
$$ 68804 117015 -32930 26419 -25598 319629 -223160 229771 21802 -85583 314410 286068
13201B86068a23457D2907O0846R8714G5601Q9251b13369A72931J05499J07350
$$ 286068 -123457 42907 103753 202467 75601 164852 -213369 172931 278430 385780
13191C85780J0051A82608g2639B65251J23969H0416a85995A3525K23175A124M4371
$$ 385780 395831 182608 -72639 265251 389220 80416 -185995 13525 236700 1124 45495
13180D5495O5516a12625A90139a11256A06322J72832a9124C78615L4441I0628
$$ 45495 111011 -112625 190139 -111256 106322 279154 -19124 378615 413056 90628
13169G4953a06614h635G6439N0797J06736a14234F070R700g062k1162C62792f4
$$ 74953 -106614 -8635 76439 127236 233972 -114234 6070 15770 -7062 -28224 362792 -64
13156b7789j07899A12497C6570P6462k237a13383A77339b24097A50491a1407A53944
$$ -27789 -135688 112497 36570 113032 110795 -113383 177339 -224097 150491 -11407 153944
13144B49474J37796f1940A52356b28128F201a92018n4015B86260a72168f0661
$$ 249474 387270 -61940 152356 -228128 6201 -192018 -246033 286260 -172168 -60661
13133a57376q911B41387E6924F676J13052m8593K47960P4548a33637H6149Q7538
$$ -157376 -166287 241387 56924 6676 119728 71135 319095 393643 -133637 86149 173687
13122A73687E1382J75924f1827B42271B6657k765h4664a9030P859A2297Q6550
$$ 173687 51382 227306 -61827 242271 26657 23892 -84664 -19030 -11171 12297 98847
13111I8847J5035j6316b08219B47875I4697D3731K01099C2685K97181f5379A29172
$$ 98847 113882 97566 -208219 247875 94697 43731 244830 32685 329866 -65379 129172
13099A63628i5020B22839o7996a4300n06933b736q0837A7254L03979H3264a59114
$$ 163628 -95020 222839 154843 -14300 -521233 -2736 -83573 17254 321233 83264 -159114
13087C47472j19365q1038o815h590m8729P758C52636f9601A98775R5014p2244
$$ 347472 228107 147069 140254 -8590 -57319 -49561 352636 -69601 198775 293789 221545
13076B21545F424M5973L41775A13693K01290o4000A10884m4742B9864d5838A09692
$$ 221545 6424 52397 394172 113693 314983 250983 110884 66142 29864 -45838 109692
13064a87922A91806g9117A14939D1336O1381N2924p6469e2121n6994B88593b3561
$$ -187922 191806 -79117 114939 41336 102717 155641 79172 -52121 -109115 288593 -23561
13052A91710m2929e247A70646D1164K60449J67959a55337h11j99805P6895A89580
$$ 191710 148781 -5247 170646 41164 301613 469572 -155337 -811 -200616 -123721 189580
13040a87051f8755A45881H621i3630a7449A66291a50933B25003A7282M5307O4729
$$ -187051 -68755 145881 8621 -93630 -17449 166291 -150933 225003 17282 62589 127318
13029A27318F3412K77423j50833D154Q6799j2886a25811A64351Q471J79372p7438
$$ 127318 63412 340835 190002 4154 90953 78067 -125811 164351 172822 352194 274756
13018B74756J863k5694I6917j853C8026K65306j06091D2659J68222J46074A38121
$$ 274756 276619 250925 96917 95064 38026 303332 197241 42659 210881 356955 138121
13006H8874K5469a86226E6905L41806a86911C71110N4759A9298K16768J53383
$$ 88874 114343 -186226 56905 398711 -186911 371110 425869 19298 236066 389449
12996C89449A55048i2699q2633B11127J5364e0559A42344i1349C07906K5556I2212
$$ 389449 155048 -92699 -175332 211127 226491 -50559 142344 -91349 307906 333462 92212
12984a01023H2602J4824b9288r53A11739Q7711d5830D99356a53146A60467D3606
$$ -101023 82602 97426 -29288 -30241 111739 199450 -45830 499356 -153146 160467 43606
12972a50180A28319c16929K1157B01536n4861D4436f9582A45630J41206a10885
$$ -150180 128319 -316929 -295772 201536 146675 44436 -69582 145630 286836 -110885
12961b4170A16018K32501g4500f729A42303L3077M5602p5938L2692k2363c5279
$$ -24170 116018 348519 -74500 -6729 142303 175380 220982 145044 177736 155373 -35279
12949b43167C55682A0714M6429J44493a01633l05125g3852A5221L4679c25467
$$ -243167 355682 10714 57143 201636 -101633 -406758 -73852 15221 49900 -325467
12938b69261A48929c4471A36575B5483K41633o1303e6964q2434b8239A03369h3712
$$ -269261 148929 -34471 136575 25483 267116 205813 -56964 -139398 -28239 103369 -83712
12926B05003a08877D38768A68625b9899q1789A32490j7828c8940j13097l3614
$$ 205003 -108877 438768 168625 -29899 -111688 132490 114662 -38940 -152037 -185651
12916a85651A2222a04880A17607f9638K9407n7452B03026a7697A85151n0217a90663
$$ -185651 12222 -104880 117607 -69638 -40231 -97683 203026 -17697 185151 134934 -190663
12904B54662L781p9906b28164C38234b4155A76653d7233l6179r1645B45746j14740
$$ 254662 258443 178537 -228164 338234 -24155 176653 -47233 -83412 -175057 245746 131006
12893A31006h0074F6206a70917C5362L4579K99423a65558n6059C2013b12940F7702
$$ 131006 -80074 66206 -170917 35362 69941 369364 -165558 -221617 32013 -212940 67702
12881A73394i5065A35110i7047a4784B7417P0588m0217c7360F0957a88054A12872
$$ 173394 -95065 135110 -97047 -14784 27417 98005 57788 -37360 60957 -188054 112872
12869c6990j37272C8380K0169a66439C2873j628L05206A64820P5504F3803B2571
$$ -36990 -174262 38380 58549 -166439 32873 31245 336451 164820 240324 63803 22571
12857B23116p5206c8145I2478b5852n5889m3909A72217a95399e86j5934B52495
$$ 223116 147910 -38145 92478 -25852 -81741 -125650 172217 -195399 -586 -16520 252495
12845B9232K21914Q0712n5882g2762j68284C11723a86175N0726b8590A8289b78017
$$ 29232 251146 331858 275976 -72762 -241046 311723 -186175 -135449 -28590 18289 -278017
12833e39982I2188m1114d8181B58055a2522L012c32C4553a31436A29815o3895
$$ -539982 92188 51074 -48181 258055 -12522 -9510 -332 34553 -131436 129815 65920
12822F5920a34134L3888A97445F1512a48849f3618A15512K7773F9092k6929A3580
$$ 65920 -134134 -100246 197445 61512 -148849 -63618 115512 143285 69092 42163 13580
12810A45837J22897Q376A00134j4910J22494g411p8287k50859A27923d5009B24507
$$ 145837 268734 277110 100134 85224 207718 -7411 -85698 -336557 127923 -45009 224507
12798G5732a41999D4917J21374a13047I1000j8957K1386a20163i941B95126b31109
$$ 75732 -141999 44917 166291 -113047 91000 72043 93429 -120163 -9941 295126 -231109
12786A33858a36313r7M7865h28B03320b67877D7779j5754J36675k3979D01J08283
$$ 133858 -136313 -136410 -88545 -828 203320 -267877 47779 32025 168700 144721 401 108684
12774A08684d1082j82666r3925I230J849J24874o7802b45054F5786a02983J182
$$ 108684 -41082 -223748 -317673 9230 11079 135953 68151 -245054 65786 -102983 -101801
12763a01801M5301j30591C8161Q2669m3992C6153b20556j78930B39163p4837i97
$$ -101801 -56500 -187091 38161 120830 76838 36153 -220556 -399486 239163 164326 -997
12751A51677a20869A4896J04123a22188G3185J75524A22111E8450f8487j0159
$$ 151677 -120869 14896 119019 -122188 73185 248709 122111 58450 -68487 -78646
12741g8646j00867C3496e7667B81432Q6184M4843j26227l3145e895o4689A67278
$$ -78646 -179513 33496 -57667 281432 367616 412459 286232 253087 -5895 -70584 167278
12729B07333j6870A8791J0015d4230l46578b2252E3107J24065A8488a88633L0452
$$ 207333 190463 18791 28806 -44230 -390808 -22252 53107 177172 18488 -188633 -158181
12718a58181B4426B227e27926K11312D01671e9708j01197a1852C13040j2034J48723
$$ -158181 24426 2227 -527926 -316614 401671 -59708 -160905 -11852 313040 301006 449729
12707D49729j89455o743J28204R702d7747C10201j34331B4858J6588K7725J23371
$$ 449729 260274 253531 381735 391437 -47747 310201 175870 24858 41446 69171 192542
12696A92542C6613K06894N7822q3670B0222b06981G4950k2984a77736C5898K03711
$$ 192542 36613 243507 301329 217659 20222 -206981 74950 51966 -177736 35898 239609
12685B39609J18219d62648f2919A35697k4351J62954j04351M8801P7828a62388
$$ 239609 357828 -462648 -62919 135697 111346 274300 169949 218750 296578 -162388
12674A78279R5385R2370e394k76710B29813I3554f4359o3089A0911b72686K2649
$$ 178279 273664 366034 -5394 -282104 229813 93554 -64359 -127448 10911 -272686 -250037
12663b50037f7609B06801j2423m8675q604j7521b2522B71573q5295K1790J70735
$$ -250037 -67609 206801 194378 145703 137099 119578 -22522 271573 186278 208068 378803
12652C78803A16834a06730B40968c32698H7543J19910C0467b09654k22103A46402
$$ 378803 116834 -106730 240968 -332698 87543 207453 30467 -209654 -431757 146402
12641C02478a25760G4362a9123B91591g5104C6900d0993p0630A10295b09214A74177
$$ 302478 -125760 74362 -19123 291591 -75104 36900 -40993 -111623 110295 -209214 174177
12629C2436J46863C2134N29532k69927a39039A13254L9743b7541A46991o9255
$$ 32436 179299 32134 561666 291739 -139039 113254 152997 -27541 146991 77736
12619G7736K5869c7936C6641J13246l2853J29557B8627M2970K5917g3295A17933
$$ 77736 103605 -37936 36641 149887 117034 246591 28627 71597 97514 -73295 117933
12607G8608L62333D2602J01298c28946B79716A35467D4928L04719j09432m2542
$$ 78608 440941 42602 143900 -328946 279716 135467 44928 349647 240215 197673
12597A97673a64328A40909a20457B3358K97851a44500j04654D3892c91121b4459
$$ 197673 -164328 140909 -120457 23358 321209 -144500 -249154 43892 -391121 -24459
12586d8876j28464J3998o3734D6535K79474a09044E7410J28661c7922A15304B8587
$$ -48876 -177340 -163342 -227076 46535 326009 -109044 57410 186071 -37922 115304 28587
12574b0913A35652b87397I7959K52675b3199H9730L3108e4786b1212B53600j18627
$$ -20913 135652 -287397 97959 350634 -23199 89730 122838 -54786 -21212 253600 134973
12563A34973J08484a09296B44089E6779L2396J18579K64423j74412P1586A51094
$$ 134973 243457 -109296 244089 56779 89175 207754 472177 297765 369351 151094
12552d086k40094j11349h4302A3562L80775D0675f9462A75316B8890c7687p7652
$$ -4086 -244180 -355529 -84302 13562 394337 40675 -69462 175316 28890 -37687 -115339
12541a15339F9651a35580e9703k31282A6087J41845J76448f3392q7425B80791
$$ -115339 69651 -135580 -59703 -290985 16087 157932 334380 -63392 -150817 280791
12530a59964A2181N2983M7623h2515b9826A51622G2127L1269a0207A25636a4905
$$ -159964 12181 65164 112787 -82515 -29826 151622 72127 103396 -10207 125636 -14905
12518C2341b88646Q6522a4572j20183C14513A23820e3366A8249Q5340O7624b03634
$$ 32341 -288646 -202124 -14572 -134755 314513 123820 -53366 18249 103589 171213 -203634
12506b49776c883m8334B51737n9093j4744b13977G0521b15170h8955D2128P7016
$$ -249776 -3883 -52217 251737 192644 177900 -213977 70521 -215170 -88955 42128 119144
12495A19144b8805H8095A2126J87836l8924Q7291q8964n9003a93566A17656i0420
$$ 119144 -28805 88095 12126 199962 161038 248329 159365 100362 -193566 117656 -90420
12483a86523B07772b49647i0633a5707j60762P5264k44938A03445f6117D51903
$$ -186523 207772 -249647 -90633 -15707 -176469 -101205 -346143 103445 -66117 451903
12472a41675A7009d8162J0216G2400b69117a03151A24048P9023E9774n462a97508
$$ -141675 17009 -48162 -37946 72400 -269117 -103151 124048 203071 59774 54312 -197508
12460C88636A40964J62935A13451a29082D1449d7702J0706j54811E1148b60102
$$ 388636 140964 303899 113451 -129082 41449 -47702 -36996 -191807 51148 -260102
12449H0791b46485B20799G9574J73747b4678j02553j34054F9829c18937a45617
$$ 80791 -246485 220799 79574 253321 -24678 -127231 -261285 69829 -318937 -145617
12438A08547a28283o446A15700l017a28100m8812L8836l2937A34285c8501n0482
$$ 108547 -128283 -134729 115700 112683 -128100 -176912 -138076 -171013 134285 -38501 -88983
12427h8983j29928j38155h317A2215J98314E7891c78481A09522f3738M666C2166
$$ -88983 -218911 -357066 -8317 12215 210529 57891 -378481 109522 -63738 -59072 32166
12415a21473E2193c3696j96355I1448a02457B62030g1485k87587O0174A5444J18609
$$ -121473 52193 -33696 -230051 91448 -102457 262030 -71485 -359072 -298898 15444 134053
12404A34053b51507f8498A58064a869B36962c09795a08825A09825c14807b5983
$$ 134053 -251507 -68498 158064 -1869 236962 -309795 -108825 109825 -314807 -25983
12393A01634N5267c1413H6828K01586a41132A31025h5338E9894J113i6613m4009
$$ 101634 156901 -31413 86828 288414 -141132 131025 -85338 59894 61007 -96613 -140622
12382a40622O4799o2113l0764K6975m2265J2315A62739a7547J0o9529A84720a60377
$$ -140622 -75823 -137936 -168700 -141725 -183990 -171675 162739 -17547 -17537 -87066 184720 -160377
12369a7991l4249F3173a766C14224g1852r9455A94152b81554k9508a43730A2668
$$ -17991 -52240 63173 -1766 314224 -71852 -171307 194152 -281554 -311062 -143730 12668
12357e3104j85194e9733F0230c0901a181j97107C9940a24555C84737E677J83103
$$ -53104 -238298 -59733 60230 -30901 -1181 -198288 39940 -124555 384737 5677 188780
12346A88780I4290k8558a78958f7512o0519a1468k62630E9851f3454a2135o9758
$$ 188780 94290 65732 -178958 -67512 -128031 -11468 -274098 59851 -63454 -12135 -81893
12335h1893A6571b17566G508f6204D5135F660J07995A0042J71277e2464B43612
$$ -81893 16571 -217566 7508 -66204 45135 6660 114655 10042 181319 -52464 243612
12323E0913M3101c0348m76780A77201J4567q5824J57019F8722J87987C4505R9408
$$ 50913 94014 -30348 -507128 177201 191768 105944 262963 68722 256709 34505 133913
12312A33913j8112K2962F0500Q9441b79323B08712b1162k8103a4687F2535E054
$$ 133913 115801 138763 60500 149941 -279323 208712 -21162 -49265 -14687 62535 5054
12300A95247K3762B3505c7640a966I4430B7198K5043J83965A06778J43661H2609
$$ 195247 219009 23505 -37640 -1966 94430 27198 52241 236206 106778 250439 82609
12288A36730f2681A86805B838J64299f6834H0023J42392E8305L02087j39582R9365
$$ 136730 -62681 186805 2838 167137 -66834 80023 222415 58305 360392 220810 320175
12277C20175a10893C94583E9696J83660j8969A03888C5335l625a18618a3678G7971
$$ 320175 -110893 394583 59696 243356 224387 103888 35335 31710 -118618 -13678 77971
12265H2556L7529M323c4450B00877F6545K58572j33758a8737k447A70714N1531
$$ 82556 120085 124408 -34450 200877 66545 325117 191359 -18737 -21184 170714 222245
12254B22245R0658o3849M8530L8255a38491A48001J2040A7994b04873b1019G3503
$$ 222245 312903 249054 297584 335839 -138491 148001 160041 17994 -204873 -21019 73503
12242C40284Q1247A42214P3535N116A01531a38227G8342P5842J40894D3026a96857
$$ 340284 421531 142214 215749 220865 101531 -138227 78342 154184 295078 43026 -196857
12230B56658a4582n3734H7857J08846l2082D6267K41800n0406f6029E7867L07921
$$ 256658 -14582 -68316 87857 196703 164621 46267 288067 237661 -66029 57867 365788
12219C65788G1557c3888j22838C15234F4000P4777n157J3856C6871N1974k9428
$$ 365788 71557 -33888 -156726 315234 64000 138777 133620 147476 36871 88845 59417
12208E9417K386A287b3182D3351b6100R608C8913j0505K93859A45156A1861L45612
$$ 59417 61803 1287 -23182 43351 -26100 -16492 38913 28408 322267 145156 11861 357473
12196C57473M2492G4163K31975a61097M2358A22527B7186K5859i759C11254h2303
$$ 357473 399965 74163 306138 -161097 -118739 122527 27186 53045 -9759 311254 -82303
12184A12460J89842a59177E9098B6426b3994r17C1803K06867A06935a08366o8623
$$ 112460 302302 -159177 59098 26426 -23994 -24911 31803 238670 106935 -108366 -176989
12173a76989A60729b28966D924K84778L077k7061n0046g7457A64010j1906c10914
$$ -176989 160729 -228966 4924 289702 292779 265718 215672 -77457 164010 152104 -310914
12161A55212A5586i8296J8984B3498a21339K2117j38727D6686b56311I4175d1894
$$ 155212 15586 -98296 -79312 23498 -121339 -99222 -237949 46686 -256311 94175 -41894
12149C89190j60619o7535o5241O7513K228e6632A84760n6470g2204G9554K07045
$$ 389190 228571 161036 95795 163308 165536 -56632 184760 128290 -72204 79554 286599
12138B86599A40267Q2223p6623P2198a08764A68290d6713m8147A44222a0158A89922
$$ 286599 140267 222490 145867 218065 -108764 168290 -46713 -94860 144222 -10158 189922
12126B77612a07983J6812C75307b6388E3317c1880j02981A16963E6546a52471
$$ 277612 -107983 -91171 375307 -26388 53317 -31880 -134861 116963 56546 -152471
12115A32004a9476C8439a59461D5588b06711A52812d81788f0879A3273L8989e8214
$$ 132004 -19476 38439 -159461 45588 -206711 152812 -481788 -60879 13273 52262 -58214
12103a57998c7494j58430I8584k0439c28344G0623M0719I391b47448b0501A02914
$$ -157998 -37494 -195924 98584 78145 -328344 70623 111342 9391 -247448 -20501 102914
12091i580A64089a63163A31850J40497G3557b0391A4994e8964j45683B31131a48052
$$ -9580 164089 -163163 131850 272347 73557 -20391 14994 -58964 -204647 231131 -148052
12079G1339b10754r0388R3816A0841d2090J2873A85765L41458J407186n59049
$$ 71339 -210754 -301142 -207326 10841 -42090 -29217 185765 527223 1934409 1375360
12069A375360I939J53985L0057I5021g0320A11977a14406A94474a05951H8368
$$ 1375360 9939 163924 193981 95021 -70320 111977 -114406 194474 -105951 88368
12058a50431d6603o3584C5025J30098G5778e434A90408b3324r5336j75080A6585
$$ -150431 -46603 -110187 35025 165123 75778 -5434 190408 -23324 -118660 -293740 16585
12046A0167J36524e4694p5565d449B33436d994C62365b63023B52817b84289i6174
$$ 10167 146691 -54694 -130259 -4449 233436 -4994 362365 -263023 252817 -284289 -96174
12034b59918R6635j53080f6237J3845r5261A9225b17566A03238C3038R516a32898
$$ -259918 -163283 -316363 -66237 -52392 -147653 19225 -217566 103238 33038 42554 -132898
12022a9230n9380B15302o3338b22829g6189o3678D76114a02552M7141D2189J28427
$$ -19230 -78610 215302 151964 -222829 -76189 -139867 476114 -102552 -55411 42189 170616
12011A70616K2221k5772C5230i7364A21812E890Q0598a66763g9151L7225k48191
$$ 170616 192837 167065 35230 -97364 121812 5890 86488 -166763 -79151 -41926 -290117
12000b90117g7808B80979n8310a28034J5401A8992a75822j39197g3188E9577p924
$$ -290117 -77808 280979 222669 -128034 -112633 18992 -175822 -315019 -73188 59577 51653
11989E1653a60686B9763K2941a08668A58894g0319A14289q171R9730a37341a9176
$$ 51653 -160686 29763 52704 -108668 158894 -70319 114289 106118 205848 -137341 -19176
11977B09996q3239e8084I4853b01726Q0055A56191b91895H0265b17146e7757l9092
$$ 209996 126757 -58084 94853 -201726 -121671 156191 -291895 80265 -217146 -57757 -96849
11966i6849D0992J02731b11982k7983O0113B2120b23332C567P6362c35568A10790
$$ -96849 40992 143723 -211982 -239965 -179852 22120 -223332 3567 79929 -335568 110790
11954G165a00466H94O9483i7547B73117d8370k6295k83902F7170f986j79753c9100
$$ 7165 -100466 894 70377 -97547 273117 -48370 -74665 -358567 67170 -6986 -186739 -39100
11941b60935O9766m028e9137n931j70857c1014h739r7577H6403d1506C1528a14866
$$ -260935 -191169 -195197 -59137 -65068 -235925 -31014 -8739 -106316 86403 -41506 31528 -114866
11928b44564B62856F8498a90493C5196a08551j19159C28340i055L621j56655A8966
$$ -244564 262856 68498 -190493 35196 -108551 -227710 328340 -9055 -5434 -162089 18966
11916a07400N724A80465D3602f6760B69410j27583a79161C9238e2840E2560d6494
$$ -107400 -101676 180465 43602 -66760 269410 141827 -179161 39238 -52840 52560 -46494
11904A06423J20303b57093K1533i4278A35570l7122D6634b16428A46684A7556
$$ 106423 226726 -257093 -235560 -94278 135570 98448 46634 -216428 146684 17556
11893a50939A1797d5495B3483i262G9161p658i4244n9821l4295A11319N6359a31358
$$ -150939 11797 -45495 23483 -9262 79161 71503 -94244 -154065 -188360 111319 167678 -131358
11880f3439G3728b46437O210A39057b9903j31745O1837l5578f2250j37139J3160
$$ -63439 73728 -246437 -240227 139057 -29903 -161648 -99811 -135389 -62250 -199389 -186229
11869a86229n4612j24944J55962d6857A01406D2060A5002J2264e06489e1952A62724
$$ -186229 -240841 -365785 -209823 -46857 101406 42060 15002 27266 -506489 -51952 162724
11857d969G084b42312C262a75612A99857b33032e3051B78437q2704C377a43745
$$ -4969 7084 -242312 3262 -175612 199857 -233032 -53051 278437 195733 3377 -143745
11845B37587c74508d2439d930k43791h5223B4830N1699j4097a2801m93527A32493
$$ 237587 -374508 -42439 -4930 -248721 -85223 24830 76529 62432 -12801 -506328 132493
11833D9129a49402L9077A01784B350c29458H3436d7716G6019L2727b68265J21872
$$ 49129 -149402 -110325 101784 2350 -329458 83436 -47716 76019 108746 -268265 -146393
11822a46393a769B31614d85221a11360c4399r5306N7319q1387H4984A1228L7774
$$ -146393 -1769 231614 -485221 -111360 -34399 -129705 -72386 -153773 84984 11228 49002
11811D9002g1897K4383A44833a45032B3207K72441a7455o9120j5759q101B83222
$$ 49002 -71897 -47514 144833 -145032 23207 295648 -17455 -86575 -102334 -110435 283222
11799A86014C7656K3540b31332A04560p045A5437b65915B09108m1079a68460r3855
$$ 186014 37656 61196 -231332 104560 97515 15437 -265915 209108 168029 -168460 -262315
11788b62315F2615J57976e2528K2572B17550F9854k2560h4938m94D61343A05933
$$ -262315 62615 220591 -52528 -29956 217550 69854 47294 -84938 -85432 461343 105933
11776f6988A91754q1500a30724e8013A11910J56915m4780r7349f0672B21263p1090
$$ -66988 191754 110254 -130724 -58013 111910 268825 224045 126696 -60672 221263 150173
11765A50173M5121o2938j7675b76437D3289c5843A62320e6744p009q5555k0041
$$ 150173 195294 132356 114681 -276437 43289 -35843 162320 -56744 -63753 -149308 -169349
11754a69349O1863A04961K6821b87083c5965A02414K2805c61665R3491B19708
$$ -169349 -107486 104961 131782 -287083 -35965 102414 125219 -361665 -268174 219708
11743a99008B40849q2623c27457R6739k31867g1437I9079K0522i1667B16139a23795
$$ -199008 240849 158226 -327457 -230718 -462585 -71437 99079 119601 -91667 216139 -123795
11731a07429B21528a93679C0163c5686j91910I8347b39522h5511C29759A14747
$$ -107429 221528 -193679 30163 -35686 -227596 98347 -239522 -85511 329759 114747
11720A46383r1A9647J4960L20599a29172b8796f859k3581B93785b8397k1943C0824
$$ 146383 146292 19647 34607 355206 -129172 -28796 -6859 -30440 293785 -28397 -50340 30824
11707I6858l5638K04820A4024g6699C37934r0126h5406B04772p4701N5729a69882
$$ 96858 61220 266040 14024 -76699 337934 247808 -85406 204772 130071 185800 -169882
11695b00737L4528A60479i9133B28825c8030B50977n5545J2822M2211H359a477
$$ -200737 -166209 160479 -99133 228825 -38030 250977 195432 208254 250465 8359 -1477
11683A8033J45496J59701E3586a09492A10424i2172k4299H1716H066b81690J28244
$$ 18033 163529 323230 53586 -109492 110424 -92172 -116471 81716 8066 -281690 -153446
11672a53446e9915n0972c266I7258b31332A32788B8798O62J79134b90228A15204
$$ -153446 -59915 -110887 -3266 97258 -231332 132788 28798 29460 208594 -290228 115204
11660A1318R9536J77526e5872a1189j39604H8623e2697A40691c08862A79838J24546
$$ 11318 110854 288380 -55872 -11189 -150793 88623 -52697 140691 -308862 179838 304384
11649C04384H5270M2947J4572J67706I7632a05206C23994C452c31558B2959K08588
$$ 304384 85270 128217 142789 310495 97632 -105206 323994 3452 -331558 22959 231547
11638B31547C0117Q8331B2854K9170b22053a8421E5892R7376A2845Q8012a36205
$$ 231547 30117 118448 22854 52024 -222053 -18421 55892 153268 12845 100857 -136205
11626C46461a22295c8535r0399C5090Q2704l5221d1767A17850l9445L20386b29449
$$ 346461 -122295 -38535 -128934 35090 117794 82573 -41767 117850 78405 398791 -229449
11614C06498r6278o5543E9427a75570A46431n7413d4437D7697h1388E0196N420
$$ 306498 210220 144677 59427 -175570 146431 89018 -44437 47697 -81388 50196 55616
11603E5616M471J95175J1275F2940L59244a2337A19025E3905a08311j00053b0916
$$ 55616 60087 255262 266537 62940 422184 -12337 119025 53905 -108311 -208364 -20916
11591B53748j25039k502D6471A7822K16065a3367B15340I8370N1688A950M73737
$$ 253748 128709 126207 46471 17822 233887 -13367 215340 98370 150058 1950 475687
11580D75687d07602a09660C02280f8831k53318B57327n1307J0021D9121b07025
$$ 475687 -407602 -109660 302280 -68831 -322149 257327 206020 216041 49121 -207025
11569I6235a3375M941B6208J44184e9450C3957I129O3788J46040e7705A98485
$$ 96235 -13375 -8434 26208 170392 -59450 33957 9129 72917 218957 -57705 198485
11557a42857L0260B5962g6268a9786A41553J88310j27681k8374P5680K00932B18445
$$ -142857 -112597 25962 -76268 -19786 141553 329863 202182 173808 249488 450420 218445
11545a97097E3750F000d856B12851B8175c45374E0811M0691g84A72657B402J56063
$$ -197097 53750 6000 -4856 212851 28175 -345374 50811 91502 -784 172657 2402 158465
11533A58465m9477K4334k875E3948J90280A11501K78722c81428B82945A0342b8461
$$ 158465 108988 133322 130447 53948 244228 111501 390223 -381428 282945 10342 -28461
11521A17941D6496f7221A17266J29942D7029c8875k43027A85794b90410F103M38785
$$ 117941 46496 -67221 117266 247208 47029 -38875 -281902 185794 -290410 6103 444888
11510D44888B21159n4738G9491b01607B6148J87194d05814A29461D364M04497
$$ 444888 221159 166421 79491 -201607 26148 213342 -405814 129461 4364 408861
11500D08861B7089R2378a03787R327B52130G9917N0658E8551c24564a20741A95199
$$ 408861 27089 119467 -103787 -94460 252130 79917 130575 58551 -324564 -120741 195199
11488a22328j5374C18627R662f6744B75295J3526a58964C84249D8903m133f5360
$$ -122328 -137702 318627 328289 -66744 275295 288821 -158964 384249 48903 44770 -65360
11476C02486m1840q6280n0010M0482J00734r2530R1131K02978A78997f6262A98739
$$ 302486 260646 174366 124356 164838 265572 173042 264173 467151 178997 -66262 198739
11464C08450d5084l3299A81289H3639k3754d7928A35616l2971P8260L29956F4005
$$ 308450 -45084 -78383 181289 83639 59885 -47928 135616 102645 180905 510861 64005
11452B54421J52974c20111f723C53316H1835J432A2649L73977A36925C8851R1444
$$ 254421 407395 -320111 -6723 353316 81835 83267 12649 386626 136925 38851 130295
11441A30295K3006a199I1232k5934J73940k3977g3722F765K96980A23144f8757
$$ 130295 153301 -1199 91232 65298 239238 215261 -73722 6765 303745 123144 -68757
11429A7717J12108b16656A06023k6963J15874p2550K0022i6593A36605b3167A41099
$$ 17717 129825 -216656 106023 79060 194934 122384 142406 -96593 136605 -23167 141099
11417a17276e1468J3004A33302n4548O3804J15127a10890B12999b9592G195L3662
$$ -117276 -51468 -38464 133302 78754 142558 257685 -110890 212999 -29592 7195 40857
11406D0857J86553a59587A08713b0648I7498h8056A76003A9561J32974b1820j03225
$$ 40857 227410 -159587 108713 -20648 97498 -88056 176003 19561 152535 -21820 -125045
11395a25045K8612c7388j22316L8444k58063b8722k15452A49418a70646p3266
$$ -125045 -96433 -37388 -159704 -121260 -379323 -28722 -244174 149418 -170646 -243912
11385b43912E8665a22145H4901L93422f3462k77223a36145J2842k69250B33128
$$ -243912 58665 -122145 84901 478323 -63462 -340685 -136145 -123303 -392553 233128
11374a42227C44811D3625M6160a3378B92207b58125J08232j24603o7494D8581
$$ -142227 344811 43625 89785 -13378 292207 -258125 -149893 -274496 -341990 48581
11363b74465D12894g6653j5833k53601B5314J79843b21771N5933N0793A74382
$$ -274465 412894 -76653 -92486 -346087 25314 205157 -221771 -165838 -115045 174382
11352f5884l6949k02110J09102A01739f9782B13054f32r273b801n0697r0966k0380
$$ -65884 -102833 -304943 -195841 101739 -69782 213054 -632 -9905 -2801 -53498 -144464 -164844
11340a64844a1519j11434A17216g2180J3978A6703c22385f7501F8568A5666a26871
$$ -164844 -11519 -122953 117216 -72180 -58202 16703 -322385 -67501 68568 15666 -126871
11328A16990a16516L4571j42744D9313i3616A57169g1737I6291k216J7069a64740
$$ 116990 -116516 -81945 -224689 49313 -93616 157169 -71737 96291 94075 111144 -164740
11316a13778A60577L5881a45926G1618g0782l4739A16667g3296j1572b0729m3906
$$ -113778 160577 196458 -145926 71618 -70782 -105521 116667 -73296 -84868 -20729 -64635
11305f4635j46238G6939R0322c07708A84809c98934J09714l8597j6222B31225
$$ -64635 -210873 76939 167261 -307708 184809 -398934 -289220 -327817 -344039 231225
11294c50453f5246E6363e9892I7506k6285b84794b5213k74245i3949A43060b74230
$$ -350453 -65246 56363 -59892 97506 71221 -284794 -25213 -299458 -93949 143060 -274230
11282b58769A20481b50724N8088i6108L1588l8893C1299b93849c1119A41728i4370
$$ -258769 120481 -250724 -192636 -96108 -64520 -103413 31299 -293849 -31119 141728 -94370
11270e25887b33340D2628J42091f4063b8871B40815a0167l3024a1661k79521c3470
$$ -525887 -233340 42628 184719 -64063 -28871 240815 -10167 -43191 -11661 -291182 -33470
11258I1297c44848H4218K8957a59076B5922J60786a67621A73631a18261A65444
$$ 91297 -344848 84218 113175 -159076 25922 186708 -167621 173631 -118261 165444
11247D7498J69427f9757A08883f9861I7420P829l7959R8625L44937c36947A3846
$$ 47498 216925 -69757 108883 -69861 97420 105249 67290 165915 510852 -336947 13846
11235g9940B50887b02752L1394A33834c63239K0986B6876a36917A28951J8248
$$ -79940 250887 -202752 -171358 133834 -363239 -342253 26876 -136917 128951 147199
11225A47199a79899I0228K4896a75540j16523g148j93898I194J96533r0288f1322
$$ 147199 -179899 90228 115124 -175540 -292063 -7148 -201046 9194 205727 115439 -61322
11213A74308f0683j23969j64626J32411A38279L4851a890H8621b8215A8400a50402
$$ 174308 -60683 -184652 -349278 -216867 138279 173130 -1890 88621 -28215 18400 -150402
11201a28965l3006k71851R9022J45878F9670N9787J05941b18729A7660J77809
$$ -128965 -161971 -433822 -334800 -188922 69670 129457 235398 -218729 17660 195469
11191A95469a87842r6126B1940d8615j29308A30524o0349B9336B594g4366k11491
$$ 195469 -187842 -283968 21940 -48615 -177923 130524 70175 29336 2594 -74366 -285857
11180b85857A45427b06515a3733l10718G6064a91987d2059K334A3607a67366a1775
$$ -285857 145427 -206515 -13733 -324451 76064 -191987 -42059 -39725 13607 -167366 -11775
11168A24701d7321B75741a01018l3177B86653e737j45533O4732b7866q6732r4054
$$ 124701 -47321 275741 -101018 -134195 286653 -5737 -151270 -86538 -27866 -114598 -208652
11157b08652B06657c398I1327H095a40836B33488b61388G5984f0349r3343l1505
$$ -208652 206657 -3398 91327 8095 -140836 233488 -261388 75984 -60349 -153692 -185197
11146a85197G1013Q5474q164b02524b4261p6383m7066A9219f2002E5938b6118
$$ -185197 71013 156487 148323 -202524 -24261 -100644 -147710 19219 -62002 55938 -26118
11134B63984a22345l0892A9201c37390J68653A46497R3851J11227A0223J34133
$$ 263984 -122345 -153237 19201 -337390 -168737 146497 240348 351575 10223 144356
11124A44356M3837L2325j04483O5558I0158J31738N4036j19005m162g1394A32024
$$ 144356 188193 220518 116035 181593 90158 221896 275932 156927 152765 -71394 132024
11112b14859A16845E1428e6427j07603H9908i211B46142D7632K36879m7955l6510
$$ -214859 116845 51428 -56427 -164030 89908 -9211 246142 47632 284511 236556 200046
11101B00046c2927A31146M30257B20560J02128i8595p7993A38852a18906A85949
$$ 200046 -32927 131146 561403 220560 322688 -98595 -176588 138852 -118906 185949
11090B47252j6600f8005B27234J93628a826D65214A00122k1828N2964J24998A22143
$$ 247252 230652 -68005 227234 420862 -1826 465214 100122 78294 131258 256256 122143
11078A57679L53623P754j03850j23561E8650K91383K51479b4823A29962K31825
$$ 157679 511302 519056 415206 291645 58650 350033 601512 -24823 129962 361787
11068C61787J23648j38477j3264J06892P4850J60369j10351B59327J81408K35225
$$ 361787 485435 346958 333694 440586 515436 675805 565454 259327 440735 675960
11058F75960j66668o0542j57686K79814L0832R8704j94791M64824k71223j97464
$$ 675960 509292 448750 291064 570878 601710 700414 505623 970447 699224 501760
11048E01760K89761j75733K23327j58092k4733L9991j29644J64342k6814J8673
$$ 501760 791521 615788 839115 681023 656290 696281 566637 730979 704165 722838
11038G22838J7601K15138r6863j1814B96876M55247M1859B99220K99572J92917
$$ 722838 740439 955577 858714 846900 296876 752123 793982 299220 598792 791709
11028G91709k21886M29327l56381K34756m32387M14584D05621L87307k53460J76858
$$ 791709 569823 999150 642769 877525 445138 859722 405621 792928 539468 716326
11018G16326J14670l6810m7548j08618L62308m11696K8271j39646J87322B34333
$$ 716326 830996 794186 746638 638020 1000328 588632 616903 477257 664579 234333
11007G45740j06936B93524J83022j65410J90567J47866l2718J52902L8670l79855
$$ 745740 638804 293524 476546 311136 501703 649569 616851 769753 808423 428568
10997D28568K60339k8818m7600J22240J20911J37865n6512j79287K99660l85427
$$ 428568 688907 660089 612489 734729 855640 993505 936993 757706 1057366 671939
10987F71939m9241L66103Q9551m37846N62927j5053Q9137Q9737L521K60521M60749
$$ 671939 622698 988801 1078352 640506 1203433 1188380 1277517 1367254 1370775 1631296 2092045
10976B092045l02857N21588j11181L71109K56377K36240l85549k1199j89489k71695
$$ 2092045 1789188 2310776 2199595 2570704 2827081 3063321 2677772 2656573 2467084 2195389
10966B195389r3031m83709j06802J99530J39392O1393l6329K78183k87146p2227
$$ 2195389 2102358 1618649 1511847 1711377 1850769 1912162 1875833 2154016 1866870 1794643
10956A794643J57860K2992j17431m58820k3662m64613l14786K97596k52625C19991
$$ 1794643 1952503 1975495 1858064 1399244 1375582 910969 596183 893779 641154 319991
10945C41802A61558N56851C20564r1480L07123D4025j6614K9525a00815L8131
$$ 341802 161558 718409 320564 229084 536207 44025 27411 56936 -100815 -62684
10935f2684B8789K01507J5383f4172A69597n9051b08376B71319h1740C04839A23872
$$ -62684 28789 230296 245679 -64172 169597 110546 -208376 271319 -81740 304839 123872
10923f5541A17898Q2723l3892A7107a45884f6302j3115A09033a0301E6386b57824
$$ -65541 117898 200621 166729 17107 -145884 -66302 -79417 109033 -10301 56386 -257824
10911B70961a68082h3798A38548J74085C7985J68620a14961l8346C3556R9995
$$ 270961 -168082 -83798 138548 312633 37985 206605 -114961 -153307 33556 133551
10901A33551a13338A16976c83533a0737F2344a22233B0620L1182a55920B04305
$$ 133551 -113338 116976 -383533 -10737 62344 -122233 20620 51802 -155920 204305
10890e5476A59192a62812O109A09990J95846o7594f6748A14426Q560a7397A22925
$$ -55476 159192 -162812 -156703 109990 305836 238242 -66748 114426 122986 -17397 122925
10878A98639a13167A72253G9149J18216H2066K94524e2653F0132a54507k26145
$$ 198639 -113167 172253 79149 197365 82066 376590 -52653 60132 -154507 -380652
10868c80652C05562G5036K7790b69731A36330K59286D3427K08225g6664j41429
$$ -380652 305562 75036 102826 -269731 136330 395616 43427 251652 -76664 -218093
10858b18093i574m61901A54315C2363c3283l25588c5155A6822J94511b57861h0612
$$ -218093 -9574 -471475 154315 32363 -33283 -358871 -35155 16822 211333 -257861 -80612
10846B70118b7810C7064K9135g7172P146j26775K6958C6661a20325C73562d9351
$$ 270118 -27810 37064 66199 -77172 -70026 -196801 -169843 36661 -120325 373562 -49351
10834E6879a13734C2713b732B17462j02282d0841A17024d5678j63720k0323a01159
$$ 56879 -113734 32713 -2732 217462 115180 -40841 117024 -45678 -209398 -229721 -101159
10822c39005a32191N7270I3568D1518a304j47312f1563j54971A52899H542b94399
$$ -339005 -132191 -74921 93568 41518 -1304 -148616 -61563 -216534 152899 8542 -294399
10810a99399i5816r3104O3619K4546r9584o0187J11687c742m3088F915i3944B50
$$ -199399 -95816 -188920 -125301 -100755 -200339 -260526 -148839 -3742 -46830 6915 -93944 250
10797a09615B02437I9097L1177b79422I8410a60962f7065j02801O8241A58138
$$ -109615 202437 99097 130274 -279422 98410 -160962 -67065 -169866 -101625 158138
10786c36062A70869E7674P3000A1810J27305R2007c06219h6799p6547A6713a59836
$$ -336062 170869 57674 130674 11810 139115 231122 -306219 -86799 -163346 16713 -159836
10774a6670j16493A14754R437a83412a3666H7595b15329E6095a98534B95566a29716
$$ -16670 -133163 114754 124191 -183412 -13666 87595 -215329 56095 -198534 295566 -129716
10762c51657B11177G9846h7565k35420A76174g3403A51316l0267a31673Q535M8126
$$ -351657 211177 79846 -87565 -322985 176174 -73403 151316 121049 -131673 -123138 -75012
10751g5012k44619C19903F6815l2375J45220G6333O2642b47967b5181k8427l9264
$$ -75012 -319631 319903 66815 34440 179660 76333 138975 -247967 -25181 -53608 -92872
10740i2872M2244F0394b45178A71914b10769K2835p1399b0071C66926i0346h010
$$ -92872 -50628 60394 -245178 171914 -210769 -187934 -259333 -20071 366926 -90346 -8010
10728b38766A82996p0638b99804e1999F8320b0433j93766A32065b54373k230b1826
$$ -238766 182996 112358 -299804 -51999 68320 -20433 -214199 132065 -254373 -256603 -21826
10716B00675b14287B4003a35882F9705b8758j92478O9324e4397j391H3316l0858
$$ 200675 -214287 24003 -135882 69705 -28758 -221236 -151912 -54397 -55788 83316 52458
10705E2458c8230A65558b4725k41898C7321b5911j67194P60i0083G6110b59096
$$ 52458 -38230 165558 -24725 -266623 37321 -25911 -193105 -192345 -90083 76110 -259096
10693a04487A42763n1517N0569e6948a725o3665J3799B34355o9413B7407a7136
$$ -104487 142763 91246 141815 -56948 -1725 -65390 -51591 234355 164942 27407 -17136
10681G101a20787D2077L0297a75579A70919J174a63150h037n5722j11675C8257
$$ 7101 -120787 42077 72374 -175579 170919 172093 -163150 -8037 -63759 -175434 38257
10669e0690k59583h4928C4519d9938a2698l24591J11642B41323a90737c0128j18015
$$ -50690 -310273 -84928 34519 -49938 -12698 -337289 -225647 241323 -190737 -30128 -148143
10658a48143f0105k87897B31704c79577P8540a44830p481E9952a77664f2145r5422
$$ -148143 -60105 -348002 231704 -379577 -301037 -144830 -152311 59952 -177664 -62145 -157567
10647a57567b6565A460K01253d01832I742J25098K1857b91069A51218c52715B2700
$$ -157567 -26565 1460 202713 -401832 9742 134840 156697 -291069 151218 -352715 22700
10635B36355a32597e3107N008E2012J6587j956a50085D5850b81451G1949c1400
$$ 236355 -132597 -53107 -48099 52012 68599 66643 -150085 45850 -281451 71949 -31400
10623I2041a07899M0810K1860m4530l3158o7806e3352m3161j42829f0448j20891
$$ 92041 -107899 -67089 -45229 -89759 -122917 -190723 -53352 -96513 -239342 -60448 -181339
10612a81339A73827a10581k92891J85134A83235a4086D1574d1018p7688A66836
$$ -181339 173827 -110581 -403472 -218338 183235 -14086 41574 -41018 -118706 166836
10601B5669G014J27315e8049A45249d1787j4695r2271n0124c3732A71361m5490
$$ 25669 7014 134329 -58049 145249 -41787 -56482 -148753 -198877 -33732 171361 125871
10590A25871O7750h2446o9177B79575A2866a55386D9026b36181p355A24394a76348
$$ 125871 193621 -82446 -151623 279575 12866 -155386 49026 -236181 -243536 124394 -176348
10578b1743k08063B08686F7782b95886A74499d4056k50970e5679G1847c53003
$$ -21743 -229806 208686 67782 -295886 174499 -44056 -295026 -55679 71847 -353003
10567a11698o2166e4436j8544r3142B4193a99787g578C2855J31080e7076F0887
$$ -111698 -173864 -54436 -72980 -166122 24193 -199787 -7578 32855 163935 -57076 60887
10555c34556a9225j21854J7457B18272b21817j92834k8706a1406A88123i3175
$$ -334556 -19225 -141079 -123622 218272 -221817 -414651 -443357 -11406 188123 -93175
10544D4386a8309A49896a04912j04421B4634b5456G6470a93010r8456B6594J35351
$$ 44386 -18309 149896 -104912 -209333 24634 -25456 76470 -193010 -291466 26594 161945
10533A61945a11003A15395a47730m241d7792B20786a58074A06024D7744M9027
$$ 161945 -111003 115395 -147730 -151971 -47792 220786 -158074 106024 47744 96771
10523I6771b24186K721A53752o3211e3603l32p4405A97499a99969d0110C231c5577
$$ 96771 -224186 -221465 153752 90541 -53603 -53935 -128340 197499 -199969 -40110 3231 -35577
10510A71932a13134o4861d0119B40687N4790G1706l5524K01361m2157D954a34195
$$ 171932 -113134 -177995 -40119 240687 295477 71706 36182 237543 195386 4954 -134195
10498a46710o9014i0834o3260A57689B5391a64971P39D1013b15848m1809A20471
$$ -146710 -215724 -90834 -154094 157689 25391 -164971 -164232 41013 -215848 -257657 120471
10486A61581l7428N6308j1036J29372R7412K72936q1643A94264e3804B43290b86640
$$ 161581 124153 180461 169425 298797 396209 669145 587502 194264 -53804 243290 -286640
10474b3744I4889B7609I710a2537G3294a57145A14697B1626c25654h0600B144
$$ -23744 94889 27609 9710 -12537 73294 -157145 114697 21626 -325654 -80600 2144
10462A43524c0589C4808c28921C80505a02302r2285H6321b51805O4842l7084A86978
$$ 143524 -30589 34808 -328921 380505 -102302 -194587 86321 -251805 -186963 -224047 186978
10450a00922l9785K1689L6627j24784E3059a8614k01418R6685A79766b93180i8237
$$ -100922 -140707 -119018 -82391 -207175 53059 -18614 -220032 -123347 179766 -293180 -98237
10438A91686o1502a0334j51281P4410q776c3058r2730d9724j93337D8116J63767
$$ 191686 130184 -10334 -161615 -87205 -95981 -33058 -125788 -49724 -243061 48116 211883
10427B11883b47188b1598j2668l2184J8694j43771D613L5513P7740a19881A35912
$$ 211883 -247188 -21598 -34266 -66450 -47756 -191527 4613 40126 117866 -119881 135912
10415c07414B47132I5461a66990p7245B13907i5876A34273f83j89388l13996A77596
$$ -307414 247132 95461 -166990 -244235 213907 -95876 134273 -683 -190071 -504067 177596
10403f4275A35431b29243K416G0572k7475b45697j30092A58546b50776A58021
$$ -64275 135431 -229243 -226827 70572 43097 -245697 -375789 158546 -250776 158021
10392C6796k458i1322d0538n6465B86074E1129b489A11147P6827j1481R9463E6175
$$ 36796 34338 -91322 -40538 -97003 286074 51129 -2489 111147 187974 176493 275956 56175
10379A43208L8050K2360p9811P5055J16240F5568L23593j78032P1179J80418A84211
$$ 143208 181258 203618 123807 198862 315102 65568 389161 211129 282308 462726 184211
10367C98969L83371l46918A83204R8867D1567J89338Q2242K79029B45402P7220
$$ 398969 782340 435422 183204 282071 41567 230905 313147 592176 245402 322622
10357C22622A34515D5086Q9547K17606J95781j58510o3315J57523p8789j13505
$$ 322622 134515 45086 134633 352239 548020 389510 326195 483718 404929 291424
10347B91424J614A45574K116J00543m6924n6113d843D77189A49615b1719B22158
$$ 291424 293038 145574 147690 248233 201309 145196 -4843 477189 149615 -21719 222158
10335A70491f5787A4237Q3881J08679L9571B2050a66816A9041b26727H4906J63200
$$ 170491 -65787 14237 98118 206797 246368 22050 -166816 19041 -226727 84906 248106
10324B48106n7921L41676C407R4906J65353J38872A58124a01101C476M43809g8486
$$ 248106 190185 531861 3407 98313 263666 402538 158124 -101101 3476 447285 -78486
10312A436K01570L400A4738b64934d104D6617R6712K4072h7984C87868I427a00402
$$ 1436 203006 206406 14738 -264934 -4104 46617 143329 167401 -87984 387868 9427 -100402
10299A89380c0206B629J08839J1966n5161c2916D5018J88757a96102d7412F6631
$$ 189380 -30206 2629 111468 123434 68273 -32916 45018 233775 -196102 -47412 66631
10287b72457F0488a00726l07206B35101B1232J50Q3619a99981R8647j58955J2256
$$ -272457 60488 -100726 -407932 235101 21232 21382 105001 -199981 -101334 -260289 -248033
10276b48033F2536B407g2909B22729B8973N5087O9098J66175b00098B19529a24227
$$ -248033 62536 2407 -72909 222729 28973 84060 153158 319333 -200098 219529 -124227
10264A26976J9959J58363A19734K21299q5445N5536J12618O6499k9923B13119
$$ 126976 146935 305298 119734 341033 255588 311124 423742 490241 460318 213119
10253h0145A6136d2521C3907e2576g985k85463j6708G6583j7343B6705b97110
$$ -80145 16136 -42521 33907 -52576 -7985 -293448 -310156 76583 59240 26705 -297110
10241a80630G587b56457n0975J26679F5898e68408C21075b88914L8633B06242
$$ -180630 7587 -256457 -307432 -180753 65898 -568408 321075 -288914 -250281 206242
10230a47556M4874k45208e4845J114D5932a95039A61033b53294D43082b7386G63
$$ -147556 -102682 -347890 -54845 -53731 45932 -195039 161033 -253294 443082 -27386 763
10218a40300c0306j8248p1177c344j34353b4594k1784A51571D7857a74746B33873
$$ -140300 -30306 -48554 -119731 -3344 -137697 -24594 -46378 151571 47857 -174746 233873
10206A59790a91200P8130r3801j28980a20494b8459m5792A77213n1687a55761
$$ 159790 -191200 -113070 -206871 -335851 -120494 -28459 -74251 177213 125526 -155761
10195D2117R9249i6085H4524b40534j19551a12693o7838A99938d65833A63006
$$ 42117 141366 -96085 84524 -240534 -360085 -112693 -180531 199938 -465833 163006
10184b2649j10240k9165d1385F1235J53123L9403A0620a6690j20031c0208a2097
$$ -22649 -132889 -162054 -41385 61235 214358 253761 10620 -16690 -136721 -30208 -12097
10172A31011e63221g0748n3515k11452h1000k3125j5893j52351a27902j92334
$$ 131011 -563221 -70748 -124263 -335715 -81000 -104125 -120018 -272369 -127902 -320236
10162c20236b5892B62035b23320O5474k63210J93672a4862l92203L1916J61348
$$ -320236 -25892 262035 -223320 -157846 -421056 -227384 -14862 -407065 -375149 -213801
10152b13801Q5914j45723a15179A63645G3920a47096n6388D0640J13103B584K80550
$$ -213801 -127887 -273610 -115179 163645 73920 -147096 -203484 40640 153743 2584 283134
10141B83134E1363L1930a80708O0061A82097a38444j00131n6876a40421N6349
$$ 283134 51363 83293 -180708 -120647 182097 -138444 -238575 -295451 -140421 -84072
10131h4072j73997A12302D6394L6093J68558a28444M0682j66015a16093j70675
$$ -84072 -258069 112302 46394 82487 251045 -128444 -87762 -253777 -116093 -286768
10121b86768o2662c8663k58920a00970A44365a27597d0132j32003g1156k18912
$$ -286768 -349430 -38663 -297583 -100970 144365 -127597 -40132 -172135 -71156 -290068
10111b90068A13264M2384b907k0906j9678C3654O3335c03733a6198j22415k67625
$$ -290068 113264 155648 -2907 -23813 -43491 33654 96989 -303733 -16198 -138613 -406238
10100d06238B22189b05899n3475A5632a0255G2639a67276j51889C24385a97421
$$ -406238 222189 -205899 -259374 15632 -10255 72639 -167276 -319165 324385 -197421
10089b20743a8000k41822B20411c6339A66934F0565g8517A722a67088f5626k16778
$$ -220743 -18000 -259822 220411 -36339 166934 60565 -78517 1722 -167088 -65626 -282404
10078b82404G5836J4172e7119A02671k2478B7446J0773R8540a54583b7722J378
$$ -282404 75836 90008 -57119 102671 80193 27446 38219 136759 -154583 -27722 -26344
10067b6344C89765c43594A08614f7734n0361I6451L5383m1496g9196D1107I653
$$ -26344 389765 -343594 108614 -67734 -118095 96451 131834 90338 -79196 41107 9653
10055I4222b13685R0031k33106a73561C01318f541m5258B57656b98275a26588
$$ 94222 -213685 -123654 -356760 -173561 301318 -6541 -51799 257656 -298275 -126588
10044b43105h9257j61406I199M3724b15207L391N051f0475n5870b955l58434a45398
$$ -243105 -89257 -250663 9199 52923 -215207 -211816 -206765 -60475 -116345 -2955 -361389 -145398
10031C0413a07754K1840j92863R0164A07142b76868I381a53020j1821A35660K9416
$$ 30413 -107754 -85914 -278777 -188613 107142 -276868 9381 -153020 -164841 135660 165076
10020A65076e6589K3844k22628A7244a19536J912E714a04931G0490a32464E6304
$$ 165076 -56589 -32745 -255373 17244 -119536 -117624 5714 -104931 70490 -132464 56304
10008A6282J06982b48767a9344G8642J43269a65461j776H6520J52998B7104e8961
$$ 16282 123264 -248767 -19344 78642 221911 -165461 -167237 86520 239518 27104 -58961
9996c74451j45511A44629c1427E796K13848j0401D0083e4965J540o2004F2674
$$ -374451 -519962 144629 -31427 5796 219644 209243 40083 -54965 -53425 -115429 62674
9984g5234L5855A56369J16172a24489r3053r973A017N3078a41178j32283C90505
$$ -75234 -39379 156369 272541 -124489 -217542 -227515 1017 54095 -141178 -273461 390505
9972a37775a1193A34802c0793C4376Q8702a42802o2661q781E8963c82870f5761
$$ -137775 -11193 134802 -30793 34376 123078 -142802 -205463 -214244 58963 -382870 -65761
9960a71397B54809a63509o2103R7294B30152b27335a5751n5224k26863D7620e4107
$$ -171397 254809 -163509 -225612 -128318 230152 -227335 -15751 -70975 -297838 47620 -54107
9948e37770B83216a52650a1953j01447B44057F6954b6221A68674E0917h3156G4335
$$ -537770 283216 -152650 -11953 -113400 244057 66954 -26221 168674 50917 -83156 74335
9936B36670F1253b06211f038k31316F3787d493r4871A49262a49025K6886A9082
$$ 236670 61253 -206211 -6038 -237354 63787 -4493 -99364 149262 -149025 -122139 19082
9924d9106A35356A1727M9878m354n326f9006B73775h2118A09623J77231D5632
$$ -49106 135356 11727 61605 57251 51925 -69006 273775 -82118 109623 286854 45632
9912b816j29723A08386C7296a41369c4927B2866O788a2454E2809a00043A8774
$$ -2816 -132539 108386 37296 -141369 -34927 22866 29654 -12454 52809 -100043 18774
9900a56333l0128q023k02583b9916j98019J11479B73302a91861j60454A2581J28297
$$ -156333 -186461 -194484 -397067 -29916 -227935 -116456 273302 -191861 -352315 12581 140878
9889A40878a57295A8036a13177j54530N1995j60573J38665o2051D7277M7482D2436
$$ 140878 -157295 18036 -113177 -267707 -215712 -376285 -237620 -299671 47277 94759 42436
9877B2985c4714G8904M80a38265r3146j39679J10858R1120d6522k41863A2086
$$ 22985 -34714 78904 79384 -138265 -231411 -371090 -260232 -169112 -46522 -288385 12086
9865a86223B39826a02621L0639m75018C55364b05654n6325A363M1512O4211f7496
$$ -186223 239826 -102621 -71982 -547000 355364 -205654 -261979 1363 42875 107086 -67496
9853d6661A28906o2996a65426F0048e6893j50787R5080K6896C4855a22267H4902
$$ -46661 128906 65910 -165426 60048 -56893 -207680 -112600 -85704 34855 -122267 84902
9841C11507h0063m371K991D710b74477m5054M6752q7150d8598m1476m6965E6494
$$ 311507 -80063 -84434 -81443 4710 -274477 -319531 -272779 -359929 -48598 -90074 -137039 56494
9828C80216a06017p018k60554A86495e1427D9269b48701g7403n9908r8999A30579
$$ 380216 -106017 -113035 -373589 186495 -51427 49269 -248701 -77403 -137311 -236310 130579
9816a68629j26301g9538A7270J90957b8030l27344B1195K28323b37825A40427
$$ -168629 -294930 -79538 17270 208227 -28030 -355374 21195 249518 -237825 140427
9805a78170j07142E9575K62549A30805j386D1404c82155A30750c51930i3613K6304
$$ -178170 -285312 59575 322124 130805 129419 41404 -382155 130750 -351930 -93613 -67309
9794f7309A94270D7967j5955f7579j15599F4801d4495A2049B979e8405k05237
$$ -67309 194270 47967 32012 -67579 -183178 64801 -44495 12049 2979 -58405 -263642
9783b63642c5386a929j04989m0121j21468k56635A10187a16879K6544I9266a05106
$$ -263642 -35386 -1929 -106918 -147039 -268507 -525142 110187 -116879 -90335 99266 -105106
9771C1686g0598D2615M8021a79183d2322j90498O6538k6432c2956A48922a44765
$$ 31686 -70598 42615 90636 -179183 -42322 -232820 -166282 -192714 -32956 148922 -144765
9759c79889c495k05741f4589A05809D2842e9371K9268j95212F871L0075a96156
$$ -379889 -3495 -209236 -64589 105809 42842 -59371 -30103 -225315 6871 36946 -196156
9747a4242d487A5477a00592A7349c02266J04462D3599g3098j13984O4360N425
$$ -14242 -4487 15477 -100592 17349 -302266 -197804 43599 -73098 -187082 -122722 -117297
9736a17297J34D26292c77374b3793p2173J3797j60757H9645a56235K6911C02011
$$ -117297 -117163 426292 -377374 -23793 -95966 -82169 -242926 89645 -156235 -129324 302011
9724a15749C2950N1634J36810e7183k59097R3110R6290B79380g2106b2303j41563
$$ -115749 32950 84584 221394 -57183 -316280 -223170 -126880 279380 -72106 -22303 -163866
9713a63866H9413Q8787b8330n7518j22675c759n9359A33777o2835j7607a45644
$$ -163866 89413 178200 -28330 -85848 -208523 -3759 -63118 133777 70942 53335 -145644
9701A1629a4274m81690a5181A05629a41334H5521i8034F7441l412d35275a03130
$$ 11629 -14274 -495964 -15181 105629 -141334 85521 -98034 67441 64029 -435275 -103130
9689a24141m937p6074e7988b2620j07476d8144j09342P4774E7709k7050J0014
$$ -124141 -129078 -205152 -57988 -22620 -130096 -48144 -157486 -82712 57709 30659 40673
9678D0673E223a41990N0899c0106q792a1463B48450b41216O0255q7211j8359c8291
$$ 40673 5223 -141990 -91091 -30106 -38898 -11463 248450 -241216 -180961 -268172 -286531 -38291
9665A25155e41348a6320D03895h7885k17012J22720N9113C8172m112b3290j8594
$$ 125155 -541348 -16320 403895 -87885 -304897 -182177 -123064 38172 34060 -23290 -41884
9654d1884A00493b75448e7873A14392a3755F4395J56227b23941A61384e1084F0921
$$ -41884 100493 -275448 -57873 114392 -13755 64395 220622 -223941 161384 -51084 60921
9642A7129a19164e6309G4517c15754A57725b2507A88591E605a18651B22818a61340
$$ 17129 -119164 -56309 74517 -315754 157725 -22507 188591 5605 -118651 222818 -161340
9630I8081J32823i784k39684L5480b4537I0526b30914A67884d594k97221C2455
$$ 98081 230904 -9784 -249468 -213988 -24537 90526 -230914 167884 -4594 -301815 32455
9618E8804b25198N3917C711d00762a84871g6806D7883F052a7225j89466M4054
$$ 58804 -225198 -171281 3711 -400762 -184871 -76806 47883 6052 -17225 -206691 -162637
9607a62637L2381b2714l05129A71318c2066A21045d1720m3909F681i2246k5736
$$ -162637 -130256 -22714 -327843 171318 -32066 121045 -41720 -85629 6681 -92246 -117982
9596a17982I0493O8937a52004l4182j46537h3485D3078g9792k42332C6737c00466
$$ -117982 90493 159430 -152004 -186186 -332723 -83485 43078 -79792 -322124 36737 -300466
9584a3894k52233C9749d5677A00382g3930G579a25004n55d7262l2850A40458a76474
$$ -13894 -266127 39749 -45677 100382 -73930 7579 -125004 -125559 -47262 -80112 140458 -176474
9571D9590a3553l8630A10925c05711B63616o706A1353K1010a61642f7671j28131
$$ 49590 -13553 -52183 110925 -305711 263616 256910 11353 32363 -161642 -67671 -195802
9560a95802a2920k1993D2451d3204C4750a94611A6830c01251E9330d1671J4772
$$ -195802 -12920 -34913 42451 -43204 34750 -194611 16830 -301251 59330 -41671 -26899
9549b6899j1147B35490b87174f1134C6275e19195A99846h9687G5624d2394j02869
$$ -26899 -38046 235490 -287174 -61134 36275 -519195 199846 -89687 75624 -42394 -145263
9538a45263A71081k6099b69764c1094j42608K7124A24681D6387b87832j3329a543
$$ -145263 171081 144982 -269764 -31094 -173702 -146578 124681 46387 -287832 -301161 -1543
9526g3322j57975E3146a79766B55579a0591A13491a3969H2525b4172p5480F5501
$$ -73322 -231297 53146 -179766 255579 -10591 113491 -13969 82525 -24172 -99652 65501
9514b2016H9824c7249j814A09862b38274J01052e7180J9128j36369L3881j91852
$$ -22016 89824 -37249 -39063 109862 -238274 -137222 -57180 -38052 -174421 -140540 -332392
9503c32392A47682e5918j49712n4367J21157j46620c8243k23522g5121p5807L2034
$$ -332392 147682 -55918 -205630 -259997 -138840 -285460 -38243 -261765 -75121 -150928 -118894
9492a18894M9264k5283C91463b12001G155c62748I7048g09o2922K5075A34463
$$ -118894 -69630 -94913 391463 -212001 7155 -362748 97048 -709 -63631 -38556 134463
9480B01197a23117K3984A77500B5173J2305c13596J50530M3218d1502I5243D6925
$$ 201197 -123117 -99133 177500 25173 37478 -313596 -163066 -119848 -41502 95243 46925
9468b00526h2322C87845a45196O5923j3590F1816a03853j48930J10265E2231a82892
$$ -200526 -82322 387845 -145196 -79273 -92863 61816 -103853 -252783 -142518 52231 -182892
9456A02098b84382N7771a9573q7500H3175c64980a58738c2165k30075A29487a05198
$$ 102098 -284382 -226611 -19573 -107073 83175 -364980 -158738 -32165 -262240 129487 -105198
9444c2607k58395K529j25289e0396b0063k11820H5493b40421C3365j1115J17217
$$ -32607 -291002 -288473 -413762 -50396 -20063 -231883 85493 -240421 33365 22250 139467
9433A39467a64755I3625h3957r1012C42193a15151A60351a11980k04232B55839
$$ 139467 -164755 93625 -83957 -174969 342193 -115151 160351 -111980 -316212 255839
9422g9552p3489k10891D82130c7729H1097b45072G0993a97276B49947c30278a34685
$$ -79552 -153041 -363932 482130 -37729 81097 -245072 70993 -197276 249947 -330278 -134685
9410F0990C709a61885M8927l51356B48082k9600D9446a18612A15743a45428j25911
$$ 60990 3709 -161885 -112958 -464314 248082 218482 49446 -118612 115743 -145428 -271339
9399b71339g7049j35875B07084D479g6066m14520a50852A40821a08436r7616N1509
$$ -271339 -77049 -212924 207084 4479 -76066 -490586 -150852 140821 -108436 -206052 -154543
9388a54543n2360H6507d5785E1315c49539a44101q2492a6247A16233J20956f27
$$ -154543 -206903 86507 -45785 51315 -349539 -144101 -226593 -16247 116233 237189 -627
9376E4947P4436e0140B1634b97056a21038H3854A2310M3791J22544b38235a5312
$$ 54947 129383 -50140 21634 -297056 -121038 83854 12310 56101 178645 -238235 -15312
9364a00045q4643h8648R891a7068k36146F3535e267I2920a8377A74a98779j28343
$$ -100045 -184688 -88648 -78757 -17068 -253214 63535 -5267 92920 -18377 174 -198779 -327122
9352c27122A30974K19632a30365B88882b9352j53884N6241k03125K0680a17173
$$ -327122 130974 350606 -130365 288882 -29352 -183236 -126995 -330120 -309440 -117173
9341D0224A5007d5274J4600C4377b1239F2119J48752b44022h9137j8093k66935
$$ 40224 15007 -45274 -30674 34377 -21239 62119 210871 -244022 -89137 -107230 -374165
9330c74165B23281b73040j86715a19059j21229M4525g6742j39918J00444e6400
$$ -374165 223281 -273040 -459755 -119059 -240288 -195763 -76742 -216660 -116216 -56400
9319b12236f5239m5272J8165H4932b43459N8536A46485M0046f1970A13043b75888
$$ -212236 -65239 -110511 -92346 84932 -243459 -184923 146485 186531 -61970 113043 -275888
9307a22781I431g4835A64738b74028a15959A2604P5375M0538m9353B6778f2809
$$ -122781 9431 -74835 164738 -274028 -115959 12604 87979 128517 79164 26778 -62809
9295b73924d1813l8907A0906d17538f850m87529d9223a6980o1088A02688A1124
$$ -273924 -41813 -80720 10906 -417538 -6850 -494379 -49223 -16980 -78068 102688 11124
9283A22834a16290o5794c6286I0887C662O805e2212k4677k46642D2360a60841
$$ 122834 -116290 -182084 -36286 90887 3662 10467 -52212 -76889 -323531 42360 -160841
9271C4086b12381k70941d8704J9703j6222F1406i4206B83215c74333G6175a8639
$$ 34086 -212381 -483322 -48704 -29001 -45223 61406 -94206 283215 -374333 76175 -18639
9259I8176a65424f1341K1048B09144a31335j82371a30964E8290d23925a18446
$$ 98176 -165424 -61341 -40293 209144 -131335 -313706 -130964 58290 -423925 -118446
9248C6762q197a93739j03497A67341b6891j43142B14437F1941b16788h1051A77501
$$ 36762 28565 -193739 -297236 167341 -26891 -170033 214437 61941 -216788 -81051 177501
9236B11750g0347h16k4110L323E9273b85619g1387I2900C3378g4652k7025l09293
$$ 211750 -70347 -816 -24926 -21603 59273 -285619 -71387 92900 33378 -74652 -101677 -410970
9224d10970d3221q4297j65402G2451j4933k2212a11125M033j85850A76795a39920
$$ -410970 -43221 -127518 -292920 72451 57518 35306 -111125 -107092 -292942 176795 -139920
9212i402k5549j29516L2196A50659K3088O4262c07393I6978a56591e6619B6061
$$ -9402 -34951 -164467 -132271 150659 173747 238009 -307393 96978 -156591 -56619 26061
9200F2550a1400D7009P1287a49355e528k22830k1307A43799P8376c6985N411j76539
$$ 62550 -11400 47009 118296 -149355 -5528 -228358 -249665 143799 222175 -36985 -31574 -208113
9188b08113N1310p757r2130C99822C6511Q6053a2223r2992e369j27070B57094
$$ -208113 -156803 -164560 -256690 399822 36511 122564 -12223 -105215 -5369 -132439 257094
9176B53870d9795j32599e8416n0577a6858o9371p7076B27428a02122A35059O3857
$$ 253870 -49795 -182394 -58416 -108993 -16858 -86229 -163305 227428 -102122 135059 198916
9165A98916b50604B2171J70427a9676j0140k65421a41104j33629J12355o5778
$$ 198916 -250604 22171 192598 -19676 -29816 -295237 -141104 -274733 -162378 -228156
9155b28156C348a9318q474o947H7202e9154E4800O5757a00408b4405j35585D1043
$$ -228156 3348 -19318 -27792 -34739 87202 -59154 54800 120557 -100408 -24405 -159990 41043
9142a62463j26884A13450f2560r3249A25701r332a893A74025l3429o2331e356
$$ -162463 -289347 113450 -62560 -155809 125701 116369 -1893 174025 140596 78265 -5356
9130e7878b3051k47027i8650j91478a04151j2132C7916J6706c11237a36196p5047
$$ -57878 -23051 -270078 -98650 -290128 -104151 -116283 37916 54622 -311237 -136196 -211243
9119b11243m4986I4008g4050b9248n7041k82659N2504i0095l9488G8604K58631
$$ -211243 -256229 94008 -74050 -29248 -86289 -368948 -316444 -90095 -129583 78604 337235
9108C37235j25702e9315C8937a28307B05318g3834I2015a10408n8190A23318a97939
$$ 337235 211533 -59315 38937 -128307 205318 -73834 92015 -110408 -168598 123318 -197939
9096d38150C18216l4501c27245J61253r6841Q6810A2049a28296j41514J21156
$$ -438150 318216 283715 -327245 -165992 -262833 -176023 12049 -128296 -269810 -148654
9086a48654M3283j4932A85799c2496B16707I990J51982b895j82288P5027A10539
$$ -148654 -105371 -120303 185799 -32496 216707 9990 161972 -2895 -185183 -110156 110539
9074B29960a50167k26716b0730j26203g1320D4911K91966a6357m6580l0928A81852
$$ 229960 -150167 -376883 -20730 -146933 -71320 44911 336877 -16357 -62937 -93865 181852
9062a11840b0580k57810c2659I8145A9491i4423D5686B469e7150b5709j61442
$$ -111840 -20580 -278390 -32659 98145 19491 -94423 45686 2469 -57150 -25709 -187151
9051a87151R768C5061K60312B6334f5479j6464j41742B46569F5452c50770a06835
$$ -187151 -177383 35061 295373 26334 -65479 -81943 -223685 246569 65452 -350770 -106835
9039A80611H4093M4492c88467e0881k54613A2464O6605a5967H1941a4162q6202
$$ 180611 84093 128585 -388467 -50881 -305494 12464 79069 -15967 81941 -14162 -100364
9028a00364k7234B56250a01556m7332L9986A2206Q8375c8587G8747b63739A08157
$$ -100364 -127598 256250 -101556 -148888 -108902 12206 100581 -38587 78747 -263739 108157
9016C7589Q2475c33572g2716E1126P9061f1118j04552a2210k5827H1955c60396
$$ 37589 120064 -333572 -72716 51126 130187 -61118 -165670 -12210 -38037 81955 -360396
9004b23638P1197K1939f2017h052r7419B5697c93550a54494m1483B12646a21813
$$ -223638 -152441 -130502 -62017 -8052 -105471 25697 -393550 -154494 -195977 212646 -121813
8992b56535C2824J249b73987i8249B9926a47724A21229b22491e3630B19095G0557
$$ -256535 32824 34073 -273987 -98249 29926 -147724 121229 -222491 -53630 219095 70557
8980C2194a21768k38477R5640J10389c1187n8911j8793k09156d7686B20275J8771
$$ 32194 -121768 -360245 -264605 -154216 -31187 -90098 -108891 -318047 -47686 220275 239046
8969B39046o1864a59782M9269b6832j62258L4996r7214A39291b4336k19838R9848
$$ 239046 177182 -159782 -110513 -26832 -189090 -154094 -251308 139291 -24336 -244174 -144326
8958a44326B71170f3348A15202a77943j37502A97956F6675c47734d2479B31335
$$ -144326 271170 -63348 115202 -177943 -315445 197956 66675 -347734 -42479 231335
8947d1255B51648a28285B03737b70805A19422a88745d8092j43765P7849G4411
$$ -41255 251648 -128285 203737 -270805 119422 -188745 -48092 -191857 -114008 74411
8936c90945A46189O10582l68981o1792c52078g5683l7221j6085d2278A60214J73327
$$ -390945 146189 756771 387790 325998 -352078 -75683 -112904 -128989 -42278 160214 333541
8925C33541O18437J547350N201473J2339526I707017B557027A182889l46594j53766
$$ 333541 951978 2499328 7700801 20040327 9707017 2557027 1182889 836295 682529
8916F82529C08094C4445a17354B6483a10811b9375B9488P20938j82728F807J95304
$$ 682529 308094 34445 -117354 26483 -110811 -29375 29488 750426 567698 6807 202111
8905B02111a19713D9113a53836G6474J25480b30693H1928Q8714A7211c203G4133
$$ 202111 -119713 49113 -153836 76474 201954 -230693 81928 170642 17211 -3203 74133
8893a44109C10700l2994b50591f789B43298b09393L8507C22350j07638A01214
$$ -144109 310700 277706 -250591 -6789 243298 -209393 -170886 322350 214712 101214
8882A72861a58044L8184H8448a46612A3487Q1467i3261K6076C67b4207B70153
$$ 172861 -158044 -119860 88448 -146612 13487 94954 -93261 -67185 367 -24207 270153
8870d7524m5506l9382p6768q328D5372b61611m8036A09410b58495J16464E6198
$$ -47524 -93030 -132412 -209180 -217508 45372 -261611 -309647 109410 -258495 -142031 56198
8858A21303M1180c20275l5728a13876A01374J43779G7829i8305o1366q8553O7397
$$ 121303 162483 -320275 -356003 -113876 101374 245153 77829 -98305 -159671 -248224 -180827
8847a80827A89516e9605j95484H4929a31829I8031c31829h7855b8829A49869a46
$$ -180827 189516 -59605 -255089 84929 -131829 98031 -331829 -87855 -28829 149869 -146
8835a02310k79483h8588q7871A37118l2753b5570n6264G4823C1301a7563j03284
$$ -102310 -381793 -88588 -176459 137118 104365 -25570 -81834 74823 31301 -17563 -120847
$$ [...]
##END NTUPLES=NMR SPECTRUM
##END=
