##TITLE=AC1534_ROEFFECT0009_8214376_YM702Qd0Co
##JCAMPDX= 6.0         $$ Bruker NMR JCAMP-DX V2.0
##DATA TYPE= NMR SPECTRUM
##DATA CLASS= NTUPLES
##ORIGIN= BRUKER
##OWNER= Administrator
$$ 1.72 TOPSPIN		Version 2.1
$$ 2013-10-04 21:56:48.491 -0700  Administrator@X
$$ Compression mode = diff/dup
##.OBSERVE FREQUENCY= 400.02188249412
##.OBSERVE NUCLEUS= ^1H
##.ACQUISITION MODE= SIMULTANEOUS (DQD)
##.ACQUISITION SCHEME= undefined
##.AVERAGES= 64
##.DIGITISER RES= 22
##SPECTROMETER/DATA SYSTEM= spect
##.PULSE SEQUENCE= noesygpps1d.comp
##.SOLVENT NAME= COFFEE_meoh
##.SHIFT REFERENCE= INTERNAL, COFFEE_meoh, 1, 14.96064
##AUDIT TRAIL= $$ (NUMBER, WHEN, WHO, WHERE, PROCESS, VERSION, WHAT)
$$ ##TITLE= Audit trail, TOPSPIN		Version 2.1
$$ ##JCAMPDX= 5.01
$$ ##ORIGIN= Bruker BioSpin GmbH
$$ ##OWNER= Administrator
$$ $$ E:\/data/COFFEE/nmr/AC1534_ROEFFECT0009_8214376_YM702Qd0Co/12/pdata/1/auditp.txt
$$ ##AUDIT TRAIL=  $$ (NUMBER, WHEN, WHO, WHERE, PROCESS, VERSION, WHAT)
(   1,<2013-10-04 21:56:43.866 -0700>,<Administrator>,<X>,<go>,<TOPSPIN 2.1>,
      <created by zg
	started at 2013-10-04 21:45:12.678 -0700,
	POWCHK enabled, PULCHK disabled,
       configuration hash MD5:
       C8 4E 4E 5D D3 5C D8 9E 9F 52 82 E0 59 8A DE 15
       data hash MD5: 64K
       10 01 38 48 C8 4F 5E C1 85 62 53 51 0A 6A 80 45>)
(   2,<2013-10-04 21:56:46.678 -0700>,<Administrator>,<X>,<proc1d>,<TOPSPIN 2.1>,
      <Start of raw data processing
       efp LB = 0.3 FT_mod = 6 PKNL = 1 PHC0 = 0 PHC1 = 0 SI = 128K 
       data hash MD5: 128K
       39 18 23 9C C0 6C 9A 92 95 21 27 D3 9C 92 28 85>)
(   3,<2013-10-04 21:56:47.584 -0700>,<Administrator>,<X>,<proc1d>,<TOPSPIN 2.1>,
      <pk PHC0 = -83.0072 PHC1 = 0 
       data hash MD5: 128K
       06 D7 B5 EE 6F C8 4C 06 D3 16 83 7A 24 D1 47 85>)
(   4,<2013-10-04 21:56:47.959 -0700>,<Administrator>,<X>,<proc1d>,<TOPSPIN 2.1>,
      <abs ABSG = 1 
       data hash MD5: 128K
       3A B5 4D C1 50 CE F9 80 7F 60 77 2C 1F 61 45 E9>)
(   5,<2013-10-04 21:56:48.038 -0700>,<Administrator>,<X>,<proc1d>,<TOPSPIN 2.1>,
      <abs ABSG = 2 
       data hash MD5: 128K
       2B C0 B0 04 E2 CD 3F 5C 32 F7 F0 AE A3 37 27 0D>)
(   6,<2013-10-04 21:56:48.131 -0700>,<Administrator>,<X>,<proc1d>,<TOPSPIN 2.1>,
      <abs ABSG = 3 
       data hash MD5: 128K
       7A 68 23 EB 34 36 C7 58 7F 00 F5 D4 E7 8D 2C 58>)
(   7,<2013-10-04 21:56:48.209 -0700>,<Administrator>,<X>,<proc1d>,<TOPSPIN 2.1>,
      <abs ABSG = 4 
       data hash MD5: 128K
       D5 4F 11 59 2B 1A 2E 0C 20 02 B5 69 99 9B 19 48>)
(   8,<2013-10-04 21:56:48.334 -0700>,<Administrator>,<X>,<proc1d>,<TOPSPIN 2.1>,
      <abs ABSG = 5 
       data hash MD5: 128K
       4A 3C 93 86 D0 01 36 5A F8 4A F1 CC 69 2C 91 DB>)
$$ ##END=
$$ 
$$ $$ hash MD5
$$ $$ 1D A0 7A F8 5E 5F CF 23 41 7B A5 84 E0 4D E7 ED
##$RELAX= 
##$RELAX= 
##$RELAX= 
##$RELAX= 
##$RELAX= 
##$RELAX= 
##$RELAX= 
##$RELAX= 
$$ Bruker specific parameters
$$ --------------------------
##$DU= <E:\>
##$EXPNO= 12
$$ [...]
##$TP07= 0
##$TPNAME0= <>
##$TPNAME1= <>
##$TPNAME2= <>
##$TPNAME3= <>
##$TPNAME4= <>
##$TPNAME5= <>
##$TPNAME6= <>
##$TPNAME7= <>
##$TPOAL= (0..7)
0.5 0.5 0.5 0.5 0.5 0.5 0.5 0.5
##$TPOFFS= (0..7)
0 0 0 0 0 0 0 0
##$TUNHIN= 0
##$TUNHOUT= 0
##$TUNXOUT= 0
##$USERA1= <user>
##$USERA2= <user>
##$USERA3= <user>
##$USERA4= <user>
##$USERA5= <user>
##$V9= 5
##$VALIST= <valist>
##$VCLIST= <CCCCCCCCCCCCCCC>
##$VD= 0
##$VDLIST= <DDDDDDDDDDDDDDD>
##$VPLIST= <PPPPPPPPPPPPPPP>
##$VTLIST= <TTTTTTTTTTTTTTT>
##$WBST= 2048
##$WBSW= 25
##$XGAIN= (0..3)
0 0 0 0
##$XL= 0
##$YL= 0
##$YMAX_a= 6608326
##$YMIN_a= -12538494
##$ZGOPTNS= <>
##$ZL1= 120
##$ZL2= 120
##$ZL3= 120
##$ZL4= 120
##$ABSF1= 14.96064
##$ABSF2= -5.597542
##$ABSG= 5
##$ABSL= 3
##$ALPHA= 0
##$AQORDER= 0
##$ASSFAC= 0
##$ASSFACI= 0
##$ASSFACX= 0
##$ASSWID= 0
##$AUNMP= <proc_prof1d_extract.lims>
##$AXLEFT= 0
##$AXNAME= <>
##$AXNUC= <1H>
##$AXRIGHT= 0
##$AXTYPE= 0
##$AXUNIT= <>
##$AZFE= 0.1
##$AZFW= 0.1
##$BCFW= 0
##$BC_mod= 0
##$BYTORDP= 0
##$COROFFS= 0
##$CY= 15
##$DATMOD= 1
##$DC= 0
##$DFILT= <>
##$DTYPP= 0
##$F1P= 0
##$F2P= 0
##$FCOR= 0.5
##$FTSIZE= 131072
##$FT_mod= 6
##$GAMMA= 0
##$GB= 0
##$INTBC= 1
##$INTSCL= 1
##$ISEN= 128
##$LB= 0.3
##$LEV0= 0
##$LPBIN= 0
##$MAXI= 10000
##$MC2= 0
##$MEAN= 0
##$ME_mod= 0
##$MI= 0
##$NCOEF= 0
##$NC_proc= -2
##$NLEV= 6
##$NOISF1= 0
##$NOISF2= 0
##$NSP= 0
##$NTH_PI= 0
##$NZP= 0
##$OFFSET= 14.96064
##$PC= 1
##$PHC0= -83.0072
##$PHC1= 0
##$PH_mod= 1
##$PKNL= yes
##$PPARMOD= 0
##$PPDIAG= 0
##$PPIPTYP= 0
##$PPMPNUM= 2147483647
##$PPRESOL= 1
##$PSCAL= 4
##$PSIGN= 0
##$PYNMP= <proc.py>
##$REVERSE= no
##$SF= 400.020009782314
##$SI= 131072
##$SIGF1= 0
##$SIGF2= 0
##$SINO= 400
##$SIOLD= 131072
##$SPECTYP= <>
##$SREGLST= <1H.CDCl3>
##$SSB= 0
##$STSI= 131072
##$STSR= 0
##$SW_p= 8223.68421052631
##$SYMM= 0
##$S_DEV= 0
##$TDeff= 65536
##$TDoff= 0
##$TI= <>
##$TILT= no
##$TM1= 0
##$TM2= 0
##$TOPLEV= 0
##$USERP1= <user>
##$USERP2= <user>
##$USERP3= <user>
##$USERP4= <user>
##$USERP5= <user>
##$WDW= 1
##$XDIM= 131072
##$YMAX_p= 400933097
##$YMIN_p= -11603
##$CURPLOT= <Network HP LaserJet P1505>
##$CURPRIN= <$Network HP LaserJet P1505>
##$DFORMAT= <normdp>
##$LAYOUT= <+/1D_H.xwp>
##$LFORMAT= <normlp>
##$PFORMAT= <normpl>
##$SURQMSG= 1
$$ End of Bruker specific parameters
$$ ---------------------------------
##NTUPLES= NMR SPECTRUM
##VAR_NAME=  FREQUENCY,     SPECTRUM/REAL,   SPECTRUM/IMAG
##SYMBOL=    X,             R,               I
##VAR_TYPE=  INDEPENDENT,   DEPENDENT,       DEPENDENT
##VAR_FORM=  AFFN,          ASDF,            ASDF
##VAR_DIM=   131072,        131072,          131072
##UNITS=     HZ,            ARBITRARY UNITS, ARBITRARY UNITS
##FACTOR=    0.0627417313425164, 1,          1
##FIRST=     8223.62146879497, 1771,         -66574
##LAST=      0,             3974,            -66902
##MIN=       0,             -11603,          0
##MAX=       8223.62146879497, 400933097,    0
$$ Real data points
##PAGE= N=1
##DATA TABLE= (X++(R..R)), XYDATA
$$ [...]
63924D695974o3788r6863j27446j54696j78467j98282k12979k21657k24600k22943
$$ 4695974 4632186 4535323 4407877 4253181 4074714 3876432 3663453 3441796 3217196 2994253
63914B994253k17730k09586j99014j86546j72509j57091j40797j24664j09719
$$ 2994253 2776523 2566937 2367923 2181377 2008868 1851777 1710980 1586316 1476597
63905A476597r6320q4192p3159o3610n6112n0691m6560m2656l8409l4023l0143
$$ 1476597 1380277 1296085 1222926 1159316 1103204 1052513 1005953 963297 924888 890865 860722
63894H60722k7197k5060k3255k1475j9864j8711j7934j7109j5973j4718j3600
$$ 860722 833525 808465 785210 763735 743871 725160 707226 690117 674144 659426 645826
63883F45826j2491j1087r386p623n725l315l61K614N199P671J0456J3361J5785
$$ 645826 633335 622248 612862 605239 599514 596199 595838 598452 603651 611322 621778 635139 650924
63870F50924J7560J8993K0197K0920K1218K1634K2358K2677K1765J9766J7576
$$ 650924 668484 687477 707674 728594 749812 771446 793804 816481 838246 858012 875588
63859H75588J5739J3977J1875R461O995M469J637j604m997q047j0400j2177j3921
$$ 875588 891327 905304 917179 926640 933635 938104 939741 938137 933140 925093 914693 902516 888595
63846H88595j6031j8282k0117k1411k2635k4133k5595k6532k7058k7737k8647
$$ 888595 872564 854282 834165 812754 790119 765986 740391 713859 686801 659064 630417
63835F30417k9010k8079k6171k4395k3420k2827k1842k0313j8656j7066j5363
$$ 630417 601407 573328 547157 522762 499342 476515 454673 434360 415704 398638 383275
63824C83275j3557j2122j1381j1004j0431r564q677p903p209o771o800o969o508
$$ 383275 369718 357596 346215 335211 324780 315216 306539 298636 291427 284656 277856 270887 264379
63811B64379n155l651k952l137l440l233k623k095j863j771j654j611j797k068
$$ 264379 259224 255573 252621 249484 246044 242811 240188 238093 236230 234459 232805 231194 229397 227329
63797B27329j995j364n73k69n80r73r87q68j188k019k807l017k654k075j603j420
$$ 227329 225334 223970 223397 223128 222548 221575 220588 219720 218532 216513 213706 210689 208035 205960 204357 202937
63781B02937j583j870j817j146j66M84M77N6l18m29m05m93q27j253j402j011k74
$$ 202937 201354 199484 197667 196521 196355 196839 197316 197372 197054 196625 196220 195727 194900 193647 192245 191234 190960
63764A90960K35J20m29q30o45R6R15J210P29r5m67j6Q09J285J139O00k2m53l65
$$ 190960 191195 191315 190886 190056 189411 189507 190422 191632 192361 192266 191799 191783 192592 193877 195016 195616 195594 195141 194776
63745A94776L13J068J202O65R1qK84O89J117J464J564J532J843K649L443L692
$$ 194776 195089 196157 197359 198024 198115 198107 198391 199080 200197 201661 203225 204757 206600 209249 212692 216384
63729B16384L499L295L228L189L191L248L198K997L027L599M394M780M561L984
$$ 216384 219883 223178 226406 229595 232786 236034 239232 242229 245256 248855 253249 258029 262590 266574
63715B66574L235K397J702J331J004L50n21j268j913k649l150k888k041j385j212
$$ 266574 269809 272206 273908 275239 276243 276593 276072 274804 272891 270242 267092 264204 262163 260778 259566
63700B59566j093p52m15j42L65J028J277J018R38J432J976K132K393L305M402
$$ 259566 258473 257721 257306 257164 257529 258557 259834 260852 261790 263222 265198 267330 269723 273028 277430
63685B77430M803M469M024L646K951J819N61o30j728k440k381j670q47k05L25
$$ 277430 282233 286702 290726 294372 297323 299142 299703 299073 297345 294905 292524 290854 290007 289802 290127
63670B90127P02P50O40P36R85Q98K79m89r72j110j075j098j491k379l400m085
$$ 290127 290829 291579 292219 292955 293940 294838 295117 294628 293656 292546 291471 290373 288882 286503 283103 279018
63654B79018m443m750m838m293l403l084l507l527k127J12J654J876J587J722
$$ 279018 274575 269825 264987 260694 257291 254207 250700 247173 245046 245158 246812 248688 250275 251997
63640B51997K182K291J926J722K178K970L428L504L824M712N568N621M983M546
$$ 251997 254179 256470 258396 260118 262296 265266 268694 272198 276022 280734 286302 291923 296906 301452
63626C01452M877N741O641P386P973Q394Q775R400J0388J1532J2592J3535J4464
$$ 301452 306329 312070 318711 326097 334070 342464 351239 360639 371027 382559 395151 408686 423150
63613D23150J5568J7152J9332K1636K3360K4545K6123K8720L1683L3655L3863
$$ 423150 438718 455870 475202 496838 520198 544743 570866 599586 631269 664924 698787
63602F98787L2424K9648K5660K0710J5357J0127N222P17l144n937p381p630p304
$$ 698787 731211 760859 786519 807229 822586 832713 837935 838652 835508 829571 822190 814560 807256
63589H07256p197p838r308j1434j4101j7291k0818k4044k6079k6497k5907k5401
$$ 807256 800059 792221 782913 771479 757378 740087 719269 695225 669146 642649 616742 591341
63577E91341k5214k4280k1629j7908j4813j3049j1600r306o322l605j524K76J972
$$ 591341 566127 541847 520218 502310 487497 474448 462848 453542 447220 443615 442091 442367 444339
63564D44339L259L990M592N639P237Q899R941J0089R835R954J0695J1667J2679
$$ 444339 447598 451588 456180 461819 469056 477955 487896 497985 507820 517774 528469 540136 552815
63551E52815J4186J6540J9311K1890K4421K7521L1240L4958L8147M0466M1040
$$ 552815 567001 583541 602852 624742 649163 676684 707924 742882 781029 821495 862535
63540H62535L8477L2154K3080J3172M002l585r117j2317j3239j2310j0253q066
$$ 862535 901012 933166 956246 969418 973420 969835 960718 948401 935162 922852 912599 904533
63528I04533o778o984q656j1473j5160j9425k3757k7609l0700l2983l4420l4868
$$ 904533 897755 890771 882115 870642 855482 836057 812300 784691 753991 721008 686588 651720
63516F51720l4204l2498l0191k7990k6282k4626k2185j8860j5680j3687j2711
$$ 651720 617516 585018 554827 526837 500555 475929 453744 434884 419204 405517 392806
63505C92806j1731j0280q896q128p651o757n400m246l774l821l950l898l505k654
$$ 392806 381075 370795 361899 353771 346120 339363 333963 329717 325943 322122 318172 314274 310769 308115
63491C08115j617j134j625k374k113n07J369K245J993J424J181J310J687K333
$$ 308115 306498 305364 303739 301365 299252 298745 300114 302359 304352 305776 306957 308267 309954 312287
63477C12287L179L901M123L669K686J648J112J148J129M00r13k091k780l316m069
$$ 312287 315466 319367 323490 327159 329845 331493 332605 333753 334882 335282 334369 332278 329498 326182 322113
63462C22113m866n196m700l432j974j180j361j721j167K53J421J765J972K679
$$ 322113 317247 312051 307351 303919 301945 300765 299404 297683 296516 296769 298190 299955 301927 304606
63448C04606L419L560L626M568O198P416P912Q514R751J1095J2002J2765J3839
$$ 304606 308025 311585 315211 319779 325977 333393 341305 349819 359570 370665 382667 395432 409271
63435D09271J5090J6301J7910K0463K3560K6018K6939K6150K3783K0016J5359
$$ 409271 424361 440662 458572 479035 502595 528613 555552 581702 605485 625501 640860
63424F40860J0813P531O334P412J0237J3930J7885K2039K6426L0724L4484L7517
$$ 640860 651673 659204 665538 672950 683187 697117 715002 737041 763467 794191 828675 866192
63412H66192L9622M0146L8383L4385K8928K2573J5340P484R6n563r075j0882j1511
$$ 866192 905814 945960 984343 1018728 1047656 1070229 1085569 1093053 1093149 1087586 1078511 1067629 1056118
63399A056118j1322j0948j1389j3369j6801k1091k5732l0365l4435l7226l8415
$$ 1056118 1044796 1033848 1022459 1009090 992289 971198 945466 915101 880666 843440 805025
63388H05025l8298l7383l5913l3905l1420k8589k5529k2468j9768j7529j5320
$$ 805025 766727 729344 693431 659526 628106 599517 573988 551520 531752 514223 498903
63377D98903j2650r662o900m471j954P58L135M813O197P798R481J0854J2065J3601
$$ 498903 486253 476591 469691 465220 463266 464024 467159 471972 478169 485967 495448 506302 518367 531968
63363E31968J5539J7616J9862K2495K5267K7588K9345L1061L3130L5432L7717
$$ 531968 547507 565123 584985 607480 632747 660335 689680 720741 753871 789303 827020
63352H27020L9699M0623L9480L5992L0894K4991J8465J1415M458j656o583j0139
$$ 827020 866719 907342 946822 982814 1013708 1038699 1057164 1068579 1073037 1071381 1064798 1054659
63340A054659j2022j2275j1684j1270j1669j3254j6278k0310k4135k6990k9486
$$ 1054659 1042637 1030362 1018678 1007408 995739 982485 966207 945897 921762 894772 865286
63329H65286l2526l5580l6978l5906l3182l0066k7051k4094k1155j8180j4976
$$ 865286 832760 797180 760202 724296 691114 661048 633997 609903 588748 570568 555592
63318E55592j1564q371n944m809n551q420j2614j6441j8546j8779j7818j6360
$$ 555592 544028 535657 529713 524904 519353 510933 498319 481878 463332 444553 426735 410375
63306D10375j4833j3373j1820j0034q281o953n925m724l500l029l443l645k633
$$ 410375 395542 382169 370349 360315 352034 345081 339156 334432 330932 327903 324460 320815 318182
63293C18182q88J95K2p59j304j430j418j477j642j893k175k398k421k124j598
$$ 318182 317294 317489 317511 316752 315448 314018 312600 311123 309481 307588 305413 303015 300594 298470 296872
63278B96872j221j298j574j480r27m36l04j83K32N62L21k71m88J8J020K114K898
$$ 296872 295651 294353 292779 291299 290372 289936 289632 289449 289681 290243 290564 290293 289805 289823 290843 292957 295855
63261B95855K993K378J677J605K288L346M412N166N231M645M237M805O053O925
$$ 295855 298848 301226 302903 304508 306796 310142 314554 319720 324951 329596 333833 338638 344691 351616
63247C51616P060P204Q066R407J0526J1199J1785J2704J4141J6012J8057K0032
$$ 351616 358676 365880 373946 383353 393879 405078 416863 429567 443708 459720 477777 497809
63235D97809K1932K3838K5619K7002K7929K8556K8937K8984K8707K8237K7648
$$ 497809 519741 543579 569198 596200 624129 652685 681622 710606 739313 767550 795198
63224G95198K7045K6733K6911K7345K7694K8005K8410K8521K7808K6543K5506
$$ 795198 822243 848976 875887 903232 930926 958931 987341 1015862 1043670 1070213 1095719
63213A095719K4533K2191J7412J0869M177j913p924j4518k1506k7969l2996l6253
$$ 1095719 1120252 1142443 1159855 1170724 1174901 1172988 1165064 1150546 1129040 1101071 1068075 1031822
63201A031822l8016l8678l8283l6672l4065l1030k7832k4233k0115j5912j2084
$$ 1031822 993806 955128 916845 880173 846108 815078 787246 763013 742898 726986 714902
63190G14902q531m905j216K246N389Q318J0996J3290J5280J7203J9053K0500K1244
$$ 714902 706371 701466 700250 702496 707885 716203 727199 740489 755769 772972 792025 812525 833769
63177H33769K1374K1300K1406K1661K1652K1067K0061J8971J7799J6240J4114
$$ 833769 855143 876443 897849 919510 941162 962229 982290 1001261 1019060 1035300 1049414
63166A049414J1425Q017L753j092o061j1203j6791k2356k6821k9866l2342l4848
$$ 1049414 1060839 1068856 1072609 1071517 1065456 1054253 1037462 1015106 988285 958419 926077 891229
63154H91229l6732l7164l6394l5177l3529l1085k8166k5478k2965k0031j6829
$$ 891229 854497 817333 780939 745762 712233 681148 652982 627504 604539 584508 567679
63143E67679j4272j2691j1399r788p980o256m581l105k352k531l143l636l964
$$ 567679 553407 540716 529317 519529 511549 505293 500712 497607 495255 492724 489581 485945 481981
63130D81981m207m142l506k403j091K51J385K033K225K295K406K454K522K891
$$ 481981 477774 473632 470126 467723 466632 466883 468268 470301 472526 474821 477227 479681 482203 485094
63116D85094L457L723L568L413L390L037K235J763K244L100L285K676K031J819
$$ 485094 488551 492274 495842 499255 502645 505682 507917 509680 511924 515024 518309 520985 523016 524835
63102E24835J835J850J926K057K010J672J185P47N69Q39J456J987K246K574L090
$$ 524835 526670 528520 530446 532503 534513 536185 537370 538117 538686 539525 540981 542968 545214 547788 550878
63087E50878L081J882J37p40l34L76N46N79J313K869M763O621Q199R115R173Q768
$$ 550878 553959 555841 555978 555238 554904 555280 555826 556405 557718 560587 565350 571971 580170 589285 598458 607226
63071F07226Q561Q873R618J0621J1646J2456J3216J4585J6987J9977K2703K4891
$$ 607226 615787 624660 634278 644899 656545 669001 682217 696802 713789 733766 756469 781360
63059G81360K6937K9162L1506L3977L6920M0627M4901M9171N2954N6190N9287
$$ 781360 808297 837459 868965 902942 939862 980489 1025390 1074561 1127515 1183705 1242992
63048A242992O2648O5998O8381O9133O8762O8410O8587O8866O8827O8702O8892
$$ 1242992 1305640 1371638 1440019 1509152 1577914 1646324 1714911 1783777 1852604 1921306 1990198
63037A990198O9348O9793P0087P0032O9116O6833O3008N7505M9879L9790K7529
$$ 1990198 2059546 2129339 2199426 2269458 2338574 2405407 2468415 2525920 2575799 2615589 2643118
63026B643118J3661j646j8325l5466n1333o4604p5144q3298q8983r1887r2167
$$ 2643118 2656779 2655133 2636808 2601342 2550009 2485405 2410261 2326963 2237980 2146093 2053926
63015B053926r0323q6513q0623p3065o4903n6922m8921m0331l1243k2366j4118
$$ 2053926 1963603 1877090 1796467 1723402 1658499 1601577 1552656 1512325 1481082 1458716 1444598
63004A444598o254J470Q741J5075K0490K5308K9433L2288L3703L4424L5368L6587
$$ 1444598 1438344 1439814 1448555 1463630 1484120 1509428 1538861 1571149 1604852 1639276 1674644 1711231
62992A711231L7267L6841L5690L4666L4108L3536L2160K9485K5422K0082J3604
$$ 1711231 1748498 1785339 1821029 1855695 1889803 1923339 1955499 1984984 2010406 2030488 2044092
62981B044092O130k208j1323k1160l1489m1782n1257n9215o5344o9714p2451p3438
$$ 2044092 2050222 2048014 2036691 2015531 1984042 1942260 1891003 1831788 1766444 1696730 1624279 1550841
62969A550841p2374o9281o4883o0340n6376n2752m8789m4342m0031l6473l3624
$$ 1550841 1478467 1409186 1344303 1283963 1227587 1174835 1126046 1081704 1041673 1005200 971576
62958I71576l1013k8362k5763k3379k1373j9970j9330j9314j9505j9479j8970
$$ 971576 940563 912201 886438 863059 841686 821716 802386 783072 763567 744088 725118
62947G25118j7926j6640j5687j5382j5321j4747j3387j1663j0089q842p960p526
$$ 725118 707192 690552 674865 659483 644162 629415 616028 604365 594276 585434 577474 569948
62935E69948p397p056o113m789l627k775j885p40K79N62L6o43p60l62j70o87j624
$$ 569948 562551 555495 549382 544593 540966 538191 536306 535566 535845 536407 536443 535800 535040 534678 534508 533821 532197
62918E32197k424l011l653m247m335l839l295l143l217l177l081l186l485l757
$$ 532197 529773 526762 523109 518862 514527 510688 507393 504250 501033 497856 494775 491589 488104 484347
62904D84347l949m220m651n053m988m039k315o96j11m71q40p47o17o46j56J161
$$ 484347 480398 476178 471527 466474 461486 457447 455132 454436 454325 453854 453014 452267 451650 451004 450848 452009
62888D52009K177J552k96j618j549p74J5R67K050K360J429K35L5O49Q87L66j45
$$ 452009 454186 455738 455442 453824 452275 451501 451516 452483 454533 456893 458322 458557 458592 459241 460128 460494 460349
62871D60349j05jm56j259j707j543j100p67o58p50j037j408j551j184m14L00O15
$$ 460349 460244 460243 459787 458528 456821 455278 454178 453411 452753 452003 450966 449558 448007 446823 446409 446709 447324
62854D47324O41O70O93N36L97Q26J862K608K144P48k40L8R30J030j90j784k440
$$ 447324 447965 448635 449328 449864 450261 451087 452949 455557 457701 458449 458209 458247 459177 460207 460017 458233 455793
62837D55793j859r05m92p00j054j269j398j444j271r28o28l24K78J134J714J728
$$ 455793 453934 453029 452537 451837 450783 449514 448116 446672 445401 444473 443845 443521 443799 444933 446647 448375
62821D48375J623J992K732L280L516L886M580N104M925M271L894M188M855N411
$$ 448375 449998 451990 454722 458002 461518 465404 469984 475088 480013 484284 488178 492366 497221 502632
62807E02632N792O292P003P636P959Q188Q747R638J0418J0882J1454J2675J4441
$$ 502632 508424 514716 521719 529355 537314 545502 554249 563887 574305 585187 596641 609316 623757
62794F23757J6135J7468J8833K0697K2922K5034K7068K9845L4136L9733M5642
$$ 623757 639892 657360 676193 696890 719812 744846 771914 801759 835895 875628 921270
62783I21270N1256N7017O3687P1110P8224Q4325Q9898R5853J02157J07640J11050
$$ 921270 972526 1029543 1093230 1164340 1242564 1326889 1416787 1512640 1614797 1722437 1833487
62772A833487J11951J10464J06470R9443Q8982P5316N9159M1268K2228K600j6943
$$ 1833487 1945438 2055902 2162372 2261815 2350797 2426113 2485272 2526540 2548768 2551368 2534425
62761B534425l5727n3177o8781q2001r2441r9958j04588j06431j05809j03358
$$ 2534425 2498698 2445521 2376740 2294739 2202298 2102340 1997752 1891321 1785512 1682154
62751A682154r9713r5179q9927q4462p9422p4826o9904o4028n7597n1671m6856
$$ 1682154 1582441 1487262 1397335 1312873 1233451 1158625 1088721 1024693 967096 915425 868569
62740H68569m2820l8859l4650l0381k6399k2939k0133j8035j6508j5094j3239
$$ 868569 825749 786890 752240 721859 695460 672521 652388 634353 617845 602751 589512
62729E89512j0815q342o522n520m858l972k724j379k05P53J652K622L624M634
$$ 589512 578697 570355 563833 558313 553455 549483 546759 545380 545175 545928 547580 550202 553826 558460
62715E58460N853P489R272J0726J2132J4608J8561K2575K4920K5936K7769L1562
$$ 558460 564313 571802 581074 591800 603932 618540 637101 659676 684596 710532 738301 769863
62703G69863L6173M0211M4101M9111N5129O0759O5250O9134P3017P6730P9852
$$ 769863 806036 846247 890348 939459 994588 1055347 1120597 1189731 1262748 1339478 1419330
62692A419330Q2153Q3194Q2177P8539P2306O3731N2982M0319K6165J0894n035
$$ 1419330 1501483 1584677 1666854 1745393 1817699 1881430 1934412 1974731 2000896 2011790 2006755
62681B006755k0751l5245m8085n9381o8938p6093q0585q3056q4258q4156q2235
$$ 2006755 1986004 1950759 1902674 1843293 1774355 1698262 1617677 1534621 1450363 1366207 1283972
62670A283972p8425p3408o8158o3349n9001n4562m9536m4211l9464l5739l2595
$$ 1283972 1205547 1132139 1063981 1000632 941631 887069 837533 793322 753858 718119 685524
62659F85524k9537k6746k4577k2686k0293j7256j4331j2284j1140j0440r878r439
$$ 685524 655987 629241 604664 581978 561685 544429 530098 517814 506674 496234 486356 476917
62647D76917r144q902q633q329p908p192o077m744l507k496j611q54m21l45k86
$$ 476917 467773 458871 450238 441909 434001 426809 420732 415988 412481 409985 408374 407520 407099 406754 406468
62632D06468M2M10M23K02K73P60J092P28j68r09r81m24L12P85R86J310K053L024
$$ 406468 406510 406920 407343 407545 407818 408578 409670 410398 410230 409321 408340 407916 408228 409013 409999 411309 413362 416386
62614D16386L900M711N608O338O545O523P039Q318R820J1135J2514J4236J6154
$$ 416386 420286 424997 430605 436943 443488 450011 457050 465368 475188 486323 498837 513073 529227
62601E29227J8202K0678K3554K6099K7887K9714L2853L7527M2742M7378N0887
$$ 529227 547429 568107 591661 617760 645647 675361 708214 745741 788483 835861 886748
62590H86748N3139N4231N4392N3516N0929M6081L9382L1763K3503J4149L617p239
$$ 886748 939887 994118 1048510 1102026 1152955 1199036 1238418 1270181 1293684 1307833 1311450 1304211
62578A304211j7352k6172l3521l9279m3492m6490m8584m9793m9940m8876m6640
$$ 1304211 1286859 1260687 1227166 1187887 1144395 1097905 1049321 999528 949588 900712 854072
62567H54072m3687m0801l8342l5735l2325k8582k5723k3984k2196j9499j6631
$$ 854072 810385 769584 731242 695507 663182 634600 608877 584893 562697 543198 526567
62556E26567j4734j3525j1662q762o072m905n138n555n225m206l153k612k546
$$ 526567 511833 498308 486646 477884 471812 466907 461769 456214 450989 446783 443630 441018 438472
62543D38472k361j519j97P67P90K07j27J40N55O15M96P63J511K146K153J852K116
$$ 438472 436111 434592 434395 435162 435952 436159 436032 436172 436727 437342 437838 438601 440112 442258 444411 446263 448379
62526D48379L483N669P956R851J1391J3010J5158J7914K0949K3915K6817K9830
$$ 448379 451862 457531 465487 475338 486729 499739 514897 532811 553760 577675 604492 634322
62514F34322L2852L5540L7864M0232M2893M5426M7073M7391M6314M3809L9797
$$ 634322 667174 702714 740578 780810 823703 869129 916202 963593 1009907 1053716 1093513
62503A093513L4471K8263K1411J3791N420l127j1029j7863k3625k8183l1111l2239
$$ 1093513 1127984 1156247 1177658 1191449 1196869 1193742 1182713 1164850 1141225 1113042 1081931 1049692
62491A049692l2019l1020k9241k6311k2319j7960j3736r461m808k6M319Q095J1642
$$ 1049692 1017673 986653 957412 931101 908782 890822 877086 867625 862817 862791 867110 875205 886847
62478H86847J5124J8243K0637K2250K3110K3027K1651J8762J4451R155L497k051
$$ 886847 901971 920214 940851 963101 986211 1009238 1030889 1049651 1064102 1073257 1076754 1074703
62466A074703p398j2656j7882k3087k8264l3086l6721l8429l8398l7577l6617
$$ 1074703 1067305 1054649 1036767 1013680 985416 952330 915609 877180 838782 801205 764588
62455G64588l5384l3565l1255k8673k5794k2573j9287j6219j3272j0232p230m673
$$ 764588 729204 695639 664384 635711 609917 587344 568057 551838 538566 528334 521104 516431
62443E16431k765j376k11J081K739M605O122O923P228P377P242O435M961L250
$$ 516431 513666 512290 512079 513160 515899 520504 526626 533549 540777 548154 555396 561831 566792 570042
62429E70042J565k20k310m749p380r766j1212j1421j1043j1115j1831j2290j1636
$$ 570042 571607 571387 569077 564328 556948 547182 535970 524549 513506 502391 490560 478270 466634
62416D66634j0022q291p070o428o156o005n808n571n413n319n106m657l964l018
$$ 466634 456612 448321 441251 434823 428667 422662 416854 411283 405870 400551 395445 390788 386824 383806
62402C83806j900j013p52q15l58Q18J715J314N6n61K13J560K243J992J464J256
$$ 383806 381906 380893 380141 379326 378968 379786 381501 382815 382871 382310 382523 384083 386326 388318 389782 391038
62386C91038J386J675K093K610K991L038K986L349M252N183N615N769O365P626
$$ 391038 392424 394099 396192 398802 401793 404831 407817 411166 415418 420601 426216 431985 438350 445976
62372D45976Q901R473R361R160R367J0158J1593J3559J5660J7615J9665K2237
$$ 445976 454877 464350 473711 482871 492238 502396 513989 527548 543208 560823 580488 602725
62360F02725K5241K8239L1344L5286M0344M5726N0395N4153N7339N9839O0992
$$ 602725 627966 656205 687549 722835 763179 808905 859300 913453 970792 1030631 1091623
62349A091623O0334N7808N3176M5997L6541K6169J6329P402j020r086j6468k2993
$$ 1091623 1151957 1209765 1262941 1308938 1345479 1371648 1387977 1395379 1394359 1385273 1368805 1345812
62337A345812k8805l3832l7725m0563m2957m5016m5741m4085m0391l6136l2370
$$ 1345812 1317007 1283175 1245450 1204887 1161930 1116914 1071173 1027088 986697 950561 918191
62326I18191k9042k5817k2822k0313j8231j6527j5524j5552j6421j7603j8644
$$ 918191 889149 863332 840510 820197 801966 785439 769915 754363 737942 720339 701695
62315G01695j9239j9209j8840j8819j9388j9800j9117j7398j5497j3860j2218
$$ 701695 682456 663247 644407 625588 606200 586400 567283 549885 534388 520528 508310
62304E08310j0456r038q269p781p121o376n804n206m116k533r96pM03N82R15J478
$$ 508310 497854 488816 480547 472766 465645 459269 453465 448259 444143 441610 440614 440607 441010 441592 442507 443985
62288D43985J913J843J449J386J942K572K627K277K290K999L908M430M567M665
$$ 443985 445898 447741 449190 450576 452518 455090 457717 459994 462284 465283 469191 473621 478188 482853
62274D82853M805M808M767N161O251P542Q255Q354Q724J0131J2315J4504J6509
$$ 482853 487658 492466 497233 502394 508645 516187 524442 532796 541520 551651 563966 578470 594979
62261E94979J8778K1541K4610K8094L2561L8158M4099M9450N4024N8068O1503
$$ 594979 613757 635298 659908 688002 720563 758721 802820 852270 906294 964362 1025865
62250A025865O3878O4722O3532N9787N3491M5485L6688K7320J7284O987k819j1785
$$ 1025865 1089743 1154465 1217997 1277784 1331275 1376760 1413448 1440768 1458052 1465039 1462220 1450435
62238A450435j9997k7473l4276m0850m7459n3342n7265n8955n9196n8413n6039
$$ 1450435 1430438 1402965 1368689 1327839 1280380 1227038 1169773 1110818 1051622 993209 937170
62227I37170n1690m6196m0890l6308l2066k7717k3277j9101j5510j2468r641o906
$$ 937170 885480 839284 798394 762086 730020 702303 679026 659925 644415 631947 622306 615400
62215F15400m738l615l156k471j371n88o19j094j529j979k545k956l069l277l794
$$ 615400 610662 607047 603891 601420 600049 599461 598842 597748 596219 594240 591695 588739 585670 582393 578599
62200E78599m195m213m363n106n857n696m661l554k694j713m36Q57K035L235M380
$$ 578599 574404 570191 565828 560722 554865 549169 544508 540954 538260 536547 536111 536968 539003 542238 546618
62185E46618N218N865O730P810Q642Q987Q981Q657P890O885O167N943N995O332
$$ 546618 551836 557701 564431 572241 580883 589870 598851 607508 615398 622283 628450 634393 640388 646720
62171F46720P307Q991J0960J2978J5439J8908K3555K9070L4724L9492M2648M4424
$$ 646720 654027 663018 673978 686956 702395 721303 744858 773928 808652 848144 890792 935216
62159I35216M5572M6115M5097M1727L6197K9194K1317J3293O097J26n276j0950
$$ 935216 980788 1026903 1072000 1113727 1149924 1179118 1200435 1213728 1219825 1219951 1214675 1203725
62147A203725j6833k2234k6811l0718l3966l6238l7287l7128l5908l3868l1260
$$ 1203725 1186892 1164658 1137847 1107129 1073163 1036925 999638 962510 926602 892734 861474
62136H61474k8053k3985j9294j4971j1773r273o597l821j860j039o66k27Mj03
$$ 861474 833421 809436 790142 775171 763398 754125 747528 743707 741847 740808 740142 739915 739919 739816
62122G39816K52J840M207O167P234P783P933P063M715J342k052m660o023n975
$$ 739816 740068 741908 746115 752282 759516 767299 775232 782295 787010 788352 786300 781640 775617 769642
62108G69642m877l696l312l866n015o618q674j0690j1737j1303r699p449m736
$$ 769642 764765 761069 757757 753891 748876 742258 733584 722894 711157 699854 690155 682706 677970
62095F77970j742R77K891M132N200O240O984P305P393P383P271P281P797Q773
$$ 677970 676228 677205 680096 684228 689428 695668 702652 709957 717350 724733 732004 739285 747082 755855
62081G55855R599R864R957J0581J1848J3194J4108J4689J5463J6776J8435J9821
$$ 755855 765454 775318 785275 795856 807704 820898 835006 849695 865158 881934 900369 920190
62069I20190K0376K0061J9422J9109J9323J9808K0422K1609K4007K7464L0696
$$ 920190 940566 960627 980049 999158 1018481 1038289 1058711 1080320 1104327 1131791 1162487
62058A162487L2254L1745K9711K6427K1472J4775P486J150l808q172j2704j7423
$$ 1162487 1194741 1226486 1256197 1282624 1304096 1318871 1326357 1327507 1323699 1315527 1302823 1285400
62046A285400k2144k7032l2293l7609m2235m5526m7266m7670m7140m6001m4372
$$ 1285400 1263256 1236224 1203931 1166322 1124087 1078561 1031295 983625 936485 890484 846112
62035H46112m2266l9711l6689l3226k9643k6427k3638k0809j7833j5414j4067
$$ 846112 803846 764135 727446 694220 664577 638150 614512 593703 575870 560456 546389
62024E46389j3124j1588r686q549q429q315p600o986p182p695p649p078o547o012
$$ 546389 533265 521677 511991 503442 495013 486698 479098 472112 464930 457235 449586 442508 435961 429949
62010D29949m975l503k283j624j105k08J103K533L785M663N096N172N147N420
$$ 429949 424974 421471 419188 417564 416459 416251 417354 419887 423672 428335 433431 438603 443750 449170
61996D49170O302P464P822O557M315K583J818J039l35j439j517j546k958n351
$$ 449170 455472 462936 470758 477315 481630 484213 486031 487070 486735 485296 483779 482233 479275 473924
61982D73924o913o930o492o584o825o589o211o299o564o243n290m439m174m225
$$ 473924 467011 460081 453589 447005 440180 433591 427380 421081 414517 408274 402984 398545 394371 390146
61968C90146m018l284k171j069l98l98r80j734k122j884j290r11r93j196j070
$$ 390146 386128 382844 380673 379604 379206 378808 377828 376094 373972 372088 370798 369887 368894 367698 366628
61953C66628n16L01J280K273K967L216L310L632M223N044O299Q023R599J0354
$$ 366628 366112 366413 367693 369966 372933 376149 379459 383091 387314 392358 398657 406680 416279 426633
61939D26633J0463J0670J1176J1498J1439J1496J1994J2487J2334J1530J0565
$$ 426633 437096 447766 458942 470440 481879 493375 505369 517856 530190 541720 552285
61928E52285R754R015Q162P121N849M199J987n79k730l786m084m753o180p369
$$ 552285 562039 571054 579216 586337 592186 596385 598372 597793 595063 591277 587193 582440 576260 568891
61914E68891p318o323n138l483o54K750N134O069O783Q219R836J0838J1353J1547
$$ 568891 561573 555250 550112 546629 545975 548725 553859 559928 566711 574930 584766 595604 606957 618504
61900F18504J0717Q261M910J948k91k250l995n239o238p555r026r814r617r044
$$ 618504 629221 637482 642392 644340 644049 641799 637804 632565 626327 618772 609746 599932 590315 581271
61886E81271q648q245p455o354n371m838m821n140n466n599n691n987o422o699
$$ 581271 572623 564378 556923 550569 545198 540360 535539 530399 524933 519334 513643 507656 501234 494535
61872D94535o684o462n955m887l207j441l60l03o93l81J246L537N262O056O738
$$ 494535 487851 481389 475434 470547 467340 465899 465539 465236 464543 464162 465408 468945 474207 480263 487001
61857D87001Q033R587J0636J1200J1956J3222J4699J6150J7688J9270K0518K1191
$$ 487001 495034 504621 515257 526457 538413 551635 566334 582484 600172 619442 639960 661151
61845F61151K1481K1613K1352K0171J7807J4603J1251Q205N303K126j344m623
$$ 661151 682632 704245 725597 745768 763575 778178 789429 797634 802937 805063 803719 799096
61833G99096p368r640j1356j1932j0931q830o561m442k013J041M335P133Q949
$$ 799096 791728 782088 770732 758800 747869 739039 732478 728036 726023 727064 731399 738532 747481
61820G47481R656R310Q029N894K983m66m095p725j1416j5003j7876j9545k0240
$$ 747481 757137 766447 774476 780370 783353 782887 778792 771067 759651 744648 726772 707227 686987
61807F86987k0553k0686k0385j9494j8134j6486j4810j3532j2816j2192j1077
$$ 686987 666434 645748 625363 605869 587735 571249 556439 542907 530091 517899 506822
61796E06822r598q383p621o949o169n449m739l772k799k547l101l548l185k458
$$ 506822 497224 488841 481220 474271 468102 462653 457914 454142 451343 448796 445695 442147 438962 436504
61782D36504k155k214k037j582j323j294r79k16N01P44O65N73M82L45L08M02L09
$$ 436504 434349 432135 430098 428516 427193 425899 424920 424704 425205 425949 426614 427187 427669 428014 428322 428724 429033
61765D29033j45n20k28O67J516J942K186K542K860K878K642K350K031J723J705
$$ 429033 428888 428368 428140 428807 430323 432265 434451 436993 439853 442731 445373 447723 449754 451477 453182
61750D53182K054K172J286m81k038k544k251k006k292l012l766l999l331k116
$$ 453182 455236 457408 458694 458213 456175 453631 451380 449374 447082 444070 440304 436305 432974 430858
61736D30858j388j743k448k226p58J043K187K439K085J453R24R17J446J939J784
$$ 430858 429470 427727 425279 423053 422295 423338 425525 427964 430049 431502 432426 433343 434789 436728 438512
61721D38512J065N16P73J720K628K844K368J642R68M10J57M63J036J006p0j574
$$ 438512 439577 440093 440866 442586 445214 448058 450426 452068 453036 453446 453603 454066 455102 456108 456038 454464
61705D54464k623l148l542l734l329k539k004j809j462j006j149k049k884l062
$$ 454464 451841 448693 445151 441417 438088 435549 433545 431736 430274 429268 428119 426070 423186 420124
61691D20124k983l073k954k351k057k863m030m081k952k123k412k869k405j444
$$ 420124 417141 414068 411114 408763 406706 403843 399813 395732 392780 390657 388245 385376 382971 381527
61677C81527j083j310j205o75q15k211l785l979k577p80K83M00j46r99j563j200
$$ 381527 380444 379134 377929 377254 376439 374228 370443 366464 363887 363107 363390 363790 363644 362645 361082 359882
61661C59882m9Q94J032R83J487J963J186p09j973j368L66J623J835J592J420J262
$$ 359882 359833 360727 361759 362742 364229 366192 367378 366669 364696 363328 363694 365317 367152 368744 370164 371426
61645C71426J012Q52R46J286J897K782L624L872L315K341J549J144Q02P6j014
$$ 371426 372438 373290 374236 375522 377419 380201 383825 387697 391012 393353 394902 396046 396848 396924 395910
61630C95910j902k103j889j928k330k493k149j924k406l164l401l182l217l534
$$ 395910 394008 391905 390016 388088 385758 383265 381116 379192 376786 373622 370221 367039 363822 360288
61616C60288l305k155q16j44j89o05j359k397l167l188k879l131m063m874m920
$$ 360288 356983 354828 354012 353868 353679 353074 351715 349318 346151 342963 340084 336953 332890 328016 323096
61601C23096m454m094l999l849l396k762k342k420k830k974k444j589j152j355
$$ 323096 318642 314548 310549 306700 303304 300542 298200 295780 292950 289976 287532 285943 284791 283436
61587B83436j761k101k620l335l516k600j248p12j205j673j335o88n69q93r43
$$ 283436 281675 279574 276954 273619 270103 267503 266255 265543 264338 262665 261330 260642 260073 259180 258237
61572B58237n30j41n8k2J59K39L4j13K01P72R00K04q95j537j191m8J220K069K427
$$ 258237 257707 257566 257508 257486 257645 257884 257918 257805 258006 258778 259678 259882 258987 257450 256259 256211 257431 259500 261927
61553B61927K515K480K264J787J183Q03R25J398J639J187K93k77j16L66N35K94
$$ 261927 264442 266922 269186 270973 272156 272959 273884 275282 276921 278108 278401 278124 278008 278374 278909 279203
61537B79203J5o1k0%j01m11p68o89L0P48O13k59q65p42n91j138k003k284j842
$$ 279203 279218 279157 279137 279137 279036 278625 277857 277168 277198 277946 278559 278300 277435 276693 276102 274964 272961 270677 268835
61518B68835j281r22m83J93Q11J122J258J332J154O18K3k99m32o28p60m44K89
$$ 268835 267554 266632 266149 266342 267153 268275 269533 270865 272019 272637 272660 272361 271929 271301 270541 270097 270386
61501B70386Q56P69K36r9J43P18J026O60k18r61j012m81l3j00l75k98J59N15M92
$$ 270386 271242 272011 272247 272148 272291 273009 274035 274695 274477 273516 272504 272023 271990 271890 271515 271217 271376 271891 272383
61482B72383K55m7m99r69r28l1J301K290K540K217J689J275J101R34M20k88m69
$$ 272383 272638 272591 272092 271123 270195 270164 271465 273755 276295 278512 280201 281476 282577 283511 283931 283643 283174
61465B83174J10N95R7r18j160l09O25Q59P57Q27P01j39j239j560q24K64R97J283
$$ 283174 283284 283879 283976 283058 281898 281589 282214 283073 283830 284657 285358 285219 283980 282420 281596 281860 282857 284140
61447B84140J296J098Q17P21Q77R31N32r7k11O79K167L259L389K920K518K287
$$ 284140 285436 286534 287351 288072 288949 289880 290412 290315 290104 290783 292950 296209 299598 302518 305036 307323
61431C07323J910J396J133J218J341J405J697K140K021R35l98p74J99J828L124
$$ 307323 309233 310629 311762 312980 314321 315726 317423 319563 321584 322519 322121 321347 321546 323374 326498
61416C26498L508K962J995J303J174J273J204R96P98M28k82j006j313j319j414
$$ 326498 330006 332968 334963 336266 337440 338713 339917 340913 341711 342139 341857 340851 339538 338219 336805
61401C36805j567j492j390j737k373k503j836j027o26k95M15J105R57m5j014j258
$$ 336805 335238 333746 332356 330619 328246 325743 323907 322880 322254 321959 322374 323479 324436 324391 323377 322119
61385C22119r42o13n23o31r20j314j428q10M19J450J651J410J748K960M081L946
$$ 322119 321177 320564 320041 319410 318490 317176 315748 314938 315357 316807 318458 319868 321616 324576 328657 332603
61369C32603K622J321R82J391J729J567J099O51L77L10M53P13R42J080J256J733
$$ 332603 335225 336546 337528 338919 340648 342215 343314 343965 344342 344652 345105 345818 346760 347840 349096 350829
61353C50829K746M251N752O537O264N350M569M285M156L713K989K480K560L135
$$ 350829 353575 357826 363578 370115 376379 381729 386298 390583 394739 398452 401441 403921 406481 409616
61339D09616L820M218M079L475K905K932L513L873L342K106Q80O8m13o55o21m70
$$ 409616 413436 417654 421733 425208 428113 431045 434558 438431 441773 443879 444759 444827 444414 443759 443138 442668
61323D42668n00o51m47L14J256J948K419K910L412L816M270N039O139P359Q524
$$ 442668 442168 441517 441070 441384 442640 444588 447007 449917 453329 457145 461415 466454 472593 479952 488476
61308D88476R550J0377J1026J1573J1927J1853J1451J1243J1464J1479J0349P955
$$ 488476 498026 508403 519429 531002 542929 554782 566233 577476 588940 600419 610768 618723
61296F18723N135K733Q15j070l145n090o433p138p764q881j0376j1503j1674j0998
$$ 618723 623858 626591 627406 626336 623191 618101 611668 604530 596766 587885 577509 566006 554332 543334
61282E43334j0029r268q978r079r043q224o632m989l787k691j250K19J048J246
$$ 543334 533305 524037 515059 505980 496937 488713 482081 477092 473305 470614 469364 469583 470631 471877
61268D71877J438J890K257K342K447K800L194L414L649M188M975N714O138O077
$$ 471877 473315 475205 477462 479804 482251 485051 488245 491659 495308 499496 504471 510185 516323 522400
61254E22400N493M680M155M118M139L691K893K404K550K837K525J575O85L14P7
$$ 522400 527893 532573 536728 540846 544985 548676 551569 553973 556523 559360 561885 563460 564145 564459 564536
61239E64536n77j392j610j179r33j297j597j136m04l37p57m86R27K507L238L440
$$ 564536 563959 562567 560957 559778 558845 557548 555951 554815 554411 554074 553317 552831 553758 556265 559503 562943
61223E62943M179N737P263P977Q078Q294Q840R200Q907Q143P470P174P128P111
$$ 562943 567122 572859 580122 588099 596177 604471 613311 622511 631418 639561 647031 654205 661333 668444
61209F68444O874O128M922L964M004M743N010M207L017K389K430K731L291M479
$$ 668444 675318 681446 686368 690332 694336 699079 704089 708296 711313 713702 716132 718863 722154 726633
61195G26633O372Q554J0359J1085J0463R245Q709Q972Q532O230L047R24K39l24
$$ 726633 733005 741559 751918 763003 773466 782711 791420 800392 808924 815154 818201 819125 819364 819040
61181H19040j600k934l552l683l931m314m584m875n570o781q254r454r699q751
$$ 819040 817440 814506 810954 807271 803340 799026 794442 789567 783997 777216 768962 759508 749809 741058
61167G41058p371o857p748r352j0608j0983j0574r897r635j0071j0651j0542r704
$$ 741058 733687 726830 719082 709730 699122 688139 677565 667668 658033 647962 637311 626769 617065
61154F17065q830q270p628o575n368m283l197k025j070o84r70j965l561n130n843
$$ 617065 608235 599965 592337 585762 580394 576111 572914 570889 569819 569135 568165 566200 562639 557509 551666
61139E51666n600n124m918m734m276l690l040j990m56R76J853K512L508M754N811
$$ 551666 546066 540942 536024 531290 527014 523324 520284 518294 517838 518814 520667 523179 526687 531441 537252
61124E37252O687P808R350J1051J2528J3544J4171J4900J6358J8608K0923K2488
$$ 537252 543939 551747 561097 572148 584676 598220 612391 627291 643649 662257 683180 705668
61112G05668K3193K3546K3977K4381K4227K3152K1564K0410K0049J9639J8154
$$ 705668 728861 752407 776384 800765 824992 848144 869708 890118 910167 929806 947960
61101I47960J5723J3276J1068Q445N063J437j924n083q076j0587j2580j4546j6764
$$ 947960 963683 976959 988027 996472 1001535 1002972 1001048 995965 987889 977302 964722 950176 933412
61088I33412j8938k0718k1979k2448k1867k0777k0204k0286k0032j8812j7116
$$ 933412 914474 893756 871777 849329 827462 806685 786481 766195 746163 727351 710235
61077G10235j5545j4041j2632j1796j1450j0573q666o617n331m487l492k740k767
$$ 710235 694690 680649 668017 656221 644771 634198 625532 618915 613584 609097 605605 602865 600098
61064F00098k943k244p67O05J592K540L540M484N600O985P971P962P526P769Q940
$$ 600098 597155 594911 594144 594749 596341 598881 602421 606905 612505 619490 627461 635423 642949 650718 659658
61049F59658J0566J2438J4561J6478J7703J8586J9726K0928K1730K2645K4703
$$ 659658 670224 682662 697223 713701 731404 749990 769716 790644 812374 835019 859722
61038H59722K7835L0783L2689L3912L5249L7119L9513M2102M4483M6733M9298
$$ 859722 887557 918340 951029 984941 1020190 1057309 1096822 1138924 1183407 1230140 1279438
61027A279438N1966N3588N3598N3142N3837N6219O0272O6486P5006Q4592R3968
$$ 1279438 1331404 1384992 1438590 1491732 1545569 1601788 1662060 1728546 1803552 1888144 1982112
61016A982112J03710J15307J29097J44913J64339J90258K24329K66664L17927
$$ 1982112 2085822 2201129 2330226 2475139 2639478 2829736 3054065 3320729 3638656
61007C638656L80166M55979N48670O62366P99517R59400J142391J353279J590485
$$ 3638656 4018822 4474801 5023471 5685837 6485354 7444754 8587145 9940424 11530909
60998A1530909J824919J992825K018860J854213J500815J012071M81399K4449
$$ 11530909 13355828 15348653 17367513 19221726 20722541 21734612 22216011 22240460
60990B2240460k53313l02009j58776O4005K29873K33373K8886l66008q77560j392044
$$ 22240460 21987147 21685138 21526362 21590367 21820240 22053613 22082499 21716491 20838931 19446887
60980A9446887j791128j999058k010607j877326j667093j432528j204974j001531
$$ 19446887 17655759 15656701 13646094 11768768 10101675 8669147 7464173 6462642
60972F462642q29357o87147n69610m72564l93416l29123k76597k34318k01418
$$ 6462642 5633285 4946138 4376528 3903964 3510548 3181425 2904828 2670510 2469092
60963B469092j75709j54439j36398j21468j08621r6240q4095p3181o3682n4664
$$ 2469092 2293383 2138944 2002546 1881078 1772457 1676217 1592122 1518941 1455259 1400595
60953A400595m5796l7842l1309k5922k1613j8817j7425j6458j5086j3199j0850
$$ 1400595 1354799 1316957 1285648 1259726 1238113 1219296 1201871 1185413 1170327 1157128 1146278
60942A146278p989m952k429o48Q23K224L178L270K695K110K097K746L531L765
$$ 1146278 1138289 1133337 1130908 1130260 1131083 1133307 1136485 1139755 1142450 1144560 1146657 1149403 1152934 1156699
60928A156699L283K458J389k40k315m111n510p503j0654j3905j5970j7256j9144
$$ 1156699 1159982 1162440 1163829 1163589 1161274 1157163 1151653 1144150 1133496 1119591 1103621 1086365 1067221
60915A067221k1799k4068k5268k5776k5851k5299k4328k3572k2933k1578j9391
$$ 1067221 1045422 1021354 996086 970310 944459 919160 894832 871260 848327 826749 807358
60904H07358j7359j6108j5106j3792j2583j2057j1829j1029r424p539n963n014
$$ 807358 789999 773891 758785 744993 732410 720353 708524 697495 688071 680532 674569 669555
60892F69555m798n170n704o001o039o148o674p578q355q568q552r059r988j0134
$$ 669555 664757 659587 653883 647882 641843 635695 629021 621443 613088 604520 595968 586909 576921 566787
60878E66787q867p343p057p709p719o624n553n305n331n033m773m883m750l792
$$ 566787 557920 550577 543520 535811 528092 521468 515915 510610 505279 500246 495473 490590 485840 482048
60864D82048k609k244k741l241l231k998k931l001k961k827k975l719m678m786
$$ 482048 479439 477195 474454 471213 467982 464984 462053 459052 456091 453264 450289 446570 441892 437106
60850D37106l361j111M45N42m05j738l101m017l895k903k057j964k189k303k724
$$ 437106 433745 432634 433079 433621 433216 431478 428377 424360 420465 417562 415505 413541 411352 409049 406325
60835D06325l809m797m611l359k194j832j938j908j562r90k87M11R84J491K042
$$ 406325 402516 397719 393108 389749 387555 385723 383785 381877 380315 379325 379038 379449 380433 381924 383966
60820C83966K539K732K517J941J089J78l80l36Q5L24nq35j624j669p40M17O36
$$ 383966 386505 389237 391754 393695 394784 394962 394582 394246 394331 394655 394650 393815 392191 390522 389782 390199 390835
60803C90835l37j503j844j505j282j373j289q20m13n32j147j971k800l458l730
$$ 390835 390498 388995 387151 385646 384364 382991 381702 380882 380469 379937 378790 376819 374019 370561 366831
60788C66831l567l185k858k694k625k535k396k354k637l276l976m352m224l654
$$ 366831 363264 360079 357221 354527 351902 349367 346971 344617 341980 338704 334728 330376 326152 322498
60774C22498k855k040j270l83O83J504J521Q61L83O26J179J371J205J136J258
$$ 322498 319643 317603 316333 315950 316633 318137 319658 320519 320902 321528 322707 324078 325283 326419 327677
60759C27677J365J518J981K625K992K970K913L044L261L548M014M384M067L020
$$ 327677 329042 330560 332541 335166 338158 341128 344041 347085 350346 353894 357908 362292 366359 369379
60745C69379K101K121K829L213K578J063p74k513m035n365o364o674o073m990
$$ 369379 371480 373601 376430 379643 382221 383284 382510 379997 375962 370597 364233 357559 351486 346496
60731C46496m299m444n041n472n555n348m735l683k704k396k603k577k032j475
$$ 346496 342197 337753 332712 327240 321685 316337 311602 307919 305215 302819 300216 297639 295607 294132
60717B94132j327j307r85n09k92l36l69m56r07j612j939j499o53n2K6k05m19m42
$$ 294132 292805 291498 290513 290004 289712 289376 289007 288551 287644 286032 284093 282594 281941 281889 281915 281710 281291 280849
60699B80849k58J03O49J358K047K369K130J593J259J375J796K272K667K924L080
$$ 280849 280591 280694 281343 282701 284748 287117 289247 290840 292099 293474 295270 297542 300209 303133 306213
60684C06213L313L757M239M459M441M502M749M987N177N584O224O557O059M861
$$ 306213 309526 313283 317522 321981 326422 330924 335673 340660 345837 351421 357645 364202 370261 375122
60670C75122L552K526J785J222P10N2q52j850k746l562m327m765m503l566k449
$$ 375122 378674 381200 382985 384207 384917 384969 384117 382267 379521 375959 371632 366867 362364 358798 356349
60655C56349j625j202r95q50q08j021j428j589j043Q3J080J382J035L26n92j562
$$ 356349 354724 353522 352527 351677 350869 349848 348420 346831 345788 345871 346951 348333 349368 349694 349102 347540
60639C47540k243k537k859l570m318m387l587k403j402p99n57n15m79l94l79l65
$$ 347540 345297 342760 339901 336331 332013 327626 324039 321636 320234 319435 318878 318363 317884 317490 317111 316746
60623C16746LP85J376J180M32j51l40m80p43r42j006j023p81K2J023J309N81l13
$$ 316746 316749 317534 318910 320090 320522 320371 320031 319551 318808 317866 316860 315837 315056 315078 316101 317410 317991 317678
60605C17678l81L98J293J734J713J461J151Q82P35Q09J204J876K538K875K797
$$ 317678 317297 317695 318988 320722 322435 323896 325047 325929 326664 327473 328677 330553 333091 335966 338763
60590C38763K406J801J129O40M29K50j41o39j043j393j687j547o91M84J343J821
$$ 338763 341169 342970 344099 344739 345168 345418 345277 344638 343595 342202 340515 338968 338277 338761 340104 341925
60574C41925K218K462K374K472L574N542P391Q734J0141J1758J2605J1878J0113
$$ 341925 344143 346605 348979 351451 355025 360567 367958 376692 386833 398591 411196 423074 433187
60561D33187Q391P015N575L783J595r99l688n691o550o670o549n917m339k214
$$ 433187 441578 448593 454168 457951 459546 458547 454859 449168 442618 435948 429399 423482 419143 416929
60547D16929m26Q47K181L867N561O920Q045R152J0309J1546J2763J3591J3720
$$ 416929 416503 417350 419531 423398 428959 435879 443924 453076 463385 474931 487694 501285 515005
60534E15005J3457J3398J3520J2995J1085P876M019R3l468o205p763q281q364
$$ 515005 528462 541860 555380 568375 579460 587336 591355 591448 587980 581775 574012 565731 557367
60521E57367q505q564q006o656n080m013l598l355k786j752l97R67J932K405K888
$$ 557367 548862 540298 532292 525636 520556 516543 512945 509590 506804 505052 504655 505622 507554 509959 512847
60506E12847L969N525P000Q476J0742J4124J7830K0963K3646K6633L0206L3882
$$ 512847 516816 522341 529341 537817 548559 562683 580513 601476 625122 651755 681961 715843
60494G15843L7012L9192M0258M0219L9060L6516L2301K6731K0574J4095O761j704
$$ 715843 752855 792047 832305 872524 911584 948100 980401 1007132 1027706 1041801 1048562 1046858
60482A046858j0536j8741k6137l2989l8954m3142m5083m5009m3354m0528l7046
$$ 1046858 1036322 1017581 991444 958455 919501 876359 831276 786267 742913 702385 665339
60471F65339l3371k9630k5944k2799k0611j9103j7600j5849j4046j2236j0270
$$ 665339 631968 602338 576394 553595 532984 513881 496281 480432 466386 454150 443880
60460D43880q366p142o947p486q079q006o792m636k534j590k060l256m211m317
$$ 443880 435514 428372 421425 413939 405860 397854 391062 386426 383892 382302 380242 376986 372775 368458
60446C68458l556k529j964j923j750j076m16l57o64q15q95j209j373p97J46L68
$$ 368458 364902 362373 360409 358486 356736 355660 355244 354887 354223 353408 352513 351304 349931 349134 349280 349648
60430C49648m22j316j420p72N9O28P76O47O70J040J311J035N71N65Q40P16K98
$$ 349648 349226 347910 346490 345718 345777 346405 347181 347828 348498 349538 350849 351884 352455 353020 353860 354576 354874
60413C54874L57Q87R40J93m16j63L55K85j37o9O44J472K042K323K325K155K114
$$ 354874 355231 356118 357058 357251 356835 356672 357027 357312 357175 357106 357750 359222 361264 363587 365912 368067 370181
60396C70181K249K112J460Q52J021J820K381K229J831J964K792L649L728L025
$$ 370181 372430 374542 376002 376854 377875 379695 382076 384305 386136 388100 390892 394541 398269 401294
60382D01294K362K291K343J832J130J219K145K858K777K434K293K033J563J628
$$ 401294 403656 405947 408290 410122 411252 412471 414616 417474 420251 422685 424978 427011 428574 430202
60368D30202K512L092K258O00l74k32K88P17J183J528J295P03O24J398K496L528
$$ 430202 432714 435806 438064 438664 438290 438058 438346 439063 440246 441774 443069 443772 444396 445794 448290 451818
60352D51818M785O526Q355R604R953R545Q885Q473Q129O881M139P23k007l885
$$ 451818 456603 463129 471484 481088 491041 500586 509471 517944 526073 532954 537093 537816 535809 531924
60338E31924n807p951r252q984p837o911o464o196o012n853n350m321l215k524
$$ 531924 526117 518166 508914 499930 492093 485182 478718 472522 466510 460657 455307 450986 447771 445247
60324D45247k181j975k078k621l177l277l002k556j736m96M50N02L48J304L552
$$ 445247 443066 441091 439013 436392 433215 429938 426936 424380 422644 422148 422598 423100 423448 424752 428304
60309D28304N969P682Q944J0267J1673J3132J4892J6816J8037J7775J6127J3496
$$ 428304 434273 441955 450899 461166 472839 485971 500863 517679 535716 553491 569618 583114
60297E83114R780M716j277p196j2266j6169j8658j9528j8927j7315j5015j2240
$$ 583114 592894 597610 596333 589137 576871 560702 542044 522516 503589 486274 471259 459019
60285D59019r397p004n207l770k537j564q32k13J94R6n25j277j868k366k857l211
$$ 459019 449622 442618 437411 433641 431104 429540 428708 428495 428689 428785 428260 426983 425115 422749 419892 416681
60269D16681l337l365l343l083k547k106k107k401k539k334j871j182k52O81J144
$$ 416681 413344 409979 406636 403553 401006 398900 396793 394392 391853 389519 387648 386466 386214 386895 388039
60254C88039Q04j90j277j834j645j051m77J40J095K125K395J616O24L58O87P93
$$ 388039 388843 388653 387376 385542 383897 382846 382369 382509 383604 385729 388124 389740 390364 390722 391409 392202
60238C92202M49K09M23P85R03P85O33O54J102K050L021L351L024K660K592K506
$$ 392202 392651 392860 393283 394068 394971 395756 396389 397043 398145 400195 403216 406567 409591 412251 414843 417349
60222D17349K103J555J055N55K62P10J952L160L654L777M155M590M502M183M618
$$ 417349 419452 421007 422062 422617 422879 423589 425541 428701 432355 436132 440287 444877 449379 453562 458180
60207D58180O019P419P958P863P773P701P234O379N682N543N811O012N727M804
$$ 458180 464199 471618 479576 487439 495212 502913 510147 516526 522208 527751 533562 539574 545301 550105
60193E50105L485K352J910K085K271J908R59k56j487k626l470l663l098k204j688
$$ 550105 553590 555942 557852 559937 562208 564116 565075 564819 563332 560706 557236 553573 550475 548271 546583
60178E46583j950k830l864m603m807m553m209m098m094l806l181k719k855l357
$$ 546583 544633 541803 537939 533336 528529 523976 519767 515669 511575 507769 504588 501869 499014 495657
60164D95657l578l142k209j182m51k81o42j141j334j140p49k06N61J356J730J546
$$ 495657 492079 488937 486728 485546 485095 484814 484172 483031 481697 480557 479808 479602 480163 481519 483249 484795
60148D84795J161R42Q40O93N97O76P77P75R33J494K083K192K222L209N240O898
$$ 484795 485956 486898 487738 488431 489028 489704 490481 491256 492189 493683 495766 497958 500180 503389 508629 515527
60132E15527O925N846N159N305N419M945M326L907L182J810M83O6L00L37J16L40
$$ 515527 522452 528298 533457 538762 544181 549126 553452 557359 560541 562351 562834 562900 563200 563537 563653 563993
60116E63993J181J942K101J900J704J502J281J283J494J451R02K21k11n86j168
$$ 563993 565174 567116 569217 571117 572821 574323 575604 576887 578381 579832 580734 580955 580744 580158 578990
60101E78990j668j758j861k659l954m700m337l461k906k637j975o64P36J491J435
$$ 578990 577322 575564 573703 571044 567090 562390 558053 554592 551686 549049 547074 546410 547146 548637 550072
60086E50072J077J023J432J902J939J493J012R28J207J438J211L18j241l093m456
$$ 550072 551149 552172 553604 555506 557445 558938 559950 560878 562085 563523 564734 565052 563811 560718 556262
60071E56262m701m179m129n386p373q748q897q322p719p268o957o827o651n932
$$ 556262 551561 547382 543253 537867 530494 521746 512849 504527 496808 489540 482583 475756 469105 463173
60057D63173m719l833l735l696k880j761j447j869j784p15L23M79L73J009K182
$$ 463173 458454 454621 450886 447190 444310 442549 441102 439233 437449 436734 437057 437536 437909 438918 441100
60042D41100K902K998L265M169N222N724N548M999M414M030L883L637K839J463
$$ 441100 444002 447000 450265 454434 459656 465380 470928 475927 480341 484371 488254 491891 494730 496193
60028D96193J9r83j491j715j808j883k217l153m668o116o630n930m727m069m280
$$ 496193 496212 495229 493738 492023 490215 488332 486115 482962 478294 472178 465548 459618 454891 450822 446542
60013D46542m675m480l721l071l041l525m015m042l499k782k466k678k853k425
$$ 446542 441867 437387 433666 430595 427554 424029 420014 415972 412473 409691 407225 404547 401694 399269
59999C99269j614j169j360j610j308o26j95j21K44J415K882L488K735J504J261
$$ 399269 397655 396486 395126 393516 392208 391582 391387 391266 391510 392925 395807 399295 402030 403534 404795
59984D04795K526M299N044M140K386J115R22J194R09k33j570k394k746k995l028
$$ 404795 407321 411620 416664 420804 423190 424305 425227 426421 427330 427097 425527 423133 420387 417392 414364
59969D14364k364j109j45j41p27r79m57M93J268J604J674J878K438L165L583L315
$$ 414364 412000 410891 410746 410605 409878 408899 408442 408935 410203 411807 413481 415359 417797 420962 424545 427860
59953D27860K302P84o79j325q33J35M73p9o79n82p6J39k2j56j79l36n63m91j15
$$ 427860 430162 430946 430267 428942 428109 428244 428717 428638 427959 427377 427301 427440 427418 427262 427083 426747 426184 425693 425578
59934D25578N6k77p70r13o42k71K1L65R81J870K808L528L948M161M346M727N519
$$ 425578 425634 425357 424587 423674 423032 422761 422782 423147 424128 425998 428806 432334 436282 440443 444789 449516 455035
59917D55035O677P692P983P596P218P317P423O609M553J950j31j160j449j658
$$ 455035 461712 469404 477387 484983 492201 499518 506941 513550 518103 520053 519922 518762 517313 515655
59903E15655k026k223k022j794j944k125j713j007j109k283l276k865j428k75
$$ 515655 513629 511406 509384 507590 505646 503521 501808 500801 499692 497409 494133 491268 489840 489565
59889D89565J85O97J872L440M855N894O489O523O030N332M784M622M989N806O639
$$ 489565 489750 490447 492319 495759 500614 506508 512997 519520 525550 530882 535666 540288 545277 551083 557722
59874E57722O994O700N789M200K020j69j673k443k980l560l959m010l860l668
$$ 557722 564716 571416 577205 581405 583425 583256 581583 579140 576160 572600 568641 564631 560771 557103
59860E57103l447l345l559l822l422k055l36Q52J333J726K696M311O018P081P104
$$ 557103 553656 550311 546752 542930 539508 537453 537117 537969 539302 541028 543724 548035 554053 561134 568238
59845E68238O157M453K097o59l077m257l849k325n35P85J150L61j441l879o456
$$ 568238 574395 578848 580945 580286 577209 572952 569103 566778 566243 567028 568178 568539 567098 563219 556763
59830E56763q505r273q428o463m358k842k141k167k531k578j959j109p10p57o87
$$ 556763 548258 538985 530557 524094 519736 516894 514753 512586 510055 507477 505518 504409 503699 502942 502255
59815E02255l71k92o32r19q29p49j055j435j480j505k168l390m282m180l357k608
$$ 502255 501884 501592 500960 500041 499212 498463 497408 495973 494493 492988 490820 487430 483148 478968 475611 473003
59799D73003k436k707k954k854k445j980j601j345j355j781k371k534j928q86
$$ 473003 470567 467860 464906 462052 459607 457627 456026 454681 453326 451545 449174 446640 444712 443826
59785D43826K6N52O72L34l46q49o52J14Q47J302J780K361K524J901J066R68J651
$$ 443826 443852 444404 445076 445410 445064 444215 443563 443677 444524 445826 447606 449967 452491 454392 455458 456426 458077
59768D58077K179J920J365J311J687J803J505J396J833K344K362K090K239L140
$$ 458077 460256 462176 463541 464852 466539 468342 469847 471243 473076 475420 477782 479872 482111 485251
59754D85251M430N522O063O048N731N434N300N318N537O028O542O522N720M548
$$ 485251 489681 495203 501266 507314 513045 518479 523779 529097 534634 540662 547204 553726 559446 563994
59740E63994L626L144K888K609K217J803J663J985K369K048Q59m78j319j851k367
$$ 563994 567620 570764 573652 576261 578478 580281 581944 583929 586298 588346 589205 588727 587408 585557 583190
59725E83190k437j573l67p3j085k576l567l719l136k183j502j514j761j368k99
$$ 583190 580753 579180 578813 578740 577655 575079 571512 567793 564657 562474 560972 559458 557697 556329 556030
59710E56030N38N48J31j01j43k66m24m35l31j58K10Q25J527K206K828L164K956
$$ 556030 556568 557116 557247 557146 557003 556737 556313 555878 555547 555389 555599 556424 557951 560157 562985 566149 569105
59693E69105K537K653L347L651K819J361L02j57o31j431k142k270j839j263r59
$$ 569105 571642 574295 577642 581293 584112 585473 585775 585618 584987 583556 581414 579144 577305 576042 575083
59678E75083j109j575k100k661l506m662n609n822n451n141n161n107m540l726
$$ 575083 573974 572399 570299 567638 564132 559470 553861 548039 542588 537447 532286 527179 522639 518913
59664E18913l349l623l927l521k397j185l01M10J164J795K130K334K592K774K810
$$ 518913 515564 511941 508014 504493 502096 500911 500610 501020 502184 503979 506109 508443 511035 513809 516619
59649E16619L045L730M387M262L219J698O0j439k350k437k331k899m053m890n033
$$ 516619 519664 523394 527781 532043 535262 536960 537020 535581 533231 530794 528463 525564 521511 516621 511588
59634E11588m937m848m411l525k663k039j332o21o22j520k411k525k238k176k160
$$ 511588 506651 501803 497392 493867 491204 489165 487833 487212 486590 485070 482659 480134 477896 475720 473560
59619D73560j822j581k074l024l613l704l773l846l454k563j779j447j268r28
$$ 473560 471738 470157 468083 465059 461446 457742 453969 450123 446669 444106 442327 440880 439612 438684
59605D38684n66l51r7M77J290J968K235K121J806J314M96n24j076n47P17J631
$$ 438684 438118 437767 437670 438147 439437 441405 443640 445761 447567 448881 449377 448853 447777 447230 447947 449578
59589D49578J635J253J138J143P69O4m52n35m30n33j087k027k868l073k706k405
$$ 449578 451213 452466 453604 454747 455516 455580 455128 454593 454163 453630 452543 450516 447648 444575 441869 439464
59573D39464k450k429k037j698j817k070j991j805j975k250j968j082k15J86K01
$$ 439464 437014 434585 432548 430850 429033 426963 424972 423167 421192 418942 416974 415892 415677 415863 416064
59558D16064O7J0K85Q72J218Q46Q8k45J94J117K131K911L111K769K674L606N290
$$ 416064 416131 416141 416426 417298 418516 419362 419450 419205 419399 420516 422647 425558 428669 431438 434112 437718 443008
59541D43008O734P562Q346R582J1161J2987J5269J7699J8839J7002J1761M409
$$ 443008 449742 457304 465650 475232 486393 499380 514649 532348 551187 568189 579950 584359
59529E84359k906q380j1137j1242r407o708m270k746j912j063R5J103J462J251
$$ 584359 581453 573073 561936 550694 541287 534579 530309 527563 525651 524588 524683 525786 527248 528499
59515E28499Q30K51o17j669k653l532m448n466o592p750q529q342p195n895n124
$$ 528499 529329 529580 528963 527294 524641 521109 516661 511195 504603 496853 488324 479982 472787 466892 461768
59500D61768m675m010l178k564k127j537p98j51M79J206J591J039j93j071r39
$$ 461768 457093 453083 449905 447341 445214 443677 442879 442728 443207 444413 446004 447043 446850 445779 444840
59485D44840j22O90J198J603K279L381M505M979M706M462M959N951O639O619N949
$$ 444840 444718 445408 446606 448209 450488 453869 458374 463353 468059 472521 477480 483431 490070 496689 502638
59470E02638M769L464K695K559K168Q84n20q97m64k99m15K01J681K823K995L100
$$ 502638 507407 510871 513566 516125 518293 519177 518657 517760 517296 516997 516582 516783 518464 521287 524282 527382
59454E27382M001N205N868O192O870P811Q392Q564Q815R155Q852P187M135L76
$$ 527382 531383 536588 542456 548648 555518 563329 571721 580285 589100 598255 607107 614294 618429 618805
59440F18805l078n413o560p123p645q038p911p195o330n837n845n924n542m702
$$ 618805 615727 610314 603754 596631 588986 580948 573037 565842 559512 553675 547830 541906 536364 531662
59426E31662l942l456k662j025J056K839M342O187Q523J0927J3231J5625J7941
$$ 531662 527720 524264 521602 520577 521633 524472 528814 535001 543524 554451 567682 583307 601248
59413F01248J9798K1487K3675K6032K7033K5418K0959J3749M090o296j4282j7670
$$ 601248 621046 642533 666208 692240 719273 744691 765650 779399 783489 777193 762911 745241
59401G45241j6971j4035r715l938K564P816R960Q232K811n326j4186k1270k4883
$$ 745241 728270 714235 704520 700582 703146 710962 720922 729154 731965 726639 712453 691183 666300
59388F66300k4990k2801j9704j6461j3133r702o725m988m426l953k763j339o24
$$ 666300 641310 618509 598805 582344 569211 559509 552784 547796 543370 539417 536654 535315 534691
59375E34691n17N0J618L449M427M251L506K889K700K975L707M722N469N371M588
$$ 534691 534174 534224 535842 539291 543718 547969 551475 554364 557064 560039 563746 568468 573937 579308 583896
59360E83896M093M627N713O230N796N126N074N870P303Q928J0020R999R240Q889
$$ 583896 587989 592616 598329 604559 610355 615481 620555 626425 633728 642656 652676 662675 671915 680804
59346F80804R568J0750J1684J2291J2786J3013J2680J1850J0681R113P178N227
$$ 680804 690372 701122 712806 725097 737883 750896 763576 775426 786107 795220 802398 807625
59334H07625L369J173j606m382o355p467q233r002r826j0716j1451j1483j0658
$$ 807625 810994 812167 810561 806179 799824 792357 784124 775122 765296 754580 743129 731646 720988
59321G20988r709r390r414q949p876o814o029n219m355l806l476k678j244j3L51
$$ 720988 711279 701889 692475 683526 675650 668836 662807 657588 653233 649427 645951 643273 642029 642016 642367
59306F42367M70J481L509N605P148Q611J0661J2911J4008J2744Q740K304n685
$$ 642367 642837 644318 647827 653432 660580 669191 679852 692763 706771 719515 728255 730559 724874
59293G24874j3511j8940k0725j9706j7869j6331j4835j3096j1586j0592r374p127
$$ 724874 711363 692423 671698 651992 634123 617792 602957 589861 578275 567683 558309 551182
59281E51182m285k065r17k17O25J565K501L704N246O574P144P267P855R348J1125
$$ 551182 546897 544832 543915 543698 544323 545888 548389 552093 557339 563913 571057 578324 586179 595527 606652
59266F06652J2099J1742J0470R002P596N970L913J661l99k169l829n463o887p809
$$ 606652 618751 630493 640963 649965 657561 663531 667444 669105 668706 666537 662708 657245 650358 642549
59252F42549q123q027p854p672p204o240n065m174l643l049k078q51L79J508K375
$$ 642549 634426 626399 618545 610873 603669 597429 592364 588190 584547 581498 579420 578569 578948 580456 582831
59237E82831K674K298J603J156J295K018K993L648L516K701J778J146P07K15l29
$$ 582831 585505 587803 589406 590562 591857 593875 596868 600516 604032 606733 608511 609657 610364 610579 610250
59222F10250q49j430k150k857l299l400l328l324l444l428l005k426k359k884
$$ 610250 609401 607971 605821 602964 599665 596265 592937 589613 586169 582741 579736 577310 574951 572067
59208E72067l062k093o25n2o21j228j137q57j003j291j256j131j326j630j623
$$ 572067 569005 566912 566287 566235 565614 564386 563249 562392 561389 560098 558842 557711 556385 554755 553132
59193E53132j372j063m49O01J443J292L04o03q25m06M13J396K211K696L054L387
$$ 553132 551760 550697 550248 550849 552292 553584 553888 553285 552460 552054 552467 553863 556074 558770 561824 565211
59177E65211L273K391J299J018J830L094M129M749N003M975M980N455O430P417
$$ 565211 568484 570875 572174 573192 575022 578116 582245 586994 591997 596972 601952 607407 613837 621254
59163F21254P975Q120Q025P581O480M764L077K123J850J432K44j403k849m054
$$ 621254 629229 637349 645374 652955 659435 664199 667276 669399 671249 672681 672925 671522 668673 664619
59149F64619n428o934q157r125j0128j0766j0222q813q020q460q913q192o959
$$ 664619 659191 652257 644100 634975 624847 614081 603859 595046 587026 578566 569653 561461 554502
59136E54502o502o646o163m869l842l634l600l181k739k681k576j788m31Q17J682
$$ 554502 548000 541354 535191 530322 526480 522846 519246 516065 513326 510645 508069 506281 505850 506667 508349
59121E08349K563L878N321O101N977N773O422P659Q304P870P091O611O113N214
$$ 508349 510912 514790 520111 526212 532189 537962 544384 552043 560347 568217 575308 581919 588032 593246
59107E93246M317L850L432K630J940K031K537K559K003J442J044N37M0j28k44
$$ 593246 597563 601413 604845 607475 609415 611446 613983 616542 618545 619987 621031 621568 621608 621480 621236
59092F21236p46j251r92k06np82j758k199k228k213k259k486l060l708l936l876
$$ 621236 620490 619239 618247 618041 618036 617254 615496 613297 611069 608856 606597 604111 601051 597343 593407 589531
59076E89531m225n164o039o304o122n858n549n152m731m281l776l487l651l881
$$ 589531 585306 580142 574103 567799 561677 555819 550270 545118 540387 536106 532330 528843 525192 521311
59062E21311l547k783k380k614k907k790k507k411k442k418k299k007j530j242
$$ 521311 517764 514981 512601 509987 507080 504290 501783 499372 496930 494512 492213 490206 488676 487434
59048D87434j497j872j587p13j90m01o79m75j55j33n7M87J123J225Q99P72J128
$$ 487434 485937 484065 482478 481765 481575 481174 480495 480020 479865 479732 479675 480162 481285 482510 483409 484181 485309
59031D85309J760K442L035L413L661M192N220O354P081P519Q254R480J0662J1196
$$ 485309 487069 489511 492546 495959 499620 503812 509032 515386 522467 529986 538240 547720 558382 569578
59017E69578J1146J1100J1240J0833R039O177L616K121R06j088l433m622m057
$$ 569578 580724 591824 603064 613897 622936 629113 632729 634850 635756 634668 631235 626613 622556
59004F22556k763j999j974k031j544l10J346K668L076K871K892L413L875L781
$$ 622556 619793 617794 615820 613789 612245 611935 613281 615949 619025 621896 624788 628201 632076 635857
58990F35857L312K872K513K069J485P88j8q36j538k105k456k203r64J084L302
$$ 635857 639169 642041 644554 646623 648108 648896 648878 648042 646504 644399 641943 639740 638776 639860 643162
58975F43162N136O350O988P520Q666J0571J2412J3324J3348J2937J2098J0955
$$ 643162 648298 654648 661636 669156 677822 688393 700805 714129 727477 740414 752512 763467
58963G63467J0473J1365J2547J2105R807P344N914M936L416J225j469m783q389
$$ 763467 773940 785305 797852 809957 819764 827108 833022 837958 841374 842599 841130 836347 827958
58950H27958j1269j2864j3736j4499j4985j5001j4918j4884j4265j2724j1027
$$ 827958 816689 803825 790089 775590 760605 745604 730686 715802 701537 688813 677786
58939F77786j0070r692r152q201o989n568m113l040k313j220M98J916K059J207
$$ 677786 667716 658024 648872 640671 633682 628114 624001 620961 618648 617428 617926 619842 621901 623108
58925F23108L68k8j73j39J20L26J88r9j91j86l97q68j461k037k174j362J44J257
$$ 623108 623476 623448 623275 623136 623256 623582 623770 623671 623480 623294 622897 622029 620568 618531 616357 614995 615139 616396
58907F16396J447J560K660M648O716Q510J0062J1212J1919J2654J3619J4038J3153
$$ 616396 617843 619403 622063 626711 633427 641937 651999 663211 675130 687784 701403 715441 728594
58894G28594J1545J0452J0187J0185J0395J1448J3429J5520J7003J7842J8131
$$ 728594 740139 750591 760778 770963 781358 792806 806235 821755 838758 856600 874731
58883H74731J7726J6623J5113J3325J1180Q786O467M259J887o72l071n085o825
$$ 874731 892457 909080 924193 937518 948698 957484 963951 968210 970097 969425 966354 961269 954444
58870I54444q408r762j0787j1393j1378j0599r292q013p247p166p568p921p809
$$ 954444 946036 936274 925487 914094 902716 892117 882825 874812 867565 860399 852831 844910 837101
58857H37101p512p829q975j0151j0534j0317j0219j0388j0440j0222r895r437
$$ 837101 829589 821760 812785 802634 792100 781783 771564 761176 750736 740514 730619 721182
58845G21182q754q137q024q281q332p985p641p615p804q035q311q619q773q556
$$ 721182 712428 704291 696267 687986 679654 671669 664028 656413 648609 640574 632263 623644 614871 606315
58831F06315p838o636n223m016l086k025o14O85J281J306J436J988K710L318L835
$$ 606315 598477 591841 586618 582602 579516 577491 576877 577562 578843 580149 581585 583573 586283 589601 593436
58816E93436M358M828N111N098M804M474M401M457M112L184K193J631J243M89
$$ 593436 597794 602622 607733 612831 617635 622109 626510 630967 635079 638263 640456 642087 643330 643819
58802F43819n82j538k374l536n118o613p467p528o984o216n728n792o161o356
$$ 643819 643237 641699 639325 635789 630671 624058 616591 609063 602079 595863 590135 584343 578182 571826
58788E71826o203n780n025l777k199p36L95J384K436L386L883L878L841M350N341
$$ 571826 565623 559843 554818 551041 548842 548106 548501 549885 552321 555707 559590 563468 567309 571659 577000
58773E77000N890M979K541n42l358n544p022p723p756p412o824o006n238m818
$$ 577000 582890 587869 590410 589868 586510 580966 573944 566221 558465 551053 544229 538223 532985 528167
58759E28167m394l288j714q31j165j762j490m92L74R19J576K342K700K503K203
$$ 528167 523773 520485 518771 517940 516775 515013 513523 513031 513405 514324 515900 518242 520942 523445 525648
58744E25648K198K436K699K897L088L455M122M853N223N220N294N632N890N887
$$ 525648 527846 530282 532981 535878 538966 542421 546543 551396 556619 561839 567133 572765 578655 584542
58730E84542N940O110N803M631L170K256K001K060K411L229M316N226N690N602
$$ 584542 590482 596592 602395 607026 610196 612452 614453 616513 618924 622153 626469 631695 637385 642987
58716F42987N014M524N027O521P752P680O751O056N787N320M291K798Q79j412
$$ 642987 648001 652525 657552 664073 671825 679505 686256 692312 698099 703419 707710 710508 711387 709975
58702G09975l701n760p921j0393j2639j4105j5075j6049j6785j6802j6342j5856
$$ 709975 706274 700514 692593 682200 669561 655456 640381 624332 607547 590745 574403 558547
58690E58547j4994j3164j0729q677p311o285n599n457n315m374k962k383l126
$$ 558547 543553 530389 519660 510983 503672 497387 491788 486331 481016 476642 473680 471297 468171
58677D68171m220m523l827k564j191p9O22J196J928K614L052L681N017O681P823
$$ 468171 463951 459428 455601 453037 451846 451767 452389 453585 455513 458127 461179 464860 469877 476558 484381
58662D84381Q349Q731Q857Q064O261M001J499j309l759m797m539m320m796n195
$$ 484381 492730 501461 510318 518382 524643 528644 530143 528834 525075 520278 515739 511419 506623 501428
58648E01428m897m557m833n073m294k802j814j756j949j784j360r00k83N09R86
$$ 501428 496531 491974 487141 482068 477774 474972 473158 471402 469453 467669 466309 465409 465126 465635 466621
58633D66621P14P4qQ17J839K139J663J054O76L97K11M03R30J342J518J840K438
$$ 466621 467335 467409 467401 468218 470057 472196 473859 474913 475589 475986 476197 476600 477530 478872 480390 482230 484668
58616D84668K949L261L693M199M232L860L947M656M900M043L044K851K772J758
$$ 484668 487617 490878 494571 498770 503002 506862 510809 515465 520365 524408 527452 530303 533075 534833
58602E34833L80p8J78j70j241j781j235m93l14l95l08k18k85j97L28J293K691
$$ 534833 535213 535135 535313 535143 533902 532121 530886 530393 530079 529684 529376 529158 528873 528676 529004 530297 532988
58585E32988M433O016O959P466P964Q290Q129P937Q362R013Q867P802O671O028
$$ 532988 537421 543437 550396 557862 565826 574116 582245 590182 598544 607557 616424 624226 630897 636925
58571F36925N819O214P553R406J0818J1544J2186J3082J4054J5231J7029J9223
$$ 636925 642744 648958 656511 665917 676735 688279 700465 713547 727601 742832 759861 779084
58559G79084K1057K2303K3227K3509K2282J9387J5650J1765P831M024P82j835
$$ 779084 800141 822444 845671 869180 891462 910849 926499 938264 946095 950119 950901 949066
58547I49066m097n881o844p262p843q664r236r519j0079j1205j2751j4666j6841
$$ 949066 944969 939088 932244 924982 917139 908475 899239 889720 879641 868436 855685 841019 824178
58534H24178j8585j9224j9009j8570j7831j6389j4567j2887j1094q825o785n770
$$ 824178 805593 786369 767360 748790 730959 714570 700003 687116 676022 667197 660412 654642
58522F54642n068l473j523q41j493j934j617j620k450l128k982k618k536k353
$$ 654642 649574 646101 644578 643737 642244 640310 638693 637073 634623 631495 628513 625895 623359 621006
58508F21006j918j734j769j302l54P2l13n50r9L64J93l83j077j835k105j150N44
$$ 621006 619088 617354 615585 614283 613929 614001 613688 613138 613039 613403 613596 613213 612136 610301 608196 607046 607590
58491F07590J587J595J481J723J922K205L260M721N372N303O019P908R592J0323
$$ 607590 609177 610772 612253 613976 615898 618103 621363 626084 631456 636759 642778 650686 660278 670601
58477F70601J1076J2513J3778J4181J4215J3999J2577R760O881M664K062j682
$$ 670601 681677 694190 707968 722149 736364 750363 762940 772700 779581 784245 786307 784625
58465G84625n446p827q792q751p613n797m491l806k245Q62M056N955P139Q589
$$ 784625 779179 771352 762560 753809 746196 740399 735908 732102 729857 730719 734775 740730 747869 756458
58451G56458R919J0436J0369R764P787M453J397m88k538n860r157j0629j0530
$$ 756458 766377 776813 787182 796946 804733 809186 810583 810095 807557 801697 792540 781911 771381
58438G71381r966q739o354l891k742k403j471O1J253K095L172M219M776N458O961
$$ 771381 761415 752676 746322 742431 739689 737286 735815 735876 737129 739224 742396 746615 751391 756849 763810
58423G63810Q516R010Q870R193R637Q981P147N085L043N67k087m112n429o532
$$ 763810 772326 781336 790206 799399 809036 818017 825164 830249 833292 833859 831772 827660 822231 815699
58409H15699p319p307o699o135n699n168m781m775m575l451j620R1J254J866J966
$$ 815699 808380 801073 794374 788239 782540 777372 772591 767816 763241 759790 758170 758261 759515 761381 763347
58394G63347J895K209K836L039K739K799L504L945L607L256L476L645L294L175
$$ 763347 765242 767451 770287 773326 776065 778864 782368 786313 789920 793176 796652 800297 803591 806766
58380H06766L973N190O201P145P896P609O207M911M286L432K029J441K570M270
$$ 806766 810739 815929 822130 829275 837171 844780 850987 855898 860184 863616 865645 867086 869656 873926
58366H73926N292O077P249Q103Q124Q342R523J0623J0706J0696J1495J2034J1101
$$ 873926 879218 885295 892544 900647 908771 917113 926636 937259 947965 958661 970156 982190 993291
58353I93291R581Q876Q554P487O024N053M229K982K075K349L189L911N269P739
$$ 993291 1002872 1011748 1020302 1027789 1033813 1038866 1043095 1046077 1048152 1050501 1053690 1057601 1062870 1070609
58339A070609R880J0401J0397J1437J2853J3105J2485J2356J2834J3299J4090
$$ 1070609 1080489 1090890 1101287 1112724 1125577 1138682 1151167 1163523 1176357 1189656 1203746
58328A203746J5611J6849J6654J5457J4152J2538J0499R062Q662Q014O411N252
$$ 1203746 1219357 1236206 1252860 1268317 1282469 1295007 1305506 1314568 1323230 1331244 1337655 1342907
58316A342907N571O157O118O873R295J1294J0975J0001J0891J3049J4414J5085
$$ 1342907 1348478 1354635 1360753 1367626 1376921 1388215 1399190 1409191 1420082 1433131 1447545 1462630
58304A462630J6226J7264J7344J7749J9655K1275K0500J8652J8375J9398J9807
$$ 1462630 1478856 1496120 1513464 1531213 1550868 1572143 1592643 1611295 1629670 1649068 1668875
58293A668875J9814K0825K2220K2541K2492K3512K4804K5014K5239K7093K9496
$$ 1668875 1688689 1709514 1731734 1754275 1776767 1800279 1825083 1850097 1875336 1902429 1931925
58282A931925L0675L1496L3434L5338L5752L6300L8881M1819M2894M3793M7133
$$ 1931925 1962600 1994096 2027530 2062868 2098620 2134920 2173801 2215620 2258514 2302307 2349440
58271B349440N1307N3128N3453N5125N7359N7497N6650N8031O1064O2715O3441
$$ 2349440 2400747 2453875 2507328 2562453 2619812 2677309 2733959 2791990 2853054 2915769 2979210
58260B979210O6246P0776P3935P5604P8298Q1899Q4042Q5079Q7393R0537R2249
$$ 2979210 3045456 3116232 3190167 3265771 3344069 3425968 3510010 3595089 3682482 3773019 3865268
58249C865268R3440R6932J02179J06505J10459J16629J24336J31018J37506J46352
$$ 3865268 3958708 4055640 4157819 4264324 4374783 4491412 4615748 4746766 4884272 5030624
58239E030624J56438J64972J73091J83555J95003K04780K15055K29372K45658
$$ 5030624 5187062 5352034 5525125 5708680 5903683 6108463 6323518 6552890 6798548
58230F798548K60008K74603K93949L16120L36436L57102L83814M15285M46122
$$ 6798548 7058556 7333159 7627108 7943228 8279664 8636766 9020580 9435865 9881987
58221I881987M77868N16633N61871O08488O58364P18207P87754Q62061R43924
$$ 9881987 10359855 10876488 11438359 12046847 12705211 13423418 14211172 15073233 16017157
58212A6017157J041467J155199J280983J424285J597313J803960K042878K323824
$$ 16017157 17058624 18213823 19494806 20919091 22516404 24320364 26363242 28687066
58204B8687066K664761L075372L561937M145900M856508N707084O703018P874295
$$ 28687066 31351827 34427199 37989136 42135036 46991544 52698628 59401646 67275941
58196F7275941R276673J0961708J2970383J5347391J8120337K1261101K4697811
$$ 67275941 76552614 87514322 100484705 115832096 133952433 155213534 179911345
58189A79911345K8325628L1876168L4696649L5733521L3887024K8508939J9695134
$$ 179911345 208236973 240113141 274809790 310543311 344430335 372939274 392634408
58182C92634408Q298689m211464j6039496k5559080l1832853l4791628l4976840
$$ 392634408 400933097 396721633 380682137 355123057 323290204 288498576 253521736
58175B53521736l3149715l0068853k6417346k2727997j9313619j6297316j3711102
$$ 253521736 220372021 190303168 163885822 141157825 121844206 105546890 91835788
58168I1835788j1549354r765862q288694p060382o046031n208352m503895l904956
$$ 91835788 80286434 70520572 62231878 55171496 49125465 43917113 39413218 35508262
58160C5508262l401453k979486k617663k304437k039547j816947j622875j451326
$$ 35508262 32106809 29127323 26509660 24205223 22165676 20348729 18725854 17274528
58152A7274528j305361j182038j070665r67028q75575p96343p22499o52015n89695
$$ 17274528 15969167 14787129 13716464 12749436 11873861 11077518 10355019 9703004 9113309
58143I113309n36198m86246m39043l99859l69845l43991l20328l01732k87485
$$ 9113309 8577111 8090865 7651822 7251963 6882118 6538127 6217799 5916067 5628582
58134E628582k72238k54637k38584k24851k09743j93024j79090j68982j58855
$$ 5628582 5356344 5101707 4863123 4638272 4428529 4235505 4056415 3887433 3728578
58125C728578j47434j37690j30139j21730j12433j05845j02134r7188q9922q3807
$$ 3728578 3581144 3443454 3313315 3191585 3079152 2973307 2871173 2773985 2684063 2600256
58115B600256q0116p6190p1498o8821o8082o5441o0106n5934n4599n3061m9663
$$ 2600256 2520140 2443950 2372452 2303631 2235549 2170108 2110002 2054068 1999469 1946408 1896745
58104A896745m6945m6367m5573m3088m0880m0117l8866l5910l2885l0950k9256
$$ 1896745 1849800 1803433 1757860 1714772 1673892 1633775 1594909 1558999 1526114 1495164 1465908
58093A465908k7898k8386l0082l0181k8315k7138k7490k7122k5268k4079k4317
$$ 1465908 1438010 1409624 1379542 1349361 1321046 1293908 1266418 1239296 1214028 1189949 1165632
58082A165632k3879k2021k0957k1814k2795k2769k2879k3223k1851j8620j6318
$$ 1165632 1141753 1119732 1098775 1076961 1054166 1031397 1008518 985295 963444 944824 928506
58071I28506j6314j6575j5607j4824j5299j5549j4454j3321j3183j2822j1259
$$ 928506 912192 895617 880010 865186 849887 834338 819884 806563 793380 780558 769299
58060G69299r690r288r390r183r006q991q643q508r815j1812j2135j0490r099
$$ 769299 759609 750321 740931 731748 722742 713751 705108 696600 686785 674973 662838 652348 643249
58047F43249q900q326o730n818o436o920o034m877m602m735m960n958p406p732
$$ 643249 634349 626023 619293 613475 607039 600119 594085 589208 584606 579871 574911 568953 561547 553815
58033E53815o889o776p843q193p098o516p589q603q081p237p507q011p550o842
$$ 553815 546926 540150 532307 524114 517016 510500 502911 494308 486227 478990 471483 463472 455922 449080
58019D49080o957p251o728n843n443n322n069m884m625l662k457k450l645m311
$$ 449080 442123 434872 428144 422301 416858 411536 406467 401583 396958 393296 390839 388389 384744 380433
58005C80433l774l334l557l185j780r78j688k470k134j694k128k430j643q25j137
$$ 380433 376659 373325 369768 366583 364803 363825 362137 359667 357533 355839 353711 351281 349638 348813 347676
57990C47676j766j524r28r54j257j212j288j830j925j001j70m63j121j149j145
$$ 347676 345910 344386 343458 342504 341247 340035 338747 336917 334992 333991 333821 333358 332237 331088 329943
57975C29943k008l039l009k106j421j229j108r31p25k93K38L42J63N34J415J649
$$ 329943 327935 324896 321887 319781 318360 317131 316023 315092 314367 314074 314312 314654 314817 315351 316766 318415
57959C18415Q44J5k69p05j565j904j372j041j469j707j255j182k135k979k650
$$ 318415 319259 319274 319005 318300 316735 314831 313459 312418 310949 309242 307987 306805 304670 301691 299041
57944B99041j694p38P31K750L877L416K979M122O023P109P531Q182Q597P842O363
$$ 299041 297347 296609 297340 300090 303967 307383 310362 314484 320507 327616 335147 343329 351926 359768 366131
57929C66131N193M142K463M48j116k193k909k848k279k804n086p126o717m641
$$ 366131 371324 375466 377929 378377 377261 375068 372159 369311 367032 364228 359142 352016 345299 340658
57915C40658l544m267n243n041l705j794K35J724K111J583O41n77j821k329j861
$$ 340658 337114 332847 327604 322563 318858 317064 317299 319023 321134 322717 323358 322781 320960 318631 316770
57900C16770j441k004l034l478l318l194l195l013k659k129j128J15O69M18N18
$$ 316770 315329 313325 310291 306813 303495 300301 297106 294093 291434 289305 288177 288292 288961 289379 289897
57885B89897J419J758N44q65o45P04J234M08o71j317j791k164k191k127k350k416
$$ 289897 291316 293074 293618 292753 292108 292812 294046 294454 293783 292466 290675 288511 286320 284193 281843 279427
57869B79427j704o34r5n2J25M21L90K48N42J095J379J541K058K802L362L814M142
$$ 279427 277723 277089 276994 276942 277067 277488 277878 278126 278668 279763 281142 282683 284741 287543 290905 294719 298861
57852B98861L589J707n03j659j698j448j188q39q99j818k927l290l235l687m463
$$ 298861 302450 304157 303654 301995 300297 298849 297661 296822 295923 294105 291178 287888 284653 280966 276503
57837B76503m574l938l359l077k643k091j923k002j684j061q78j210j281o50L11
$$ 276503 271929 267991 264632 261555 258912 256821 254898 252896 251212 250151 249273 248063 246782 246132 246443
57822B46443J122J588J587J213J016J390J949K103J916J735J392N36p30k202l975
$$ 246443 247565 249153 250740 251953 252969 254359 256308 258411 260327 262062 263454 263990 263260 261058 257083
57807B57083n819o839o585n762n017l939k253r23q04j041l84P02Q69K74L03J326
$$ 257083 251264 244425 237840 232078 227061 223122 220869 219946 219142 218101 217717 218419 219288 219562 219865 221191
57791B21191K371K886L202L350K999K552K808L508L602K995K603K656K443J870
$$ 221191 223562 226448 229650 233000 235999 238551 241359 244867 248469 251464 254067 256723 259166 261036
57777B61036J775K375K797K535K073J757J232M19j56m91j398l072m437m559l913
$$ 261036 262811 265186 267983 270518 272591 274348 275580 275999 275843 275352 273954 270882 266445 261886 257973
57762B57973l536l649l718l400k828k259j840j577j380j230j185j042l45Q78J858
$$ 257973 254437 250788 247070 243670 240842 238583 236743 235166 233786 232556 231371 230329 229984 230862 232720
57747B32720K087K137K788L754M113L629K852K235J927K077K525K570J946J463
$$ 232720 234807 236944 239732 243486 247599 251228 254080 256315 258242 260319 262844 265414 267360 268823
57733B68823J722J814O05j206j861j128m34n22o57m63p84k047l185l064k019j136
$$ 268823 270545 272359 272964 271758 269897 268769 268335 267813 267156 266693 265909 263862 260677 257613 255594 254458
57717B54458q58r53j243j710k277k927l666m147l892l045k401k475l013l470l524
$$ 254458 253600 252647 251404 249694 247417 244490 240824 236677 232785 229740 227339 224864 221851 218381 214857
57702B14857l077k269j504j047o71j28L05L43L46P27J043N75n13j445j991k389
$$ 214857 211780 209511 208007 206960 206289 206161 206466 206809 207155 207882 208925 209500 208987 207542 205551 203162
57686B03162k399j610n04jk4L55J389K524L798O002R148J2196J4651J7303K0906
$$ 203162 200763 199153 198649 198648 198624 198979 200368 202892 206690 212692 221840 234036 248687 265990 286896
57671B86896K5243L0027L5658M2276M8850N3714N5298N1941M2039K5378M132j7779
$$ 286896 312139 342166 377824 420100 468950 522664 577962 629903 671942 697320 701452 683673
57659F83673l6278m8465n3542n3007m9355m4256l8222l1736k5755k0899j7032
$$ 683673 647395 598930 545388 492381 443026 398770 360548 328812 303057 282158 265126
57648B65126j3844j1184q794o516m823m271m358l908k697j617j158q21k95l1j70
$$ 265126 251282 240098 231304 224788 219965 215694 211336 207428 204731 203114 201956 201135 200840 200809 200639
57633B00639o7N71J061Q43L37J12K5k49o08r62j506k152k416k285k334k631k461
$$ 200639 200572 201143 202204 203047 203384 203496 203521 203272 202664 201702 200196 198044 195628 193343 191009 188378 185917
57616A85917j643j032j146j273p65k46n83j421j743j400j141j465k172k762k710
$$ 185917 184274 183242 182096 180823 180058 179812 179229 177808 176065 174665 173524 172059 169887 167125 164415
57601A64415j793n92k01q47j467j180n41n17r77j156j166j810l056l788l303k258
$$ 164415 162622 162030 161829 160982 159515 158335 157794 157277 156300 155144 153978 152168 149112 145324 142021 139763
57585A39763j754k009k331k084j325n84k02j29l41j046k186k958k558j284l33
$$ 139763 138009 136000 133669 131585 130260 129676 129474 129345 129004 127958 125772 122814 120256 118972 118639
57570A18639l54q21r98r06j027j505k036k188j703p94j59k68o80n77M2M33L82
$$ 118639 118285 117464 116466 115560 114533 113028 110992 108804 107101 106307 106148 105880 105200 104623 104665 105098 105480
57553A05480M93J115J796K099K158K063J461K97q15j358j455j322q53j13M87R16
$$ 105480 105973 107088 108884 110983 113141 115204 116665 116962 116147 114789 113334 112012 111159 111046 111533 112449
57537A12449J687K801L354K715J460N02k4l98m74m2M95N63J94j58l99p44j183
$$ 112449 114136 116937 120291 123006 124466 124968 124944 124546 124072 124030 124525 125088 125282 125124 124725 123981 122798
57520A22798j391j057j15J073J699J276M93N97J660K354J794P04J85K46L19M17
$$ 122798 121407 120350 120235 121308 123007 124283 124776 125373 127033 129387 131181 131885 132070 132316 132635 133052
57504A33052P66R52M26m59q46o42n72j103j933k499k508k101j798k092k795l091
$$ 133052 133818 134770 135196 134737 133891 133249 132677 131574 129641 127142 124634 122533 120735 118643 115848 112757
57488A12757k522j483n34K23P66Q56N80N19Q37Q46J18p01q33n40n61r37j279j665
$$ 112757 110235 108752 108218 108441 109207 110063 110643 111162 111999 112845 112963 112262 111429 110889 110328 109391 108112 106447
57470A06447k346k894k622j679q72n09k05K59N59L71k64j035j441r98J54J090
$$ 106447 104101 101207 98585 96906 96034 95525 95320 95579 96138 96509 96245 95210 93769 92771 92925 94015
57454I4015J066L48l21p18j034j187r60o42p60j267j579j302n16N60J659K405
$$ 94015 95081 95429 95108 94390 93356 92169 91209 90567 89807 88540 86961 85659 85143 85703 87362 89767
57438H9767K573K316J872J303P75O38Q29P33O6n79o63n68q55j214r44j00O43J053
$$ 89767 92340 94656 96528 97831 98606 99244 100073 100806 100872 100293 99630 99062 98207 96993 96049 95949 96592 97645
57420I7645J381J624J480R88M73Jm82o62j63P20J258J152O64N9m76n73l0P27J071
$$ 97645 99026 100650 102130 103118 103591 103592 103110 102448 102285 103005 104263 105415 106079 106138 105662 105089 105059 105786 106857
57401A06857R65P69M78j71r83j344j006l16K95N97N13K41K61P94J455J789J878
$$ 106857 107822 108591 109069 108898 107915 106571 105565 105249 105544 106141 106654 106895 107156 107950 109405 111194 113072
57384A13072K030K228K401K796L526M080L870K924J594O1j318j830j282n02k09
$$ 113072 115102 117330 119731 122527 126053 130133 134003 136927 138521 138582 137264 135434 134152 133650 133441
57369A33441oO63J241Q24k82r88j031r49p92j58O68R25P11Q29J355J568J365J462
$$ 133441 133435 134098 135339 136163 135881 134893 133862 132913 132121 131963 132631 133556 134267 135096 136451 138019 139384 140846
57351A40846J996K243J991J888K140K069J451J063J263J296O46pQK02n0k59L28
$$ 140846 142842 145085 147076 148964 151104 153173 154624 155687 156950 158246 158892 158885 158893 159095 159045 158786 159114
57334A59114J244J427R88J206K627M107M126K563P47m8J63M54L40L37J014J987
$$ 159114 160358 161785 162773 163979 166606 170713 174839 177402 178149 178101 178264 178718 179058 179395 180409 182396
57318A82396K350J895J291J159J485J947K256K200J841J658J984K424K415K125
$$ 182396 184746 186641 187932 189091 190576 192523 194779 196979 198820 200478 202462 204886 207301 209426
57304B09426K105K280K118J813K216L491M775N434N753O019N911N269M709M836
$$ 209426 211531 213811 215929 217742 219958 223449 228224 233658 239411 245430 251341 256610 261319 266155
57290B66155N423N875N969N699M982M099L818M520N536N923N613N298N449N897
$$ 266155 271578 277453 283422 289121 294103 298202 302020 306540 312076 317999 323612 328910 334359 340256
57276C40256O277O465O603O878P235P304O844O152N770N836O091O368O636O739
$$ 340256 346533 352998 359601 366479 373714 381018 387862 394014 399784 405620 411711 418079 424715 431454
57262D31454O684O974P971R063R357R072R290J0264J1111J1413J1870J2842J3474
$$ 431454 438138 445112 453083 462146 471503 480575 489865 500129 511240 522653 534523 547365 560839
57249E60839J3075J2396J2532J3306J3710J3490J3298J3626J4345J5150J5725
$$ 560839 573914 586310 598842 612148 625858 639348 652646 666272 680617 695767 711492
57238G11492J5696J5086J4625J4990J5971J6850J7353J7686J7944J8087J8347
$$ 711492 727188 742274 756899 771889 787860 804710 822063 839749 857693 875780 894127
57227H94127J9039K0030K0822K1184K1262K1264K1355K1713K2339K3005K3620
$$ 894127 913166 933196 954018 975202 996464 1017728 1039083 1060796 1083135 1106140 1129760
57216A129760K4440K5590K6705K7518K8497L0339L2939L5363L6846L7426L7682
$$ 1129760 1154200 1179790 1206495 1234013 1262510 1292849 1325788 1361151 1397997 1435423 1473105
57205A473105L8135L8919L9707L9976L9499L8565L7577L6639L5601L4362L2983
$$ 1473105 1511240 1550159 1589866 1629842 1669341 1707906 1745483 1782122 1817723 1852085 1885068
57194A885068L1704L0935L0933L1445L2009L2625L3680L5106L6199L6584L6780
$$ 1885068 1916772 1947707 1978640 2010085 2042094 2074719 2108399 2143505 2179704 2216288 2253068
57183B253068L7441L8515L9573M0469M1156M1350M0896M0176L9624L9183L8735
$$ 2253068 2290509 2329024 2368597 2409066 2450222 2491572 2532468 2572644 2612268 2651451 2690186
57172B690186L8606L9059L9679L9950M0168M0967M2079M2409M1448L9875L8569
$$ 2690186 2728792 2767851 2807530 2847480 2887648 2928615 2970694 3013103 3054551 3094426 3132995
57161C132995L7559L6369L4893L3578L2740L2038L0687K8265K5195K2246J9595
$$ 3132995 3170554 3206923 3241816 3275394 3308134 3340172 3370859 3399124 3424319 3446565 3466160
57150C466160J6672J3046R010N084J404j928m317n075m182k094J063N475J0854
$$ 3466160 3482832 3495878 3504888 3509972 3511376 3509448 3505131 3500056 3495874 3493780 3494843 3500318 3511172
57137C511172J6257K0839K4417K7033K8427K8242K6605K4197K1673J9175J6524
$$ 3511172 3527429 3548268 3572685 3599718 3628145 3656387 3682992 3707189 3728862 3748037 3764561
57126C764561J3859J1789J0804J0832J1771J4144J8489K4123K9269L2791L5242
$$ 3764561 3778420 3790209 3801013 3811845 3823616 3837760 3856249 3880372 3909641 3942432 3977674
57115C977674L7901M1518M6494N3506O3122P5099Q8898J04589J22589J42871J65543
$$ 3977674 4015575 4057093 4103587 4157093 4220215 4295314 4384212 4488801 4611390 4754261 4919804
57104D919804J92203K25720K68321L20710L83407M58279N48125O55151P80242
$$ 4919804 5112007 5337727 5606048 5926758 6310165 6768444 7316569 7971720 8751962
57095H751962R23191J082882J257183J443137J637189J834708K028935K210474
$$ 8751962 9675153 10758035 12015218 13458355 15095544 16930252 18959187 21169661
57087B1169661K367847K488528K559899K570584K512704K384329K190414J940732
$$ 21169661 23537508 26026036 28585935 31156519 33669223 36053552 38243966 40184698
57079D0184698J645110J308216R27687M98592K3081m81596r84119j449348j849535
$$ 40184698 41829808 43138024 44065711 44564303 44587384 44105788 43121669 41672321 39822786
57070C9822786k168370k398315k537610k590388k567213k483046k353750k193875
$$ 39822786 37654416 35256101 32718491 30128103 27560890 25077844 22724094 20530219
57062B0530219k016134j831324j648183j473339j311214j163921j031878r14992
$$ 20530219 18514085 16682761 15034578 13561239 12250025 11086104 10054226 9139234
57054I139234q13153p25567o50257n84754n27078m75883m30151l89176l52634
$$ 9139234 8326081 7600514 6950257 6365503 5838425 5362542 4932391 4543215 4190581
57045D190581l20204k91303k65289k41694k20072j99894j80762j62483j44922
$$ 4190581 3870377 3579074 3313785 3072091 2852019 2652125 2471363 2308880 2163958
57036B163958j28080j12241r7433q2843o7422n1028l4236j7066P71J7882L0508
$$ 2163958 2035878 1923637 1826204 1743361 1675939 1624911 1590675 1573609 1574380 1592262 1622770
57025A622770L4650K8256J1270j4818m6113p6063r8032j08664j08664j01040q9474
$$ 1622770 1657420 1685676 1696946 1682128 1636015 1559952 1461920 1353256 1244592 1143552 1054078
57014A054078p7395o6873n7978m9891m2507l6358l1463k7256k3525k0503j8108
$$ 1054078 976683 909810 851832 801941 759434 723076 691613 664357 640832 620329 602221
57003F02221j5948j3910j2059j0118p870n877m955n002n163m959m487l693k428
$$ 602221 586273 572363 560304 550186 542316 536439 531484 526482 521319 516360 511873 508180 505752
56990E05752j050p7P54K114L909N369O240O812O741M960J120l866q930j3582j7352
$$ 505752 504702 504625 505379 507493 511402 516771 523011 529823 536564 541524 542644 538778 529848 516266 498914
56975D98914j9549k0049j9474j8237j6144j3297j0527q384o478m361k362q93M69
$$ 498914 479365 459316 439842 421605 405461 392164 381637 373253 366775 362414 360052 359159 359628
56962C59628K495N222P993J0393J2581J4687J6171J5928J3071P798J382m893j0571
$$ 359628 362123 367345 375338 385731 398312 412999 429170 445098 458169 465967 467349 462456 451885
56949D51885j5532j9103k0387j9340j6873j3921j1012q472o264l780o39K443M591
$$ 451885 436353 417250 396863 377523 360650 346729 335717 327245 320981 317201 316562 319005 323596
56936C23596O361R173J3141J6880J9665K2162K4329K4196J9902J2013K676o555
$$ 323596 329957 339130 352271 369151 388816 410978 435307 459503 479405 491418 494094 487539
56924D87539j4978k1657k5619k6908k6362k4513k1614j8428j5966j4349j2821
$$ 487539 472561 450904 425285 398377 372015 347502 325888 307460 291494 277145 264324
56913B64324j0924r033p666o905o499o077n312m270l485l238l042k346j375p38
$$ 264324 253400 244367 236701 229796 223297 217220 211908 207638 204153 200915 197873 195527 194152 193414
56899A93414l71L64J651K997M088N161O430P736Q975J0451J2512J5146J7993K0415
$$ 193414 193043 193407 195058 198055 202143 207304 213734 221470 230445 240896 253408 268554 286547 306962
56885C06962K1543K0672J7807J3540Q363K486l519q451j1228j1794j0985r643
$$ 306962 328505 349177 366984 380524 388887 391373 387854 379403 368175 356381 345396 335753
56873C35753q070o171l748o04L278P514J1477J4991J8646K3185K8660L4514M0257
$$ 335753 327683 321512 317764 317160 320438 327952 339429 354420 373066 396251 424911 459425 499682
56860D99682M5363M8520M7843M2348L2684K0087N463r755k2780l0999l4204l4224
$$ 499682 545045 593565 641408 683756 716440 736527 741990 732235 709455 678456 644252 610028
56848F10028l2418k8680k2882j5894q711j646N207J1713J8413K6357L5644M5067
$$ 610028 577610 548930 526048 510154 501443 499797 505004 516717 535130 561487 597131 642198
56836F42198N3811O2313P0502P6163P6239O9113N4757L3770P899j8970m2110n8654
$$ 642198 696009 758322 828824 904987 981226 1050339 1105096 1138866 1146765 1127795 1085685 1027031
56824A027031o8220p1313o8568o1584n2876m4196l5686k7047j8591j0584k429
$$ 1027031 958811 887498 818930 757346 704470 660274 624588 597541 578950 568366 565937
56813E65937O500J5690K3985L1114L7944M4979N1061N3723N0708M1063K5364N518
$$ 565937 572437 588127 612112 643226 681170 726149 777210 830933 881641 922704 948068 953586
56801I53586j5449l4167m8208n6844o0408n9387n4653m8043m1478l5315k8604
$$ 953586 938137 903970 855762 798918 738510 679123 624470 576427 534949 499634 471030
56790D71030k1217j4568r537m958P49P320J3277J8117K2426K6037K7556K5869
$$ 471030 449813 435245 425708 420750 421499 428819 442096 460213 482639 508676 536232 562101
56778E62101K1040J3506L583p838j8935k7852l3550l5852l5355l3384l1243k9167
$$ 562101 583141 596647 600230 592392 573457 545605 512055 476203 440848 407464 376221 347054
56766C47054k6557k3266j9939j7079j4585j2433j0904r844q593p034n950n814
$$ 347054 320497 297231 277292 260213 245628 233195 222291 212447 203854 196820 190870 185056
56754A85056n991n693n053m584m133l253k182j638j725j786j360p13l45l65n10
$$ 185056 179065 173372 168319 163735 159602 156349 154167 152529 150804 149018 147658 146945 146600 146235 145725
56739A45725n14l61k41l05m75o36q84j326j644j312m07K71J20n36r41p88k98K59
$$ 145725 145211 144850 144609 144304 143829 143193 142309 140983 139339 138027 137620 137891 138011 137475 136534 135746 135448 135707
56721A35707O99Q46O85N41P08J038J207J259J557K141K548K358J722J165J012
$$ 135707 136406 137252 137937 138478 139186 140224 141431 142690 144247 146388 148936 151294 153016 154181 155193
56706A55193J140J288J430J682J907J673P66m32j316j589j290m98N20J159R35
$$ 155193 156333 157621 159051 160733 162640 164313 165079 164647 163331 161742 160452 159954 160474 161633 162568
56691A62568J42n10q39j188j513j216j78P38P37Q4m15m35j49L27Q73J035N13j91
$$ 162568 162710 162200 161361 160173 158660 157444 157266 158004 158741 158825 158410 157975 157826 158153 159026 160061 160574 160383
56673A60383k86K38O00L02l82r63j191r32j37Q22J339J331J347J724K053J858
$$ 160383 160097 160335 160935 161237 160855 159892 158701 157769 157632 158454 159793 161124 162471 164195 166248 168106
56657A68106J343J078J220J487J681J764J587J047M38J98K35Pn78q78l58N62R37
$$ 168106 169449 170527 171747 173234 174915 176679 178266 179313 179751 179949 180184 180191 179613 178735 178377 178939 179876
56640A79876M05m92r72p52j19M60P00O44N44N39N31L68P5k25m66n38k38M29R87
$$ 179876 180281 179789 178817 178065 177946 178406 179106 179750 180294 180833 181364 181732 181807 181582 181116 180578 180340 180769 181756
56621A81756Q79Q7q52j406j409j029p16j060k119k991k608j114K02M76J44r1l72
$$ 181756 182635 182722 181870 180464 179055 178026 177310 176250 174131 171140 168532 167418 167620 168096 168240 168149 167777
56604A67777j088j794j622n78L97P00O82Q59J132J116P80M29K48J69J00J11L68
$$ 167777 166689 164895 163273 162695 163092 163792 164474 165333 166465 167581 168361 168790 169038 169207 169307 169418 169786
56587A69786Q73J348J438J119O98L22j92r04j329r19K45J431J941J589P93L38
$$ 169786 170659 172007 173445 174564 175262 175584 175392 174488 173159 172240 172485 173916 175857 177446 178239 178577
56571A78577Q24J969K730K481J862K014L204M647N600O128O744P782R088J0152
$$ 178577 179401 181370 184100 186581 188443 190457 193661 198308 203908 210036 216780 224562 233650 243802
56557B43802J0507J0172R517Q533O704L955J275k90r06j458k096k218j728j345
$$ 243802 254309 264481 273998 282531 289235 293190 294465 294175 293269 291811 289715 287497 285769 284424
56543B84424j488j756j796j899k327k775k870k722k513k131j600j455k139l305
$$ 284424 282936 281180 279384 277485 275158 272383 269513 266791 264278 262147 260547 259092 256953 253648
56529B53648m136m181l643k994k560k323k018j474r10o95r06j352j865k227k085
$$ 253648 249512 245331 241688 238694 236134 233811 231793 230319 229409 228714 227808 226456 224591 222364 220279
56514B20279j445j048j537k396k484j619p51m85m20k04k64q63j364j057k34K70
$$ 220279 218834 217786 216249 213853 211369 209750 208999 208514 208094 207890 207626 206763 205399 204342 204108 204378
56498B04378J06m91j216j694j458n25L59N41K65J93M62P33Q52R67J130J198J008
$$ 204378 204484 203993 202777 201083 199625 199100 199459 200000 200265 200458 200920 201653 202505 203472 204602 205800 206808
56481B06808M33n13j480j968j873j465q23J73J160J432R88O80Q96R61M10o7L00
$$ 206808 207241 206728 205248 203280 201407 199942 199119 199292 200452 201884 202872 203552 204448 205409 205819 205752 206052
56464B06052J123J551J531J431J011q3j231j383n23L53P08Q77J130J240J014N30
$$ 206052 207175 208726 210257 211688 212699 212616 211385 210002 209479 209832 210540 211417 212547 213787 214801 215331
56448B15331j79r37j078q8J399K076J512N27k1l3K19M84M55K3k79J59R47J036
$$ 215331 215152 214215 213137 213049 214448 216524 218036 218563 218542 218509 218728 219212 219667 219690 219411 219570 220517 221553
56430B21553K80k50J26O63L22o86j197n73O24J276P23o36j606j333k27N00K74
$$ 221553 221833 221583 221709 222372 222694 222008 220811 220238 220862 222138 222861 222225 220619 219286 219059 219559 219833
56413B19833k73k69M01J151J319N56q54j949j810o04N69J066J326J906K492K394
$$ 219833 219560 219291 219692 220843 222162 222718 221864 219915 218105 217501 218070 219136 220462 222368 224860 227254
56397B27254J535N11n1J94J211K386K767K080J254J358K191K535J766O23J78N42
$$ 227254 228789 229300 229249 229443 230654 233040 235807 237887 239141 240499 242690 245225 246991 247614 247792 248334
56381B48334R27O83j4n13m52r9M8n3J39J083K419L123K546J156O1j58Q2J02j80
$$ 248334 249261 249944 249930 249417 248965 248866 248914 248861 249000 250083 252502 255625 258171 259327 259388 259230 259312 259414 259234
56362B59234l09l6M09P49R45J065J123J184J343J438J167N87K12M09R59J413J558
$$ 259234 258925 258889 259298 260047 260992 262057 263180 264364 265707 267145 268312 268899 269111 269520 270479 271892 273450
56345B73450J360Q41L27L88J129J873J969J678J763K428L199L710M080M412M447
$$ 273450 274810 275651 275978 276366 277495 279368 281337 283015 284778 287206 290405 294115 298195 302607 307054
56330C07054L907K931K052J803K302L149L785L950L659K841J455n8r80j127r22
$$ 307054 310961 313892 315944 317747 320049 323198 326983 330933 334592 337433 338888 338830 337850 336723 335801
56315C35801n49K64J367J883J376O22N61J085J538J856K387L045L505L877M388
$$ 335801 335252 335516 336883 338766 340142 340764 341325 342410 343948 345804 348191 351236 354741 358618 363006
56300C63006M819M988N339O162O717O111M708L651L330L347L648M431N202N296
$$ 363006 367825 372813 378152 384314 391031 397142 401850 405501 408831 412178 415826 420257 425459 430755
56286D30755N169N825P017P533P306P626Q874R801R693R664J0784J2364J3304
$$ 430755 435924 441749 448766 456299 463605 471231 480105 489906 499599 509263 520047 532411 545715
56273E45715J4017J5553J7592J8879J9247J9798K1086K2434K3328K4462K6828
$$ 545715 559732 575285 592877 611756 631003 650801 671887 694321 717649 742111 768939
56262G68939L0358L3982L6935L9581M2971M7755N3748O0508O8047P6691Q6440
$$ 768939 799297 833279 870214 909795 952766 1000521 1054269 1114777 1182824 1259515 1345955
56251A345955R6887J07727J18981J30716J42798J54880J66284J76037J83324J87844
$$ 1345955 1442842 1550569 1669550 1800266 1943064 2097944 2264228 2440265 2623589 2811433
56241B811433J89429J87572J81745J71911J58128J39925J16727Q8882N7765K5006
$$ 2811433 3000862 3188434 3370179 3542090 3700218 3840143 3956870 4045752 4103517 4128523
56231D128523p862l9344o8331r4439j17438j36598j51228j61560j68281j71575
$$ 4128523 4120661 4081317 4012986 3918547 3801109 3664511 3513283 3351723 3183442 3011867
56221C011867j71373j68232j63000j55979j47426j38412j30014j21970j13390
$$ 3011867 2840494 2672262 2509262 2353283 2205857 2067445 1937431 1815461 1702071
56212A702071j04489r6254q8708q1062p3485o7003o1650n6394n0965m6084m1708
$$ 1702071 1597582 1501328 1412620 1331558 1258073 1191070 1129420 1073026 1022061 975977 934269
56201I34269l6995l2291k9110k7546k5727k2728j9981j8723j7895j5986j3404
$$ 934269 897274 864983 835873 808327 782600 759872 739891 721168 703273 687287 673883
56190F73883j1486j0441r667q994q322p077n264m045m081m317l573k288j500j134
$$ 673883 662397 651956 642289 633295 624973 617896 612632 608587 604506 600189 596616 594328 592828 591694
56176E91694o13j61k24m03j53K80O26J320K426K992K636K587L807N303N810N923
$$ 591694 591081 590920 590696 590293 590140 590420 591046 592366 594792 597784 600420 603007 606814 612117 617927 623850
56160F23850O844Q030Q072P216P110Q391J0231J1889J3283J4326J5121J6470J8944
$$ 623850 630694 638724 646796 654012 661122 669513 679744 691633 704916 719242 734363 750833 769777
56147G69777K1941K4855K8492L3904M0597M7333N4070O1412O8752P4576P8160
$$ 769777 791718 816573 845065 878969 919566 966899 1020969 1082381 1151133 1225709 1303869
56136A303869P9379P7441P1613O2912N3465M4554L6775L1345K9223K9054K8001
$$ 1303869 1383248 1460689 1532302 1595214 1648679 1693233 1730008 1761353 1790576 1819630 1847631
56125A847631K4650J9652J3765P128M32n160r543j3766j8605k4415l2054m2139
$$ 1847631 1872281 1891933 1905698 1912826 1913258 1908098 1898555 1884789 1866184 1841769 1809715 1767576
56113A767576n3316o2965o9712p3750p4869p2166o5973n8196n0235m2116l4091
$$ 1767576 1714260 1651295 1581583 1507833 1432964 1360798 1294825 1236629 1186394 1144278 1110187
56102A110187k7399k2718j9163j5560j1806q479o017m546l754k777r91J104K572
$$ 1110187 1082788 1060070 1040907 1025347 1013541 1005062 999045 994499 990745 987968 986977 988081 990653
56089I90653L393M206N117N796O418P344Q247Q727R272J0397J1353J1143J0299
$$ 990653 994046 998252 1003369 1009165 1015583 1022927 1031174 1039901 1049173 1059570 1070923 1082066 1092365
56076A092365J0121J0635J0870J0731J0931J1468J1824J2274J3301J4218J4166
$$ 1092365 1102486 1113121 1123991 1134722 1145653 1157121 1168945 1181219 1194520 1208738 1222904
56065A222904J3959J4971J6717J7613J7749J8542J9974K0550K0097K0103K1145
$$ 1222904 1236863 1251834 1268551 1286164 1303913 1322455 1342429 1362979 1383076 1403179 1424324
56054A424324K2129K2432K2665K2968K2606K1552K0710K0339K0026K0117K1307
$$ 1424324 1446453 1468885 1491550 1514518 1537124 1558676 1579386 1599725 1619751 1639868 1661175
56043A661175K2914K3599K3640K4407K5877K6931K7897L0244L3876L7245M0071
$$ 1661175 1684089 1707688 1731328 1755735 1781612 1808543 1836440 1866684 1900560 1937805 1977876
56032A977876M3364M6817M8902M9713N0983N3030N4396N4658N4910N5377N5326
$$ 1977876 2021240 2068057 2116959 2166672 2217655 2270685 2325081 2379739 2434649 2490026 2545352
56021B545352N5499N7608O1301O4529O7089P0617P5011P8282Q0313Q3280Q7775
$$ 2545352 2600851 2658459 2719760 2784289 2851378 2921995 2997006 3075288 3155601 3238881 3326656
56010C326656R1980R5241R9070J03925J08531J12919J18634J25310J30748J35045
$$ 3326656 3418636 3513877 3612947 3716872 3825403 3938322 4056956 4182266 4313014 4448059
56000D448059J40900J49162J57896J66424J76311J87621J98395K08536K20089
$$ 4448059 4588959 4738121 4896017 5062441 5238752 5426373 5624768 5833304 6053393
55991F053393K33126K45812K58977K75748K96096L16896L38060L63009L92230
$$ 6053393 6286519 6532331 6791308 7067056 7363152 7680048 8018108 8381117 8773347
55982H773347M22404M52997M87693N27966N71626O18976O73673P36193Q03750
$$ 8773347 9195751 9648748 10136441 10664407 11236033 11855009 12528682 13264875 14068625
55973A4068625Q78199R66249J070209J187181J319547J477199J667089J890589
$$ 14068625 14946824 15913073 16983282 18170463 19490010 20967209 22634298 24524887
55965B4524887K154370K473711K862143L329211L891400M571686N383985O333759
$$ 24524887 26679257 29152968 32015111 35344322 39235722 43807408 49191393 55525152
55957E5525152P442097Q756421J0332227J2218315J4458368J7077001K0051239
$$ 55525152 62967249 71723670 82055897 94274212 108732580 125809581 145860820
55950A45860820K3314950K6771535L0196996L3028689L4274446L2774788K7723477
$$ 145860820 169175770 195947305 226144301 259172990 293447436 326222224 353945701
55943C53945701J9096305P757580m722824j6445686k5706497l1519658l3849056
$$ 353945701 373042006 380799586 376076762 359631076 333924579 302404921 268555865
55936B68555865l3389214l1099798k7843821k4264413k0788409j7646671j4916178
$$ 268555865 235166651 204066853 176223032 151958619 131170210 113523539 98607361
55929I8607361j2593325j0648822r037604p700916o585943n657402m885594m237776
$$ 98607361 86014036 75365214 66327610 58626694 52040751 46383349 41497755 37259979
55921C7259979l688239l223882k832561k496426k202227j947385j729726j540381
$$ 37259979 33571740 30347858 27515297 25018871 22816644 20869259 19139533 17599152
55913A7599152j372058j225183j100089r90880q92126q04495p28953o61992o00942
$$ 17599152 16227094 15001911 13901822 12910942 12018816 11214321 10485368 9823376 9222434
55904I222434n47730n03209m63535m25895l92193l63548l36863l10375k86976
$$ 9222434 8674704 8171495 7707960 7282065 6889872 6526324 6189461 5879086 5592110
55895E592110k68320k50976k32115k14039j99296j85983j71721j57943j46472
$$ 5592110 5323790 5072814 4840699 4626660 4427364 4241381 4069660 3911717 3765245
55886C765245j35806j24396j14052j06686j01085r6015r3146r3710r5392r5495
$$ 3765245 3629439 3505043 3390991 3284305 3183220 3087205 2994059 2900349 2804957 2709462
55876B709462r4236r2341q8566q2510p6778p3474p1155o7880o4504o2398o0589
$$ 2709462 2615226 2522885 2434319 2351809 2275031 2201557 2130402 2062522 1998018 1935620 1875031
55865A875031n7837n4959n2637m9428m4469l9698l6912l5003l2494l0354k9801
$$ 1875031 1817194 1762235 1709598 1660170 1615701 1576003 1539091 1504088 1471594 1441240 1411439
55854A411439k9614k8319k6916k6871k7376k7040k6550k7144k8115k8071k7207
$$ 1411439 1381825 1353506 1326590 1299719 1272343 1245303 1218753 1191609 1163494 1135423 1108216
55843A108216k6355k5297k3900k3189k3494k3245k1379j9209j8156j7547j6455
$$ 1108216 1081861 1056564 1032664 1009475 985981 962736 941357 922148 903992 886445 869990
55832H69990j5713j6007j5976j4339j2203j1134j0615r572q709r131j0130j0516
$$ 869990 854277 838270 822294 807955 795752 784618 774003 764431 755722 746591 736461 725945
55820G25945j0726j1500j1929j1034r908j0079j0900j0769r826r328r284q731
$$ 725945 715219 703719 691790 680756 670848 660769 649869 639100 629274 619946 610662 601931
55808F01931p532o198m712l181k492k766k420l89J999L103L418M052M294K999
$$ 601931 594399 588201 583489 580308 577816 575050 572630 572241 574240 577343 580761 584813 589107 592106
55794E92106J146N50R94R63M47N53R76L41j216k134j994k017l008m636o693r345
$$ 592106 593252 593802 594796 595759 596206 596759 597735 598076 596860 594726 592732 590715 587707 583071 576378 567033
55778E67033j2017j3554j3571j2536j0652p819m461j251J783M799P159P857O508
$$ 567033 555016 541462 527891 515355 504703 496884 492423 491172 492955 497754 504913 512770 519278
55765E19278L106k365r018j4563j7070j6734j4959j2605j0143q468q034q021p743
$$ 519278 522384 520019 511001 496438 479368 462634 447675 435070 424927 416459 408425 400404 392661
55752C92661p991r458j0847j0358q400o955o674o434n538m567m051l784l516l152
$$ 392661 384670 375212 364365 354007 345607 338652 331978 325544 320006 315439 311388 307604 304088 300936
55738C00936k342r63J92K58m87j136j450j694j794j746k206l503m739n022m907
$$ 300936 298594 297631 297823 298081 297594 296458 295008 293314 291520 289774 287568 284065 279326 274304 269397
55723B69397n308n802n464m639m289m128l082j191N59J908L334M638N140N006
$$ 269397 264089 258287 252823 248184 243895 239767 236685 235494 236053 237961 241295 245933 251073 256079
55709B56079M970M977M447L582K918J998K0k447l957m256m366m798n207n655o596
$$ 256079 261049 266026 270473 274055 276973 278971 278991 276544 272587 268331 263965 259167 253960 248305 241709
55694B41709p514p162n416l592k723k530k240j450k18Q27Q18m7r1J735M038M658
$$ 241709 234195 227033 221617 218025 215302 212772 210532 209082 208864 209691 210509 210462 210371 212106 216144 220802
55678B20802L587K559K271J908J106N27L37r9q67j327j364j409j269n16J94j77
$$ 220802 224389 226948 229219 231127 232233 232760 233097 232998 232131 230804 229440 228031 226762 226246 226440 226263
55662B26263j126j163k93j4p46j238q74n02m83J35J651K754K487J642J307J333
$$ 226263 225137 223974 223681 223667 222921 221683 220809 220307 219824 219959 221610 224364 226851 228493 229800 231133
55646B31133J117O73J36o22j266j089m28o80k242l772m231m306m926n746o035
$$ 231133 232250 232923 233059 232437 231171 230082 229654 228974 226732 222960 218729 214423 209497 203751 197716
55631A97716n989n996n673m677l650l320l345k941k067j202n81l27o22j190j315
$$ 197716 191727 185731 180058 175381 171731 168411 165066 162125 160058 158856 158275 157948 157326 156136 154821
55616A54821r49r36j582j968j463q42j077j873k409k673k993k992k220j346j431
$$ 154821 153872 152936 151354 149386 147923 147081 146004 144131 141722 139049 136056 133064 130844 129498 128067
55601A28067k278k560j587q9P86N90k60r27p44J65R62J036O63M44M87N22N36P05
$$ 128067 125789 123229 121642 121553 122339 122929 122669 121742 120998 121163 122125 123161 123824 124268 124755 125277 125813 126518
55583A26518R62J069J037J106J379J702J879J847J780J944K338K617K705L133
$$ 126518 127480 128549 129586 130692 132071 133773 135652 137499 139279 141223 143561 146178 148883 152016
55569A52016M241N239M908L248J569P85M17l84j614k704l431l986m478m760m636
$$ 152016 156257 161496 166404 169652 171221 172006 172423 172039 170425 167721 164290 160304 155826 151066 146430
55554A46430m022l168k575k408k179j539j087j546k372k209q60L63M93R2J11N18
$$ 146430 142408 139240 136665 134257 132078 130539 129452 127906 125534 123325 122465 122828 123321 123413 123524 124042
55538A24042P49P02O45O01M51K37Pk97m75j75M50P42M45K7j80m54j032j640k021
$$ 124042 124791 125493 126138 126739 127190 127427 127434 127137 126662 126487 126937 127679 128124 128151 127971 127517 126485 124845 122824
55519A22824k291k475k329j973j972k410k643k283j784j553j316q60o75j151j738
$$ 122824 120533 118058 115729 113756 111784 109374 106731 104448 102664 101111 99795 98935 98260 97109 95371
55504I5371j587o67L56R73J064O40j22p97j038q95o09l96m42p37q56m10K61M25
$$ 95371 93784 93117 93473 94446 95510 96150 96028 95231 94193 93298 92689 92293 91851 91114 90258 89848 90109 90534
55486I0534k9n16o65n98l26K35O63M30m2J85Q77P49m61j289o06Q20J585J383O88
$$ 90534 90505 89989 89324 88726 88400 88635 89298 89728 89686 89871 90748 91497 91036 89747 89141 89961 91546 92929 93617
55467I3617k54j157j343o48L5k9l11l8M77M56pk52j70q5qJ89K59O5R5O67J115
$$ 93617 93363 92206 90863 90215 90250 90221 89910 89872 90349 90805 90798 90546 90376 90291 90283 90472 90731 90796 90891 91558 92673
55446I2673N71p61j914k295j901q94K60P56L61r7J31O10N26rl38l80m36l74j3
$$ 92673 93244 92483 90569 88274 86373 85479 85739 86495 86856 86759 86890 87500 88026 88017 87679 87299 86863 86489 86476
55427H6476J78k06n30N7J122J477R32L95L76N64Q25J383J972J906J291J055J516
$$ 86476 86654 86448 85918 85975 87097 88574 89506 89901 90277 90841 91666 93049 95021 96927 98218 99273 100789
55410A00789J799J079l14j472j957j952j825j891k268k673k674k151j353n14J95
$$ 100789 102588 103667 103353 101881 99924 97972 96147 94256 91988 89315 86641 84490 83137 82623 82818
55395H2818M45lq21j253q89k8P09Q87M98l9j63L31J147J849K152J803P15n68j119
$$ 82818 83263 83260 82439 81186 80297 80269 80978 81865 82363 82324 82161 82492 83639 85488 87640 89443 90158 89590 88471
55376H8471p06j74l26r26j218r34l13L90Q20M82n72j398j178k47M47N35K54k44
$$ 88471 87765 87591 87265 86339 85121 84187 83874 84264 85084 85566 84994 83596 82418 82171 82618 83153 83407 83163
55358H3163q96j337j260q95n85k30K78M65j29j090j534j172m21K52N50L23j21
$$ 83163 82267 80930 79670 78775 78190 77960 78238 78703 78574 77484 75950 74778 74357 74609 75159 75482 75361
55341G5361j11M61Q53O58N36J019J395Q44l9j09M95O68J42l14k63M9N15J125J296
$$ 75361 75250 75711 76564 77222 77758 78777 80172 81016 80977 80868 81363 82031 82173 81859 81596 81645 82160 83285 84581
55322H4581M96n67o17L09R20O09N5j88l83o29m61J76O04M21o8o32j318j710j150
$$ 84581 85077 84510 83893 84202 85122 85731 85786 85598 85215 84586 84125 84301 84905 85326 85258 84626 83308 81598 80448
55303H0448RN37P6l46kM91M23J89L69N75P7r02j451j111k30O25J076J086R33Q52
$$ 80448 80457 80994 81070 80724 80722 81213 81636 81825 82194 82769 82846 81944 80493 79382 79152 79777 80853 81939 82872 83724
55283H3724O96L36J95P07J330J045r4q99p37k61j45j31J37K92kl28j85K14M27
$$ 83724 84420 84756 84951 85658 86988 88033 87939 87040 86303 86042 85897 85766 85903 86195 86193 85865 85680 85894 86321
55264H6321M61M31J50l92p11o04n74r76j246p16L37J052J030M77l12r92j081m16
$$ 86321 86782 87213 87363 86971 86260 85656 85082 84106 82860 82144 82481 83533 84563 85040 84728 83736 82655 82239
55246H2239M79R63Q80L84m40j347j752j292l34M54P50N95J63j75m1L69L93j31
$$ 82239 82718 83681 84561 84945 84505 83158 81406 80114 79780 80234 80984 81579 81742 81567 81526 81895 82288 82157
55228H2157n32l31K5n6l48k15M04J017J265J113O49J73R4L55L38j91n81k44L39
$$ 82157 81625 81294 81319 81263 80915 80700 81104 82121 83386 84499 85148 85321 85415 85770 86108 85917 85336 85092 85431
55209H5431K70l96p36k60N26Q52M85k51q58j020q09n33l01j1K59K23l0P4P61J458
$$ 85431 85701 85305 84569 84309 84835 85687 86172 85921 85063 84043 83234 82701 82400 82389 82648 82871 82841 82915 83676 85134
55189H5134J519J013L70k74q82j092o11K13P41P81N73L71L84P96J329J218K04
$$ 85134 86653 87666 88036 87762 86880 85788 85177 85390 86131 86912 87485 87856 88240 89036 90365 91583 91787
55172I1787q50r75m30k06n63q60p48n22k65L41J102J083p3j279j192R7J233J303
$$ 91787 90937 89962 89532 89326 88763 87903 87155 86633 86368 86709 87811 88894 88821 87542 86350 86447 87680 88983
55154H8983O99J99j05n39r85r54m53j32l01m19K7O34O88K84O4J01o4l46j31M98
$$ 88983 89682 89881 89776 89237 88252 87298 86845 86713 86412 85993 86020 86654 87342 87626 87690 87791 87727 87381 87250 87748
55134H7748O13l9m24K09J095J173P30P85J296J241K94o17o69j51J15k03p46r80
$$ 87748 88361 88322 87898 88107 89202 90375 91105 91890 93186 94427 94721 94104 93435 93284 93399 93196 92450 91470
55116I1470p09l08l41p66q14j2J014J257O20j56n80p02n16J61J084J622J591J414
$$ 91470 90761 90453 90112 89346 88532 88520 89534 90791 91411 91255 90675 89973 89457 89618 90702 92324 93915 95329
55098I5329J332J058N23K44N88J086J046N34K33M83R12R96O78K83J13K57O33J036
$$ 95329 96661 97719 98242 98486 99074 100160 101206 101740 101973 102456 103368 104364 105042 105325 105438 105695 106328 107364
55080A07364J117N77m16j195j181n58j1J19P8Q4K4l1L21J052J272L12j204k025
$$ 107364 108481 109058 108642 107447 106266 105708 105697 105816 105894 105978 106002 105971 106292 107344 108616 108928 107724 105699
55062A05699j892j589j534j221l70L36K09k75n2J029J956J810P05n66j392j589
$$ 105699 103807 102218 100684 99463 99093 99429 99638 99363 99311 100340 102296 104106 104811 104245 102853 101264
55046A01264j177l62L47M54L9k79j50N2k25r15j428j399r36k46M90R29P46J69
$$ 101264 100087 99725 100072 100526 100565 100286 100136 100188 99963 99048 97620 96221 95285 95039 95529 96458 97204 97373
55028I7373j81j34j56n02p79o54m66n44n73j77K37O8l81k58M80R06M97j28j75
$$ 97373 97192 97058 96902 96400 95621 94967 94501 93957 93384 93207 93444 93512 93131 92873 93353 94259 94756 94628 94453
55009I4453K70N60M41K35K37L93N04M52K61L7r7j30r3M3L64Q39J254J386J164
$$ 94453 94723 95283 95724 95959 96196 96589 97093 97545 97806 97843 97746 97616 97523 97566 97930 98769 100023 101409 102573
54990A02573O66J00k72k20K69R50J399J311P24L8l70n07o12p23o37k90J36N44
$$ 102573 103239 103339 103067 102847 103116 104066 105465 106776 107500 107538 107168 106661 106049 105326 104689 104399 104535 105079
54972A05079R67J207Q70L0n28j71P39J231Q08j83j014j144m85M84J038R47P09
$$ 105079 106046 107253 108123 108153 107625 107454 108193 109424 110232 110049 109035 107891 107406 107890 108928 109875 110584
54955A10584P65Q20L89k87n24k91k93q54j379j169l10M87O47R9p63j289j016j82
$$ 110584 111349 112169 112558 112271 111747 111456 111163 110309 108930 107761 107451 107938 108585 108684 107921 106632 105616 105434
54937A05434M18K60l76p64m93K39Q87J027P92Q06J496K407K655K108J685K145
$$ 105434 105852 106112 105736 104972 104479 104718 105605 106632 107424 108230 109726 112133 114788 116896 118581 120726
54921A20726L080L578L532L659M293M861M796M383M314M710M984M530L176J105
$$ 120726 123806 127384 130916 134575 138868 143729 148525 152908 157222 161932 166916 171446 174622 175727
54907A75727j231l183m322m871n368n835n748m937m027l639l577l230k409j383
$$ 175727 174496 171313 166991 162120 156752 150917 145169 140232 136205 132566 128989 125759 123350 121967
54893A21967l97L10L50l37j053j032m78j53j45J44P77J072Q21P62J392K160K442
$$ 121967 121570 121880 122230 121893 120840 119808 119330 119177 119032 119176 119953 121025 121846 122608 124000 126160 128602
54876A28602K535K992L574L768L849M488N544O069N563M457L323K176P82q37k427
$$ 128602 131137 134129 137703 141471 145320 149808 155352 161421 166984 171441 174764 176940 177722 176885 174458
54861A74458l735m620n043n054m691m065l588l757m475m897m300k939j684j084
$$ 174458 170723 166103 161060 156006 151315 147250 143662 139905 135430 130533 126233 123294 121610 120526
54847A20526r99j058j074j102j338j765j876j206k34j86j449k803k891j876r21
$$ 120526 119527 118469 117395 116293 114955 113190 111314 110108 109874 109688 108239 105436 102545 100669 99748
54832I9748m45Q6Q02J049N39pJ15N65N01k02q28p66k40L4k18m57k9Q98J395R47
$$ 99748 99303 99389 100191 101240 101779 101772 101887 102452 102953 102751 101923 101157 100917 100951 100733 100276 100247 101145 102540 103487
54812A03487P2m06l23l7K45N30O54M51J62J91N58R65J212J150N32n48j306r99
$$ 103487 103559 103153 102830 102793 103038 103568 104222 104673 104835 105026 105584 106549 107761 108911 109443 108895 107589 106590
54794A06590N0P50N21j97o60n43l2L79K48k63m04J85Q22P46L34N51J360J684J003
$$ 106590 106640 107390 107911 107714 107054 106511 106479 106858 107106 106843 106439 106624 107446 108192 108526 109077 110437 112121 113124
54775A13124J07m9N39J241J655J768J773J959K462L034L383L730M480N472O076
$$ 113124 113231 113182 113721 114962 116617 118385 120158 122117 124579 127613 130996 134726 139206 144678 150754
54760A50754O132O093O249O355O091N234L458O75k307m338n187n587n921n848
$$ 150754 156886 162979 169228 175583 181674 186908 190366 191041 188734 184396 179209 173622 167701 161853
54746A61853n365n146n300m962l715k492k239k470k119j241p80j025j248q49m9
$$ 161853 156488 151342 146042 141080 137365 134873 132634 130164 128045 126804 126024 124999 123751 122902 122853
54731A22853N35M65l21j279j422k94J323K209K082J747J924K578L416M396N492
$$ 122853 123388 123853 123532 122253 120831 120537 121860 124069 126151 127898 129822 132400 135816 140212 145704
54716A45704O324O409N650M458L354K438J286n19k725m515n334n317m819l992
$$ 145704 152028 158437 164087 168545 171899 174337 175623 175104 172379 167864 162530 157213 152394 148402
54702A48402l094k728l163l702l337k042q44n93j060j482j492j278j031o69j43
$$ 148402 145308 142580 139417 135715 132378 130336 129492 128899 127839 126357 124865 123587 122556 121887 121744
54687A21744K32o4j104k185k370j548o15m22p51p00m9L73j52j116j361n58M66
$$ 121744 121976 121912 120808 118623 116253 114705 114090 113668 112917 112217 112168 112541 112389 111273 109912 109354 109820
54670A09820R68J132J331J101k28k109k882j678N06K012K220J590O32l82j044
$$ 109820 110788 111920 113251 114352 114124 112015 109133 107455 107961 109973 112193 113783 114415 114033 112989
54655A12989r89m92j90k58l31k44k12l04k92j42r7j39R1O60J087R65M61N2k7R1
$$ 112989 112000 111508 111318 111060 110729 110485 110273 109969 109677 109535 109438 109299 109390 110050 111137 112102 112563 112615 112588 112679
54635A12679O6l44r18j012k91O92J047N97l3k40L8N01P07K86n94j119q04k26k01
$$ 112679 112745 112401 111483 110471 110180 110872 111919 112516 112483 112243 112281 112782 113489 113775 113181 112062 111258 111032 110831
54616A10831m86k42M62P00K04l10m39n91q73o54K15Q37N73Pq5J26J69K96R38J701
$$ 110831 110345 110103 110565 111265 111469 111159 110720 110129 109256 108602 108817 109654 110227 110234 110149 110275 110444 110740 111678 113379
54596A13379J788J114K74k93n16m42k84l93p38q18m68k40m33m41K47R53O26n76
$$ 113379 115167 116281 116555 116262 115746 115304 115020 114627 113889 113071 112603 112363 111930 111489 111736 112689 113315 112739
54578A12739j382r90J30J016J202R09O21N74N60L45K18O05J144R35n9p31l96K18
$$ 112739 111357 110367 110497 111513 112715 113624 114245 114819 115379 115724 115942 116547 117691 118626 118567 117836 117440 117658
54560A17658J92j88j76O7j63q13j156q90k54O47J743K453K208J373Q68R47J085
$$ 117658 117850 117662 117486 117553 117390 116577 115421 114531 114277 114924 116667 119120 121328 122701 123569 124516 125601
54543A25601R52O87M14J79K70Q30J292R99K05k85l37m30n51j26P81J210N24p72
$$ 125601 126553 127240 127654 127833 128103 128933 130225 131224 131429 131144 130807 130377 129826 129700 130481 131691 132215 131443
54525A31443j728j893j409p08k65k19j81J37L16k06j070j310p25q3J05J96N49
$$ 131443 129715 127822 126413 125705 125440 125221 125040 125177 125493 125287 124217 122907 122182 122099 122204 122400 122949
54508A22949P92M30l91j087j315j130p58l71Q2P12J257J042q3j198j282n10J55
$$ 122949 123741 124171 123780 122693 121378 120248 119490 119119 119201 119913 121170 122212 122129 120931 119649 119139 119294
54491A19294M05P12J120J033L63j05P6L65J73k29l08j00P4J46J12k30q53j229
$$ 119294 119699 120411 121531 122564 122927 122822 122898 123263 123436 123207 122899 122799 122873 123019 123131 122901 122048 120819
54473A20819r51l03K01N20R33J475J904K029J750J000o8j025j472j358q44j13
$$ 120819 119868 119565 119766 120286 121219 122694 124598 126627 128377 129377 129309 128284 126812 125454 124610 124497
54457A24497N93J042J172J098Q41L51k58p17q44n95QO76Q27K40m69n66j86k0j19
$$ 124497 125090 126132 127304 128402 129243 129594 129336 128619 127775 127180 127188 127864 128691 128931 128462 127896 127710 127690 127571
54438A27571P9O19P81K29m62p30p67r16j038r31p46n59l8R29J768J877J391Q42
$$ 127571 127650 128269 129050 129279 128817 128087 127320 126404 125366 124435 123689 123130 123092 124021 125789 127666 129057 129899
54420A29899M21L7k26j71J70N86R08R82P61N31O93J125J187N97j19l78k45r5k7
$$ 129899 130320 130357 130131 129960 130130 130716 131624 132606 133367 133898 134591 135716 136903 137500 137381 137003 136758 136663 136636
54401A36636Q5L39Q42J541J895J299J16m01L06J308J469Q98M33L53L83M70P05
$$ 136636 136721 137060 137902 139443 141338 142637 142753 142352 142658 143966 145435 146333 146766 147119 147502 147972 148677
54384A48677P55K70l74n46l78n20r85j115p17l50l27j82M98J309J492Q85R3j15
$$ 148677 149432 149702 149328 148782 148404 147884 146899 145784 145067 144717 144390 144208 144706 146015 147507 148392 148485 148370
54366A48370N15J420J652Q33l03o16K24J537K516K950L057L086L183L312L216
$$ 148370 148885 150305 151957 152790 152487 151871 152095 153632 156148 159098 162155 165241 168424 171736 174952
54351A74952K735K163J946K016J808R75k17j369k369l231l828m070m092m067l905
$$ 174952 177687 179850 181796 183812 185620 186595 186378 185009 182640 179409 175581 171511 167419 163352 159447
54336A59447l373k474j546j032j093j420j452r47k63M4j54n14p22p76p36n33j41
$$ 159447 156074 153600 152054 151022 149929 148509 147057 146110 145847 145891 145737 145223 144501 143725 142989 142456 142315
54319A42315K47L93K65N0o1m1n8l21p78j106j098r25q60q58p21n34n20m95j1Q19
$$ 142315 142562 142955 143220 143270 143209 143168 143110 142789 142011 140905 139807 138882 138022 137164 136443 135909 135389 134894 134883 135702
54299A35702J177N98k73m73K1M65N50O89J045J089N39NQ6L37j01j061j438p71
$$ 135702 136879 137477 137204 136731 136752 137217 137767 138456 139501 140590 141129 141134 141220 141557 141456 140395 138957 138186
54281A38186J18L52J44K89R80J712J929J390J89j050j366m70O50P29k06r53o89
$$ 138186 138304 138656 138800 139089 140069 141781 143710 145100 145289 144239 142873 142403 143053 143782 143576 142623 141934
54264A41934J68Q03J042J226J500J600J212L94l36l79K44P92P06L22K56L52l2
$$ 141934 142102 142905 143947 145173 146673 148273 149485 149879 149543 149164 149408 150200 150906 151228 151484 151836 151804
54247A51804q01j135p49k56m2K39O95O53j92j006r61n05n29q74p09p7J03m83j151
$$ 151804 151003 149868 149119 148863 148821 149060 149755 150408 150216 149210 148249 147744 147215 146341 145632 145555 145658 145175 144024
54228A44024j432j645k010k039j340k82N82J213J747J985J744J343J191J121O85
$$ 144024 142592 140947 138937 136898 135558 135276 135858 137071 138818 140803 142547 143890 145081 146202 146887
54213A46887j23q60j262j390j260q58m34l41m73l43J59N67N52L51K42Q1k38l21
$$ 146887 146764 145904 144642 143252 141992 141134 140700 140359 139886 139543 139702 140269 140821 141172 141414 141495 141257 140936
54195A40936J75Q41J008P64P08Q14M39m61r99p20l82p67j355j086k2P39O37K22
$$ 140936 141111 141952 142960 143724 144432 145246 145685 145224 144225 143505 143123 142356 141001 139915 139893 140632 141269 141491
54177A41491J30L11M66N69O57N73K75k4j46j24J7K53L30k6n59o14p2M12K65k99
$$ 141491 141621 141932 142398 142967 143624 144197 144472 144448 144302 144178 144195 144448 144778 144752 144193 143579 143507 143919 144184 143885
54157A43885p22p93n73n3O52J086Q90K87j81k81k10j87k05j74p7J5K3m9p7k4l5
$$ 143885 143163 142370 141797 141744 142396 143482 144372 144659 144478 144197 143987 143800 143595 143421 143344 143359 143382 143333 143256 143232 143197
54136A43197j74k15L3L27L12J34K44O12P18L67mKK52M62O01O67N27K29N7J29K90
$$ 143197 143023 142808 142841 143168 143480 143614 143858 144470 145188 145555 145551 145553 145805 146267 146868 147535 148062 148291 148348 148477 148767
54115A48767N17R64J484J636J391J223J336J387J162Q78N77q8j038j575j417j192
$$ 148767 149284 150248 151732 153368 154759 155982 157318 158705 159867 160745 161322 161234 160196 158621 157204 156012
54099A56012j345j321n86K95M84J75J50M67N48L00J74K90L61L75N71P75N69R3
$$ 156012 154667 153346 152760 153055 153539 153714 153864 154331 154879 155179 155353 155643 156004 156379 156950 157725 158294 158387
54081A58387m9L27Q70J407K023K550K645K428K344K448K533K913M118N764O645
$$ 158387 158338 158665 159535 160942 162965 165515 168160 170588 172932 175380 177913 180826 184944 190708 197353
54066A97353O193N087M047K874J226m63j493j891k238k754l170l267l074k608
$$ 197353 203546 208633 212680 215554 216780 216317 214824 212933 210695 207941 204771 201504 198430 195822
54052A95822j857r96k74K60O73Q68P27N58J007K293L787M559M406L990L998M429
$$ 195822 193965 192969 192695 192955 193628 194496 195223 195781 196788 199081 202868 207427 211833 215823 219821 224250
54036B24250M904N340N915O489O628O175N409M544L595K797K568K835K957K637
$$ 224250 229154 234494 240409 246898 253526 259701 265110 269654 273249 276046 278614 281449 284406 287043
54022B87043K292K186J850R66J45L7K18k45j403k467l030l415l905m439n012n672
$$ 287043 289335 291521 293371 294337 294482 294519 294737 294492 293089 290622 287592 284177 280272 275833 270821 265149
54006B65149o146o075n624n227m887m366l845l604l210k054n69J44k8m3N92J053
$$ 265149 259003 252928 247304 242077 237190 232824 228979 225375 222165 220111 219542 219686 219658 219615 220207 221260
53990B21260O60Qk0L91M42q2p88j348j563j213n16l49j283k668l358l060k437
$$ 221260 221920 221928 221908 222299 222741 222659 221871 220523 218960 217747 217231 216882 215599 212931 209573 206513 204076
53973B04076k065j976k019k054j812j098j99L63N34O60P78N29j00m96k16L72O24
$$ 204076 202011 200035 198016 195962 194150 193052 192853 193216 193750 194410 195188 195717 195617 195121 194905 195277 195901
53956A95901N18N76J074J733K224K443K276J578P46P62K088L812M624M495M592
$$ 195901 196419 196995 198069 199802 202026 204469 206745 208323 209069 209831 211919 215731 220355 224850 229442
53941B29442N412O067N794N230N358N928N987N536N512O210O823O746O400O433
$$ 229442 234854 240921 246715 251945 257303 263231 269218 274754 280266 286476 293299 300045 306445 312878
53927C12878O931P759R049J0819J2589J3773J4100J3443J1615Q608M791P95k515
$$ 312878 319809 327568 336617 347436 360025 373798 387898 401341 412956 421564 426355 427150 424635
53914D24635m080l390j332L29O54K07j50l22n27n69l29m20j482l073m066m107
$$ 424635 420555 417165 415833 416162 416816 417023 416873 416551 416024 415455 415126 414706 413224 410151 406085 401978
53898D01978l927m220m802n143n161n161n287n420n539n911o739p770q443q509
$$ 401978 398051 393831 389029 383886 378725 373564 368277 362857 357318 351407 344668 336898 328455 319946
53884C19946q303q211q089p454o279n135m505m262m004l647l455l610l930m009
$$ 319946 311643 303432 295343 287889 281610 276475 271970 267708 263704 260057 256602 252992 249062 245053
53870B45053l594k836k186j968k158k579l058l263k797j803j175j576k502k840
$$ 245053 241459 238623 236437 234469 232311 229732 226674 223411 220614 218811 217636 216060 213558 210718
53856B10718k281j532j167j051r59j092j551j889j605q11j00Q9k10n52m62M5L91
$$ 210718 208437 206905 205738 204687 203728 202636 201085 199196 197591 196780 196680 196769 196559 196007 195545 195590 195981
53839A95981J67k32j62K50L06j67o13p19p89r87r81n72k9M88J133J730J696J006
$$ 195981 196148 195916 195754 196004 196310 196143 195530 194811 194022 193035 192054 191482 191453 191941 193074 194804 196500 197506
53821A97506M50M53M00l06j135j095m1J315K353K946L247L533L952M170L721K988
$$ 197506 197956 198409 198809 198503 197368 196273 196232 197547 199900 202846 206093 209626 213578 217748 221469 224457
53805B24457L077M266N400N454M943M909N270N227M780M601M707M425L678L171
$$ 224457 227534 231800 237200 242654 247597 252506 257776 263003 267783 272384 277091 281516 285194 288365
53791B88365L141K904J929N97l30m16L52J526K145J423l08j932k918l716m690
$$ 288365 291506 294410 296339 296936 296606 296190 296542 298068 300213 301636 301328 299396 296478 292762 288072
53776B88072n454n621n512n537n460m884m126l953m529n134n005m086k876j890
$$ 288072 282618 276997 271485 265948 260488 255604 251478 247525 242996 237862 232857 228771 225895 224005
53762B24005j375j365j720k121k212j907j469j188j030p69l58P2M45O83M79m04
$$ 224005 222630 221265 219545 217424 215212 213305 211836 210648 209618 208849 208491 208563 209008 209691 210170 209766
53746B09766j600k363k432k164j781j082j51M25M32M68R47J365J221J012J341
$$ 209766 208166 205803 203371 201207 199426 198344 198193 198618 199050 199518 200465 201830 203051 204063 205404
53731B05404J669J140K91O02K145L095K098R0r46l67P65J245R35N47P60J574K324
$$ 205404 207073 208213 208504 209106 211251 214346 216444 216534 215588 215221 215986 217231 218166 218713 219473 221047 223371
53714B23371K343J790J510K012K797L022K539K009K069K695L338L461K918K022
$$ 223371 225714 227504 229014 231026 233823 236845 239384 241393 243462 246157 249495 252956 255874 257896
53700B57896J308J188J686K463L066L250L128K949K758K370J715J040O11M24L22
$$ 257896 259204 260392 262078 264541 267607 270857 273985 276934 279692 282062 283777 284817 285428 285852 286174
53685B86174K70L03M01M64L90k6r66k219l150l263k653j757q75j81K02L22M08
$$ 286174 286444 286747 287148 287612 288002 287976 287010 284791 281641 278378 275725 273968 273093 272912 273114 273436 273844
53668B73844M60J56n50j118j129r03r15r51n53M3J46k96o66p20q58j266j514j338
$$ 273844 274304 274460 273910 272792 271663 270760 269845 268894 268341 268384 268530 268234 267568 266848 265990 264724 263210 261872
53650B61872j078r43m78O94K036K578K082J233Q09R90J428J670J568J391J561
$$ 261872 260794 259851 259373 260067 262103 264681 266763 267996 268805 269795 271223 272893 274461 275852 277413
53635B77413K090K440K072J137L83L97J031J665J952K150K638L288L539L171K629
$$ 277413 279503 281943 284015 285152 285535 285932 286963 288628 290580 292730 295368 298656 302195 305366 307995
53620C07995K506K975L910N152O347O876O470N733N491N719N681N134M712M922
$$ 307995 310501 313476 317386 322538 328885 335761 342231 347964 353455 359174 364855 369989 374701 379623
53606C79623N367N332M747M064L477K810K059J453R11m9j513k663k656j836j423
$$ 379623 384990 390322 395069 399133 402610 405420 407479 408932 409843 409794 408281 405618 402962 401126 399703
53591C99703j847k133j391k86j90j233k207k371k273k552k935k942k753k637k266
$$ 399703 397856 395723 394332 394046 393856 392623 390416 388045 385772 383220 380285 377343 374590 371953 369687
53576C69687j375n65o01j279j764j764j551j111j65J025J739J672J169O17K47
$$ 369687 368312 367747 367146 365867 364103 362339 360788 359677 359512 360537 362276 363948 365117 365734 365981
53561C65981L70J025J517J065k7o65l97J78N21P97J267J778K231K776L316L414
$$ 365981 366351 367376 368893 369958 369931 369266 368869 369047 369568 370365 371632 373410 375641 378417 381733 385147
53545C85147L025K742L006L581M070M372M388L966L466L745N104O738P695P945
$$ 385147 388172 390914 393920 397501 401571 405943 410331 414297 417763 421508 426612 433350 441045 448990
53531D48990Q050Q273Q600R219J0354J1776J2976J3751J4261J4619J4827J5002
$$ 448990 457040 465313 473913 483132 493486 505262 518238 531989 546250 560869 575696 590698
53519E90698J5326J5796J6286J6876J7834J9260K0856K2210K3176K4009K4994
$$ 590698 606024 621820 638106 654982 672816 692076 712932 735142 758318 782327 807321
53508H07321K6010K6592K6534K6190K5966K5772K5283K4495K3620K2646K1448
$$ 807321 833331 859923 886457 912647 938613 964385 989668 1014163 1037783 1060429 1081877
53497A081877K0231J9343J8742J8161J7729J7850J8490J9126J9400J9329J8885
$$ 1081877 1102108 1121451 1140193 1158354 1176083 1193933 1212423 1231549 1250949 1270278 1289163
53486A289163J8040J7249J7177J7813J8458J8702J8714J8415J7199J4836J2031
$$ 1289163 1307203 1324452 1341629 1359442 1377900 1396602 1415316 1433731 1450930 1465766 1477797
53475A477797R606P652N758L644J244j358l834n902p931j0559j3540j5633j6079
$$ 1477797 1487403 1495055 1500813 1504457 1505701 1504343 1500509 1494607 1486676 1476117 1462577 1446944 1430865
53462A430865j5491j4910j4663j4671j5181j6397j7879j9040j9929k0907k1824
$$ 1430865 1415374 1400464 1385801 1371130 1355949 1339552 1321673 1302633 1282704 1261797 1239973
53451A239973k2209k1980k1412k0586j9436j8131j6839j5321j3318j1193r628
$$ 1239973 1217764 1195784 1174372 1153786 1134350 1116219 1099380 1084059 1070741 1059548 1049920
53440A049920q651p534n773l799k520k323k597k295j017N99J749K565L779N461
$$ 1049920 1041269 1033735 1027962 1024163 1021643 1019320 1016723 1014428 1013411 1014010 1015759 1018324 1022103 1027564
53426A027564O847P665Q759J0882J3515J5524J6517J6980J7468J8259J9508K1115
$$ 1027564 1034411 1042076 1050835 1061717 1075232 1090756 1107273 1124253 1141721 1159980 1179488 1200603
53414A200603K2678K4034K5574K7589K9711L1459L3011L4783L6659L8267L9755
$$ 1200603 1223281 1247315 1272889 1300478 1330189 1361648 1394659 1429442 1466101 1504368 1544123
53403A544123M1568M3681M5742M7809N0219N2701N4387N4796N4457N4335N5013
$$ 1544123 1585691 1629372 1675114 1722923 1773142 1825843 1880230 1935026 1989483 2043818 2098831
53392B098831N6367N7703N8284N7988N7322N6528N5053N2325M8749M5309M2411
$$ 2098831 2155198 2212901 2271185 2329173 2386495 2443023 2498076 2550401 2599150 2644459 2686870
53381B686870L9676L6699L3418K9800K5767K1412J6839J1846O276N22m882j0076
$$ 2686870 2726546 2763245 2796663 2826463 2852230 2873642 2890481 2902327 2908603 2909125 2904243 2894167
53369B894167j5701k1944k8290l4289l9946m5280m9971n3535n5543n5811n4794
$$ 2894167 2878466 2856522 2828232 2793943 2753997 2708717 2658746 2605211 2549668 2493857 2439063
53358B439063n3644n3284n3393n2913n1457m9564m7635m5388m2694m0222l8877
$$ 2439063 2385419 2332135 2278742 2225829 2174372 2124808 2077173 2031785 1989091 1948869 1909992
53347A909992l8888l9730m0619m0853m0033l8292l6130l3965l1918k9942k7852
$$ 1909992 1871104 1831374 1790755 1749902 1709869 1671577 1635447 1601482 1569564 1539622 1511770
53336A511770k5397k2648k0185j8407j6842j4827j2729j1713j2163j3192j3991
$$ 1511770 1486373 1463725 1443540 1425133 1408291 1393464 1380735 1369022 1356859 1343667 1329676
53325A329676j4746j5781j6544j6268j5147j4040j3285j2520j1568j0716r994
$$ 1329676 1314930 1299149 1282605 1266337 1251190 1237150 1223865 1211345 1199777 1189061 1179067
53314A179067q861o897m452k254n97Q37K438M214N876P189Q182R070J0112J1475
$$ 1179067 1170206 1163309 1158857 1156603 1156006 1156843 1159281 1163495 1169371 1176560 1184742 1193812 1203924 1215399
53300A215399J3198J5216J7416J9655K1689K3278K4453K5609K7014K8307K8763
$$ 1215399 1228597 1243813 1261229 1280884 1302573 1325851 1350304 1375913 1402927 1431234 1459997
53289A459997K8190K7209K6498K6011K5127K3352K0733J7722J4870J2286R363
$$ 1459997 1488187 1515396 1541894 1567905 1593032 1616384 1637117 1654839 1669709 1681995 1691358
53278A691358N322L36m297p454r309j0830j2563j4450j6506j8932k1580k3899
$$ 1691358 1696680 1697016 1692719 1685265 1675956 1665126 1652563 1638113 1621607 1602675 1581095 1557196
53266A557196k5514k6516k7181k7761k8482k9302k9756k9476k8800k8403k8384
$$ 1557196 1531682 1505166 1477985 1450224 1421742 1392440 1362684 1333208 1304408 1276005 1247621
53255A247621k8212k7615k6955k6616k6440k6035k5323k4607k4253k4412k4833
$$ 1247621 1219409 1191794 1164839 1138223 1111783 1085748 1060425 1035818 1011565 987153 962320
53244I62320k4967k4447k3420k2253k1092j9915j8836j7928j6991j5813j4588
$$ 962320 937353 912906 889486 867233 846141 826226 807390 789462 772471 756658 742070
53233G42070j3564j2538j1092r341p883p144p112p645q555r515j0379j1457j2983
$$ 742070 728506 715968 704876 695535 687652 680508 673396 665751 657196 647681 637302 625845 612862
53220F12862j4573j5701j6445j7027j6998j5814j4056j2931j2550j1884j0595
$$ 612862 598289 582588 566143 549116 532118 516304 502248 489317 476767 464883 454288
53209D54288r688r761r843q830p139o026n925o349o911p529p975q139q400q926
$$ 454288 444600 434839 424996 416166 409027 403001 397076 390727 383816 376287 368312 360173 351773 342847
53195C42847q960p718n781m589m557m650m091l442l588m388m967m891m360l554
$$ 342847 333887 326169 320388 315799 311242 306592 302501 299059 295471 291083 286116 281225 276865 273311
53181B73311k449j286n84n60r00j304j846k502k732k051q41pJ48Q6M2l46j098
$$ 273311 270862 269576 268992 268432 267532 266228 264382 261880 259148 257097 256256 256249 256397 256483 256525 256179 255081
53164B55081j378o87J04j92j354k048j701j018o58m89m43r91k115k736j974m63
$$ 255081 253703 253016 253120 252928 251574 249526 247825 246807 246149 245660 245217 244226 242111 239375 237401 236938
53148B36938M16K77l8K04P33P74L7r77j432r59o5M40M00M50J096K083K770K730
$$ 236938 237354 237631 237593 237797 238530 239304 239341 238364 236932 235973 235908 236348 236748 237198 238294 240377 243147 245877
53130B45877J815J63j577k466k162j299o89n24o21r04j182r11J64J419K012J864
$$ 245877 247692 247855 246278 243812 241650 240351 239662 239138 238517 237613 236431 235520 235684 237103 239115 240979
53114B40979J452R14N2q50j090n55o3m12j483k501k812k253j072J49P57M67l13
$$ 240979 242431 243345 243397 242547 241457 240902 240839 240427 238944 236443 233631 231378 230306 230455 231212 231679 231366
53097B31366q21o30m4K09k07q55j020n27J26M38M21L99N77Q81J020O38k33r29
$$ 231366 230545 229915 229871 230080 229873 229018 227998 227471 227597 228035 228456 228855 229432 230313 231333 231971 231738 230809
53079B30809p81p0J43n94j502j640j027k52M68J149J448J034L14K5J42qn76r18
$$ 230809 230028 229958 230101 229507 228005 226365 225338 225086 225554 226703 228151 229185 229499 229524 229666 229658 229082 228164
53061B28164o97m80q58j507j673j193n58j19K57P68J244J305Q11K8o32r98j155
$$ 228164 227467 226987 226129 224622 222949 221756 221198 221079 221336 222104 223348 224653 225464 225492 224860 223862 222707
53044B22707j127p17J46J072J448J030J09q25j383j328o53K34O75L96j60l35k5
$$ 222707 221580 220863 221009 222081 223529 224559 224668 223843 222460 221132 220479 220713 221388 221784 221624 221289 221264
53027B21264K84J85k09n84q37r35o53K6M96J09p40q27K92J579J899J468J250J395
$$ 221264 221548 221733 221524 220940 220103 219168 218515 218541 219037 219146 218406 217579 217871 219450 221349 222817 224067 225462
53009B25462J283P66L36J42j45m41k79J15j12r27j083J32J744K398J993J221L97
$$ 225462 226745 227511 227847 227989 227844 227403 227124 227239 227127 226200 225117 225249 226993 229391 231384 232605 233002
52992B33002m27q20m80P0J99J88O40J331J508J113O99M41Q8k83l35j27J28O49
$$ 233002 232575 231755 231275 231345 231544 231732 232372 233703 235211 236324 237023 237464 237552 237269 236934 236807 236935 237584
52974B37584J600K322K109J523J701K529K756K025J356J401J551J318J245J667
$$ 237584 239184 241506 243615 245138 246839 249368 252124 254149 255505 256906 258457 259775 261020 262687
52960B62687J734O61r06j756j711j455j353j345j563k137k615k422j751j312j371
$$ 262687 264421 265082 264176 262420 260709 259254 257901 256556 254993 252856 250241 247819 246068 244756 243385
52945B43385j605j718j593j102l79n1n22j155r74rP89Q79O28M30J91j03j38N4
$$ 243385 241780 240062 238469 237367 236988 236937 236415 235260 234286 234277 235066 235945 236573 237003 237194 237091 236953 237007
52927B37007j93j160k029j814p03J68J49l19n99o79q59j003o91P3P46R86J080
$$ 237007 236814 235654 233625 231811 231108 231276 231425 231106 230507 229828 228969 227966 227275 227348 228094 229080 230160
52910B30160J363J467P27p46j893j912j225q83j248j739j766j404j018p43n14
$$ 230160 231523 232990 233717 232971 231078 229166 227941 227058 225810 224071 222305 220901 219883 219140 218626
52895B18626l43k47n1M24J040J410J270P25J36j14J51P34J203J304J167J063J017
$$ 218626 218283 218036 217985 218409 219449 220859 222129 222854 222990 222876 223027 223761 224964 226268 227435 228498 229515
52878B29515Q68N64J47m54j192j520q06P10J836J827J368J600K413K551J447O5
$$ 229515 230383 230947 231094 230640 229448 227928 227122 227832 229668 231495 232863 234463 236876 239427 240874 240939
52862B40939m54k99m74j224j718j263j99N81O13J51k74l61k66l72q57j476j842
$$ 240939 240485 240186 239712 238488 236770 235507 235308 235889 236502 236653 236379 236018 235752 235380 234523 233047 231205
52845B31205j863j750j673j615j525j435j363j239j015p46n58n13n16l47M4L24
$$ 231205 229342 227592 225919 224304 222779 221344 219981 218742 217727 216981 216423 215910 215394 215047 215091 215415
52829B15415N7o75j218j107o25l79n27p49q01p45p01o63n48j90N81J555K075J733
$$ 215415 215472 214797 213579 212472 211847 211468 210941 210192 209391 208646 207945 207282 206734 206544 207125 208680 210755 212488
52811B12488R92O46P59P15L04P8M35R44R51M01l14r56j463j670j537j448j784
$$ 212488 213480 214126 214885 215600 215904 215982 216417 217361 218312 218713 218399 217443 215980 214310 212773 211325 209541
52794B09541k203j879o02O86P97l91j739j999r96L50J099J185J187J429J644J490
$$ 209541 207338 205459 204857 205543 206340 205949 204210 202211 201215 201565 202664 203849 205036 206465 208109 209599
52778B09599J113R49J111J215Q53J37m18n11l96m18l90J73J144J584Q08o32j519
$$ 209599 210712 211661 212772 213987 214840 214977 214559 214048 213652 213234 212844 213017 214161 215745 216553 215921 214402
52761B14402j350p08l66n03p96q78n15J99P49O55J26j25J70N42O02O19R68J423
$$ 214402 213052 212344 211978 211475 210679 209801 209286 209485 210234 210889 211015 210890 211060 211602 212204 212823 213791 215214
52743B15214J490J162R13J097J687K482L178L370K891K082J422R51L78l34q08
$$ 215214 216704 217866 218779 219876 221563 224045 227223 230593 233484 235566 236988 237939 238317 237983 237175
52728B37175p17j23N99J014Q27J43n21o98m33q4K26O28J059J151O99j04r56j657
$$ 237175 236458 236335 236934 237948 238775 238918 238397 237699 237266 237182 237408 238036 239095 240246 240945 240841 239885 238228
52710B38228k024j945j670j668k000k135j671q97k62K92J026J614J362K55p82
$$ 238228 236204 234259 232589 230921 228921 226786 225115 224218 223956 224248 225274 226888 228250 228505 227723
52695B27723r75m94N9N55J191J758J684Q78K8j65K27N64M55J46J18M59P32M59
$$ 227723 226748 226254 226313 226868 228059 229817 231501 232379 232407 232242 232469 233033 233488 233634 233752 234211 234943 235402
52677B35402l33j152j639j881k029j876j187k50K80J82j21j35K09P00J083J099
$$ 235402 235069 233917 232278 230397 228368 226492 225305 225055 225335 225517 225396 225261 225470 226170 227253 228352
52661B28352O20q4n63p67j011j279j075k29P43J423K046K782L027K187Q20P9K08
$$ 228352 228972 228888 228325 227558 226547 225268 224193 223964 224707 226130 228176 230958 233985 236172 236992 237071 237279
52644B37279M04J70j05l5Q3j09l78k54L40J114J770K111K105K029K243K701L064
$$ 237279 237683 237853 237748 237713 237796 237687 237309 237055 237395 238509 240279 242390 244495 246524 248767 251468 254532
52627B54532L299L691M160M120L276J989N88j078k979m374m595l968l329k940
$$ 254532 257831 261522 265682 269802 273078 275067 275655 274577 271598 267224 262629 258661 255332 252392
52613B52392k454j821j461j516j495q91J33Q62O78l43j368j462n19O46J252J309
$$ 252392 249938 248117 246656 245140 243645 242754 242887 243749 244427 244084 242716 241254 240735 241381 242633 243942
52597B43942J147P28Ll61M35J993K811K036M21p52j104j020p07j31L84L66n9k59
$$ 243942 245089 245817 245820 245459 245894 247887 250698 252734 253155 252403 251299 250279 249572 249441 249825 250191 250132 249873
52579B49873m2Q6j40k26L30J181J558J290P90K88l62j046j296j000p19q90j130
$$ 249873 249831 249917 249777 249551 249881 251062 252620 253910 254700 254988 254626 253580 252284 251284 250565 249675 248545
52562B48545q50j71K26R3j99l97p11j278j740j658j091m63j21j47m79r24j163
$$ 248545 247695 247524 247750 247843 247644 247247 246536 245258 243518 241860 240769 240306 240185 240038 239559 238635 237472
52545B37472r71m39J16M01L21j0l53n49o03n45k71K82Q94J255J394J577J836J882
$$ 237472 236501 236062 236178 236579 236900 236890 236537 235988 235385 234840 234569 234851 235745 237000 238394 239971 241807 243689
52527B43689J601J206Q01K10n50j023r09n69n20o44l86M08J281J812K026K059
$$ 243689 245290 246496 247297 247507 246957 245934 245025 244456 243936 243292 242906 243314 244595 246407 248433 250492
52511B50492J816J239O71O69J395K391L015L041K742K387J845Q42n35j826k651
$$ 250492 252308 253547 254218 254887 256282 258673 261688 264729 267471 269858 271703 272545 272010 270184 267533
52496B67533k962k822k302j684j427j720k224k437k126j340l19M46M26l32j044
$$ 267533 264571 261749 259447 257763 256336 254616 252392 249955 247829 246489 246170 246616 247042 246710 245666
52481B45666r97l43K71N90Q27J064J133J093J263J667J905J755J496J375J186
$$ 245666 244669 244326 244597 245187 246014 247078 248211 249304 250567 252234 254139 255894 257390 258765 259951
52466B59951O85J82K86J179K396L322L629L307K535J604P19j25r92j711j960j712
$$ 259951 260636 260818 261104 262283 264679 268001 271630 274937 277472 279076 279795 279670 278678 276967 275007 273295
52450B73295j409j498j876k038j778j531j832k535k845k180q97O1J45l40q17j146
$$ 273295 271886 270388 268512 266474 264696 263165 261333 258798 255953 253773 252876 252937 253082 252742 251925 250779
52434B50779j482j669j228j27Q96J087N66J15K17P11J201J370R76R8n66k35Q64
$$ 250779 249297 247628 246400 246273 247169 248256 248822 248937 249154 249865 251066 252436 253412 253510 252944 252709 253573
52417B53573J577J262N91M82Q81J191J415K011K963L865M800O234Q001R248R512
$$ 253573 255150 256412 257003 257485 258366 259557 260972 262983 265946 269811 274611 280845 288846 298094 307606
52402C07606R099Q257O734M512K148o8k500n221p310p788o856n521m386l408k547
$$ 307606 316705 324962 331696 336208 338356 338288 335788 330567 323257 315469 308613 303092 298706 295298 292751
52387B92751j927j448q71k54J14K29L79O95J072J460J880K209K371K620L256M082
$$ 292751 290824 289376 288505 288251 288365 288594 288973 289668 290740 292200 294080 296289 298660 301280 304536 308618
52371C08618M579M640M681N040N583O051O260N901M581K384J52j214j577j478
$$ 308618 313197 317837 322518 327558 333141 339192 345452 351353 355934 358318 358470 357256 355679 354201
52357C54201j359j147o51p2J48n4j14N60J778K622K435J628J306K139L680M843
$$ 354201 352842 351695 351044 350972 351120 351066 350952 351512 353290 355912 358347 359975 361281 363420 367100 371943
52341C71943N021M712M969O179P580Q210Q197Q673J0303J2391J3734J4104J4392
$$ 371943 376964 381676 386645 392824 400404 408614 416811 425484 435787 448178 461912 476016 490408
52328D90408J5428J7063J8553J9542K0370K1465K2724K3680K4235K4772K5495
$$ 490408 505836 522899 541452 560994 581364 602829 625553 649233 673468 698240 723735
52317G23735K5943K5567K4495K3309K2283K1371K0710K0445K0095J8927J7076
$$ 723735 749678 775245 799740 823049 845332 866703 887413 907858 927953 946880 963956
52306I63956J5528J4734J4059J2993J2000J1536J0996R557P492N710M287K472
$$ 963956 979484 994218 1008277 1021270 1033270 1044806 1055802 1065359 1072851 1078561 1082848 1085320
52294A085320K5k385m208n655p114q563r785j0671j1102j0934j0226r195p886
$$ 1085320 1085345 1082960 1078752 1073097 1065983 1057420 1047635 1036964 1025862 1014928 1004702 995507 987621
52281I87621o261m555l087j721R0K564N302P765R702J1103J2175J3416J5185J7047
$$ 987621 981360 976805 973718 971997 972087 974651 979953 987718 997420 1008523 1020698 1034114 1049299 1066346
52267A066346J8009J7666J6740J6222J6257J6177J5452J4239J3080J2300J1753
$$ 1066346 1084355 1102021 1118761 1134983 1151240 1167417 1182869 1197108 1210188 1222488 1234241
52256A234241J1065J0085R021Q083P156N929M303K493P19j003k802m841p185r702
$$ 1234241 1245306 1255391 1264412 1272495 1279651 1285580 1289883 1292376 1293095 1292092 1289290 1284449 1277264 1267562
52242A267562j2103j4157j5732j6612j6595j5912j5264j5122j5204j4926j4155
$$ 1267562 1255459 1241302 1225570 1208958 1192363 1176451 1161187 1146065 1130861 1115935 1101780
52231A101780j3188j2249j1346j0469r559q429p091n950n271m694l707k421j342
$$ 1101780 1088592 1076343 1064997 1054528 1044969 1036540 1029449 1023499 1018228 1013534 1009827 1007406 1006064
52218A006064n88J59R43J470J766K317L372M592N525O068O303O243N939N575N259
$$ 1006064 1005476 1005635 1006578 1008048 1009814 1012131 1015503 1020095 1025620 1031688 1037991 1044234 1050173 1055748 1061007
52203A061007M948M603M271L994L804L728L718L608L390L284L365L367L099K744
$$ 1061007 1065955 1070558 1074829 1078823 1082627 1086355 1090073 1093681 1097071 1100355 1103720 1107087 1110186 1112930
52189A112930K447K041J560J488J967K233J557K89q45j995l720n647o781p024
$$ 1112930 1115377 1117418 1118978 1120466 1122433 1124666 1126223 1126512 1125667 1123672 1119952 1114305 1107524 1100500
52175A100500p183p479p396p131p643q845r134p560n218l560k464j086L10Q48
$$ 1100500 1093317 1085838 1078442 1071311 1063668 1054823 1045689 1038129 1032911 1029351 1026887 1025801 1026111 1026959
52161A026959P51J118K166K989L177L382L960M119L075J372K98K65M45j7q77j187
$$ 1026959 1027710 1028828 1030994 1033983 1037160 1040542 1044502 1048621 1051696 1053068 1053366 1053631 1054076 1054059 1053182 1051995
52145A051995n14O11J511K206L137M286N093N177M690L951L244L077M044O105
$$ 1051995 1051481 1052092 1053603 1055809 1058946 1063232 1068325 1073502 1078192 1082143 1085387 1088464 1092508 1098613
52131A098613Q450J0429J2310J4747J7792K0776K3053K4616K6094K8233L1159
$$ 1098613 1107063 1117492 1129802 1144549 1162341 1183117 1206170 1230786 1256880 1285113 1316272
52120A316272L4119L6133L6917L6818L5989L4244L1783K9387K7457K5435K2566
$$ 1316272 1350391 1386524 1423441 1460259 1496248 1530492 1562275 1591662 1619119 1644554 1667120
52109A667120J8916J5189J1865Q859N809K486q76l538m925n471o282p787r249
$$ 1667120 1686036 1701225 1713090 1721949 1727758 1730244 1729368 1725830 1720905 1715434 1709152 1701365 1692116
52096A692116r905r977j0206j0897j1903j3103j4403j5609j6673j7704j8455j8353
$$ 1692116 1682211 1672234 1662028 1651131 1639228 1626125 1611722 1596113 1579440 1561736 1543281 1524928
52084A524928j7354j6135j4962j3094r929o138k886l72K029M617P179R634J1995
$$ 1524928 1507574 1491439 1476477 1463383 1453454 1447316 1444430 1444058 1446087 1450704 1457883 1467517 1479512
52071A479512J3950J5239J6311J7760J9269J9962J9739J9390J9336J9133J8322
$$ 1479512 1493462 1508701 1525012 1542772 1562041 1582003 1601742 1621132 1640468 1659601 1677923
52060A677923J7000J5280J2887R717O304L363J116p40k631m751o876q609r986
$$ 1677923 1694923 1710203 1723090 1732807 1739111 1742474 1743590 1742850 1740219 1735468 1728592 1719983 1709997
$$ [...]
##END NTUPLES=NMR SPECTRUM
##END=
