##TITLE=AC1534_ROEFFECT0009_8214376_YM702Qd0Co
##JCAMPDX= 6.0         $$ Bruker NMR JCAMP-DX V2.0
##DATA TYPE= NMR SPECTRUM
##DATA CLASS= NTUPLES
##ORIGIN= BRUKER
##OWNER= Administrator
$$ 1.72 TOPSPIN		Version 2.1
$$ 2014-07-31 19:00:33.036 -0700  Administrator@X
$$ Compression mode = diff/dup
##.OBSERVE FREQUENCY= 400.02188249412
##.OBSERVE NUCLEUS= ^1H
##.ACQUISITION MODE= SIMULTANEOUS (DQD)
##.ACQUISITION SCHEME= undefined
##.AVERAGES= 8
##.DIGITISER RES= 22
##SPECTROMETER/DATA SYSTEM= spect
##.PULSE SEQUENCE= zg30
##.SOLVENT NAME= COFFEE_meoh
##.SHIFT REFERENCE= INTERNAL, COFFEE_meoh, 1, 14.98509
##AUDIT TRAIL= $$ (NUMBER, WHEN, WHO, WHERE, PROCESS, VERSION, WHAT)
$$ ##TITLE= Audit trail, TOPSPIN		Version 2.1
$$ ##JCAMPDX= 5.01
$$ ##ORIGIN= Bruker BioSpin GmbH
$$ ##OWNER= Administrator
$$ $$ E:\/data/COFFEE/nmr/AC1534_ROEFFECT0009_8214376_YM702Qd0Co/20/pdata/1/auditp.txt
$$ ##AUDIT TRAIL=  $$ (NUMBER, WHEN, WHO, WHERE, PROCESS, VERSION, WHAT)
(   1,<2014-07-31 19:00:26.186 -0700>,<Administrator>,<X>,<go>,<TOPSPIN 2.1>,
      <created by zg
	started at 2014-07-31 18:59:20.579 -0700,
	POWCHK enabled, PULCHK disabled,
       configuration hash MD5:
       16 EA D6 F4 BB 67 03 14 9B FF E7 A0 43 5B 48 2E
       data hash MD5: 64K
       54 70 5B 41 28 0D D5 16 3C 34 9C 43 DB 82 CA 47>)
(   2,<2014-07-31 19:00:29.249 -0700>,<Administrator>,<X>,<proc1d>,<TOPSPIN 2.1>,
      <Start of raw data processing
       efp LB = 0 FT_mod = 6 PKNL = 1 PHC0 = 0 PHC1 = 0 SI = 32K 
       data hash MD5: 32K
       94 02 6A ED 49 FF C8 8D 2E CF DB 78 FF 10 C3 12>)
(   3,<2014-07-31 19:00:29.558 -0700>,<Administrator>,<X>,<proc1d>,<TOPSPIN 2.1>,
      <pk PHC0 = 93.22449 PHC1 = 0 
       data hash MD5: 32K
       81 21 A3 D6 10 2B 14 5F FA 48 49 70 98 55 02 8E>)
(   4,<2014-07-31 19:00:29.682 -0700>,<Administrator>,<X>,<proc1d>,<TOPSPIN 2.1>,
      <abs ABSG = 1 
       data hash MD5: 32K
       BA 2A 4F 01 29 3D B7 71 47 7C 64 72 DC 24 2A 4C>)
(   5,<2014-07-31 19:00:29.790 -0700>,<Administrator>,<X>,<proc1d>,<TOPSPIN 2.1>,
      <abs ABSG = 2 
       data hash MD5: 32K
       EB 79 0F 1E 0B 12 28 3E 27 36 7B 09 B3 CC FB A2>)
(   6,<2014-07-31 19:00:29.852 -0700>,<Administrator>,<X>,<proc1d>,<TOPSPIN 2.1>,
      <abs ABSG = 3 
       data hash MD5: 32K
       DF D0 26 71 DC F6 B5 E3 F1 88 EC F5 20 B1 BB 6A>)
(   7,<2014-07-31 19:00:29.914 -0700>,<Administrator>,<X>,<proc1d>,<TOPSPIN 2.1>,
      <abs ABSG = 4 
       data hash MD5: 32K
       86 4F A7 71 86 18 4F BA CB EA 56 49 C5 CC F8 3A>)
(   8,<2014-07-31 19:00:29.991 -0700>,<Administrator>,<X>,<proc1d>,<TOPSPIN 2.1>,
      <abs ABSG = 5 
       data hash MD5: 32K
       B1 F2 C9 CE C8 9A AD 06 22 10 FB 29 74 E8 15 91>)
$$ ##END=
$$ 
$$ $$ hash MD5
$$ $$ DA B2 9B DA 63 A5 55 02 FE FE 3B 73 1F 49 C9 95
##$RELAX= 
##$RELAX= 
##$RELAX= 
##$RELAX= 
##$RELAX= 
##$RELAX= 
##$RELAX= 
$$ Bruker specific parameters
$$ --------------------------
##$DU= <E:\>
##$EXPNO= 20
$$ [...]
150 150 150 150 150 150 150 150
##$TP07= 0
##$TPNAME0= <>
##$TPNAME1= <>
##$TPNAME2= <>
##$TPNAME3= <>
##$TPNAME4= <>
##$TPNAME5= <>
##$TPNAME6= <>
##$TPNAME7= <>
##$TPOAL= (0..7)
0.5 0.5 0.5 0.5 0.5 0.5 0.5 0.5
##$TPOFFS= (0..7)
0 0 0 0 0 0 0 0
##$TUNHIN= 0
##$TUNHOUT= 0
##$TUNXOUT= 0
##$USERA1= <user>
##$USERA2= <user>
##$USERA3= <user>
##$USERA4= <user>
##$USERA5= <user>
##$V9= 5
##$VALIST= <valist>
##$VCLIST= <CCCCCCCCCCCCCCC>
##$VD= 0
##$VDLIST= <DDDDDDDDDDDDDDD>
##$VPLIST= <PPPPPPPPPPPPPPP>
##$VTLIST= <TTTTTTTTTTTTTTT>
##$WBST= 1024
##$WBSW= 4
##$XGAIN= (0..3)
0 0 0 0
##$XL= 0
##$YL= 0
##$YMAX_a= 598345
##$YMIN_a= -512139
##$ZGOPTNS= <>
##$ZL1= 120
##$ZL2= 120
##$ZL3= 120
##$ZL4= 120
##$ABSF1= 14.98509
##$ABSF2= -5.573092
##$ABSG= 5
##$ABSL= 3
##$ALPHA= 0
##$AQORDER= 0
##$ASSFAC= 0
##$ASSFACI= 0
##$ASSFACX= 0
##$ASSWID= 0
##$AUNMP= <proc_prof1d_extract_pilot.lims>
##$AXLEFT= 0
##$AXNAME= <>
##$AXNUC= <1H>
##$AXRIGHT= 0
##$AXTYPE= 0
##$AXUNIT= <>
##$AZFE= 0.1
##$AZFW= 0.1
##$BCFW= 0
##$BC_mod= 0
##$BYTORDP= 0
##$COROFFS= 0
##$CY= 15
##$DATMOD= 1
##$DC= 0
##$DFILT= <>
##$DTYPP= 0
##$F1P= 0
##$F2P= 0
##$FCOR= 0.5
##$FTSIZE= 32768
##$FT_mod= 6
##$GAMMA= 0
##$GB= 0
##$INTBC= 1
##$INTSCL= 1
##$ISEN= 128
##$LB= 0
##$LEV0= 0
##$LPBIN= 0
##$MAXI= 10000
##$MC2= 0
##$MEAN= 0
##$ME_mod= 0
##$MI= 0
##$NCOEF= 0
##$NC_proc= -8
##$NLEV= 6
##$NOISF1= 0
##$NOISF2= 0
##$NSP= 0
##$NTH_PI= 0
##$NZP= 0
##$OFFSET= 14.98509
##$PC= 1
##$PHC0= 93.22449
##$PHC1= 0
##$PH_mod= 1
##$PKNL= yes
##$PPARMOD= 0
##$PPDIAG= 0
##$PPIPTYP= 0
##$PPMPNUM= 2147483647
##$PPRESOL= 1
##$PSCAL= 4
##$PSIGN= 0
##$PYNMP= <proc.py>
##$REVERSE= no
##$SF= 400.02
##$SI= 32768
##$SIGF1= 0
##$SIGF2= 0
##$SINO= 400
##$SIOLD= 32768
##$SPECTYP= <>
##$SREGLST= <1H.CDCl3>
##$SSB= 0
##$STSI= 32768
##$STSR= 0
##$SW_p= 8223.68421052631
##$SYMM= 0
##$S_DEV= 0
##$TDeff= 65536
##$TDoff= 0
##$TI= <>
##$TILT= no
##$TM1= 0
##$TM2= 0
##$TOPLEV= 0
##$USERP1= <user>
##$USERP2= <user>
##$USERP3= <user>
##$USERP4= <user>
##$USERP5= <user>
##$WDW= 1
##$XDIM= 32768
##$YMAX_p= 461598050
##$YMIN_p= -713257
##$CURPLOT= <Network HP LaserJet P1505>
##$CURPRIN= <$Network HP LaserJet P1505>
##$DFORMAT= <normdp>
##$LAYOUT= <+/1D_H.xwp>
##$LFORMAT= <normlp>
##$PFORMAT= <normpl>
##$SURQMSG= 1
$$ End of Bruker specific parameters
$$ ---------------------------------
##NTUPLES= NMR SPECTRUM
##VAR_NAME=  FREQUENCY,     SPECTRUM/REAL,   SPECTRUM/IMAG
##SYMBOL=    X,             R,               I
##VAR_TYPE=  INDEPENDENT,   DEPENDENT,       DEPENDENT
##VAR_FORM=  AFFN,          ASDF,            ASDF
##VAR_DIM=   32768,         32768,           32768
##UNITS=     HZ,            ARBITRARY UNITS, ARBITRARY UNITS
##FACTOR=    0.250966925370066, 1,           1
##FIRST=     8223.43324360094, -341297,      -158075
##LAST=      0,             -258303,         -153061
##MIN=       0,             -713257,         0
##MAX=       8223.43324360094, 461598050,    0
$$ Real data points
##PAGE= N=1
##DATA TABLE= (X++(R..R)), XYDATA
$$ [...]
23828 -35307 25529 32631 -132388 -72979 -138237 -8999 -103383 -82072 -371582 -162333 18886
23816 367317 -197293 74102 178108 -220978 85217 -66033 -87980 183001 -170341 -107439
23806 -107439 71163 -49179 -100511 -159287 210321 -209383 227171 -75325 -192971 100949
23795 104352 250706 -172428 -113710 -27155 93087 86493 190533 -258505 -62184 -222401 176870
23783 -9036 175478 71576 -76916 -171117 50729 -152621 -28452 111961 -234386 -173337 -217039
23772 -217039 278022 138420 -161106 11342 -110809 28231 -147627 166904 -12503 160816
23761 -55250 27866 70678 45696 67084 -177542 -370209 68478 -243219 54819 -103277 21042
23749 -239469 29017 -170111 -17113 -77857 189749 145309 -172227 -109778 69279 -160948 -60407
23737 108845 -158596 -207716 -78276 96905 146712 196048 18487 -99074 282240 211827 18861
23725 75090 92393 -258074 142261 32422 59799 -142510 -172248 334560 36881 -115907 139558
23713 174953 84666 134650 84557 32712 -135413 -307164 -198078 -156296 61020 73831 46586
23702 46586 -185670 -192652 -183334 -255151 292164 44107 199869 -31304 -140094 8175 266539
23691 266539 -120738 95232 -162040 -118585 -277727 -27179 57280 134020 69527 -292648 -47779
23679 -23844 -357455 101242 110103 215824 25153 -86812 -233107 -224000 54820 306087 75017
23667 -85349 -46685 -198887 -81171 -34848 -50404 -90553 -37859 38564 -177078 72783 -349876
23655 332624 90107 -313929 323875 -74677 186874 149879 -5643 114 -70879 -2341 -102138 338982
23642 28127 76894 423787 -7926 190766 266550 281030 -417144 -55780 -180272 -150572 -113320
23631 -113320 89982 176351 44997 124298 162161 104634 -128919 -211634 302258 -106037 -102212
23620 -102212 175555 -253430 103102 -114174 213134 5736 41706 96339 233207 -59367
23609 389176 -34203 56245 -149024 -117909 -125641 -58656 53962 85383 172936 -110603 -86141
23598 -86141 -39992 132145 130102 -321545 -37528 -141530 -118764 -280560 60314 -129971 -51987
23586 97873 -293253 -266081 226508 153249 178869 99698 25786 -199394 255685 15350 -292947
23574 -177579 52128 148096 -250576 145433 -34212 -78716 -46809 146845 -87149 -139635 70045
23562 -300783 249164 -13674 -164079 140165 -8374 -10676 -60037 -13027 109379 -18022 -100335
23551 -100335 -166078 -335743 -30633 -247617 -39666 -135810 69392 -226486 120423 -290775
23540 -76788 148097 157582 166138 -2837 -441002 303059 -70661 -25911 89674 -41661 -130437 -231334
23528 -231334 -122074 48366 -31579 109213 -42762 134736 -63386 269080 73068 -192063
23517 190367 -227685 22275 -176433 -43730 -52470 -96396 -13313 -128361 -139860 -42201 74331
23505 9314 -115807 117161 199560 -263788 -122842 55607 68740 198854 -120222 18689 163854
23494 163854 -107060 -31386 -220020 -55559 -121528 -52724 56040 37137 254352 -193291 -68269
23482 52690 -184667 -55660 144837 273887 159474 -122118 240005 -452791 -51350 4820
23471 -228578 141082 -87905 53267 -157964 -81731 265624 -260315 -106998 -151376 -226257
23461 -226257 -21179 13941 -16170 -180591 -9603 -128567 -118617 -150511 52111 6637 193318
23450 193318 -66786 46487 -146538 -150351 27379 7576 113697 -577602 -32376 -52799 32703
23438 3040 128813 81335 22648 207942 -89607 6488 241981 14546 68630 -220666 -276488
23427 -276488 -187312 -138413 -153348 -83813 -151729 -26073 66864 116742 28241 -88084 123524
23415 -130998 -60065 -59867 -197720 -115885 -17115 -110676 -42773 98922 -164026 285462 162202
23404 162202 -289902 433109 -167684 131976 33289 -350558 223327 266311 123098 213593
23394 213593 67393 -80396 57145 -200046 81220 215991 8670 -59751 -165889 -60511 36137
23382 158497 35222 128120 -22999 129653 -66324 154583 210557 -158944 138814 -65989 55119
23370 399101 163912 -301793 201245 49662 -16267 -120579 -356031 -88361 8734 98387 133303
23359 133303 -136493 -6210 -256372 -44067 171155 -263611 -161528 -81808 -57494 52522 71498
23348 71498 -54775 43913 -288239 266698 -170717 174858 -42178 -57922 36213 193243 -240459
23336 112806 -276542 -188289 2777 -13814 40691 290428 -12920 188396 141216 -136872 28576
23324 -31575 39433 -197473 -128966 51856 209920 126027 -37312 -163258 -179532 -84507 152597
23312 -213269 336 -4477 299188 86112 -176787 282442 -144431 -8595 183508 -86441 159699
23300 -122895 364918 -344181 142611 -244481 118336 9540 -245881 -214582 299178 95178
23289 42500 -289713 -139392 -8846 112501 13967 -137004 49255 46682 -24244 -72210 -89344
23278 -89344 179067 -30599 302644 251656 -467722 190097 207260 8468 -526 -94620 379248
23266 94233 320404 -120169 -34319 19467 -151335 -70697 286646 33937 95613 108240 -127945
23254 152271 148638 -2866 226194 88491 -124871 214797 161616 -33061 31977 -131748 -35915
23242 -20470 193528 -229680 -124953 -298648 39650 -75224 -101126 -178360 102833 -136206
23231 115971 -91354 309936 -363690 -175837 -187185 131725 90108 -97080 -86293 126838
23220 -17594 -63141 -255080 -19587 3331 -428360 37369 -265880 -283722 158843 18787 -66669
23208 128509 -42336 10434 -453249 -139016 -200383 -186044 113678 -57390 -1624 -115414 160546
23196 30371 -204571 284846 78617 -290352 -125352 -32222 2522 73646 125409 -268240 170855
23184 -210170 -136138 -58741 -190035 -139529 -113961 -118919 -229295 209805 -21609 -215686 -54274
23172 -95826 101084 -237272 -70514 268888 -199248 -62963 -331261 111599 -118591 34212
23161 -189803 234720 90930 14081 227779 -62365 297450 -93208 -176895 187370 41501 -193055
23149 -215704 54535 55048 116541 -24613 -26525 140660 -194934 144284 -159247 80931 240956
23138 240956 178166 28889 234563 206859 -44964 -124357 -186557 156764 132049 -116786 -219666
23127 -219666 42221 -162334 35183 -238849 -173126 164042 -267033 142261 305070 -146394
23116 -199575 43098 187054 -24230 84247 39699 176792 332077 55535 -34268 -55532 139234
23104 237593 -146284 308186 -10316 18885 -23025 -67610 3918 40963 -55462 12066 -142888
23092 -345193 -10395 -74030 240281 -174109 -128413 -208414 229592 -188610 -29241 -94525 15650
23080 -341682 15555 -305896 -47908 169574 61162 -96341 215278 270052 -23699 23316 139960
23069 139960 142677 -224042 30110 24388 39788 -141370 -255731 47165 -138012 40891 166503
23058 166503 159855 29942 126353 -33316 -243885 134858 156982 17668 24595 -239846 108269
23046 146926 -170379 -208364 -295643 262551 -80287 179888 332050 -57174 198029 221000
23036 221000 -344825 13369 291443 -70892 134905 103967 -307778 162897 10097 -271473
23025 -125541 -49187 -335024 198934 293637 119738 -319076 74172 27364 18222 -75452 -47365
23014 -47365 65655 -187285 31815 -168542 -10531 -2186 -228966 -49790 96227 -93157 127513
23002 126575 56343 200245 15967 420055 -180270 475600 40154 23871 195472 -219390
22991 267036 155454 124542 45252 46225 91800 -181539 -7992 65006 -178553 -96875 -39317
22979 -30778 46186 416357 36798 -332261 -103587 -122159 19449 -32430 -279914 -169045 -95329
22968 -95329 -246302 -116349 240132 69015 265464 -18249 115805 -137884 -311593 134122
22957 -34186 -8888 110182 -159551 -82392 135953 -233237 150634 -326382 -183960 50258
22946 -3010 -26332 -145748 -259846 144982 -46539 -75324 142785 -220843 -191396 -321860 19272
22934 -130299 -20127 186588 8444 -218245 289959 -111677 205893 99893 28424 -20298 18646
22922 -425558 -299478 301829 -78111 -163389 -97577 -162716 -235371 199678 158201 -200312 -291098
22911 -291098 -303310 -12167 175054 -94472 -18903 86038 -95812 -94849 -386194 24771 -127614
22899 38946 125262 -339518 246788 307762 -22051 -311643 8267 368463 201010 -130094 133738
22887 63819 78500 -112113 99368 -110386 1830 13906 125741 -87064 54095 -6879 275422
22875 45707 -31138 74587 253824 -102099 -243850 154353 -55836 -280292 17511 82119 145469
22864 145469 -128984 -159846 -4508 249854 -22240 -161707 -588620 -100733 -165295 -277962
22854 -277962 208903 -84545 67308 -403708 99394 273143 -68107 -14370 131208 -62329 -21072
22842 -316050 -83862 278683 -117536 -36414 -334213 -359781 -433922 -142614 344356 239658
22832 239658 40176 -137359 73758 95673 290413 -111389 152684 -27859 -186371 -30291
22821 -69063 -28027 -228262 37958 -71469 114863 -38460 23040 -24942 97021 253200 -155004
22809 -416979 29795 7771 -59187 13656 -142510 -8377 -9159 48492 -108711 -248874 94102 59077
22797 59077 46094 71743 -161139 -200538 15236 -214736 10609 159342 74916 -120090 -173818
22786 -173818 -328711 213384 -73405 64742 209874 93911 -243200 47447 -9184 95028 -28101
22774 165429 50935 275465 -201249 -52353 95141 -170924 -40686 76282 162748 180911 71444
22762 -409772 -205478 -265585 68827 49559 -70215 305984 213182 -47915 -144474 -196681 62750
22750 -264706 -310881 -129840 222865 -313505 -151253 -274383 -123682 37019 197362 -198359
22739 118941 90174 -124205 142226 21053 -55913 -181320 -22889 -202346 -79881 -181353
22729 -181353 527414 -103747 158 -154671 -189659 182880 -36549 -130503 109043 253870 -117894
22717 -74971 227402 262965 -45417 249034 -36457 -249948 41031 -124911 139225 167 -106418
22705 160018 115775 -341429 109465 -292972 79212 223133 29434 156697 -171397 245016
22694 -204537 179943 -351367 128222 -345678 68330 -230806 -49992 275836 2249 179676
22684 179676 -49129 -127369 189581 145733 -128819 184351 -81296 -46838 -111647 -221810 150620
22672 -229338 -15511 -189999 -119546 189914 -145386 27389 -161758 -11292 -73427 -31839 -93654
22661 -93654 33518 -67748 -455678 -204565 -47100 194744 -69714 -211574 -91878 -324602 -232764
22650 -232764 -93112 -383238 -60583 -87385 -37660 -170218 -124348 26067 338639 -103927 135279
22638 -4930 -163629 -223047 -328847 -73765 -133015 -186220 44956 328565 -209545 68759 -207619
22626 34995 -101414 47472 71443 496747 -62541 -258852 -128834 88564 2262 5045 -462262
22614 30092 96790 250126 129383 -108031 60729 51813 35029 79893 383552 175305 -261826
22602 -131996 86126 -117941 -22184 -29093 -85717 80291 233370 26547 74553 -26733 93636
22590 243519 197749 133437 256073 85732 48983 -38864 -226639 -247244 -227761 89709 -548519
22578 -75665 -88904 100842 -121170 -44964 -177394 -37743 -258509 31465 39865 96686 -145043
22566 -512020 -138156 -72359 -5509 -25133 4517 465012 -219681 -110985 248975 -135075 -201922
22555 -201922 -52057 -132293 13916 -167142 -67650 45389 48123 -28589 -61833 -12425 155634
22543 322423 -26951 -118221 219908 3909 -183666 -1442 -106180 -165562 -337097 -415449 98142
22531 209358 -20629 -85707 -28885 -56226 -151849 -201698 -180881 42280 185726 128819 45768
22519 -40005 -239260 -13759 -357547 180472 -115683 -367988 -241359 -298346 9505 -249061
22508 180543 -126744 -97833 248936 35020 25567 -98927 -161777 -112464 95414 -22467 -102175
22497 -102175 236458 31754 -15179 80483 -101330 -99145 103502 -144493 305362 22125 -10942
22485 -39614 -3579 140026 -346832 131879 32318 448132 5269 -232753 144510 -199713 -67521
22473 -234869 23878 -42425 55245 -46877 51306 90126 -18745 96650 -2162 -89093 -204260
22462 -204260 31510 104075 241180 65073 -289588 61691 -183818 7216 160992 -12448 -165085
22451 -165085 4837 234227 -201146 161583 -150609 95119 467564 -115454 47389 -126057
22440 132784 -91843 -309220 -237481 320631 -121897 -55363 -375797 50258 223386 -115850
22429 112552 -96938 184170 -59310 -86316 -117628 267534 -241285 -78882 104636 -177400
22418 77476 212374 -85685 123161 -198803 78200 -138550 -210517 53721 132138 -73684 -54888
22407 -54888 -140102 52953 -292303 -103197 110927 7073 -19632 -98871 9837 73273 -44968
22395 -277766 -87673 -338362 -280244 131795 -63968 -31106 -153150 133112 -164813 -419715
22385 -419715 115428 47352 -39103 136344 -156334 -8152 244464 -307612 279998 26427
22374 153736 171349 460701 -160475 24608 137409 -383418 51147 87996 49306 -14984 -233503
22363 -233503 216853 108303 -323119 -143741 135297 -211419 -60566 -132790 11144 120304
22353 120304 142552 -155849 -125724 154450 -122500 50711 279698 -342371 -55769 -27182
22342 207941 -7299 -75406 41241 190102 307268 152444 94995 -204788 16866 89163 97487
22331 97487 9436 167080 38081 164915 -191391 -187945 -88866 -89008 234232 39182 -70633 -156546
22319 -156546 -366084 -61547 54268 -170110 -263005 -115923 -116652 -214394 -333535 -48919 132079
22307 -144568 68229 -378052 19128 -84751 -229160 -278608 65364 86462 -304404 76996 178179
22296 178179 208402 22908 -36555 319285 118958 152495 -240853 -79973 84277 135706 76405
22285 76405 83181 -224422 -24926 14582 224442 119590 -12156 -285394 143628 23856 68040
22274 68040 97277 -189531 -313750 -131969 -194102 154218 53472 -176410 -48369 23810 -19012
22262 -250908 -19159 177225 48244 -78477 36240 275998 21494 23547 33820 113681 -46116
22250 136070 -332448 -8938 -285588 -107500 -329019 77032 52751 282910 52464 47885 116090
22239 116090 -96940 56854 252366 300069 71153 274443 282513 15400 -28193 -150465 147357
22227 73406 164060 -247736 -159650 -233609 104666 61968 -239116 95341 -125842 276604 -113698
22215 -59076 -186814 -17452 -10706 220094 115587 -261343 25939 -126961 -104256 162124 252917
22204 252917 -244483 22230 275292 -60329 178606 -55483 -325791 -47872 -160155 -16059
22193 172076 79259 307461 -124738 239153 -64130 -122192 -63627 -111844 16559 25501 -39776
22181 -132620 -221485 -289595 -15099 -208842 -147900 -370003 -163516 58968 128128 281800 -169018
22169 110819 -123763 62701 -165519 -25171 267490 327502 -147384 -180675 -90113 -98570 -211172
22158 -211172 -107976 -117096 100096 116877 4209 16992 -176410 285723 -38750 66432 -188336
22146 122287 -212733 243074 31350 249683 36382 -21864 80578 -35118 -171701 135308
22135 -336615 23963 49106 -423028 -60971 -226425 24366 63047 -137329 93155 514567 62241
22123 11765 -157861 158211 -167483 -85803 118752 -229800 326505 -117097 163574 132858
22113 132858 164567 141267 179791 72548 357658 -217119 -35420 103665 -415151 104419
22102 23871 -58150 86352 -228342 356857 -25482 -63384 -172027 176852 -53493 -20352 -38277
22091 -38277 -214038 154663 324711 266453 -114787 -228659 -190060 206714 -136042 -145675
22081 -145675 -250437 15812 81216 -132944 -24607 -55199 -241732 284745 283789 -106696 -165163
22070 -165163 85928 -86051 -292168 16912 5829 -213315 -243246 -12188 114206 -239312 -65925
22058 -104696 96055 -122461 -82156 108169 -184295 -288033 24069 43646 265103 -127228
22047 185840 -93850 -102387 -10606 -89872 38195 283727 43952 31159 -197409 -160881 -204260
22036 -204260 61316 79568 -97934 189482 8352 -371616 -3092 154160 -35580 -81013 -21428
22024 -188846 392126 -394342 -189945 -165989 105683 3965 -203712 -28046 -458772 28896
22013 98331 -146909 182668 -13368 -380892 -483334 -38302 28449 60224 291591 -109127
22002 100189 -273353 -50775 -87486 184364 -130179 -260922 489045 48662 -107306 32180
21991 397578 -92011 162655 -128181 163161 -403025 -330733 39234 -163395 -250126 -175471
21981 -175471 14930 -82389 -19147 -417083 -94702 113899 369422 -13588 -73488 29124 148718
21970 148718 -432678 -245173 63069 157826 36705 -199116 65484 107133 252826 -209551
21959 125260 66194 -13671 -161754 -131901 178813 -65599 102810 99938 -21130 -24613 40044
21947 -29787 -318994 -322417 -43011 256432 247411 19577 -60303 463311 45374 -303888 -184521
21936 -184521 -87256 60989 -13346 307603 -133022 3234 -268850 70444 -132522 -211499 -348975
21925 -348975 -102075 57934 84779 107258 -212484 -193543 80300 196999 23698 158269 236960
21914 236960 20065 207574 -468 67417 -76981 -310054 -43174 -203506 -294695 -193309 23148
21902 109050 -17176 265065 152681 28319 -363087 -137976 -338681 65245 -41610 -187993
21892 -187993 217533 113174 -91134 43299 -30198 -270273 -252407 -89366 -2368 169759 119427
21881 119427 -82401 298979 88416 -269261 -75621 59169 70235 -6617 -38411 -305654 73708
21869 -110099 -129416 -53443 179107 174556 -187080 106662 -138344 -31280 68294 -129569 13641
21857 89771 -140945 9030 100122 -4261 -286910 -299101 -326306 18862 163763 72156 102069
21846 102069 97534 -215431 -81648 -45956 95439 -144594 -78721 -45909 -7122 -94158 237286
21834 105081 -184458 73789 -155461 -131509 55736 -83758 208354 -72198 206017 -6480 31335
21822 240844 -56880 5435 132233 -74964 -154065 -395671 158809 268466 141593 -216893
21811 -84020 -218581 -73572 -58195 323795 -157584 -224397 -64519 -64227 -38137 -63568 -111877
21800 -111877 235388 25775 67235 -310258 149435 -12082 244206 273357 15328 -108864
21789 -123360 -78348 22967 -301273 -58947 7894 147901 -47088 8076 47283 -111139 8886
21777 -184003 -118802 -159951 219486 -186570 197243 242041 -141403 50428 177331 -215665
21766 23349 -262788 161546 156695 -171022 379461 63492 -45507 -69131 -47374 -83659 -326257
21755 -326257 -29121 -298793 96128 -238346 71646 -50265 -339598 -55026 168753 -761 -52283
21744 -52283 36026 -277427 125479 -212500 28864 4220 209138 134867 75604 105763 -181658
21732 121657 276314 -295763 -193600 -168837 65242 -43957 265192 20652 -133028 254745
21721 -177585 -242471 -14700 -14765 -55125 -5811 -35880 -5229 446864 -193623 -337750 -52231 -79092
21709 -79092 -5789 5692 -149567 20287 -61130 68893 108213 85886 -99920 -47697 -103042 -435266
21697 -435266 -454919 14792 177926 48928 123507 -137726 803 -159283 -153310 14740 13081 23671
21685 23671 53023 -106285 -53228 -6132 150643 85550 -326046 102227 197643 -246561 15707
21673 1938 -137608 -166287 19947 177661 -130235 -12174 105873 -101512 -212197 14110 -138928
21661 15925 -202363 50883 -40042 -365885 -179138 -17327 -37953 -41746 -231274 -300429 -224621
21650 -224621 -208868 -18556 -349852 142442 -164204 180632 -56596 -88328 1236 -36189 42681
21638 64230 -213153 -353145 41652 -383187 140586 -141013 -257772 43125 108853 -10358
21627 -137986 -120852 -355602 877 31070 -429342 -242209 111655 45799 250905 -35061 -97176
21616 -97176 -41371 -37244 -270509 -296687 25438 -10534 -250048 -56851 19389 -228065 137881
21604 28173 87002 -111045 111627 -133029 83799 153189 -93640 289006 -180311 -61964 -37153
21593 -37153 118944 -149803 -72368 -145230 -235752 67515 -41600 -143775 -9143 163795 150968
21582 150968 -18273 -21497 77810 57166 285693 50384 -216830 -120681 49538 154374 -238531
21570 1724 -51098 226166 -357640 -253897 90016 -55576 -288791 -178093 249448 -43707 -21054
21558 -165844 -151448 -119131 -133813 -124075 -147156 114685 -194674 100067 -33103 -182439 -153888
21547 -153888 197760 -35851 72511 -160631 -15143 -87825 -36557 133976 -37476 -226488 -57978
21535 288920 -127699 -96203 -127287 -271996 -4920 157432 -335283 -313050 -143450 -230052 8239
21523 -59172 55625 150853 -64232 -112762 -56767 123932 -163828 -42108 99510 -20815 -149149
21512 -149149 -106494 -63852 102398 56473 84067 54038 -67944 -158034 38697 -125369 115768
21500 -78259 -122420 186262 -33344 35531 322107 -165404 106544 -322372 199084 -250605
21489 -147302 37533 -51682 -56838 -124838 -41189 -292145 -216444 -107521 -110277 -7501 -25380 -8254
21476 122319 -110044 119825 -415821 21633 -2791 -189780 -57762 -344633 101638 -461184
21465 -128765 -222132 -128870 -439886 239906 6074 163550 -73240 -660614 183811 -185718
21454 -240020 -132396 -20067 -35502 58247 79935 -124366 -35747 96037 138454 -18441 -34228
21443 -34228 -58534 153714 70821 -75934 17670 -151439 136948 138123 -49268 -13733 -142327
21432 -142327 113402 162890 -21078 -297933 -27775 -62129 -23354 205868 -273013 193814
21421 226418 172119 87018 30137 194491 307229 102233 143868 123544 -44565 183473 217825
21410 217825 184101 -31657 24178 142963 90553 -24693 91961 64037 -304995 -233763 -139463
21399 -139463 -240417 67380 168151 103355 74371 39246 -129075 103994 165506 -134829
21388 51354 -105901 -34752 179386 -170629 -74547 353849 96020 -196392 42727 -56215 65633
21376 59997 -52822 -178849 116034 -315875 105332 -311879 152490 -332435 231998 -198318
21365 -58876 -61166 -84120 -155043 -227822 -28211 213878 27010 3735 27426 -229055 216264
21353 61727 -108087 -263621 136320 -261960 -164157 257026 164955 -163943 -118865 151798
21342 -172409 83812 -255022 -204823 -169655 196036 -23241 -682 375454 37309 138768 -154591
21330 -15954 59503 -51084 -43494 -50688 -123785 -327190 288334 31790 18456 -42031 -314413
21319 -314413 -21408 246010 8555 -1085 -306555 -171280 -121585 -26782 -45466 -58562 -182793
21308 -182793 -92182 124340 91288 -120612 -61470 -70489 -97929 29465 67636 -143954 213751
21296 -160619 271997 85439 -367938 -69619 13924 -139519 -162035 -147188 -250879 -64760 -284951
21285 -284951 69379 101417 -25547 -151316 175807 -35439 -271010 -49742 -212124 7027 10237
21274 10237 187483 -381331 81480 -268389 -65464 155997 -38851 16341 24474 -233567 237638
21262 -160737 36171 -228479 -989 -169155 58750 137828 -174407 -76453 101192 220302 37765
21250 -36840 -146607 148707 -178590 -154673 123327 80747 135080 -138315 -82842 85963 -96158
21238 -178605 -89517 -56426 12861 -39635 -51431 -83555 -39357 -242123 -83652 171143 -233684
21226 20068 -89293 150863 -9517 -103285 -197774 -424409 -71282 84671 -364210 -144556 40968
21214 -175263 15768 -334286 -260640 -192567 -134777 -284409 -41932 -72009 -60476 12194 -171918
21202 167774 120516 -29107 -531324 -297021 -161727 -164291 -9716 -172462 -28566 -103479 421536
21190 44319 64127 -137558 -216368 -353309 -110679 135063 -222016 131556 167438 239133
21180 239133 70966 -228908 -227320 -115465 -107325 378533 -220227 -147109 92430 120170 209668
21169 209668 -53248 20146 -246610 -129031 -154886 -465528 -21406 -280394 229245 66233
21158 327217 -44731 113570 11574 212010 408016 -167868 -235771 42548 47846 71001 -97976
21146 56169 -107098 67426 97058 105918 2442 -96979 10438 214539 114597 -104890 -154179
21135 -154179 174381 -342255 -47241 34920 -71206 26915 101951 50261 134832 411385 64652
21123 -94415 -132149 61014 -251482 -510172 -178242 -226736 289831 -377696 154907 66429
21112 -105566 290989 123586 -366084 -289361 -154330 -81234 290183 119289 154383 -30276
21101 -200693 -84284 35335 -203645 -55647 -408339 -330928 -228586 -151517 228561 -112314
21090 -55131 -173027 5365 -203257 29326 -261163 -181608 48061 -183031 -50328 -103475 2703
21078 160848 136347 -31012 143790 -225727 81608 112564 -356366 -21934 108896 287843
21068 287843 -487697 -115104 -199391 -24443 22357 -260048 -183975 -195989 11464 87376 -206598
21056 129933 -71972 -292128 -164723 -386409 -452552 -165941 63064 -118355 -304 -221401 164443
21044 -244161 171679 -166405 -35535 -255940 99855 -178114 -380892 84766 11891 -48105
21033 -42439 -28620 -43191 7958 -251323 46776 66875 3611 423932 -2394 182463 -212511
21021 -443033 132002 51222 398886 -219249 105899 -99095 11998 247034 -58620 -68163 -150810
21010 -150810 181612 -73001 -204091 15352 129456 -96312 -274719 -350280 -45860 -22916 -106958
20999 -106958 171507 -224865 2476 -308529 -5644 65277 -34166 155461 -134777 -315144 -259222
20988 -259222 -41420 -100118 165497 -150375 -232526 -244047 -174559 -137049 -250493 -140245 -23935
20976 -254902 211466 -284904 136108 -210223 -101171 112879 54983 -65698 -86496 258819
20965 -269000 186915 -182058 -184258 11751 249420 208094 1118 -47724 -311527 132885 130485
20954 130485 213685 207244 79271 -232561 58486 -35425 223575 -1378 -445278 -331152 203001
20942 -122086 -77106 -112547 -202859 87655 -164524 33881 75815 -36903 -70537 -147680 -193450
20931 -193450 -93910 -44041 -210766 241569 -56207 27175 -165893 -388791 75542 -36545 -180013
20920 -180013 2965 253558 -232788 113373 -153534 342065 -223358 -156571 -71175 -66682 -89509
20909 -89509 51571 -159416 -163470 -215745 -23084 -14164 -272894 135381 -266277 210045 -132587
20897 -250489 -13257 -125811 -83740 151044 -193935 -317648 -551012 -124691 66952 -105784
20886 88732 -28151 -130291 -82306 -74901 -43402 -15255 -527056 136433 75817 -172695 20159
20874 -133128 96666 -308976 146253 189530 25591 -303326 351145 -15688 3470 -76040 -71601
20863 -71601 6161 -118944 57548 -68084 100080 -6554 -81706 27788 17376 -30901 126719
20851 -182390 -168956 30774 -65823 -171840 -17090 14140 213259 -153116 -331607 232450
20840 -226660 -121039 143481 211477 -64167 -101191 -148088 20147 -142305 130480 133163 -96702
20828 11420 -274364 -200706 27676 -15744 -6371 151510 -217026 -47182 -205040 -33081 127348
20816 -136686 273445 39368 -262009 10628 8827 358413 -277603 -166334 -55037 -319887
20806 -319887 -98836 -284550 -149947 -111333 -120126 14242 -182384 331015 -357782 -9287 120135
20794 -129937 -141960 -337901 -212114 84592 -276229 -34227 -63927 -71179 -7485 -143306 217902
20782 -264635 115963 -94077 -50838 297 -183257 -41263 -154498 -247289 97641 -200309 -117418
20771 -117418 -56690 154215 -66933 -31265 97438 -235504 497317 334146 -87153 36748 -449125
20759 338670 -130407 -84379 -198444 -503705 100399 52666 -12446 -174336 -379300 -251487
20749 -251487 7304 129015 -303783 -288746 -82851 -322391 74555 14967 167878 383234 133581
20737 -114345 24126 180993 -272769 89804 -285534 -103036 -125520 -284092 327703 -10655
20726 -160626 -178629 -51454 5234 -279544 184581 -96663 -189881 -20452 212188 17499 -117864
20714 -121531 -189677 -334004 63471 125519 -125134 28634 -19103 49381 68398 118471 -207232
20702 170426 -327542 -34121 -133115 -43400 70165 -151520 20766 -270117 -97367 -16617 -51123
20691 -51123 -181953 -289071 -229154 204235 -103886 -255748 102203 79511 -63717 -90299
20681 -90299 -317344 296961 -70780 29633 -188106 -241201 -25313 -218292 -31339 -58229 -190397
20670 -190397 -181783 188119 -4566 -399487 -9951 190377 235459 -103638 255426 -189523 123319
20658 236644 -118994 -312972 -196852 -225906 -255344 -97329 85179 -82903 -406520 -238788
20648 -238788 -75430 101992 -35295 -19417 86637 -114890 -314262 125659 -54987 -32603 -142071
20637 -142071 185854 230743 -82349 -331752 57624 -25033 -112493 -143780 -441539 -246288 126390
20625 -91746 289501 15410 121958 -68889 106891 -103089 241541 -195128 -35812 -86569
20615 -86569 -223022 -222481 196375 -99288 433817 195589 -191025 -285935 105408 -145858 174582
20603 -162721 291742 -65351 22711 74437 -27744 41741 55363 345897 -286802 -78931 -156131
20592 -156131 -299949 -311561 -587294 116085 -156296 43588 -61545 -274957 -7510 157500
20581 112424 -75095 -176266 97424 67163 24378 -17699 16934 -172975 128168 223990 -52694
20569 -36444 -301256 -290991 183415 -134117 -106694 212811 65249 -14951 236131 -132477
20558 -169667 -167708 35678 -117947 -11356 -146042 266403 -57237 -16916 -301320 111883 356032
20547 356032 159936 188194 65 -154942 -186855 -75014 -338884 -76123 -270236 248099 -305433
20535 1477 -207467 36336 -293651 35609 36729 -503631 -445576 38641 -12885 77376 -62478
20523 114904 -43455 -121479 -176034 -88572 38631 -163636 67345 -78267 192462 212784 172675
20512 172675 -266180 -55699 170793 211567 58918 82858 -383551 -142114 -11484 118308
20501 -108347 -443016 111605 448503 43408 -4737 114134 -111676 -257548 157126 351661
20491 351661 -50345 118621 -400526 -300931 -137455 -128141 -243351 96402 -218472 -63928 -39152
20480 -39152 115655 236211 -324344 -90703 -103083 -219389 -304302 -273291 -130704 -287031
20470 -287031 79706 -98164 14799 -5008 -442381 -104353 83618 -62423 234334 -274141 -106351
20458 73432 -363298 -98127 -189898 -160690 26675 72817 -56705 270859 3328 -60845 -41758
20447 -41758 -38086 122536 150703 -64394 -193871 109570 67428 106766 64013 87465 -30911
20435 -126952 165475 173628 132041 -12905 262762 228368 -68451 -43954 192748 -68287 167869
20423 -201395 -25868 4988 234996 -804 -234487 -360729 -72263 287490 -79513 63543 192788
20412 192788 44497 382410 -444920 82763 -341891 -425709 -197675 102626 -114517 6550
20401 -55564 -389700 21565 -133228 -393601 -104791 -71364 -334564 92172 146616 -11737 -45840
20390 -45840 280783 -394021 213046 246850 -222434 -105527 300714 -84494 -117319 -126416 -55499
20378 5715 -314029 -102295 103961 -177738 -247154 -255518 184087 156963 -298829 -24192 -58540
20367 -58540 -435289 -145235 -324500 -386281 -237250 306210 -93 -357740 -221365 377159 -171163
20355 -61339 33469 39417 187262 -222307 6258 -365732 93742 -215087 7175 282523 -123487
20343 -193806 -339767 -71582 132336 -201605 350904 -172949 42168 244084 -180776 294808
20332 -154858 -238886 -43236 -74234 -58046 -59347 132423 -278856 -148493 -381832 -224852 -180927
20321 -180927 -394484 -65529 149597 -291061 53051 31953 -18507 -69976 93051 -13297 -248221
20310 -248221 -212602 149287 -194043 -55570 -13692 90910 -134588 -98753 -204101 -262385 -62921
20298 3925 -213465 -45812 -240586 -68076 -65709 6858 -239721 11981 -61203 73949 -175322
20286 -19115 -317339 113383 -312990 235015 95380 -244258 29629 -82098 143678 -123364
20275 467034 -35304 58896 -156002 -451800 -66978 -232114 -441142 67296 55486 -194696
20264 -82692 -94341 -71453 47023 -121416 -187188 -47684 107985 -257051 -210757 -69137 -83786
20253 -83786 93647 -76072 126734 50405 109118 258389 93771 -122657 256482 -291921 72125
20241 156702 -53742 98292 88338 -176964 263173 31117 -82898 -47272 -94461 -241894 -219297
20230 -219297 -324051 61388 -207670 91455 -1108 -111227 -198659 -80527 -81604 81998 -104289
20218 -56605 -37085 -70678 -5826 -177849 -39568 -50824 92896 -103465 171320 13424 -115681
20206 90845 -97454 198597 162966 -222546 -98549 72329 6336 126962 -164943 -278484 382622
20194 98051 -298451 100193 31813 -10277 1084 -20734 -112655 -174946 32092 -346582 -60333
20182 -126401 15902 48314 123253 9085 -157430 125872 244067 -61298 31329 -247363 -71048
20170 -158994 -333823 100183 -174009 -163912 -2989 406238 79829 -184941 -248816 -186530 -53485
20158 -22560 -140925 119524 247644 -218740 -199599 -220976 114389 -47632 -170517 51467
20147 157836 102106 115922 293677 -75735 -271280 202189 -36917 -149335 -32548 -438789
20137 -438789 40623 5912 123197 -65475 -22694 281641 -109268 -170137 -272129 -339876 68463
20125 219728 110854 17404 74076 -241651 -292202 143622 -347166 -247669 -131382 123737
20114 -437943 77643 256514 -24144 70644 -58307 -26338 -408608 -71335 7242 -281626 -98456
20102 -42405 -128583 -65071 -276979 -175272 -158498 144891 149295 234204 39015 -177504 29421
20090 -22008 -292301 -121880 -337621 -53826 -116062 -78679 -410687 -302141 251663 -85740
20079 -161137 65815 66169 55094 187880 -163109 -34840 153895 -233309 134019 -160529 5068
20067 114443 -51387 10796 -136734 -283328 -240058 -171905 147511 -148853 365280 220054
20057 220054 229462 -77896 -213440 -231378 41698 85462 16163 -295262 -124300 -37301 -17841
20045 -92914 -226652 -234605 118527 68827 -21422 -8594 -269451 29789 76142 -430534 -125051
20033 157812 -34733 42432 -133899 -332068 -32864 -333998 142024 -94115 -322104 33921
20022 115517 10054 -1779 -145260 84881 -142363 -23674 -157351 73535 -36933 -39064 -34028
20011 -34028 195528 -53610 92741 -175166 184222 218001 41679 -64479 225092 319334 86394
19999 -204408 171591 -44076 102107 -283027 -322077 241675 266454 -208404 -285577 -87074
19988 56531 -68925 38795 -195680 -197115 -163941 -42865 269341 43042 -137205 213246 -5517
19976 69483 -202953 19171 59904 -162098 262979 -31748 89733 -376906 -218515 -197056 -114328
19965 -114328 47201 71953 -267699 -361337 -23330 -324684 192146 -23142 -77710 -299592 -260477
19954 -260477 -298420 -257639 -506153 354414 -146428 -59295 -91742 -90921 -205329 127063 -189062
19942 -114146 -257929 -102951 -219626 134050 98824 -69556 -16581 38695 -32001 -294511
19932 -294511 -152072 -482667 152830 215506 -253129 -73504 74887 -247391 -108083 -23164
19921 -337737 -53594 16117 206949 165152 45791 195268 -13388 -72437 -261537 -309729 -16322
19909 -143231 -171344 28912 34189 101666 -168156 -70290 -487522 -50296 -1055 -335487 32047
19897 -135953 35904 -71104 -161752 163997 -36223 122886 30032 255720 48949 103673 -98908
19885 152613 225040 -21285 -51111 83499 -75430 -108529 49845 -253913 -120598 21448 43776
19874 43776 -98076 -179527 -15210 -256915 -69751 -100595 -33550 -176931 157805 210760 -80322
19862 -328650 109126 -294080 -173586 6474 228056 157722 -110115 -84117 -141790 213242
19851 132096 -120116 196736 -96642 -11971 -50253 73267 77579 -24282 -314593 -198982 -138872
19840 -138872 -95190 196518 304811 49883 -150300 55054 -84733 -299873 -178006 -364876
19830 -364876 -168985 -40663 -151159 -219227 -22180 -39780 107140 160215 -169478 116930
19819 94231 -146299 -273815 16364 81979 -90334 -359864 -248159 -231483 196460 282129 121875
19807 -202472 58506 -108311 -20129 16915 -52750 65644 161949 105381 121495 -277242 2702
19795 -119232 -200483 385037 -135494 -41136 34617 -16435 -131280 -98472 -106505 69095 20017
19783 -54027 3582 -19175 -278817 -176321 5687 -282938 -76177 -29459 68872 -62546 -107542
19772 -107542 -134674 180796 -55762 331244 111823 7816 -204385 18320 237567 167604 73605
19760 -303168 136468 246920 -274020 159935 -260933 32258 -132374 121554 -126978 -158122
19750 -158122 134622 -150984 -101878 151479 -48397 -204347 -36881 -140386 -220641 119595
19739 383528 -84295 -153984 -206796 -66524 24406 -22927 262393 290141 -139295 -131869 -222098
19728 -222098 9712 -142784 -86099 111624 -95547 -184878 -158391 -4443 -164531 -290606 17862
19716 -69447 59296 180209 -224333 -78351 30001 279337 -134127 -142733 88115 20065 363399
19705 363399 46604 -171446 161870 -571648 -212205 103942 -291548 -21356 249508 -49771
19694 121081 25528 85142 -17707 -46291 -186193 -120976 -211240 -375788 -74642 -146895 51126
19682 140098 -4556 -355998 104017 127703 -184699 161802 46084 238894 129195 -309177
19671 13803 9346 89258 -41307 -68581 -11358 121413 -195553 41767 -64954 167926 -69033
19659 -180272 379217 -208747 17917 40152 -265543 -109251 290897 145773 45877 -331954
19648 296329 -147484 294089 -70133 -21145 -104352 -253138 51718 57278 297 -144808 -140387
19637 -140387 -13886 58683 -218977 -63517 264032 132833 -179329 -17150 -177069 -38042
19626 -175823 49059 -208465 -167388 254768 -25045 122909 -44339 8148 65102 16712 -191570
19614 -74710 -77433 -78381 -94641 -260955 210492 -96755 169291 -127029 -216682 -407562 -226433
19603 -226433 -187072 31785 -134483 -115140 -19481 -79485 221531 87780 -94426 4668 -13649
19591 -196548 -336845 139908 130292 41604 -64451 -196771 -152588 -378079 -343262 -123408 179122
19579 -144382 -303169 -152628 -40148 -41880 -95206 168669 -220415 -92444 221714 -116815
19568 -156954 117538 462689 -477730 86755 -148446 -191051 219819 68976 -290598 -306663
19558 -306663 71174 67218 -11127 -29687 72787 -58356 868 129967 152278 6333 -13540 129195
19545 -149795 -95670 -62996 149214 -228525 313417 30564 -63668 -647 -172174 -94640 -378566
19534 -378566 -514592 -311636 210713 -162080 -38852 73737 -26856 164231 91408 227094
19524 227094 -213091 -240306 213758 86259 156679 49842 83227 123821 87337 -197327 -219200
19513 -219200 26391 -384152 -163088 69358 -18875 -84109 30220 65640 75146 81765 449 -180351
19500 110275 -358709 320534 -83620 34833 -11472 -232449 -332129 31000 -251055 -163360 -55548
19488 -35462 240687 418315 388810 -182192 140013 214441 -94018 -16301 -41114 49810 71569
19477 71569 -57116 27012 18201 176930 -353807 174651 -56467 -39031 -117676 -287237 -82817
19465 -20243 -11489 -127732 31283 79316 40272 85346 41188 -136765 136080 -177281 -81062
19453 -63118 235248 133743 -55314 59766 40985 -69940 31718 -97003 110581 174585 3785
19441 -338213 -153807 -127389 -31873 -298016 -49961 -8805 -105396 312254 -125538 -72888 274454
19429 73046 -12224 -268279 -225380 -227569 -157852 86782 -23109 -389691 80889 35154 79476
19418 79476 -203319 -85891 -176636 -456552 -146516 40593 -158303 47315 -191249 48872 241732
19407 241732 76223 -183413 -259893 -228118 174469 -22259 -45191 200426 268637 9923 -123843
19395 -335806 -171898 128281 9738 68906 -9452 -44509 291242 122813 -118742 106098 -173803
19383 -259162 -155976 -101327 69156 -167580 -173966 -102250 56758 -125658 -210000 -215384 -190981
19372 -190981 -137079 -142247 -158795 -294467 -193607 -19593 216825 131155 132699 -219104 106030
19360 -174383 -65018 -156409 -276489 -39606 -322858 129731 35603 -50746 -452056 -46796 -80595
19349 -80595 -183195 -106504 509 -23460 -234765 -359392 -179071 68119 77767 -6036 -77033 -261018
19337 -261018 -75396 -3299 -150369 -135474 184516 5656 53853 107417 -70271 3855 -74821 -53504
19325 -53504 -105689 -76037 183521 -293118 -343826 -193921 -71787 -224984 6349 -171048 -511312
19314 -511312 -196298 -139202 -84358 -41923 -3187 80870 -35011 345035 -117544 115549 -90425
19302 179437 32893 123822 32623 13669 122862 -133238 -91257 -20301 47489 298272 -77996
19290 -363882 -125925 -17914 -151589 -97532 -534 -280166 -56753 198924 -140540 108725 -241931
19278 -5533 257672 179166 -257466 -14093 52090 -69925 82620 249805 -408708 -278769 206227
19266 75093 -151661 -65382 -115117 -121161 193961 -207480 -200281 112101 -42831 211102 22747
19254 118199 -126344 -145295 -241700 -359461 20320 -61313 124838 -457831 -320542 -195746
19244 -195746 81883 -49873 -155875 -7690 -56398 163965 252371 -54865 -221084 -120295 -169906
19233 -169906 -239187 -20719 -152462 75471 -132261 97106 240700 259371 -219795 21097 -170283
19221 3074 363564 377223 -87230 -78742 -341696 -155626 -76889 -53232 -14120 -2157 143255
19209 -114666 -122831 151455 60364 -192520 -22008 -137113 -443 -22178 -87899 -310600 78973
19197 -184141 -231866 -156773 -86737 -191863 48444 187372 -304112 -370875 18455 -243974 -268715
19186 -268715 -123981 72779 -392513 -50249 -63450 313936 -219878 -119595 217975 5717
19175 -45269 -48786 -131807 -208509 13980 -91190 -114978 -149158 -112925 -114917 315610 960 -239950
19162 -181265 54636 -223879 -244951 297379 113315 10296 32616 -39390 99089 -60095 -315461
19151 -315461 -127664 63611 -54883 -45986 -171366 -284108 -152193 -58550 83150 -164656 326180
19139 -122732 -275638 -274379 66529 29267 7280 159820 126773 -286074 -247830 190465 -221304
19127 -90283 -310649 112229 -170602 -270418 138031 343413 -84 -306030 -26082 64758 5737
19115 70924 144039 172215 104413 14815 23564 13308 -62736 -190741 69131 -129285 3810 -97237
19102 -218628 190832 -112035 312115 11147 26925 74339 -286522 -309421 292409 -50992
19091 -412418 -516333 -230003 -247694 -200853 232474 -293392 -267421 -107045 -311250 -175378
19081 -175378 353974 30213 123996 -41499 75207 -579059 102242 -244004 158257 -42706
19070 53385 -4212 133550 -117623 -398738 43876 30703 -65701 -142857 -148667 -26380 -188259
19059 -188259 -149949 23959 -19019 -338244 313308 196976 -5268 -151322 -186374 -159424 -204702
19048 -204702 -64439 -68632 -217433 226400 -454516 -80528 -294329 -132545 -29917 -272306
19038 -272306 -316395 -29976 -549921 17523 120475 246866 7657 79387 93685 -23255 -182469
19027 -182469 -324218 -50093 -16118 -200358 -32258 -89252 -94698 409386 -1739 -45361 -19411
19015 -35441 243376 -91377 -250419 -38575 -61687 -171164 -358816 159599 97004 52551 548072
19004 548072 410996 45834 -238153 -39573 -142642 -176125 190588 -41510 24522 298885
18994 298885 240600 261903 102183 -13323 -206352 -79449 191173 -12174 -433946 -31751 78039
18982 -62604 62198 58641 -298175 79855 446387 -322349 -357624 -140095 -335430 -304784 155556
18970 -75153 85326 -226439 48939 -348233 -138393 6116 -371719 -160595 -139971 -412784 71071
18958 59442 294340 -28679 37085 -13504 42376 -168590 -304025 -119735 147784 -256608
18947 -431131 184100 -57269 43979 -426507 -285370 143457 -260963 98179 101922 -23243 153716
18935 -43159 215132 -141603 -37937 -182603 289132 -75419 195131 -178885 130393 -209826
18924 -11302 174764 83616 177255 37868 -42166 27357 108435 -95383 201524 -128048 250685
18912 178276 212916 -89814 -45236 -196871 4463 -45381 53706 -76358 189457 115846 176450
18901 176450 -1908 -175585 -355030 -77235 -171399 102635 -285741 267369 -349160 -135876
18890 88708 -215090 -154917 -161575 -342391 -8494 -381113 147069 39384 -158240 -291557 -7833
18878 -72688 58705 -97776 -59677 -126366 123872 218642 2314 195363 43515 123622 -23869
18866 -389862 5135 -76993 -140351 -109371 -102433 14641 -83345 245141 -120732 -157767 -145474
18855 -145474 -170233 61167 -109146 -153105 -98814 -327451 118710 -32577 78105 -18074 112207
18843 -64292 -179300 -85220 -38003 -144924 -77855 -262460 178541 -69052 -63505 -39197 -69712
18832 -69712 18955 -709 106804 -319484 -214954 -14747 208132 127966 -87477 -228382 37824
18820 145616 109153 124310 189483 17540 -28871 -221561 -279514 128356 5283 -116373 -177762
18809 -177762 -58103 -90416 240329 -399817 -152891 -170176 110753 -6389 -151256 62240 -280130
18797 30987 -373789 -290636 84463 51366 -50640 1325 91382 95584 -86003 255392 -176022
18785 -71435 70858 175723 105170 -95411 -193538 -24982 -286100 -49823 -259430 142231 -224527
18773 -25761 -62307 -9374 38719 -13463 210986 317695 60138 -199991 -151792 13559 -12901
18761 40879 -374248 203440 -126207 138822 133470 48097 -301285 -265164 -32021 19546 173949
18750 173949 178128 -278999 -116767 19366 89836 -37928 -277230 97005 69741 -80424 156623
18738 -280372 203921 -188661 -175743 -162895 -310132 -203520 56890 -59714 -92575 -51089 -78904
18727 -78904 -101327 -60488 -204367 -190224 68157 105763 -9998 55795 -19501 191908 -139117
18715 -123171 -190070 12633 -2177 -104005 -16227 110944 -223778 -281382 72991 192520 -189523
18703 -84380 -199042 -20254 113390 -224558 -32819 -38397 258189 -88450 48507 123443 -62343
18691 -97662 -379234 -118356 -36099 -104943 -291172 33814 -44109 -1798 77190 -269877 -105840
18679 -44947 -32798 99868 176916 -51022 -32228 -331640 -26869 -168485 -125465 -126393 -132334 137844
18666 -180638 48344 4203 -565001 -24813 213184 130699 -107796 -333881 195272 -119680
18655 317872 67182 64323 -179918 -21843 -23415 207556 -44769 -127208 308800 -387044 -35061
18643 -228456 -130465 -143784 -38233 -100333 -184248 -68807 -64181 -270558 124037 -130997 192547
18631 -90535 -44900 -125282 178645 309742 -59899 -428106 -253893 -28816 117221 -266051
18620 38986 90975 219599 -138836 120242 -319863 -107061 -74880 325077 -109812 -178273
18610 -178273 -351766 65828 10122 185283 109293 116319 -98634 -289733 -191354 -310088 -154933
18598 -85145 123747 53132 283514 -235380 237904 -42893 -233298 225735 -192170 101953
18587 126244 217205 -284980 -3483 105737 -103215 -3180 27989 -202684 -175922 204019 -57870
18575 -91826 -46340 -266009 -227198 -141921 -113675 -129951 -12132 -291854 -82096 -20992 71462
18563 12694 -330724 -83063 150633 308487 136106 -221936 57606 -258063 279062 -201272
18552 158516 -277525 100397 -1147 -158613 3342 227449 38494 291136 -298080 8747 16761
18541 16761 -7659 -31944 -177487 -80185 11806 -13716 -177423 -57559 216990 224599 -194508
18529 136008 45727 171478 54083 -138319 -56642 -105943 -104202 -164236 98582 243398 166348
18518 166348 -15718 -88827 105156 46799 276634 -99022 64109 -112691 -290347 21920 254827
18507 254827 133962 -181696 -204366 4967 36148 64528 -116472 -118117 -412754 80218 181195
18496 181195 130016 24886 -105039 -124246 -11368 -304394 -289261 -193664 -132799 49703 8255
18484 -119293 -100640 342149 11725 -84943 -451323 286612 -129800 169790 -437526 129004
18473 -315672 -107214 306154 -176750 -96448 -19442 72230 -17180 280487 11237 -196004
18462 -77607 50650 4627 -217872 -135718 -191816 -287173 -352875 -249128 186645 45175 156734
18451 156734 -203037 -188387 178391 -358454 -142076 -338349 -129426 196969 -216438 -85804
18440 -193494 -164305 -108023 -79091 57600 -196444 59702 222671 105514 -119881 -209322 -117163
18429 -117163 56749 -14342 3706 -215172 -184259 -26611 -245540 -72833 29003 -142 -32294 36896
18416 -106741 -289980 -281023 69489 -123012 -295726 7984 -327558 12006 -23687 -300568 108060
18404 -35461 -56348 -200855 -5329 -14474 93878 -56073 141044 102430 20229 -367016 375894
18392 -339442 -161522 -178183 -305021 157018 -171386 139500 51202 -150827 -58559 -82393
18382 -82393 132359 240700 -56291 90569 206632 -228945 237622 39896 242912 220606
18372 220606 23869 -53214 28641 -424013 -83617 17541 122514 131377 206933 86498 -222258
18360 -154001 4166 99304 -115023 42692 92839 97415 -74642 -147987 -403519 -158183 -207443
18349 -207443 -386702 -120253 -103228 270591 53945 321127 36278 -6593 63250 -334248 168342
18337 137792 -100307 106185 -46161 162504 207710 -51912 -139736 165019 -150787 -113455
18327 -113455 -213890 13714 -196822 -105490 38856 -104124 -141682 98818 -18356 -287099 -64904
18315 -297617 -177480 15882 -264581 -74393 -100339 330179 -168191 -413944 -161845 -44402
18304 28426 -82495 -4339 25617 -337004 21912 69006 -271582 413952 131190 -239420 444989
18292 -86493 -124113 -28768 192579 1257 -177406 74895 131286 -58414 46803 33569 -305065
18280 -62173 194803 147891 62384 -28860 -32636 90729 -100879 -18949 -447291 85782 -108162
18268 101088 -319471 56487 -39409 -139407 -123118 -122835 -113611 103026 387824 -22106 -217170
18257 -217170 139242 -81637 -118656 -159190 -15472 -209487 -415584 98888 -61366 31363 -98189
18245 19382 152484 -146239 -83401 35863 -152765 222825 224563 309134 -46199 -7461 -447558
18234 -447558 148505 -113283 -280191 97343 -75565 -338655 37361 -35094 -109753 -43466 -540991
18223 -540991 -96353 173027 -273924 112537 -60214 -96956 8835 167967 -64972 -256365 165730
18211 -101707 -293687 128907 -217502 -71635 -199889 55028 160800 121136 -252201 242558
18200 -48728 145839 212022 -236142 45780 -58990 28115 -17125 75736 -145575 -128388 -326414
18189 -326414 313732 24445 76696 14098 232440 208955 -215217 -186459 -163463 58102 -37138
18177 -183120 -205534 -140216 -11928 -91470 -23748 -50537 101111 336271 16626 -156702 135975
18165 85319 -26829 -176246 22741 156741 -46535 -170212 60743 -192173 -219399 -355519 168945
18153 160497 218911 -194637 10760 -153944 -235252 -168501 -57722 272610 96669 79871 -123517
18141 -187257 -322574 85889 -329920 66131 318537 -177595 47446 -95247 -23020 -275344
18131 -275344 -173791 290719 -23468 72252 -102741 -123847 -85696 -154852 -171302 112052 -387884
18119 -34076 261078 181458 -166040 -482222 55250 109937 -325805 -14125 -380670 -202708
18109 -202708 -267859 46313 239284 -330270 149744 133396 -170826 122689 43844 121971
18099 121971 -61459 19789 86028 166785 -33227 -95784 -66930 53030 -222218 -313304 -285532
18088 -285532 -202768 -59793 -102839 97703 -178660 -192425 4661 197283 202218 -104056 -47639
18076 222527 5523 -58922 -283096 -168990 253475 17430 -180635 107160 119692 -312274
18065 -142451 119853 312359 -69020 -272170 -241320 -237111 27299 181535 -45280 70779 252837
18054 252837 -298136 -98634 160833 24780 -273882 -80919 -225497 -97972 -160662 125086
18043 -120664 96278 -220873 325853 75212 -155868 224559 120324 33942 -167808 -10671
18032 137075 296244 79866 24979 -32748 -79784 327079 88040 170882 58861 -194458 -188972
18021 -188972 -222258 26751 85688 -65449 125529 -58221 16241 -176029 13678 -85450 -75060
18010 -75060 -68298 -122958 -22368 -63474 64285 -26564 175961 235254 -154447 2829 -89386 -60373
17998 -60373 375430 255817 -31369 -102111 -202602 160094 133422 -177464 -247507 124408
17987 -203506 -278634 -86172 235252 14486 -44021 5421 65092 18350 -282430 -9458 124336
17975 -157644 39941 -235481 -140471 -62071 -34355 43496 -277047 266983 -69705 196709 202091
17964 202091 -145512 -176213 162665 25290 -226339 47651 -25892 89342 -278017 43457 -73340
17952 -278054 69056 -56504 -132264 67019 -212031 -30694 -165411 -390739 49685 -191736 -61822
17940 -258815 13486 316642 -177937 -39753 -199357 -11612 165189 -152273 24342 -146777
17929 -100484 -237237 -55030 -65298 52827 127704 110451 71755 -316009 61112 -15335 55092
17917 -120773 -253265 35010 35573 -203463 -253713 58312 290736 84095 285868 -32186 88861
17905 74491 302654 54158 105407 15449 -40352 -159297 -2943 -45921 28651 153309 203155
17894 203155 -296430 -128269 -363934 19846 -67417 -172426 157817 54008 -150889 -326766
17884 -326766 -15617 124264 -121127 238615 -10211 -18175 -61006 8691 -354122 6795 -372542
17872 -36625 128103 -107419 37952 152672 26131 -215118 -102050 -215955 54165 157000
17862 157000 78929 10777 145236 -165405 -146117 61411 -235827 422607 170464 -173562
17851 -48945 27789 -223283 -88968 -144981 8794 -51133 -264112 -95097 141687 -596 -182226
17840 -182226 287037 183742 135514 -157404 -6058 -56425 60779 9437 66758 -20421 -56772
17829 -56772 -269861 -176314 152859 -85030 -189600 -105591 -155386 -101500 5430 -257710 -9714
17817 -88987 216086 -194711 -103245 -5087 296705 41429 -266235 -114162 -45020 -106181 38287
17805 127736 102382 15925 190582 -92071 -28782 -232598 157493 229534 207101 123594 4465
17793 264850 27770 110074 -257159 32015 297110 -116468 -62169 -30342 -75727 486590 -91073
17781 97703 476 154166 -42120 292239 35500 18791 126616 57039 -448051 -76672 -270123
17770 -270123 -228913 -227285 -296779 -81482 -150780 -339564 -5832 243299 191298 16093 -21978
17758 -70344 105771 256422 461968 -14631 -487 75232 91988 -47773 128142 -306885 87486
17746 -255079 -27535 -117723 -13477 -135539 37903 68153 76906 149473 30673 147299 68279
17734 -300912 89904 195062 160123 -107399 228996 221402 137559 27787 -15043 82127 -218742
17722 -90754 168167 -93439 -97366 -138281 -9931 -149008 -79256 126684 19355 -21595 560648
17710 212695 35298 151170 -277313 -247723 -49665 -26537 559025 64544 -176352 40239 -23208
17698 261234 -113810 123279 76028 135900 -102881 83905 25453 271693 -28528 308249
17687 122071 -166774 -172044 92405 32005 5034 405790 190578 -237025 289822 25046 -102025
17675 -76264 -141389 -251319 -89502 -114659 39829 206185 -106802 383459 -36849 -180057 -34527
17663 301985 70715 33621 -118951 68268 -80922 287516 4897 -34949 180986 -136693 98802
17651 38310 83434 -114553 -923 17560 13273 249537 -178309 -170410 -45333 -195641 197320
17639 8606 -69225 126830 458198 -84904 127721 205644 101955 9638 249010 61870 -70530
17627 -17087 -103106 -215135 88393 29851 -22784 -8900 137232 91620 55304 -148312 203514
17615 39265 -1032 84462 54477 62184 -181470 -69429 45796 104675 83793 404949 158590
17603 -107393 -84618 22064 -156343 38186 -209333 94405 -111445 34356 254756 -96139 -21888
17591 -148813 -264900 48538 197457 67677 84899 99159 -280262 78912 135082 -90101 -348736
17580 -348736 -122937 -250876 83541 62724 -335321 -104974 293373 53182 -264639 -51277
17569 69901 -431432 349696 246139 26888 -39476 -65426 -75321 -27769 -73798 104189 156495
17558 156495 160486 -65497 180150 106575 -1163 -59850 -48990 -2180 -19520 -47743 54170 -28788
17545 -154491 -110054 -20345 -88402 -94498 -75956 49517 -147951 336741 -39879 92152 140765
17534 140765 16412 126506 39787 220967 43497 63762 -180883 280509 -104711 154528
17523 -11673 305127 -73640 70706 -267718 -224578 329974 114000 -106955 364540 -56737
17512 56174 -1328 452711 -57241 112719 -242141 171797 -78716 152474 -61029 326446 25440
17500 95473 -142922 65183 -251360 49564 -255787 48176 494299 286230 90199 161187 71630
17488 53174 76976 -25440 -274351 70629 286894 -190215 167492 164212 -302181 -110730 -110842
17477 -110842 427738 -113895 177542 225792 208687 39309 -131896 271049 -142135 37137
17466 308096 253388 149628 116952 333239 399225 87252 240398 29404 -162869 350767
17455 -89558 261812 -6313 109490 -58035 28006 93058 -187758 239875 525239 238811 139961
17444 139961 -239694 -11387 344838 198171 182387 16262 50312 373898 29669 475138
17434 475138 242968 101883 102718 51277 -119681 355580 268330 171062 469005 438803 155022
17422 -99131 366397 283831 227930 35703 704862 38269 288281 -21806 261332 223884 364304
17411 364304 -36847 -105171 229722 111344 348180 392482 298016 27652 148648 274587
17401 274587 239937 347871 527239 -68721 422372 26555 374553 -7975 156095 482412
17391 482412 486264 81039 65337 346728 131830 143184 196924 762451 261998 237251 40516
17379 -41362 425713 497934 62702 292595 -374134 -11964 307301 309548 211215 -268756 265257
17367 215021 -53700 14272 321424 280961 182005 391553 3331 117778 419181 -306040 30811
17355 -162758 184625 45922 7109 -94464 101413 208686 -198773 189416 384922 6371 339138
17344 339138 80129 297880 203846 39603 225143 689198 1442 179987 375873 -40629 314923
17332 -15591 283402 -476159 148659 87875 81875 72375 232820 79122 301636 -63086 134917
17320 217027 -66231 -370653 474635 541306 492585 232472 152953 2555 -59010 132321 72072
17309 72072 45299 446221 172988 196270 76307 504461 123403 426818 270039 -18691
17298 194419 -24645 167958 -21195 47832 233263 247947 198735 -2218 340990 312965 226167
17287 226167 306685 146712 301729 6571 53193 220085 220348 -67744 92799 98347 -10359 50723
17274 245857 216532 63934 307810 46074 330000 511320 109524 43172 89421 52455 256412
17263 256412 4705 55648 36786 111731 444009 -73520 11535 230203 91451 29302 -41972
17251 264822 422758 607105 154082 266818 140956 105565 273186 377662 436046 123601
17240 -209351 662058 281317 329529 574413 516858 232833 149168 151629 231477 328353 282538
17229 282538 295245 143851 29850 199404 257830 307733 233016 134349 397631 223807 -112157
17217 422232 385975 411544 236409 389730 182919 379923 -42870 395697 149596 548378
17207 548378 518137 133267 264964 52575 258069 -140810 337233 29793 17877 494422
17197 494422 123849 57502 277673 -91544 41440 607714 255156 199820 -60620 455015
17186 149456 180644 746376 250502 370222 329488 341031 167506 -1511 280434 491334
17176 491334 245924 360749 366237 142244 193122 491639 156996 473179 -98495 430833
17165 243261 79342 422833 111996 206893 -248446 -128396 579485 469102 -82406 202975
17154 352377 91547 431603 134722 288564 193845 194946 -25380 313681 533921 398029
17144 398029 122031 -37486 682336 386880 470500 484226 169938 59066 248968 219143
17134 219143 610143 241695 343370 71725 475697 92986 338110 510272 313898 166013
17124 166013 535915 543234 294095 230963 227997 354834 196355 186612 19933 433621 298420
17113 298420 489064 395684 364662 404974 374477 209257 499436 341737 393838 309835 808306
17102 808306 585013 545176 210729 321744 257352 338696 657159 182170 99846 500949
17092 500949 275058 182510 572044 691296 146690 473821 495567 659549 735069 527865
17082 527865 588926 476761 263579 525718 438914 653299 328964 201299 606493 399314
17072 399314 406490 756335 452673 419041 586132 488611 304819 351432 643852 350217
17062 350217 602327 367232 754596 731324 400075 535426 479348 487600 381855 611413
17052 611413 812053 704516 441223 656701 573944 140514 605801 332925 800789 584814
17042 584814 551881 679792 207647 518842 688459 408537 549874 522782 396347 456850
17032 456850 679221 502968 348017 835602 519242 623549 687655 780994 823556 446633
17022 446633 506002 527380 351167 547610 622238 953073 572088 692631 523748 786289
17012 786289 950037 663527 662625 588694 772214 93090 519345 718966 1044477 844283
17002 844283 651262 898623 965211 870041 755878 911244 648208 906863 884867 662886
16992 662886 710510 645693 838892 511951 728100 816965 881311 905313 419355 1050414
16982 1050414 1025357 957057 619441 860981 1106869 904825 968056 977602 707883 759123
16972 759123 968167 729751 968532 914875 1040093 744608 1048825 949018 744108 978238
16962 978238 1041363 1088655 1155676 1023890 1021830 1143157 1108728 842606 1107981 992918 1024974
16951 1024974 1255862 940377 971643 1011652 1394119 1068755 1027458 1095863 1297736 1025347
16941 1025347 1177875 1133304 1280137 1584986 1002325 1090826 1336011 1166779 1043967 1020525
16931 1020525 1371487 1319781 1200124 1172210 1047215 1170074 1349082 1324023 1445125 1319758
16921 1319758 1640837 1126973 1258383 1536300 1365362 1194020 1091679 1606522 1273761
16912 1273761 1106589 1624613 1289659 1545576 1499790 1350597 1650753 1453510 1565375 1762805
16902 1762805 1566153 1613396 1501974 1525317 1497370 1520430 1411164 1531326 1919170 1839408
16892 1839408 1844379 1860164 1586865 1727886 1921789 2033441 1657167 1932383 2141031 1883623
16882 1883623 1901768 2015599 1898888 2205912 2135392 2101117 2038793 2050165 2007239 1789952
16872 1789952 2218765 2221238 2433812 2506475 2037946 2461983 2282550 2229973 2510993 2467492
16862 2467492 2683418 2832882 2480587 2508010 2301852 2488731 2476765 2495734 2784356 2497218
16852 2497218 2895248 2889602 2539669 2930716 2925458 2679833 3103360 3352959 2763227 3134977
16842 3134977 2848179 3044380 3362108 3193231 3341784 3515470 3423421 3294208 3686767 3677275
16832 3677275 3987432 3673276 3526926 4214692 3578658 4006875 3666660 4008776 4367037
16823 4367037 3938710 4460408 4141916 4224788 4095835 4042846 4471297 4791655 4284522 4639333
16813 4639333 4734708 4753591 5138208 5263160 5067976 5251566 5356590 5335597 5391994 5561025
16803 5561025 5517114 5842375 5794135 6030794 6307967 6018556 6080923 6543739 6482137 5999983
16793 5999983 6755270 6651396 6884833 7180924 7237386 7367467 7527770 7662710 7877206 8002510
16783 8002510 8071613 8204414 8660916 8613102 8637630 9081978 9185540 9170486 9302096 9629318
16773 9629318 10045396 10397009 10408516 10608751 10887893 11519416 11479402 11828077 12430853 12412223
16763 12412223 12562635 12827571 12968472 13343548 13995331 14089363 14359468 14848807 15226375
16754 15226375 15797944 16165160 16800823 17209236 17734296 18303871 18862398 19282116 19882036
16745 19882036 20470819 21209075 21823975 22232146 23300746 24060562 24578677 25566498 26460467
16736 26460467 27407324 28575145 29327108 30619061 31291615 32505854 33870275 34983671
16728 34983671 36426763 37597014 39406370 41246305 42479801 44093671 45652273 48030219
16720 48030219 49967069 51944391 54358647 56520483 58749847 61357227 63855937 66585671
16712 66585671 69782491 72677499 75636096 78692278 82473604 85865199 89027348 92959550
16704 92959550 96737275 100197720 103840389 107597436 111517783 114507115 118095629 121652249
16696 121652249 124199408 127032149 128996632 131403000 132890501 134201162 134936890 135071782
16688 135071782 134851162 134059332 132912688 131480025 129643032 126836499 124655207 121381265
16680 121381265 117983592 114647831 111304344 107573499 103977690 100044381 96540208 92625627
16672 92625627 88684704 85677857 82165919 78476549 75454608 72250063 69257263 66333722
16664 66333722 63615560 60705321 58111615 55785467 53649964 51235753 49344733 47275000
16656 47275000 45321869 43570364 41870914 40104562 38979352 37062314 36248361 34480221
16648 34480221 33614367 31944196 31327203 29630476 28955178 27644924 26506988 25952151 24990075
16639 24990075 24054018 23178099 22756602 22172900 21317008 20775928 20012917 19207784 18707598
16630 18707598 18242483 17687786 17309319 16606974 16184289 15665573 15287379 14932739 14552472
16621 14552472 14222151 13536685 13529894 13084663 12661948 12587337 12079386 11555575 11652962 11309214
16611 11309214 10887606 10393410 10449632 10223286 10183662 9713531 9680954 9255774 8743565 8913597
16601 8913597 8688815 8276541 8455494 8108424 8152224 7752001 7468631 7607040 6988357 7612946
16591 7612946 7213076 6954771 6552097 6670395 6400107 6445597 6493936 5992664 6214053 6085402
16581 6085402 5555310 5849862 5716819 5566642 5374244 5203867 5302931 5214131 4847205 5013609
16571 5013609 4612503 4505010 4774841 4447167 4616998 4299065 4541717 4161297 4357490
16562 4357490 4057135 3958101 3918240 4086036 3845436 3854856 3976583 3716012 3604208 3504111
16552 3504111 3459613 3361729 3456031 3405356 3272376 3465133 3369974 3126545 3313656 3430184
16542 3430184 3378811 2892762 3038326 3213358 3099090 3105452 3372994 2875534 2713873 2895937
16532 2895937 2725368 2659643 2734063 2684105 2920346 2586301 2451471 2353440 2381285 2284991
16522 2284991 2344552 2240188 2342836 2359310 2492240 2285037 2137843 2235749 2331129 1991268
16512 1991268 2487388 1860954 2277815 1910782 1866513 2111713 2086066 2119293 2254261 1978087
16502 1978087 1558076 2157675 1926677 1845759 1700095 2126220 2073919 1878126 1462454 1567947
16492 1567947 1810337 1549755 1696536 1612883 1545428 1617290 1480906 1413088 1581369 1782578
16482 1782578 1489895 1498546 1301111 1564981 1585761 1574830 1528862 1678766 1312564 1543182
16472 1543182 1531461 1630444 1615066 1119398 1433637 1573449 1414484 1298697 1490239 1402590
16462 1402590 1555144 1260561 1041404 1267106 951058 1180933 1030267 1120761 949039 1135305
16452 1135305 1229276 1064353 1053390 1130636 1075658 1179485 956997 792951 1169165 1220026
16442 1220026 948021 1133338 881663 779358 947302 911706 1317912 717827 1319162 744965
16432 744965 997399 979656 830827 860691 972083 980147 1139955 1064835 1168379 931482
16422 931482 860361 1330038 1151198 956677 823545 940540 961013 1131233 828844 769605
16412 769605 996509 1377921 680363 981005 726980 862772 736886 494228 553306 442670
16402 442670 760938 970903 774221 490735 575375 716079 808697 609097 729386 497806
16392 497806 633622 626512 524309 903483 787564 721034 670531 555616 496767 480377 413016
16381 413016 446103 529858 691391 800789 279079 766320 595889 765602 337736 475428
16371 475428 1021588 564230 590227 759689 591754 741664 846044 562129 309083 647819
16361 647819 600681 515804 668769 290236 809183 555466 459298 407280 651311 653379 667049
16350 667049 678627 713978 555160 439153 350410 592370 560257 305922 369929 448071 362046
16339 362046 673372 392168 349928 249818 352382 377585 143220 458508 541584 496377
16329 496377 255199 487138 305971 534399 394840 343701 272823 50746 538798 383254
16319 383254 486646 528094 487618 231488 700975 226284 446643 55836 592601 135777
16308 -10790 304895 400931 535892 389762 162146 457210 586816 327262 401758 127750
16297 308218 545353 138122 75530 395361 333110 578420 467987 185569 242696 75776
16286 297310 495061 227862 416013 269643 437482 397305 244620 503442 264149 223936
16276 223936 232089 309421 166306 309492 319361 221574 242644 106642 -55595 251460 402551
16265 402551 484151 359794 374361 238111 476690 118594 334628 559116 67775 272971
16255 272971 217076 154024 402795 459990 272161 157906 174274 168575 -18854 -103761 56501
16243 351362 254842 509073 132857 20046 384334 77271 187076 156339 205375 438790
16233 438790 55839 209393 5794 356548 350844 359148 111970 113569 277425 284308 190111 23095
16220 -99847 -1238 115936 -41057 182217 174428 247724 380636 446819 246878 328878 33043
16208 261172 438407 188626 270207 302909 148798 253042 90627 281263 -46352 200849
16197 5488 -162025 643146 67186 -60143 204732 189193 209735 275252 566478 305843 374166
16186 374166 221725 197027 296876 279576 386331 -229349 -21105 304522 151430 210419
16176 210419 -36994 -23556 -183935 226561 204178 225774 576516 25409 -151502 349824
16165 -188891 253077 26744 40918 14998 -246177 12770 -216843 157125 65003 10104 116111
16154 116111 332509 158038 476274 30199 36964 268827 199713 174399 23481 -30215 135054
16142 97239 130964 46469 195968 -63179 -123790 57643 200638 37483 28450 -36168 94671
16130 146364 -45559 244106 301907 390739 61861 325791 -7711 -11260 -16097 251565 166399
16119 166399 106422 66664 243162 -250404 16741 174254 83825 377224 -150880 -26101
16108 323678 237936 -199102 120254 -113217 106657 249913 399171 234521 188464 162534
16098 162534 -121111 210041 85695 86718 263013 44623 257101 -60535 -145724 343772 15857
16086 -142307 -2334 153957 -526220 179237 -194625 -163947 -2892 18667 261949 -54229 249687
16074 149379 -42262 -29111 348128 276014 -68449 204320 -103019 -101505 298982 -222789 16631
16062 158829 -50857 23024 290660 282921 133949 78777 74891 -179074 412385 -49948 -408841
16051 -408841 -111110 -159415 -93190 64726 129860 281895 18191 -253141 -207801 -85245 83972
16039 -367344 -17787 10549 164433 15408 49965 -204893 21323 -296922 -113562 19933 -122497
16027 -216813 216183 -211560 -17534 -240425 150537 136711 108381 38999 -49482 288630
16016 -252514 374380 108311 -134604 106997 158697 1647 130130 76409 124277 -81411 177418
16004 -54873 -242065 -172387 43660 225209 -301915 67002 180507 67664 117818 223204 225925
15993 225925 -85670 141974 258578 80814 -12967 40758 23001 214731 -20767 -341847 41236
15981 -33965 -258820 42076 -157068 -301107 264289 199728 -79151 104297 182974 118413 -150753
15969 393090 -38917 -63807 278581 -167796 -90506 -44747 -61533 103980 263811 177015 275843
15958 275843 388447 172908 574167 659468 64002 178200 264609 170090 -186649 -181965 193748
15946 297877 -28748 181682 383756 -80619 -48499 61058 379020 -333602 -118720 -76817
15936 -76817 339745 199554 -47833 -17576 16831 -166384 36358 -217569 157911 -57433 186859
15924 -169804 -123787 262660 -45844 -47921 52179 120688 187757 -84658 -62789 444624 -120378
15912 156007 -34905 -230645 95840 129781 58571 -129435 -205323 -71981 32709 8441 -190086
15900 -306397 -69269 266217 97411 -88776 277570 67245 47662 -13841 203050 35787 -279841
15888 -18931 -282712 -184443 -259949 42391 -67141 192647 -175102 -10247 50863 204847 -4966
15876 -142190 -317939 -428619 -176038 222031 350677 54934 119207 87835 95461 -11668 7429
15864 -80705 -277034 -99780 -236087 43110 -194731 -265897 -140951 -86323 -80581 66061 -205598
15852 185734 -105057 -149963 125746 54220 143999 16484 -323099 45419 -36529 243145 38217
15840 -158672 -224530 116229 113284 -14610 45999 160969 -237750 -315315 63457 -608694 -156561
15828 386770 32826 24493 144054 23126 -195832 -4450 143155 161114 -240156 138392 -197034
15816 -184797 355003 64760 -131484 276386 -132220 105880 23416 -29868 -170127 19609
15805 98951 102264 193278 -208035 -78575 -101056 14222 168425 33716 121448 -119431 41414
15793 -259969 -29996 -66634 186843 -136011 171967 7165 -47901 90632 -48958 36047 -243991
15781 195905 120242 -184057 54604 -252917 739 13490 48799 313841 -67537 -192117 -31102
15769 64348 -144632 -55151 61949 39905 -254692 -275185 -208941 23111 -4870 76540 -178606
15757 -130145 -144777 50869 -25432 -296851 5972 -90120 -211811 -174761 -152489 21877 -126406
15745 -206718 142703 223638 -177105 182033 -40331 102204 -205945 233700 270619 217339
15735 217339 196026 34950 -189438 42568 74515 85586 154977 23158 20851 -80403 214179
15723 -64634 322177 -53134 51887 -273940 -16847 -111251 171291 261333 220990 -258176 -197273
15712 -197273 -104924 159800 -418163 153693 72825 -257579 -90514 -71775 74413 -162659
15701 147593 95200 -167690 -44732 -217162 -211097 -25396 20769 -167334 -25091 14139 103216
15690 103216 -139572 -317377 -117394 -140408 64264 -250549 -13510 -185019 -7988 -130799
15680 -130799 35082 22224 -187444 -32245 320760 66829 343696 47227 127983 25646 12016
15668 -2854 148215 296798 -108855 123937 -51559 343288 82738 -32247 -36150 -105999 -22938
15656 47395 -193851 -113255 147378 -67905 103586 -71735 104860 -84227 -84468 -259116 -126572
15644 122259 292651 -126779 354286 -148405 13249 17387 -316641 158013 -377637 -35194
15633 -218288 -11942 -35869 -341819 185105 -284790 -211684 -164648 223093 5134 9550 27280
15622 27280 -42683 -125283 50192 101065 102877 93413 134332 79991 -97943 -212150 289921 83354
15609 -88039 58732 -267623 -151990 -109923 -5357 33696 -215850 34031 106453 417878 106702
15597 308631 -212571 82672 -90466 -416431 189952 -385103 -44335 22768 55221 -75194 -83328
15586 -83328 55535 98914 253943 60473 117754 19119 -251479 -165001 -32530 -14981 406813
15574 236392 194840 99271 40850 169222 169413 91381 -270320 -60533 -22108 21776 35655
15563 35655 -182921 -33096 -74084 -179046 -179453 125092 32386 -241880 -20985 159348 -7495
15551 -230489 101740 -218710 -14517 -178703 48466 -93591 -592676 98796 -239614 216277
15540 178493 210030 -20265 92777 44304 224538 37772 -33396 -289300 -196238 -335199 -287622
15529 -287622 1802 93960 288131 12083 304110 38224 -168548 -161097 -104219 -125006 248771
15517 -267131 -167864 270797 -166232 163371 -127332 -42032 -390 -59206 -169183 13376 -178014
15505 -9703 -206380 34352 -8265 223917 74408 162664 -145538 -15124 -92632 109190 143153
15494 143153 -38577 -36836 140147 112846 -369822 -44077 200706 92397 -251418 50046 70764
15483 70764 84483 -203321 226140 -111749 62729 -8155 10933 -338080 38668 79904 -30329
15471 58358 172545 164720 -77461 -178454 -36399 64081 -164100 102271 43846 -404565 -291854
15460 -291854 -51459 31976 -77620 -141309 -59933 80255 79627 301330 38362 -102998 189018
15448 -84844 328371 -144765 -166677 70682 -149434 -11324 -52450 -415311 -398147 -37575 -182196
15437 -182196 169419 188312 163213 -53539 76939 -183065 119863 31313 32103 9897 24414
15426 24414 -59315 -11459 197565 159130 106227 -22960 -300416 -201489 -164674 -128398 -105238
15415 -105238 -99196 -135944 -193784 -310925 30662 93532 -251890 156037 -98219 -108970 -279474
15404 -279474 -128678 100729 -122761 191441 51415 238339 95661 -93064 -75706 -232612
15394 -232612 125225 -63648 -124233 -268918 142215 -54838 -121834 -95496 41758 127055 96745
15383 96745 103756 -302173 -317436 267918 -67115 73506 62625 -94872 -247904 42990 -82328
15371 14211 15473 -267557 -130476 -113262 -159927 142426 -126875 209108 123132 81741 -18511
15359 56840 470006 64341 406870 371020 208093 20789 276419 -214891 -145943 -228047 -237851
15348 -237851 122250 7819 -311870 -53668 -218193 194872 -153188 26903 44669 -262718
15337 -146408 -271685 24321 94864 -30596 -79363 -23395 259856 -154623 230357 -29833 88030
15325 107563 59 4817 -316091 -331038 45334 -141165 -45423 185193 274559 -34901 -167470
15314 -167470 -141694 -66940 175617 239045 -238896 -88180 -3780 174455 289761 217985 293860
15303 293860 -99328 514739 -120869 153995 -80768 -63315 215809 -83306 -31194 322594
15292 510251 62161 18506 27113 -111511 -154638 -141255 138168 28091 150611 -102709 -131630
15281 -131630 121174 265021 83620 163592 -121762 100485 -318737 -37290 100191 -33924
15270 111006 -163860 -86795 -1396 -77897 -50247 -121957 109895 -165538 10135 84192 370316
15259 370316 83665 -271250 137026 90727 268755 -19841 393106 -43280 363537 70177
15248 263145 20811 81242 75272 185721 55203 -98704 70315 32213 -77386 112181 178363
15237 178363 -5256 322635 313018 -195127 12625 -176195 -402434 -42050 -62204 103066 186590
15226 186590 123753 414139 119734 1640066 991729 942916 1330030 631193 -58808 363480
15215 73692 493835 81633 -15504 143016 -216477 442223 114048 307619 215551 207606 73066
15203 363952 -142044 190957 -338000 -232008 158814 393651 -63527 115327 -17664 151977
15192 532258 -271709 -66937 -53771 52371 -122641 122352 63741 184001 47880 -83189 302492
15180 173349 -102507 27660 -21013 178326 34573 -15965 -6178 -37315 32562 -177068 300811
15168 -61311 135734 113797 -69337 130157 86720 -194349 -44345 -166843 25241 -302178 107437
15156 182654 -2115 305658 -181999 312093 28996 -141108 45419 -75089 -34271 111492 -96110
15144 -235317 122444 -41602 86924 160008 -40209 -177732 -215673 -208108 469369 68910 272778
15133 272778 -104627 63322 118031 317433 -160139 23782 65433 43174 -175100 -77489 -72475
15122 -72475 226003 212015 -100605 369201 -157401 154633 43631 138840 -2692 169016 -114696
15110 99854 67021 89916 37237 48971 78364 -234635 74360 -174200 111895 -9552 5180
15098 -27370 -140935 198513 92577 258222 168468 -122286 150985 108101 -78141 190920
15087 314502 216441 437757 -197507 274241 -10817 45989 21543 58889 -70577 136951 62384
15075 201918 301375 126377 42506 10109 320161 -104965 339097 15877 462753 132759
15064 -23076 74898 211979 206308 51543 299262 464165 7448 -20213 244388 61229 55032
15053 55032 275585 136194 185822 184115 279787 199398 144098 -104507 142918 271640 -158996
15041 169719 204956 19322 188092 343526 332545 -149478 95192 84509 298786 -22851 196300
15029 60935 110120 46993 -115990 230311 156993 -190167 306806 4065 -115128 375807 456430
15018 456430 122551 382144 100607 157492 273191 84802 395958 412555 -512 23092 400617
15007 400617 190865 260215 223062 348666 94605 215390 176152 -65162 169066 -122802
14996 194701 293871 341609 143686 235692 247147 275311 -45866 187788 325437 57565 244134
14985 244134 221730 149436 45233 311292 -141716 142178 -61183 150080 353621 173921
14974 325694 203367 91718 207420 -170558 376137 -178752 12021 103977 22520 256555
14964 256555 -161943 362237 213343 229345 80471 91365 -252269 185325 439234 124498
14953 114337 207339 224494 -113017 141401 -77731 23376 48532 119029 486083 -65032 215283
14941 26885 500638 35152 96059 413689 217226 93967 287053 234079 129537 140680 498415
14930 498415 165108 153001 118196 222054 230313 101786 524832 -17857 -58108 56900 277930
14919 277930 123673 47197 255434 269496 348029 9862 344236 328319 -14555 400535 27613
14907 191495 322615 299713 -56370 485552 158233 -118382 362423 461561 284596 445964
14897 445964 183684 40353 523645 143207 175340 206410 206121 163218 339531 170751 212962
14886 212962 229166 477329 20681 326781 -83207 246085 172202 570955 398648 143975
14875 373593 303332 300310 318346 294780 304214 11177 736622 299246 286914 425472 220029
14864 220029 280163 617329 296810 352837 158202 213270 391367 167227 405831 267402
14854 267402 182492 161231 599741 188377 107814 -74388 131583 391328 291605 152304
14844 152304 212590 518759 81613 527547 270823 251542 193169 319932 299188 317307 50421
14832 90817 373209 344072 91886 109164 117872 333792 184114 477095 383797 279338 489709
14821 489709 25938 365713 291080 227245 726290 279870 263839 420399 301628 546871
14811 546871 395111 507302 295386 289791 357085 574783 14617 232842 322359 435133
14801 435133 582965 546146 421391 351071 513367 271131 511780 162793 562316 369385
14791 369385 248480 226585 415678 462058 398926 538416 502726 661249 289512 378131
14781 378131 267891 486471 787016 596125 663606 568345 315375 404607 403211 500083 259770
14770 259770 580280 403149 155412 306772 680601 409475 541008 452539 691434 374420
14760 374420 421720 559068 425733 266528 341018 593663 118471 700504 332558 521059
14750 521059 502063 566950 648926 752209 395435 218795 570737 476356 283430 669146
14740 669146 642586 595476 575967 619956 293459 744191 860178 781371 489338 541777 261579
14728 822370 629281 598530 671003 542970 535697 480823 700382 613574 707193 543404 504071
14717 504071 363405 532925 477993 481811 563611 441147 547698 717625 407323 562221
14707 562221 431863 449079 482175 631315 562861 635795 810723 530805 403362 677866
14697 677866 819826 637226 663018 927191 537048 671562 834428 722531 711123 338092
14686 496774 486388 960910 650386 923072 785187 483979 561049 743454 660839 776894
14676 776894 617586 854482 752010 808756 850647 682434 677889 464363 795579 998736
14666 998736 328372 948578 651148 872042 709279 513265 572879 416537 521394 741375
14656 741375 405461 895931 867907 768365 983798 838473 619791 714296 715288 778822 1090887
14645 1090887 968736 931528 789869 996670 1154918 1035881 619579 737336 764011 849698
14635 849698 1017089 605448 730923 1057640 921971 799308 688122 964544 970891 872576
14625 872576 1316782 942934 860264 971089 1032477 1064136 1092878 1199128 1186373 1156374 1100837
14614 1100837 900713 863654 976168 1200339 1115218 1156529 1074463 1202920 1172488 979839
14604 979839 1003664 1179628 1144826 1118116 1065214 1135407 1233700 1099239 990730 991549 1019223
14593 1019223 1279930 1071863 1364295 1222689 935289 1391073 914548 1208750 980984
14584 980984 1318887 1279502 1493232 1513836 1401990 1506997 1480197 1513455 1400323 1443722
14574 1443722 1365235 1173306 1498195 1400639 1468225 1789264 1645385 1269831 1653494 1656235
14564 1656235 1108966 1778178 1634969 1501734 1490697 1886649 1644647 1722484 1625532 1896003
14554 1896003 1603703 1596538 1573788 1949782 1903772 1615063 2029661 1996122 2024037 1817910
14544 1817910 2020074 1937285 1907767 2008057 2201012 2298336 1779685 1984031 1738957 2065340
14534 2065340 2113028 2106004 2205751 2531700 2557926 2855280 2989613 2953870 3506064 4487347
14524 4487347 5425210 7915074 12057752 22350534 51686805 33435182 12100137 5457238
14515 3322540 2527836 1688195 1816627 2134356 1429139 1826290 1961416 1521006 1874953
14506 1874953 1748805 2131470 1827605 2119180 1910261 1701301 1784394 2111399 1976098 1924419
14496 1924419 2138317 2351887 2056351 2113039 2353889 2184357 2031121 2031842 2182775 2017619
14486 2017619 2098659 2547255 2468608 2194314 2259550 2490731 2145033 2439473 2527879 2237353
14476 2237353 2568335 2695317 2678999 2674707 2715970 2847665 2637295 2680687 2678500 2828548 2783160
14465 2783160 3258598 3215877 2810594 2774633 3055273 3079106 3215159 3086691 3205990 3209757
14455 3209757 3444103 3260886 3356958 3123194 3607910 3634899 3730184 3196707 3429380 3570111
14445 3570111 3410099 3546943 3741299 3687651 3678428 3881916 4045174 3982638 4069256 4153564
14435 4153564 4175133 4053284 4690474 4216528 4119560 4321399 4390502 4734922 4528972 4597400
14425 4597400 4611182 4742494 4905657 5219066 4901198 4832908 5009330 4836296 4974930 5106678
14415 5106678 4882861 5046636 5290149 5141552 5154746 5484136 5608370 5860684 5646361 5680734
14405 5680734 5808350 6075910 5871238 6130520 6223394 5828649 6424483 6226058 6806009 6701058
14395 6701058 6430388 6812240 7110787 7071354 6994900 7215304 7307414 7509267 7464216 7536328
14385 7536328 7734403 7745850 7920018 8083026 8128428 8316531 8562158 8724701 8728944 9001504
14375 9001504 9085176 9193777 9353059 9300647 9597329 9528565 9926060 10064354 10268706 10374738
14365 10374738 10338488 10715148 10837896 11299776 11283781 11837395 11539373 11850787 12044410 12313722
14355 12313722 12413471 13127846 13229203 13321962 13241398 13845123 14279927 14514228 14737447 14827893
14345 14827893 15432345 15799208 15814939 16013506 16350797 16800241 17068347 17601678 18041111
14336 18041111 18185605 18672950 18986057 19378522 19721258 20496463 20827593 21068077 21717025
14327 21717025 22254908 22629565 23080317 23954981 24379023 25026648 25394309 26578666 27131603
14318 27131603 27869821 28287098 29054130 29984635 30522123 31491701 32609669 33760007 34486951
14309 34486951 35384222 36745075 37705985 38742436 39712880 41263330 42678288 44003889
14301 44003889 45392933 47119631 48626457 50325609 52061502 53842334 55452871 57811003
14293 57811003 59819065 61886935 64441864 67023626 69923252 72512346 75393041 78745595
14285 78745595 81572262 85201853 89133034 92881618 97373720 102034098 106645399 111673473
14277 111673473 117012404 122600262 128671797 135452818 141889286 149820431 157464689 165398043
14269 165398043 174667551 184236339 193768265 204614375 215923018 227573437 240182277
14262 240182277 253172457 266746830 281244037 296037221 312313892 328152400 344428627
14255 344428627 360557368 376914304 393047825 408518427 422884514 436045789 447272621
14248 447272621 455000666 456316459 457830592 459909919 461598050 458623811 450593339 444283082
14240 444283082 435984442 425339598 412310233 398271231 383796193 368534064 351669978
14233 351669978 335185238 318699300 302739673 287882638 272896706 258812366 245123722
14226 245123722 232115593 219597313 208119253 197263318 186921690 177066898 167968234
14219 167968234 159663533 152019105 144266526 137111281 130570449 124318919 118514725 113522618
14211 113522618 108448891 103397550 98861402 94345671 90845167 86916234 83388898 79984189
14203 79984189 76932726 73744496 70795420 68132832 65773962 63121768 60599905 58680941
14195 58680941 56514495 54643332 52897590 50991085 48988140 47711867 46243717 45092662
14187 45092662 43789766 42665806 40697239 39425296 38417012 37453681 36616224 35634083
14179 35634083 34359714 33314198 32702988 31430638 31187537 30008555 29280176 28340806 27939922
14170 27939922 26804056 26172095 25684307 24778659 24394141 23936301 23335550 22617506 21869557
14161 21869557 21633972 20909982 20540705 20111451 19861258 19248778 18753143 18238743 18017272
14152 18017272 17727210 17183687 16763082 16310021 16332849 15751202 15229950 15234703 14759300 14719072
14142 14719072 14321218 13950767 14015818 13433956 13601730 12571436 12699950 12580493 12237707
14133 12237707 12111061 12008740 11715244 11662132 11419741 11204244 11050213 10519069 10491218 10477331
14123 10477331 10117911 10066226 9883567 9996625 9801685 9743109 9178140 9113685 9045016 8994391
14113 8994391 8910811 8711970 8454025 8393175 8180890 8343226 7973441 7944010 7624834 7583231
14103 7583231 7907735 7520307 7383941 7482601 7545177 7301807 7116192 7062525 7123296 6682580
14093 6682580 6533712 6704977 6506758 6576386 6532074 6254596 6257870 6002809 5743150 6093108
14083 6093108 6011671 5874547 5679593 5637141 5537916 5258328 5379838 5055943 5492439 5322707
14073 5322707 5085892 5132465 5109120 4640991 4926261 4704520 5089599 4803996 4802006 4471740
14063 4471740 4700984 4980141 4558631 4463815 4670262 4624193 4295612 4209414 4300849 3745043
14053 3745043 4222660 4124335 4173830 4079282 3663590 3623749 3829513 3521855 3696135 3731351
14043 3731351 3688165 3726137 3503590 3644522 3486908 3503175 3422800 3639753 3655817 3295214
14033 3295214 3608667 3752242 3540525 3079851 3160409 3145500 3327365 3145204 3272587 3201303
14023 3201303 3198161 3138601 3160129 2848185 3041607 3167023 2977368 2869430 3181969 2847015
14013 2847015 2983827 2984033 2803626 2780252 2809558 2726492 2920718 2270699 2829483 2591678
14003 2591678 2879832 2721820 2224248 2606854 2692885 2542925 2383892 2380446 2472773 2004200
13993 2004200 2377274 2698150 2052946 2102407 2206159 2141629 2150895 2450497 2245874 2086653
13983 2086653 2020355 2448487 2240708 1774620 2057195 1857477 2014192 1890070 1805692 1426134
13973 1426134 1987330 1908763 1851960 1659936 1939170 1626728 1596054 1585051 2019866 2666074
13963 2666074 3959810 6766572 13648893 39413216 42155380 18575752 10205007 6310006
13955 6310006 5082029 4211342 3747657 3570507 3010329 2628202 2657579 2526532 2427236 2477570
13945 2477570 2397647 2247916 1817917 2097604 1891454 1974060 2049176 2054945 1962253 1745970
13935 1745970 1799670 1899259 1638787 1980761 1833587 1757521 1843822 1777386 1415120 1643395
13925 1643395 1618439 1719501 1743782 1655459 1792447 1687581 1465755 1574692 1916388 1706465
13915 1706465 1859235 1317520 1692670 1259213 1194733 1210571 1356166 1507154 1626642 1565616
13905 1565616 1200430 1564913 1677276 1383029 1451998 1466462 1326038 1447670 1515575 1359014
13895 1359014 1340503 1591100 1315004 1098288 1402886 1557565 1222007 1429427 1358098 1155584
13885 1155584 882415 1471073 1087105 1168107 1501501 1244066 1342670 932514 1320418 1120957
13875 1120957 1174401 1093963 1263973 1537631 1343623 1045916 1096618 922830 1179249 1221166
13865 1221166 1284596 1460379 1244101 1286816 1219192 1319750 1304857 1200187 882294 1049659
13855 1049659 798402 854982 1115068 1195046 986768 1074671 887920 1351707 978471 769805
13845 769805 1332728 898468 1038682 847092 935309 792892 967414 1114768 1023551 845554
13835 845554 1019171 910061 882783 787961 727522 952000 772272 1188574 969287 648650
13825 648650 862039 876563 1004460 841436 971108 729502 1075597 295450 1167834 735589
13815 735589 967914 917398 728564 832002 896397 645350 578277 868917 764367 904119
13805 904119 857587 631119 805510 835575 899112 676035 478548 772415 692240 908951
13795 908951 825553 872264 676293 946366 839653 793703 774362 715016 1057546 852546
13785 852546 706184 750797 698074 701645 701496 798029 833586 596814 847531 468135 436108
13774 436108 641288 945015 999863 648080 606928 644008 809146 853447 711513 93075
13763 604806 450220 761960 825797 544028 719015 522520 398356 533754 574544 610240
13753 610240 695900 825954 634052 715696 589306 718891 531249 648619 886981 591659
13743 591659 264840 388163 622727 633410 679645 356219 790259 533220 556113 482097
13733 482097 403680 469084 742280 916441 688249 696219 390055 444904 575200 649266 858484
13722 858484 409428 475686 514082 669124 886801 710511 415126 428363 368808 301516
13712 301516 393312 583154 268590 587788 404955 381498 577995 351582 461885 490208
13702 490208 652802 533572 264903 854577 373100 740647 461438 171219 578957 363542
13692 363542 700155 524615 381646 623790 669572 403120 408089 337637 579261 264100
13681 322687 134396 228984 744034 672893 542158 350345 453821 440420 533324 480073
13671 480073 715564 247568 623657 552632 397770 355706 203277 703096 444558 419724
13661 419724 797598 482951 503825 568106 692594 778827 383561 519839 653299 616539
13651 616539 234305 248914 431272 275230 363102 281542 249664 379939 264238 369396
13641 369396 602606 353585 640341 226398 502207 253490 522439 539769 284944 144819
13631 144819 379213 577530 248371 190580 336840 250420 577160 581304 413370 245891
13621 245891 387088 764765 670829 233207 299653 453220 394572 641980 260781 458720
13611 458720 181056 297160 519352 474002 337256 410716 163063 690676 334648 229253
13601 229253 378264 402849 457094 159166 308982 474996 604041 516253 600657 262117
13590 571859 209116 255824 564850 491675 390517 273184 539290 -16178 275606 444565
13580 444565 372880 461686 339515 91464 274325 178262 372135 398620 295459 271471 472185
13569 472185 477686 208202 239297 180097 186618 722056 219143 182722 284491 470804 237922
13558 237922 324394 421277 446271 134587 348936 197045 171770 371735 287878 188420 133030
13547 133030 269998 193575 598732 312860 353937 344431 357433 372457 327400 360034 54421
13535 446849 162217 181517 -11161 616107 94883 605062 242342 458006 536957 326162
13525 326162 281166 8375 379885 132468 409456 517982 66443 357599 439728 298498
13515 298498 420243 437493 517239 258140 253142 241376 391909 130362 438693 32739 71897
13504 71897 74910 183004 409750 296884 209669 519180 71002 231579 139814 150123 171320
13493 171320 -50027 298118 570060 115323 -172290 358719 354596 106512 -68991 127520
13482 128553 221000 248096 -17724 110668 183970 331302 -38390 15436 44473 525544 688375
13471 688375 124406 144730 383506 180152 265070 434438 496770 67667 -73239 246944
13460 107341 285753 120841 349389 156589 237785 416694 372722 282336 195539 134951
13450 134951 278867 271641 227818 -20518 176743 405502 -47862 301088 198016 456766
13440 456766 111079 216751 138396 -10535 4199 143113 8414 116010 21992 71080 20063
13428 141954 120597 126180 294196 162643 500897 395681 90857 -25755 22291 73375 -118975
13416 343345 396505 316263 154278 265718 -5418 276832 139191 186688 -163088 -30622 363477
13404 191366 446522 247024 273683 416887 -106933 -50336 410929 -27174 176325 319119
13394 319119 240536 482759 282339 425252 484190 120781 103798 334161 136698 -46805
13383 199541 47414 173562 163015 -156116 180801 135 39333 255015 -61006 -7986 332904
13371 270472 49056 478554 -232343 459767 190989 195864 7697 -131576 120243 8911 310326
13360 310326 22101 352156 118681 245536 223115 -49035 -100307 172018 140824 323016
13350 323016 165619 228926 -195396 213872 329668 -160060 225589 467530 157848 144151
13340 144151 251236 23904 521802 71823 242722 259785 192344 368711 222335 335769
13330 335769 208328 -57332 50895 68806 -82033 240339 22318 172311 262052 201123 110226
13319 110226 702 79058 327285 55650 493728 43871 56987 417490 -13390 212211 158804
13308 158804 135334 108637 187729 211035 197348 82421 -24979 253174 310340 427852 279434
13297 279434 -99709 344498 321325 343001 31129 154894 488439 130512 125900 161557 164392
13286 164392 139418 203688 85057 143106 385085 338687 140851 252936 324301 191984 193766
13275 193766 83038 88522 -134328 175992 235028 184968 148006 393050 150900 156237 129084
13264 129084 53085 149024 -12305 -3371 625206 289270 483725 372927 104112 -22099 -23814
13253 -23814 -13866 263102 332643 241907 202221 247138 -5740 -365996 -35577 -58706 217019
13241 86068 96704 94616 323178 72260 25429 429648 16492 75709 -15596 203881 -55923
13229 222996 35191 148724 261627 -164139 212063 -165068 100912 255994 574776 212562
13218 -25720 37727 144976 136201 5951 191050 -275181 115998 413764 23765 119582 205426
13207 205426 103534 -70101 310620 214085 -176087 -102720 27274 200445 381970 -2394 112167
13195 183869 -124769 -214724 5473 428873 30137 43361 -39367 121989 37587 -99806 189104
13183 -5564 178925 -89657 357258 251640 -25450 27266 -54206 -19975 -170460 205516 42149
13171 145691 -31868 143352 161118 193959 53008 199203 347814 2307 147223 280151 110900
13159 20729 -58821 11116 202872 -46784 -69865 -40738 5010 242628 55413 140089 196158
13148 196158 -78407 -166890 260397 -241774 -99486 -22456 9445 27309 59255 236043 225572
13137 225572 157488 -18324 50501 127784 216807 338033 451168 93049 10868 -83575 66175
13125 -4895 135565 94069 -203020 42326 75156 104500 374936 -183048 251884 -159838 -36783
13113 -57270 -46698 -269783 19263 -140828 60266 214572 -179572 -2141 -2700 -158306 -218831
13102 -218831 192542 201505 -169051 354361 108686 -200010 43939 226557 35098 10363
13091 48953 -173514 -58964 -98778 93138 247546 -203592 342044 -206676 249361 179101
13081 179101 152179 213388 10272 -166488 9643 98042 -152708 -244083 72036 -305573 48407
13069 -25294 5784 307503 33950 -92788 -170290 253836 -18806 31763 -20497 154719 265334
13058 265334 167811 -47049 83233 -159844 154361 426936 92294 31874 4883 29295 17974
13047 17974 470740 59193 271010 -61673 -8065 373715 58685 69772 326512 307681 237321
13036 237321 104027 56150 277661 -84912 -214822 -131327 170024 205580 139193 269537
13026 269537 211326 573276 198670 -19731 -27559 -176863 4134 135331 321526 49810 -52182
13014 -69067 456832 -67308 136427 202766 190498 174465 26811 -342918 -225608 69504 -108447
13002 -85092 237470 193967 -148971 124320 384478 -140595 -137870 -4597 -8201 132120 76528
12991 76528 129328 161012 178362 -122524 74176 59326 -21306 416033 131153 -76800 452653
12979 121389 104497 -168694 37658 137467 77281 34173 134247 -196779 18083 -99424 -102297
12968 -102297 -56520 -41965 -113884 -154268 125108 165716 -33375 -42532 42315 287331 -18869
12956 157892 -131139 187760 196637 -18531 5677 -334366 -15883 189517 -66125 23932 37840
12945 37840 -74455 -34300 342944 26029 -144754 -291308 173402 51566 164446 176441 96094
12934 96094 -77288 -115916 71892 44290 336855 -83450 127923 -62936 -9751 -85940 -103874
12923 -103874 -146921 114539 49721 -200121 19505 315017 57879 -148776 41585 50393 -60555
12911 109142 25084 66568 -5515 -109471 -283115 -182174 223277 205769 142904 78359 316526
12900 316526 -200292 108349 -72811 250559 -87765 -47302 92996 4462 79350 -79031 -48260
12889 -48260 168714 181744 -95902 -6131 -526 -73616 229426 253887 -76065 189385 -71835 13476
12876 133627 -99804 33945 -8332 265675 -42847 191501 150341 92642 197024 267863 -138121
12864 122011 228332 263505 -320959 -113647 173971 -275929 -38144 -18692 -19883 27930 225629
12853 225629 179913 75759 7969 37686 -360310 -20838 -9292 -201725 58550 176319 10019
12841 219050 -204059 70076 3071 -36724 25238 113111 308314 59523 -13507 159128 -126416
12829 84439 254273 -213825 -68129 -169469 273058 162851 105565 347881 158280 139838
12819 139838 -4901 -30370 -272399 -234334 -26296 -76996 212480 522030 252820 23399 -137846
12807 37658 -108785 -57825 287375 -50056 -457 258030 5362 20305 34902 140828 52149
12795 258387 68507 -18896 95414 217669 146305 -183924 72240 -133560 -31950 -258217 -42483
12783 46937 156980 32797 -334880 -75011 -45586 135256 113317 104273 60806 19235 -30290
12771 154048 134254 -109842 -58530 220638 -193228 -122510 18381 -152694 63280 82050 -123543
12759 200041 -140516 130981 -355381 -103549 -211245 345154 283331 -61754 -112107 75394
12748 -289162 -53957 -293158 -152308 143150 467023 -488784 156022 -109887 -347923 -131859
12737 176213 -60300 -188922 -201157 45960 23342 -39895 201663 -172511 147459 36748 -15633
12725 -47504 -98904 261441 23933 -12868 155207 14736 -2655 -43159 -66271 213730 46932
12713 39361 278973 50105 224676 214479 66826 323598 118263 79715 -194869 -25135 134599
12701 -119060 -8727 -74491 47452 -111284 179483 -118307 369325 69399 -504260 -226640
12690 -70085 55650 80577 77646 162930 160617 274447 409656 128092 161527 195945 95790
12678 -231505 -112029 250386 16259 120002 -61239 311226 146214 56992 115434 -88842
12667 -92798 -94685 -161661 -33162 -291909 162801 204511 -186274 -242100 58198 282534 127322
12655 221506 45745 -231506 168394 -264309 49318 172910 269847 65003 -216843 125745
12644 -271506 238053 -137747 -72187 25873 449117 -136273 89314 175011 230373 214870 123188
12633 123188 109058 160416 81353 377967 91407 -215146 -118612 156617 33727 93814 211469
12622 211469 75806 189356 -9291 25311 50383 157859 -21198 -81725 -83565 -72029 115409
12610 156251 103594 43321 -41880 204780 -163077 124224 7870 151775 273471 168652
12600 168652 218269 -49279 -69557 60709 375749 259520 45726 19278 144369 89130 546714
12589 546714 -31706 -70338 53275 124285 327597 -127547 196732 196180 115482 -328467 253195
12577 54342 297588 -256783 289142 -7099 -26361 -142293 -230869 111686 434093 341082 27916
12565 -68208 -14045 1937 120228 -82719 113607 121021 -303094 97391 52460 153027 465693
12554 465693 32493 -112369 49029 230697 -77119 -169414 94455 71915 268838 -272678 -186610
12543 -186610 40881 193265 52683 -102221 279271 51731 416563 -209874 88003 -69807
12532 61225 107292 3024 -9162 154230 35212 149712 -34642 -279706 121979 31273 281024
12521 281024 -51992 194514 189523 9005 -114834 13568 4110 -376590 -45467 -32018 -197638
12510 -197638 222669 -88417 77321 -185279 -113221 -135064 -6039 143236 125255 -50131 -16792
12498 100080 -130998 -270490 -97053 -219212 83499 81832 275175 -12244 -79197 -226610 -371666
12487 -371666 2724 -282942 -63411 -313870 -79965 50564 -279472 386788 313672 -67488 148551
12475 38287 21655 -162214 100323 -105039 -249295 -337097 150278 11379 191218 118468
12465 118468 152009 -24514 154977 -90201 -172405 212415 -99960 -184191 81493 -254077 -106708
12453 229041 268575 82040 140660 -25393 -91573 119323 -223993 -208562 272006 43444 -10472
12441 111977 153370 86090 311655 -86914 -3769 -26286 391837 -253532 81477 -143778 -17119
12429 140283 18032 4967 -39949 99580 -135916 -283364 -110096 -41011 296510 -143173 59004
12417 106952 174321 80205 -67088 -311211 -90013 -77745 216858 -9965 62975 -40451 32921
12405 146560 -331088 145978 -351358 88357 298289 -177123 -93195 -209023 -522568 -136204
12394 -185852 -155180 -59011 149950 4408 -82207 437318 200754 -101445 -88890 174859 -121977
12382 137246 -176234 -25531 303095 -17079 -163803 -20434 126814 -115604 129430 39280
12371 -166831 139120 -277225 -218148 71778 -44838 -384604 21960 72120 8412 -35050 -291078
12360 -291078 140011 66409 11699 -141231 -110978 -107117 -239459 147586 -212801 219703
12349 -111746 176080 -151338 -17519 133805 3235 177381 -209987 -174336 -59700 151764
12338 122027 -138263 181540 29899 -257683 169405 -263015 -58736 81598 450620 -279472
12327 308794 -167645 294947 144751 -340226 -71141 106992 -108909 55286 -70041 233457
12316 211373 156585 -91413 -97451 352060 36892 -220705 -21042 -133220 -294324 -344149 136047
12304 195934 55132 -74922 187829 126300 -324447 90051 -70056 -64911 36132 -151516 183011
12292 28241 35972 -160695 206057 52976 -235986 167941 85404 -69625 -31129 -74023 -62197
12281 -62197 22245 -126305 128195 328922 -115695 85094 163442 -38552 31374 -68432 131249
12269 181061 117695 -78455 -144424 -120383 237789 -370890 5236 106517 174598 -81312 -119589
12258 -119589 190515 -33614 90120 -182114 173086 3678 -18830 -36473 278555 315024 -212494
12246 229414 303859 341002 -27016 271819 115615 176531 234231 -113967 251437 -136728
12235 -240760 -105437 -245572 82006 -136005 -222847 236004 269203 -42051 517910 324178
12225 324178 -57956 122266 143147 91133 -65666 32820 268018 95445 246753 95273 -102937
12213 262850 106676 37348 347316 173886 -135242 -8288 -6501 -157925 -84710 -31833 27736
12201 303671 247106 -60103 1764 32247 372447 -43608 434184 219178 254481 103165 195625
12190 195625 -2388 -22999 -70308 89394 121808 -107153 -222867 321111 -133893 495324 26402
12178 -133399 379169 -128685 -108749 218986 254549 7368 -167800 264244 -78994 120684
12167 40651 314606 153053 268012 154137 222842 -152977 -134873 350339 12250 84765
12157 84765 -276011 110926 222342 17143 188177 302325 244521 112260 373263 -119815
12146 -55408 143039 132240 203199 177026 164495 -50638 64069 400696 35986 209435 -177192
12134 89061 -29947 -9019 151383 66147 164349 -336506 32883 74535 473465 -160917 -225586
12123 -225586 143928 -59477 18363 36559 -26492 -33143 113679 90289 -154591 -246044 284141
12111 114009 143520 94848 295505 21360 -232825 370537 -73865 157321 194387 -747 23166
12099 -44430 113678 -13830 48036 -220056 379028 21255 -125678 28112 24088 -122581 96608
12087 98533 90721 -91164 96105 172517 142730 225441 24105 86441 -59573 253017 132320
12076 132320 -32245 206503 103964 -441055 232853 -86527 54135 37554 -142212 291860
12065 -67466 -144392 -226893 -168120 -47840 -14819 67215 178983 9496 147787 -94105 -19663
12053 396217 87038 29274 -237596 249517 -168467 226798 448416 422120 9428 229989
12043 229989 -336876 -101778 172006 -221258 212917 -223610 186041 9393 211701 -5601
12032 43195 -6159 -75796 170486 283717 -22607 -128554 -415533 98597 355583 -31045 -270541
12021 -270541 95025 -49518 -368094 33247 119330 44245 -91562 81499 15320 -54143 -8167
12009 -419449 257105 -151637 29175 -171414 -247905 -155974 -590583 -121524 -269542 145273
11998 -312152 69881 15706 13869 -207738 -224709 -210821 81070 10019 41800 -27171 -76871
11987 -76871 322191 499569 -5256 25499 -73104 -127931 -18587 295866 -244000 20279 125044
11976 125044 112179 26714 -147166 -30837 111231 124126 241433 -180519 -40118 110030
11965 -105333 244827 397629 -307532 -242872 12966 73216 212293 -242515 57331 -140612
11954 -129826 -63024 300613 297365 33792 89248 -112244 -377359 -205979 -70065 -23057 157891
11942 -23324 -33191 -185662 -263670 -67411 -64722 -235376 68298 336468 68972 142277 -391131
11930 -90299 56865 136026 138916 -8822 -404183 -192058 -60209 -404057 -227117 76883 55755
11919 55755 -310727 -166012 149504 116564 320955 29479 96276 95756 -95626 30961 -112530
11907 -47613 -37642 231015 359959 -200591 71469 111379 -89074 185437 -176827 134897 -5571
11895 -97868 -109473 226095 -52062 -13589 -102007 -202558 118798 100841 231734 -154464 367225
11883 281992 72682 -225432 -528114 -3371 45252 -162424 55863 77172 320239 54835 241488
11872 241488 94908 210369 95963 -118446 69321 47325 -95235 -307961 -82602 -140798 75827
11860 -15739 -57862 -66055 274235 288088 56721 -179136 96016 -72881 58816 -208724 -62533
11848 -4402 -199440 93317 23485 -173750 69635 200959 138389 159137 -253620 50364 211097
11837 211097 45545 -74887 264895 -319022 404828 -220615 -34702 239486 123226 -95121
11826 74808 165890 -195573 -196290 -89993 63694 -192171 -282711 -186600 83705 438244 -204615
11814 -40736 136196 118571 250866 -39426 46698 -138466 25439 -169011 3581 377710 -131672
11802 -255412 -152600 -260222 -193682 104574 -290675 102243 -5851 393855 49681 -160932
11791 -150073 121778 22069 66408 -124985 -340594 -13537 -249576 192317 331792 -12204
11780 -36757 -946 -84286 50842 -76932 54280 -136170 -29571 -207292 -352810 -82021 -43581
11769 -43581 112529 131807 -97174 -294443 224541 -63214 40984 -33030 -6961 135694 15538
11757 -304493 385188 -57141 -296031 -243304 145476 46090 407840 14004 206187 96528
11746 72918 -201768 -131688 105134 -159941 -63600 52956 -53440 -50464 -12148 23727 193625
11735 193625 -237726 -172698 -193496 117270 -149730 284146 158437 63971 33331 -155995
11724 170949 323995 -88823 -74126 -10847 -110885 -143186 -122024 273105 152460 163237 -24936
11712 -97865 -151063 -55827 307553 -111690 232152 -96355 91695 193893 -168772 197152
11701 268590 -9699 -56170 -15801 148209 198632 -179710 90707 12867 -31171 157179 340521
11690 340521 -219816 -212098 167407 -222861 -33953 87303 251022 168809 385671 -60186 145921
11678 -14123 44395 143685 -42630 248751 -101988 25669 97975 -14930 149158 -43941 229378
11666 2593 145680 333785 315855 357555 -275122 -60157 -230200 257516 86561 37965 6418
11654 133177 -213589 -231029 102900 -59576 67211 -51830 89058 85454 56414 306835 -92656
11642 132172 16541 96976 143241 1335 -39784 213874 -158170 93639 262329 -69477 590502
11630 -144599 130996 -122336 -320402 242935 352933 -45870 276059 171903 155527 -18291
11619 -13128 -131433 14031 279571 -82518 -13880 -173412 158291 105896 -220933 -354452
11609 -354452 3894 -184397 21506 -136535 53607 -197350 -407552 -146528 -29341 366699
11598 198114 -32448 91419 -134871 11245 -267252 -618 52458 -235218 -49731 -141521 88719
11586 -76711 -40271 44609 170706 -60468 -237237 72014 -171729 164572 169093 87979 168236
11575 168236 -273052 551050 172079 77935 275284 458898 219587 335544 -182144 -117222
11565 -117222 -97240 422724 46602 75383 -93398 140030 -222588 -12552 38273 317487 -212345
11553 266669 9624 -38929 -122771 95125 18503 -145248 45050 118421 -172272 -9204 45382
11541 1261 35942 131318 153717 106052 -102685 -179322 195570 -109507 -274032 301206 126374
11529 -218176 52924 -84411 275785 45347 114799 52643 -33380 -157046 -54662 -206955 67926
11517 41371 -115066 34791 -126043 338336 -270052 85320 523587 154097 21545 421480
11507 421480 272471 -54934 151413 164478 44614 111403 139943 73811 -155853 40959 -211856
11495 -44749 -197900 241281 277862 259523 -272655 99040 -190333 -226921 187316 187858 240975
11484 240975 -60262 106442 311316 123356 -109304 356769 132346 251369 120510 85031
11474 85031 -154967 -233849 254735 7998 178659 200771 79717 -41020 74995 -46384 192854
11462 71721 -5134 -128108 75776 -248921 16439 52795 41504 355876 9138 -127344 160110
11450 141011 -113381 124253 192741 122870 132408 224110 11635 38748 207536 344084 225346
11439 225346 588416 -32280 874 656 475260 46628 51090 -53987 435367 104402 -147796
11427 9229 70386 448759 36237 -28598 106394 -154912 282047 361422 -37679 -182748 118801
11415 87353 398348 163597 -113470 135035 28163 -143337 91829 -332499 -82514 26858
11404 170151 145500 172635 -66410 145855 148796 -273233 -235454 198426 58895 -127489 146917
11392 -206739 -181367 -112425 529398 72904 -98545 -3557 -39424 100573 11500 161473 -169495
11380 264927 25538 -16145 6611 25099 59310 192037 217429 -107307 -167670 -72203 -145637
11369 -145637 204521 -312409 -15532 -164610 6853 -144169 137333 -23715 255535 138352
11359 138352 -51531 -172436 -76124 -115804 405129 76276 -243242 -9679 211906 -235132 62019
11347 159666 -209440 -48039 -175887 66523 -30409 99486 -113246 -58586 152291 239269 -104419
11335 266673 -296242 -291804 11273 -190575 -191534 267210 -369160 -205052 -37867 -112538 186196
11323 -69303 255674 -58455 -171446 -68600 67709 -408651 208510 283378 91044 -356471 -54819
11311 -141553 172864 103331 -6747 -174815 44361 -100451 250522 -142765 188049 16522
11300 -213643 -144170 -82923 -168 299514 -115766 155594 25444 -88122 -80148 58798 -27720
11288 -119517 -140939 -216741 -64507 -47137 -5258 -42180 29259 165828 -53906 152267 5167
11276 -71472 203464 5128 -127058 209567 -524270 -185535 -94507 62919 -137542 8664 233761
11265 233761 151384 187259 -145286 -293710 -423585 -141847 40071 -194029 269930 16130
11254 114770 -407485 -372934 -357493 -130219 179132 -150810 39198 63771 -218834 -302345
11244 -302345 54225 -147974 56297 276176 -125266 -27098 -301746 -51161 43257 -147327
11233 -32230 -259170 16016 165139 -175551 210368 -198682 -69896 150937 -74514 42893
11222 -33294 -193459 10875 -151866 -449772 -81802 99561 -94964 -240451 -38929 -46745 42909
11210 12806 -235433 -169537 -142547 133305 144482 8594 129087 -7793 68799 53356 -57740
11198 23486 74713 345481 -9562 -17383 185197 56927 33058 250634 -488360 308537 169468
11187 169468 -149049 264467 -29814 -15302 -129132 -254513 -170424 215411 38838 224961
11177 224961 6907 107901 286326 -35647 -201237 58208 -150013 5708 45911 -193126 -15766
11165 -226539 -283433 -159210 129774 68784 -92893 -28444 162942 -168086 -155630 31724 -156186
11153 536749 -98845 -272212 -171114 -255618 45411 -104979 -15618 -153913 -148565 -42753 -229508
11142 -229508 -23363 -27825 13237 -201201 166213 -491295 352865 -319491 -508775 -251192
11131 -184502 -289322 28051 -422051 -97406 -24863 140793 -19919 72827 69628 115100 -240570
11119 -68642 -34153 34513 213656 -56252 -229972 145054 82131 -238661 -183073 12086 98839
11108 98839 -162239 -217199 -41046 256697 84894 -28737 117692 456368 -57513 29756 56370
11097 56370 -170814 -279313 65809 -101774 109431 130777 -185401 -222863 225986 -7106 41352
11085 -13447 -358360 164462 94214 80602 -129967 -124245 91454 -36887 -26081 -206855 124584
11073 189402 200864 -15539 -132340 172059 -22292 -69227 194612 321120 12745 135589
11063 135589 351833 119521 13186 368350 290676 378043 273676 335269 60229 359775
11053 359775 414648 154154 274655 192936 -131023 313216 175632 138982 44114 9257 69172
11042 69172 338376 243050 105887 128245 442260 637272 353610 297863 507030 786254
11032 786254 347819 93322 463261 693085 320795 299460 558672 384109 159700 547052
11022 547052 219746 378323 796626 551657 868327 311986 557303 818816 659150 683516
11012 683516 364977 562747 556319 539983 357747 440685 619269 735456 448146 321439
11002 321439 528244 350821 380845 516530 938509 717779 515351 524185 496970 330847
10992 330847 517530 290722 401889 747860 297086 352199 259251 433207 326283 488647
10982 488647 642257 404400 389220 196281 692133 543316 249817 622555 330723 695616
10972 695616 460932 413953 727384 698920 640695 777646 551231 739839 661864 571836
10962 571836 657799 535311 333930 627145 704917 1042705 768662 677025 1226934 588833
10951 705160 888904 1097314 1378171 1079592 1642988 1712222 1728087 2299796 2727772 2097895
10941 2097895 2056713 1915335 1802580 1654689 1504046 1315633 1532377 1498894 1147482 1340531
10931 1340531 1330867 1518654 1456683 1622355 1499012 1418001 1345967 1337391 800532 773830 818626
10920 818626 566151 242238 766113 267981 543823 411793 795406 363546 267472 40245
10909 290899 132143 175620 133983 -137410 12977 516913 6267 334096 181062 -137133
10898 -11488 -4223 25119 47423 22451 122616 417472 -42540 -165689 92885 -116811 -298146
10887 -298146 -19363 -148344 230346 131677 40370 75199 80222 16136 120045 -85094 -331510
10876 -331510 40501 -14933 316587 171155 -127240 77253 107715 -45990 -167129 -34231 328442
10864 15085 22406 -1933 -139202 222408 129018 -102780 -229598 -43342 -61890 -326991 -1103
10852 -76720 -197099 205367 -186808 -46638 -289005 109 -150594 66339 -13633 471210 -5537
10840 112751 80296 -244455 191230 299412 -72058 58710 -23331 420630 -64121 -305767
10830 -305767 241119 248 -208899 -308181 317903 -226733 -75588 -48545 -196484 74226 -105270
10818 78583 125373 89395 -49906 152436 19327 61824 32684 -410913 -55813 -1401 -213593
10807 -213593 161263 -191650 -82152 -55871 194435 -40119 166844 479905 317174 156244
10796 -316793 -81494 23207 223819 -53066 -91524 -9779 -230740 95281 -19457 109500 248761
10785 248761 -7419 76792 75851 -132681 258408 40398 -32275 -90163 -244741 -567250 149467
10773 68802 -130277 -56183 -19201 -168971 -95757 36309 260337 -148666 -96875 -241709 196728
10761 26390 348624 -272198 -82312 72248 -78640 -154372 -165650 130010 -166403 -139824 -190451
10750 -190451 -391773 -535923 -259034 -77012 64222 181660 -165664 12296 30511 -234735
10739 -78256 259854 8076 -6906 -51772 14569 91490 -65203 -29536 58634 156984 196754 59032
10726 -132330 51408 327153 92168 -54179 -99155 -357304 313285 -230943 -192030 -113057 -124038
10715 -124038 -40138 239110 -135620 -39766 -88539 -277755 -210381 -496427 29374 197925
10705 197925 215115 -252347 -246128 -240367 -154916 -148390 244868 -119751 7252 -63391 -45490 94673
10692 -42505 -131640 -380050 188260 213359 126897 -318961 -43817 23858 -102567 -300786 -103644
10680 58928 161967 -55263 -276572 323332 55001 -229880 -183902 59633 -80135 -119668 46409
10668 -247 118249 -8974 -131702 -278494 152925 284343 317450 -23078 -131542 -84748 -9457
10656 89386 279295 -469105 -201718 32526 78722 149210 89697 -176746 -167642 -121408 -153525
10645 -153525 399820 -150370 -273132 118685 -186397 38930 -206256 -81302 -270469 72035
10634 -39795 -143742 83121 34926 -88001 58143 159249 -36507 62398 -19769 -77552 -208295
10623 -208295 288366 -194128 -214011 -20110 -34765 -222810 -222461 -57891 -35801 278825 262631
10612 262631 -270193 -196682 -175203 85994 -180942 -120766 -293228 -278841 91235 -199292 -139195
10601 -139195 -72003 -97797 -55891 175088 151297 33419 -63284 -302274 -37998 35729 31999
10590 31999 -195970 -187332 -198031 -134518 -50889 -169332 -31239 80961 76486 -243110 -6720 68956
10577 203017 -84345 55694 -175818 -133953 8563 164196 89265 88068 131925 95088 -86983
10565 175247 -31182 69438 -88055 -101158 -50745 28589 -372 -144531 -149329 132066 172782 -79277
10552 265530 199345 39408 -49185 150300 26844 -159375 31168 379435 121381 -237128
10541 143683 33587 9030 -32126 318788 -195241 230297 114209 12137 85546 -322362 -9330
10529 -206339 121704 -256541 2342 -101365 356388 -25867 -18825 -86694 -55742 218258 91344
10517 -107473 344282 -74519 218662 -36914 -100153 -158979 110540 -49254 -161659 131974
10506 -273127 -227621 -160612 -115983 -237180 -37281 -184428 -61421 -143843 -41243 -8110 11080
10494 22823 -273895 133937 128596 89518 143456 -46148 -65406 -133963 -4029 -7178 87920 7690
10481 -334074 -9644 -20033 -362037 -193056 -228081 78200 184450 30469 -10031 -8842 299174
10469 -212716 -76235 -6580 -211764 -12533 -74528 7545 -415903 209068 -75937 -86961 10318
10457 133848 130264 170735 423034 435530 585172 418610 246629 422255 424212 -142972 227947
10445 236174 -12927 -255393 85420 119459 -159172 165728 226553 -160066 -81807 -124146 -149582
10434 -149582 -103446 -222862 -74184 -20426 -251912 -128631 218358 114833 110865 -324889
10423 95825 196395 -70622 -9301 -114709 -330028 -150925 54888 -137691 -72432 -17313 -3136
10411 160359 -274652 -240584 161508 56713 -133355 38754 152756 -211363 -62388 -136667
10401 -136667 -38981 -64421 362669 -130092 90797 -116296 -138363 7197 41869 22110 319774
10390 319774 -513160 73963 190797 -45554 -46975 -322732 250 -64755 -212978 -92307 53641
10378 227600 -146770 7398 -413346 -61363 -200462 -342668 155901 -320909 -110740 295368
10367 -105552 -59810 70941 57188 155177 389973 24981 234498 55160 -6599 269448 72197
10355 329767 16935 115996 319410 68280 113896 61775 285362 510873 298952 56721 299058
10344 299058 313126 -76714 392512 278992 -112831 566508 531030 411377 339988 254178
10334 254178 343433 -87030 185709 -39670 205370 122859 87915 208891 43023 173923 314163
10323 314163 522768 100549 232332 461948 30444 -58763 559759 493661 -306648 46610
10312 234843 53371 562125 524996 169773 -385176 86317 112170 221116 57872 333531
10302 333531 73566 46877 -177126 448143 -2633 183979 311361 302632 336505 56651 37017
10291 37017 -132126 -85356 147050 96457 21062 -154567 30091 -83274 240745 65265 -3459
10279 99133 152950 9405 -146379 259849 74099 -441150 134145 209879 49215 48780 199454
10268 199454 266820 -54939 -93596 -106108 63797 -34825 32160 -162352 -187094 -229367 241417
10256 -21351 174569 155502 -230615 -17945 -71402 177639 -224947 98508 255713 -397281
10245 -171913 72716 -122521 99612 -233311 -257549 210455 -99846 -53260 132111 -96561 211974
10233 277462 374348 336260 276635 391501 97867 22827 210032 -104509 13825 -260127 118558
10221 95552 257891 20290 -35453 -28735 -114299 179481 -315519 198233 28364 118261 40733
10209 -136049 -305467 -166970 31357 -62010 57570 -108772 62079 107970 -84642 -169028 182668
10197 -100438 285299 102964 -58546 -99727 -15549 7974 -123928 -311011 -256097 93823 -86712
10185 -49687 -21046 -103343 111353 -25311 -155520 -24361 12419 -54517 -70099 -44076 -156955
10174 -156955 -212553 115882 -258393 161761 54179 58858 -44734 217304 -46840 -85890 -117874
10163 -117874 64814 23807 -257719 -9873 -170469 -122474 -38905 286011 30491 -450213 122885
10151 11078 -188875 -240374 -68430 -11544 -278374 13629 67911 116412 -151982 89200 -78019
10139 -55073 -220012 -77115 167286 38537 -87458 40892 -152426 -479171 -357633 -94357 -111645
10128 -111645 -422255 -22701 27376 7758 -118 -120342 -116503 75873 43435 -89458 -362129 99028
10115 236566 -68367 -74456 -32599 122248 24506 9351 -213777 44632 2522 -72407 -148158 -110736
10103 -110736 -208946 -34050 -70528 -76705 -102524 -74070 286090 -99143 -240980 -74582 -36386
10091 -312117 155632 -228444 -56143 -46169 -40663 -215059 272693 6591 -223965 -226986 -405786
10080 -405786 -4663 201230 300107 -124963 -364187 255723 91352 -220619 354451 -282243
10069 -129961 -255889 -20121 20369 7136 -11374 367141 -33544 -24756 -25272 -232619 -135500 -130371
10057 -130371 -277515 414701 272 85908 -89371 -102772 -288776 45305 189634 146164 193049
10046 193049 -108146 170432 47614 -82748 -311394 -282424 24718 -305871 1859 144826 -170753
10034 -84230 -35221 140359 -54673 -263782 -103033 102120 417398 -129263 76755 -163598
10023 -76526 -114373 129573 -98420 -180751 331347 68408 -162310 -141929 43694 -260261 -129264
10011 -205527 -50955 64666 -138125 -137576 63181 -264677 -186786 -94713 55261 -30915 -242552
10000 -242552 -91576 15010 -204554 93826 -251723 -375053 -20886 -4112 -118975 -184935 -289034
9989 -289034 47070 -283661 -67015 -21966 80209 318802 -187884 -101457 62241 -243339 -384545
9978 -384545 -27828 -442747 302260 -368940 -263660 9645 -234641 -355231 1181 -265954 -118201
9966 -40931 279410 -113007 106001 -225209 -214398 -26766 335537 253380 7235 77862 -48176
9954 -9994 -89611 -203491 -56403 -35713 -175872 7167 -193187 -232837 -187283 -193191 -236623 -22359
9941 -175061 -85619 -222234 -87594 -158281 -227999 34908 -370855 141424 -242830 -167617 -270090
9930 -270090 -176061 -319857 67735 28972 -7861 -299305 -77403 -249581 -161926 -193109 -26485
9918 102826 -255052 -58997 96342 151031 -149797 -224536 -233501 -105966 -194093 -89836 -166704
9907 -166704 76569 -107313 228528 31439 -61649 -236095 -32229 53748 129956 43648 32563
9896 32563 27980 -240946 250364 -79200 210164 -186395 -332638 -161071 37238 118194 140930
9885 140930 -38435 77558 156415 -259516 101065 -2517 325469 -459367 187962 120149 -231101
9873 -73123 -149907 94866 -460818 58476 -109459 -165887 -69382 58673 -196741 -8444 83060
9861 156446 -261900 -168626 -292549 101023 -217497 93282 -483228 -35333 -9589 -32311 -227210
9850 -227210 95570 -24663 -3065 -92119 -122966 -53803 -237999 36325 72668 35615 -209436
9838 21506 -2895 35121 -359096 -228961 81615 48375 268260 27108 -67378 -283851 -56861
9826 22403 -61892 -63538 -32627 -146374 -9491 -68668 11883 162201 660 -82039 -160207 -34888
9813 60571 -15005 -290276 -54156 181205 -35802 -16699 10798 192125 -40591 -49748 -220156
9802 -220156 71492 -408098 -78097 -181834 -93841 -162486 -110101 308237 -414690 -444030 21656
9790 -67805 -55332 82293 95736 -232878 -144809 29659 -191589 -22417 -33372 -116205 29578
9778 163362 -72415 -121735 -248537 -50158 107939 -41870 -74122 -138719 84146 -575 -42322 -61074
9766 -61074 62512 49927 154876 -51706 -163038 -299795 -350608 -179737 94309 79038 -129885
9754 64724 -70881 71704 -351331 130755 28415 -86590 -346702 -137925 -151961 -80440 -261662
9743 -261662 38540 -82081 -249765 -153446 201969 152643 129341 -82023 -203924 -191085 -119025
9732 -119025 8427 -1892 -20403 -107606 -358723 -21581 81328 -315762 -36923 -72438 -28112 57371
9719 -314921 208883 135117 88119 -158422 -52062 -362756 48238 -9303 -234767 141262 183942
9708 183942 -74585 -177480 -412692 3225 -272322 -384561 -361819 -75557 132086 -266460 -260295
9697 -260295 -70085 -17018 166015 -50761 -114092 -330474 39258 54811 286121 120328 -217797
9685 146016 34816 -279807 95187 -56260 14295 139500 -235354 -54191 175747 -85402 -104191
9674 -104191 99891 -25308 33667 -350010 -126315 66939 8252 119364 279628 187169 -7001
9662 -365743 26568 -75285 -393654 40042 40509 28634 -318148 22671 -17109 -147282 91042
9650 -286116 -83812 -76120 -38777 53890 -355398 -155918 -202897 9952 -279580 -22002 -94276
9639 -94276 156437 -175131 -302154 -177912 -216965 43442 -137025 -47645 -232243 -39514 17303
9627 -202108 203900 -17344 185536 -141951 -102952 -23879 -96303 -173388 13130 -179699 41945
9615 -134703 -233520 -214729 -47891 76107 -110070 134261 216837 8514 -57456 -272500 -46660
9603 6606 -98579 8420 -162482 -314098 -238188 -124100 -60967 2873 -212257 -51754 -182423
9592 -182423 -147357 -107155 -251880 -65170 -192019 -158830 41075 -235407 -27766 -184721 -82774
9580 -101994 -292922 163146 105648 -39087 169316 38667 272623 110034 -135215 -110696
9570 -110696 4417 -93707 -23259 -103378 -199359 -263470 41713 37349 -25485 -162464 12007 59164
9558 59164 21235 272749 -441444 -142657 -59779 384348 -75073 -127518 -390804 -128816 -207057
9547 -207057 115805 -201379 27540 97956 -243199 49410 143068 -345216 -52861 -559298 -301276
9536 -301276 -99480 299337 194004 274310 -49528 -277477 -238191 -104371 -207686 -30810 -4283
9524 96606 135349 -172364 -169431 222800 -251366 185905 68115 318404 106332 200529 11554
9512 -158987 316829 26705 -266710 272071 53516 126947 -157424 -253281 -84382 -166283 -491057
9501 -491057 -248471 -636407 -126610 -151314 -136647 -285953 -123641 105391 -212083 86203
9490 179333 -186228 -416229 -222937 -90402 -91974 -110556 -115946 92784 11207 -107748 136120
9478 -39112 -245197 -167012 48069 -113002 -82857 6341 -83645 -375847 -138269 -320670 -167971
9467 -167971 -244539 -264036 -4838 -64776 -54075 81423 100087 -338801 -320160 -89990 316974
9455 226615 -57254 -229759 25581 -357093 -403614 -296479 -71940 -322308 -103546 48746 227595
9444 227595 220791 9234 -18334 -204727 -180012 -90604 82224 91650 -169659 140083 -205396
9432 139677 234945 -86499 -151303 -149271 46959 -386395 -184328 -262436 -167693 -251568 -81317
9420 132595 5610 106391 -196766 -51576 165469 173512 -218586 39710 34395 52325 -121395
9408 -20535 7230 -56262 -42131 -425702 23919 -345099 -66778 -150333 -345153 -274906 117557
9396 -236259 -203384 181370 -64787 -67197 -162902 -82639 80140 46895 -11006 -30985 -86002 175816
9383 149920 8181 457998 -48805 -113871 143696 -274817 -173647 -96386 79179 -75525 -46350
9372 -46350 71462 -115278 -379892 -103848 -300190 53978 -132510 164301 58770 322154
9362 322154 -6614 -32188 -120277 86326 -1037 1297 -26319 -4664 -56983 -165177 -151801 129630
9349 -177957 -112704 217908 49267 87514 -44106 -53874 81736 -144424 -173174 39998 -110234
9337 -28555 -182379 1964 96419 103854 -258348 113910 96554 -103466 -267568 76421 -85830
9325 144581 -325235 -134352 256795 172497 -188313 15902 -220864 130262 149650 25513
9314 17801 -107125 64161 -14823 -46540 -7728 7304 -129527 199902 -66962 46063 -96243 -147498
9302 -147498 -82238 53915 -20638 -19499 119881 -224020 158850 397226 -229172 -103281 73186
9290 70923 -91428 32279 -107173 -78036 -131095 -77484 233148 -113228 -199222 34536 -158070
9278 -126554 345271 -97124 72798 707 -109225 -59227 298649 41588 -122239 -102833 -127869
9267 -127869 15145 -289330 116887 67374 118496 210715 133560 -47081 -1136 -144253 179252
9255 3000 -117596 -24229 -16792 -323390 169744 179019 19866 -201709 -210152 -81326 -228791 25057
9242 259446 -297395 -130881 31778 -274970 249964 107001 171934 -411646 -62773 -92293
9232 -92293 -9812 -60736 -30239 -431925 -138431 -175021 336676 280711 127751 -145553 -57179
9220 92969 -140566 110976 -83385 207530 3248 -2898 13408 186836 -155660 -93909 -145470
9209 -145470 -68422 213206 -64959 -152390 -325088 134503 -338269 -107454 117563 -113654
9198 -83798 -62565 45197 -27766 -72808 88369 -164427 132194 -314149 254008 -431447 -91158
9186 -226410 49176 95656 -242261 157892 -169976 85837 -46739 -222952 71484 -230309 -25547
9174 -23714 -362779 -74223 19334 -36583 -2691 -358871 334621 383333 -220928 -229275 -393307
9163 -393307 -185549 -207986 -78066 102237 265986 -61960 -78295 -98164 -50470 -101221 -305306
9152 -305306 -243582 31179 -39964 -7302 -68623 184199 324802 -183725 151106 -300875 -94942
9140 -187482 -222263 -174480 18582 -205420 51145 71275 254714 -68070 115480 -281545 -7880
9128 204193 -259078 -118591 -72056 -18105 100981 40743 -268856 6141 56453 -163937 -29563
9116 240447 149327 3225 -108183 -230112 -130464 97612 -24229 -397875 -107126 36121 336169
9105 336169 -106608 -250231 -92904 49830 -393306 35020 -319695 -4635 -104028 -212680 -130337
9094 -130337 96415 257910 -60811 44810 -319119 -7393 38969 -129972 -132207 166256 -82415
9082 -189466 7900 -207737 5055 -46719 -331591 -189830 -5335 -132182 181220 -78693 66999
9070 -28396 108509 -384802 -197115 51481 27515 -426925 129166 135726 140512 42729 -40530
9058 106876 -158855 69383 -145954 20625 60747 -111654 9657 -56877 26819 77855 202632
9047 202632 185533 -248131 167947 -192523 -110731 -169616 60061 -40636 -310815 -87462 -306555
9036 -306555 -249652 -31625 -143046 142142 -271114 158911 56210 -157981 179538 55682
9025 -62071 60082 153684 -58603 30841 -215069 81707 264053 -405635 -90212 239365 -335728
9013 -292950 137943 -432239 171311 -80007 131167 -48510 -296101 -163309 23654 -18327
9002 -292885 -54463 -238950 -22981 -6371 -68397 -170204 206821 -136971 -210346 -116621 -4199
8990 -80844 -82507 -234499 -200430 -102508 -30937 158940 127488 47573 -61655 72371 -112233
8978 -376556 56760 -13714 -8481 22804 -306686 -339057 170202 238884 -62648 172237 97341
8967 97341 -73573 -39514 -27190 -487648 -82122 -283748 -25183 -13317 -236693 135521 65394
8955 120164 -35318 -124770 -62916 12820 -120839 51716 5510 212448 120697 5215 -102295
8943 -17919 -179127 -137937 -90618 -85681 -187529 -225590 -551056 104014 41847 43201 -75131
8931 -404711 -56580 -280642 -206565 -80704 107794 -82692 315308 187662 -245121 -117050
8920 -9449 -12782 72162 -95884 -45103 41349 156527 352375 -21124 117617 -61094 -362482
8909 -362482 -146550 71248 69829 -268514 -59192 71968 -177387 -122884 272972 -187690 32665
8897 -182441 -168144 -127315 -74047 278675 -368543 -40367 186929 -239323 67334 -181716 -210586
8886 -210586 -174401 -53959 -314000 -97829 -121991 -32317 -185800 -196934 74313 -23038 38858
8874 74711 -264259 -51290 57853 -146561 -285097 180156 215686 32494 -200199 132313 -74207
8862 139482 6527 -141714 -78059 256483 -24381 -2437 190817 -381080 151081 49095 192591
8851 192591 161223 -55307 -169285 119836 -155821 38272 -124087 30649 -117059 -58056 16412
8839 -209637 14848 71484 225513 126324 -20059 77053 -42970 -577506 130650 -114855 81903
8827 160072 71323 -35952 -93644 -18065 -228201 -99699 166708 86470 178048 -155750 -135362
8816 -135362 -210162 174032 72877 -86445 21129 -144961 212432 -309787 -618072 130262
8805 -54789 -275671 -64363 106714 15062 18210 -97334 57443 -75753 -21634 14630 -119709
8793 -133866 11263 -122598 45271 117477 -98476 143023 101785 188100 -240892 -216451 -50584
8781 -100162 -42583 111635 -57283 19696 -304877 -86950 -71243 -141276 5968 -25681 -507393
8770 -507393 67538 310702 142761 -212103 364521 113677 -360885 -51095 151970 -320395
8759 -241288 44429 76424 -152781 39948 -185446 -131704 -6489 15625 10000 -17408 -157282
8748 -157282 -347661 212049 -149032 -102560 154999 -20517 -166563 -99533 -89586 46227 -191058
8736 -12514 72422 -95888 -23826 26226 -38349 73691 189517 -43563 -8024 -198103 44928 14137
8723 -155775 -108931 -39272 -27003 -18231 131549 -370863 -126231 -63551 124121 165840 -52075
8711 -37748 -48711 68728 -10957 9823 -226250 -40247 239340 -138382 193627 -64002 301680
8699 969 -174469 -219851 -63676 55297 81222 3271 -32495 -43132 -232812 290476 104277 -186717
8686 -201647 -374958 -22834 -99804 45951 21727 -149523 -224160 83960 -241569 -128933 -218562
8675 -218562 58623 -169914 -62582 136937 209539 -114939 -102034 -344677 11231 -1200 -278128
8664 -278128 -133292 205887 18709 -121486 -27118 271100 -175669 57276 147585 174029 -94731
8652 -253025 -35347 91765 -227553 211230 64572 121979 100161 -149213 -111975 -199229 94521
8640 -156459 -6861 46852 267265 -219579 36707 -127884 -230284 -187468 -86156 -69201 -171744
8629 -171744 -33044 -225366 -230013 -353372 -321111 -102507 -304603 271086 276875 -68873 84674
8617 -90973 -50752 -130328 7899 -274395 -148643 -218004 -233175 228479 -61728 -190628 -209406
8606 -209406 -60600 88103 365582 276281 65102 -144661 48210 -444423 -297681 221423 73781
8594 45275 222649 85207 -35486 -168431 56836 51406 -111899 -139347 16377 -6359 36602 48192
8582 48192 -99972 1302 -213466 -126963 -159463 -7150 -271683 63333 34928 177314 -116193
8570 7419 -174613 144710 -145050 -134596 -59204 144438 4497 -14454 220433 23913 -121750
8558 140671 47675 -4777 -55899 -175448 12389 -223180 -30703 -64150 141901 -102863 -27857
8546 -33719 146609 -78185 -320602 -254261 -234310 -104791 -159695 126464 -19340 -55490 91707
8534 -128122 -63924 -142683 -11913 187897 53197 -30531 -271691 104923 -43578 -306411 -81977
8522 15775 -21935 -177606 -783 -96492 263698 180201 335558 84437 98243 -255418 -27031
8510 103013 34101 13636 -122732 116386 189210 9178 -169506 -339570 -35553 -16270 35797
8498 -65321 -456528 -123943 189741 45928 -378496 -105097 43434 -193141 -150505 78445 -229627
8486 -71962 32309 75135 -88024 -198014 35320 85998 81033 -188225 -139392 -223917 305815
8474 -99884 -46937 -306569 -284640 -81074 67880 -65479 -319473 -55509 -68462 -67233 31760 -282594
8461 -77128 -122805 -285935 -17938 -8455 133056 264012 -15358 222092 -126359 46305 207842
8450 207842 180882 -186609 -128539 -431997 -362056 -7180 -120038 -245903 -21942 -166310 1183
8438 49948 -319180 -168334 -70359 6149 -170648 -160978 144757 251013 -61965 118807 52315
8426 131212 86174 -79061 -135634 64216 179433 -63554 -447709 -82693 -113327 346307 -101011
8414 -273438 185022 -58223 -279646 189744 -84634 24584 -95629 230773 -37108 -307110 -27005
8402 -387140 -132671 -223120 59256 -62576 96052 -91508 -145539 189890 -68169 -174680 -7233
8390 -84292 70119 -203984 92062 -351087 62564 181358 -173237 -234155 146678 -1520 -72942
8379 -72942 -6775 191692 -300012 160022 143876 -115862 185792 -233415 -221494 -4995 30775
8367 -92963 -221293 -69582 -52492 -281101 158288 129391 -239102 409101 -115079 -24992 -395773
8356 -395773 42865 -2643 -148256 -275207 149512 -298378 -155196 -263531 28382 -201193
8345 -285374 107742 288236 29483 -208175 38588 11356 -299179 266479 -82678 -474015
8335 -474015 98188 -79257 -331411 -36710 -134619 139708 28667 -545549 -50494 340868 -10608
8323 -236545 -182981 -176815 -61316 244891 2889 153828 131626 -15756 -126442 -157075 79119
8311 -22296 -93748 -97874 -142306 119745 -246234 148104 257787 79392 79194 -233644 -142037
8300 -142037 -340257 331566 -97911 -113429 -222583 -178092 -155889 -86406 -72737 37120 174162
8289 174162 -52061 -218550 12375 93631 -116065 -279931 128138 -217828 -371168 -101923
8278 84582 36720 90790 -25217 -41079 47713 197369 -101525 -122599 -170238 -5908 -134157
8267 -134157 60970 -131027 25255 22012 -71213 251132 -75863 135702 50039 108168 83877
8256 83877 -79195 205709 -183347 148276 107310 65012 -38659 -216035 -18895 -135943 95744
8244 27109 -230026 -107070 -329338 35711 75245 -252106 -292232 -131175 -98223 -235065 -364588
8233 -364588 155419 39722 136906 -619436 62131 83720 67123 -45362 -172348 -399668 -415444
8222 -415444 -41505 -37427 -64428 120498 -109559 63974 306796 -44362 122278 314028 -133715
8210 57513 -140435 -284426 -187645 -73609 -25010 16264 138210 -196284 -8460 283439 -51664
8198 97710 144624 60356 179079 -12206 66820 43947 -132176 -81070 42405 -91991 106706
8186 -116468 -144413 136629 -14509 121634 -15771 155543 -412216 -144302 -13283 -98942 172325
8174 -217235 48880 120841 -154622 -211156 69823 89454 149900 -388649 -79642 -161799 4054
8162 99958 12934 -249251 99025 182661 -184906 21756 -170996 137115 86690 15935 117584
8151 117584 -171492 86370 -580169 -202181 -151068 208656 109285 -105315 -196315 -163072 94822
8139 101038 -248196 -216355 -353419 -133867 -150502 -85364 -79255 229363 -10671 95181 143598
8128 143598 -179139 -20800 -57485 -137495 49397 129937 58164 27298 11067 220759 -2476
8116 -14917 175908 -174416 -177665 6720 -301576 -42791 232378 -95158 10288 205297 58987
8104 173675 -434422 -188198 -181683 219246 -33887 60627 -90251 -47628 1934 -16226 -59734
8093 -59734 42162 -163999 -58558 150928 -102136 -8048 -298555 -187101 -196560 65018 136881
8082 136881 -449018 170163 -76575 192377 -75836 -95426 25421 -55631 177863 -273512 113840
8070 -100423 -12715 136332 -321422 -6368 -122644 -66762 111097 315380 209641 -147148
8059 -85284 -239504 -102977 -165106 -120312 -460790 -34769 250750 -111282 -95080 22460 80165
8048 80165 -265355 122982 -191539 -377208 -87085 -90485 126405 -13653 -162490 139198 75100
8037 75100 -504973 135408 -96487 66682 -802 29313 -130527 -186556 284589 82884 -203 219700
8024 59757 -30966 -106865 64730 -31760 -228262 -108129 7490 -265215 132724 -301598 280418
8012 330511 218135 -317814 -22516 -31948 -25256 -26797 -312713 163048 -179764 -279982 130214
8000 -212809 -111544 22626 104508 -779 231727 -580279 25970 -23029 -21488 6503 -212699 -193159
7988 -193159 -310820 18088 309957 59506 28184 -274237 -130760 197924 109261 233501
7978 233501 -189914 -167601 18949 -11883 -85343 -64728 -176885 -123859 106408 -305549 -273316
7967 -273316 -118592 -151602 338681 -159815 193201 -217939 59091 -106130 301873 -163756
7956 100689 34801 -55541 152521 2181 -20600 -139297 3164 -506571 -354922 70544 -6071
7944 -140679 252845 24672 -138427 -1574 -197250 -156797 -98234 -153462 -268440 311419 -392855
7932 148599 113012 116896 315920 -89946 379037 -16516 -178448 36986 85583 -74434 -67980
7921 -67980 17636 -42033 -21028 -99602 23079 -152247 -81506 101593 -209061 -38905 111969
7909 -120180 -348431 27847 183552 -6643 360012 42922 40543 180807 -74409 271602 -376344
7897 -116788 -107821 -132731 115877 -161548 -230505 -231811 -15303 160747 -31862 -231824 101883
7885 -161351 -30587 235878 -50489 -105024 -81984 190791 -8988 -121379 124705 327626 -222120
7873 305930 323101 -135865 -159101 272103 22451 -190969 -382784 -101612 282022 -141544
7862 -287008 -223440 -164179 -239027 4116 -91009 37531 430763 -302284 -16385 16431 -38318
7850 -42085 120564 -12281 -14168 229688 202614 -118521 159422 -196049 -227820 151934 227129
7839 227129 292049 -151811 162499 170000 -176123 -121619 18945 54423 -222376 233219 -212684
7827 -5888 -13759 -103538 151735 165089 72715 -60127 -409635 -307182 -16122 -30503 29162 -160302
7814 -21504 -275716 137946 22796 -34087 -181250 108804 145307 15600 51901 58128 21203
7802 -330785 124801 -311372 -121764 -2330 -263136 59723 -167012 -113250 -143872 -32560 -112248
7791 -112248 -223302 -201839 -193969 -14049 -18676 96807 -63026 -258998 223855 97322 -123546
7779 -10719 20713 180096 -235833 -37189 -150819 -65277 234367 31108 -151724 234986 1051
7767 44394 -29435 -127349 304644 214644 188116 -51835 198242 47493 21706 -263128 -409637
7756 -409637 -145922 138667 -209106 -3428 115108 13081 4956 32683 178027 -455502 -67544
7744 -194432 -34716 99517 -10255 29262 -409760 -108546 63947 99910 -354084 202840 180554
7733 180554 95954 -223494 167435 -777 -115571 111399 -288103 160867 -366401 -109965
7722 -241578 10813 -294374 9076 -297020 -226354 10642 150079 118744 127832 6136 -348395
7710 114795 158332 -85672 197271 -214922 -240202 169231 -63084 -340071 -14921 -17725 -8643
7698 -231690 -115279 -61577 -369900 75725 -373585 -34818 -108963 -103497 163751 -374706 144248
7686 -114164 -87549 -20806 117 -122222 -179777 -190018 137095 -153096 -463700 3424 63012
7675 63012 59630 -161254 -172190 67254 -13587 -44133 -216929 53372 126523 -45447 -152064
7664 -152064 -441128 218759 50892 -368739 -85232 216348 24432 186634 -106146 -198344
7654 -198344 -193906 464432 119798 12664 -44096 -222407 -33567 -66107 -55149 -47161 4352 232676
7642 232676 -36687 -112766 -128010 -199955 92447 102455 -221880 -82559 89038 -177303 -173972
7631 -173972 152659 -281326 -77407 -167035 -52781 223073 -7705 -62876 98702 -219692 -378928
7620 -378928 71433 64325 94960 159351 -21820 136131 -128313 67047 -206376 8933 -292684
7608 -170354 3669 -228077 -30769 -141936 49591 -144372 136164 -287793 154702 27909 -114064
7596 87382 -24927 108530 131594 159135 173102 -142439 -35092 73491 -54586 100941 -220683
7584 231067 16709 4902 -221809 -247598 -156439 245748 -157943 37777 105054 358817 96730
7572 -42380 172883 207722 -86286 -151791 -146681 -156445 -87330 -41794 19594 -141784 -122937 298497
7559 -78105 229238 225070 -22147 -492206 132680 -207231 -25428 -27498 -138442 300752 -119235
7547 79109 -195740 -64129 -131677 -95277 1859 92322 69022 75870 444 106231 -136145 -151864
7535 -151864 -40487 306936 -27110 -39091 90541 80547 -78124 -393348 -51062 205880 -353191
7523 -111629 -193157 2465 -474229 -107176 -254408 -18663 -238379 -66266 -49568 121719 -221857
7511 15545 -207967 80595 146365 -94018 346243 43850 223074 173301 -241685 111272 -126913
7499 -250016 -316328 121128 100432 161780 -56332 123640 208361 66730 -93349 -101089 6351 20531
7487 20531 -49934 -226148 -68693 -11420 -177156 -28339 -126524 119486 -186395 -68976 5105
7475 -60178 51078 -102394 -321789 -77249 380830 33910 124954 -154077 -260808 71709 -148905
7463 141640 -108327 -129167 -333597 -161686 -296116 -123918 10415 -257057 -46573 178087
7452 -215985 -16311 45481 -227963 392782 -55555 -108931 -164744 -470539 -99600 62802 -335090
7440 58444 205443 -360994 57768 -26496 -83491 -190587 334678 -200315 117797 82843 249053
7429 249053 -105799 -114412 -153555 217811 -192656 -104210 263535 84583 -57219 -129263 -60892
7417 6258 -256884 -47193 7188 -94617 -23384 264862 205 28900 -43825 127523 -204270 158286
7404 -178454 157259 99096 5948 231771 -13595 84730 -159708 289247 -248784 -171588 165598
7392 -8532 180609 -123280 -117930 232338 -118382 -113767 -21769 280635 -252091 115025 -57761
7380 148951 -45782 173402 -85571 -129850 -98548 -10378 -264872 -233259 -75813 -94133 -16284
7368 97712 73768 -28893 236152 -223258 325075 217030 138272 -401467 -111582 -55255 -229974
7357 -229974 -6732 -20904 -33333 -50661 -104104 39543 -238046 -268887 9236 -282955 -511790
7346 -511790 108343 151078 131445 -181637 308775 67803 159384 -244398 -285241 120591 160908
7335 160908 -78705 -245907 114158 -187842 -321825 169337 106994 144539 -168490 398184
7324 -82337 338924 -23163 -280210 34065 -109741 -120000 10834 -236679 -22189 266904 -326621
7312 129783 -165340 -140394 128588 163260 -205957 98395 -176621 -163148 223749 149851 -284278
7300 -124421 -187426 -231740 -141549 -246337 -311807 -81467 195674 -74426 -312467 -112997 -408976
7289 -408976 -226358 -132058 -197015 -297413 92326 -227073 -117455 66918 -24236 -3169 -54097
7278 -54097 40014 208829 81638 106684 -76236 -93268 76608 -114956 -14216 370240 -35591
7266 -41386 -141313 121984 -12703 -151618 45438 -56831 214569 115320 242950 -130325 -168712
7255 -168712 512249 -29043 -186031 -101301 -172970 117186 246236 186749 -41254 216471 91987
7243 -43989 -305106 -392050 -89329 11670 -205428 -177142 -50607 -296844 -222725 239919 116118
7231 -183801 -197938 -313858 -9329 -164922 -117497 125217 69915 405274 155761 1521 -271144
7219 53545 59367 -33644 -107761 1633 95589 -229521 290490 31390 -241501 217015 -331978
7207 -73195 -32231 -99188 -164114 -33733 -126779 -226102 -67598 499358 93198 -213425 -191299
7196 -191299 -61637 -72837 -19197 19095 2024 242877 -44196 -157898 245259 65763 3710
7184 153313 -57605 -175275 -138411 -15306 -61050 -246364 134211 -229482 17202 240664 -30985
7172 -168467 -65823 -60403 -14572 -145664 -241493 -172743 -165961 -301181 -18196 -109727 -44255 163242
7159 -50698 -316762 -106934 170336 55155 -17090 -1424 209919 124109 105668 160376 135072
7148 135072 -96384 114077 -265374 -126367 1861 80477 -91981 156467 98248 45617 167671
7137 167671 120213 180461 58121 69392 86222 -261555 -86300 -81221 90093 21383 25757 -81453
7124 -32531 -250418 354333 -276978 120719 240326 -89041 143348 -24514 109720 -41607
7113 -266025 8175 -147907 -80188 104549 14858 -11947 -287221 -160817 135335 -36751 -89681
7102 -89681 -133784 207861 -47488 -177277 39146 -112377 123505 -81165 158262 264170 39524
7090 -197977 185300 -250907 -471512 73203 -133504 105492 147706 -181371 -204004 191033
7079 10867 -150601 149774 -7422 5381 -400849 22601 -61324 -118964 -82721 81899 -1128 328084
7066 -42064 342782 -122288 158742 22593 174534 73356 134458 -125921 230251 -50074 59334
7054 255954 101797 -115516 -137670 45971 -648 -182259 -64863 -146353 -62875 -431033 -321241
7043 -321241 -156529 165164 -112181 36784 346781 -270948 148990 37465 -24546 -85988
7033 -85988 14210 232927 -12917 -212211 32035 -313272 -160693 93135 320563 16426 267473
7022 267473 192871 147178 531 -102132 175994 -374236 31350 9797 34834 10705 48019 -61219
7009 -115663 58135 228466 112117 -51793 84778 63691 190678 494376 -101192 -159598 -299640
6998 -299640 6770 157821 -183414 -118489 -2588 -24678 297351 -416283 177705 -165336 341532
6986 119956 -57467 -27208 76605 395576 259026 18734 205922 -195768 -220499 -38853 81299
6974 -221951 116340 -84588 -63429 -232690 28619 -30778 -104702 54465 26608 -68856 -298940
6963 -298940 -575603 -333691 -17510 425514 -223615 -148018 -55822 77854 -7805 -207041 59798
6951 -158194 -210696 -213670 90520 -350670 -526453 169737 -122354 212973 -65911 -62587 -143798
6940 -143798 -27557 16520 17588 -97519 115296 -175699 34063 4126 -323390 -222673 118272
6928 -61840 203508 -2222 -49152 186668 -547717 -179945 -40624 -167571 179006 -12787 -36199
6917 -36199 -65312 160852 -138713 72451 -22050 93709 397147 125447 -128137 11945 -253675
6905 155139 21934 -220585 119196 121850 187212 -132511 -210652 -188236 107197 -153670 -75199
6893 -187647 -42153 -236102 -60863 -239653 -98475 -57699 -258364 -56295 206881 207094 -303800
6881 -25446 42494 242600 -21459 4451 85820 119960 -121548 -252196 -21691 -48499 163999
6869 216664 112062 -292743 -19928 -230855 10421 83971 59208 -60668 240352 -104851 74120
6857 -80099 193961 55202 -147043 -73046 72107 127851 164035 55421 -193572 -68575 11241
6845 12531 70355 343888 -240069 48741 121878 -83780 -173440 51453 -170484 23314 178504
6834 178504 103284 -83058 -285928 -166295 55065 72355 73158 -150231 -65442 88003 -12868
6822 -134729 346089 99535 -81169 35312 163917 54565 -126559 -88804 -28053 214411 -57088
6810 198167 13625 -220194 -317461 181245 -140317 131904 -1158 -229750 101420 29339 -443826
6798 413841 -25557 -55543 262149 -271205 74466 -174145 -29394 60638 136379 -579917 106331
6786 -120629 -423131 209947 -217852 -130406 -243791 -107838 127340 194757 -30178 134926
6775 -162723 25648 130649 -259910 -5504 112775 -177337 213591 212003 -7312 79864 89843
6764 89843 -153237 -79701 38185 -101767 -147731 64925 278519 -4761 177549 332047 -102704
6752 109493 202091 102291 -81503 -66082 82523 -156279 -155837 102067 -7425 62618 -236466 402649
6739 -43545 -123344 55474 -22399 -218006 89775 140416 -79077 -247636 -225070 -223579 -369282
6728 -369282 -267406 -143593 5147 95652 84389 -185249 65398 25727 -136948 203277 208507
6717 208507 -320047 297527 321166 34459 -78256 100608 -21209 -374954 -151491 -189763 -172062
6706 -172062 23232 -59349 317311 -72450 95047 -52831 -144072 -110373 46898 54977 -25835 217195
6693 137492 262211 -39527 254323 -360549 -122806 15775 42639 -69281 -201188 -302417
6683 -302417 -391407 -45264 -234059 -109622 -48712 95874 -52076 155464 -195827 94155 -119774
6671 193055 -323451 -241920 251810 -171419 62511 -87149 -178335 -10317 -141557 -124342 418394
6659 -132066 29043 -252630 -92707 -266718 53098 195168 -64517 13702 -191663 211571 73042
6647 -30890 2696 41602 -26443 266750 303330 139715 92515 -331996 -130265 -378540 192514
6635 -128201 138736 15368 157568 216139 207039 15012 -195887 -104486 -303861 172521 87897
6624 87897 78504 -188117 244591 -137526 -34729 4153 222050 -109910 191543 -80543 119180
6612 60257 52724 -188558 -262411 62579 -181573 32226 153961 -34643 55090 353046 -169054
6600 -218322 275132 86548 -158362 225643 -32598 219072 -278067 -50638 -179705 34815
6589 150816 87064 -76847 -156453 269573 53827 97446 116893 301716 112517 211796 -288999
6577 -272094 -4276 -58804 -240135 -8623 -264485 -340775 -211437 192533 -176288 227409 -57130
6565 293100 449055 129058 -179125 30948 194040 -31529 -202525 250804 244348 82946 70831
6554 70831 40903 41178 -59103 -48555 -183345 -77575 -98408 -102816 -220312 26988 -102064 -183376
6542 -183376 -52684 -353252 150587 -240399 -42662 22124 204902 -258260 39717 -302832
6531 238361 138946 -136042 248293 -11656 50717 192234 -234375 -132132 17489 -78217 294649
6519 -92559 -113124 -190875 175934 -68728 102685 302502 277952 -61191 -203616 -145741 64437
6507 -25128 -29365 -143126 -166874 275642 -79502 122269 -232223 95143 -45980 19308 -65836
6495 11777 99541 -29594 -26690 -80721 -304172 -8998 -22690 294647 311822 15156 -197473 285130
6482 49810 -27200 -342643 60111 214124 -287708 -10023 -107692 -256818 -77565 91806 56448
6471 56448 -240091 -165174 -195733 40097 -83680 -58341 99536 -188373 -225974 -107906 -199631
6460 -199631 -9000 171728 225926 -59766 -93573 -153925 -81857 -110100 158472 54003 61855 60935
6448 60935 132613 133497 180841 -144528 105734 186009 -497154 -170654 151010 350491 -240213
6436 -341078 225848 175021 334899 57600 55022 -245474 -119254 -79214 121986 166028 -111883
6424 25713 153763 -242284 15892 152315 38741 -123497 131949 -57823 110783 -170114
6413 117820 -184316 16851 -115168 250374 5180 -127931 47086 -195582 -12699 -44210 136861
6401 -178072 -231372 -278153 133687 118606 -72116 -348256 -165888 296707 -103479 -119690 57513
6389 324185 153939 276724 -103654 1493 140049 329097 -27358 -116627 -150415 10651 28652
6378 28652 -150883 37361 227410 127735 343908 45169 -376855 -347995 -108759 -180870 -15676
6366 105247 -23870 4482 78221 -140306 137703 -34487 16765 15455 -81092 -153322 192210
6354 -50847 229224 93614 -269374 -221031 211329 -108890 -139258 122816 -79364 58634 -16170
6342 46521 -151828 176124 -217807 -96452 -175296 -89864 -58567 39237 -209402 -120545 195703
6330 -111640 -44045 297497 -64180 -52630 -6122 -156611 -107422 -494375 -31153 -202261 184645
6318 -258947 -188329 -126207 -172269 115235 -128936 125645 35013 93497 62596 -61655 -105503
6307 -105503 88830 10785 -95936 -32636 82240 -122715 -28122 -193083 122042 -351177 -18264
6295 129714 -249302 114635 -269782 -256337 386170 55134 -126316 133991 128763 163221 -122540
6283 60117 108991 125289 -38659 -56128 -27010 22536 30787 109558 -8892 23311 134834 85951
6271 85951 409147 274251 64811 -99701 -147032 -198799 190089 -218560 -171279 253408 59620
6259 68238 -172086 101467 -197653 -78038 -109826 -209088 -366541 6902 -93351 295873 68283
6247 -115841 222967 -67927 91449 137237 -94627 261619 33147 -37138 83730 317419 -118805
6235 -205796 356576 -272038 2696 -68340 58141 226915 -138938 -165224 -225302 311512 -36801
6223 383262 -134971 -136809 15781 -264775 228359 -73318 -314802 -15890 -99595 74247 5132
6211 180062 392637 48677 115902 -151787 289512 -76695 96144 -245421 -173231 122682 -127129
6199 198932 -204072 84782 19951 118405 378565 241867 154984 -264642 -243482 -252134 114671
6187 109749 -376100 -274626 325236 -329771 -216944 -159100 -195643 -367818 -68780 228968
6176 -85852 454329 -93443 -21535 -110555 -92322 -150681 -177878 130682 -73647 182332 -82284
6164 127425 122759 -65172 156583 -4274 18625 -85745 249456 -252470 -68300 201147 27461
6152 -69527 70892 -252345 30782 -39282 188926 -157245 -85452 3732 110260 83342 272290
6141 272290 -289511 -167924 50582 -121831 -104677 82918 92355 -44298 44387 -42786 -173375
6130 -173375 -133741 -6722 -232808 -203099 117677 174555 188655 -312584 -614759 36469 -160427
6118 221237 -217018 -13082 -148304 -56981 -103844 155201 105696 72393 -145224 -55293 -20550
6106 -198269 149826 -162407 192939 -26606 -128963 -201364 -1985 129162 -56934 -15410 -412715
6095 -412715 -37986 -324921 209547 12361 -145168 -52191 -112456 -98267 1058 -226708 46124
6083 -105494 -158868 -190946 242879 -168607 61857 212026 257325 -61916 197253 -212596 41928
6071 36323 84609 -538312 -158870 282144 -21197 -243945 397352 -115865 165825 129369
6061 129369 -37820 -204597 -132901 235255 120954 46482 -255632 -161094 16189 -141510 58796
6049 -129653 24953 187171 137767 -99265 -37545 89960 86498 275004 -4311 163705 260555
6038 260555 -257445 -276667 17120 68663 89520 -248914 79182 75752 -293677 14134 166799
6027 166799 -26772 62527 -148240 -32148 263933 443692 -128149 130681 60727 115044 -135364
6015 -125538 37454 -14708 -74021 -140841 -242132 -249407 -84211 -79807 -192017 144706 179760
6004 179760 -118869 183468 -83584 10042 -6885 118710 -362350 -171697 63876 -153216 87986
5992 -95856 -145108 61051 -12622 -50455 36677 -78327 64404 139391 -52240 159286 -316595
5980 48381 22076 253400 216892 80504 19679 -272114 192064 -173980 -74461 125436 305924
5969 305924 79208 -2074 -91886 -108032 99985 -185456 -432281 -19358 -6713 120728 -315002
5957 17681 -5603 292795 97000 28593 -244512 -21407 -210098 -306437 70014 48957 18136
5945 95260 15516 -124981 -1023 -104992 -27651 -108984 66023 14017 -34636 290967 -14000
5933 -159724 -97909 -115747 -32071 -302184 2942 -51801 -187049 -4888 -109726 103853 -193860
5921 165074 -286291 -109364 -65216 94448 -71755 322587 -126594 73083 -376351 -65758 27655
5909 134340 382366 -143826 -70455 100356 -97975 -341649 306750 17711 132390 265166
5899 265166 296519 -103993 -14128 247805 1974 85150 -285353 92362 345225 127448 96534
5888 96534 -312375 -293045 -285727 462887 90296 119475 28848 -102763 -117941 131839 205255
5877 205255 -211826 -51175 -215295 -225376 69180 71644 7130 64052 93933 68102 240516
5866 240516 -44980 -75600 264406 -72745 -82708 -239501 152845 29662 -42603 -56984 -5788
5854 14301 -311461 -81539 -16478 -112054 132603 -285533 -38732 110341 -139807 -83110 164047
5842 163963 98887 159734 114564 17863 168255 154298 -177903 -38243 35100 64599 -176693
5830 313531 65323 28512 -295449 -87418 -227486 -274557 -167483 189167 426807 -123496
5819 15706 -322942 61499 -100279 -62589 218787 78128 -131353 157265 34403 27011 82830
5808 82830 37250 -132994 -149341 -75115 -59143 -25458 -149825 57527 156429 -76000 223725
5796 -75987 37748 198838 -248342 37755 37197 -87342 186182 6185 85305 100424 69748 -167896
5783 96836 102413 3366 -105461 364565 -246727 195040 102319 43182 -259672 -175834 328487
5771 -157156 -44051 -165394 -38144 156804 -269591 -150939 60196 189389 359185 230144
5761 230144 9694 62548 95561 -173248 18665 -176474 185705 265193 46085 -74735 -110209
5750 -110209 -20486 -49876 -197388 -34075 2302 36410 8633 61129 37681 -89425 -181837 -105867
5738 -105867 224780 -339076 332148 78069 80301 -108394 -2650 151886 67708 -59454 162965
5726 -146681 164274 232981 -144129 70614 197 -248246 -228844 67159 -284549 -218750 -260875
5715 -260875 -192574 145197 -186507 -166249 -65019 -190544 88815 51680 -3744 177886 108142
5704 108142 -50244 -29795 -68484 -64347 -265294 -232027 199528 -54712 185017 55274 45865
5693 45865 447044 -78680 9693 192181 190797 312537 -14480 -26950 -98048 192096 -85550
5681 31825 180933 -70223 -130479 -84116 267609 -83551 29790 -465029 177231 -1747 11825
5669 -72868 108442 105184 -227316 127974 79634 -21551 -97584 -45581 -312069 44954 -201428
5657 157067 56987 -125996 -65224 -148812 -55819 233355 22373 -25332 324374 -93810 174184
5645 -81045 -58508 -148933 -177019 -49168 -308756 36136 -13452 -123216 -301792 -21080 53268
5633 -22063 -402783 -44766 21852 -154064 -20679 10560 251906 150177 273640 80916 166022
5622 166022 130178 -102073 268760 -197694 86912 172764 81906 -91422 -61335 -231418 123912
5610 33444 31768 -5820 19555 11815 324504 191143 -439382 169876 -14584 -133137 185647
5598 28397 -20520 182282 -6707 220265 85745 -186509 -179887 -19936 -278737 116026 -176667
5586 200710 -147360 162222 -182206 -277981 15817 278561 36982 248201 -59495 44861 323203
5575 323203 51231 -75906 169432 -10882 -70831 -267480 -440940 302 -84670 110630 59245
5564 59245 -96267 113414 -6999 -41503 -325847 -109169 58549 -300637 170487 -122011 -126484
5553 -126484 -95373 230096 26004 91464 -121612 -271025 70485 -51183 84361 -57084 -251789
5542 -251789 102543 -175199 -80682 -141960 -12839 230072 49445 124686 292466 83885 48668
5531 48668 87070 50145 -99601 -7003 125319 83693 -152561 -20272 -223957 52924 28276
5520 28276 488343 -45660 -32 -67949 39679 268644 121236 -185785 147248 -146448 56347
5508 -48483 451887 9821 -158561 52854 -5753 256040 -156287 -351612 6744 63050 41048
5497 41048 -40127 -193474 42000 261923 -190542 -299784 288409 -189138 64405 -67388 -269223
5486 -269223 -265232 -14949 143550 2784 -367389 -70519 -127559 -337502 290245 -54890 138027
5474 -122258 361550 -80306 366635 -23504 -182047 -205132 56305 -194094 -61014 127199 264368
5463 264368 -159487 85381 257649 -134943 -172481 57624 -67092 258210 70456 -126239 103800
5451 -135702 100378 31250 47737 -29718 -146711 278265 60278 122384 389950 190873 184346
5440 184346 -491014 -186661 193980 -100471 -7221 -293319 132824 -314891 57712 -107071
5429 -202194 42102 -210839 -9054 -257217 -31752 50297 129887 -15563 -48906 154694 24284
5417 229555 133960 113759 261149 229073 246160 -26115 -278631 -373118 -157482 437651 98373
5405 -134819 -95165 177170 176637 -1799 99444 43853 -81094 48776 319046 -135303 65889 146347
5393 146347 280604 315439 -34899 -51822 93153 8487 -561 -57139 149261 -163120 55917 -18823
5380 -10233 116989 107093 241367 -70265 -45542 23472 108024 25362 1500 7953 -175016 -457912
5368 -457912 -63679 74226 89051 300241 18712 78301 -275813 -116087 71977 -84461 281612
5356 47256 -79350 30478 -191740 100760 -31360 -5927 -107117 -107958 124307 -36467 -88649 -59482
5344 -59482 7403 45958 53673 156835 99122 73520 -106370 -115972 -207456 -70175 406305 371582
5332 371582 -88778 136728 -188036 -120804 124170 -112880 204706 -49415 113264 -206975
5321 23826 115458 -136614 78293 343164 92615 -215609 -430 421578 -6428 178601 -226655
5309 90039 -244269 -227048 63546 269341 52891 -130571 -42663 -153670 -109792 -220169 225506
5297 -360145 -337514 40211 271626 187810 20162 -87825 -173553 -102209 35539 128980 12551
5285 87657 -71067 -336770 -48924 150411 -18205 -26744 168495 -159222 -76755 54463 -150042
5273 323611 7765 132186 138166 83052 432174 -141525 -155044 -271502 109236 68670 123923
5262 123923 140964 203352 -13417 155758 -183161 -284199 -73497 -15159 88187 -128449 70771
5250 69261 93355 105892 3976 -138756 270254 -106687 -365277 189306 -75469 -61082 -63087
5239 -63087 238098 -126468 -259010 54900 -335019 -242571 204585 21320 82675 -153159 73227
5227 288501 -184695 297977 -21837 51115 -124724 223978 91699 -174425 151719 287577
5217 287577 -255512 -63021 165146 76787 23138 126984 -143153 -22424 -26244 -173141 -148183
5206 -148183 30230 58947 72293 -192061 -246906 -172760 12419 -156741 337162 136585 86808
5195 86808 110588 -29101 99798 217935 31154 163153 111426 -46517 115888 -90692 31988
5183 137193 42895 -394219 3354 -255614 203672 10860 -305013 -103518 102652 -194652
5172 -358377 162391 43499 -324623 19750 79532 -157424 -250291 -63415 -56379 73368 280725
5161 280725 -114048 6419 274024 -140761 41703 -40294 -3106 -13200 225089 -301410 3656
5149 164775 79157 200309 -73175 -209648 25569 122724 164139 -171703 30756 262365 221852
5138 221852 -171356 65245 -53507 131181 124633 69472 47455 -136530 -8013 -159579 -80432
5127 -80432 -101031 295158 -284604 -237544 189190 21524 244785 134331 127697 -64034 -46428
5116 -46428 72655 139701 -30446 -139490 -33068 39488 13189 91544 -63121 167869 -202398
5104 316639 -129541 19523 107454 -42059 -308062 245750 58539 169848 315150 250458 266477
5093 266477 -3969 189328 -57914 -264541 255655 91743 21124 -79407 228174 71848 -23636
5081 -20593 79520 248758 170576 -285425 -317371 88569 84617 -42062 -108227 316125 96093
5069 -194013 -156208 67220 -247441 24851 -20897 -173185 290405 -49012 -155176 -92322 43329
5057 30368 226536 -101757 -70192 -394 131096 148499 121786 -219245 421594 234299 231420
5046 231420 -164835 168316 -123956 172231 -12902 65185 -258906 193594 -90570 18823
5035 71406 -156645 -49070 -87212 -112276 58641 -16611 186384 -147877 406400 -45932 -163370
5024 -163370 -127107 234388 -150530 119550 -80138 198262 -212321 -183000 256805 226936
5014 226936 3603 -184862 230990 294392 -47172 -370842 -112441 120420 79557 -65899 -118001
5003 -118001 4041 213931 120322 -14711 -239605 -49995 -21903 -204703 -13513 -92101 -50369
4992 -50369 88536 -233812 -90302 53709 21932 -193251 -332298 65406 36073 164231 -52889
4980 84654 315727 -142320 -26437 -220336 166425 151 -100953 -17423 -274700 -70539 -110896
4969 -110896 103740 -21789 -42491 64900 89423 26152 -217216 330206 21402 270095 168557
4958 168557 72207 229265 159653 67497 -41000 -158948 -112951 -42246 -195074 181776 175628
4947 175628 -69708 351086 270243 35586 322473 33971 -116011 -208840 -51893 55884 -116973
4935 -17912 204244 151404 176224 -241995 45726 -52364 53304 -318759 -47622 218108 173935
4924 173935 -96495 -223948 -146759 59980 -107009 164992 -57821 125361 195137 -2887 45258
4912 225111 177122 -179239 -335406 251130 -88553 -95828 277150 12674 215900 5027 67757
4901 67757 133470 -9350 132303 5920 -113294 -177794 39225 -90965 -118378 38306 -363304 -351821
4889 -351821 -159258 -155146 15739 146640 -3276 -10911 80652 11085 60039 395890 -79628 300615
4876 204215 -99109 123391 114069 288017 -147572 -264968 19083 101813 137010 -244221 94490
4864 78289 -113992 161112 -270 -67139 109518 106818 70382 -249789 97765 -202128 -119554
4853 -119554 34525 221802 -3537 239428 159588 -48272 -107026 -134120 -68069 -116140 315542
4841 -36391 -107226 -170199 170570 -29797 -23377 -59691 -101104 -104801 -159280 102916 -406962 -203701
4829 -203701 49624 90897 -48628 96168 -27182 180332 143361 -159432 -192895 -90749 73180
4817 -86981 102547 -174523 -93643 -57171 -249957 95753 102551 200107 -161311 15275 141657
4806 141657 45844 259824 -33280 127402 49998 -72255 -298618 8493 -219977 135392 -75612
4794 257402 79641 79594 -81534 336836 -72491 -162633 161294 11124 -117048 -87978 -81779 69808
4781 -231520 -184474 153230 -33501 -288263 -275489 58843 -137371 326189 191548 -58629 -189212
4770 -189212 186843 -327331 -53126 -265548 15383 196480 238568 100293 30653 -56448 311552
4758 -183429 38314 89297 166105 -63532 2796 63533 104711 -287504 33966 -288066 -167933
4747 -167933 -70561 -166978 -51418 157963 240980 95780 -174858 7890 -204158 35026 -89790
4735 56041 -31244 30314 86171 202959 -34068 -68704 193919 21523 -99472 -67259 -40378
4724 -40378 -16536 272950 22116 -177183 125295 -23570 159123 93838 174020 52360 334925
4713 334925 -386011 -112225 291622 -171996 105554 -230394 -6596 70987 16750 -62866 72778
4701 -63063 -57951 -74966 99884 505178 60536 80729 37787 199087 291637 81010 21794 125593
4689 125593 71236 60339 -286915 -4261 231520 115910 107156 -107530 -144674 172571 57849
4677 144479 -152907 2448 -380942 12925 -149357 -78255 11172 -284629 31749 101133 -2934
4665 118970 63436 -138021 -45638 29604 -230971 298069 108666 150674 -135839 137465
4654 -384957 83148 153332 250284 17223 3012 -427931 -27844 -9695 -79826 40427 67985 214988
4642 214988 -6822 -12003 269151 188384 -205920 371494 -200584 -374326 50226 3371 -210263
4630 157645 242496 71899 112103 48380 108546 25530 88444 -132264 295530 -84206 -163710
4619 -163710 -153792 -65810 -269789 8559 62266 -7238 2483 -30019 96386 174449 106640 105065
4607 105065 122738 -311564 99379 -293225 317541 -30802 165318 175008 -280552 -208667 -2061
4595 43824 -96865 77280 -29091 -102848 153922 121247 97950 -27964 -220046 254296 -452087
4583 44587 -35535 176679 -100821 -105334 -167673 -328638 164195 182194 -73240 -21972 -63710
4572 -63710 20792 291819 562751 254283 -145992 65651 109478 130955 -51940 134298 -112441
4560 -93846 191900 -114788 82749 82860 -294881 216248 -87255 -81108 -317573 -156306 -267954
4549 -267954 -229769 -193013 -20542 -62832 182317 148178 98458 -70826 254092 -107929 205665
4537 37541 77638 60508 143325 -46044 -227052 -145866 -370013 -191060 35702 -157803 -167090
4526 -167090 32404 23538 111852 85099 321811 -228701 -36192 222394 -125354 -195890 -256731
4515 -256731 38830 -55010 21427 -269534 320468 258956 -211950 -480050 50772 61163 -333528
4503 216882 -151608 222006 100302 246294 -88119 -232667 124964 140142 -279541 -117460
4492 215949 27118 -295895 -89734 -40074 141528 130989 28987 115843 -246011 -374658 246492
4480 238630 99455 18765 -19994 -118887 161110 -316626 30658 -70576 69480 -307786 65457
4468 229718 -240397 186146 48774 -111105 121137 395408 -213051 280084 -205875 -102086
4457 40563 -48658 54303 98750 -86558 -155969 80218 -82050 86797 -262906 75467 143200 167893
$$ [...]
##END NTUPLES=NMR SPECTRUM
##END=
