##TITLE=AC1534_ROEFFECT0009_8214376_YM702Qd0Co
##JCAMPDX= 6.0         $$ Bruker NMR JCAMP-DX V2.0
##DATA TYPE= NMR SPECTRUM
##DATA CLASS= NTUPLES
##ORIGIN= BRUKER
##OWNER= Administrator
$$ 1.72 TOPSPIN		Version 2.1
$$ 2014-07-31 19:13:35.428 -0700  Administrator@X
$$ Compression mode = diff/dup
##.OBSERVE FREQUENCY= 400.02188249412
##.OBSERVE NUCLEUS= ^1H
##.ACQUISITION MODE= SIMULTANEOUS (DQD)
##.ACQUISITION SCHEME= undefined
##.AVERAGES= 64
##.DIGITISER RES= 22
##SPECTROMETER/DATA SYSTEM= spect
##.PULSE SEQUENCE= noesygpps1d.comp
##.SOLVENT NAME= COFFEE_meoh
##.SHIFT REFERENCE= INTERNAL, COFFEE_meoh, 1, 14.97794
##AUDIT TRAIL= $$ (NUMBER, WHEN, WHO, WHERE, PROCESS, VERSION, WHAT)
$$ ##TITLE= Audit trail, TOPSPIN		Version 2.1
$$ ##JCAMPDX= 5.01
$$ ##ORIGIN= Bruker BioSpin GmbH
$$ ##OWNER= Administrator
$$ $$ E:\/data/COFFEE/nmr/AC1534_ROEFFECT0009_8214376_YM702Qd0Co/22/pdata/1/auditp.txt
$$ ##AUDIT TRAIL=  $$ (NUMBER, WHEN, WHO, WHERE, PROCESS, VERSION, WHAT)
(   1,<2014-07-31 19:13:30.074 -0700>,<Administrator>,<X>,<go>,<TOPSPIN 2.1>,
      <created by zg
	started at 2014-07-31 19:01:56.248 -0700,
	POWCHK enabled, PULCHK disabled,
       configuration hash MD5:
       16 EA D6 F4 BB 67 03 14 9B FF E7 A0 43 5B 48 2E
       data hash MD5: 64K
       8C 59 E1 44 B2 0A C0 67 90 2B 2A 44 A6 0A C7 88>)
(   2,<2014-07-31 19:13:33.276 -0700>,<Administrator>,<X>,<proc1d>,<TOPSPIN 2.1>,
      <Start of raw data processing
       efp LB = 0.3 FT_mod = 6 PKNL = 1 PHC0 = 0 PHC1 = 0 SI = 128K 
       data hash MD5: 128K
       3D 78 1B C0 F4 02 B6 0C F5 84 0B 15 7A B8 6F 3B>)
(   3,<2014-07-31 19:13:34.277 -0700>,<Administrator>,<X>,<proc1d>,<TOPSPIN 2.1>,
      <pk PHC0 = -84.75403 PHC1 = 0 
       data hash MD5: 128K
       69 5C C4 C8 FB B7 01 C5 07 B1 B6 CE FE 35 F3 FF>)
(   4,<2014-07-31 19:13:34.761 -0700>,<Administrator>,<X>,<proc1d>,<TOPSPIN 2.1>,
      <abs ABSG = 1 
       data hash MD5: 128K
       15 BD 65 BF ED EC 47 99 73 C7 F8 FA D3 9E E9 3A>)
(   5,<2014-07-31 19:13:34.861 -0700>,<Administrator>,<X>,<proc1d>,<TOPSPIN 2.1>,
      <abs ABSG = 2 
       data hash MD5: 128K
       7A EB 5B 6A 93 1A D0 49 D2 65 57 68 A8 1C E7 1D>)
(   6,<2014-07-31 19:13:34.961 -0700>,<Administrator>,<X>,<proc1d>,<TOPSPIN 2.1>,
      <abs ABSG = 3 
       data hash MD5: 128K
       68 5A 56 66 E7 D5 F5 DF AA 41 E8 A2 5A 8F 51 DB>)
(   7,<2014-07-31 19:13:35.044 -0700>,<Administrator>,<X>,<proc1d>,<TOPSPIN 2.1>,
      <abs ABSG = 4 
       data hash MD5: 128K
       D7 B9 EB ED E4 73 91 C5 05 E4 9B 59 12 3F 8B 7F>)
(   8,<2014-07-31 19:13:35.144 -0700>,<Administrator>,<X>,<proc1d>,<TOPSPIN 2.1>,
      <abs ABSG = 5 
       data hash MD5: 128K
       1D 8C C9 89 C4 6D DC D0 35 D4 4B 89 F5 20 81 4C>)
$$ ##END=
$$ 
$$ $$ hash MD5
$$ $$ DA C8 FD 06 68 54 F9 17 D2 DF 71 EF E0 A5 D6 A3
##$RELAX= 
##$RELAX= 
##$RELAX= 
##$RELAX= 
##$RELAX= 
##$RELAX= 
##$RELAX= 
##$RELAX= 
$$ Bruker specific parameters
$$ --------------------------
##$DU= <E:\>
##$EXPNO= 22
$$ [...]
##$TP07= 0
##$TPNAME0= <>
##$TPNAME1= <>
##$TPNAME2= <>
##$TPNAME3= <>
##$TPNAME4= <>
##$TPNAME5= <>
##$TPNAME6= <>
##$TPNAME7= <>
##$TPOAL= (0..7)
0.5 0.5 0.5 0.5 0.5 0.5 0.5 0.5
##$TPOFFS= (0..7)
0 0 0 0 0 0 0 0
##$TUNHIN= 0
##$TUNHOUT= 0
##$TUNXOUT= 0
##$USERA1= <user>
##$USERA2= <user>
##$USERA3= <user>
##$USERA4= <user>
##$USERA5= <user>
##$V9= 5
##$VALIST= <valist>
##$VCLIST= <CCCCCCCCCCCCCCC>
##$VD= 0
##$VDLIST= <DDDDDDDDDDDDDDD>
##$VPLIST= <PPPPPPPPPPPPPPP>
##$VTLIST= <TTTTTTTTTTTTTTT>
##$WBST= 1024
##$WBSW= 4
##$XGAIN= (0..3)
0 0 0 0
##$XL= 0
##$YL= 0
##$YMAX_a= 10942815
##$YMIN_a= -11910687
##$ZGOPTNS= <>
##$ZL1= 120
##$ZL2= 120
##$ZL3= 120
##$ZL4= 120
##$ABSF1= 14.97794
##$ABSF2= -5.580242
##$ABSG= 5
##$ABSL= 3
##$ALPHA= 0
##$AQORDER= 0
##$ASSFAC= 0
##$ASSFACI= 0
##$ASSFACX= 0
##$ASSWID= 0
##$AUNMP= <proc_prof1d_extract.lims>
##$AXLEFT= 0
##$AXNAME= <>
##$AXNUC= <1H>
##$AXRIGHT= 0
##$AXTYPE= 0
##$AXUNIT= <>
##$AZFE= 0.1
##$AZFW= 0.1
##$BCFW= 0
##$BC_mod= 0
##$BYTORDP= 0
##$COROFFS= 0
##$CY= 15
##$DATMOD= 1
##$DC= 0
##$DFILT= <>
##$DTYPP= 0
##$F1P= 0
##$F2P= 0
##$FCOR= 0.5
##$FTSIZE= 131072
##$FT_mod= 6
##$GAMMA= 0
##$GB= 0
##$INTBC= 1
##$INTSCL= 1
##$ISEN= 128
##$LB= 0.3
##$LEV0= 0
##$LPBIN= 0
##$MAXI= 10000
##$MC2= 0
##$MEAN= 0
##$ME_mod= 0
##$MI= 0
##$NCOEF= 0
##$NC_proc= 0
##$NLEV= 6
##$NOISF1= 0
##$NOISF2= 0
##$NSP= 0
##$NTH_PI= 0
##$NZP= 0
##$OFFSET= 14.97794
##$PC= 1
##$PHC0= -84.75403
##$PHC1= 0
##$PH_mod= 1
##$PKNL= yes
##$PPARMOD= 0
##$PPDIAG= 0
##$PPIPTYP= 0
##$PPMPNUM= 2147483647
##$PPRESOL= 1
##$PSCAL= 4
##$PSIGN= 0
##$PYNMP= <proc.py>
##$REVERSE= no
##$SF= 400.020002861607
##$SI= 131072
##$SIGF1= 0
##$SIGF2= 0
##$SINO= 400
##$SIOLD= 131072
##$SPECTYP= <>
##$SREGLST= <1H.CDCl3>
##$SSB= 0
##$STSI= 131072
##$STSR= 0
##$SW_p= 8223.68421052631
##$SYMM= 0
##$S_DEV= 0
##$TDeff= 65536
##$TDoff= 0
##$TI= <>
##$TILT= no
##$TM1= 0
##$TM2= 0
##$TOPLEV= 0
##$USERP1= <user>
##$USERP2= <user>
##$USERP3= <user>
##$USERP4= <user>
##$USERP5= <user>
##$WDW= 1
##$XDIM= 131072
##$YMAX_p= 83791302
##$YMIN_p= -270490107
##$CURPLOT= <Network HP LaserJet P1505>
##$CURPRIN= <$Network HP LaserJet P1505>
##$DFORMAT= <normdp>
##$LAYOUT= <+/1D_H.xwp>
##$LFORMAT= <normlp>
##$PFORMAT= <normpl>
##$SURQMSG= 1
$$ End of Bruker specific parameters
$$ ---------------------------------
##NTUPLES= NMR SPECTRUM
##VAR_NAME=  FREQUENCY,     SPECTRUM/REAL,   SPECTRUM/IMAG
##SYMBOL=    X,             R,               I
##VAR_TYPE=  INDEPENDENT,   DEPENDENT,       DEPENDENT
##VAR_FORM=  AFFN,          ASDF,            ASDF
##VAR_DIM=   131072,        131072,          131072
##UNITS=     HZ,            ARBITRARY UNITS, ARBITRARY UNITS
##FACTOR=    0.0627417313425164, 1,          1
##FIRST=     8223.62146879497, -354,         -6600
##LAST=      0,             -204,            -6660
##MIN=       0,             -270490107,      0
##MAX=       8223.62146879497, 83791302,     0
$$ Real data points
##PAGE= N=1
##DATA TABLE= (X++(R..R)), XYDATA
$$ [...]
63427A22093m000m059l970l792l715l799l857l724l463l181k848k451k121j942
63413G5171j785j516j282j281j410j368j051o44l33j89k12l55m94n40n32n00l64
63396F1315j23Kj56l90l83j35Q5J84K76L91M30M14M80O03O54O73Q43J108J209
63377F7480J076R12Q10O12K74pj21k57n64q88r99r23q30p85p70p77p54n65j82
63358F2742K21M48N18N66O56P79R28J102J248J330J368J387J437J613J961K359
63342H0663K648K855L086L202K939K336J789J548J467J386J450J817K325K742
63328A12253L172L862M758N539O079O522O888O869O155M805L185J637K98q23j691
63313A69508k213k306k016j497r24m32j32j01l44q44j601k598l673m584n183n477
$$ y = [122093, 118093, 114034, 110064, 106272, 102557, 98758, 94901, 91177, 87714, 84533, 81685, 79234, 77113, 75171, 73386, 71870, 70588, 69307, 67897, 66529, 65478, 64834, 64501, 64312, 64100, 63745, 63251, 62711, 62179, 61679, 61315, 61192, 61194, 61038, 60648, 60265, 60130, 60215, 60399, 60675, 61066, 61496, 61910, 62390, 62993, 63647, 64320, 65163, 66271, 67480, 68556, 69468, 70278, 70890, 71164, 71157, 71036, 70779, 70215, 69327, 68328, 67405, 66575, 65790, 65020, 64243, 63489, 62924, 62742, 62963, 63411, 63929, 64495, 65151, 65930, 66858, 67960, 69208, 70538, 71906, 73293, 74730, 76343, 78304, 80663, 83311, 86166, 89252, 92454, 95393, 97729, 99518, 101066, 102533, 103919, 105369, 107186, 109511, 112253, 115425, 119287, 124045, 129584, 135663, 142185, 149073, 155942, 162097, 166902, 170087, 171724, 172022, 171199, 169508, 167295, 164989, 162973, 161476, 160552, 160120, 159988, 159887, 159543, 158699, 157098, 154500, 150827, 146243, 141060, 135583]
63297A35583n528n390n172m969m733m344l832l371l026k659k177j693j320r87
63283H6382n77j14K89O06Q65J065J200J327J489J666J877K228K748L286L696M022
63267A12055M385M768N081N349N679O016O102N729M936L902K750J509K23r70j890
63252A65624k437k613k450j984j361q70p46r57j303j708k296l102l947m621n066
63237A30163n312n314n017m512m012l665l408l038k420j655j061q82j078j416
63223H7373j723j972k122k122k005j883j788j651j447j242j061q69o99o04n19
63208F5666l10l9M4j53m36n89n84m55k11L2M7j89l93l27r2Q9K16M01N93O87P47
63187F4744Q50Q56N55M2l37m43m55n58o88p01n68l50j08R2J87J79J19K5j11k12
$$ y = [135583, 130055, 124665, 119493, 114524, 109791, 105447, 101615, 98244, 95218, 92559, 90382, 88689, 87369, 86382, 85805, 85691, 85980, 86586, 87451, 88516, 89716, 91043, 92532, 94198, 96075, 98303, 101051, 104337, 108033, 112055, 116440, 121208, 126289, 131638, 137317, 143333, 149435, 155164, 160100, 164002, 166752, 168261, 168484, 167514, 165624, 163187, 160574, 158124, 156140, 154779, 153909, 153163, 152206, 150903, 149195, 146899, 143797, 139850, 135229, 130163, 124851, 119537, 114520, 110008, 105996, 102331, 98923, 95885, 93465, 91810, 90749, 89867, 88789, 87373, 85650, 83678, 81556, 79434, 77429, 75546, 73758, 72107, 70660, 69418, 68357, 67488, 66789, 66185, 65666, 65356, 65317, 65361, 65208, 64772, 64183, 63599, 63144, 62933, 62965, 63012, 62823, 62430, 62103, 62011, 62100, 62316, 62717, 63310, 63997, 64744, 65594, 66450, 67005, 67047, 66710, 66267, 65812, 65254, 64566, 63865, 63297, 62947, 62839, 62931, 63118, 63297, 63416, 63441, 63330, 63118]
63167F3118j78m5L4K3N3K14L85M08L25L32N01P09Q14Q21Q17Q51R00R71J094J222
63147G3369J244J153J109J258J526J716J769J812J957K205K510K866L233L542
63133A01269L799M102M511M965N393N797O175O494O702O768O626O238N752N426
63119A80017N364N400N359N308N424N751O137O410O486O363O067N582M793L602
63105B58063K082M23j269k996m687o147p275q125q711q924q737q338p867p232
63091A80260o335n346m516l832l075k180j276m57L45J165J928K563L075L490L821
63076A69630M121M447M742M899M925M958N044N052M851M532M314M277M268M094
63062B34154L706L165K457J518L79p88j890l035m305n518o404o928p274p532p619
$$ y = [63118, 62940, 62895, 62929, 62952, 63005, 63219, 63604, 64012, 64337, 64669, 65170, 65879, 66693, 67514, 68331, 69182, 70082, 71053, 72147, 73369, 74613, 75766, 76875, 78133, 79659, 81375, 83144, 84956, 86913, 89118, 91628, 94494, 97727, 101269, 105068, 109170, 113681, 118646, 124039, 129836, 136011, 142505, 149207, 155975, 162601, 168839, 174591, 180017, 185381, 190781, 196140, 201448, 206872, 212623, 218760, 225170, 231656, 238019, 244086, 249668, 254461, 258063, 260145, 260568, 259299, 256303, 251616, 245469, 238194, 230069, 221358, 212434, 203697, 195359, 187492, 180260, 173925, 168579, 164063, 160231, 157156, 154976, 153700, 153243, 153588, 154753, 156681, 159244, 162319, 165809, 169630, 173751, 178198, 182940, 187839, 192764, 197722, 202766, 207818, 212669, 217201, 221515, 225792, 230060, 234154, 237860, 241025, 243482, 245000, 245379, 244591, 242701, 239666, 235361, 229843, 223439, 216511, 209237, 201705, 194086]
63047A94086p518p339p079o589n859n123m547l994l286k518j900j445j017o09
63033A35263l71l73n04o35p10p49p67p36n77k52P8J46j07m12m85l27j26lN1M9
63013A28453J2nK5N6P8J37K08J57l5j50l8J21N1k27m41m37l02j46KJ10J25O0q
62990A27806m3l6N4K34L94M39M38N35P25Q90R68R78R02P07M88M25N69Q18J057
62971A38348J257J419J567J775K104K500K838L061L233L449L781M213M631M902
62957A79078N064N333N861O562P288Q010Q763R494J0152J0814J1563J2307J2872
62944B93161J3234J3497J3715J3846J3871J3814J3677J3457J3228J3100J3130
62933D41730J3340J3700J4088J4284J4164J3735J2936J1573R562P073M259J099
$$ y = [194086, 186568, 179229, 172150, 165561, 159702, 154579, 150032, 146038, 142752, 140234, 138334, 136889, 135872, 135263, 134892, 134519, 134015, 133380, 132670, 131921, 131154, 130418, 129841, 129589, 129667, 129813, 129706, 129294, 128809, 128482, 128356, 128353, 128404, 128453, 128465, 128460, 128485, 128541, 128619, 128756, 128964, 129121, 129086, 128936, 128898, 129019, 129070, 128843, 128402, 127965, 127663, 127517, 127519, 127629, 127754, 127814, 127806, 127763, 127727, 127781, 128015, 128409, 128848, 129286, 129821, 130546, 131436, 132404, 133382, 134284, 134991, 135479, 135904, 136473, 137291, 138348, 139605, 141024, 142591, 144366, 146470, 148970, 151808, 154869, 158102, 161551, 165332, 169545, 174176, 179078, 184142, 189475, 195336, 201898, 209186, 217196, 225959, 235453, 245605, 256419, 267982, 280289, 293161, 306395, 319892, 333607, 347453, 361324, 375138, 388815, 402272, 415500, 428600, 441730, 455070, 468770, 482858, 497142, 511306, 525041, 537977, 549550, 559112, 566185, 570444, 571543]
62921E71543k370n824q937j1717j4325j6665j8460j9610k0186k0181j9555j8490
62909C95223j7271j5903j4184j2119j0017q096o334m672l152j727k41J329K811
62896C05647M071N151O087O808P303P682Q023Q288Q473Q624Q711Q616Q357Q114
62882D09955P968P745P222O344N168L737K058J50j981m307o716r040j1131j2882
62868D04290j4205j5108j5688j5985j5910j5446j4827j4260j3637j2726j1583
62857B44915j0506r626q835q082p481p038o591o078n620n252m830m287l778l455
62843A53456l277l135k996k849k635k324j972j628j334j134r96p45k93J56L49
62828A28643L68N11P74Q73P12N11L75R3m09q62j033j109j363j716j864j740j540
$$ y = [571543, 569173, 563349, 554412, 542695, 528370, 511705, 493245, 473635, 453449, 433268, 413713, 395223, 377952, 362049, 347865, 335746, 325729, 317633, 311299, 306627, 303475, 301748, 301507, 302836, 305647, 309718, 314869, 320956, 327764, 335067, 342749, 350772, 359060, 367533, 376157, 384868, 393484, 401841, 409955, 417923, 425668, 432890, 439234, 444402, 448139, 450197, 450347, 448366, 444059, 437343, 428303, 417172, 404290, 390085, 374977, 359289, 343304, 327394, 311948, 297121, 282861, 269224, 256498, 244915, 234409, 224783, 215948, 207866, 200385, 193347, 186756, 180678, 175058, 169806, 164976, 160689, 156911, 153456, 150179, 147044, 144048, 141199, 138564, 136240, 134268, 132640, 131306, 130172, 129176, 128431, 128138, 128294, 128643, 129011, 129522, 130296, 131169, 131881, 132392, 132767, 132860, 132451, 131589, 130556, 129447, 128084, 126368, 124504, 122764, 121224]
62811A21224j416j375j365j340j259j138j045r79q44o43n27n88p11p56p16o28
62795A05894m48k01l1m7j57k13j98j56r0rK0JO2K55M33M27K72J10np6p5JL5p1
62771A05733k45l15k15k4J20J34M3j7N5K00K82K87L04L36L02K38L08N25O94O87
62751A09432N91N34M80L43J43p0k73m04l84k66k47l96n65n81m50k80j61j95m03
62732A06848o16o16m31k78j93K2L94O50O32N43O04P28P34O73O87P49P69P77Q38
62713A13514Q87Q87R09R81R72Q55Q36J049J299J364J315J331J394J432J559J894
62697A32478K285K531K718L061L534L944M293M761N368O021O725P546Q384R094
62683B02743R796J0755J1986J3252J4457J5726J7108J8475J9753K1011K2214K3136
$$ y = [121224, 119808, 118433, 117068, 115728, 114469, 113331, 112286, 111307, 110463, 109820, 109293, 108705, 107994, 107238, 106522, 105894, 105446, 105245, 105214, 105167, 105010, 104797, 104599, 104443, 104353, 104344, 104364, 104365, 104427, 104682, 105115, 105542, 105814, 105924, 105919, 105843, 105768, 105769, 105804, 105733, 105488, 105173, 104958, 104934, 105054, 105188, 105231, 105214, 105269, 105469, 105751, 106038, 106342, 106678, 106980, 107218, 107526, 108051, 108745, 109432, 110023, 110557, 111037, 111380, 111523, 111453, 111180, 110776, 110392, 110126, 109879, 109483, 108918, 108337, 107887, 107607, 107446, 107251, 106848, 106232, 105616, 105185, 104907, 104714, 104736, 105130, 105780, 106412, 106955, 107559, 108287, 109021, 109694, 110381, 111130, 111899, 112676, 113514, 114401, 115288, 116197, 117178, 118150, 119005, 119841, 120890, 122189, 123553, 124868, 126199, 127593, 129025, 130584, 132478, 134763, 137294, 140012, 143073, 146607, 150551, 154844, 159605, 164973, 170994, 177719, 185265, 193649, 202743, 212539, 223294, 235280, 248532, 262989, 278715, 295823, 314298, 334051, 355062, 377276, 400412]
62671D00412K3541K3331K2460K0869J8588J5718J2305Q365M041m07m774q926j2665
62658E22858j5777j8221k0132k1585k2529k2915k2786k2209k1263k0099j8874
62647B96468j7644j6383j5128j3925j2723j1458j0204r111q181p287o395n614
62635A62415n024m556m089l585l065k593k239j986j740j431j112q77p36o47n64
62620A28171m08o8M35Q75J094J199J406J775K214K676L120L469L733M088M670
62605A58449N337N906O475P279Q341R474J0589J1744J2944J4102J5190J6226J7129
62592B99185J7786J8187J8314J7969J6927J5225J3085J0565P592M242P36k815
62580D36998o390r751j2542j4682j6386j7741j8527j8598j8142j7430j6566j5589
$$ y = [400412, 423953, 447284, 469744, 490613, 509201, 524919, 537224, 545589, 549630, 549223, 544449, 535523, 522858, 507081, 488860, 468728, 447143, 424614, 401699, 378913, 356704, 335441, 315342, 296468, 278824, 262441, 247313, 233388, 220665, 209207, 199003, 189892, 181711, 174424, 168029, 162415, 157391, 152835, 148746, 145161, 142096, 139503, 137264, 135278, 133538, 132107, 130995, 130118, 129382, 128735, 128171, 127763, 127695, 128130, 129005, 130099, 131298, 132704, 134479, 136693, 139369, 142489, 145958, 149691, 153779, 158449, 163786, 169692, 176167, 183446, 191787, 201261, 211850, 223594, 236538, 250640, 265830, 282056, 299185, 316971, 335158, 353472, 371441, 388368, 403593, 416678, 427243, 434835, 439077, 439813, 436998, 430608, 420857, 408315, 393633, 377247, 359506, 340979, 322381, 304239, 286809, 270243, 254654]
62568B54654j4644j3821j2992j1987j0804r589q463p484o696o077n583n208m958
62555A36348m737m403l954l507l094k640k150j745j480j281j125j078j135j172
62541A02847j127j084j090j078j015r82r98r56p97o19m95l70j94o3m3o2j8M9M1
62522I1946m1j48k78m25m98l96j20K42N99Q52R30Q80Q79J025J244J439J661K021
62504A01812K487K892L152L352L609L954M364M874N564O429P338Q152Q882R628
62490A76489J0402J1084J1571J1841J1831J1372J0381Q947P179N084K719L28j858
62477B77370l835n673p257q415r225r924j0530j0825j0719j0352r844r154q302
62464A63315p480o832o316n841n391m931m356l653k962k422k047j817j729j702
$$ y = [254654, 240010, 226189, 213197, 201210, 190406, 180817, 172354, 164870, 158174, 152097, 146514, 141306, 136348, 131611, 127208, 123254, 119747, 116653, 114013, 111863, 110118, 108638, 107357, 106232, 105154, 104019, 102847, 101720, 100636, 99546, 98468, 97453, 96471, 95473, 94517, 93720, 93101, 92606, 92236, 92042, 91979, 91936, 91874, 91856, 91905, 91946, 91905, 91757, 91479, 91054, 90556, 90160, 90040, 90282, 90881, 91733, 92663, 93543, 94422, 95447, 96691, 98130, 99791, 101812, 104299, 107191, 110343, 113695, 117304, 121258, 125622, 130496, 136060, 142489, 149827, 157979, 166861, 176489, 186891, 197975, 209546, 221387, 233218, 244590, 254971, 263918, 271097, 276181, 278900, 279228, 277370, 273535, 267862, 260605, 252190, 242965, 233041, 222511, 211686, 200967, 190615, 180771, 171617, 163315, 155835, 149003, 142687, 136846, 131455, 126524, 122168, 118515, 115553, 113131, 111084, 109267, 107538, 105836]
62450A05836j562j249q96o66o13p47j037j321j350j087q12p56q14p09m09j16J4
62433I1706N9J74M03O65Q75J004J086J181J353J644K050K483K839L129L474L943
62417A18068M458M962N553O329P183P912Q488R081R785J0466J0869J0764J0056
62404B23974Q894P570O245M792L058J159o72k416m189n862p110p844q310q661
62390B10628q750q447p946p562p355p134o702o037n301m723m406m242m060l819
62376A24144l560l244k855k538k437k388k103j596j205j110j168j201j187j081
62362I6471p76l37j8Q4J39K48K64J02l4O9L69P36J147J557J824J940K107K390
62344A08282K535K382K185K245K427K372K036J651J258O47k25j096j723k145k490
$$ y = [105836, 104274, 103025, 102129, 101463, 100850, 100103, 99066, 97745, 96395, 95308, 94496, 93740, 92926, 92217, 91808, 91692, 91706, 91765, 91939, 92342, 93007, 93882, 94886, 95972, 97153, 98506, 100150, 102200, 104683, 107522, 110651, 114125, 118068, 122526, 127488, 133041, 139370, 146553, 154465, 162953, 172034, 181819, 192285, 203154, 213918, 223974, 232868, 240438, 246683, 251475, 254533, 255692, 255020, 252604, 248415, 242553, 235443, 227599, 219289, 210628, 201878, 193431, 185485, 177923, 170568, 163434, 156732, 150695, 145394, 140671, 136265, 132023, 127963, 124144, 120584, 117340, 114485, 111947, 109510, 107122, 105019, 103423, 102218, 101108, 99940, 98739, 97552, 96471, 95695, 95358, 95340, 95424, 95563, 95811, 96075, 96177, 96143, 96212, 96581, 97317, 98464, 100021, 101845, 103785, 105892, 108282, 110817, 113199, 115384, 117629, 120056, 122428, 124464, 126115, 127373, 128020, 127795, 126699, 124976, 122831, 120341]
62329A20341k759k865k789k617k450k316k157j921j653j450j334j241j142j059
62315I2588r49p16l93j65j18j51j60j60j56q9L7R5R8K46N96Q98R16P67P31Q43
62295I4758R47R73R91J018J003R62R67J062J236J446J575J506J307J206J285J333
62279A13575J189J003R88J110J198J260J394J554J619J671J913K382K916L385
62265A37157L824M317M920N667O542P451Q309R108R771J0089R942R425Q663P624
62251B42809O311M981L921L101K307J522R22N29J16n00j275k059k743l288l725
62236B52929m146m555m810m831m734m691m676m595m536m686n030n364n579n743
62222A84953n922o100o265o416o458o287n912n414m812m118l456k925k439j863
$$ y = [120341, 117582, 114717, 111928, 109311, 106861, 104545, 102388, 100467, 98814, 97364, 96030, 94789, 93647, 92588, 91639, 90923, 90530, 90365, 90247, 90096, 89936, 89776, 89620, 89531, 89568, 89663, 89761, 90007, 90603, 91501, 92417, 93184, 93915, 94758, 95705, 96678, 97669, 98687, 99690, 100652, 101619, 102681, 103917, 105363, 106938, 108444, 109751, 110957, 112242, 113575, 114764, 115767, 116755, 117865, 119063, 120323, 121717, 123271, 124890, 126561, 128474, 130856, 133772, 137157, 140981, 145298, 150218, 155885, 162427, 169878, 178187, 187295, 197066, 207155, 217097, 226522, 235185, 242809, 249120, 254101, 258022, 261123, 263430, 264952, 265874, 266403, 266519, 266019, 264744, 262685, 259942, 256654, 252929, 248783, 244228, 239418, 234587, 229853, 225162, 220486, 215891, 211355, 206669, 201639, 196275, 190696, 184953, 179031, 172931, 166666, 160250, 153792, 147505, 141593, 136179, 131367, 127249, 123793, 120868, 118429, 116566]
62208A16566j299r81r06q32o35m39l48k74j03J31L43N17O42O59N60M37L87M28
62190A14853N00M81K55j50n04n94m86m21m78m80k64J17M83P14P99Q12Q81J093
62172A17611J407J728K023K324K652K990L341L749M264M948N830O806P710Q520
62158A75903R373J0265J0921J1088J0823J0308R516Q333O849N284L695K069N91
62145B75018n27j433k548m002n493o762p858q850r595r952r978r765r255q457
62131A80543p585o819o039n067m052l358l095k981k697k240j834j638j589j509
62117A30040j295r78o47l63j93j70k34k03N5M61Q26J070J234J354J377J295J190
62100A34819J157J187J210J187J173J285J549J816J878J736J611J638J715J703
$$ y = [116566, 115267, 114286, 113380, 112548, 111913, 111474, 111126, 110852, 110749, 110880, 111223, 111740, 112382, 113041, 113601, 114038, 114425, 114853, 115353, 115834, 116089, 115939, 115435, 114841, 114355, 113934, 113456, 112976, 112712, 112829, 113312, 114026, 114825, 115637, 116518, 117611, 119018, 120746, 122769, 125093, 127745, 130735, 134076, 137825, 142089, 147037, 152867, 159673, 167383, 175903, 185276, 195541, 206462, 217550, 228373, 238681, 248197, 256530, 263379, 268663, 272358, 274427, 275018, 274491, 273058, 270510, 266508, 261015, 254253, 246395, 237545, 227950, 217998, 208020, 198255, 189000, 180543, 172958, 166139, 160100, 155033, 150981, 147623, 144528, 141547, 138850, 136610, 134776, 133138, 131549, 130040, 128745, 127767, 127120, 126757, 126564, 126394, 126160, 125957, 126012, 126473, 127299, 128369, 129603, 130957, 132334, 133629, 134819, 135976, 137163, 138373, 139560, 140733, 142018, 143567, 145383, 147261, 148997, 150608, 152246, 153961, 155664]
62086A55664J656J680J715J624J424J228J038P67M60K60K23L18N47R53J509K177
62070A73243L019M023M956N585N992O388O708O655O170N462M603L399J870M70
62056B38543l40n98p02r61j473k226l156m100m876n384n591n496n147m643m041
62041A89809l363k692k169j798j424r84o29n35o94r70j262j508j628j589j457
62026A67107j291j041o39j31L63Q10J278J799K319K754L059L160K880K073Q56
62011A85356l55j137j396j316j070p50o02r71j904k961l670l985m091l971l492
61996A53685k767k093j518q45m8O05R39J097J245J340J290J162J114J215J473
61981A57894J852K213K388K392K441K683L040L367L612L788L946M203M672N242
$$ y = [155664, 157320, 159000, 160715, 162339, 163763, 164991, 166029, 166796, 167256, 167516, 167739, 168057, 168604, 169557, 171066, 173243, 176262, 180285, 185241, 190826, 196818, 203206, 209914, 216569, 222739, 228201, 232804, 236203, 238073, 238543, 238203, 237605, 236903, 235942, 234469, 232243, 229087, 224987, 220111, 214727, 209136, 203640, 198493, 193850, 189809, 186446, 183754, 181585, 179787, 178363, 177379, 176750, 176215, 175521, 174551, 173289, 171781, 170153, 168564, 167107, 165816, 164775, 164136, 164005, 164368, 165178, 166456, 168255, 170574, 173328, 176387, 179547, 182427, 184500, 185356, 185001, 183864, 182468, 181152, 180082, 179332, 178730, 177759, 175855, 172894, 169224, 165239, 161148, 157177, 153685, 150918, 148825, 147307, 146462, 146414, 147019, 147958, 149055, 150300, 151640, 152930, 154092, 155206, 156421, 157894, 159746, 161959, 164347, 166739, 169180, 171863, 174903, 178270, 181882, 185670, 189616, 193819, 198491, 203733]
61967B03733N620N664N506N281M927M302L378K206Q44n43j678k376k737k998l305
61952B27824l652l977m222m384m576m894n260n464n429n291n151m929m553m151
61938A61891l919l875l870l773l600l454l399l358l171k826k535k501k590k459
61924A16561j983j419j098j104j288j479j610j701j779j786j596j231r31q60q43
61909I5853o03j71J55K21J65J25R1Q5J99L96M85L98K76K09J26l2j95l56n88q73
61889I5966j048j071j086j146j126r69q22p91p89p19n97m01q3K23K14j37m72n07
61871H4639l88l64l87k96j46j06j56j58j22j44j84j50r5j46k61l03k30r6Q7L38
61851H1332N91P67R08J129J467J843K140K248K185K183K481K971L263L175K980
$$ y = [203733, 209353, 215017, 220523, 225804, 230731, 235033, 238411, 240617, 241461, 240918, 239240, 236864, 234127, 231129, 227824, 224172, 220195, 215973, 211589, 207013, 202119, 196859, 191395, 185966, 180675, 175524, 170595, 166042, 161891, 157972, 154097, 150227, 146454, 142854, 139400, 136001, 132643, 129472, 126646, 124111, 121610, 119020, 116561, 114578, 113159, 112061, 110957, 109669, 108190, 106580, 104879, 103100, 101314, 99718, 98487, 97556, 96696, 95853, 95250, 95079, 95234, 95455, 95620, 95745, 95836, 95921, 96120, 96516, 97001, 97399, 97675, 97884, 98010, 97978, 97783, 97427, 96839, 95966, 94918, 93847, 92761, 91615, 90489, 89520, 88698, 87907, 87118, 86399, 85802, 85401, 85318, 85541, 85755, 85618, 85146, 84639, 84251, 83887, 83500, 83204, 83058, 82952, 82796, 82638, 82516, 82372, 82188, 82038, 81943, 81797, 81536, 81233, 81003, 80907, 80994, 81332, 81923, 82690, 83598, 84727, 86194, 88037, 90177, 92425, 94610, 96793, 99274, 102245, 105508, 108683, 111663]
61836A11663L007L210L321L250L109K996K897K771K521K072J472R03M51L9l42
61821A43340n77o75q35j125j286j091o41j20M77J164J763K143K434K771K962K782
61805A53486K360J976J613J045K81m44j024j534j957k205k360k577k801k841k735
61790A40283k708k792k766k535k269k119k019j883j761j768j923k156k329k262
61776A08993j896j384r14n28k08l3m4n0J64N14P46Q42J036J415J812K110K397
61759A14972K741L076L365L694M096M488M824N172N551N844N995O098O224O258
61745A82398O040N571M969M261L344K171Q75l14j253j959k434k547k189j511q32
61730A96590k70L18J008J625K003K235K425K401J907R72j20j149k109l034l926
$$ y = [111663, 114670, 117880, 121201, 124451, 127560, 130556, 133453, 136224, 138745, 140817, 142289, 143192, 143643, 143682, 143340, 142763, 142088, 141253, 140128, 138842, 137751, 137110, 136990, 137467, 138631, 140394, 142537, 144971, 147742, 150704, 153486, 155846, 157822, 159435, 160480, 160761, 160317, 159293, 157759, 155802, 153597, 151237, 148660, 145859, 143018, 140283, 137575, 134783, 132017, 129482, 127213, 125094, 123075, 121192, 119431, 117663, 115740, 113584, 111255, 108993, 107097, 105713, 104799, 104271, 104063, 104030, 103986, 103936, 104100, 104614, 105360, 106202, 107238, 108653, 110465, 112575, 114972, 117713, 120789, 124154, 127848, 131944, 136432, 141256, 146428, 151979, 157823, 163818, 169916, 176140, 182398, 188438, 194009, 198978, 203239, 206583, 208754, 209629, 209315, 208062, 206103, 203669, 201122, 198933, 197422, 196590, 196320, 196638, 197646, 199271, 201274, 203509, 205934, 208335, 210242, 211214, 211094, 209945, 207836, 204802, 200876]
61715B00876m744n372n668n655n540n378m962m219l498l196l212l147k849k502
61701A40934k197j862j538j381j353j225r58p74q02q79q39p00n20l20j76k38m56
61684A24716n75m51k42j60k26l05k90j54O4K43K73K00J83K72L88M79N56N92N46
61665A26109M80M79M96M28L60M65O89P32M59R9o5n1j10m13q86j306j486j418j286
61646A23775j238j213j082r00q61r82j064r44o78m04j88n3nJ0P2J85K81L31L47
61627A15389L14K27J80K51L67L95L83N03P29Q17O34L82L23M65N50L80L2k33k84
61608A21804l15n93j068j394j388j267j272j336j280j176j215j356j394j289j164
61593A04297j040q55o79o46p35q12q58r19q89o78m69n40q13r28p62n27l99k96
$$ y = [200876, 196132, 190760, 185092, 179437, 173897, 168519, 163557, 159338, 155840, 152644, 149432, 146285, 143436, 140934, 138737, 136875, 135337, 133956, 132603, 131378, 130420, 129646, 128844, 127965, 127126, 126426, 125906, 125586, 125410, 125172, 124716, 124141, 123690, 123448, 123288, 123062, 122757, 122467, 122313, 122377, 122620, 122893, 123093, 123276, 123548, 123936, 124415, 124971, 125563, 126109, 126589, 127068, 127564, 127992, 128352, 128817, 129506, 130238, 130697, 130796, 130731, 130680, 130570, 130157, 129271, 127965, 126479, 125061, 123775, 122537, 121324, 120242, 119342, 118481, 117499, 116435, 115491, 114813, 114409, 114221, 114168, 114163, 114173, 114245, 114430, 114711, 115042, 115389, 115703, 115930, 116110, 116361, 116728, 117123, 117506, 118009, 118738, 119555, 120189, 120571, 120894, 121359, 121909, 122289, 122321, 122088, 121804, 121489, 120896, 119828, 118434, 117046, 115779, 114507, 113171, 111891, 110715, 109500, 108144, 106750, 105461, 104297, 103257, 102402, 101723, 101077, 100342, 99530, 98672, 97753, 96864, 96186, 95717, 95177, 94364, 93436, 92674, 92147, 91748, 91452]
61575I1452j60q2r8j31j59k48l65l85k96k02r2Q9K21J34p7j57j07j40k41j80L7
61554H8813J18j4p7R0K88L17K63K71L32M41O34P95O87L32L9o7j98m86p82r57j083
61533H9756j143r83o96o14p48p03l41q3k30m49l42p3op4QJ76J68M4O7J90J26j69
61511H3881m71o60p77p94o95o50p98r54q66o70o67q25q73q13q54r33p26k37J19
61492G0737O9k11m68o61p89p53n81m98n94o59n19k92j66j01K2J47J45M3k6k1m
61471F4820J6Q3J30L2k04l61k52N9K89K41mj92j64K7K13K82K53K24K59L13K87
61450F6351K07K35M35O14N48K95J25J31J65J30J14K05L46M86O66Q70R50Q11N37
61431G4221K41j6j39n6J12J10q9k42k44l19o06q54p39l25O3K66L34L20K42J79
$$ y = [91452, 91292, 91210, 91112, 90981, 90822, 90574, 90209, 89824, 89528, 89326, 89234, 89323, 89544, 89678, 89601, 89444, 89337, 89197, 88956, 88776, 88813, 88931, 88917, 88840, 88930, 89218, 89535, 89798, 90069, 90401, 90842, 91476, 92271, 92958, 93290, 93329, 93262, 93064, 92578, 91796, 90839, 89756, 88613, 87630, 86934, 86320, 85572, 84869, 84528, 84445, 84215, 83766, 83424, 83351, 83345, 83271, 83279, 83455, 83623, 83667, 83734, 83924, 84050, 83881, 83410, 82750, 81973, 81179, 80484, 79834, 79036, 78082, 77216, 76546, 75879, 75054, 74181, 73368, 72514, 71581, 70855, 70618, 70737, 70806, 70595, 70127, 69466, 68677, 67924, 67343, 66845, 66251, 65592, 65073, 64781, 64615, 64514, 64536, 64683, 64828, 64871, 64845, 64824, 64820, 64836, 64919, 65049, 65081, 64877, 64516, 64264, 64323, 64612, 64853, 64849, 64657, 64493, 64520, 64733, 65015, 65268, 65492, 65751, 66064, 66351, 66558, 66793, 67228, 67842, 68390, 68685, 68810, 68941, 69106, 69236, 69350, 69555, 69901, 70387, 71053, 71923, 72873, 73684, 74221, 74462, 74446, 74307, 74251, 74363, 74473, 74384, 74142, 73898, 73579, 72973, 72119, 71380, 71055, 71118, 71384, 71718, 72038, 72280, 72459]
61411G2459J99K10J26M1Q8J76R7j67m31n52n12l54j60o2j07j51m7J62L25L83L75
61390G2098L18K17J00l6k47m76n43l81j63n3l2l0j03k39k63q0J05O6p5n1J72L70
61368G0674L91K47lk54l39k09k7O7J62L82N78N37L20J76K04L21M67N91N50K80
61348G5115J1RK18L48L33L26L96M41M66N87Q25J033J117J102J012Q53P10O44N88
61329H6134M65L70M05M59L46J31L0O9Q2J4o6j87l90n17l45M1L25L73L35L16K71
61308H8661K22K78L68K89N3o3O4K35K49J81J69J80J18j1j41k39k83k64k71l91
61288H9404n38n23l52k39l08m52n31n49n61n40m38k39J1J92J51r2k67j32J95M28
61268H4620N23O47Q22Q85Q31Q38R47R70Q50P95R69J277J551J765J902J883J738
$$ y = [72459, 72658, 72868, 72994, 73035, 73123, 73299, 73396, 73229, 72798, 72246, 71734, 71380, 71220, 71158, 71051, 70900, 70853, 71015, 71340, 71723, 72098, 72416, 72633, 72733, 72697, 72450, 71974, 71431, 71050, 70887, 70834, 70802, 70772, 70669, 70430, 70167, 70087, 70192, 70258, 70183, 70132, 70304, 70674, 71065, 71312, 71309, 71055, 70716, 70507, 70480, 70547, 70709, 71091, 71669, 72206, 72526, 72702, 72906, 73227, 73694, 74285, 74835, 75115, 75126, 75135, 75353, 75701, 76034, 76360, 76756, 77197, 77663, 78250, 79075, 80108, 81225, 82327, 83339, 84192, 84902, 85546, 86134, 86599, 86969, 87374, 87833, 88179, 88310, 88340, 88409, 88491, 88505, 88439, 88252, 87862, 87345, 87000, 87041, 87366, 87739, 88074, 88390, 88661, 88883, 89161, 89529, 89818, 89871, 89808, 89872, 90107, 90356, 90537, 90706, 90886, 91004, 90993, 90852, 90613, 90330, 90066, 89795, 89404, 88866, 88343, 87991, 87752, 87444, 86992, 86461, 85912, 85351, 84811, 84373, 84134, 84145, 84337, 84488, 84396, 84129, 83997, 84192, 84620, 85143, 85790, 86612, 87497, 88328, 89166, 90113, 91083, 91933, 92728, 93697, 94974, 96525, 98290, 100192, 102075, 103813]
61251A03813J640J660J607J303Q35M45K55K30K58K49J92J53J50M6k61o10p00m95
61233A10770k48j55j94k88m08m78l96k45k29l54l98k62j18j17j68j56j17n8J35
61214A06516N15R47J327J717K147K466K566K587K694K812K740K476K170J894J617
61199A37191J353J192J162J180J137R81O99L19j25o03j055j367j487j503j549
61184A37525j641j732j851k012k060j780j257q41p20p40o85n46l95k07O2L47N28
61167A21995N86O35Q41J324J972K440K436K050J577J114N19k05q17j162j364j575
61151A32366j753j820j828j819j728j503j201q87n33j58J21K40K64K66K66L06
61135A20599M16N04M83M59O18Q82R86Q94Q37R21R85R69J041J256J388J329J303
$$ y = [103813, 105453, 107113, 108720, 110023, 110858, 111303, 111558, 111788, 112046, 112295, 112487, 112640, 112790, 112836, 112575, 111965, 111265, 110770, 110522, 110367, 110173, 109885, 109477, 108999, 108603, 108358, 108129, 107775, 107377, 107115, 106997, 106880, 106712, 106556, 106439, 106381, 106516, 107031, 107978, 109305, 111022, 113169, 115635, 118201, 120788, 123482, 126294, 129034, 131510, 133680, 135574, 137191, 138544, 139736, 140898, 142078, 143215, 144196, 144895, 145214, 145089, 144486, 143431, 142064, 140577, 139074, 137525, 135884, 134152, 132301, 130289, 128229, 126449, 125192, 124351, 123631, 122891, 122206, 121660, 121265, 121058, 121120, 121467, 121995, 122581, 123216, 124057, 125381, 127353, 129793, 132229, 134279, 135856, 136970, 137489, 137284, 136467, 135305, 133941, 132366, 130613, 128793, 126965, 125146, 123418, 121915, 120714, 119827, 119294, 119136, 119257, 119497, 119761, 120027, 120293, 120599, 121015, 121519, 122002, 122461, 123079, 123961, 124947, 125841, 126678, 127599, 128584, 129553, 130594, 131850, 133238, 134567, 135870]
61118A35870J499J785J982K149K345K389K137J781J603J599J642J786K119K488
61104A63174K650K614K572K627K781L078L472L718L632L325K983K564J953J287
61090B02430Q08N04J87j83n18q62j312j754j997k151k568l315m045m403m414m327
61074A72080m263m165l943l631l407l422l596l614l287k783k400k165j881j455
61060A28068j019o91m07k6M73R68J297J405J391J353J209Q08K30k45n19p82j091
61043A32422j153p35q7L93O97J092J621K067K377K731L176L504L574L494L435
61028A58608L474L663M023M424M647M667M680M813M953M932M757M568M509M619
61014B21337M800M886M823M740M731M704M577M496M607M719M455L782L090K755
$$ y = [135870, 137369, 139154, 141136, 143285, 145630, 148019, 150156, 151937, 153540, 155139, 156781, 158567, 160686, 163174, 165824, 168438, 171010, 173637, 176418, 179496, 182968, 186686, 190318, 193643, 196626, 199190, 201143, 202430, 203238, 203742, 203929, 203746, 203228, 202366, 201054, 199300, 197303, 195152, 192584, 189269, 185224, 180821, 176407, 172080, 167817, 163652, 159709, 156078, 152671, 149249, 145653, 142039, 138752, 135969, 133569, 131404, 129523, 128068, 127049, 126358, 125951, 125925, 126398, 127366, 128663, 130068, 131459, 132812, 134021, 134829, 135059, 134814, 134295, 133513, 132422, 131269, 130534, 130447, 130840, 131537, 132629, 134250, 136317, 138694, 141425, 144601, 148105, 151679, 155173, 158608, 162082, 165745, 169768, 174192, 178839, 183506, 188186, 192999, 197952, 202884, 207641, 212209, 216718, 221337, 226137, 231023, 235846, 240586, 245317, 250021, 254598, 259094, 263701, 268420, 272875, 276657, 279747, 282502]
61000B82502K795L056L449L906M302M598M912N364N895O322O503O407O128N819
60986C51958N526N110M441L606K780J930Q68m10j691k840l911m922n737o303o748
60971C43657p164p441p492p445p470p531p459p181o760o311n914n578n168m538
60957B50205l742l053k620k284j822j253p95n89n64n39l67l5K90M43M93O61R64
60940B35393J142J032Q55R18J221J549J805K061K363K744L314M098M903N530O041
60925B74969O554O955P115P335Q106R479J1105J2889J5135J7876K0647K3111K5502
60912D46778K8248L1672L6323M2983N1803O1992P2913Q5026R9251J16229J37218
60901A210436J64987K02538K51737L14347L91282M73926N33752N28526M31430
$$ y = [282502, 285297, 288353, 291802, 295708, 300010, 304608, 309520, 314884, 320779, 327101, 333604, 340011, 346139, 351958, 357484, 362594, 367035, 370641, 373421, 375351, 376219, 375809, 374118, 371278, 367367, 362445, 356708, 350405, 343657, 336493, 329052, 321560, 314115, 306645, 299114, 291655, 284474, 277714, 271403, 265489, 259911, 254743, 250205, 246463, 243410, 240790, 238506, 236684, 235431, 234636, 234047, 233483, 232944, 232577, 232542, 232832, 233275, 233768, 234429, 235393, 236535, 237567, 238422, 239340, 240561, 242110, 243915, 245976, 248339, 251083, 254397, 258495, 263398, 268928, 274969, 281523, 288478, 295593, 302928, 311034, 320513, 331618, 344507, 359642, 377518, 398165, 421276, 446778, 475026, 506698, 543021, 586004, 637807, 699799, 772712, 857738, 956989, 1073218, 1210436, 1375423, 1577961, 1829698, 2144045, 2535327, 3009253, 3543005, 4071531, 4502961]
60892D502961K59952P2635o7909j30895j20877n7251L7816J31693J77109J33340
60882D938574j445j82032l44674m46141m79924m64075m21098l67712l14330k66323
60872A650820k24735j88411j56631j29568j06991q7994p2051n9265m9472m1923
60862E33779l5974l1401k7869k4808k1978j9583j7682j5957j4225j2655j1285
60851C00362r915q603p834p865q343q767q942q828q336p550o808o272n746n107
60837A91446m572m295m066l685l316l172l150l019k752k438k112j847j744j696
60823A49582j452j037q11q77q98o61m26m41n29n09n98r55j263j192r84j087j464
60806A34398j746j888k137k497k715k735k733k742k632k413k201j973j687j493
$$ y = [4502961, 4762913, 4835548, 4767639, 4636744, 4515867, 4458616, 4496432, 4628125, 4805234, 4938574, 4937129, 4755097, 4410423, 3964282, 3484358, 3020283, 2599185, 2231473, 1917143, 1650820, 1426085, 1237674, 1081043, 951475, 844484, 756490, 684439, 625174, 575702, 533779, 497805, 466404, 438535, 413727, 391749, 372166, 354484, 338527, 324302, 311647, 300362, 290447, 281844, 274010, 266145, 257802, 249035, 240093, 231265, 222929, 215379, 208571, 202299, 196553, 191446, 186874, 182579, 178513, 174828, 171512, 168340, 165190, 162171, 159419, 156981, 154869, 153022, 151278, 149582, 148130, 147093, 146282, 145405, 144507, 143846, 143420, 142979, 142450, 141941, 141343, 140388, 139125, 137933, 136949, 135862, 134398, 132652, 130764, 128627, 126130, 123415, 120680, 117947, 115205, 112573, 110160, 107959, 105986, 104299, 102806]
60792A02806j543j645j514j191r39p80n50k89k17l23l31r6L02P74J260J593J597
60775I8914J359J092Q46N76L86M09N58O54P41R60J225J351J371J440J496J373
60759A14751J130R46P75M59R9r1j68l44n30m46j25R1R6Q8J04m6l91o95q96j203
60739A13604j704k195k515k686k692k462k116j937j973j992j884j776j680j420
60725H4572j012p57q18r75r66q01o14m37k99k71l51m39n24o62p75o75l50J7L04
60706G4167N21O14N36M28N24P79R45R28Q58P79O63O51R00J189J127P24L83K67
60688H6983J56o2k05k30l54o24p84p90r13j218j385j277j216j379j431j106p18
60671G3447o60p79o87m14l00m23n83o99q08q36o80m57l60l31j86Q7L29M93O28
$$ y = [102806, 101263, 99618, 98104, 96913, 95974, 95194, 94644, 94355, 94138, 93815, 93484, 93388, 93690, 94464, 95724, 97317, 98914, 100273, 101365, 102211, 102787, 103173, 103582, 104140, 104794, 105535, 106495, 107720, 109071, 110442, 111882, 113378, 114751, 115881, 116827, 117602, 118061, 118160, 118069, 117901, 117557, 117027, 116581, 116456, 116547, 116643, 116731, 116835, 116789, 116398, 115703, 114807, 113604, 111900, 109705, 107190, 104504, 101812, 99350, 97234, 95297, 93324, 91332, 89448, 87672, 85992, 84572, 83560, 82803, 81985, 81010, 80044, 79243, 78629, 78192, 77893, 77622, 77271, 76832, 76308, 75646, 74871, 74196, 73846, 73863, 74167, 74688, 75302, 75838, 76266, 76790, 77569, 78514, 79442, 80300, 81079, 81742, 82393, 83293, 84482, 85609, 86333, 86716, 86983, 87139, 87077, 86872, 86642, 86288, 85664, 84880, 84090, 83177, 81959, 80574, 79297, 78081, 76702, 75271, 74165, 73447, 72787, 72008, 71321, 70907, 70607, 70184, 69601, 68902, 68094, 67258, 66578, 66121, 65761, 65430, 65244, 65331, 65660, 66153, 66781]
60652F6781P12P04O90P87R55J080J156J209J178J002P26L87q4o31r72q79m86j33
60634G4182J9J2p8j67j18J47M88P11P76P47O42M53K94L04M84P17Q71Q69O95M39
60614H2487K30J11L4m3j25k67n02p12p74p81r13j115j164j044r31q60p10n38n72
60595G1811p42p29n04m47o82q04n10q4P8J6l0p3j78j37K43P30R79J010J047J055
60575G2049Q86P16Q51J157J168P23J37k79n18o70p11o45n68n46n59o00o67o78
60557G1246n53l38j30P7L05M57M57M29N31P03P43O06M01J86p6l63n83o89o77n56
60537G2176l97l46m21m25k22L0R2l5j75k41k54k03q5OJ5N9K30L90L50J69M3J6
60515G0772j2n2m5k2n5p3K6J63J59oj71k37k23j62q2m7p1n5O9K02K20J60J39J83
$$ y = [66781, 67493, 68197, 68887, 69674, 70629, 71709, 72865, 74074, 75252, 76254, 76980, 77367, 77283, 76652, 75680, 74801, 74315, 74182, 74201, 74213, 74135, 73968, 73850, 73997, 74485, 75196, 75972, 76719, 77361, 77814, 78108, 78412, 78896, 79613, 80484, 81353, 82048, 82487, 82717, 82828, 82862, 82819, 82694, 82427, 81925, 81213, 80439, 79658, 78745, 77630, 76466, 75422, 74491, 73631, 72921, 72383, 71811, 71069, 70340, 69836, 69389, 68707, 67903, 67393, 67309, 67387, 67403, 67373, 67300, 67122, 66985, 67228, 67958, 68937, 69947, 70994, 72049, 72935, 73651, 74502, 75659, 76827, 77550, 77687, 77408, 76890, 76220, 75509, 74864, 74296, 73750, 73191, 72591, 71924, 71246, 70693, 70355, 70225, 70302, 70607, 71064, 71521, 71950, 72481, 73184, 73927, 74533, 74934, 75120, 75044, 74681, 74098, 73409, 72732, 72176, 71779, 71433, 71012, 70587, 70365, 70395, 70487, 70452, 70277, 70036, 69782, 69579, 69494, 69500, 69515, 69574, 69804, 70194, 70544, 70713, 70756, 70772, 70760, 70708, 70663, 70641, 70586, 70513, 70539, 70702, 70861, 70855, 70684, 70447, 70224, 70062, 69980, 69933, 69862, 69807, 69876, 70078, 70298, 70458, 70597, 70780]
60491G0780K75M36O43P67P47P09P15O13L21P0J06K86K94R0q9j34j36r3R3L75N53
60470G7421N72N96P29Q71R32R90J174J500J871K125K130J900J606J364J113P84
60454I7678M74L11K29P3j42k87l21l02k42j17M7K48N98J156J733K084K227K391
60436A07838K719L180L740M427N191N837O156O018N413M441L238J875M11r66k014
60421A57504k684l120l384l383l149k895k698k386j901j472j248j064p96n96n26
60406A26202k98K90R67J405J778K450L338M096M706N464O425P385Q298R274J0180
60391A91960J0729J0952J1111J1168J0773R833Q632P275N461K999J43k761n638
60378B72637q437j0864j2567j3487j3802j3656j3091j2142j0901r545q311p347
$$ y = [70780, 71055, 71491, 72134, 72901, 73648, 74357, 75072, 75685, 76006, 76076, 76182, 76468, 76762, 76852, 76763, 76629, 76493, 76400, 76493, 76868, 77421, 77993, 78589, 79318, 80189, 81121, 82111, 83285, 84785, 86656, 88781, 90911, 92811, 94417, 95781, 96894, 97678, 98152, 98463, 98692, 98765, 98623, 98336, 98015, 97713, 97471, 97354, 97401, 97649, 98247, 99403, 101136, 103220, 105447, 107838, 110557, 113737, 117477, 121904, 127095, 132932, 139088, 145106, 150519, 154960, 158198, 160073, 160484, 159518, 157504, 154820, 151700, 148316, 144933, 141784, 138889, 136191, 133805, 131904, 130432, 129184, 128120, 127324, 126728, 126202, 125904, 126194, 127161, 128566, 130344, 132794, 136132, 140228, 144934, 150398, 156823, 164208, 172506, 181780, 191960, 202689, 213641, 224752, 235920, 246693, 256526, 265158, 272433, 277894, 280893, 281036, 278275, 272637, 264200, 253336, 240769, 227282, 213480, 199824, 186733, 174591, 163690, 154145, 145834, 138487]
60366A38487o596n916n267m653m035l412k944k723k572k255j820j493j307j123
60352I2371r62r65j090j116r74q08p27p15p90r37j001q42o13n75o62n67k37L7
60334G8827M5r7j98k03j04O3J77J50J37L24N94O60N10L80L48K56J17J24K87L50
60314H2747K23R4Q9P3l5j08o3j5l6k1Q6K02K97M56O62P63P35P23P49O61M43K94
60292H9019L08L57L87N35Q45J068J014Q02O72O69P12P56Q19R15J037J100R41N45
60274A02501K10K40N12O22M42K02Q6N1J28M42Q74J050Q55N79M59M07L31L83O76
60255A11050J064J405J792K292K718K848K673K272J637Q18K0o17j145j601j874
60240A25352j933j938j995j981j790j521j304j123r64r11r63r68r08r74j225j393
$$ y = [138487, 131891, 125975, 120708, 116055, 112020, 108608, 105664, 102941, 100369, 98114, 96294, 94801, 93494, 92371, 91409, 90444, 89354, 88238, 87264, 86456, 85729, 85014, 84224, 83287, 82286, 81444, 80831, 80256, 79594, 79027, 78790, 78827, 78872, 78775, 78577, 78374, 78270, 78333, 78510, 78660, 78797, 79121, 79715, 80375, 80885, 81265, 81613, 81869, 81986, 82110, 82397, 82747, 82970, 83064, 83153, 83226, 83191, 83083, 83020, 83005, 82969, 82948, 83034, 83236, 83533, 83989, 84651, 85414, 86149, 86872, 87621, 88282, 88725, 89019, 89327, 89684, 90071, 90606, 91451, 92519, 93533, 94335, 95007, 95676, 96388, 97144, 97963, 98878, 99915, 101015, 101956, 102501, 102711, 102951, 103463, 104085, 104527, 104729, 104815, 104866, 104994, 105436, 106310, 107360, 108215, 108794, 109253, 109660, 109991, 110374, 111050, 112114, 113519, 115311, 117603, 120321, 123169, 125842, 128114, 129751, 130569, 130589, 129972, 128827, 127226, 125352, 123419, 121481, 119486, 117505, 115715, 114194, 112890, 111767, 110803, 109892, 108929, 107961, 107053, 106079, 104854, 103461]
60224A03461j225p95l34O1L78N62O16O70Q17J013J276J708K187K327J950J369
60208A16041R80P32K65n30j370j913k049j865j530j179q41n03k29j42k36l78n10
60191A04743p32j058j327j403j335j232j123r93q48o72m93m37n78p49o88l89r2
60174I0594L6rk26n55p15m35J28N07N08L69K79J77L6J2J19J84J55J97L19L00J19
60153I2099M7J85K91K16J52K05J53j24l61l46k49k52k15J3K18J49n6j16pJ28K94
60132I2424M95N77M70M42P30J159J407J440J423J401J336J327J452J552J449J224
60116A10308J058R56Q69R09J148J382J342J041P21N32M85N23N09K75j27m23n18
60099A20990o03q05r44q64p09o47o07n28n52p39q63p61o00n16l42L4L44L53K90
$$ y = [103461, 102236, 101441, 101107, 101168, 101546, 102108, 102724, 103394, 104211, 105224, 106500, 108208, 110395, 112722, 114672, 116041, 117021, 117753, 118018, 117488, 116118, 114205, 112156, 110291, 108761, 107582, 106741, 106238, 106009, 105867, 105631, 105253, 104743, 104011, 102953, 101626, 100223, 98888, 97656, 96533, 95540, 94692, 94020, 93527, 93090, 92512, 91763, 91075, 90686, 90594, 90630, 90621, 90395, 89840, 89125, 88690, 88818, 89325, 89833, 90202, 90481, 90658, 90694, 90706, 90825, 91009, 91164, 91361, 91680, 91980, 92099, 92146, 92331, 92622, 92838, 92990, 93195, 93348, 93224, 92863, 92517, 92268, 92016, 91801, 91814, 92032, 92181, 92125, 92009, 92002, 92130, 92424, 92919, 93496, 93966, 94408, 95138, 96297, 97704, 99144, 100567, 101968, 103304, 104631, 106083, 107635, 109084, 110308, 111366, 112322, 113191, 114100, 115248, 116630, 117972, 119013, 119734, 120266, 120751, 121274, 121783, 122058, 121931, 121508, 120990, 120387, 119582, 118638, 117774, 117065, 116418, 115811, 115283, 114731, 113992, 113129, 112368, 111768, 111252, 110910, 110944, 111288, 111641, 111931]
60080A11931M50O67N91K88J16J57K34K85L86M46L14Q5kQ9K21L26L82K74Kj89j57
60059A16896j45l67n62l57J32M72N21M95N20N34N56O51P23O37N17N39O19N65M55
60040A23401M91O10N94M88N05O46P55Q55J037J150R55N44K12%k79o11p88q32r51
60021A28782j174j298j244j118r80q23p63r17j152j241j180j098r41o32l43k90
60005A13588l27j72J10K34K18L38O03P46P31Q01R99J087R92R32R87R75Q02O18
59987A24262N21M62M39N28O21N10K11o7k79n77r66j277j468j657j829j860j822
59970A15752j896k017j930j633j389j262j034o46l41l12m41n23m56k00J85M41
59954A02298L91K20K35L97M46L90M50N73M70J52p2j48l74q30j173j178j053r91
$$ y = [111931, 112381, 113048, 113639, 113927, 114043, 114200, 114434, 114719, 115105, 115551, 115865, 115950, 115948, 116037, 116258, 116584, 116966, 117240, 117242, 117053, 116896, 116751, 116384, 115822, 115465, 115597, 116069, 116590, 117085, 117605, 118139, 118695, 119346, 120069, 120706, 121223, 121762, 122381, 122946, 123401, 123892, 124502, 125096, 125584, 126089, 126735, 127490, 128345, 129382, 130532, 131487, 132031, 132243, 132243, 131964, 131353, 130565, 129733, 128782, 127608, 126310, 125066, 123948, 122968, 122145, 121382, 120465, 119313, 118072, 116892, 115794, 114853, 114221, 113878, 113588, 113261, 113089, 113199, 113433, 113651, 113989, 114592, 115338, 116069, 116870, 117869, 118956, 119948, 120880, 121867, 122842, 123644, 124262, 124783, 125245, 125684, 126212, 126833, 127343, 127554, 127487, 127208, 126631, 125665, 124388, 122920, 121263, 119434, 117574, 115752, 113856, 111839, 109909, 108276, 106887, 105625, 104591, 103945, 103604, 103292, 102851, 102328, 101872, 101672, 101857, 102298, 102689, 102909, 103144, 103541, 103987, 104377, 104827, 105400, 105870, 106022, 105950, 105802, 105428, 104598, 103425, 102247, 101194, 100203]
59936A00203q85o37m22l97m52m36l53k24MK26K14o1l77o61j051j511j711j522
59918H9947j241j114r89o71l14j92k66k91k03j49k14l02k71o1K56M85M91L48K28
59899H5477J76J30J17J92K72K45J79K05K47J82J21K33L79K51j19l80m00l56l56
59880H6795l08k32k57k88j01K12L06J65J34L25M22K82J95L91O85Q59R91J185J295
59861I3056J226J136J124J021P17L94J96n5n09r70j166j150j142j196j240j269
59845I0173j278j162q71n18k39m6P2J27K01M04O49P38O97P74J046J340J552J771
59827I5430K010K124K088J986J705J013M7o89r69j069j232j270r78m88k5M02P85
59810A00870R69R26Q96J031J164J140J034Q85N52N0l21m15m71o51p49o12m78n69
$$ y = [100203, 99318, 98681, 98259, 97862, 97410, 96974, 96621, 96397, 96401, 96627, 96841, 96780, 96403, 95742, 94691, 93180, 91469, 89947, 88706, 87592, 86603, 85932, 85618, 85426, 85160, 84869, 84666, 84517, 84303, 84001, 83730, 83669, 83925, 84410, 84901, 85249, 85477, 85653, 85783, 85900, 86092, 86364, 86609, 86788, 86993, 87240, 87422, 87543, 87776, 88155, 88406, 88287, 87907, 87507, 87151, 86795, 86487, 86255, 85998, 85710, 85609, 85821, 86127, 86292, 86426, 86751, 87173, 87455, 87650, 88041, 88726, 89585, 90576, 91761, 93056, 94282, 95418, 96542, 97563, 98280, 98674, 98870, 98815, 98306, 97336, 96170, 95020, 93878, 92682, 91442, 90173, 88895, 87733, 86862, 86344, 86105, 86059, 86131, 86258, 86459, 86863, 87512, 88250, 88947, 89721, 90767, 92107, 93659, 95430, 97440, 99564, 101652, 103638, 105343, 106356, 106403, 105714, 104745, 103676, 102444, 101174, 100196, 99708, 99683, 100085, 100870, 101839, 102765, 103661, 104692, 105856, 106996, 108030, 108915, 109467, 109517, 109196, 108781, 108310, 107659, 106910, 106298, 105820, 105251]
59792A05251o74n47l13j91m0L53Q21J049J066J137J335J542J740J945J980J678
59776A18132J215R28Q85Q61P07M56J87l3j32j39k02l60m53l63k35k51m01n67o74
59757A19561o54m43j50JJ6J62N11Q09R28J153J701K315K572K399J988J438Q06
59740A35113K95P8J44M53J076J925K549K513J850R03m7q43j347j559j645j705
59724A39753j665j563j654k034k411k488k328k141j979j824j732j632j320q45
59710A14137n87o90p81n62k80k59l58l01k07k86l58j59J21J28j4R0M09N18K77
59691A10838j5j34j47j21k3Q3O8l0o5m4o2r2p4q5j99k68j96j83l70m81k04K36
59669A08432L70K03J72M13O34O90P86J042J238J197J065J066J214J396J504J458
$$ y = [105251, 104577, 104030, 103717, 103526, 103486, 103839, 104660, 105709, 106775, 107912, 109247, 110789, 112529, 114474, 116454, 118132, 119347, 120275, 121160, 122021, 122728, 123184, 123371, 123338, 123206, 123067, 122865, 122505, 122052, 121689, 121454, 121203, 120802, 120235, 119561, 118907, 118464, 118314, 118315, 118331, 118493, 119004, 119813, 120741, 121894, 123595, 125910, 128482, 130881, 132869, 134307, 135113, 135408, 135486, 135630, 136083, 137159, 139084, 141633, 144146, 145996, 146899, 146852, 146009, 144662, 143103, 141458, 139753, 138088, 136525, 134871, 132837, 130426, 127938, 125610, 123469, 121490, 119666, 117934, 116302, 114982, 114137, 113550, 112860, 112079, 111517, 111237, 110978, 110620, 110319, 110112, 109826, 109468, 109309, 109430, 109558, 109544, 109634, 110043, 110561, 110838, 110823, 110689, 110542, 110421, 110398, 110481, 110549, 110519, 110454, 110410, 110348, 110256, 110182, 110097, 109898, 109630, 109434, 109251, 108881, 108400, 108196, 108432, 108802, 109005, 109177, 109590, 110224, 110914, 111700, 112742, 113980, 115177, 116242, 117308, 118522, 119918, 121422, 122880]
59653A22880J261J103J196J513J832K070K301K527K634K569K410K225K038J869
59639A50428J678J356Q95M88K67J20o5j63m6J37J54O0K5l9l42p97j047r46p11
59620A51452n89n95o42o55o21n94o59p48o48l14j8mj41j47J4K09L99O02O81N02
59600A47484K17R9J98L87N97P87Q45P17N61N12M56K78J27K00L68L77K30J06j1
59581A54535k78o85j097j460j760j873j757j615j617j619j436j221j216j324j254
59566A34323r95p68o53n59m87m76m19j79J28L07L38K73N0l14n52n38n93j005j517
59547A26364j671j524j489j637j659j436j163r50o99m27k85k59k24k21l96o84
59531A11640q98j067j342j668j845j845j754j524j103o91n39n83o12o18o84p20
$$ y = [122880, 124141, 125244, 126440, 127953, 129785, 131855, 134156, 136683, 139317, 141886, 144296, 146521, 148559, 150428, 152106, 153462, 154357, 154845, 155112, 155232, 155167, 155004, 154958, 155095, 155249, 155309, 155334, 155295, 154953, 154156, 153109, 152163, 151452, 150863, 150268, 149626, 148971, 148350, 147756, 147097, 146349, 145701, 145387, 145369, 145365, 145224, 145077, 145091, 145300, 145699, 146301, 146982, 147484, 147701, 147800, 147998, 148385, 148982, 149769, 150614, 151331, 151892, 152404, 152860, 153138, 153265, 153465, 153833, 154210, 154440, 154546, 154535, 154257, 153572, 152475, 151015, 149255, 147382, 145625, 144010, 142393, 140774, 139338, 138117, 136901, 135577, 134323, 133328, 132560, 131907, 131348, 130861, 130385, 129966, 129787, 129915, 130222, 130560, 130833, 130883, 130569, 130017, 129479, 128886, 127881, 126364, 124693, 123169, 121680, 120043, 118384, 116948, 115785, 114835, 114136, 113709, 113424, 113165, 112941, 112720, 112324, 111640, 110742, 109675, 108333, 106665, 104820, 102975, 101221, 99697, 98594, 97903, 97364, 96781, 96169, 95551, 94867, 94147]
59515I4147o20n31n61m94j67J35R9p4m5O7j7r1K07O60P33M44K79L27K65Q7J39
59494I4989M14M98L10K14L27L60K63L37O02O95N18M08M81M36J99P1J20k1m57p61
59474A00003o68m65m34m08k18q4k01l69l43j92p4K9J15N5j09j44k2pj80k66j10
59453I5908J20L03N18P29P16N35N43Q03R77R35J003J408K038K965M490O290P106
59436A27387N905L088O0k078l055l057k409j552q51m02j33l8j20k90m92p54j009
59419A20200j101j049j093j327j550j589j487j301j016p51p23q76q52n12j52q2
59403A04739k33l88m59m44l41k75l98o13o41m60l22l17k71j09j4n3n0N9J18O9
59383I9597M6O9jj06l5J83L20M01O44R37Q67M20Q2J35L58N39P48R43Q90O69P05
$$ y = [94147, 93527, 92996, 92435, 91941, 91774, 91909, 92008, 91934, 91889, 91956, 91939, 91848, 92055, 92715, 93448, 93892, 94171, 94498, 94763, 94850, 94989, 95403, 95901, 96211, 96425, 96752, 97112, 97375, 97712, 98314, 99009, 99527, 99935, 100416, 100852, 101051, 101122, 101242, 101221, 100764, 100003, 99335, 98870, 98436, 98028, 97810, 97726, 97525, 97156, 96813, 96621, 96547, 96576, 96691, 96746, 96637, 96493, 96471, 96464, 96284, 96018, 95908, 96028, 96331, 96849, 97578, 98294, 98829, 99372, 100175, 101152, 102087, 103090, 104498, 106536, 109501, 113991, 120281, 127387, 133292, 136380, 136440, 134362, 131307, 128250, 125841, 124289, 123438, 123036, 122903, 122865, 122745, 122455, 121963, 121209, 120200, 119099, 118050, 116957, 115630, 114080, 112491, 111004, 109703, 108687, 107936, 107213, 106337, 105485, 104973, 104821, 104739, 104506, 104118, 103659, 103215, 102874, 102599, 102201, 101588, 100947, 100487, 100165, 99848, 99577, 99468, 99454, 99401, 99351, 99410, 99528, 99597, 99643, 99712, 99711, 99605, 99570, 99753, 100073, 100474, 101118, 102055, 102922, 103342, 103424, 103559, 103917, 104456, 105204, 106147, 107037, 107706, 108411]
59362A08411J056J272J136J020J173J300J140R20Q71Q22O54N60O03M56qm07m93
59345A20486n73q89j147j051q30p76p19m42j32M3L29Q94J379J415J225J220J418
59328A21850J660K006K446K676K624K727L206L550L310K874K876L262L689M344
59314A63100N492O485O145M169J458q99k349k719k097j005r0O01J560K920L944
59299A86715L633J635j408m276n981o391o089n602m977m169l407k906k533k117
59285A42127j793j670j524j142p29n65n48m49l65m57n22k70J44L39L02L10M43
59268A33631N64O55Q25J052J293J650K159K588K729K685K632K535K414K519K926
59253A62857L248L180K972K958K975K691K234J929J679J164M45j37n61j078j719
$$ y = [108411, 109467, 110739, 111875, 112895, 114068, 115368, 116508, 117428, 118299, 119121, 119775, 120335, 120938, 121394, 121386, 120979, 120486, 119913, 119024, 117877, 116826, 115996, 115220, 114501, 114059, 113927, 113970, 114299, 115193, 116572, 117987, 119212, 120432, 121850, 123510, 125516, 127962, 130638, 133262, 135989, 139195, 142745, 146055, 148929, 151805, 155067, 158756, 163100, 168592, 175077, 181222, 185391, 186849, 185950, 183601, 180882, 178785, 177780, 177690, 178291, 179851, 182771, 186715, 190348, 191983, 190575, 186299, 180318, 173927, 167838, 162236, 157259, 153090, 149683, 146777, 144244, 142127, 140334, 138664, 137140, 135998, 135269, 134704, 134156, 133707, 133342, 132885, 132363, 132093, 132237, 132576, 132878, 133188, 133631, 134195, 134850, 135675, 136727, 138020, 139670, 141829, 144417, 147146, 149831, 152463, 154998, 157412, 159931, 162857, 166105, 169285, 172257, 175215, 178190, 180881, 183115, 185044, 186723, 187887, 188332, 188195, 187634, 186556, 184837]
59238A84837k311k841l404l856m014m015m082m067l682l038k552k379k362k392
59224A39842k433k364k112j860j780j722j527j381j458j531j313r65q10p69n84
59209A17233l29k20j20K27O88R83J226J752K512L149L493L495K900J563r6j433
59193A37023k286k838k995k543j727j096p79m57NM33Q06J219J549J572J454J588
59177A30928J985K301K422K493K480K201J784J577J624J658J578J507J425J234
59163A57197J074J159J332J276J015P79N23R3k91l19k19m96j086j416j275j037
59147A58309r85j002r88j045j142j097r71j008j172j217j172j328j695j977k082
59132A39428k206k383k413k259k102j980j788j595j544j509j256q71o01l93o6
$$ y = [184837, 182526, 179685, 176281, 172425, 168411, 164396, 160314, 156247, 152565, 149527, 146975, 144596, 142234, 139842, 137409, 135045, 132933, 131073, 129293, 127571, 126044, 124663, 123205, 121674, 120361, 119396, 118586, 117817, 117233, 116904, 116684, 116564, 116791, 117479, 118462, 119688, 121440, 123952, 127101, 130594, 134089, 136989, 138552, 138456, 137023, 134737, 131899, 128904, 126361, 124634, 123538, 122759, 122302, 122307, 122740, 123546, 124765, 126314, 127886, 129340, 130928, 132913, 135214, 137636, 140129, 142609, 144810, 146594, 148171, 149795, 151453, 153031, 154538, 155963, 157197, 158271, 159430, 160762, 162038, 163053, 163832, 164355, 164448, 164157, 163838, 163619, 163123, 162037, 160621, 159346, 158309, 157324, 156322, 155334, 154289, 153147, 152050, 151079, 150071, 148899, 147682, 146510, 145182, 143487, 141510, 139428, 137222, 134839, 132426, 130167, 128065, 126085, 124297, 122702, 121158, 119649, 118393, 117522, 116921, 116528, 116462]
59117A16462K05J29q6J9M22O62O01N41O05O11N29M94M15R5k49k00J46K83O7j89
59097A21562l80o81r78q90m74k49m17o12n68m44l82k83j22pJ05L11L98J25k09
59078A15805r2L81O21M90M06M99M60K48K12L49K24k01m29k75j94m76q37j039j247
59059A14905j516j539j225r31q71q34p48q55j134j152q12n96p62r11p30n24o68
59042I9097j004j196j216j148r05n04j93o8P0K96M13L89M58O23N81L15K09L95
59024I6612N44N23O46J039J353J398J487J826K141K230K346K667K923K935K947
59009A23617L179L403L392L252L079K662J937J203O50Q8n71j065j271j449j724
58994A40382j824j621j432j449j408j131r08r59j039r11p89r12j129j254j372
$$ y = [116462, 116667, 116796, 116710, 116729, 117151, 117813, 118414, 118955, 119560, 120171, 120700, 121194, 121609, 121704, 121455, 121255, 121401, 121684, 121751, 121562, 121182, 120501, 119523, 118633, 118159, 117910, 117493, 116881, 116313, 115869, 115487, 115204, 115082, 115075, 115180, 115491, 115889, 116014, 115805, 115713, 116094, 116715, 117205, 117611, 118110, 118570, 118818, 119030, 119379, 119603, 119402, 118973, 118698, 118504, 118028, 117191, 116152, 114905, 113389, 111850, 110625, 109694, 108823, 107989, 107241, 106386, 105252, 104100, 103288, 102692, 101930, 101019, 100289, 99765, 99097, 98093, 96897, 95681, 94533, 93628, 93124, 92931, 92863, 92933, 93229, 93642, 94031, 94489, 95112, 95693, 96008, 96217, 96612, 97156, 97679, 98325, 99364, 100717, 102115, 103602, 105428, 107569, 109799, 112145, 114812, 117735, 120670, 123617, 126796, 130199, 133591, 136843, 139922, 142584, 144521, 145724, 146374, 146462, 145891, 144826, 143555, 142106, 140382, 138558, 136937, 135505, 134056, 132648, 131517, 130609, 129650, 128611, 127700, 126911, 125999, 124870, 123616, 122244]
58979A22244j533j515j247r95r25q45o98p41j020j158r74p92q27q33o59n88q01
58962A06093r92r11p60p22o19l84l18n37o67m82k99l56l76j22J37J77K56N83Q28
58943A00529O82L89K52J25j81l99k67j5Q5K19O30J139J512J873K341K691K800
58926A14405K953L268L339K880K232J763J289N76q6l70m95p85j069j093j068j256
58910A26483j417j210p88m85k73K9L20M94P26J064J176R45Q01R91J043N55o0k04
58892A30190j4J8j30j85k14l97n04k51J16K51L16O44J065J225J262J543K000K340
58874A39275K614K998L314L297L124L110L136K905K515K277K195K079J928J745
58860A76512J316N88o9m03o77j127j494j597j819k459l106l329l414l806m206
$$ y = [122244, 120711, 119196, 117949, 116954, 116029, 115184, 114486, 113745, 112725, 111567, 110593, 109801, 108974, 108141, 107482, 106894, 106093, 105101, 104190, 103430, 102708, 102089, 101705, 101387, 100850, 100183, 99701, 99402, 99046, 98670, 98548, 98685, 98862, 99118, 99701, 100529, 101211, 101600, 101852, 101977, 101796, 101397, 101130, 101115, 101200, 101419, 102049, 103188, 104700, 106573, 108914, 111605, 114405, 117358, 120626, 123965, 126845, 129077, 130840, 132129, 132705, 132619, 132249, 131754, 130969, 129900, 128807, 127739, 126483, 125066, 123856, 123068, 122583, 122310, 122339, 122659, 123153, 123879, 124943, 126119, 127064, 127865, 128856, 129899, 130454, 130394, 130190, 130176, 130194, 130064, 129879, 129665, 129268, 128764, 128513, 128629, 128880, 129196, 129840, 130905, 132130, 133392, 134935, 136935, 139275, 141889, 144887, 148201, 151498, 154622, 157732, 160868, 163773, 166288, 168565, 170760, 172839, 174767, 176512, 177828, 178416, 178347, 177944, 177267, 176140, 174646, 173049, 171230, 168771, 165665, 162336, 158922, 155116, 150910]
58845A50910m033l372k759k347j965j680j611j499j067n51k58k7L37N14K40p8
58829A30754J4J97k7m25n07m44o84j005q94n38m91o80o04l34l52n92n54k47r8
58810A22489q9J80O36Q61R70J492K403L094L321L422L568L586L508L597L780L745
58794A60563L591L710M093M377M514M728M883M612L971L358K800K040J153M38
58780B08831k08j111k107k740l031l343l603l378k709k090j688j269q36o28n59
58765A79531l43j11k04m91n96o47j069j721k055k057k174k432k439k241k350k839
58749A55762l203l213l124l068k900k733k853l098l046k764k667k687k340j633
58735A16433j093q75o34k94j70k40p5L75O86P46Q60J088J139J004R90J062R08
$$ y = [150910, 146877, 143505, 140746, 138399, 136434, 134754, 133143, 131644, 130577, 130026, 129768, 129741, 130078, 130592, 130832, 130754, 130768, 130965, 130938, 130513, 130006, 129562, 128878, 127873, 126979, 126441, 125950, 125270, 124666, 124332, 123980, 123388, 122834, 122587, 122489, 122400, 122580, 123216, 124077, 125047, 126539, 128942, 132036, 135357, 138779, 142347, 145933, 149441, 153038, 156818, 160563, 164154, 167864, 171957, 176334, 180848, 185576, 190459, 195071, 199042, 202400, 205200, 207240, 208393, 208831, 208623, 207512, 205405, 202665, 199634, 196291, 192688, 189310, 186601, 184511, 182823, 181554, 180718, 180090, 179531, 179188, 179077, 178873, 178382, 177786, 177139, 176070, 174349, 172294, 170237, 168063, 165631, 163192, 160951, 158601, 155762, 152559, 149346, 146222, 143154, 140254, 137521, 134668, 131570, 128524, 125760, 123093, 120406, 118066, 116433, 115340, 114465, 113831, 113537, 113367, 113127, 113052, 113427, 114113, 114859, 115719, 116807, 117946, 118950, 119940, 121002, 121910]
58718A21910O26O40Q75Q28M70L04M39M55K11L9Ok08n78o98n53o14r67j209j259
58699A20717j494j929k051j706j374j375j467j444j422j381j083n92k96k26p6
58684A02801J40J07p8J4L52M61L20L96P39Q64O58N39N87L81j87p10j050j479j895
58665A02960j811j240p65n49j83L36M63J42L8L82N44J17m23o04o13o90o03k21
58647I7280O6Rq0J27M96Q41J203J534J645J656J898K276K359K175K163K311K166
58630A20125J770J685J922J817J163N78M42M20L14M74R91J355J338J346J588J674
58614A39002J415J186J150R34M11j7k72q54j910k848l315l719m356m852m887m758
58598A12310m704m472l895l295k877k462k042j909j960j686j101q37j062j197
$$ y = [121910, 122536, 123176, 124051, 124879, 125349, 125653, 126092, 126547, 126758, 126797, 126803, 126595, 126017, 125319, 124766, 124152, 123185, 121976, 120717, 119223, 117294, 115243, 113537, 112163, 110788, 109321, 107877, 106455, 105074, 103991, 103399, 103103, 102877, 102801, 102941, 103048, 102970, 102984, 103336, 103797, 104117, 104513, 105252, 106116, 106774, 107313, 107900, 108281, 108094, 107384, 106334, 104855, 102960, 101149, 99909, 99144, 98595, 98412, 98748, 99211, 99353, 99391, 99773, 100317, 100434, 100011, 99407, 98794, 98104, 97501, 97280, 97346, 97355, 97275, 97402, 97898, 98739, 99942, 101476, 103121, 104777, 106675, 108951, 111310, 113485, 115648, 117959, 120125, 121895, 123580, 125502, 127319, 128482, 129060, 129502, 129922, 130236, 130710, 131701, 133056, 134394, 135740, 137328, 139002, 140417, 141603, 142753, 143687, 144098, 144081, 143809, 142955, 141045, 138197, 134882, 131163, 126807, 121955, 117068, 112310, 107606, 103134, 99239, 95944, 93067, 90605, 88563, 86654, 84694, 83008, 81907, 81070, 80008, 78811]
58584G8811r57p65q13o74j94J36J39L23Q73J246J153J064J297J513J577J917K615
58567H9261L067L023K992L162K939K054J140O12K8r31j771k134k414k807k776
58552I5445k099j487j440j436j005o06p14r06o75l17k54k50k6J24k5j11M3pm45
58533H3809p08m98l48n76o24j27L32K75J65M42O61M27K11M46O99N90N47Q89J036
58514H7648N48J4N7K90J64m4M2P9k24l57K7L26L8l04j66l7m28p86m74N4J23M7
58492H6637M12R24J074J201J757K329K376K282K559K800K452J944J921K079J823
58477A14570J410J365J449J249J161J668K376K733L060L823M618M951N250N996
58463A55679O598O301N427M633L653K034L49n92j066j765k436k444k049j864j716
$$ y = [78811, 77854, 77089, 76276, 75602, 75408, 75544, 75683, 76006, 76879, 78125, 79278, 80342, 81639, 83152, 84729, 86646, 89261, 92328, 95351, 98343, 101505, 104444, 106498, 107638, 108250, 108278, 107347, 105576, 103442, 101028, 98221, 95445, 93346, 91859, 90419, 88983, 87978, 87372, 86658, 85752, 85077, 84760, 84506, 84256, 84230, 84354, 84329, 84218, 84261, 84254, 83809, 83101, 82603, 82255, 81679, 81055, 80928, 81260, 81535, 81700, 82142, 82803, 83230, 83441, 83887, 84586, 85176, 85723, 86612, 87648, 88196, 88210, 88267, 88557, 88721, 88677, 88719, 88798, 88574, 88217, 88244, 88570, 88608, 88304, 88138, 88101, 87673, 86887, 86413, 86467, 86590, 86637, 87049, 87973, 89047, 90248, 92005, 94334, 96710, 98992, 101551, 104351, 106803, 108747, 110668, 112747, 114570, 115980, 117345, 118794, 120043, 121204, 122872, 125248, 127981, 131041, 134864, 139482, 144433, 149683, 155679, 162277, 168578, 174005, 178638, 182291, 184325, 184674, 184082, 183016, 181251, 178815, 176371, 174322, 172458, 170742]
58448A70742j239r71j601k681l328l621m096m478m210l670l549l627l313k861
58434A27497k795k739k108j331j134j190p78j85j00k74q5J60j43n60l67L9j58
58417A13749o24n43k36o03j404j678j416j344j412j027m29l63o79o72m40n61p80
58400I9538m64O7P6j52J45P02P26M66P29J291J302R60J183J922K338K385K690
58383A15904L181L252L061L140L117K259R48R3m90j553k706k913k345k045k120
58368A20783j862j361j294j386q14J44N30N33J123K187K717K653K749K861K176
58353A31739R56K29o0q35j944k347k063k094k460k198j268o76o02k59M02N91K95
58336A17406L03N97M68J22M33J172J257P41O92J167J195O79M80O00J92o44r72
$$ y = [170742, 169503, 168532, 166931, 164250, 160922, 157301, 153205, 148727, 144517, 140847, 137298, 133671, 130358, 127497, 124702, 121963, 119855, 118524, 117390, 116200, 115422, 115237, 115137, 114863, 114778, 114938, 114795, 114235, 113868, 113907, 113749, 113125, 112582, 112346, 111743, 110339, 108661, 107245, 105901, 104489, 103462, 103033, 102670, 101991, 101319, 100879, 100318, 99538, 99074, 99141, 99217, 99065, 99210, 99912, 100638, 101104, 101833, 103124, 104426, 105386, 106569, 108491, 110829, 113214, 115904, 119085, 122337, 125398, 128538, 131655, 133914, 134862, 134955, 134465, 132912, 130206, 127293, 124948, 122903, 120783, 118921, 117560, 116266, 114880, 114066, 114210, 114740, 115273, 116396, 118583, 121300, 123953, 126702, 129563, 131739, 132695, 132924, 132864, 132029, 130085, 127738, 125675, 123581, 121121, 118923, 117655, 116979, 116377, 116118, 116520, 117111, 117406, 117709, 118306, 118774, 118896, 119329, 120501, 121758, 122499, 123191, 124358, 125553, 126232, 126712, 127312, 127504, 126860, 125888]
58319A25888q69j270k010k008j352j229j722j765j268j245j713j609q82n99q39
58304A05508n53K91N75K04L00J012J259Q63Q33J269J156M58L05P99P98J60J6N73
58286A15826P90N31Q36J705J910J297J076J456J308M98K61Q25R83M82M84J229
58270A31497J566J272J473K289K446J734J445J879J794Q66K71K99j42j120j308
58255A46261n48k45o71m47O82J265R18J031J987K406J897J814K524K651J862J639
58239A65026K388K621J842J505K104K221J361R44J450J436M25j23K89K30p01r19
58223A82099O3O22J60K28J327J798J048Q04J760K256J537J207J999K347J570J281
58207B02106K174K617J915J683K525K705J626J177K113K580J831J730K970L486
$$ y = [125888, 125019, 123749, 121739, 119731, 118379, 117150, 115428, 113663, 112395, 111150, 109437, 107828, 106946, 106347, 105508, 104955, 105246, 105821, 106025, 106325, 107337, 108596, 109459, 110292, 111561, 112717, 113175, 113480, 114279, 115077, 115237, 115253, 115826, 116616, 117147, 117983, 119688, 121598, 122895, 123971, 125427, 126735, 127233, 127494, 128319, 129302, 129784, 130268, 131497, 133063, 134335, 135808, 138097, 140543, 142277, 143722, 145601, 147395, 148261, 148532, 148831, 148689, 147569, 146261, 145713, 145468, 144797, 144350, 145032, 146297, 147215, 148246, 150233, 152639, 154536, 156350, 158874, 161525, 163387, 165026, 167414, 170035, 171877, 173382, 175486, 177707, 179068, 180012, 181462, 182898, 183323, 183200, 183489, 183719, 183018, 182099, 182162, 182784, 182944, 183172, 184499, 186297, 187345, 188149, 189909, 192165, 193702, 194909, 196908, 199255, 200825, 202106, 204280, 206897, 208812, 210495, 213020, 215725, 217351, 218528, 220641, 223221, 225052, 226782, 229752, 233238]
58193B33238K430J939L031L646K724K343L649M577L889L519M647N325M444M044
58179B83445N254N937M890M333N606O508N617N114O504P688P194P059Q617R618
58165C73384Q576P732Q595Q978P521O668P925Q762P555O866Q431R690Q862Q514
58151D88059J0408J1872J1065J0711J2669J4121J3192J2866J5137J6926J6209
58140F33235J6231J9091K1246K0303J9921K2813K5394K4852K4815K8230L1419
58129H87550L1366L1836L5933L9768M0188M1346M6540N1350N2239N3915O0304
58118A372335O6703O9158P2825Q2075R1599R6857J03665J17262J31983J42670
58108B347132J55662J76807J99937K19766K44074K79643L19498L59221M11792
$$ y = [233238, 235668, 237607, 240638, 244284, 247008, 249351, 253000, 257577, 261466, 264985, 269632, 274957, 279401, 283445, 288699, 294636, 299526, 303859, 309465, 315973, 321590, 326704, 333208, 340896, 348090, 355149, 363766, 373384, 381960, 389692, 398287, 407265, 414786, 421454, 429379, 438141, 445696, 452562, 460993, 470683, 479545, 488059, 498467, 510339, 521404, 532115, 544784, 558905, 572097, 584963, 600100, 617026, 633235, 649466, 668557, 689803, 710106, 730027, 752840, 778234, 803086, 827901, 856131, 887550, 918916, 950752, 986685, 1026453, 1066641, 1107987, 1154527, 1205877, 1258116, 1312031, 1372335, 1439038, 1508196, 1581021, 1663096, 1754695, 1851552, 1955217, 2072479, 2204462, 2347132, 2502794, 2679601, 2879538, 3099304, 3343378, 3623021, 3942519, 4301740, 4713532]
58099D713532M89764N87851P00356Q37553J004543J185097J371589J589356J865353
58090A4344994K201943K616578L174493L941662M950344O253964P893619R605845
58082E4983442J0567899R717176O598904J923881k819976o346678q207898q673595
58074E7743155q258946p413094o445416n522497m686967l929425l256865k687371
58066A5542574k215383j820644j496640j242848j042911q75489p36254o28883
58058E483522n44954m71411m08160l60874l24688k90471k59193k35678k15597
58049B372496j92114j68517j51550j38652j23538j08234r8107r0709q0561o9847
58039A150667o3984o1292n6768n1594m9637m8863m5107m0357l8752l8316l4783
$$ y = [4713532, 5203296, 5791147, 6491503, 7329056, 8333599, 9518696, 10890285, 12479641, 14344994, 16546937, 19163515, 22338008, 26279670, 31230014, 37483978, 45377597, 54983442, 65551341, 75268517, 81867421, 83791302, 80971326, 74624648, 66416750, 57743155, 49484209, 42071115, 35625699, 30103202, 25416235, 21486810, 18229945, 15542574, 13327191, 11506547, 10009907, 8767059, 7724148, 6848659, 6112405, 5483522, 4938568, 4467157, 4058997, 3698123, 3373435, 3082964, 2823771, 2588093, 2372496, 2180382, 2011865, 1860315, 1721663, 1598125, 1489891, 1391784, 1301075, 1220514, 1150667, 1086683, 1025391, 968623, 917029, 867392, 818529, 773422, 733065, 694313, 655997, 621214]
58028F21214k9904k7980k7742k5341k2012k1238k1530j9362j6206j5666j6454
58017C77779j5083j2748j2811j4057j3036j0696j0338j1169j0178q204q179r224
58005B42056q458o729o867q051p464n863n994p131o513m759m584n514n030l612
57991A55487l705m790m398k929k772l637l324k166k270l250l033k038k351l597
57977A11227l695k897l083l904l548k464k539l356l056k071k261l162k814j559
57963G0818j327j934j677q82j214k168j867o87o13j509j610j050j481k618k675
57948D7506j801j735k405k175j143r34j529j455q11r92j741j550o79p24j482j315
57932B5035l36j32o39l37O37O90j14j62N65M66n56r28m06l67r74r15p8J69l79
$$ y = [621214, 591310, 563330, 535588, 510247, 488235, 466997, 445467, 426105, 409899, 394233, 377779, 362696, 349948, 337137, 323080, 310044, 299348, 289010, 277841, 267663, 259459, 251280, 242056, 233598, 226869, 220002, 211951, 204487, 198624, 192630, 185499, 178986, 174227, 169643, 164129, 159099, 155487, 151782, 146992, 142594, 139665, 136893, 133256, 129932, 127766, 125496, 122246, 119213, 117175, 114824, 111227, 107532, 104635, 101552, 97648, 94100, 91636, 89097, 85741, 82685, 80614, 78353, 75191, 72377, 70818, 69491, 67557, 65880, 64998, 63784, 61616, 59749, 59062, 58449, 56940, 55330, 54280, 52799, 50181, 47506, 45705, 43970, 41565, 39390, 38247, 37313, 35784, 34329, 33518, 32526, 30785, 29235, 28556, 27832, 26350, 25035, 24699, 24567, 23928, 23591, 24228, 24918, 24804, 24642, 25207, 25673, 25117, 24189, 23783, 23416, 22442, 21527, 21449, 21618, 21239]
57913B1239n06l7l6m72k25M93K96p18j003l53j16n41m77J52J62m69m31L76O22
57894A7956R4J8O09P15J54K0L63j9j136j562r88o93j080j077m15k03p03q21k66
57875A0966j04o14p71l60m49j228j490q57m47p50q37l11p2m78o67l26k58B76d06
57855e56m8n98p74l01k08q14j038l84J97J17N1L61L96J6J11Q59J210f35g7A069
57834B741J503J236J297J091L86m3J20N0o54j207j141j133j581H55e73j118j289
57817b980j329q97o28q49r05m53j47l29l72L1K14j59l93q4J85L4j2K96L60l3j92
57796h642J60L18m4k24J42L57L4j68J45L81J98K01O55Q09K85j31J32M68L17J62
57776d445M49P39O79P11h05C33P26N39Q96J013M42k1K55O28M27J31K74L80k7l47
$$ y = [21239, 20733, 20696, 20660, 20188, 19963, 20456, 20752, 20034, 19031, 18678, 18562, 18021, 17544, 17696, 17858, 17389, 16958, 17334, 17956, 18050, 18068, 18677, 19392, 19546, 19566, 19929, 19910, 18774, 17212, 16224, 15531, 14451, 13374, 12959, 12756, 12053, 11232, 10966, 10862, 10248, 9477, 9117, 8668, 7440, 5950, 5093, 4646, 3896, 3059, 2748, 2676, 2198, 1531, 1205, 947, 276, -406, -556, -604, -1202, -1976, -2277, -2485, -3299, -4337, -4721, -4524, -4407, -4356, -3995, -3599, -3583, -3472, -2613, -1403, -635, -77, 1069, 2741, 4244, 5480, 6777, 7868, 8254, 8211, 8331, 8381, 7727, 6520, 5379, 4246, 2665, 855, -573, -1691, -2980, -4309, -5206, -5834, -6683, -7588, -8041, -8188, -8517, -8889, -8858, -8644, -8803, -9196, -9280, -9095, -9061, -9073, -8777, -8417, -8450, -8642, -8482, -8164, -8208, -8432, -8290, -7933, -7899, -8067, -7922, -7541, -7343, -7142, -6487, -5678, -5393, -5524, -5392, -4924, -4607, -4445, -3996, -3257, -2578, -1867, -805, 333, 1059, 1598, 2494, 3507, 3949, 3928, 4183, 4811, 5238, 5369, 5643, 6023, 5996, 5649]
57756E649JM31J80l95n80n34p39r84q78o85F67b83q12o59p70p76m15j05j78k35
57736d233RJ26j69l54k6L65M16N23J009i49B83J030J197J322R86O21O86Q10O06
57717G541M69P80J023O50K3l33o45j269j845j965j947C25a912j910j670j983k385
57700i860k311k088k209k332j945j341j049q69m52j37l26o28m89j79k08l58j73
57683b6954J26J04k2J51L88K88O9J01J48p9k11J39N39M08k7k30l19o42r32p86
57663b7741n07n75p70o30l62l87m94k82J2j5q6K64P51Q06N77N86P74P43N84O62
57643b6090Q64Q93R28J232J465J232Q35P44P26L34j89l68m05p30j039p74j91j1
57625b0544k91n33o52r12j131r32n44m95o99o56m00l55n08n13m28n75q42q85p96
$$ y = [5649, 5650, 6081, 6261, 5866, 5286, 4752, 4013, 3029, 2151, 1466, 667, -283, -1095, -1754, -2524, -3300, -3715, -3820, -3998, -4233, -4224, -4098, -4267, -4621, -4647, -4282, -3866, -3343, -2334, -949, 283, 1313, 2510, 3832, 4818, 5439, 6125, 6935, 7541, 8010, 8790, 9813, 10463, 10486, 10153, 9508, 8239, 6394, 4429, 2482, 325, -1912, -3822, -5492, -7475, -9860, -12171, -14259, -16468, -18800, -20745, -22086, -23135, -24004, -24456, -24593, -24919, -25547, -26036, -26215, -26423, -26781, -26954, -26828, -26724, -26746, -26595, -26207, -25919, -25850, -25749, -25601, -25680, -25891, -25752, -25213, -24805, -24832, -25062, -25381, -26023, -26955, -27741, -28248, -28823, -29593, -30223, -30585, -30972, -31466, -31748, -31736, -31751, -31837, -31573, -30822, -30016, -29439, -28853, -28079, -27336, -26752, -26090, -25226, -24333, -23405, -22173, -20708, -19476, -18641, -17897, -17171, -16837, -17026, -17394, -17799, -18529, -19568, -20342, -20533, -20544, -20835, -21368, -22020, -22932, -24063, -24995, -25539, -26034, -26733, -27389, -27789, -28144, -28652, -29165, -29593, -30168, -31010, -31895, -32691]
57606c2691q23p43k50K98L69J70K48M87M09J54K44N72N57K08O8K15K44Q3M2M5
57586c0094k48p08q43o60n82o63n92m35m96n97k59M24R21J167J565K171K692L270
57568b3967M404O154e245E147J3038J5564J6674J5260J1022M454l072r442j3069
57555E5576j4116j3858j3016C053f625q212p301o379n183m132l480k922k252j693
57541d8179j361j096r10r91j160j020o67n90p94p76m19j71k13k48j83l18o71q40
57523f0607p26o90q54r36q89j075j566j965k045j994j904j638j305j245j382j256
57507h2077p92m39l83l15j11l6j13L6M82P56N91K78R6p1l27n08n59o50q15q74
57487h5831q70j010j176j023o63n88q67j045r37q35q26n95j46J0l44p70q84q38
$$ y = [-32691, -33514, -34257, -34507, -34209, -33840, -33670, -33422, -32935, -32526, -32372, -32128, -31556, -30999, -30791, -30723, -30508, -30264, -30181, -30139, -30094, -30342, -31050, -31893, -32553, -33135, -33798, -34390, -34825, -35321, -35918, -36177, -35753, -34832, -33665, -32100, -29929, -27237, -23967, -19563, -13409, -5245, 5147, 18185, 33749, 50423, 65683, 76705, 81159, 78087, 68645, 55576, 41460, 27602, 14586, 3053, -6625, -14837, -22138, -28517, -33700, -37832, -41312, -44234, -46486, -48179, -49540, -50636, -51546, -52537, -53697, -54717, -55384, -55974, -56768, -57544, -57963, -58134, -58347, -58595, -58778, -59096, -59767, -60607, -61333, -62023, -62877, -63813, -64702, -65777, -67343, -69308, -71353, -73347, -75251, -76889, -78194, -79439, -80821, -82077, -82869, -83308, -83691, -84006, -84117, -84153, -84266, -84230, -83748, -82992, -82401, -82123, -82027, -82098, -82425, -82933, -83492, -84142, -84957, -85831, -86701, -87711, -88887, -89910, -90573, -91161, -92028, -93073, -94010, -94845, -95671, -96266, -96412, -96402, -96746, -97516, -98400, -99238]
57469i9238q23o97l90j93l02n29o87q03q29n94k11n2j58j98p8p3k45l05j90j61
57449a06756k19j1M33N91K67r0j52j62l64n82o23o41p25p06n56n35o60o15l26
57430a12432j65k98m18l48l29m79n10l06j67k64l52l11m25p74r67p61m07j48J26
57411a19735M00L45o4l51k60j43k44k55K7K00q1m98o38o49q35j088j160j159j254
57392a27442j288j131j025j159j296j170r59r14r34q78q98j085j154r12o46o61
57376a43552p91p64o70p06p49o51n68o52p40o76o15o52n89l45k07l45m82m21m20
57357a54595o67q57p44o25q08j032r29o71o22o97o34n38o18p19o12m81o17q50
57339a67316q50p03o90p38o17m46m91o44o47o12q18j178j353j278j125r14n91
$$ y = [-99238, -100061, -100758, -101148, -101341, -101643, -102172, -102859, -103662, -104491, -105085, -105296, -105348, -105506, -105704, -105782, -105855, -106100, -106405, -106595, -106756, -106975, -106986, -106553, -105962, -105695, -105785, -105937, -106099, -106463, -107045, -107668, -108309, -109034, -109740, -110296, -110831, -111491, -112106, -112432, -112597, -112895, -113313, -113661, -113990, -114469, -114979, -115285, -115452, -115716, -116068, -116379, -116804, -117578, -118545, -119306, -119713, -119861, -119735, -119335, -118990, -119054, -119405, -119665, -119808, -120052, -120307, -120280, -120080, -120161, -120659, -121297, -121946, -122781, -123869, -125029, -126188, -127442, -128730, -129861, -130886, -132045, -133341, -134511, -135470, -136384, -137318, -138196, -139094, -140179, -141333, -142245, -142891, -143552, -144343, -145107, -145777, -146483, -147232, -147883, -148451, -149103, -149843, -150519, -151134, -151786, -152375, -152720, -152927, -153272, -153754, -154175, -154595, -155262, -156119, -156863, -157488, -158296, -159328, -160257, -160928, -161550, -162247, -162881, -163419, -164037, -164756, -165368, -165849, -166466, -167316, -168166, -168869, -169559, -170297, -170914, -171360, -171851, -172495, -173142, -173754, -174572, -175750, -177103, -178381, -179506, -180420, -181011]
57322a81011l38l62n49o96q74j186j392j215q44o94p92q45p48o35n53m79n23p57
57304a94493r70r33p28n45l79k23k78n77p64o01m10n65q81r87r66j094j242j120
57286b07756q76q63r92r35p87r02j204j293j131j056j157j216j221j377j610j621
57270b25997j450j446j661j805j792j849k005j990j748j563j573j588j492j394
57256b49353j318j115q10o73q44j151j398j541j587j557j573j710j823j792j770
57241b70015j918k019j789j400j259j336j250r44p81q92j023j044j144j391j556
57226b89761j566j653j886j984j792j605j723k051k332k506k631k669k584k490
57212c19233k532k686k815k799k620k409k406k682k968k962k725k584k672k844
$$ y = [-181011, -181349, -181711, -182260, -182956, -183830, -185016, -186408, -187623, -188467, -189161, -189953, -190798, -191546, -192181, -192734, -193213, -193736, -194493, -195463, -196396, -197124, -197669, -198048, -198271, -198549, -199126, -199890, -200491, -200901, -201466, -202347, -203334, -204300, -205394, -206636, -207756, -208632, -209495, -210487, -211422, -212209, -213111, -214315, -215608, -216739, -217795, -218952, -220168, -221389, -222766, -224376, -225997, -227447, -228893, -230554, -232359, -234151, -236000, -238005, -239995, -241743, -243306, -244879, -246467, -247959, -249353, -250671, -251786, -252596, -253269, -254113, -255264, -256662, -258203, -259790, -261347, -262920, -264630, -266453, -268245, -270015, -271933, -273952, -275741, -277141, -278400, -279736, -280986, -281930, -282711, -283603, -284626, -285670, -286814, -288205, -289761, -291327, -292980, -294866, -296850, -298642, -300247, -301970, -304021, -306353, -308859, -311490, -314159, -316743, -319233, -321765, -324451, -327266, -330065, -332685, -335094, -337500, -340182, -343150, -346112, -348837, -351421, -354093, -356937]
57198c56937k989l122l196l133l046l115l260l216k982k840k904k996k955k836
57184c99527k676k403k019j670j400j118q17n84l75l6M01O78O76N16K79j31p71
57167d10977j501k167k717l109l332l502l772m106m340m480m659m868m973n015
57153d63518n189n491n698n698n643n653n693n770n949o143o127n904n764n888
57139e44128o132o302o398o485o547o575o624o690o717o783p061p505p835p873
57125f39655p768p695p627p470p243p004o721o398o154o096o246o592p096p589
57111g37354p836p789p645p585p609p660p765p933q086q186q299q509q809r154
57097h50219r509r818j0064j0335j0740j1250j1743j2223j2777j3381j3865j4139
$$ y = [-356937, -359926, -363048, -366244, -369377, -372423, -375538, -378798, -382014, -384996, -387836, -390740, -393736, -396691, -399527, -402203, -404606, -406625, -408295, -409695, -410813, -411630, -412214, -412589, -412625, -412224, -411546, -410870, -410354, -410075, -410206, -410977, -412478, -414645, -417362, -420471, -423803, -427305, -431077, -435183, -439523, -444003, -448662, -453530, -458503, -463518, -468707, -474198, -479896, -485594, -491237, -496890, -502583, -508353, -514302, -520445, -526572, -532476, -538240, -544128, -550260, -556562, -562960, -569445, -575992, -582567, -589191, -595881, -602598, -609381, -616442, -623947, -631782, -639655, -647423, -655118, -662745, -670215, -677458, -684462, -691183, -697581, -703735, -709831, -716077, -722669, -729765, -737354, -745190, -752979, -760624, -768209, -775818, -783478, -791243, -799176, -807262, -815448, -823747, -832256, -841065, -850219, -859728, -869546, -879610, -889945, -900685, -911935, -923678, -935901, -948678, -962059, -975924, -990063]
57085i90063j4310j4533j4828j5156j5490j5825j6191j6644j7191j7736j8216
57074a166183j8748j9515k0527k1672k2872k4022k4748k4576k3454k1944k0758
57063a409019k0247k0441k1336k2929k5028k7269k9368l1312l3204l5112l7040
57052a712305l9017m1066m3104m5052m6958m8993n1184n3386n5521n7758o0300
57041b254644o3125o6070o9075p2209p5553p9193q3233q7635r2228r7014j02272
57030c142251j08204j14652j21406j28557j36247j44358j52814j61981j72340
57021d382810j83902j96428k10011k24993k41486k59490k79358l01585l26318
57012f606381l53630l84117m18606m57554n01423n51493o09566o77213p56277
$$ y = [-990063, -1004373, -1018906, -1033734, -1048890, -1064380, -1080205, -1096396, -1113040, -1130231, -1147967, -1166183, -1184931, -1204446, -1224973, -1246645, -1269517, -1293539, -1318287, -1342863, -1366317, -1388261, -1409019, -1429266, -1449707, -1471043, -1493972, -1519000, -1546269, -1575637, -1606949, -1640153, -1675265, -1712305, -1751322, -1792388, -1835492, -1880544, -1927502, -1976495, -2027679, -2081065, -2136586, -2194344, -2254644, -2317769, -2383839, -2452914, -2525123, -2600676, -2679869, -2763102, -2850737, -2942965, -3039979, -3142251, -3250455, -3365107, -3486513, -3615070, -3751317, -3895675, -4048489, -4210470, -4382810, -4566712, -4763140, -4973151, -5198144, -5439630, -5699120, -5978478, -6280063, -6606381, -6960011, -7344128, -7762734, -8220288, -8721711, -9273204, -9882770, -10559983, -11316260]
57003a1316260q50041r63085j100504j268689j477151j738879k069693k488878
56995b3273180l019662l684962m498775n460080o554315p760327r057040j0425702
56987g3734043j1845796j3286244j4697513j6008705j7127058j7938583j8318171
56980a82956113j8154810j7375804j5945061j3839953j1045117p587473l585776
56973b70490107P33156N066557R093456J2534603J5204686J7042050J8096099
56966a92719500J8476719J8301832J7674818J6688894J5435909J4007998J2494749
56959g9638581J0978046R524479Q179692O969650N905863M988661M208969L552282
56951b5330939L003348K547441K169561J855513J594095J376765J195682J043630
$$ y = [-11316260, -12166301, -13129386, -14229890, -15498579, -16975730, -18714609, -20784302, -23273180, -26292842, -29977804, -34476579, -39936659, -46490974, -54251301, -63308341, -73734043, -85579839, -98866083, -113563596, -129572301, -146699359, -164637942, -182956113, -201110923, -218486727, -234431788, -248271741, -259316858, -266904331, -270490107, -269756951, -264690394, -255596938, -243062335, -227857649, -210815599, -192719500, -174242781, -155940949, -138266131, -121577237, -106141328, -92133330, -79638581, -68660535, -59136056, -50956364, -43986714, -38080851, -33092190, -28883221, -25330939, -22327591, -19780150, -17610589, -15755076, -14160981, -12784216, -11588534, -10544904]
56943a0544904R15372Q07279P15764O37301N69557N11058M60042M14831L74868
56934e138832L40080L09500K81732K56326K33554K13115J94159J76302J59753
56925b974311J45074J33714J27682J27115J28715J28175J23880J17081J09192
56916a833683J00689R2231Q4839P8636P2876O7407O2857N9275N5926N2563M9679
56905a056705M7311M4824M2062L9617L7738L5941L3982L2193L0677K9045K7222
56894f56093K5605K4282K2933K1560K0519J9725J8681J7388J6408J5908J5506
56883d37578J5045J4753J4563J4119J3505J3097J2733J1884J0710R968R770R444
56871b87987Q723Q137P994P917P636P427P448P431P327P433P690P632P247P121
$$ y = [-10544904, -9629532, -8822253, -8106489, -7469188, -6899631, -6388573, -5928531, -5513700, -5138832, -4798752, -4489252, -4207520, -3951194, -3717640, -3504525, -3310366, -3134064, -2974311, -2829237, -2695523, -2567841, -2440726, -2312011, -2183836, -2059956, -1942875, -1833683, -1732994, -1640763, -1555924, -1477288, -1404412, -1337005, -1274148, -1214873, -1158947, -1106384, -1056705, -1009394, -964570, -922508, -882891, -845153, -809212, -775230, -743037, -712360, -683315, -656093, -630488, -606206, -583273, -561713, -541194, -521469, -502788, -485400, -468992, -453084, -437578, -422533, -407780, -393217, -379098, -365593, -352496, -339763, -327879, -317169, -307201, -297431, -287987, -279264, -271127, -263133, -255216, -247580, -240153, -232705, -225274, -217947, -210514, -202824, -195192, -187945, -180824]
56857a80824P468P825P962Q231Q743Q939Q380P294O034M654L338K522K321K343
56843i4770K384K648L153L501L545L623L909M147M225M418M827N194N472N960
56829c7764O712P379P787g913c23E723L526J050o45j694k316k334A512B47g54
56813a408j0M74d68a09D08P43P37O78P89Q93Q16P43P97P65N83O18J054J539J753
56794A2916J850K006K051J928J923K137K210J968J772J921K242K595L201M009
56780D4729M377L827K672J484M58l27n61j91K37K32lk3J99M50P37J111J427J644
56762F2479K015K650L297L849M639N844P024P556P149N689L161R0k467l848m292
56747A04835m282l910l215k533k022j376m56L49P84J227K021K899L588M435N856
$$ y = [-180824, -173356, -165531, -157569, -149338, -140595, -131656, -123276, -115982, -109948, -105294, -101956, -99434, -97113, -94770, -92386, -89738, -86585, -83084, -79539, -75916, -72007, -67860, -63635, -59217, -54390, -49196, -43724, -37764, -31052, -23673, -15886, -7913, -323, 5723, 9249, 10299, 9654, 7960, 5644, 3310, 1512, 247, -754, -1408, -1418, -944, -468, -109, 408, 1151, 1888, 2566, 3355, 4248, 5064, 5807, 6604, 7369, 7952, 8570, 9624, 11163, 12916, 14766, 16772, 18823, 20751, 22674, 24811, 27021, 28989, 30761, 32682, 34924, 37519, 40720, 44729, 49106, 52933, 55605, 57089, 57547, 57220, 56659, 56468, 56705, 56937, 56934, 56911, 57110, 57560, 58297, 59408, 60835, 62479, 64494, 67144, 70441, 74290, 78929, 84773, 91797, 99353, 106502, 112191, 115352, 115442, 112975, 109127, 104835, 100553, 96643, 93428, 90895, 88873, 87497, 87041, 87390, 88174, 89401, 91422, 94321, 97909, 102344, 108200]
56732A08200P638R419J1224J2832J3087J0770O027L57m648q104r749r838r054
56719A38161q017o826n404l937k684j602n96J90O90J200J981K866L667M641O116
56704A30446P891R323R702Q378N062M66l842o679q083q620q493p727o678n683
56690A15463m616l346k221j587j200o89j64J73N84J366K288L045L830M802N357
56675A23085M709K893O21j593l517m792n170m939m537m000l258k644k450k338
56661I2070j867j275j065j106r20n46l97m82m87m34n49o50l82N2J62l3r0N4Q9
56642H2144mM5K00J82K9k0m7k64m64k81J06K05K7J2K55M51M83M97M48K24P6K91
56620H4595O17N98L62L75O19O63M67L43K86K8k86k35J03K09k9k25k07j75j82p8
$$ y = [108200, 115838, 125257, 136481, 149313, 162400, 173170, 179197, 179554, 174906, 166802, 157053, 147215, 138161, 130144, 123318, 117914, 113977, 111293, 109691, 109095, 109285, 109975, 111175, 113156, 116022, 119689, 124330, 130446, 138337, 147660, 157362, 165740, 170802, 171268, 167426, 160747, 152664, 144044, 135551, 127824, 121146, 115463, 110847, 107501, 105280, 103693, 102493, 101804, 101640, 101813, 102397, 103763, 106051, 109096, 112926, 117728, 123085, 127794, 130687, 131308, 129715, 126198, 121406, 116236, 111297, 106760, 102760, 99502, 96858, 94408, 92070, 90203, 88928, 87863, 86757, 85837, 85291, 84894, 84412, 83925, 83491, 82942, 82292, 81910, 81962, 82124, 82091, 82001, 82055, 82144, 82140, 82185, 82385, 82567, 82596, 82576, 82529, 82265, 81801, 81520, 81626, 81831, 81858, 81870, 82125, 82576, 83059, 83556, 84004, 84228, 84304, 84595, 85212, 85810, 86172, 86547, 87166, 87829, 88296, 88639, 88925, 88953, 88667, 88432, 88535, 88744, 88715, 88490, 88283, 88108, 87926, 87848]
56600H7848M4n3k21j35Q0O1p5R4M65N31K38K6K8m3j89r1J99K63L2j52j89k27j39
56577H8395L29Q42P87K76L6K56L70J14r8j5O7m6r2O1J95K58M53O75N26O5j78m6
56555I3230O8L2J67N06N99L27J28K04K16Lj22l3n9l00l74j30K4j30k79k12k01
56534I3664l84m48k37r1k45m45m82n39p12p37m99k83k45j78j0Kj88k42m4R3K7
56513H7777kN4q6l89l81O8M30L60J72J87K30J27Q7K28L12K24K13L34K74l4j91
56492H9994QK22K30K53L83L05q2l48k20ON7J09K83L41J87J13K24K01m4j23J10
56471I2209K50O4j01j4L2j45k22k0J29M4O5L35M34J68L7L97Q29Q72P56Q38R51
56450I7908Q55P70R08R83P51M99N00N00K43jK8N6k17n66o88p41r03r79q35p46
$$ y = [87848, 87892, 87839, 87618, 87483, 87563, 87624, 87549, 87643, 88108, 88639, 88877, 88903, 88931, 88888, 88699, 88608, 88807, 89070, 89102, 88950, 88761, 88534, 88395, 88724, 89566, 90353, 90629, 90665, 90921, 91291, 91405, 91307, 91292, 91359, 91313, 91221, 91282, 91477, 91735, 92188, 92863, 93389, 93454, 93276, 93230, 93298, 93330, 93497, 94003, 94602, 94929, 95057, 95261, 95477, 95480, 95358, 95325, 95266, 94966, 94592, 94462, 94486, 94356, 94077, 93865, 93664, 93280, 92832, 92595, 92504, 92259, 91814, 91332, 90793, 90081, 89344, 88845, 88562, 88317, 88139, 88129, 88131, 87943, 87701, 87657, 87750, 87777, 87775, 87829, 87743, 87354, 86973, 87041, 87471, 87831, 88003, 88190, 88420, 88547, 88634, 88862, 89174, 89398, 89611, 89945, 90219, 90185, 89994, 90002, 90224, 90454, 90707, 91090, 91395, 91313, 90965, 90745, 90751, 90808, 90917, 91200, 91541, 91728, 91841, 92065, 92266, 92222, 92099, 92209, 92459, 92523, 92422, 92408, 92440, 92295, 92073, 92053, 92182, 92226, 92291, 92626, 93060, 93228, 93265, 93662, 94491, 95363, 96119, 96957, 97908, 98763, 99533, 100441, 101424, 102175, 102674, 103174, 103674, 103917, 103916, 103944, 104000, 103783, 103217, 102529, 101788, 100885, 99906, 99071, 98325]
56430I8325q64q81o76o67j048j299r96m88k33o1K79N23L93J86K21K60N3j13j6
56411I2898m6m74q32o64l49m43p47p55n43m62m11j63J5j86m49l27j3N7l8OQ4K2
56389H6180Q0M66P41M83Q2J51N06N18J33j78k31j79j3L38O33O23M47L00L4m01
56369I0713o12l69p0q2j33O4J67j19l72j48J90J42l5J09K88M3l08j96J55J54o7
56348H9514N8M71O13L86J39j9j59p2L52O20K91k17k47M7Q3r5n6R4o4l95m47k90
56326I0607k88l31r0J98J13j41q6J23L1k20j82J1o1k63j97j2p9j79P6L92K66l5
56304H9653N4L29K23p5J9L41K75o9q1J87J62j15j37J8j22l54p6N23O59K74P3K47
56282I2008L25J85K05L74K70o1j67n6r4j71O8L51J62j88j1M82M95P4k0K78K89
$$ y = [98325, 97461, 96580, 95904, 95237, 94189, 92890, 91894, 91406, 91173, 91112, 91391, 91914, 92307, 92493, 92714, 92974, 93027, 92914, 92898, 92852, 92378, 91546, 90882, 90533, 90090, 89343, 88588, 88045, 87583, 87172, 87009, 87024, 86838, 86389, 86062, 86049, 86106, 86068, 86074, 86158, 86180, 86260, 86726, 87467, 87950, 88032, 88183, 88689, 89207, 89340, 89162, 88931, 88752, 88739, 89077, 89710, 90333, 90780, 91080, 91114, 90713, 90101, 89732, 89662, 89580, 89447, 89511, 89678, 89559, 89187, 89039, 89229, 89371, 89336, 89445, 89733, 89776, 89468, 89272, 89427, 89581, 89514, 89572, 90043, 90656, 91042, 91181, 91162, 91003, 90931, 91283, 91903, 92194, 91977, 91730, 91777, 91860, 91765, 91709, 91803, 91739, 91344, 90897, 90607, 90319, 89988, 89898, 90096, 90209, 90068, 89982, 90105, 90136, 89916, 89734, 89745, 89684, 89421, 89224, 89212, 89133, 88954, 89030, 89422, 89688, 89653, 89707, 90036, 90259, 90184, 90203, 90544, 90819, 90750, 90669, 90856, 91018, 90903, 90766, 90784, 90662, 90308, 90232, 90755, 91414, 91688, 91761, 92008, 92333, 92518, 92723, 93097, 93367, 93306, 93139, 93083, 92989, 92818, 92886, 93237, 93399, 93211, 93200, 93682, 94177, 94251, 94231, 94509, 94798]
56261I4798l9o3K51K65o7n6L96N73K69Q4K36K39n3j69j7l9k09J2N55O73K24q6
56239I7777Q1K80K71L68N84N04J80J50M03L81J03J91O61Q13M88K82L70K82lN8
56219A04224M14L79n9j13L87P09N80N82Q88R11N45M73Q60R89O20M71Q69J168R97
56200A15894Q96J201J450J361J362J583J504J037Q89J338J714J592J433J556J589
56185A36399J366J351J647J687J321J188J540J777J616J577J914K159K186K570
56171A60298L426M011L993L990M360M659M733N187O226P193P767Q528R777J1005
56157B45153J2027J3479J5603J7765J9647K1766K4273K6526K8402L0730L3806
56146D89177L6653L8461L9542M0243M0157L9047L7337L5032L1352K6069K0022
$$ y = [94798, 94759, 94696, 94947, 95212, 95145, 95089, 95485, 96058, 96327, 96411, 96647, 96886, 96833, 96664, 96647, 96608, 96399, 96411, 96966, 97639, 97863, 97777, 97858, 98138, 98409, 98777, 99361, 99865, 100045, 100195, 100598, 100979, 101082, 101273, 101934, 102747, 103235, 103517, 103887, 104169, 104166, 104224, 104638, 105017, 104958, 104845, 105232, 105941, 106521, 107103, 107991, 108902, 109447, 109920, 110780, 111769, 112389, 112860, 113729, 114897, 115894, 116790, 117991, 119441, 120802, 122164, 123747, 125251, 126288, 127177, 128515, 130229, 131821, 133254, 134810, 136399, 137765, 139116, 140763, 142450, 143771, 144959, 146499, 148276, 149892, 151469, 153383, 155542, 157728, 160298, 163724, 167735, 171728, 175718, 180078, 184737, 189470, 194657, 200883, 208076, 215843, 224371, 234148, 245153, 257180, 270659, 286262, 304027, 323674, 345440, 369713, 396239, 424641, 455371, 489177, 525830, 564291, 603833, 644076, 684233, 723280, 760617, 795649, 827001, 853070, 873092]
56135H73092J3727O802o67p597j3444j8863k4134k8349l0980l2814l4490l5452
56123F66831l5293l4710l4200l3161l1237k9248k7779k6195k3991k1863k0389
56112C48765j8967j7093j5421j4478j3603j2196j0845j0092r355q115p019o620
56100B04961o296n456m692m597m575l966l232k951k716k099j614j687j762j389
56086A57929j096j269j336r88q87j322j458q57l70m99m40K78P58M15J33N44P55
56069A50290J25l72R4O64M48J94P63J454J419J272J755K196J885J566J987K371
56053A68111J952J567K109K817K779K708L479M379M521M652N746P153P959Q813
56039B28745J0602J2632J3978J5199J6870J7812J6778J4576J2634J0821Q625P001
$$ y = [873092, 886819, 893621, 892954, 885357, 871913, 853050, 828916, 800567, 769587, 736773, 702283, 666831, 631538, 596828, 562628, 529467, 498230, 468982, 441203, 415008, 391017, 369154, 348765, 329798, 312705, 297284, 282806, 269203, 257007, 246162, 236070, 226715, 218600, 211581, 204961, 198665, 193209, 188517, 183920, 179345, 175379, 172147, 169196, 166480, 164381, 162767, 161080, 159318, 157929, 156833, 155564, 154228, 153240, 152353, 151031, 149573, 148716, 148346, 147847, 147407, 147685, 148443, 148858, 148991, 149535, 150290, 150415, 150043, 150137, 150801, 151249, 151443, 152206, 153660, 155079, 156351, 158106, 160302, 162187, 163753, 165740, 168111, 170063, 171630, 173739, 176556, 179335, 182043, 185522, 189901, 194422, 199074, 204820, 211973, 219932, 228745, 239347, 251979, 265957, 281156, 298026, 315838, 332616, 347192, 359826, 370647, 379272, 386273]
56027C86273O949P533P303O454N605L944Q04k377l838m040m321m497m073m310
56013C97409o615j0005j2585j4303j5975j6912j6060j4313j3177j2261j0469q492
56001B46242p571p043n624l958l371l242k234r62p85j112n37M42N12J83O87J391
55985B13018J023L23P19J561J451J070J823K924K798K145K592L520L293K445K535
55970B43240K985K286J125J107J554Q39k61N2J119J097N48J201K380K254J482
55955B63008J918K895K526J567K051L304L206K351K854M110L933K881L181M389
55941C04174M372L601M176N457N188L986M209N350N121M143M800O403O394N402
55927C72776O069P808P850O624O879Q233Q042O830P367R110R192Q115Q798J0706
$$ y = [386273, 393222, 400755, 408058, 414512, 420117, 424061, 424865, 422488, 418650, 414610, 410289, 405792, 401719, 397409, 390794, 380789, 368204, 353901, 337926, 321014, 304954, 290641, 277464, 265203, 254734, 246242, 238671, 231628, 226004, 222046, 218675, 215433, 213199, 212237, 211452, 210340, 209803, 210245, 210757, 210940, 211627, 213018, 214041, 214364, 215083, 216644, 218095, 219165, 220988, 223912, 226710, 228855, 231447, 234967, 238260, 240705, 243240, 246225, 248511, 249636, 250743, 252297, 253136, 252875, 252927, 254046, 255143, 255691, 256892, 259272, 261526, 263008, 264926, 267821, 270347, 271914, 273965, 277269, 280475, 282826, 285680, 289790, 293723, 296604, 299785, 304174, 308546, 312147, 316323, 321780, 326968, 330954, 335163, 340513, 345634, 349777, 354577, 360980, 367374, 372776, 378845, 386653, 394503, 401127, 408006, 416239, 424281, 431111, 438478, 447588, 456780, 464895, 473693, 484399]
55913D84399J0880R916J0849J2958J2976J1628J2403J4662J4799J3425J4320J6938
55901F40153J7366J6097J7213K0341K1320K0420K1763K4924K5588K4239K5521
55890H74945K9149L0452K9797L2058L6808L8875L8640M1534M7256N0138N0461
55879A300113N4187O1188O5443O7323P3339Q3165Q9986R4304J03626J17769J29124
55868B239567J38366J54158J76310J96193K15093K43915K83269L23836L68322
55859D339029M31456N16052O12397P22865Q60085J019100J183493J363505J593487
55850A2641469J889413K253066K723350L370540M235265N340150O739882Q373521
55842D7566656R736296R856131P914548M040191n96317m562625p044054q051432
$$ y = [484399, 495279, 505195, 516044, 529002, 541978, 553606, 566009, 580671, 595470, 608895, 623215, 640153, 657519, 673616, 690829, 711170, 732490, 752910, 774673, 799597, 825185, 849424, 874945, 904094, 934546, 964343, 996401, 1033209, 1072084, 1110724, 1152258, 1199514, 1249652, 1300113, 1354300, 1415488, 1480931, 1548254, 1621593, 1704758, 1794744, 1889048, 1992674, 2110443, 2239567, 2377933, 2532091, 2708401, 2904594, 3119687, 3363602, 3646871, 3970707, 4339029, 4770485, 5286537, 5898934, 6621799, 7481884, 8500984, 9684477, 11047982, 12641469, 14530882, 16783948, 19507298, 22877838, 27113103, 32453253, 39193135, 47566656, 57302952, 67159083, 75073631, 79113822, 78517505, 73954880, 66910826, 58859394]
55834E8859394q024895p417809o560525n667031m836385m081001l399047k808766
55826A6063935k318827j911442j570570j296973j085371r14455p69785o53830
55818E542682n65662m91852m24711l70071l30054k95449k61096k32598k11964
55809B359225j91752j68732j49347j36492j23995j08902r6748q9998q3085p3310
55799A136864o5622o2278n8313n1387m6096m4535m2153l6853l2995l2599l1385
55788F32648k7264k4231k4206k3208j9213j6068j5951j5561j3212j2389j4713
55777D26632j6389j5171j4177j5401j5890j3819j2102j2598j2592j0387q676r157
55765B70273r298p540o414p416p996o593n642o629p105n507m178m729n067l792
$$ y = [58859394, 50834499, 43416690, 36856165, 31189134, 26352749, 22271748, 18872701, 16063935, 13745108, 11833666, 10263096, 8966123, 7880752, 6966297, 6196512, 5542682, 4977020, 4485168, 4060457, 3690386, 3360332, 3064883, 2803787, 2571189, 2359225, 2167473, 1998741, 1849394, 1712902, 1588907, 1480005, 1383257, 1293259, 1210174, 1136864, 1071242, 1008964, 950651, 899264, 853168, 808633, 766480, 729627, 696632, 664033, 632648, 605384, 581153, 556947, 533739, 514526, 498458, 482507, 466946, 453734, 441345, 426632, 410243, 395072, 380895, 365494, 349604, 335785, 323683, 311085, 298493, 288106, 279430, 270273, 260975, 253435, 247021, 239605, 231609, 225016, 219374, 212745, 205640, 200133, 195955, 191226, 186159, 182367]
55751A82367k996l901m251k776j861l027m030l209k532l563m452l722l083l810
55737A35154m093k758j804k605l239k224j295j861k234j083j40q01j344k95P36
55722A10114K41l05N35J307N55l44J09P39K23k64N08J313Q59K68P09J075K73n38
55704A17377l34l63j682k931k811k424k924l209k232j266j619k236j850j313j597
55689H8586j664n07P06P38M32P18N82q15k069j825j137j385j807j302p16j104
55673G7431j539q99j02l56r23p24n08j239k013j680j033j238j648j221o12p77
55657F0919j013m03K64l2n30j99K41k67j070j128j023j632k227j811j084j126
55641D7879j374q60j85l44p84n29m6k05m74n1M50J91j82K29P86N38M0J64L31k70
$$ y = [182367, 179371, 175470, 171219, 168443, 166582, 163555, 159525, 156316, 153784, 150221, 145769, 142047, 138964, 135154, 131061, 128303, 126499, 123894, 120655, 118431, 117136, 115275, 113041, 111958, 111818, 111017, 109673, 109378, 110114, 110355, 110050, 110585, 111892, 112447, 112103, 112212, 112951, 113174, 112910, 113418, 114731, 115590, 115858, 116567, 117642, 117915, 117377, 117043, 116680, 114998, 112067, 109256, 106832, 103908, 100699, 98467, 97201, 95582, 93346, 91496, 90183, 88586, 86922, 86415, 87121, 87859, 88291, 89009, 89591, 88776, 86707, 84882, 83745, 82360, 80553, 79251, 78535, 77431, 75892, 74993, 74891, 74535, 73612, 72888, 72380, 71141, 69128, 67448, 66415, 65177, 63529, 62308, 61696, 60919, 59906, 59503, 59767, 59735, 59205, 59006, 59247, 58980, 57910, 56782, 55759, 54127, 51900, 50089, 49005, 47879, 46505, 45645, 45460, 45116, 44332, 43803, 43757, 43552, 43078, 43027, 43477, 43668, 43486, 43715, 44501, 45039, 45079, 45243, 45574, 45304]
55621D5304q94n40J49O1l65j68K06j35o76n02j09l94q31m73J93J98m4L64R77Q84
55601D3205M96O77R85N81l7N7M03Q9m28j81M20L75m0L6L04L1k90J88R21Q70M33
55580D9095O22J116R18L09K91O77N99K81N42J025P59qk33O7J19J2M09J038J106
55561E8744Q02Q02Q39K60n03o31n29j098j983k160j783j742j922j565r36q97j240
55544D4458j090o26o71r97p29q5l5m89n00m6O6j82j13K09J30j88o7K47j3n80n53
55523C8146p7m8l89k55K71L07j65l60k58n35j072j050n07k75m52l83n4o3l20k08
55503C2253Q5j29n71l65L11M29p3k68N5K10P1J77M43J86m22n15p7P4j31QM41L75
55481C2567j44j83L74O18K80R7L31L63N5O2N56Q98Q96J050J367J223O18K94M08
$$ y = [45304, 44410, 43870, 44019, 44080, 43715, 43547, 43753, 43618, 42942, 42440, 42331, 41937, 41106, 40633, 40826, 41024, 40980, 41344, 42321, 43205, 43701, 44378, 45363, 45944, 45907, 45964, 46367, 46456, 46028, 45847, 46267, 46642, 46602, 46638, 46942, 46973, 46683, 46871, 47792, 48662, 49095, 49717, 50833, 51751, 52060, 52351, 53028, 53627, 53908, 54450, 55475, 56234, 56226, 55993, 56060, 56179, 56191, 56600, 57638, 58744, 59546, 60348, 61187, 61447, 60944, 60313, 59784, 58686, 56703, 54543, 52760, 51018, 49096, 47531, 46595, 45698, 44458, 43368, 42742, 42071, 41074, 40345, 40260, 40225, 39736, 39236, 39190, 39256, 39074, 38961, 39170, 39300, 39112, 39045, 39292, 39279, 38699, 38146, 38069, 38021, 37632, 37377, 37648, 37955, 37790, 37430, 37172, 36637, 35565, 34515, 34008, 33733, 33281, 32898, 32844, 32781, 32461, 32253, 32338, 32209, 31638, 31273, 31584, 32013, 31940, 31672, 31727, 31937, 32008, 32185, 32628, 32814, 32392, 31877, 31800, 31874, 31743, 31751, 32192, 32567, 32423, 32240, 32614, 33232, 33512, 33609, 33940, 34303, 34358, 34420, 34976, 35874, 36770, 37820, 39187, 40410, 41028, 41322, 41730]
55462D1730L24j14l49k80m43q18p90l87l31o66o67k47j17l65k63K75M58J03k6
55443C7027L42M99J26j69o9n9l30l75p0rl78n80l68k72n39p25o63p50r87q43l29
55422C0479j13l18l13K6P3k99l89N9M06L17K32L22J22l98n68k20qj93k00J96L93
55401B9606J26m9J35J50k58n42l80j88k21j49Q1j9m64n82j94M1j64k68k2L8k58
55380B6419k94J73M96L30K14M68N63J86j29j2R7j13k34m6j9l48m78j56N6j52k76
55359B6745m7L0k61k80K60O13K54k12j14K07K10J05K02J85j84m13j12K59K12N0
55339B7709J72L10J48k4O8Q1k16l81r3J84L3j90q7M4j16k34KK39J39M6K71M35
55317B8540K04j1J85M53L53J42J84K30Jj75NJ64p9l66k22J18J98Q1K5q3l22l53
$$ y = [41730, 42054, 41940, 41591, 41311, 40868, 40050, 39260, 38873, 38542, 37876, 37209, 36962, 36845, 36480, 36217, 36492, 36950, 37053, 37027, 37369, 37868, 37994, 37825, 37756, 37697, 37367, 36992, 36922, 36913, 36535, 35955, 35587, 35315, 34776, 34051, 33388, 32638, 31651, 30808, 30479, 30366, 30048, 29735, 29761, 29834, 29535, 29146, 29205, 29611, 29928, 30160, 30482, 30604, 30206, 29638, 29418, 29410, 29217, 29017, 29213, 29606, 29732, 29683, 29818, 29968, 29710, 29168, 28788, 28600, 28379, 28230, 28311, 28292, 27828, 27246, 27052, 27093, 26929, 26661, 26639, 26677, 26419, 26125, 26298, 26794, 27124, 27338, 27806, 28369, 28555, 28426, 28414, 28511, 28398, 28164, 28118, 28099, 27751, 27273, 27117, 27173, 27021, 26745, 26698, 26728, 26467, 26187, 26447, 27060, 27314, 27102, 26988, 27195, 27405, 27510, 27712, 27897, 27713, 27300, 27188, 27447, 27659, 27709, 27881, 28191, 28339, 28315, 28383, 28464, 28248, 27867, 27774, 27958, 27991, 27801, 27714, 27758, 27642, 27408, 27410, 27649, 27788, 27834, 28105, 28540, 28744, 28733, 28918, 29371, 29724, 29866, 30050, 30280, 30281, 30106, 30111, 30275, 30196, 29830, 29608, 29726, 29924, 30005, 30030, 29947, 29625, 29272]
55295B9272k4K36J26J3J90K99N5j66n7j5l62o35l87j8m3j78L4L17J69j89k30k6
55273B8381J0j02q7rl6%K25L33J20n4J35L91L50K07K27K11m5k81l11m16p04o87
55251B7858j56K82J60m5J91M75K16k73l36o5Kj42j29J2K8J1J15J11j69l50j36
55230B7660Q9o6k53l7K72J68j20q6J40J32KJ13L08K47J04K13M05L35J46J13L6
55209B9921k98n31k95O2N0j32n3J12pk20j83j04k71l37N1M50K93q3j4L29L36R0
55187B9166J25L68L33Q8P2J78j0l12k42Nj43n35m86K5L46K55J50J62jk89k90J6
55165B8981J80P5j1oj18k59j30J51J80m1j58j21j24o3K74O12N20J64O5K17J74
55144C0562j09l09m02n86o64k93K47L59P7m7O8J5k09j71J43K43K8p8O8J30%k6
$$ y = [29272, 29248, 29484, 29610, 29623, 29813, 30112, 30167, 30001, 29944, 29929, 29567, 28932, 28545, 28527, 28484, 28306, 28340, 28657, 28826, 28637, 28407, 28381, 28391, 28289, 28202, 28193, 28157, 28157, 28382, 28715, 28835, 28781, 28916, 29307, 29657, 29864, 30091, 30302, 30257, 29976, 29665, 29249, 28545, 27858, 27702, 27984, 28144, 28099, 28290, 28765, 28981, 28708, 28372, 28307, 28309, 28167, 28038, 28050, 28078, 28089, 28204, 28315, 28146, 27796, 27660, 27749, 27683, 27430, 27393, 27665, 27833, 27713, 27627, 27767, 27899, 27901, 28014, 28322, 28569, 28673, 28886, 29291, 29626, 29772, 29885, 29921, 29623, 29092, 28797, 28859, 28909, 28777, 28724, 28836, 28829, 28609, 28426, 28322, 28051, 27714, 27765, 28215, 28508, 28425, 28411, 28740, 29076, 29166, 29291, 29659, 29992, 30080, 30152, 30330, 30320, 30008, 29766, 29771, 29628, 29093, 28607, 28632, 28978, 29233, 29383, 29545, 29544, 29255, 28965, 28981, 29161, 29236, 29225, 29219, 29101, 28842, 28712, 28863, 29043, 29002, 28844, 28723, 28599, 28536, 28810, 29422, 29942, 30106, 30171, 30388, 30562, 30453, 30144, 29742, 29156, 28492, 28199, 28446, 28805, 28882, 28835, 28903, 28918, 28709, 28538, 28681, 28924, 28952, 28874, 28942, 29072, 29072, 29046]
55122B9046J32K01J25J48K50J34j62k39j1J88J88J01n0l26m99k88R7K23J36K06
55102B9600L81K88l9j90q2PJ9J14J74j8k32j30M8j38m68l74K3P8k47l56r7L6j36
55079B8261k16o1lj20o4J90K19n0k11j19q0j25P8M81N66K16p7m8M1P8L01O51O79
55056C0587L31Q6R9k4l82m85j41J82J77J68L75M22L2m10m35j71QK0m7j83k65p8
55034B9866K56L18ql21l41k23j19M9K37K29P3P3K30K11Mk7J59J65j11k72j33k7
55012C0288j32j59K0J08l1q0J41L37L07K41K49J22j37j52J84M32L20J36J65K46
54992C2605J94J61K42K67K12K98M77L46j43m89m31l19l89l70q0J56J19J05L09
54973C3270L87J18j09O5L18K09j22k68k39k54k83k01j57k87l95k82q9J0J27L37
$$ y = [29046, 29178, 29379, 29504, 29652, 29902, 30036, 29874, 29635, 29624, 29812, 30000, 30101, 30051, 29725, 29226, 28938, 29035, 29258, 29394, 29600, 29981, 30269, 30230, 30040, 29958, 29965, 29984, 30098, 30272, 30254, 30022, 29892, 29940, 29802, 29334, 28960, 28983, 29061, 28814, 28458, 28361, 28397, 28261, 28045, 27984, 27981, 27861, 27797, 27987, 28206, 28156, 27945, 27826, 27746, 27621, 27699, 28180, 28746, 28962, 28885, 28837, 28878, 28956, 29257, 29908, 30587, 30918, 31004, 31103, 31079, 30697, 30212, 30071, 30253, 30430, 30598, 30973, 31395, 31427, 31017, 30582, 30411, 30419, 30439, 30392, 30209, 29944, 29866, 30122, 30440, 30432, 30111, 29770, 29547, 29428, 29477, 29714, 29943, 30016, 30089, 30319, 30530, 30534, 30507, 30666, 30831, 30720, 30448, 30315, 30288, 30156, 29997, 30017, 30125, 30094, 30014, 30155, 30492, 30799, 31040, 31289, 31411, 31274, 31122, 31306, 31738, 32058, 32194, 32359, 32605, 32799, 32960, 33202, 33469, 33681, 33979, 34456, 34802, 34659, 34170, 33739, 33420, 33031, 32661, 32581, 32737, 32856, 32961, 33270, 33657, 33775, 33666, 33731, 34049, 34258, 34136, 33868, 33629, 33375, 33092, 32891, 32734, 32447, 32052, 31770, 31681, 31691, 31818, 32155]
54953C2155L81R1k47l20k47k56k31J3L28M35L56K65J76L2r3j44k10l15l20j92
54933C1657q2k1J20K91K59O8M8K30K60K9j01L9J27m8k08j37n9j46j58O5K22O6
54911C2521j34p8R6J71K47L96L39r5n38o12m57l72k73J8L05K92Q5j6K9P9J46K53
54889C2402K59R5n1n1m7j45j80p3k7j36j50O8K39J38l1k9L5Kj9N2K5j38j20K35
54865C2353N51N03L14L21L96K71N5M4K09L26L46L02J38p3j01L8pl13m45j48J98
54844C5278K05R5K38M97N47M95O39R22J116J243J428J569J587J671J872J838J360
54827E2600Q13N91M72N5n44r67j237j578j845j786j559j491j496j274q96o62n68
54810C8628l96k06k00k88k22n1j6r6p3N7J25Q4pj06o7L35R86J341J154Q99J104
$$ y = [32155, 32536, 32627, 32380, 32060, 31813, 31557, 31326, 31339, 31667, 32102, 32458, 32723, 32899, 32931, 32838, 32694, 32484, 32169, 31849, 31657, 31575, 31554, 31674, 31965, 32224, 32292, 32340, 32570, 32830, 32859, 32758, 32797, 32924, 32876, 32668, 32531, 32472, 32326, 32168, 32233, 32455, 32521, 32387, 32309, 32405, 32576, 32823, 33219, 33558, 33463, 32925, 32313, 31856, 31484, 31211, 31229, 31534, 31826, 31911, 31895, 31924, 32003, 32149, 32402, 32661, 32756, 32705, 32654, 32607, 32462, 32282, 32209, 32182, 32046, 31896, 31964, 32203, 32341, 32310, 32281, 32316, 32318, 32299, 32351, 32376, 32238, 32118, 32353, 32904, 33407, 33721, 34042, 34438, 34709, 34764, 34808, 35017, 35343, 35689, 35991, 36129, 36056, 35955, 35993, 35986, 35673, 35228, 35080, 35278, 35483, 35578, 35816, 36313, 36860, 37355, 37994, 38916, 40032, 41275, 42703, 44272, 45859, 47530, 49402, 51240, 52600, 53413, 54004, 54476, 54531, 53987, 53020, 51783, 50205, 48360, 46574, 45015, 43524, 42028, 40754, 39858, 39196, 38628, 38232, 38026, 37826, 37538, 37316, 37265, 37249, 37153, 37080, 37137, 37262, 37346, 37339, 37233, 37166, 37501, 38487, 39828, 40982, 41881, 42985]
54789D2985J593J867J872J841J725J335Q00L62o1o21j118j307j353j510j603j380
54773D5427j095j116j250j038n79l83n49p01o79o74p06n54k21K4P6N3Mq5j00M4
54753C5898R5k11o89r30q64p08n15k55q8j71l05k18KJ40K79N21N96K53j62j36
54733C2532K10L45J98J28J89Q9j91l43k76j96j36L8K14J46m4nK30L01J38J2Nm2
54711C3542q7Q0L67M49L00K04K20J45n5j84k21k88k94l6L16M16K89K55L52L52
54691C6122K71L43N36N98N44N86O57N37L75N20Q97J136J250J582K120K437K422
54674E2933K366K352K101J582J160J033J035J086J242J272P66k00j032j349j274
54659F5073r60m64j29m17j229j946k294k559k835k740k138j513j260j160q77n02
$$ y = [42985, 44578, 46445, 48317, 50158, 51883, 53218, 54018, 54380, 54319, 53698, 52580, 51273, 49920, 48410, 46807, 45427, 44332, 43216, 41966, 40928, 40349, 39966, 39417, 38716, 38037, 37363, 36657, 36103, 35882, 35906, 35982, 36035, 36039, 35954, 35854, 35898, 35993, 35782, 35093, 34163, 33299, 32591, 32076, 31821, 31733, 31562, 31257, 31039, 31041, 31181, 31460, 31981, 32577, 32830, 32668, 32532, 32742, 33087, 33285, 33413, 33602, 33691, 33500, 33157, 32881, 32685, 32549, 32587, 32801, 32947, 32903, 32898, 33128, 33429, 33567, 33579, 33584, 33542, 33455, 33535, 33902, 34351, 34651, 34855, 35075, 35220, 35165, 34981, 34760, 34472, 34178, 34142, 34458, 34874, 35163, 35418, 35770, 36122, 36393, 36736, 37272, 37870, 38414, 39000, 39657, 40194, 40569, 41089, 41986, 43122, 44372, 45954, 48074, 50511, 52933, 55299, 57651, 59752, 61334, 62494, 63527, 64562, 65648, 66890, 68162, 68928, 68728, 67696, 66347, 65073, 64113, 63649, 63520, 63103, 61874, 59928, 57634, 55075, 52240, 49500, 47362, 45849, 44589, 43429, 42552, 42050]
54643D2050k62j13N6J78K13L26N92R07J233J652K031K086J859J674J527J009L5
54626E7053q92j355j491j585j655j663j677j650j388r65p68q81r44p34n10m85
54610C8410n06m34m13m76l63j8J64n0l29l18j67j60k21j28L8P5Pn9j76l57l92
54589C4127j27K46M72N16M26J73j64l29k18m1M0J14K15J51j08k60j12R6Q1n9j04
54568C5135r1j46j95j46r6j36j51n9j8j56k93k04M5K60M07N39N78M27J64n2j70
54547C5642j88j11m2j19l02l98l77l81m01k48O4K48J93J27K05K48J04o2n0N0Q1
54526C4283N6L9j9j33j80j04j8J6O6Q8n1k81l19j16M7J2l4M4R6L0L7K47M73N00
54502C4779L78K39P4r2j39o9n1r6rK07K74J00n8m7m9j65j84rJ21O6K3J05P4k18
$$ y = [42050, 41788, 41675, 41731, 41909, 42122, 42448, 43040, 43947, 45180, 46832, 48863, 50949, 52808, 54482, 56009, 57018, 57053, 56161, 54806, 53315, 51730, 50075, 48412, 46735, 45085, 43697, 42732, 41964, 41083, 40139, 39405, 38895, 38410, 37904, 37470, 37057, 36581, 36218, 36200, 36364, 36314, 35985, 35667, 35500, 35340, 35119, 34991, 35029, 35104, 35111, 35052, 34876, 34519, 34127, 34000, 34246, 34718, 35234, 35660, 35833, 35669, 35340, 35122, 35081, 35121, 35235, 35450, 35601, 35493, 35233, 35121, 35217, 35298, 35239, 35135, 35044, 34898, 34703, 34557, 34461, 34325, 34174, 34115, 34097, 33941, 33648, 33444, 33489, 33749, 34156, 34695, 35273, 35700, 35864, 35812, 35642, 35454, 35343, 35301, 35182, 34880, 34482, 34105, 33724, 33323, 33075, 33139, 33387, 33580, 33707, 33912, 34160, 34264, 34202, 34152, 34202, 34283, 34339, 34378, 34359, 34226, 34046, 33942, 33924, 33940, 34006, 34094, 34043, 33762, 33443, 33327, 33374, 33386, 33352, 33396, 33492, 33522, 33559, 33806, 34279, 34779, 35157, 35396, 35470, 35378, 35239, 35170, 35119, 35023, 35014, 35221, 35495, 35595, 35537, 35490, 35441, 35276, 35092, 35083, 35204, 35270, 35293, 35398, 35472, 35254]
54478C5254m74m32k58k12k13r3N2P2O6J23J14j3k8J81L54K82J82K76L80K50M2
54457C5905M1J85K52K68L28L12J29j2R3K49J71o3j98k32k86k80r0J20J15l6j25
54436C6846j57k29k48r3R1Q9pJ0J13J30P4P1Q4L9mK3J4j01j75j05m8j23j78p4
54412C6042J0q6j77n0J30J13K3J10L04L27J87J08J24P5r3k89m44m82k83R2L52
54391C6093L45K71K95K56K6j55m5J66J78P1P0J05J9k0K04N04N19K75Q5L9Pl1k2
54368C9255n5j73j72N0J95Nk39j71J6j18m53m75j16J65J31On2j57k93k36RJ47
54346C7269O2k3K2M2o3j58j14j0L9j2j77l99m83l38j54j13n3K49N56M49j2l17
54324C6262k10P2K32K63K29J49J17K51M40M32K45J43K22L33M02N27O76O47M18
$$ y = [35254, 34780, 34348, 34090, 33878, 33665, 33572, 33624, 33696, 33762, 33885, 33999, 33986, 33958, 34139, 34493, 34775, 34957, 35233, 35613, 35863, 35905, 35946, 36131, 36383, 36651, 36979, 37291, 37420, 37408, 37501, 37750, 37921, 37858, 37660, 37428, 37142, 36862, 36772, 36892, 37007, 36971, 36846, 36689, 36460, 36212, 36119, 36210, 36299, 36292, 36302, 36415, 36545, 36619, 36690, 36774, 36813, 36809, 36832, 36846, 36745, 36570, 36465, 36417, 36294, 36116, 36042, 36052, 35966, 35789, 35739, 35869, 35982, 36005, 36115, 36419, 36746, 36933, 37041, 37165, 37240, 37147, 36858, 36414, 35932, 35649, 35741, 36093, 36438, 36709, 37004, 37260, 37286, 37131, 37086, 37252, 37430, 37501, 37571, 37676, 37695, 37675, 37879, 38383, 38902, 39177, 39262, 39301, 39308, 39277, 39255, 39200, 39027, 38855, 38905, 39100, 39105, 38866, 38695, 38711, 38593, 38140, 37665, 37549, 37714, 37845, 37851, 37799, 37642, 37349, 37113, 37122, 37269, 37331, 37308, 37330, 37372, 37309, 37151, 37037, 37027, 37066, 37054, 36877, 36478, 35995, 35657, 35503, 35390, 35337, 35586, 36142, 36591, 36579, 36262, 36052, 36124, 36356, 36619, 36848, 36997, 37114, 37365, 37805, 38237, 38482, 38625, 38847, 39180, 39582, 40109, 40785, 41432, 41850]
54305D1850K02J24O1p5j71j23J7J23J20k2k49l83l26k06j73j62p5j3r4j46O8M27
54283D0774N90M57J93j12m15n17k50J65L30K38K48M76O51N69L72K70L20N27Q30
54264D5716J031R46P12O01O01M65J54j11k72m82p68r18q33o83o23o33o31n71l77
54245D3324o6J38L1k58m48n01n47n05k04K05L60K03K0m7r9j60r3P7J46J08J64
54224D1848L17L05M7k39l95m95n83n64m32l19k31p8O1kk19l07j93n7L8J98L47
54203C9047K36j11l18k06j3Op3o9J0M7J4m9n8R0L28L63N1k81k36Q3K76K91L86
54180C9814N27M13R1j3J80K84J25K6J62K30K6j60n5J52J86J36K10L46L80L20J96
54159D3576n0l25l45p4J28K9j31q2L9l1k21l08k65j53N9L25L91J49j18j42l6n5
$$ y = [41850, 42052, 42176, 42237, 42162, 41991, 41868, 41885, 42008, 42128, 42106, 41857, 41474, 41148, 40942, 40769, 40607, 40532, 40519, 40425, 40279, 40347, 40774, 41364, 41821, 42014, 41902, 41487, 40970, 40720, 40885, 41215, 41453, 41701, 42177, 42828, 43397, 43769, 44039, 44359, 44886, 45716, 46747, 47693, 48405, 49006, 49607, 50072, 50226, 50115, 49843, 49361, 48593, 47675, 46842, 46159, 45536, 44903, 44272, 43701, 43324, 43258, 43396, 43427, 43169, 42721, 42220, 41673, 41168, 40964, 41169, 41529, 41732, 41752, 41705, 41606, 41446, 41353, 41430, 41576, 41684, 41848, 42165, 42470, 42517, 42278, 41883, 41388, 40805, 40241, 39809, 39490, 39259, 39181, 39242, 39240, 39021, 38714, 38521, 38464, 38502, 38700, 39047, 39283, 39172, 38854, 38648, 38635, 38641, 38568, 38499, 38509, 38556, 38570, 38521, 38463, 38553, 38881, 39244, 39295, 39014, 38778, 38861, 39137, 39428, 39814, 40341, 40754, 40845, 40832, 41012, 41296, 41421, 41447, 41609, 41839, 41865, 41705, 41650, 41802, 41988, 42124, 42334, 42680, 43060, 43380, 43576, 43526, 43201, 42856, 42782, 42910, 42939, 42808, 42726, 42765, 42734, 42513, 42205, 41940, 41787, 41846, 42171, 42562, 42711, 42593, 42451, 42415, 42360]
54137D2360j48j15J8Q5R8J74K77K69J76J26J64K22K72K89J86o3l30m71m81m15
54117D2693k99k05k18k77j89O8K62J95n5k99m42m59l46j96j23p2J23M02M75K37
54097D1275n0j14L8K35L56L21J01j40j67kJ07Q7Q9J20k5l29m58k55%K9n4k4R1
54074D1231J42J26J00K3r7j63j81l05n24n70l26m4J7p0j04l8R9L35N85O29M06
54053D1271J45M0Rl1J2J68K33P9j15j36l7M7J32K70L85M44N63P73R22R28Q94Q79
54031D7875P96O61O26O35M24ok92k44j19j17n6K27M99N47N67Q08J111J157R22
54012E6021N49K5o53j246j518j550j509j332r57n90m50m49m36m64n75n96m34l08
53994D3528l83m37k53LJ05J82L94N23L26K2l0P8L4j19j05N7Q3l2o5j3n0j02O5
$$ y = [42360, 42212, 42097, 42115, 42200, 42298, 42472, 42749, 43018, 43194, 43320, 43484, 43706, 43978, 44267, 44453, 44390, 44060, 43589, 43108, 42693, 42394, 42189, 41971, 41694, 41505, 41573, 41835, 42030, 41975, 41676, 41234, 40775, 40429, 40233, 40110, 40038, 40161, 40563, 41038, 41275, 41225, 41111, 41149, 41384, 41740, 42061, 42162, 42022, 41855, 41853, 41960, 42047, 42136, 42256, 42231, 41902, 41444, 41189, 41189, 41218, 41164, 41140, 41231, 41373, 41499, 41599, 41622, 41525, 41362, 41181, 40876, 40352, 39782, 39456, 39412, 39429, 39359, 39255, 39217, 39316, 39651, 40236, 40865, 41271, 41416, 41456, 41465, 41434, 41446, 41614, 41847, 41926, 41811, 41675, 41638, 41685, 41817, 42087, 42472, 42916, 43479, 44252, 45174, 46102, 46996, 47875, 48671, 49332, 49958, 50593, 51017, 51011, 50719, 50475, 50356, 50239, 50183, 50410, 50909, 51456, 52023, 52831, 53942, 55099, 56021, 56570, 56595, 55942, 54696, 53178, 51628, 50119, 48787, 47830, 47240, 46790, 46341, 45905, 45441, 44866, 44270, 43836, 43528, 43145, 42708, 42455, 42458, 42563, 42745, 43139, 43662, 43988, 44010, 43980, 44058, 44092, 43973, 43868, 43925, 44008, 43976, 43911, 43898, 43848, 43746, 43811]
53971D3811L59M33K00p1k07k66k43l8K47L30J66K0Q3K42L13K57J51J03J91L45
53951D6426L66K24J66L53N89O01M69M57N91O97P37P97Q57Q78R36J112J266J268
53933E8790J209J216J188J048R88J138J221R50N60N01P41Q23N55J94j2n5J1J20
53915G1186J00j28l60l92m08o58r71j008q53q84j123j222j059q75q01p04n80o01
53897E8659p54q11p32o80o29l74L8K86K79K27K13R3q2j2L73P91J111J567K274
53878F1837K927L142K801J918N46j002k177k664k619k314j845j326j026j040j112
53863E6046r82p22n33m24k80r6O3J84K68K81K27J64J08K8k0P2K65L92L97L83L93
53842E6214L82M02N75Q56J042J074J114J253J393J476J599J824K080K313K518
$$ y = [43811, 44170, 44603, 44803, 44732, 44525, 44259, 44016, 43978, 44225, 44555, 44721, 44741, 44824, 45066, 45379, 45636, 45787, 45890, 46081, 46426, 46792, 47016, 47182, 47535, 48124, 48725, 49194, 49651, 50242, 50939, 51676, 52473, 53330, 54208, 55144, 56256, 57522, 58790, 59999, 61215, 62403, 63451, 64439, 65577, 66798, 67748, 68308, 68809, 69550, 70373, 70928, 71122, 71110, 71055, 71066, 71186, 71286, 71158, 70798, 70406, 69998, 69340, 68369, 67361, 66508, 65624, 64501, 63279, 62220, 61345, 60544, 59840, 59260, 58659, 57905, 57094, 56362, 55682, 55053, 54679, 54717, 55003, 55282, 55509, 55722, 55815, 55733, 55721, 56094, 56885, 57996, 59563, 61837, 64764, 67906, 70707, 72625, 73171, 72169, 69992, 67328, 64709, 62395, 60550, 59224, 58198, 57158, 56046, 55064, 54342, 53809, 53385, 53105, 53009, 53072, 53256, 53524, 53805, 54032, 54196, 54304, 54332, 54312, 54384, 54649, 55041, 55438, 55821, 56214, 56596, 56998, 57573, 58429, 59471, 60545, 61659, 62912, 64305, 65781, 67380, 69204, 71284, 73597, 76115]
53827G6115K620K539K417K526K859L050K773K070J179L18l02m70j44N21J344K201
53811A01616K907L172K799J843N75n96j301j469j407j448j604j679j651j620j547
53796I8590j340j111j053j092j040r80j178j596j880j882j797j760j683j569j619
53781G7010j855j987j809j470j204j057r90r91r97r01p59p35q10p86o29n28n60
53764E8942n91n73n99o63o18m89m56m94l84j60j35l57m42j76J28J07j30k74l08
53745E2328l76m45l90k51j82j86j76j34o5P0K57L49K61R2j6m1lQ4J26K4j11l1
53723E1184K81N34N18L63K53K08K00K61L32K56P5O9L44O56P60P27P20P19O67O85
53703E9812Q75J110J205J163J084R86Q68Q14Q68R35R08P79N59K50l6j35q3r0j90
$$ y = [76115, 78735, 81274, 83691, 86217, 89076, 92126, 94899, 96969, 98148, 98466, 98164, 97694, 97550, 98071, 99415, 101616, 104523, 107695, 110494, 112337, 112912, 112316, 111015, 109546, 108139, 106691, 105087, 103408, 101757, 100137, 98590, 97250, 96139, 95086, 93994, 92954, 91974, 90796, 89200, 87320, 85438, 83641, 81881, 80198, 78629, 77010, 75155, 73168, 71359, 69889, 68685, 67628, 66638, 65647, 64650, 63749, 62990, 62255, 61445, 60659, 60030, 59502, 58942, 58351, 57778, 57179, 56516, 55898, 55409, 54953, 54459, 54075, 53915, 53780, 53423, 52981, 52805, 52933, 53040, 52910, 52636, 52328, 51952, 51507, 51117, 50866, 50684, 50498, 50322, 50188, 50123, 50193, 50450, 50799, 51060, 51152, 51136, 51095, 51092, 51176, 51302, 51326, 51215, 51184, 51465, 51999, 52517, 52880, 53133, 53341, 53541, 53802, 54134, 54390, 54465, 54534, 54878, 55534, 56294, 57021, 57741, 58460, 59127, 59812, 60687, 61797, 63002, 64165, 65249, 66235, 67103, 67917, 68785, 69720, 70628, 71407, 71966, 72216, 72180, 72045, 71962, 71872, 71682]
53684G1682j85kJ41P6r4k24l71o10q58j033j175j289j265j081q89p85p06o28o61
53665F0043p95q55p97p77q22p32m53k27k15k73k83l55n08n16k80o8p3j03M8J86
53645E2145M8k36l42k24p1L0O6l2k69m22l31j43n6j3J01J64N5p1KJ83K51K16K06
53622E1257J58l4k44k62j15N4K50N24P18O98O28P38R12Q77O52M98M51L55J99J74
53602E8488L05M06L71K61J29j7p3M4K20K89L02M26O04O32N04L91L62L26K74K86
53582F4530L30K86J84J73K68L26L06K94L06K56J38L9k6j15k24k44j33N2K15K64
53562F7225J46l3m6J75M05M16K51Q7m2j46j36M6K32K23R7P5J89L01L61M06L97
53541G0629K79J57J73K89L50L35L18L10L13M18O45Q22Q32Q20R45J055R31O57M76
$$ y = [71682, 71497, 71495, 71636, 71712, 71618, 71394, 71023, 70413, 69555, 68522, 67347, 66058, 64793, 63712, 62823, 62038, 61332, 60704, 60043, 59248, 58393, 57596, 56819, 55997, 55265, 54812, 54585, 54370, 54097, 53814, 53459, 52951, 52435, 52155, 52087, 52014, 51911, 51959, 52145, 52193, 51957, 51615, 51391, 51320, 51350, 51416, 51384, 51115, 50693, 50362, 50219, 50163, 50150, 50251, 50415, 50470, 50399, 50401, 50584, 50835, 51051, 51257, 51415, 51381, 51137, 50875, 50760, 50814, 51064, 51588, 52306, 53004, 53632, 54370, 55282, 56159, 56811, 57309, 57760, 58115, 58314, 58488, 58793, 59199, 59570, 59831, 59960, 59943, 59870, 59914, 60134, 60423, 60725, 61151, 61755, 62387, 62891, 63282, 63644, 63970, 64244, 64530, 64860, 65146, 65330, 65503, 65771, 66097, 66403, 66697, 67003, 67259, 67397, 67436, 67410, 67295, 67071, 66827, 66694, 66746, 66961, 67225, 67371, 67338, 67292, 67467, 67872, 68288, 68539, 68626, 68584, 68438, 68302, 68348, 68580, 68803, 68900, 68975, 69164, 69465, 69826, 70232, 70629, 70908, 71065, 71238, 71527, 71877, 72212, 72530, 72840, 73153, 73571, 74216, 75038, 75870, 76690, 77635, 78690, 79621, 80278, 80754]
53522H0754L93K25k0j80k45l27l57j62J86L96L51K17J62J95K90L96M10L10K76
53503H3270M29N85N28L97M74O94P29N50M39N22O36P10Q35R24P08K12j61j54L6
53484I2363J21R9R3J06Q6Q3J14R8l0k11l83n29o00n45m38m03l94k81j28j29k69
53463H8823l14j98j38k60l66l01k01k73m63n68n20m17l41l03k52j32L9J18J2j34
53443H3811q8J32K67K21J71K54L55L34K75L18M31N04N30N84O88Q07Q98R17Q45
53424I2254P57Q11J041J327J538J675J794J899J949J921J868J907K112K347K362
53409A17562K150K013K165K393K406K311K452K866L232L374L443L566L655L664
53395A57252L730L952M236M467M637M716M612M358M134M019L931L832L824L913
$$ y = [80754, 81147, 81372, 81352, 81172, 80927, 80600, 80243, 80081, 80267, 80663, 81014, 81231, 81393, 81588, 81878, 82274, 82684, 82994, 83270, 83699, 84284, 84812, 85209, 85683, 86377, 87106, 87656, 88095, 88617, 89253, 89963, 90798, 91722, 92430, 92642, 92481, 92327, 92363, 92484, 92583, 92676, 92782, 92868, 92951, 93065, 93163, 93133, 92922, 92539, 92010, 91410, 90865, 90427, 90024, 89630, 89349, 89221, 89092, 88823, 88509, 88311, 88173, 87913, 87547, 87246, 87045, 86772, 86309, 85741, 85221, 84804, 84463, 84160, 83908, 83776, 83815, 83933, 83945, 83811, 83723, 83855, 84122, 84343, 84514, 84768, 85123, 85457, 85732, 86050, 86481, 86985, 87515, 88099, 88787, 89594, 90492, 91409, 92254, 93011, 93822, 94863, 96190, 97728, 99403, 101197, 103096, 105045, 106966, 108834, 110741, 112853, 115200, 117562, 119712, 121725, 123890, 126283, 128689, 131000, 133452, 136318, 139550, 142924, 146367, 149933, 153588, 157252, 160982, 164934, 169170, 173637, 178274, 182990, 187602, 191960, 196094, 200113, 204044, 207876, 211700, 215613]
53381B15613L960L918L906L965L949L779L577L447L316L124L015L138L413L629
53367B65749L668L538L296L011K703K307J804J370J187J108P71Q1o59j198j623
53352B87113k055k356k380k245k188k241k321k450k676k880k932k907k949k991
53338B51542k857k615k584k914l384l667l685l578l422l128k585j871j214p57
53324B13281m48j75M7J22N9OQ2K48L81M05L70M20O72J061J389J561J728K063K524
53305B25796K938L251L536L794L964M063M183M367M591M880N245N591N820O020
53291B88039O345O780P206P633Q161Q716R115R348R583R889J0150J0303J0410
53278D01678J0486J0463J0357J0255J0131R857R481R175Q951Q619Q111P610P237
$$ y = [215613, 219573, 223491, 227397, 231362, 235311, 239090, 242667, 246114, 249430, 252554, 255569, 258707, 262120, 265749, 269417, 272955, 276251, 279262, 281965, 284272, 286076, 287446, 288633, 289741, 290512, 290593, 289934, 288736, 287113, 285058, 282702, 280322, 278077, 275889, 273648, 271327, 268877, 266201, 263321, 260389, 257482, 254533, 251542, 248685, 246070, 243486, 240572, 237188, 233521, 229836, 226258, 222836, 219708, 217123, 215252, 214038, 213281, 212833, 212658, 212705, 212827, 212886, 212892, 212974, 213222, 213603, 214008, 214378, 214798, 215470, 216531, 217920, 219481, 221209, 223272, 225796, 228734, 231985, 235521, 239315, 243279, 247342, 251525, 255892, 260483, 265363, 270608, 276199, 282019, 288039, 294384, 301164, 308370, 316003, 324164, 332880, 341995, 351343, 360926, 370815, 380965, 391268, 401678, 412164, 422627, 432984, 443239, 453370, 463227, 472708, 481883, 490834, 499453, 507564, 515174, 522411]
53265E22411O850O246N420M505L650K929K284J513M74p27j922l187m664o184p323
53250E32275p951q354q817r312r678r832r713r353q991q863q813q450p783p248
53236D09117p098p071o920o807o932p144p177p034o829o499n992n498n200m979
53222C17937m652m273l945l522k832k086j710j835k216k639l091l558l866l861
53208B73851l593l297l177l233l242l006k594k265k101j935j639j304j047q48
53194B40570o56m76k54J14N91R95J275J581J969K285K480K737L134L469L632L839
53178B67285M265M664M695M423M164M055L988L892L773L568L216K812K426J927
53164C19153J185L62k77p17j127j509j741j880k157k649l202l705m200m702n104
$$ y = [522411, 529261, 535507, 540927, 545432, 549082, 552011, 554295, 555808, 556282, 555555, 553633, 550446, 545782, 539598, 532275, 524324, 515970, 507153, 497841, 488163, 478331, 468618, 459265, 450274, 441411, 432598, 424148, 416365, 409117, 402019, 394948, 388028, 381221, 374289, 367145, 359968, 352934, 346105, 339606, 333614, 328116, 322916, 317937, 313285, 309012, 305067, 301545, 298713, 296627, 294917, 293082, 290866, 288227, 285136, 281578, 277712, 273851, 270258, 266961, 263784, 260551, 257309, 254303, 251709, 249444, 247343, 245408, 243769, 242465, 241418, 240570, 239914, 239438, 239184, 239298, 239889, 240884, 242159, 243740, 245709, 247994, 250474, 253211, 256345, 259814, 263446, 267285, 271550, 276214, 280909, 285332, 289496, 293551, 297539, 301431, 305204, 308772, 311988, 314800, 317226, 319153, 320338, 320700, 320423, 319706, 318579, 317070, 315329, 313449, 311292, 308643, 305441, 301736, 297536, 292834, 287730]
53149B87730n316n349n267n143n082n138n257n305n205m955m596m218l934l790
53135B19175l754l833m053m329m473m441m367m310m160l876l609l447l257k953
53121A64313k683k564k409k016j510j215j212j313j343j279j189j200j453j945
53107A40982k459k803l006l168l291l366l443l479l291k841k393k170k046j819
53093A01407j598j626j867k030j965j799j701j737j875k019k032j919j825j812
53079G5602j736j500j226j029q29n96m98o41q08p49n41m08l84l70l78m14l54j52
53061F2989m2j82l32k12On7l85o19n74l91k04l0L5r7k79l15k60k94l53k37k7K6
53039E8166n9m2Q6R3l1l5J40K46J41j1m0J1O4J33J86J50J11K29M61N88N54N27
$$ y = [287730, 282414, 277065, 271798, 266655, 261573, 256435, 251178, 245873, 240668, 235713, 231117, 226899, 222965, 219175, 215421, 211588, 207535, 203206, 198733, 194292, 189925, 185615, 181455, 177579, 173970, 170523, 167266, 164313, 161630, 159066, 156657, 154641, 153131, 151916, 150704, 149391, 148048, 146769, 145580, 144380, 142927, 140982, 138523, 135720, 132714, 129546, 126255, 122889, 119446, 115967, 112676, 109835, 107442, 105272, 103226, 101407, 99809, 98183, 96316, 94286, 92321, 90522, 88821, 87084, 85209, 83190, 81158, 79239, 77414, 75602, 73866, 72366, 71140, 70111, 69282, 68686, 68188, 67547, 66739, 65990, 65449, 65041, 64657, 64287, 63909, 63495, 63141, 62989, 62947, 62765, 62433, 62221, 62227, 62170, 61785, 61166, 60592, 60201, 59997, 59967, 60002, 59905, 59626, 59311, 59051, 58757, 58404, 58167, 58140, 58166, 58107, 58065, 58151, 58244, 58213, 58178, 58318, 58564, 58705, 58694, 58654, 58665, 58729, 58862, 59048, 59198, 59309, 59538, 59999, 60587, 61141, 61668]
53017F1668O00O90P18O61M55J12j38j04rk10o38q86q07o59n87m40j81l6q1r3L1
52996F0066O6j18l06l01k46l11l85k83o8Q5J49K11K77L03K54R2j49k57o3K21J86
52975E9423j99n00m47k82l04m27m01k39j07l5N1J22J34J31J52J36Q1J17K43K34
52955E7883k1k90l31k34k32l14k80p0J70K70J66r6l34l34j02J04J24R4J86L18
52935E6677L17K07J21P4j9j34j83j72j39n3P9J32J4j22p9Q6J35k2k07k24n1J95
52913E6632L85M53M51M58M69L81J57q7k36k96l09k60j31J0R5J34J64J63J31R4
52893E8858N2m2j46j08J15L75M88M27K50L8r0NL04N61N62L29L3j88k54j37P5K01
52871F1708J72J30J91K90L01K54K41K60K43J86J14Mj65l21l88l82l42k34m0J25
$$ y = [61668, 62268, 62958, 63676, 64337, 64792, 64904, 64766, 64662, 64653, 64443, 63805, 62919, 62112, 61453, 60866, 60426, 60245, 60209, 60128, 60035, 60066, 60132, 60014, 59708, 59407, 59161, 58850, 58465, 58182, 58114, 58199, 58348, 58559, 58836, 59139, 59393, 59485, 59336, 59079, 59016, 59237, 59423, 59224, 58724, 58277, 57995, 57691, 57264, 56863, 56624, 56517, 56482, 56533, 56655, 56789, 56920, 57072, 57208, 57289, 57406, 57649, 57883, 57862, 57572, 57241, 57007, 56775, 56461, 56181, 56111, 56281, 56551, 56717, 56621, 56287, 55953, 55851, 55955, 56079, 56173, 56359, 56677, 56994, 57201, 57322, 57396, 57377, 57243, 57060, 56888, 56749, 56696, 56775, 56907, 56921, 56799, 56720, 56806, 56941, 56919, 56712, 56488, 56437, 56632, 57017, 57470, 57921, 58379, 58848, 59229, 59386, 59299, 59063, 58767, 58458, 58198, 58067, 58077, 58172, 58306, 58470, 58633, 58764, 58858, 58910, 58868, 58722, 58614, 58729, 59104, 59592, 60019, 60269, 60307, 60217, 60222, 60526, 61087, 61649, 61978, 62011, 61823, 61569, 61432, 61507, 61708, 61880, 62010, 62201, 62491, 62792, 63046, 63287, 63547, 63790, 63976, 64090, 64094, 63929, 63608, 63220, 62838, 62496, 62262, 62222, 62347]
52851F2347J57R2M1Qq9k23k69j58J0J05Q2J8j5j6n1j64k83l08k23r9J4J24K28
52828F1328K81K45J02j09k78k65q8N2M3K1J37K53J28j80l72l31k20j54p0N6J31
52807F0710J57K60M13L94J36j42k25j43j5J18J74L6j93j86J58N08N13K42Rm8o
52786F2870N9R3Pk13l91l80k62k10k22j72j4J82L65M61L95K02O1P4J09L3q4p5
52764F2888P7K62L95L92J49k82o52p38o25n38n50n64n19m41l53k61j80j11l5k
52744E8312r0k42k99k44k39l23l08j13N8J8j05p7O6J25M4q0j79k34j67N0K79M02
52722E6654N09P15R35R90Q79P07M86J52k41n61p40p82o98n77n44n86n05k57r5
52703E6441j88l26k31j9J1j30j51M0K32K55J67N6l6m1R0K37K09L0j01j20j42j93
$$ y = [62347, 62504, 62596, 62637, 62645, 62556, 62333, 62064, 61906, 61916, 62021, 62103, 62121, 62106, 62090, 62039, 61875, 61592, 61284, 61061, 60962, 60976, 61100, 61328, 61609, 61854, 61956, 61847, 61569, 61304, 61216, 61268, 61311, 61332, 61469, 61722, 61850, 61670, 61298, 60967, 60747, 60593, 60523, 60579, 60710, 60867, 61127, 61540, 61934, 62070, 61928, 61703, 61560, 61545, 61663, 61837, 61873, 61680, 61494, 61652, 62160, 62673, 62915, 62924, 62876, 62870, 62929, 63022, 63029, 62816, 62425, 62045, 61783, 61573, 61351, 61179, 61165, 61347, 61712, 62173, 62568, 62770, 62831, 62905, 63014, 63047, 62963, 62888, 62965, 63227, 63622, 64014, 64163, 63881, 63229, 62491, 61866, 61328, 60778, 60214, 59695, 59254, 58901, 58640, 58460, 58349, 58314, 58312, 58222, 57980, 57681, 57437, 57198, 56875, 56567, 56454, 56512, 56530, 56425, 56348, 56414, 56539, 56583, 56503, 56324, 56090, 55923, 55973, 56252, 56654, 57163, 57878, 58813, 59803, 60682, 61389, 61875, 62027, 61786, 61225, 60485, 59703, 59005, 58428, 57884, 57298, 56793, 56536, 56441, 56253, 55927, 55696, 55677, 55688, 55558, 55407, 55447, 55679, 55934, 56101, 56157, 56121, 56080, 56170, 56407, 56616, 56646, 56545, 56425, 56283, 56090]
52681E6090j52K5J94K34J76J10N4rr4k22l78m59l69j49R9L19M65M50K45J6p3o8
52659E6504j04j48o5J15K10J60J07J75L38M80M91L31J05L3J94L85L52J27o0r4
52639E9636n0j0M3J23K26L19L14J13j78k56l2J64qm16o51n75l83k23o1R8J51J02
52617E8446O9P3O0Q0K11L48L09J49Q5J48J79J48K04L47L82K54J52J92K52K10J11
52596F2409K7n1q3K0J86J91l7k94l95l81l42k62j30n3r3j62j73j71k27l02l10
52575E9367k18m9J50K76K80K49K56J99m9l50m25k56r7n1M5K48L37J67m4k7J81
52554F0189L40L40K38J14O1J58L38L80K09L5M4J10K3j57j61J03M66P46R19J014
52534F5509J055J108J244J362J195N86k80r84j238j113r04q20q54q95q73p62n62
$$ y = [56090, 55938, 55963, 56157, 56391, 56567, 56677, 56731, 56722, 56628, 56406, 56028, 55569, 55200, 55051, 55150, 55469, 55934, 56384, 56629, 56645, 56572, 56504, 56400, 56252, 56187, 56302, 56512, 56672, 56779, 56954, 57292, 57772, 58263, 58594, 58699, 58732, 58926, 59311, 59663, 59790, 59730, 59636, 59586, 59576, 59619, 59742, 59968, 60287, 60601, 60714, 60536, 60280, 60248, 60412, 60404, 59988, 59337, 58762, 58379, 58156, 58095, 58193, 58344, 58446, 58515, 58588, 58648, 58728, 58939, 59287, 59596, 59745, 59830, 59978, 60157, 60305, 60509, 60856, 61238, 61492, 61644, 61836, 62088, 62298, 62409, 62436, 62385, 62302, 62322, 62508, 62699, 62662, 62368, 61973, 61592, 61250, 60988, 60858, 60805, 60712, 60550, 60377, 60206, 59979, 59677, 59367, 59149, 59100, 59250, 59526, 59806, 60055, 60311, 60510, 60461, 60111, 59686, 59430, 59333, 59282, 59327, 59575, 59912, 60079, 60035, 60008, 60189, 60529, 60869, 61107, 61221, 61282, 61440, 61778, 62158, 62367, 62402, 62446, 62556, 62579, 62422, 62261, 62364, 62830, 63576, 64495, 65509, 66564, 67672, 68916, 70278, 71473, 72059, 71779, 70795, 69557, 68444, 67540, 66720, 65866, 64971, 64098, 63336, 62774]
52517F2774l49k51k76k71j12J07K32K46K27J69L4j00j20m7K2Q1J81K51J96R4R1
52496F3179J48J21N4J25K98L11O6k06k83j88m7P6J30N3p1m7J27K24J17k5k3P4
52474F4213J25J18R9N0k5m1L1R6Q6M0k1j52k94k84j17k1j12j89l1K48L37J40j78
52451F4118m32n39m78k83o8P9J65K12J69M7mJ30L16L39J89N1K7K4m5j12m0J63
52429F4028L10K49N2k9J20L30L55J81Jm7L6K08L98M59K90M2jK26M99O33O18M75
52407F9433J94j18k50j98j90l68n85o50n93n08l94k51j69j64j30m4n8k04k74j35
52387F4344J2n6k20j93L2K03J78L8r1j49q8Q7K71L48L46L70M55N46N94N48L83
52366F7958J85J33K54L58K89J43P9O2m0k05l08l44m24n64o50n81l67q6J33J82
$$ y = [62774, 62425, 62174, 61898, 61627, 61515, 61622, 61854, 62100, 62327, 62496, 62530, 62430, 62310, 62263, 62285, 62366, 62547, 62798, 62994, 63088, 63179, 63327, 63448, 63502, 63627, 63925, 64236, 64302, 64096, 63813, 63625, 63578, 63654, 63784, 63837, 63766, 63719, 63846, 64070, 64187, 64162, 64139, 64213, 64338, 64456, 64555, 64605, 64580, 64539, 64570, 64666, 64752, 64792, 64771, 64619, 64325, 64041, 63924, 63903, 63791, 63602, 63571, 63819, 64156, 64296, 64118, 63686, 63147, 62669, 62386, 62318, 62397, 62562, 62774, 62943, 62990, 62986, 63116, 63432, 63771, 63960, 64011, 64038, 64062, 64017, 63905, 63865, 64028, 64338, 64587, 64639, 64610, 64730, 65060, 65415, 65596, 65597, 65550, 65586, 65794, 66192, 66651, 66941, 66983, 66982, 67208, 67707, 68340, 68958, 69433, 69627, 69509, 69259, 69061, 68871, 68503, 67918, 67268, 66675, 66167, 65773, 65522, 65353, 65189, 65059, 65015, 64957, 64753, 64479, 64344, 64356, 64300, 64080, 63887, 63919, 64122, 64300, 64338, 64247, 64098, 64010, 64097, 64368, 64716, 65062, 65432, 65887, 66433, 67027, 67575, 67958, 68143, 68276, 68530, 68888, 69177, 69320, 69399, 69461, 69421, 69216, 68908, 68564, 68140, 67576, 66926, 66345, 65978, 65892, 66025, 66207]
52346F6207Q3OL4P1J9m6k9K1%o4q4p2j07j75j94j20M7K72M23L52J12m0NO1k4r7
52320F6661L2K17J65j20l07k05Q5L54N19N99O63Q11J092J425J707J905J941J667
52302G9211J030K61l55p56j027j168j121r72q80q54p72o00l93j64Q8K37J67k8
52284G1904j40j23r3q2rJ43K72L44M01M71N39O24P16P24O19N20N20M76K43m1j26
52263G7902k5J6m3LK45M84N39M27K50P5j3P1K52L68M19N23O43O02M17L29M57O25
52241H4566O52N78N04M15L11L03M31N64O18O87Q44R88J043J118J321J551J698
52224I8192J831K021K133K016J806J769J933K076K093K100K190K323K463K671
52210A27617K954L213L407L619L885M106M237M422M816N286N523N435N285N292
$$ y = [66207, 66290, 66296, 66330, 66401, 66420, 66374, 66345, 66366, 66366, 66302, 66218, 66146, 66039, 65864, 65670, 65550, 65597, 65869, 66292, 66644, 66756, 66716, 66721, 66782, 66758, 66661, 66693, 66910, 67075, 66955, 66648, 66443, 66528, 66882, 67401, 68000, 68663, 69474, 70566, 71991, 73698, 75603, 77544, 79211, 80241, 80502, 80147, 79391, 78364, 77196, 76075, 75103, 74223, 73369, 72597, 71997, 71604, 71440, 71528, 71765, 71932, 71904, 71764, 71641, 71548, 71466, 71457, 71600, 71872, 72216, 72617, 73088, 73627, 74251, 74967, 75691, 76310, 76830, 77350, 77826, 78069, 78028, 77902, 77877, 77893, 77850, 77853, 78098, 78582, 79121, 79548, 79798, 79873, 79860, 79931, 80183, 80551, 80970, 81493, 82136, 82738, 83155, 83484, 83941, 84566, 85218, 85796, 86300, 86715, 87026, 87329, 87760, 88324, 88942, 89629, 90473, 91461, 92504, 93622, 94943, 96494, 98192, 100023, 102044, 104177, 106193, 107999, 109768, 111701, 113777, 115870, 117970, 120160, 122483, 124946, 127617, 130571, 133784, 137191, 140810, 144695, 148801, 153038, 157460, 162276, 167562, 173085, 178520, 183805, 189097]
52196A89097N329N104M588M071L767L581L296K896K536K316K193K062J836J486
52182B34158J094Q14P28P46P26O41N11K87m8l62n13o20r47j507j983k097j898
52165B29730j583j223q06m13j32J17N21J102J694K158K536K935L341L665L852
52150B47494L897L785L502L141K886K850K961L058L045K901K605K153J680J382
52136B87340J284J196R50N81K36l7l02n88q69j133j420j743k077k374k576k656
52120B75812k660k663k665k578k392k223k149k086j931j718j554j441j283j035
52106B47434p13l17J13M54O06O29O63O90N75K69q3k76k42o5R7J30N5j4k5mN6K34
52084B50266M79N65L47Oj92k47l53n80p78q68r21j014j098j128j123j097j007
$$ y = [189097, 194426, 199530, 204118, 208189, 211956, 215537, 218833, 221729, 224265, 226581, 228774, 230836, 232672, 234158, 235252, 236066, 236794, 237540, 238266, 238907, 239418, 239705, 239657, 239295, 238782, 238162, 237215, 235708, 233725, 231628, 229730, 228147, 226924, 226118, 225705, 225573, 225690, 226211, 227313, 229007, 231165, 233701, 236636, 239977, 243642, 247494, 251391, 255176, 258678, 261819, 264705, 267555, 270516, 273574, 276619, 279520, 282125, 284278, 285958, 287340, 288624, 289820, 290770, 291351, 291587, 291550, 291248, 290660, 289791, 288658, 287238, 285495, 283418, 281044, 278468, 275812, 273152, 270489, 267824, 265246, 262854, 260631, 258482, 256396, 254465, 252747, 251193, 249752, 248469, 247434, 246721, 246404, 246517, 246971, 247577, 248206, 248869, 249559, 250134, 250403, 250320, 250044, 249802, 249737, 249834, 249964, 250019, 250005, 249980, 249976, 250032, 250266, 250745, 251310, 251657, 251663, 251471, 251224, 250871, 250291, 249513, 248645, 247724, 246710, 245612, 244484, 243361, 242264, 241257]
52067B41257q58p15o28n69n01m17k76m6K17L85L90K74J38P0J05J79J69N9l7o1
52047B39135j53l87n80m98k34j00k01l41l43k56j73q0M8J72K98M78O88Q12Q61
52028B39146R77J198J347J293J143J091J184J379J673K052K408K650K860L152
52014B63553L483L694L733L707L698L648L491L278L151L149L183L166L145L237
52000C11316L472L729L887L940L940L904L818L686L518L274K914K467K027J706
51986C57598J540J422J103M07n38j424k110k702l218l454l300k980k783k680k458
51971C34423k108j827j700j627j500j315j059p31m06j37J53N42R17J131J253J467
51955C27476J767J993K099K189K267K293K353K577K838K863K634K426K376K328
$$ y = [241257, 240399, 239684, 239056, 238487, 237986, 237569, 237293, 237247, 237464, 237849, 238239, 238513, 238651, 238721, 238826, 239005, 239174, 239233, 239196, 239135, 238982, 238595, 238015, 237517, 237283, 237183, 236982, 236641, 236298, 236042, 235869, 235789, 235837, 236009, 236307, 236785, 237473, 238285, 239146, 240123, 241321, 242668, 243961, 245104, 246195, 247379, 248758, 250431, 252483, 254891, 257541, 260401, 263553, 267036, 270730, 274463, 278170, 281868, 285516, 289007, 292285, 295436, 298585, 301768, 304934, 308079, 311316, 314788, 318517, 322404, 326344, 330284, 334188, 338006, 341692, 345210, 348484, 351398, 353865, 355892, 357598, 359138, 360560, 361663, 362070, 361532, 360108, 357998, 355296, 352078, 348624, 345324, 342344, 339561, 336881, 334423, 332315, 330488, 328788, 327161, 325661, 324346, 323287, 322556, 322150, 322013, 322166, 322708, 323625, 324756, 326009, 327476, 329243, 331236, 333335, 335524, 337791, 340084, 342437, 345014, 347852, 350715, 353349, 355775, 358151, 360479]
51941C60479K118J801J457J042N41L7m50j027j708k354k896l397l862m149m220
51926C43412m228m287m323m261m146m014l813l577l497l673l974m217m330m291
51912B86781m076l761l506l338l135k860k647k562k484k347k253k279k361k460
51898B46712k692l108l591m019m404m737m930n012n190n586o068o429o546o334
51884A78066n761n022m412l922l277k461j862j711j708j508j226j147j227j253
51870A41569j306j622k106k390k328k110j901j672j350r33m35N9L56L86L91O29
51854A25237R96J220J354J735K435L147L654M145M886N851O860P900R033J0019
51840A88472J0197Q896O009K173j630m699o803p955q214p780p063o405n847n305
$$ y = [360479, 362597, 364398, 365855, 366897, 367438, 367475, 367025, 365998, 364290, 361936, 359040, 355643, 351781, 347632, 343412, 339184, 334897, 330574, 326313, 322167, 318153, 314340, 310763, 307266, 303593, 299619, 295402, 291072, 286781, 282705, 278944, 275438, 272100, 268965, 266105, 263458, 260896, 258412, 256065, 253812, 251533, 249172, 246712, 244020, 240912, 237321, 233302, 228898, 224161, 219231, 214219, 209029, 203443, 197375, 190946, 184400, 178066, 172305, 167283, 162871, 158949, 155672, 153211, 151349, 149638, 147930, 146422, 145196, 144049, 142822, 141569, 140263, 138641, 136535, 134145, 131817, 129707, 127806, 126134, 124784, 123851, 123416, 123475, 123831, 124217, 124608, 125237, 126233, 127453, 128807, 130542, 132977, 136124, 139778, 143923, 148809, 154660, 161520, 169420, 178453, 188472, 198669, 207565, 213574, 215747, 214117, 209418, 202615, 194660, 186446, 178666, 171603, 165198, 159351, 154046]
51826A54046m850m587m417m110l609l056k547k030j493j026p14n67n69o71q08
51811A18992r73j273j768k302k631k662k481k208j944j795j757j649j338r86q24
51796I2401p89o00j88K08M32O56J052J506J765J820J885K054K168K040J699J305
51780A09414R30N46J77n3p5j5l2j40k34k85l29l28j98j1M4p3k19l22m44o13p36
51759A07004q30j043j415j753j931k050k188k200j959j598j303j072q45o84o17
51744H5516m58p3L33M56L15J94K10K34J86J45J95L19M84O23O29M94L78M23N43
51725I1146N79N27M56K84q7n55r12j097j167j116r36p32n67l15J02M57M90L11
51707H6868K54L75M57M29M49N80O89O98O75O00L79R8mJ19K37J71j1j29o0K56P52
$$ y = [154046, 149196, 144609, 140192, 136082, 132473, 129417, 126870, 124840, 123347, 122321, 121607, 121040, 120471, 119800, 118992, 118019, 116746, 114978, 112676, 110045, 107383, 104902, 102694, 100750, 98955, 97198, 95549, 94211, 93225, 92401, 91612, 91012, 90824, 91032, 91464, 92120, 93172, 94678, 96443, 98263, 100148, 102202, 104370, 106410, 108109, 109414, 110344, 110890, 111067, 111014, 110939, 110924, 110892, 110752, 110518, 110233, 109904, 109576, 109378, 109367, 109411, 109338, 109119, 108797, 108353, 107740, 107004, 106174, 105131, 103716, 101963, 100032, 97982, 95794, 93594, 91635, 90037, 88734, 87662, 86817, 86133, 85516, 85058, 84985, 85318, 85774, 86089, 86283, 86493, 86727, 86913, 87058, 87253, 87572, 88056, 88679, 89308, 89802, 90180, 90603, 91146, 91725, 92252, 92708, 92992, 92905, 92350, 91438, 90341, 89174, 88058, 87122, 86390, 85823, 85508, 85610, 86067, 86557, 86868, 87122, 87497, 87954, 88383, 88832, 89412, 90101, 90799, 91474, 92074, 92453, 92551, 92547, 92666, 92903, 93074, 93063, 92934, 92874, 93130, 93882]
51686I3882J154J212J033R18R47R39Q37Q09R06R21O80K20l83j088j713j967j770
51669I7537j384j104j015j061j171j223j125r73r25r12p16l39m7M6R6J57M5k89
51651H5597n52n04k78j27q7q7j54l03m19m30m41m90m08j02K11K77J73R9N1r1k55
51630H1680k41o8N8N7N4J26K02K06J78J89K59L73M73M83L64K02J41K59N19P67
51610H6281Q15N94K59M6j0q6k70m43m54l06k0M23R08J141R43N13K00J30J62J48
51590I0974M8j22l33n39p49j015j291j378j135o73k21R0K74L90M96N88N55K80
51572H6239j48m11l42j15j5n4n7O4K50M34N75O20N69N54P01R54J165J325J580
51553I3888K032K611L119L311L001K184J063q3j074j857k425k826l092l160k950
$$ y = [93882, 95036, 96248, 97281, 98199, 99146, 100085, 100922, 101731, 102637, 103558, 104238, 104458, 104075, 102987, 101274, 99307, 97537, 96153, 95049, 94034, 92973, 91802, 90579, 89454, 88481, 87556, 86644, 85928, 85589, 85542, 85588, 85684, 85841, 85886, 85597, 85045, 84541, 84263, 84136, 84049, 83962, 83808, 83505, 83086, 82656, 82215, 81725, 81317, 81215, 81426, 81703, 81876, 81975, 82026, 81935, 81680, 81439, 81371, 81429, 81486, 81540, 81666, 81868, 82074, 82252, 82441, 82700, 83073, 83546, 84029, 84393, 84595, 84736, 84995, 85514, 86281, 87096, 87690, 87949, 87995, 87985, 87899, 87629, 87186, 86732, 86426, 86406, 86829, 87737, 88878, 89821, 90334, 90534, 90664, 90826, 90974, 91022, 90900, 90567, 90028, 89279, 88264, 86973, 85595, 84460, 83787, 83566, 83656, 83930, 84320, 84816, 85404, 85959, 86239, 86091, 85680, 85338, 85223, 85208, 85154, 85097, 85161, 85411, 85845, 86420, 87040, 87609, 88163, 88864, 89818, 90983, 92308, 93888, 95920, 98531, 101650, 104961, 107962, 110146, 111209, 111126, 110052, 108195, 105770, 102944, 99852, 96692, 93742]
51538I3742k532k127j821j474j005n75l67k62k9K93M23K42n6k38k90l36m38n59
51520H2591o31o21n49m72m34m37m58m86m68l34q4K08M96P88J039J133J097J138
51502H3516J411J822K264K829L606M242M079K787P85j109k341k875k936k670k141
51487I3269j485r45o23l73OM79Q33R66R89R84R32Q23P56P18N18Q8l24l90q4L89
51467I7526R06J504K214K982L761M474M968N142N131N224N514N792N811N531N060
51452A61540M456L699K787J800Q42o4j011k086l240m293n110n642n881n804n477
51437A36516n086m788m567m284l851l309k802k506k464k476k278j856j475j327
51423I3447j289j148q92o57m74k96j49j01j21j30j53k53l54l27k17j83k38j99
$$ y = [93742, 91210, 89083, 87262, 85788, 84783, 84208, 83841, 83579, 83550, 83843, 84266, 84508, 84452, 84214, 83924, 83588, 83150, 82591, 81960, 81339, 80790, 80318, 79884, 79447, 78989, 78503, 78035, 77701, 77617, 77825, 78321, 79109, 80148, 81281, 82378, 83516, 84927, 86749, 89013, 91842, 95448, 99690, 103769, 106556, 107341, 106232, 103891, 101016, 98080, 95410, 93269, 91784, 90839, 90216, 89843, 89849, 90328, 91161, 92127, 93116, 94100, 95032, 95855, 96611, 97329, 97847, 97935, 97611, 97221, 97137, 97526, 98432, 99936, 102150, 105132, 108893, 113367, 118335, 123477, 128608, 133832, 139346, 145138, 150949, 156480, 161540, 165996, 169695, 172482, 174282, 175124, 175060, 174049, 171963, 168723, 164430, 159320, 153678, 147797, 141993, 136516, 131430, 126642, 122075, 117791, 113940, 110631, 107829, 105323, 102859, 100383, 98105, 96249, 94774, 93447, 92158, 91010, 90118, 89461, 88987, 88691, 88542, 88441, 88320, 88190, 88037, 87784, 87430, 87103, 86886, 86703, 86465, 86266]
51405H6266J4K11K01N3lJ12K46K53J59P6M2MmR8K89M01K96M1k10m41p19r94j116
51382H5275j059r45q24o08l01q5p2j26r3m7j29k83l17k09j29k12m12o04o83n99
51362G7538l87j54J3R2J00P9J29L57P13R92J081J109J247J511J809K076K243K195
51344I2743J929J603J323R71M30j58n39o92q26j066j347j583j759j863j856j762
51328H5548j646j519j342j129r19o94m26j80o2n8n8nO5J20J58J63J36J70L29N03
51308G9154N27M09L45M93P81J043J182J243J317J423J451J290R90P46O52O03N04
51291I4153M49N86R11J312J716K110K451K726L012L391L842M316M856N499O133
51276A37463O599O829O810O479N812M911L870K625J117n41k181l751n205o312
$$ y = [86266, 86280, 86491, 86692, 86745, 86742, 86854, 87100, 87353, 87512, 87588, 87630, 87634, 87630, 87728, 88017, 88418, 88714, 88755, 88545, 88104, 87385, 86391, 85275, 84216, 83271, 82447, 81839, 81538, 81453, 81381, 81255, 81162, 81115, 80986, 80703, 80386, 80177, 80048, 79836, 79424, 78820, 78137, 77538, 77151, 76997, 77010, 77102, 77202, 77281, 77410, 77767, 78480, 79472, 80553, 81662, 82909, 84420, 86229, 88305, 90548, 92743, 94672, 96275, 97598, 98569, 98999, 98841, 98302, 97610, 96784, 95718, 94371, 92788, 91029, 89166, 87310, 85548, 83902, 82383, 81041, 79912, 78993, 78299, 77873, 77693, 77631, 77573, 77515, 77510, 77575, 77695, 77853, 78016, 78152, 78322, 78651, 79154, 79681, 80090, 80435, 80928, 81709, 82752, 83934, 85177, 86494, 87917, 89368, 90658, 91648, 92394, 93046, 93649, 94153, 94602, 95188, 96099, 97411, 99127, 101237, 103688, 106414, 109426, 112817, 116659, 120975, 125831, 131330, 137463, 144062, 150891, 157701, 164180, 169992, 174903, 178773, 181398, 182515, 181974, 179793, 176042, 170837, 164525]
51262A64525o851o937o897o874o718o298n672m934m130l343k681k147j667j271
51248I8105j041r51q68p77p94r52j141j282j393j448j335j051p45n61n12n49o23
51231H2082o62n99m75l90l59l22k59j95q0J30L46M21L97M70P34J051J233J201
51213H4724R56N65J85n3k02l88n77n75l30n0L9q5k66l59l30k71l04m10l99j64
51193H1706J33K42J54O7J31L50O97J084J294J169Q70O80N82L27j38n68p93r01
51175H7086r56q58n78l00j56m2J82M59O47P02O18L76L0k56m12n12n84n41l85l10
51155H4210l99m24j55K96N93N91M39L40L34L30K72J90J47J26Qk27l89l08j42k09
51135H5623n21p30n91k63k8M0J5p1j73j69MK27L32L12K49J83J50K06L38M13L87
$$ y = [164525, 157674, 150737, 143840, 136966, 130248, 123950, 118278, 113344, 109214, 105871, 103190, 101043, 99376, 98105, 97064, 96113, 95245, 94468, 93674, 92722, 91581, 90299, 88906, 87458, 86123, 85072, 84327, 83766, 83254, 82705, 82082, 81420, 80821, 80346, 79956, 79597, 79275, 79016, 78821, 78741, 78871, 79217, 79638, 80035, 80505, 81239, 82290, 83523, 84724, 85680, 86245, 86430, 86377, 86175, 85787, 85210, 84635, 84305, 84255, 84294, 84209, 83943, 83584, 83254, 82983, 82679, 82269, 81870, 81706, 81839, 82081, 82235, 82302, 82433, 82783, 83480, 84564, 85858, 87027, 87897, 88577, 89159, 89486, 89348, 88780, 87987, 87086, 86130, 85272, 84694, 84394, 84238, 84196, 84378, 84837, 85484, 86186, 86804, 87180, 87210, 86954, 86542, 86030, 85446, 84905, 84520, 84210, 83811, 83387, 83232, 83528, 84121, 84712, 85151, 85491, 85825, 86155, 86427, 86617, 86764, 86890, 86898, 86671, 86282, 85974, 85832, 85623, 85102, 84372, 83781, 83518, 83490, 83530, 83545, 83474, 83301, 83132, 83136, 83363, 83695, 84007, 84256, 84439, 84589, 84795, 85133, 85546, 85933]
51114H5933M03N83Q40R75R47Q67Q31Q40Q27O91L93M2j89k85l95n60o23m79k73
51095I1368j72j49o4N8J01N4L2J10K61M15M98M57K95P1j50l02l17k14j84m02p56
51074I1010r24p99n85m67m06l54l88n32o14n19l56k37j00J16K54J72j2p3j0L9
51054H5215M2P6J44K13L22M56M67K66L8J1J12Q5r0j84p2J05J85J66J22P1%r1j89
51031H7470k25o9L06P01Q80Q27P30P13P09O00L71R9j17k15j70l4J22K28K06J1
51011I3143k62m28l94k51j35o4j7J8P7K38M71O30O22N42M88M41M01M62O23O97
50991I7302N77M45N26P44Q11O09K55j01l52m16k99j77j83j89K4M12O79O54M63
50972A01784L25L30M57O46Q50J055J277J498J668J828K079K402K600K552K399
$$ y = [85933, 86336, 86919, 87759, 88734, 89681, 90548, 91379, 92219, 93046, 93737, 94130, 94172, 93983, 93698, 93303, 92743, 92120, 91641, 91368, 91196, 91047, 90983, 91041, 91142, 91196, 91228, 91338, 91599, 92014, 92512, 92969, 93264, 93335, 93185, 92883, 92566, 92352, 92168, 91766, 91010, 90086, 89287, 88702, 88235, 87829, 87475, 87087, 86555, 85941, 85422, 85066, 84829, 84729, 84845, 85099, 85271, 85259, 85186, 85176, 85215, 85257, 85333, 85477, 85690, 86012, 86468, 86935, 87201, 87239, 87250, 87362, 87447, 87357, 87173, 87101, 87206, 87391, 87557, 87679, 87750, 87750, 87659, 87470, 87245, 87176, 87482, 88183, 89063, 89890, 90620, 91333, 92042, 92642, 93013, 93112, 92995, 92780, 92610, 92576, 92698, 92926, 93132, 93143, 92881, 92453, 92059, 91808, 91673, 91609, 91592, 91610, 91687, 91925, 92396, 93026, 93648, 94190, 94678, 95119, 95520, 95982, 96605, 97302, 97879, 98324, 98850, 99594, 100405, 101014, 101269, 101168, 100816, 100400, 100101, 99924, 99741, 99552, 99576, 99988, 100667, 101321, 101784, 102109, 102439, 102896, 103542, 104392, 105447, 106724, 108222, 109890, 111718, 113797, 116199, 118799, 121351, 123750]
50957A23750K291K156J838J373Q83L74k24q41j361j794k184k421k402k232k077
50942A17129j887j558j228j112j099q64l62J11L76N66P74Q53P14N36N33O97R38
50925A15117J268J694K108K397K605K819L024L164L234L236L107K806K409K003
50911A50991J578J082N86K45J69K53K31j11o77j139j296j258j178r91n73n4K99
50894A48157M47O03Q93J226J537J901K349K788L186L643M227M806N147N072M534
50879A90516L735L138L187L909M961O076P237Q430R531J0519J1593J2843J4038
50866B89713J4932J5603J6294J7015J7518J7608J7308J6711J5815J4541J2855
50855D65913J0870Q828O929N174L423J649Pj331k321k943l131k889k425k067k033
$$ y = [123750, 126041, 128197, 130035, 131408, 132291, 132665, 132441, 131600, 130239, 128445, 126261, 123840, 121438, 119206, 117129, 115242, 113684, 112456, 111344, 110245, 109381, 109019, 109130, 109506, 110072, 110846, 111699, 112413, 112949, 113482, 114179, 115117, 116385, 118079, 120187, 122584, 125189, 128008, 131032, 134196, 137430, 140666, 143773, 146579, 148988, 150991, 152569, 153651, 154237, 154482, 154651, 154904, 155135, 155024, 154347, 153208, 151912, 150654, 149476, 148485, 147912, 147858, 148157, 148604, 149207, 150100, 151326, 152863, 154764, 157113, 159901, 163087, 166730, 170957, 175763, 180910, 185982, 190516, 194251, 197389, 200576, 204485, 209446, 215522, 222759, 231189, 240720, 251239, 262832, 275675, 289713, 304645, 320248, 336542, 353557, 371075, 388683, 405991, 422702, 438517, 453058, 465913, 476783, 485611, 492540, 497714, 501137, 502786, 502793, 501462, 499141, 496198, 493067, 490178, 487753, 485686, 483653]
50840D83653k311k709l004l121l216l532m135m885n643o446p401q537r761j0963
50826D07989j2062j3027j3838j4387j4482j4041j3251j2410j1615j0761r828q981
50814B59306q343p802p172o426n676n045m610m382m258m018l519k837k212j816
50800A91190j630j482j208q17m65k52j19L6J81K56L41N56Q50J050J104J117J144
50783A91852J144J167J356J703K013K192K389K732L125L408L602L870M316M917
50769B29786N534O005O276O530O989P611Q180Q698R470J0674J2132J3651J5322
50756C46858J7280J9378K1412K3515K5986K8809L1596L4015L6024L7697L9044
50745F61614M0064M0719M0789L9843L7563L3957K9274K3787J7772J1610N748N09
$$ y = [483653, 481342, 478633, 475629, 472508, 469292, 465760, 461625, 456740, 451097, 444651, 437250, 428713, 418952, 407989, 395927, 382900, 369062, 354675, 340193, 326152, 312901, 300491, 288876, 278115, 268287, 259306, 250963, 243161, 235989, 229563, 223887, 218842, 214232, 209850, 205592, 201574, 198055, 195218, 193006, 191190, 189560, 188078, 186870, 186053, 185588, 185336, 185217, 185253, 185434, 185690, 186031, 186587, 187437, 188487, 189591, 190708, 191852, 192996, 194163, 195519, 197222, 199235, 201427, 203816, 206548, 209673, 213081, 216683, 220553, 224869, 229786, 235320, 241325, 247601, 254131, 261120, 268731, 276911, 285609, 295079, 305753, 317885, 331536, 346858, 364138, 383516, 404928, 428443, 454429, 483238, 514834, 548849, 584873, 622570, 661614, 701678, 742397, 783186, 823029, 860592, 894549, 923823, 947610, 965382, 976992, 982740, 983249]
50733I83249l990p781j0907j3333j4909j5429j4744j2947j0383p509m714k291
50721H64312n71Q5n21k265m836p983j1531j5270j8925k2310k5358k8056l0401
50708F96370l2339l3697l4211l3746l2449l0578k8245k5534k2733k0209j8003
50697C84626j5835j3533j1271r293p627o203n020m046l115k126j237o77m69m23
50683C03751m12m75o96j092j557j908k021j962j915j961k054k170k356k601k824
50668B77747l022l292l619l823l810l692l558l324k916k455k063j642j026k67
50654B39238M31J024J684K572L643M710N589O231O748P256P748Q179Q662R399
50640C13114J0392J1394J2300J3352J4768J6388J7825J8904J9718K0369K0832
$$ y = [983249, 979259, 971478, 960571, 947238, 932329, 916900, 902156, 889209, 878826, 871317, 866603, 864312, 863741, 863826, 863305, 861040, 856204, 848221, 836690, 821420, 802495, 780185, 754827, 726771, 696370, 664031, 630334, 596123, 562377, 529928, 499350, 471105, 445571, 422838, 402629, 384626, 368791, 355258, 343987, 334694, 327067, 320864, 315844, 311798, 308683, 306557, 305320, 304643, 304174, 303751, 303339, 302864, 302168, 301076, 299519, 297611, 295590, 293628, 291713, 289752, 287698, 285528, 283172, 280571, 277747, 274725, 271433, 267814, 263991, 260181, 256489, 252931, 249607, 246691, 244236, 242173, 240531, 239505, 239238, 239669, 240693, 242377, 244949, 248592, 253302, 258891, 265122, 271870, 279126, 286874, 295053, 303715, 313114, 323506, 334900, 347200, 360552, 375320, 391708, 409533, 428437, 448155, 468524, 489356]
50629D89356K1049K0977K0595J9929J9044J7860J6096J3501J0074N985J427l246
50617F52647p456j0704j2864j4086j4423j3852j2515j0715q652o398m112k086
50605E34784n28N24J024Q60j6j522l569o098q970j1928j4695j7049j8800j9786
50591D34231j9982j9491j8500j7175j5654j3997j2221j0406q694p136n634m139
50579B81202k745j498k62J085K422L558M492N345O086O548O656O464O017N388
50565C30758M759M235L648K820J959J476J416J417J257J110J137J145R08N41K97
50550C58883K15J67J84M15Q53J350J868K541L425M393N318O190P008P640P924
50535D08374P873P674P500P351P146O900O810P153Q154R785J1485J2069J0283
$$ y = [489356, 510405, 531382, 551977, 571906, 590950, 608810, 624906, 638407, 648481, 654466, 655893, 652647, 645191, 634487, 621623, 607537, 593114, 579262, 566747, 556032, 547380, 540982, 536870, 534784, 534256, 534780, 535804, 536664, 536648, 535126, 531557, 525459, 516489, 504561, 489866, 472817, 454017, 434231, 414249, 394758, 376258, 359083, 343429, 329432, 317211, 306805, 298111, 290975, 285341, 281202, 278457, 276959, 276697, 277782, 280204, 283762, 288254, 293599, 299685, 306233, 312889, 319353, 325370, 330758, 335517, 339752, 343400, 346220, 348179, 349655, 351071, 352488, 353745, 354855, 355992, 357137, 358045, 358586, 358883, 359098, 359265, 359449, 359864, 360717, 362067, 363935, 366476, 369901, 374294, 379612, 385802, 392810, 400450, 408374, 416247, 423921, 431421, 438772, 445918, 452818, 459628, 466781, 474935, 484720, 496205, 508274, 518557]
50522E18557N826j72n804r638j1343j1372j0388r001p649o452n258l971k741j771
50508D38823j054m36J64O71R80R70M88n62k087l883n806p800r776j1536j2899
50493C86257j3808j4309j4440j4229j3736j3060j2285j1459j0579r614q508p268
50481B42962o019m951m115l399k676j966j344p57p0P31J507K166K750L317L866
50466B32002M423N021N571N858N816N625N486N423N407N540N908O396O824P164
50452C12464P439P539P306O772O085N259M214L077K221J906K083K552L175L856
50438C75948M508N095N648O182O657P109P709Q645R986J1669J3515J5312J6887
50425D94870J8170J9130J9710J9883J9711J9235J8357J6950J5019J2637R816O595
$$ y = [518557, 524383, 524211, 518407, 508769, 497426, 486054, 475666, 466665, 459016, 452564, 447306, 443335, 440594, 438823, 437769, 437333, 437497, 438168, 439148, 440118, 440606, 440044, 437957, 434074, 428268, 420468, 410692, 399156, 386257, 372449, 358140, 343700, 329471, 315735, 302675, 290390, 278931, 268352, 258738, 250230, 242962, 236943, 231992, 227877, 224478, 221802, 219836, 218492, 217735, 217665, 218396, 219903, 222069, 224819, 228136, 232002, 236425, 241446, 247017, 252875, 258691, 264316, 269802, 275225, 280632, 286172, 292080, 298476, 305300, 312464, 319903, 327442, 334748, 341520, 347605, 352864, 357078, 360155, 362376, 364282, 366365, 368917, 372092, 375948, 380456, 385551, 391199, 397381, 404038, 411147, 418856, 427501, 437487, 449156, 462671, 477983, 494870, 513040, 532170, 551880, 571763, 591474, 610709, 629066, 646016, 661035, 673672, 683488, 690083]
50413F90083L183j90l518o892j0155j2931j5030j6593j7726j8285j8100j7219
50401E56627j5801j3937j1717r334o941m567k307m24R26K012L313M989O723Q041
50387E17603Q654Q432P233M934J606k424o731j0972j4896j8214k0582k1801k1980
50374D30862k1429k0420j9101j7631j6216j4960j3765j2486j1095r715q474p387
50362B58183o332n161l875k645j632p70J30J119K032K706L151L454L633L695L688
50347B61376L673L669L653L621L600L623L706L767L586K954J900P29k36q60j202
50332B97559j375j440j411j304j172j046q90o22k49J27M62Q76J465K151K812L471
50316B99414M235N073N878O674P576Q551R404J0028J0467J0747J0815J0673J0356
$$ y = [690083, 693266, 693076, 689558, 682666, 672511, 659580, 644550, 627957, 610231, 591946, 573846, 556627, 540826, 526889, 515172, 505838, 498897, 494330, 492023, 491599, 492525, 494537, 497850, 502839, 509562, 517603, 526257, 534689, 541922, 546856, 548462, 546038, 539307, 528335, 513439, 495225, 474643, 452842, 430862, 409433, 389013, 369912, 352281, 336065, 321105, 307340, 294854, 283759, 274044, 265570, 258183, 251851, 246690, 242815, 240170, 238538, 237768, 237898, 239017, 241049, 243755, 246906, 250360, 253993, 257688, 261376, 265049, 268718, 272371, 275992, 279592, 283215, 286921, 290688, 294274, 297228, 299128, 299857, 299621, 298761, 297559, 296184, 294744, 293333, 292029, 290857, 289811, 288921, 288299, 288050, 288177, 288639, 289515, 290980, 293131, 295943, 299414, 303649, 308722, 314600, 321274, 328850, 337401, 346805, 356833, 367300, 378047, 388862, 399535, 409891]
50303D09891R795Q857P621O322N002L408J382q92l145n346p582r784j1743j3355
50289D00431j4591j5366j5553j5160j4318j3156j1770j0251q670p014n276l520
50277B65786j810j49J437K825L916M751N403N788N725N130M078K670R67r24k794
50262C02799m408n622o424o865o995o882o733o849p380q092q554q537q150p602
50248B03706o962o228n426m595l766l015k456k075j708j248p73l73LM66R67J385
50232A67902J675J904K091K190K154K010J834J751J873K185K526K735K791K804
50218A98425K863K950K920K581J912J155O49N05N75O84P77Q31Q56R89J371J882
50202B21925K146J964J518J070O49J97j82l61m58p23j200j712k122k447k737k972
$$ y = [409891, 419686, 428543, 436164, 442486, 447488, 450896, 452278, 451386, 448241, 442895, 435313, 425529, 413786, 400431, 385840, 370474, 354921, 339761, 325443, 312287, 300517, 290266, 281596, 274582, 269306, 265786, 263976, 263827, 265264, 268089, 272005, 276756, 282159, 287947, 293672, 298802, 302880, 305550, 306517, 305593, 302799, 298391, 292769, 286345, 279480, 272485, 265603, 258870, 252021, 244641, 236549, 227995, 219458, 211308, 203706, 196744, 190516, 185090, 180495, 176729, 173714, 171258, 169183, 167475, 166227, 165454, 165081, 165084, 165550, 166517, 167902, 169577, 171481, 173572, 175762, 177916, 179926, 181760, 183511, 185384, 187569, 190095, 192830, 195621, 198425, 201288, 204238, 207158, 209739, 211651, 212806, 213455, 213960, 214535, 215219, 215996, 216827, 217683, 218672, 220043, 221925, 224071, 226035, 227553, 228623, 229272, 229469, 229287, 228926, 228468, 227745, 226545, 224833, 222711, 220264, 217527, 214555]
50186B14555l110l090k860k453k049j759j488j063m83J26P19J370K076K731L259
50171B06481L697M126M565M998N412N841O356P003P677Q156Q285Q076P562O745
50157B94980N748M901M447M254L991L505K907K245J319j67k259m615o672q032
50143C06552q726r035r057q641p721o570n540m754m221m028m200m440m369l908
50129B21342l302k734k173j597j080o83l96k45k57l38l21k03j59l20o55j065j481
50112B04333j826k058k199k280k269k214k299k590k811k641k210j968k081k233
50098A72654k132j886j743j719j703j693j694j557j141n92j84L1K49N60Q23R00
50082A59173Q67Q53Q45P18M80L09L38M87N19L40Q5n5o7p1j25j63j56j93l27m17
$$ y = [214555, 211445, 208355, 205495, 203042, 200993, 199234, 197746, 196683, 196200, 196326, 197045, 198415, 200491, 203222, 206481, 210178, 214304, 218869, 223867, 229279, 235120, 241476, 248479, 256156, 264312, 272597, 280673, 288235, 294980, 300728, 305629, 310076, 314330, 318321, 321826, 324733, 326978, 328297, 328130, 325871, 321256, 314584, 306552, 297826, 288791, 279734, 271093, 263372, 256802, 251262, 246508, 242287, 238259, 234059, 229619, 225250, 221342, 218040, 215306, 213133, 211536, 210456, 209773, 209377, 209132, 208875, 208537, 208216, 208013, 207854, 207534, 206879, 205814, 204333, 202507, 200449, 198250, 195970, 193701, 191487, 189188, 186598, 183787, 181146, 178936, 176968, 174887, 172654, 170522, 168636, 166893, 165174, 163471, 161778, 160084, 158527, 157386, 156794, 156610, 156641, 156890, 157450, 158273, 159173, 160040, 160893, 161738, 162456, 162936, 163245, 163583, 164070, 164589, 164929, 165014, 164959, 164892, 164821, 164696, 164533, 164377, 164184, 163857, 163440]
50062A63440k28L13R72J421J567J670K018K591L110L481L945M709N621O406P087
$$ y = [163440, 163212, 163525, 164497, 165918, 167485, 169155, 171173, 173764, 176874, 180355, 184300, 189009, 194630, 201036, 208123]
$$ [...]
##END NTUPLES=NMR SPECTRUM
##END=
