##TITLE=AC1534_ROEFFECT0009_8214376_YM702Qd0Co
##JCAMPDX= 6.0         $$ Bruker NMR JCAMP-DX V2.0
##DATA TYPE= NMR SPECTRUM
##DATA CLASS= NTUPLES
##ORIGIN= BRUKER
##OWNER= Administrator
$$ 1.72 TOPSPIN		Version 2.1
$$ 2014-08-01 14:30:40.595 -0700  Administrator@X
$$ Compression mode = diff/dup
##.OBSERVE FREQUENCY= 400.02188249412
##.OBSERVE NUCLEUS= ^1H
##.ACQUISITION MODE= SIMULTANEOUS (DQD)
##.ACQUISITION SCHEME= undefined
##.AVERAGES= 8
##.DIGITISER RES= 22
##SPECTROMETER/DATA SYSTEM= spect
##.PULSE SEQUENCE= zg30
##.SOLVENT NAME= COFFEE_meoh
##.SHIFT REFERENCE= INTERNAL, COFFEE_meoh, 1, 14.98509
##AUDIT TRAIL= $$ (NUMBER, WHEN, WHO, WHERE, PROCESS, VERSION, WHAT)
$$ ##TITLE= Audit trail, TOPSPIN		Version 2.1
$$ ##JCAMPDX= 5.01
$$ ##ORIGIN= Bruker BioSpin GmbH
$$ ##OWNER= Administrator
$$ $$ E:\/data/COFFEE/nmr/AC1534_ROEFFECT0009_8214376_YM702Qd0Co/30/pdata/1/auditp.txt
$$ ##AUDIT TRAIL=  $$ (NUMBER, WHEN, WHO, WHERE, PROCESS, VERSION, WHAT)
(   1,<2014-08-01 14:30:33.780 -0700>,<Administrator>,<X>,<go>,<TOPSPIN 2.1>,
      <created by zg
	started at 2014-08-01 14:29:28.005 -0700,
	POWCHK enabled, PULCHK disabled,
       configuration hash MD5:
       16 EA D6 F4 BB 67 03 14 9B FF E7 A0 43 5B 48 2E
       data hash MD5: 64K
       B1 75 A8 65 38 E5 56 8B B6 49 69 92 46 B2 AE DE>)
(   2,<2014-08-01 14:30:36.781 -0700>,<Administrator>,<X>,<proc1d>,<TOPSPIN 2.1>,
      <Start of raw data processing
       efp LB = 0 FT_mod = 6 PKNL = 1 PHC0 = 0 PHC1 = 0 SI = 32K 
       data hash MD5: 32K
       3C E6 A3 A2 55 91 A8 33 0C 8D E6 7A 84 9E 70 B2>)
(   3,<2014-08-01 14:30:37.072 -0700>,<Administrator>,<X>,<proc1d>,<TOPSPIN 2.1>,
      <pk PHC0 = 92.02698 PHC1 = 0 
       data hash MD5: 32K
       5F 48 9D C9 C7 98 40 D8 B2 C0 80 90 7B 9E 6A 19>)
(   4,<2014-08-01 14:30:37.179 -0700>,<Administrator>,<X>,<proc1d>,<TOPSPIN 2.1>,
      <abs ABSG = 1 
       data hash MD5: 32K
       03 9A 78 E0 34 17 85 CF 60 FD AA F4 32 5B 57 B0>)
(   5,<2014-08-01 14:30:37.241 -0700>,<Administrator>,<X>,<proc1d>,<TOPSPIN 2.1>,
      <abs ABSG = 2 
       data hash MD5: 32K
       5F 2D 88 F1 75 2D 1E 28 B0 8F 41 D0 E4 85 28 CB>)
(   6,<2014-08-01 14:30:37.333 -0700>,<Administrator>,<X>,<proc1d>,<TOPSPIN 2.1>,
      <abs ABSG = 3 
       data hash MD5: 32K
       6A 6A 1D D7 6F 82 B9 C7 28 D4 9A E8 EF A3 95 97>)
(   7,<2014-08-01 14:30:37.425 -0700>,<Administrator>,<X>,<proc1d>,<TOPSPIN 2.1>,
      <abs ABSG = 4 
       data hash MD5: 32K
       6B A6 5F 3E 66 6F 93 C7 D7 81 30 0C 64 B5 A4 DD>)
(   8,<2014-08-01 14:30:37.486 -0700>,<Administrator>,<X>,<proc1d>,<TOPSPIN 2.1>,
      <abs ABSG = 5 
       data hash MD5: 32K
       CB 2E 0F 88 4B 92 B4 E2 BD FB 7A 15 89 FF E0 67>)
$$ ##END=
$$ 
$$ $$ hash MD5
$$ $$ 56 32 DF E0 5E 83 88 40 65 FE C2 F5 BF 65 B7 6F
##$RELAX= 
##$RELAX= 
##$RELAX= 
##$RELAX= 
##$RELAX= 
##$RELAX= 
##$RELAX= 
$$ Bruker specific parameters
$$ --------------------------
##$DU= <E:\>
##$EXPNO= 30
$$ [...]
##$TP= (0..7)
150 150 150 150 150 150 150 150
##$TP07= 0
##$TPNAME0= <>
##$TPNAME1= <>
##$TPNAME2= <>
##$TPNAME3= <>
##$TPNAME4= <>
##$TPNAME5= <>
##$TPNAME6= <>
##$TPNAME7= <>
##$TPOAL= (0..7)
0.5 0.5 0.5 0.5 0.5 0.5 0.5 0.5
##$TPOFFS= (0..7)
0 0 0 0 0 0 0 0
##$TUNHIN= 0
##$TUNHOUT= 0
##$TUNXOUT= 0
##$USERA1= <user>
##$USERA2= <user>
##$USERA3= <user>
##$USERA4= <user>
##$USERA5= <user>
##$V9= 5
##$VALIST= <valist>
##$VCLIST= <CCCCCCCCCCCCCCC>
##$VD= 0
##$VDLIST= <DDDDDDDDDDDDDDD>
##$VPLIST= <PPPPPPPPPPPPPPP>
##$VTLIST= <TTTTTTTTTTTTTTT>
##$WBST= 1024
##$WBSW= 4
##$XGAIN= (0..3)
0 0 0 0
##$XL= 0
##$YL= 0
##$YMAX_a= 596662
##$YMIN_a= -512876
##$ZGOPTNS= <>
##$ZL1= 120
##$ZL2= 120
##$ZL3= 120
##$ZL4= 120
##$ABSF1= 14.98509
##$ABSF2= -5.573092
##$ABSG= 5
##$ABSL= 3
##$ALPHA= 0
##$AQORDER= 0
##$ASSFAC= 0
##$ASSFACI= 0
##$ASSFACX= 0
##$ASSWID= 0
##$AUNMP= <proc_prof1d_extract_pilot.lims>
##$AXLEFT= 0
##$AXNAME= <>
##$AXNUC= <1H>
##$AXRIGHT= 0
##$AXTYPE= 0
##$AXUNIT= <>
##$AZFE= 0.1
##$AZFW= 0.1
##$BCFW= 0
##$BC_mod= 0
##$BYTORDP= 0
##$COROFFS= 0
##$CY= 15
##$DATMOD= 1
##$DC= 0
##$DFILT= <>
##$DTYPP= 0
##$F1P= 0
##$F2P= 0
##$FCOR= 0.5
##$FTSIZE= 32768
##$FT_mod= 6
##$GAMMA= 0
##$GB= 0
##$INTBC= 1
##$INTSCL= 1
##$ISEN= 128
##$LB= 0
##$LEV0= 0
##$LPBIN= 0
##$MAXI= 10000
##$MC2= 0
##$MEAN= 0
##$ME_mod= 0
##$MI= 0
##$NCOEF= 0
##$NC_proc= -8
##$NLEV= 6
##$NOISF1= 0
##$NOISF2= 0
##$NSP= 0
##$NTH_PI= 0
##$NZP= 0
##$OFFSET= 14.98509
##$PC= 1
##$PHC0= 92.02698
##$PHC1= 0
##$PH_mod= 1
##$PKNL= yes
##$PPARMOD= 0
##$PPDIAG= 0
##$PPIPTYP= 0
##$PPMPNUM= 2147483647
##$PPRESOL= 1
##$PSCAL= 4
##$PSIGN= 0
##$PYNMP= <proc.py>
##$REVERSE= no
##$SF= 400.02
##$SI= 32768
##$SIGF1= 0
##$SIGF2= 0
##$SINO= 400
##$SIOLD= 32768
##$SPECTYP= <>
##$SREGLST= <1H.CDCl3>
##$SSB= 0
##$STSI= 32768
##$STSR= 0
##$SW_p= 8223.68421052631
##$SYMM= 0
##$S_DEV= 0
##$TDeff= 65536
##$TDoff= 0
##$TI= <>
##$TILT= no
##$TM1= 0
##$TM2= 0
##$TOPLEV= 0
##$USERP1= <user>
##$USERP2= <user>
##$USERP3= <user>
##$USERP4= <user>
##$USERP5= <user>
##$WDW= 1
##$XDIM= 32768
##$YMAX_p= 460586582
##$YMIN_p= -698187
##$CURPLOT= <Network HP LaserJet P1505>
##$CURPRIN= <$Network HP LaserJet P1505>
##$DFORMAT= <normdp>
##$LAYOUT= <+/1D_H.xwp>
##$LFORMAT= <normlp>
##$PFORMAT= <normpl>
##$SURQMSG= 1
$$ End of Bruker specific parameters
$$ ---------------------------------
##NTUPLES= NMR SPECTRUM
##VAR_NAME=  FREQUENCY,     SPECTRUM/REAL,   SPECTRUM/IMAG
##SYMBOL=    X,             R,               I
##VAR_TYPE=  INDEPENDENT,   DEPENDENT,       DEPENDENT
##VAR_FORM=  AFFN,          ASDF,            ASDF
##VAR_DIM=   32768,         32768,           32768
##UNITS=     HZ,            ARBITRARY UNITS, ARBITRARY UNITS
##FACTOR=    0.250966925370066, 1,           1
##FIRST=     8223.43324360094, -204262,      -82655
##LAST=      0,             -9335,           -62707
##MIN=       0,             -698187,         0
##MAX=       8223.43324360094, 460586582,    0
$$ Real data points
##PAGE= N=1
##DATA TABLE= (X++(R..R)), XYDATA
$$ [...]
19505a33116I090f4309K5260j88947K3931e2786j14086j14213D1768c21478C3043
19493a65672b4453j53360f5224I6595A5004J48025B8609f7555I7074O2717J46016
19482C05807b01585b1871N768B36345A4401b49811O2803l3712Q1666j79000D7354
19470g4048L2691B25762J14351D8794J3786b08390L7545M4293B7287g1721b6270
19458f5247B244J95272b70145a14845r7881e1853l03801J55033o7225b3014k19233
19447b42247B4202a06500A80342B6135M44684r9056j77826a63968j69866a11292
19436a48705B09806a28215A60440a70827e6966i764j40607j3747j25466g2265
19425d2563l89511a11566C65649i9203k54926g6744k4039J9314k56870E163b95551
$$ y = [-133116, 9090, -64309, -39049, -227996, -204065, -52786, -166872, -281085, 41768, -321478, 33043, -165672, -24453, -177813, -65224, 96595, 15004, 163029, 28609, -67555, 97074, 159791, 305807, -201585, -21871, -16103, 236345, 14401, -249811, -187008, -220720, -139054, -318054, 47354, -74048, -41357, 225762, 340113, 48794, 62580, -208390, -170845, -126552, 27287, -71721, -26270, -65247, 2244, 197516, -270145, -114845, -212726, -51853, -355654, -200621, -267846, -23014, -242247, 24202, -106500, 180342, 26135, 470819, 371763, 193937, -163968, -333834, -111292, -148705, 209806, -128215, 160440, -170827, -56966, -9764, -150371, -164118, -289584, -72265, -42563, -432074, -111566, 365649, -99203, -354129, -76744, -100783, -81469, -338339, 5163, -295551]
19413I6728l7924N9851J18625k1122o6471C4616b69733d9680C8879a92139i0066
19401b39936D9956L2992o149f252j71064J7722f3833j33528d0214D25710a41575
19389F4589a65068C177d5453l0750B23855h5204A18524a14863B5065C580N2518
19378E6098a08129K9344o1639j212j59065A24827e7999o6929B3050P0077d59161
19366C09980E9226a0115A76337o3131L5067b03007b1000j28267N9400k15815c1184
19354A0122M5223B4978d7918j11571D8631b87989G1421B3626b68617J20099D2468
19342a82485j32392b0564j00228D54951j84865I9341f98187A03954L12049i3714
19331a76380o3691m06476h5150A9898i3581B23868F966e1407l54502a61102l5115
$$ y = [96728, 58804, 118655, 237280, 216158, 149687, 34616, -269733, -49680, 38879, -192139, -90066, -239936, 49956, 82948, 76799, -6252, -177316, -159594, -63833, -197361, -40214, 425710, -141575, 64589, -165068, 3177, -45453, -76203, 223855, -85204, 118524, -114863, 25065, 3580, 56098, -108129, -78785, -140424, -141636, -300701, 124827, -57999, -124928, 23050, 93127, -459161, 309980, 59226, -10115, 176337, 113206, 148273, -203007, -21000, -149267, -89867, -305682, -31184, 10122, 55345, 24978, -47918, -159489, 48631, -287989, 71421, 23626, -268617, -148518, 42468, -182485, -314877, -20564, -120792, 454951, 270086, 99341, -698187, 103954, 416003, -93714, -176380, -240071, -646547, -85150, 19898, -93581, 223868, 6966, -51407, -405909, -161102, -196217]
19320a96217A56041i8008c8046k5708r0468A28409b20846D5428L8262c8165p1088
19309a09253D1840a69426H6734e0907m7644A48430J00879f2664B76557C9813a00591
19297H4899D0987J08376C9297a90643B00539B0060c39740J1584i5736B25683c21364
19285f3864k2964A72945b27451j06095A85736b08830R3746N7114H378M658a65934
19273A92116f7167b3155p9616q0256G3455b12863j18866J11775B69403b21861
19262a99640F04714b1917l3812A0864a78900M7166A70508b82752a23565H6862
19251d63644b8392H1060G671e0685B5942b0790q9315L9222q253A87433d2569k74489
19239c17058B35577b28981F9821d70802d2120k65301h4815A38278c16730a33277
$$ y = [-196217, 156041, -98008, -38046, -63754, -154222, 128409, -220846, 45428, 83690, -38165, -109253, 41840, -169426, 86734, -50907, -98551, 148430, 249309, -62664, 276557, 39813, -100591, 84899, 40987, 149363, 39297, -190643, 200539, 20060, -339740, -328156, -95736, 225683, -321364, -63864, -86828, 172945, -227451, -333546, 185736, -208830, -115084, -57970, 8378, 13036, -165934, 192116, -67167, -23155, -102771, -183027, 73455, -212863, -331729, -219954, 269403, -221861, -199640, 604714, -21917, -55729, 10864, -178900, -131734, 170508, -282752, -123565, 86862, -463644, -28392, 81060, 7671, -50685, 25942, -20790, -110105, -70883, -79136, 187433, -42569, -317058, 235577, -228981, 69821, -470802, -42120, -307421, -84815, 138278, -316730, -133277]
19228b3124B40374h7095A2173a36106l60435A6872n531a99919L5572f3516A20465
19216H0295g5797k37012A37527J17196A09419a36395C9227a10674L1972c4547
19205a10886K7863j0869A91750a02815b9561k67347f7674A91116b7156j02592
19195a29748j19865g35q4217A86217b77860A74530c25670a11811j37107j4578
19185b63496C81607f8913I5326j0759b76555a36510A51252E1131g1543R797G3993
19173E5575B430f7285j87709B75210A13075n1467a53485l45275A36116b42302
19162a55149c5604j34939A09775c9968l68463I3150J32347H0831a00508j79131
19152b79639a26480A96392b44637I7061c30787a29206r4592e9064E493K06479
$$ y = [-23124, 240374, -87095, 12173, -136106, -496541, 16872, 11341, -199919, -164347, -63516, 120465, 80295, -75797, -312809, 137527, 254723, 109419, -136395, 39227, -110674, -78702, -34547, -110886, -83023, -93892, 191750, -102815, -29561, -296908, -67674, 191116, -27156, -129748, -249613, -735, -84952, 186217, -277860, 174530, -325670, -111811, -248918, -263496, 381607, -68913, 95326, 84567, -276555, -136510, 151252, 51131, -71543, -61746, 73993, 55575, 2430, -67285, -254994, 275210, 113075, 61608, -153485, -498760, 136116, -242302, -155149, -35604, -170543, 109775, -39968, -408431, 93150, 225497, 80831, -100508, -279639, -126480, 196392, -244637, 97061, -330787, -129206, -223798, -59064, 5493, 211972]
19142B11972F8218c8284k12883p6136A89763a3295B8698J68757b64818A81243
19131b01277G9978a99100L0395C5483e6006l22379a23919k79316c6118j84951
19121b21069Q667r294A62342a81562I6558b82601a00045j76229A36597a0489p5248
19110h5737o4696M4342C3789N9185b44151L1491h67C2524a31485p1103G4906K45854
19098C20760b0317j88879e7342n06950a25304L9149l36892a34137B0129a978r3080
19087i5058B21560c12897C7957L67647j72200J72995b24270A06685a59233C67271
19076b13786A21706j6551a18583M9182D3704a21542M8312j90093A16463E3751
19065a07986c0109A39304f9768A2849a64607E069d8726I9477f6817G1360K903
$$ y = [211972, 68218, -38284, -251167, -327303, 189763, -13295, 28698, 197455, -264818, 181243, -201277, 79978, -199100, -168705, 35483, -56006, -378385, -123919, -403235, -36118, -221069, -212402, -221696, 162342, -181562, 96558, -282601, -100045, -276274, 136597, -10489, -85737, -150433, -106091, 33789, 92974, -244151, -212660, -867, 32524, -131485, -202588, 74906, 320760, -20317, -209196, -57342, -564292, -125304, -86155, -423047, -134137, 20129, -1978, -95058, 221560, -312897, 37957, 405604, 233404, 406399, -224270, 106685, -159233, 367271, -213786, 121706, 105155, -118583, -69401, 43704, -121542, -73230, -263323, 116463, 53751, -107986, -30109, 139304, -69768, 12849, -164607, 5069, -48726, 99477, -66817, 71360, 74263]
19054G4263J42047b35701R4126M2701f729j47291A1875h2919O710C7612I8a95675
19041B09011d00645J34266E3152a25767B1220M9505a87776d1582L113H3334l3674
19030D9660a10277M079H6808b02895D454e66433i572r529l2740B24541G8887d03390
19017a69988L1342k44665E7443I333f4055j49678C14576c46358C01724l2144a26592
19005a09197J8973a5845j43237L4664B637a85180E4900j1438N2149A4977J15314
18994A30291L5840h0905A07796N8440c07668e1430j0458A49026g3690j96759l3927
18983c04376J22794m9921P9004c4219A44795a1612C5610a34009A31421R0833a88797
18971a80265f6583J2931k539m5017j35173J11956B7596h8409A02762B9156J56943
$$ y = [74263, 216310, -235701, -141575, -98874, -6729, -154020, 11875, -82919, -76209, 37612, 98, -195675, 209011, -400645, -266379, 53152, -125767, 21220, 70725, -187776, -41582, -38469, 83334, 49660, -110277, -106198, 86808, -202895, 4454, -566433, -9572, -19101, -51841, 224541, 78887, -403390, -169988, -138646, -383311, 57443, 9333, -64055, -213733, 314576, -346358, 301724, 269580, -126592, -109197, -90224, -15845, -159082, -124418, 2637, -185180, 54900, 43462, 95611, 14977, 130291, 166131, -80905, 107796, 166236, -307668, -51430, -61888, 149026, -73690, -270449, -304376, -181582, -231503, -152499, -34219, 144795, -11612, 35610, -134009, 131421, 222254, -188797, -180265, -66583, -53652, -56191, -101208, -236381, -124425, 27596, -88409, 102762, 29156, 186099]
18960A86099a68969k92686O9858a75046F7019K2435a80639H4679J30441b93936
18949a41512C4785J58672a41846o5516j25146M1535g2363E964a05138b0780r9748
18938a20528L1623C3818a36837d3986j22421b3767C77016A4656K55673a68385
18927b6387D6015a73915b9357j40766c6780j10715A73884b3013A78980b12231
18916a93218R2705a3994E5904c4004k1818A90324b42957B18524r8223K26008I072
18904a12270q207A68799a54891A2170b55419D5450J20180a26101l44911G3333
18893a73228k1935A28144M1255b85324C4160a42958d1930A18873a68092A8079
18882a49132M6865k81992d7930A71601f1865a0292C1964N335a25111O2220k7675
$$ y = [186099, -168969, -461655, -391797, -175046, 67019, 89454, -180639, 84679, 215120, -293936, -141512, 34785, 193457, -141846, -207362, -332508, -290973, -72363, 5964, -105138, -20780, -120528, -88905, 33818, -136837, -43986, -166407, -23767, 377016, 14656, 270329, -168385, -26387, 46015, -173915, -29357, -170123, -36780, -147495, 173884, -23013, 178980, -212231, -193218, -100513, -13994, 55904, -34004, -55822, 190324, -242957, 218524, 120301, 346309, 9072, -112270, -120477, 168799, -154891, 12170, -255419, 45450, 165630, -126101, -471012, 73333, -173228, -195163, 128144, 169399, -285324, 34160, -142958, -41930, 118873, -168092, 18079, -149132, -102267, -384259, -47930, 171601, -61865, -10292, 31964, 37299, -125111, -62891, -90566]
18871i0566H1839a36910A77801p3302J02189e5622j9973m0096j38991A21650C8754
18859a7750m2148l43149C0868g9050j75586R578L7653h4697A00365b4128q5682
18848a09810G5109b15853f9831n394f113k22974g7335J6500j45606g0834j95540
18837b66374L1232F2319K56043a44057g0755C6981c54635e1183j95819A59156
18826b18994Q6778c6638C9895Q0935g5660H0071a08955M4699F390c23912I762
18814b22644h0047F0626f1087B46768a09055A39972o6004a72900e4602j66157
18804b20759M1660K389e9438b4231j05574N7145B59339m2682B5053b32139A47696
18792A49437E4376a69863C28022j03818O2124b79466A78986B3989K12964J24374
$$ y = [-90566, 81839, -136910, 177801, 104499, 206688, -55622, -75595, -115691, -254682, 121650, 38754, -17750, -59898, -403047, 30868, -79050, -254636, -245058, -207405, -84697, 100365, -24128, -109810, 75109, -215853, -69831, -75225, -6113, -229087, -77335, -60835, -206441, -70834, -266374, -235142, 62319, 318362, -144057, -70755, 36981, -354635, -51183, -247002, 159156, -218994, -132216, -36638, 39895, 120830, -75660, 80071, -108955, -64256, 6390, -323912, 9762, -222644, -80047, 60626, -61087, 246768, -109055, 139972, 73968, -172900, -54602, -220759, -179099, -176710, -59438, -24231, -129805, -72660, 259339, 216657, 25053, -232139, 147696, 149437, 54376, -169863, 328022, 224204, 286328, -279466, 178986, 23989, 236953, 361327]
18782C61327a64032Q0744G1800b8330D6550K4330K5020c5442k34186F3703j9082
18771D4621a6271F7883i4092j21414D7248a09938l57427g2064k6016k2258j79688
18760c00026B04891F9742b29667E09520G9635A2735d7358H3335h6016o8925q7547
18749b42488j38415R6527a05740B34426E578g4342A22081N4607O1406a11063j21742
18738b32805d8150a9862D7332a6827K536l53983C19971c24337a51859B46846b48733
18726E8880b00087B75320d3604C689b83955J34937N4034L5831l07317B4884e6517
18714C50502a16203D3030h5686h371H432l672a05753e1936p678j75995b6538j77815
18702b04353d7614r5559k10582H1805R7510c1129k15118B2414b2103j18501j21685
$$ y = [361327, -164032, -83288, 71800, -28330, 46550, 70880, 95900, -35442, -269628, 63703, 44621, -16271, 67883, -94092, -215506, 47248, -109938, -467365, -72064, -98080, -120338, -300026, 204891, 69742, -229667, 509520, 79635, 12735, -47358, 83335, -86016, -154941, -242488, -380903, -284376, -105740, 234426, 5578, -74342, 122081, 176688, 238094, -111063, -232805, -48150, -19862, 47332, -16827, -14291, -368274, 319971, -324337, -151859, 246846, -248733, 58880, -200087, 275320, -43604, 3689, -283955, -149018, -94984, -59153, -366470, 24884, -56517, 350502, -116203, 43030, -85686, -8371, 8432, 4760, -105753, -51936, -59614, -235609, -26538, -204353, -47614, -143173, -353755, 81805, 179315, -31129, -246247, 22414, -22103, -140604, -262289]
18691b62289B56960f1844l45281A03249a92462q2453J34814j65440g8219j5308
18681i3527j514M0185D512c16281a1406n8320G9646g3910l7468D1361H447c40947
18668h6581k45451B44738D143K26926b79105a08592K097a414C24538a93875n8581
18657b52456i2089C0209K57162A12704M0278l4487g3076j43474B061g4905n9815
18646a34720j26657N7949A11293a23733A07286b07995f2211j7072m22668D67269
18635g7321c477k65233E3915J3149b09950h6398l00040a44551C0808a29140D1363
18623b5589l54340h331k51760C7531b80481H4048k8217A2365a97245K3170j38576
18612c12651C509h6939C7033N6381a21175b3711q8834j3883h643j2414E3757c1433
$$ y = [-262289, 256960, -61844, -407125, 103249, -192462, -274915, -140101, -305541, -78219, -93527, -95041, -54856, 4512, -316281, -11406, -69726, 79646, -73910, -111378, 41361, 8447, -340947, -86581, -332032, 244738, 4143, 231069, -279105, -108592, -106495, -1414, 324538, -193875, -252456, -92089, 30209, 287371, 112704, 152982, 118495, -73076, -216550, 2061, -74905, -134720, -261377, -203428, 111293, -123733, 107286, -207995, -62211, -79283, -501951, 467269, -77321, -3477, -268710, 53915, 67064, -209950, -86398, -386438, -144551, 30808, -129140, 41363, -25589, -379929, -8331, -260091, 37531, -280481, 84048, 55831, 12365, -197245, -174075, -312651, 3509, -86939, 37033, 93414, -121175, -23711, -112545, -126428, -8643, -21057, 53757, -31433]
18599b04159e361A36567b33484q5834J32556o8166A22141h6233j03480c4607D06154
18587B8328a94224A71155h9717K206C05694A46015b9632g852k77201e1544A50465
18575A01676Q5868c7167j30969l8316F8722c07631D2633M0700k3283b29649i8841
18563A87191C3786d1812k81250B15227a62312k17343J81582n1324b3534d335j37896
18552a42231H9970a30595H4062i9517G491a6088A0861O1641L9915c9278l47294
18541c86572a80375j51951P1892Q9464f0865p919C10648b00603p0871o965R4880
18530a83559B30639b2519o8078F010b24195c3050m7932A30580a65009k40330B09101
18518e046k32725d940C61526b0892A64621g9457R578q0369B26917a00352j32070
$$ y = [-204159, -5361, 136567, -233484, -319318, -186762, -254928, 122141, -86233, -189713, -34607, 406154, 28328, -194224, 171155, -89717, -87511, 305694, 146015, -29632, -7852, -285053, -51544, 150465, 101676, 187544, -37167, -168136, -206452, 68722, -307631, 42633, 83333, 60050, -229649, -98841, 187191, 33786, -41812, -323062, 215227, -162312, -379655, -198073, -249397, -23534, -4335, -142231, 89970, -130595, 84062, -99517, 7491, -16088, 10861, 72502, 112417, -39278, -386572, -180375, -332326, -260434, -170970, -60865, -68784, 310648, -200603, -271474, -278439, -183559, 230639, -22519, -90597, 6010, -224195, -33050, -80982, 130580, -165009, -405339, 209101, -5046, -237771, -4940, 361526, -20892, 164621, -79457, -69879, -150248, 226917, -100352, -232422]
18507b32422B50652A1478a44303d9111j18744K6758N2135q3647A50692m3384b18242
18495a89392B9969J8118m733M8140J10611a06499k11881g5947A55175d2211l6700
18484g8911o6209E7194g9211o1490B4859b79814h3217f691D6224a49982B1119
18472C23876A1556a18405c8607A10412e0664D0045P0399K3083c37980B11429b8654
18460d0222A02586a30910I3248h3209D5933a95773A49078a72205r9748g9044q08
18449g9852a8001l8145b7449j43673g1708k40087a45886j7790k967f518I3069
18437a15960c3675l2554j194J4689k5762J1224A2045M3953a01572B1355N5061
18426G6416b5527b240k10978e7318A51345a23111e677B30869H216b08460b1915
$$ y = [-232422, 250652, 11478, -144303, -49111, -167855, -141097, -88962, -172609, 150692, 107308, -218242, -189392, 29969, 48087, 43354, 91494, 202105, -106499, -318380, -75947, 155175, -42211, -78911, -145120, 57194, -79211, -140701, 24859, -279814, -83217, -6691, 46224, -149982, 21119, 323876, 11556, -118405, -38607, 110412, -50664, 40045, 110444, 133527, -337980, 211429, -28654, -40222, 102586, -130910, 93248, -83209, 45933, -195773, 149078, -172205, -271953, -79044, -79852, -18001, -56146, -27449, -171122, -71708, -311795, -145886, -163676, -166643, -6518, 93069, -115960, -33675, -66229, -67423, -52734, -78496, -67272, 12045, 55998, -101572, 21355, 76416, -25527, -2240, -213218, -57318, 151345, -123111, -5677, 230869, 8216, -208460, -21915]
18414a24360d40j09849j1780r0301m5088M3269K4245Q8404p3203G527e0434k4779
18402g5213H7032e3956A41172K7497b37510o3042d1695Q883n2907L5656F8051
18390c27975e4412a7439n120p6080k6690L4130L5472j56447C9599b78131d9418
18378a56448A35196f2672A41163D2111J58252a70954G4493a99186j59921b6767
18367c0912I8792M4648f8111A85738l2392i5972F4707B8599g6075r9401A2934
18355C2402J05370c28557B0827a45687j49770D5367a11055B57859a23990A51024
18344B78073G5655e678l0616B33508r8093K1151J16953a7938k3016A29687j8927
18333A10760k2138b89021E0829d05229E7172a99713I0708g2699c653j13060m0929
$$ y = [-124360, -440, -110289, -122069, -212370, -257458, -214189, -189944, -101540, -174743, 7527, -50434, -75213, 87032, -53956, 141172, 168669, -237510, -300552, -41695, -32812, -85719, -50063, 68051, -327975, -54412, -17439, -22559, -98639, -125329, -91199, -55727, -212174, 39599, -278131, -49418, -156448, 135196, -62672, 141163, 42111, 200363, -170954, 74493, -199186, -359107, -26767, -30912, 98792, 143440, -68111, 185738, 153346, -95972, 64707, 28599, -76075, -175476, 12934, 32402, 137772, -328557, 20827, -145687, -295457, 45367, -111055, 257859, -123990, 151024, 278073, 75655, -5678, -36294, 233508, 135415, 156566, 273519, -17938, -40954, 129687, 110760, 88622, -289021, 50829, -405229, 57172, -199713, 90708, -72699, -3653, -116713, -157642]
18322a57642N752a591j26177B71818D2912L1208f8412j65B36848b34334D4174
18310a12104L660B0445q964b32419p1786g8753k05584k9093e0748A3029a1651
18298b13524j55147F4249b71449R7519A4613e4350A79600d38416a72899I6202
18287h9396A44986a53391f1663J1582o6254G5488g1742k92881C34389f0454A239
18275E1952c0098m90167d4214C624H77i7430c3210A5963a09181e2257B97934j20601
18263A77333g9446A45660c77947i428q9844B63790a21820C04914c09013H222b11811
18251b90961j27559a16867A541J443a08809B66371a01936a9221B27003a07074
18240i515j23806j19676L5337O7840f0424j3004n012A55958a83226B14532b6316
$$ y = [-157642, -151890, -1591, -127768, 271818, 42912, 74120, -68412, -68577, 236848, -234334, 44174, -112104, -108444, 20445, 11481, -232419, -304205, -78753, -284337, -313430, -50748, 13029, -11651, -213524, -368671, 64249, -271449, -173930, 14613, -54350, 179600, -438416, -172899, 96202, -89396, 144986, -153391, -61663, -50081, -116335, 75488, -71742, -364623, 334389, -60454, 1239, 51952, -30098, -520265, -44214, 3624, 877, -97430, -33210, 15963, -109181, -52257, 297934, 177333, -79446, 145660, -377947, -9428, -99272, 263790, -121820, 304914, -309013, 8222, -211811, -290961, -418520, -116867, 1541, 2984, -108809, 266371, -101936, -19221, 227003, -107074, -9515, -133321, -252997, -217660, -149820, -60424, -73428, -78440, 155958, -183226, 214532, -26316]
18228a52231f5904B54942a14614a7614B06200b05342L7438B22739b87089B30300
18217a6000F6301N8918b6943E9576a2663k49122j5523C6898P6560a91639j6832
18206b08471k56114a68962N1715G1924g6386l13595e2319G926b31672A30421c6398
18194a57556B7726c3990l02214A05715a51644A50664a16946m3593D0172P0440
18184A10612n4403f7353L1567C61694D5853a80285a4640F7437J19753h3061j44901
18173b27962A29585f9663B53599c22589b4587A15148C8694a712j40769C04606
18162A79800b16604f5371C6316b96771C35119A32575k675a45769A15335h4805
18151f0026B652J15329O649a6193A67708h4071q9263c0141k38892a13662n7379
$$ y = [-152231, -65904, 254942, -114614, -17614, 206200, -205342, -167904, 222739, -287089, 230300, -16000, 66301, 125219, -26943, 59576, -12663, -261785, -277308, 36898, 113458, -191639, -208471, -464585, -168962, -117247, 71924, -76386, -389981, -52319, 7926, -231672, 130421, -36398, -157556, 27726, -33990, -336204, 105715, -151644, 150664, -116946, -160539, 40172, 110612, 56209, -67353, -35786, 361694, 45853, -180285, -14640, 67437, 187190, -83061, -227962, 129585, -69663, 253599, -322589, -24587, 115148, 38694, -1712, -142481, 304606, 179800, -216604, -65371, 36316, -296771, 335119, 132575, 129900, -145769, 115335, -84805, -60026, 2652, 117981, 124630, -16193, 167708, -84071, -173334, -30141, -269033, -113662, -171041]
18140a71041m8124j25378b9343m50442B3279a32158a3375E1704h9077C9956a97346
18128C36M5899a19268k69343G7651a65952P9879c3903n3880B9026J75696n236
18117A99486a43558G085e8401r0736j20503J8894F773c1772B76748h4551j54948
18106b39499A39674L2972c13537C5618b39454j27863A99264b77540E5186a28135
18095A86341a91365B20887a15436C0952O1581K08622j28340e6196H7930b1948
18084d3691a2221l8867A55415h7050l64957A67715b63130A21596c71689a65172
18073B14105K40490A36930c8775G7147h2866j7636q6021l8112b0402j75207g0588
18061e3117k73032a02919A07171i0948b8553k65090B91526A33409K2120K35543
$$ y = [-171041, -219165, -344543, -29343, -479785, 23279, -132158, -13375, 51704, -89077, 39956, -197346, 336, 46235, -119268, -388611, 77651, -165952, -86073, -33903, -87783, 29026, 204722, 199486, -143558, 7085, -58401, -149137, -269640, -250746, 6773, -31772, 276748, -84551, -239499, 139674, 172646, -313537, 35618, -239454, -367317, 199264, -277540, 55186, -128135, 186341, -191365, 220887, -115436, 30952, 92533, 301155, 172815, -56196, 87930, -21948, -43691, -12221, -51088, 155415, -87050, -452007, 167715, -263130, 121596, -371689, -165172, 214105, 454595, 136930, -38775, 77147, -82866, -100502, -186523, -224635, -20402, -195609, -70588, -53117, -326149, -102919, 107171, -90948, -28553, -293643, 291526, 133409, 155529, 391072]
18051C91072j79684C1578a03757D4450b7714H1631d54925D11086e68585E8161
18040a24935o3235c658A52279b82339J07792J7986I5478n395j1277N3449E3700
18028A05278M3044l8459a36118B9555L7144e3044q8705A14644a82383F2836O01396
18017F64232I8635M9765h4355A02791j445b62769k019J13999c201p8565K944A7923
18004c8595F526a42490j29634B15182b00790k6446i1593B74361c3104j58787d6979
17992c7373J5281j1565k47564R6638E8342i6774j11299e4300E6518a05336D4157
17980B88493n4850G9240h7190A59925a50022j60557A6776K46977B2700O0181J14910
17969A97791I8129f5287L1728j11742F7680j9922a0351A1714b04897A33680a41593
$$ y = [391072, 211388, 31578, -103757, 44450, -27714, 81631, -454925, 411086, -568585, 58161, -124935, -188170, -3658, 152279, -282339, -174547, -156561, 95478, 90083, 78806, 132255, 53700, 105278, 148322, 109863, -136118, 29555, 66699, -53044, -141749, 114644, -182383, 62836, 664232, 98635, 148400, -84355, 102791, 101346, -262769, -264788, -150789, -3201, -81766, -78822, 17923, -38595, 6526, -142490, -272124, 215182, -200790, -227236, -91593, 274361, -33104, -191891, -46979, -37373, -22092, -33657, -281221, -184583, 58342, -96774, -208073, -54300, 56518, -105336, 44157, 288493, 233643, 79240, -87190, 159925, -150022, -310579, 16776, 263753, 22700, 82881, 197791, 98129, -65287, -33559, -145301, 67680, 47758, -10351, 11714, -204897, 133680, -141593]
17957e806k20793N9679j3248C3273J7330a57684K4650m4486H2775c31444A50818
17945G8901l0596J54573j9416l1462a14910A25437C5088a18258E8139J14351p5632
17934I6858N5566G5567N8373c5177A07349g0885j13776f8261C2983b60020e5934
17922a97420B11628C9568K9360e6659A19973b6133I4798a49713c2616B13058a3680
17910A15793b43427o88j6335A05077b38064F1190a00016k13728B4132c34529L0245
17899c04284A02096b71486A11653P5827j2225h3983E8143a44107E9741B1090c4374
17887a16119a6348A878a81368N286A4968J5759K5181b02886j15545A06529a38055
17875C36452d657B10152d7442A95914E4520e0103k16127B94667A9104d7261j69937
$$ y = [-5806, -226599, -166920, -180168, 33273, 50603, -157684, -133034, -177520, 82775, -331444, 150818, 78901, 48305, 202878, 183462, 152000, -114910, 125437, 35088, -118258, 58139, 172490, 96858, 152424, 75567, 133940, -35177, 107349, -70885, -184661, -68261, 32983, -260020, -55934, -197420, 211628, 39568, 68928, -56659, 119973, -26133, 94798, -149713, -32616, 213058, -13680, 115793, -243427, -244115, -260450, 105077, -238064, 61190, -100016, -313744, 24132, -334529, -304284, 102096, -271486, 111653, 187480, 175255, -83983, 58143, -144107, 59741, 21090, -34374, -116119, -16348, 1878, -181368, -176082, 14968, 30727, 55908, -202886, -318431, 106529, -138055, 336452, -4657, 210152, -47442, 195914, 54520, -50103, -266230, 294667, 19104, -47261, -217198]
17864b17198G0634M00535a38906e6745k32740A04314i8313c4711B4688a3189k38320
17853b51509J18119F0590A4449J08597b17672K8530A96120o2189d0163q0117C8289
17841A11764J3370g4964H391a80932g3978Q731k1612B27937E146c36933I4317
17829A08057P6049G7581a46887E909a29918O3482h320l54741a10457o2339C2461
17817A63441b8288B85797F2539A328R9989c75260I1416K35876c74024A08958d8341
17805b24508B30896a48329H0947L750K1647b86121J13161g406F6227b8149k1885
17794e0034l0999j64739A10594D612a9552B816J57812L7752b4257B86902A28800
17782a80030A78255g7780J7978k2874j84867C770M9054c92528O1602g0904E2539
$$ y = [-217198, 70634, 471169, -138906, -56745, -289485, 104314, -98313, -34711, 24688, -13189, -251509, -133390, 60590, 14449, 123046, -217672, -189142, 196120, 133931, -40163, -120280, 38289, 111764, 125134, -74964, 8391, -180932, -73978, -65247, -86859, 227937, 5146, -336933, 94317, 108057, 184106, 77581, -146887, 5909, -129918, -66436, -8320, -363061, -110457, -172796, 32461, 163441, -28288, 285797, 62539, 1328, 101317, -375260, 91416, 327292, -374024, 108958, -48341, -224508, 230896, -148329, 80947, 84697, 106344, -286121, -172960, -7406, 66227, -28149, -50034, -81033, -245772, 110594, 4612, -19552, 2816, 160628, 198380, -24257, 286902, 128800, -180030, 178255, -77780, -59802, -82676, -267543, 3770, 52824, -392528, -330926, -70904, 52539]
17770a8496j85574e0925j9017L2977j04027b3170C540i8358j69430A71877b23315
17758A7302K12267H663c1518p344B04226A69K5053g4751D1038d5198j88462a16471
17745A22641M6293O9645G7483b03327f8388A383g9116k03072B02743d7660E2860
17733a95113H0968c87803a30322n3857j55164C20104B413a88054L5022M8364K376
17722a02292A26362c62212B66581G1606G465K7470A4639J65509c51183g1945C2243
17710B27575A3536L751i9191C8882Q8038A3716L03874h6911j37417H7038g4488
17698e2216C03890O5899a85982B17005J654h298l5597m2308O053a8265k76639
17687b94904a33328B4020L9834f1482A15243J33230C4430J66773f5171p4533c2952
$$ y = [-18496, -204070, -50925, -69942, -36965, -140992, -23170, 3540, -98358, -267788, 171877, -223315, 17302, 229569, 8663, -31518, -38862, 204226, 169, 25222, -74751, 41038, -45198, -233660, -116471, 122641, 168934, 238579, 77483, -203327, -68388, 1383, -79116, -282188, 202743, -47660, 52860, -195113, 80968, -387803, -130322, -184179, -339343, 320104, 2413, -188054, -153032, -104668, -102292, 126362, -362212, 266581, 71606, 7465, 34935, 14639, 180148, -351183, -71945, 32243, 227575, 13536, 17287, -99191, 38882, 126920, 13716, 317590, -86911, -224328, 87038, -74488, -52216, 303890, 369789, -185982, 217005, 218659, -8298, -43895, -86203, -80150, -18265, -294904, -133328, 24020, 63854, -61482, 115243, 248473, 34430, 201203, -65171, -139704, -32952]
17675G8175N1072h9569A87068q6150Q4183P3023I7872c20134C02451J59476b0736
17663C4310A6769K36645C2056a34085A17087c0758A45431n1777J45200j17649
17653A21205b14210i6291j77227A02687a11930C0804J62227J18399A29712L7394
17643A67106p4635R447e0077B683J72780a53266A08088b23697A48035a83568H6371
17631G7332F382O5596k7450K44816a68725q0304C3689a68172B1937L21262C8036
17619H5984h3076A92100g5808C9858b19180l5452B02195p9313a7312m38982E7173
17607B98708j17476b10885O6439A8647J91116J30615c4414A63450L19879a04992
17596a91113C01912F6563i0425F252M2272K52143j24327a51815o5278J2992A10208
$$ y = [78175, 129247, -89569, 187068, 100918, 185101, 258124, 97872, -320134, 302451, 461927, -20736, 34310, 16769, 253414, 32056, -134085, 117087, -30758, 145431, 93654, 238854, 121205, -214210, -96291, -273518, 102687, -111930, 30804, 193031, 311430, 129712, 167106, 92471, 101918, -50077, 2683, 175463, -153266, 108088, -223697, 148035, -183568, 86371, 77332, 6382, 71978, 44528, 289344, -168725, -249029, 33689, -168172, 21937, 343199, 38036, 85984, -83076, 192100, -75808, 39858, -219180, -254632, 202195, 122882, -17312, -456294, 57173, 298708, 181232, -210885, -144446, 18647, 209763, 340378, -34414, 163450, 483329, -104992, -191113, 301912, 66563, -90425, 6252, 48524, 300667, 176340, -151815, -217093, -204101, 110208]
17584A45943b12882A22944L7153g0835B07653a84884P3250B47800o8826C8314
17573A02441K25290B7462a76112L6411r3480G8429M0127K18175a1315q0694D7682
17561B62962h1745B32580G2451a5334A07603c5375r8644N5062j52788D68729B01122
17549A93236b80452A52603a65882B30960b66034C0187J41154a13747C412M46398
17539D49810d1388E637a34402M7497H899J1405b2480A95902B1428M4599K15306
17528B81333J7338a4633E4797c0474A53290E8887b74366D059K04445r1358b33219
17516F8844i7129A23576Q8511b36704Q6616B76600b50915A05440j9506c14603
17505b95562h0285C9100K25970A28528K27482E7356R7259L4516C3443J25487n4048
$$ y = [145943, -212882, 122944, 160097, -70835, 207653, -184884, -111634, 247800, 178974, 38314, 102441, 327731, 27462, -176112, -139701, -233181, 78429, 118556, 336731, -11315, -92009, 47682, 262962, -81745, 232580, 72451, -15334, 107603, -35375, -134019, -78957, -231745, 468729, 201122, 193236, -280452, 152603, -165882, 230960, -266034, 30187, 171341, -113747, 3412, 449810, -41388, 5637, -134402, -86905, 8899, 20304, -22480, 195902, 21428, 66027, 281333, 298671, -14633, 54797, -30474, 153290, 58887, -274366, 4059, 208504, 117146, -233219, 68844, -97129, 123576, 212087, -236704, -150088, 276600, -250915, 105440, 85934, -314603, -295562, -80285, 39100, 265070, 128528, 356010, 57356, 154615, 189131, 33443, 158930, 104882]
17494A04882M8430O8828i0215K9469j18962A03887J8676j7192J66686G4892a27834
17482C3401b3531A48216O254j8672a27208C58512A06346n975d65754a72380D53204
17470A65416C7745Q5217K31264e4006B89296j00370l7953P4929r1686B7550M35281
17459D62831J9900A41286P6047D6746l717A0094M7908b06248B11975i788j20452
17448a30240B97734p2117a82030C3265P5277e8913F4777M4273Q6373L6175F6912
17436B68730J55669b0759A35388I549c0428B4435a23458D8751f3911A87028K757
17425A89785N1850A12611J65931J49065A45521J00824o5734J3732p2516b8010
17414B33713j3943M13026j24451A33913K00899D7617j5457Q3240a38521e6364
$$ y = [104882, 153312, 222140, -90215, -60746, -179708, 103887, 122563, 105371, 272057, 74892, -127834, 33401, -23531, 148216, 154470, 135798, -127208, 358512, 106346, 100371, -465754, -172380, 453204, 165416, 37745, 122962, 354226, -54006, 289296, 188926, 150973, 225902, 134216, 27550, 462831, 482731, 141286, 217333, 46746, 43029, 10094, 58002, -206248, 211975, -9788, -130240, 297734, 225617, -182030, 33265, 108542, -58913, 64777, 109050, 195423, 231598, 66912, 268730, 424399, -20759, 135388, 9549, -30428, 24435, -123458, 48751, -63911, 187028, 189785, 241635, 112611, 278542, 427607, 145521, 246345, 180611, 194343, 121827, -28010, 233713, 219770, 632796, 508345, 133913, 334812, 47617, 32160, 115400, -138521, -56364]
17403C2808J55040j1183J28361J85405I7684N1928J33238I2761J18900b22781
17392E17522B39774K65542C0661K78958M6606H2993L32025p2608j68533O2263
17382B36140o867q1146b26494B13128M960A06880b9334E79735F437M07238j36826
17371B76849j22788j2186i6608I5303K11749k2706P3749m1842j37494g2342A50013
17359D70245A25112N6432c0196D69075j68373d5802A8382K38805j08159b1837
17348B6530M01933o4625A68366D6733b7174A93428J09915h0454A64802J3442k6054
17337A52190a01488C58301i6211A85576n7951E0678L5749K23376a21000C32206
17326F0632O3417N611K62907j36977k9594H9397J87326j2531i7996A14433L5467
$$ y = [32808, 187848, 176665, 305026, 490431, 97684, 149612, 282850, 92761, 211661, -222781, 517522, 239774, 505316, 30661, 309619, 356225, 82993, 415018, 342410, 173877, 236140, 229273, 148127, -226494, 213128, 218088, 106880, -29334, 579735, 6437, 413675, 276849, 154061, 141875, -96608, 95303, 307052, 284346, 358095, 316253, 178759, -72342, 150013, 470245, 125112, 181544, -30196, 469075, 300702, -45802, 18382, 257187, 149028, -21837, 26530, 428463, 363838, 168366, 46733, -27174, 193428, 303343, -80454, 164802, 178244, 152190, -101488, 358301, -96211, 185576, 127625, 50678, 86427, 309803, -121000, 332206, 60632, 124049, 129660, 392567, 255590, 225996, 89397, 276723, 264192, -97996, 114433, 149900]
17315A49900D2559J28907a40327F2635L29968A66909J06119D6777J0559o271K73035
17304C24100j61228A7379K28615L4855J63768j48246J32398A3622K60350g1239
17293d5731B89836a5792D12540j62370k5168q3009a4174a142k58628A38284b08937
17281C62143G2452M3833J43917B0825b88750B15620r2559L88855A45467c81928
17270I3886h021A23809E9562J23534J06980E6894J75559i3294b1117j9158A56532
17258b12748C00725K10740j94062f3661A02403D0267J20176G1383J31458e9162
17247E77191B01836e2705m8392B19591M2301j29881K4155e06F00992B34659L9324
17236B73983k8006J3044J05854A62662J00476j02261K9515J44564O7541J7962
$$ y = [149900, 42559, 171466, -140327, 62635, 392603, 166909, 273028, 46777, 57336, 51065, 324100, 162872, 17379, 245994, 280849, 444617, 296371, 428769, 13622, 273972, -71239, -45731, 289836, -15792, 412540, 250170, 225002, 141993, -14174, -1142, -259770, 138284, -208937, 362143, 72452, 116285, 260202, 20825, -288750, 215620, 123061, 511916, 145467, -381928, 93886, -8021, 123809, 59562, 183096, 290076, 56894, 232453, -93294, -21117, -40275, 156532, -212748, 300725, 511465, 317403, -63661, 102403, 40267, 160443, 71383, 202841, -59162, 577191, 201836, -52705, -101097, 219591, 261892, 132011, 156166, -506, 600992, 234659, 273983, 245977, 259021, 364875, 162662, 263138, 160877, 190392, 334956, 402497, 420459]
17226D20459m5986j60402D1133L66146A97836a62566A53461L47754A386L08222
17216C09608I7906M5531o8747J60749o474M8256K5478J24893A6529K88449K94781
17205E99759B42235o9454K59118E4276K30794N42954A6976K70470K07495l8790
17195D56151l500k8256A75780k8018k3812N2725J28686j5380n8607L06924j56330
17184C81968A05084M1461P4095L71815f3111C60399k4062J38717q5346I4153J76428
17173B70581A25422n4495K52652J27306j49373j0178A36609d965A11001K13697
17163C24698Q9833H3023R5878J33110q9532D8937K43531F4162K91752j13747L57783
17152E99950A02638J82545J31149J6368j83747k814g9261B72922q1617E6426M97488
$$ y = [420459, 374473, 214071, 41133, 407279, 197836, -162566, 153461, 501215, 1386, 309608, 97906, 143437, 74690, 235439, 228965, 277221, 302699, 427592, 16529, 304978, 599759, 242235, 172781, 431899, 54276, 285070, 828024, 16976, 287446, 494941, 456151, 452651, 424395, 175780, 147762, 123950, 176675, 305361, 289981, 231374, 538298, 381968, 105084, 146545, 220640, 592455, -63111, 360399, 336337, 475054, 389708, 94153, 270581, 125422, 70927, 323579, 450885, 301512, 291334, 136609, -4965, 111001, 324698, 414531, 83023, 178901, 312011, 222479, 48937, 292468, 64162, 355914, 242167, 599950, 102638, 285183, 416332, 432700, 248953, 246139, -79261, 272922, 191305, 56426, 553914]
17141E53914A94706J70798I7120R6648M06832k54790j08552K34734A19974K87635
17131D07609a12788D31584j52211J13275A72754J95054F0955J38605N1144K48415
17121D99119j82949j33306R3599F7175K43657Q3896j21884J93208q6158k48O7050
17110D46696j22525Q0885P6566B13139K60381k11526K04801J50014j23674l7070
17100D56065j1092N7999G6886Q0651M6470m8438K899K8046K49123j30909K8827
17089C33555O019J63931j98740M36469C61803Q1120q6250L15970J10316l49537
17079D33422o478J13741Q1445l3056O1208B49536J97281p3698P1173L5274M7635
17068E27201j19205j7601K44376R8877J8455J30743l21931K01123j24112k48831
$$ y = [553914, 194706, 365504, 97120, 193768, 600600, 345810, 237258, 471992, 119974, 407609, -112788, 431584, 279373, 392648, 172754, 367808, 60955, 199560, 250704, 499119, 316170, 182864, 276463, 67175, 310832, 394728, 272844, 466052, 379894, 379646, 446696, 324171, 405056, 481622, 213139, 473520, 261994, 466795, 616809, 493135, 456065, 444973, 502972, 76886, 157537, 204007, 155569, 158468, 186514, 435637, 304728, 333555, 339574, 503505, 304765, 741234, 361803, 442923, 356673, 672643, 782959, 433422, 426944, 540685, 622130, 589074, 650282, 249536, 446817, 373119, 444292, 479566, 527201, 407996, 390395, 634771, 733648, 752103, 882846, 560915, 762038, 637926, 389095]
17058C89095j66584l0916N99253k59205J17369Q0889r2427k22486J52876H8343
17047D79676J4573A95259J28266L82240j32465M11422j32741l46649m6019n8024
17037D01289Q0244L3469r4072J67123P3465j1493Q0175o0629j71957J24831k40030
17026C82415L49681B00183M76951K14584m42396J33376j91668M23519j73695N5718
17016F96572p8360N9599K34800j59381j97224K22408K01278j99426m4451n3694
17006F82121j29563k731J75098K67460j31524P0313j85302M9400n6170J974J63943
16995I05019Q8589l22037r2573J54720j34892M94547m73701J11158J45635j54712
16985G21753k538O9070k07459K60963J52219J33933n06926L69454j24590J4226
$$ y = [389095, 222511, 191595, 790848, 531643, 649012, 729901, 637474, 414988, 567864, 88343, 479676, 494249, 195259, 323525, 705765, 573300, 984722, 851981, 505332, 459313, 401289, 481533, 515002, 420930, 588053, 661518, 650025, 730200, 669571, 497614, 622445, 382415, 732096, 200183, 677134, 891718, 449322, 582698, 391030, 814549, 640854, 696572, 618212, 677811, 912611, 753230, 556006, 778414, 979692, 780266, 735815, 682121, 552558, 549827, 724925, 992385, 860861, 931174, 745872, 795272, 739102, 741076, 905019, 993608, 671571, 578998, 733718, 598826, 1093373, 619672, 730830, 876465, 721753, 719215, 788285, 580826, 841789, 994008, 1127941, 621015, 990469, 865879, 880105]
16975H80105J31620l04533K52357M2271M9723o4344k90897J77401J93627k77994
16965G89336L13469k81042J53369R9411l31300N9652J56787K05984j36206O2017
16955A091477j26900L00490q0641j81829o3060K01027P9207j72091j28906P3051
16945I91825k3333K88989l32093P51985l16388l27847k4930L0245J30700L02613
16935A471766n36404J25781K53534k3644O7372r4986l6738N4073L59057r1467
16925A548344k65433j75300M64620o50113K06776K92344J87339j74183L83441
16916A817835l58156j2785K0466L94165m48292J06013r2033M7822k03571L68622
16906A640086k29691M22966l66971K80402j39568J20807l15631J88889J1335K34302
$$ y = [880105, 1011725, 707192, 959549, 1001820, 1051543, 987199, 696302, 873703, 1067330, 789336, 1102805, 821763, 975132, 1074543, 743243, 802895, 959682, 1165666, 1029460, 1091477, 964577, 1265067, 1184426, 1002597, 939537, 1140564, 1219771, 1047680, 918774, 991825, 968492, 1257481, 925388, 1677373, 1360985, 1033138, 1008208, 1038453, 1169153, 1471766, 935362, 1061143, 1314677, 1291033, 1358405, 1263419, 1226681, 1280754, 1639811, 1548344, 1282911, 1107611, 1572231, 922118, 1128894, 1421238, 1608577, 1434394, 1817835, 1459679, 1446894, 1467360, 1861525, 1413233, 1519246, 1427213, 1475035, 1271464, 1640086, 1410395, 1833361, 1466390, 1746792, 1607224, 1728031, 1412400, 1601289, 1612624, 1846926]
16896A846926k31837M7862J59537O7488k15266K42416o2127J9905j2685l30434
16886A531785L22668j28017J62760P1164K45575j98692O5043q7910J23407q0174
16876B027609J75869o6550K92978m47089M1864L01883J08658j443o9934m21958
16866A941887L62591J54425J84507k16025L5884L68762J9705l37507J01557j70268
16856B445518K27067K42166l19991L85767j52373j90657K86209P5188r1675r0035
16846B817184K83115J87O460J17794o4367L30444q5954Q5976J5135j68994L63114
16835C700094o139k47435q7624L33637j50552L67408M3136Q1614j20250j90250
16825C723639K28126K83889o5819k77715L17439L43670k07835j99119M40711Q8141
$$ y = [1846926, 1615089, 1662951, 1822488, 1889976, 1674710, 1917126, 1854999, 1874904, 1862219, 1531785, 1854453, 1726436, 1889196, 1960360, 2205935, 2007243, 2072286, 1984376, 2107783, 2027609, 2203478, 2136928, 2429906, 1982817, 2024681, 2326564, 2435222, 2433779, 2363845, 1941887, 2304478, 2458903, 2643410, 2427385, 2463269, 2832031, 2851736, 2514229, 2615786, 2445518, 2672585, 2914751, 2594760, 2980527, 2828154, 2637497, 2923706, 2998894, 2907219, 2817184, 3100299, 3100486, 3106946, 3224740, 3160373, 3490817, 3404863, 3490839, 3505974, 3336980, 3700094, 3693955, 3446520, 3358896, 3692533, 3541981, 3909389, 3952525, 4034139, 3913889, 3723639, 3951765, 4235654, 4169835, 3892120, 4209559, 4553229, 4345394, 4146275, 4586986, 4675127]
16815D675127J51711k30185K7367N28587m1241m1182j02907L34784J06100J25182
16805E533343K03841k43748q0535J59290M80733p2787K09877M0943k9917M53101
16795F654141j97025J06446K42703o729O74559l51919K37198L51596p7836K52847
16785G885981L7688K42649J78698J03573o311M22286j84987N09669j39610K61782
16775I311418M44737J94085K56520M60031K75095L23466J78417q813N51863K93733
16765A2280552Q087N75782J06702L72288J96574L92267L97147L19017K45595P35171
16755A5629182J11592Q5905J200952P483M25835Q88348L83324M67212J141442
16746B0341275J93523O76338O53121P09905P40222Q14764Q15416O73693R95915
$$ y = [4675127, 4826838, 4596653, 4624020, 5152607, 5111366, 5070184, 4967277, 5302061, 5408161, 5533343, 5737184, 5493436, 5412901, 5572191, 6052924, 5980137, 6190014, 6230957, 6201040, 6654141, 6457116, 6563562, 6806265, 6799536, 7474095, 7122176, 7359374, 7710970, 7633134, 7885981, 7923669, 8166318, 8345016, 8448589, 8442278, 8864564, 8679577, 9189246, 9049636, 9311418, 9756155, 9950240, 10206760, 10666791, 10941886, 11265352, 11443769, 11434956, 11986819, 12280552, 12288639, 12864421, 12971123, 13343411, 13539985, 13932252, 14329399, 14648416, 14894011, 15629182, 15740774, 15826679, 17027631, 17035114, 17460949, 18349297, 18732621, 19199833, 20341275, 20534798, 21211136, 21864257, 22574162, 23314384, 24129148, 24944564, 25618257, 26614172]
16737B6614172Q31835P51814J158822R77342J460190P69290J638879Q27069J525714
16728C6555127J459997J642360J437932J852755J392310K018067J688916K029704
16720E0077168K286215J695482K355544K654763K242676K668754K838200K738307
16712F9557109L372014K916510L265790L083890L868181L249642L391592L573674
16704I6278402L816022L548054L842756L414210L526740L544078K785139L170870
16696A23926271K821266K415914J939212J220998J519457Q43080L6046n3342l74219
16687A34294683j258503j540921j948645k373735k762680l041483k688829l763137
16679A14916750l439182l519036l837702l847680l410339l866228l704656l386984
$$ y = [26614172, 27446007, 28197821, 29356643, 30333985, 31794175, 32563465, 34202344, 35029413, 36555127, 38015124, 39657484, 41095416, 42948171, 44340481, 46358548, 48047464, 50077168, 52363383, 54058865, 56414409, 59069172, 61311848, 63980602, 66818802, 69557109, 72929123, 75845633, 79111423, 82195313, 86063494, 89313136, 92704728, 96278402, 100094424, 103642478, 107485234, 110899444, 114426184, 117970262, 120755401, 123926271, 126747537, 129163451, 131102663, 132323661, 133843118, 134686198, 134722244, 134668902, 134294683, 133036180, 131495259, 129546614, 127172879, 124410199, 121368716, 118679887, 114916750, 111477568, 107958532, 104120830, 100273150, 96862811, 92996583, 89291927, 85904943]
16671H5904943l524997l820677l158001k929678k775350k745925l241490k640524
16663F1068301k319902k557235k253569k295047k113979k146713j845437j818023
16655D3718396j919458j683154j346163j258100j381484j156876j507947j128007
16647C2337207j270518j380817n90706j161277j244067r38534n67558q86110q04186
16638B3493434m38985r61789o56120o15979r56118k05880n89962q19382o31896
16629A7617323m13530m41897m21130n11684n21172l41659n76976l33943k27870
16620A3827462J9542j025965R6275m82536m20958p4306l73457l42947l63698k0775
16610A0838637m86521k74721k45918q2394j11585o48189j11489L728j98207K66985
$$ y = [85904943, 82379946, 78559269, 75401268, 72471590, 69696240, 66950315, 63708825, 61068301, 58748399, 56191164, 53937595, 51642548, 49528569, 47381856, 45536419, 43718396, 41798938, 40115784, 38769621, 37511521, 36130037, 34973161, 33465214, 32337207, 31066689, 29685872, 29095166, 27933889, 26689822, 25751288, 25183730, 24297620, 23493434, 23054449, 22092660, 21436540, 20820561, 19864443, 19658563, 19068601, 18249219, 17617323, 17203793, 16761896, 16340766, 15829082, 15307910, 14966251, 14389275, 14055332, 13827462, 13847004, 12821039, 12917314, 12434778, 12013820, 11939514, 11566057, 11223110, 10859412, 10838637, 10352116, 10077395, 9831477, 9749083, 9637498, 8989309, 8877820, 8881548, 8683341, 8950326]
16600H950326n55497R5295k27381k35414k22349j11511l40951n7982p2843k46631
16590F975062k6659k11184o828j87839j85345m24207J99536k73811j24186J7100
16580E751639j5124k17683l9510j74427L35867m96647K70192l97104k06715K16091
16570E026579o60979L42656j21937k87278K42334l36071M41632j42903l75358
16561D128675J55977l06587o869N3050O1072j05189n9891Q7791l10626j65003
16551C532400k73970K89663k26854L17800j45146J36284k57687l59995J06342
16542C118837o7038j68207k46353N09465k25462n7615R8264j41869N6523k69394
16532B607151L7309l77268O77676m30699K2361R2725q4085J65439j22416O3005
$$ y = [8950326, 8394829, 8490124, 8262743, 8027329, 7804980, 7693469, 7352518, 7294536, 7221693, 6975062, 6948403, 6737219, 6730391, 6542552, 6357207, 5933000, 6132536, 5858725, 5734539, 5751639, 5736515, 5518832, 5479322, 5304895, 5640762, 5144115, 5414307, 5017203, 4810488, 5026579, 4365600, 4708256, 4586319, 4299041, 4541375, 4205304, 4646936, 4504033, 4128675, 4284652, 3978065, 3971196, 4024246, 4085318, 3980129, 3920238, 4008029, 3697403, 3532400, 3258430, 3548093, 3321239, 3639039, 3493893, 3630177, 3372490, 3012495, 3118837, 3051799, 2883592, 2637239, 3146704, 2921242, 2863627, 2961891, 2820022, 2876545, 2607151, 2644460, 2267192, 2944868, 2514169, 2536530, 2629255, 2545170, 2710609, 2588193, 2651198]
16522B651198k27685j15810J78597k16265K10167k20783j08071k61272J72005
16513B062081J90994l8725j1965k53133M42820l87713j3923r0408J01948j51208
16503A850768k9028p2701P7141L67357l35483J41320k96383N107N0026l13916
16493A444208L43459l96943K15879K53476k51446m2582J2531L81808n91332K47136
16483A616194Q884l94923l5963q3650J32684K68341q4306m7257R8307j81094R6676
16472A393893q5963j55369m7334J94022L53800j85670j21189n00642L15695J15076
16462A276319p6652J89812L8462k18692K14165k62081j54409L41872l27784p3016
16452I47996J68408J65421k87903L08126j83352J32720p9639l31447L20701j13514
$$ y = [2651198, 2423513, 2307703, 2486300, 2270035, 2480202, 2259419, 2151348, 1890076, 2062081, 2253075, 2214350, 2202385, 1949252, 2392072, 2004359, 1990436, 1900028, 2001976, 1850768, 1821740, 1749039, 1826180, 2193537, 1858054, 1999374, 1702991, 1708098, 1758124, 1444208, 1787667, 1390724, 1606603, 1860079, 1608633, 1566051, 1578582, 1960390, 1369058, 1616194, 1625078, 1230155, 1194192, 1110542, 1243226, 1511567, 1427261, 1380004, 1478311, 1297217, 1393893, 1307930, 1152561, 1105227, 1299249, 1653049, 1467379, 1346190, 845548, 1161243, 1276319, 1199667, 1389479, 1427941, 1209249, 1423414, 1161333, 1006924, 1348796, 1021012, 947996, 1116404, 1281825, 993922, 1302048, 1118696, 1251416, 1171777, 840330, 1161031, 1047517]
16442A047517O5447k49083K60575k50085o1098J60423O2699k6103q9094o0911
16432H60287K14432j31231J35424k3996j47788o4721k07478J26120O6177j02192
16422G25034M15171j46091K9574j30419M6876j5818p4146k66486O03710E27050
16411I81810k29404r0048m3589J25892J3698J52789k14037k95872K35645K3264
16401F60148P0792k3082K82627k40030K84072k90145j55966R7851j38890J52293
16391F99670j11562K04384J1118J13606j04353j48485J33796C16207M56714C08667
16380F98940O849C17938N35090k67611j80433J50799J97657n9578k99810K92473
16370F86525k09563J91653J66611k29985m0258R6594j8849q6018M1050m9437K09857
$$ y = [1047517, 1112964, 863881, 1124456, 874371, 813273, 973696, 1036395, 1010292, 921198, 860287, 1074719, 943488, 1078912, 1054916, 907128, 842407, 634929, 761049, 827226, 725034, 1140205, 994114, 1023688, 893269, 940145, 924327, 850181, 583695, 1187405, 527050, 981810, 752406, 662358, 618769, 744661, 758359, 911148, 697111, 401239, 636884, 660148, 730940, 707858, 990485, 750455, 1034527, 744382, 588416, 686267, 547377, 699670, 588108, 792492, 803610, 917216, 812863, 664378, 798174, 316207, 772921, 308667, 698940, 705789, 317938, 853028, 585417, 404984, 555783, 753440, 693862, 394052, 686525, 476962, 668615, 835226, 605241, 564983, 661577, 642728, 556710, 597760, 548323, 758180]
16359G58180k10112N9997k97196L55064j51384j69986J44906J86503B84849q679
16349B76170J52124j66036L5977O6136p0796L05809k86805O1057K09643g6010
16338E49555k57792L30405C5805O57753j22298O2166B91376J7079L37555n2942
16328E93068B58449J90551L1162J09940j45172L0867R7520j87921L84480k66224
16318E03652n6517k3377J43340k7976p4414J94570j78282j50702R7223A78784
16307D8630K00371K14780j90422K45627F6898J84495J02247m0871J03473m775
16297D11467j73023P6068l0105m0375J57303N3066A23676O9794n452L06178j5081
16286D79115j89613j08429L4937k6797J08240j11808B7309L24364J24036k23204
$$ y = [758180, 548068, 608065, 310869, 665933, 514549, 344563, 489469, 675972, 284849, 276170, 428294, 262258, 298235, 364371, 293575, 599384, 312579, 373636, 583279, -76010, 549555, 291763, 622168, 35805, 693558, 571260, 633426, 291376, 308455, 646010, 593068, 258449, 449000, 480162, 590102, 444930, 475797, 573317, 385396, 769876, 503652, 447135, 423758, 567098, 539122, 464708, 659278, 480996, 330294, 427517, 178784, 48630, 249001, 463781, 273359, 518986, 66898, 251393, 353640, 312769, 416242, 411467, 238444, 314512, 284407, 244032, 401335, 454401, 123676, 193470, 188018, 494196, 479115, 289502, 181073, 216010, 189213, 297453, 185645, 27309, 351673, 475709, 252505]
16276B52505r5340L66818j44753j75670J65776l9911J00216l8977A92737J87389
16266C80126q9620J76849j69433J4750J1853K69379A84886N7203c5824B73207
16255E43234j56860j65359n6145J6939a10537B21953K58249B698J36603K35329
16245C74630I0763J3239J86968K9790a162A33877P6854R1624A47341M7692L2426
16234B27459C2988M03359a38812C81991E2588a83858D19587j67537N7396i7371
16223D20186a36039A51391K21562m8390H6906M142Q8229l6305J86554d7890B08551
16211B05699j2576K30023n6811A24027j3343K4995k3477J82851n504K19366c9815
16199d7340A32043K9927Q458J1654G738P3831O0478J78246N4953a89328I0172
$$ y = [252505, 157165, 523983, 379230, 203560, 369336, 329425, 429641, 390664, 192737, 380126, 290506, 467355, 297922, 312672, 324525, 593904, 184886, 242089, -35824, 273207, 543234, 386374, 221015, 164870, 181809, -110537, 221953, 480202, 2698, 139301, 374630, 90763, 104002, 290970, 320760, -1162, 133877, 210731, 302355, 147341, 195033, 227459, 32988, 436347, -138812, 381991, 52588, -183858, 419587, 252050, 309446, -97371, 420186, -136039, 151391, 372953, 324563, 86906, 91048, 179277, 142972, 329526, -47890, 208551, 205699, 193123, 423146, 366335, 124027, 110684, 135679, 112202, 295053, 289549, 508915, -39815, -47340, 132043, 161970, 170428, 182082, 7738, 81569, 142047, 320293, 375246, -189328, 90172]
16187e6096F9091J46068j02878d677A61887K32427C3443J31983J02770j29617
16177A38579L03080A46345n6097J41913O999j00026Q6981c7300H0608a82488A2096
16165A58421b6275A15775n6508J21060K66222b9686A77236J15523e6072A53931
16154A90965K56504I6145j7441a64870e6089G8516b0439B04589j7389H5542g1614
16142B74943a73567d3674D2259a36725C67181A57830a20318A71729J54153j6216
16132C09666R2082H8196K30768l8245j7923j493J55106A97018a91187E0505K6411
16121G6916J47466J76000A82380j2512M5362K410b64285B93958A06271b860A1013
16109C64367c39300A88532f7981A68065J17940r5832Q2884L3175h3592k02818
$$ y = [-56096, 69091, 215159, 112281, -4677, 161887, 394314, 33443, 165426, 268196, 138579, 441659, 146345, 90248, 232161, 239160, 139134, 226115, -37300, 80608, -182488, 12096, 158421, -26275, 115775, 59267, 180327, 446549, -29686, 177236, 292759, -56072, 153931, 190965, 447469, 96145, 78704, -164870, -56089, 78516, -20439, 204589, 187200, 85542, -71614, 274943, -173567, -43674, 42259, -136725, 367181, 157830, -120318, 171729, 325882, 309666, 401748, 88196, 318964, 280719, 262796, 261303, 416409, 197018, -191187, 50505, 76916, 224382, 400382, 182380, 169868, 215230, 217640, -264285, 293958, 106271, -2860, 11013, 364367, -339300, 188532, -67981, 168065, 286005, 190173, 273057, 306232, -83592, -286410]
16099b86410C19580F2288b8260B24932o492H6680a23312A32589c6778B80441A16813
16087b885A36997o6676P9589G2789b27341a06262F0258O3047B8533a88665I0127
16075B92484A02135j8847K27041A44730J95817A38627O3024f668A61139j0704
16065A50435a0388B27508c812j22160A76025F4020b65015A24509a58613C16333
16054B55537H775i6434j65209f9626r0021K2518B65564A29577b50524A15158P687
16043A22845L937a88054C35078A53936Q1857e7092j73702A29251b62884B34358
16032B73732r1307o2061M3581a12011F3845b54254a25793b2627B4751b37751B42821
16020D46656a64339A23630i788k65051J33315M4929l4000A56009L21487A57005
$$ y = [-286410, 319580, 62288, -28260, 224932, 218440, 86680, -123312, 132589, -36778, 280441, 116813, -2885, 136997, 70321, 149910, 72789, -227341, -106262, 60258, 123305, 28533, -188665, 90127, 292484, 102135, 83288, 310329, 144730, 340547, 138627, 201651, -6668, 161139, 150435, -10388, 227508, -3812, -125972, 176025, 64020, -265015, 124509, -158613, 316333, 255537, 8775, -96434, -261643, -69626, -159647, -137129, 265564, 129577, -250524, 115158, 122845, 126782, -188054, 335078, 153936, 235793, -57092, -230794, 129251, -262884, 234358, 273732, 182425, 120364, 163945, -112011, 63845, -254254, -125793, -22627, 24751, -237751, 242821, 446656, -164339, 123630, -9788, -274839, -141524, -96595, -130595, 156009, 477496, 157005]
16009d2098I8555l2993M84201C3372J39760c23507A36000J0691m5920m9407a94369
15997G9399a9628M092A27552b4037p0785k39881G8446i1600A56201e8991m4007
15986a02998A52228J77214b65397I6845J4881D5930e5602o0133k67177J70688
15976b12224B74219b57820a0135C52415D3861A7879K66749a04062B28020I5390
15965A62769E456J81515J10237a07691B0086c1480C55337Q7279A52065L05575
15955D57640A37347B9404J80855a69317C23456A9604e9940k35944J06950Q8687
15945a00247k6303a6833D8647b33045J9806H5331i1125I6366j157b6113k15128
15934b41241C52942g773H9785k5826J26088a07825d5136F0760a53902L8180C51170
$$ y = [-42098, 98555, 65562, 549763, 33372, 173132, -323507, 136000, 146691, 100771, 51364, -194369, 79399, -19628, -15536, 127552, -24037, -94822, -334703, 78446, -91600, 156201, -58991, -102998, 152228, 329442, -265397, 96845, 111726, 45930, -55602, -115735, -382912, -212224, 274219, -257820, -10135, 352415, 43861, 17879, 284628, -104062, 228020, 95390, 162769, 5456, 186971, 297208, -107691, 20086, -31480, 355337, 442616, 152065, 457640, 137347, 29404, 210259, -169317, 323456, 19604, -59940, -295884, -188934, -100247, -126550, -16833, 48647, -233045, -213239, 85331, -91125, 96366, 95209, -26113, -241241, 352942, -7773, 89785, 63959, 190047, -107825, -45136, 60760, -153902, -115722, 351170]
15922b66194c379r692C29622b01715E5032J01242J48962b39254D8495c184k04194
15911b07378B32356h0051k50944A38581K35536f4589j29386a7347C4923J9631
15901E4554i3424D8471R2895n7964h4924j22406A68337b40628A08095a39531J8751
15890a20780D4257e6318E0678e2977A98015a97511j39672I9648a56244K4669j25298
15879b56873J04312A82432J1118J27872b04526A88299h7613m12197b34841b33
15868B39975h6673j4040A10428d6937C85537D9454f285n5608E4207B6503P1630
15857I8133e4489b6848j79869A17145M9585H3000J58334K4699a79736J0005I3205
15845F2395A9397a41860B18748b67619A92167f8731k78546N4664a20204D6447
$$ y = [-266194, -3379, -13071, 329622, -201715, 55032, 156274, 305236, -239254, 48495, -3184, -207378, 232356, -80051, -330995, 138581, 374117, -64589, -193975, -17347, 34923, 54554, -93424, 48471, 141366, 83402, -84924, -207330, 168337, -240628, 108095, -139531, -120780, 44257, -56318, 50678, -52977, 198015, -197511, -337183, 99648, -156244, -131575, -256873, -152561, 182432, 193550, 321422, -204526, 188299, -87613, -499810, -234841, -233, 239975, -86673, -100713, 110428, -46937, 385537, 49454, -6285, -61893, 54207, 26503, 98133, -54489, -26848, -206717, 117145, 166730, 83000, 241334, 266033, -179736, -169731, 93205, 62395, 19397, -141860, 218748, -267619, 192167, -68731, -347277, -292613, -120204, 46447]
15834e6625A16145a20379C6204J82899o2531l8140c23302B8689b49039A11239
15823a18491A82123h2197B9378Q5597j6433f3264A37604E9640N8632a60665K944
15812a57721M7270d4397k20163N3227g2078F4846r045a95545B82116h7794a5981
15800A83315B182Q3946P800P4605d8164F2293P1026M3945K70662c2851r784j31604
15788a74239M7501e8817j52965L68d3671A75873b22171k07478f3059A06914l1427
15777G5487a21545A857K61063a38158f1635A87002J35365F0103M8859h0081h652
15765g0532B03860B7590a13884j04620f4716e227l56178A98860g3414I0518a82912
15753d55374A37453b0655E4654b26947J0415B523a35687b9230j04675N209l17328
$$ y = [-56625, 116145, -120379, 36204, 219103, 156572, 118432, -323302, 28689, -249039, 111239, -118491, 182123, -82197, 29378, 114975, 98542, -63264, 137604, 59640, 118272, -160665, -157721, -110451, -44397, -264560, -211333, -72078, 64846, 55801, -195545, 282116, -87794, -15981, 183315, 2182, 86128, 93928, 168533, -48164, 62293, 133319, 177264, 447926, -32851, -42635, -174239, -126738, -58817, -211782, -211414, -43671, 175873, -222171, -429649, -63059, 106914, 75487, -121545, 1857, 262920, -138158, -61635, 187002, 322367, 60103, 108962, -80081, -8652, -70532, 203860, 27590, -113884, -218504, -64716, -5227, -361405, 198860, -73414, 90518, -182912, -455374, 137453, -20655, 54654, -226947, -216532, 2523, -135687, -29230, -133905, -128696, -446024]
15742d46024a01792j05173q7018a03244k02926A09596J3127D6517J23501K39220
15732D09238A72039J04219M1607C9602i2278A43712g8950B2002f8123b3772k4881
15721d8653A80468g840D8031i803A75948F1384K30928a42642A49109n63O4049
15710B12595f1200I5912b23013K7257D8748Q4670a06910C83750a12705I8334e0083
15698A22181d1217l0336J0492E1002a18123N8296B27773b39335B00601a03605
15687A46738n7440N12856b40073G3258J43617b0613j46854F6798K56867A8775
15676H563g8968L8636A18927c6940k22315c4657B46446q3092H0525J63129a06928
15664B7691a25891B01471N291a61234L059k8672C7432a53516A0932J7112J26584
$$ y = [-446024, -101792, -206965, -293983, -103244, -306170, 109596, 122723, 46517, 170018, 409238, 172039, 276258, 317865, 39602, -92278, 143712, -78950, 22002, -68123, -23772, -48653, 180468, -7840, 48031, -9803, 175948, 61384, 292312, -142642, 149109, 148546, 212595, -61200, 95912, -223013, -195756, 48748, 133418, -106910, 383750, -112705, 98334, -50083, 122181, -41217, -71553, -61061, 51002, -118123, -59827, 227773, -239335, 200601, -103605, 146738, 89298, 602154, -240073, 73258, 216875, -20613, -167467, 66798, 323665, 18775, 8563, -78968, -40332, 118927, -36940, -259255, -34657, 246446, 163354, 80525, 243654, -106928, 27691, -125891, 201471, 206762, -161234, -158175, -186847, 37432, -153516, 10932, 28044, 154628]
15653A54628a36111j23312k7490a34633A83639J02427Q9506A24657n5193A0121
15642A43355Q5573q0479b01108A40824m4201a29167E7567a25702b7707j29436
15632a57143l1853O7301A4789K6881N6244A4819K08305g8029m47963A56041a64323
15620b62590g7998A24939g7640c798o9321B81789o3384g4014p4531O2472B19921
15608b34118a05667E8276c5906B27169G5716b21964B1295e6771F7172e1921j70067
15597b21988D4995J31182f1613A19960g1951k01521C64897c9597j34887e490p0997
15586g6487A95497i7625l9853r8570m626C37692A37253a28057A81836H0025g0839
15574B605c41447a00382A40459c9699j1486p9892E8269b9282A46059i0696A90443
$$ y = [154628, -136111, -259423, -286913, -134633, 183639, 286066, 375572, 124657, 69464, 10121, 143355, 228928, 148449, -201108, 140824, 96623, -129167, 57567, -125702, -27707, -157143, -188996, -121695, 14789, 41670, 97914, 14819, 223124, -78029, -525992, 156041, -164323, -262590, -77998, 124939, -77640, -3798, -73119, 281789, 218405, -74014, -148545, -86073, 219921, -234118, -105667, 58276, -35906, 227169, 75716, -221964, 21295, -56771, 67172, -51921, -221988, 44995, 176177, -61613, 119960, -71951, -273472, 364897, -39597, -174484, -5490, -76487, 195497, -97625, -137478, -236048, -240674, 337692, 137253, -128057, 181836, 80025, -70839, 2605, -341447, -100382, 140459, -39699, -51185, -131077, 58269, -29282, 146059, -90696, 190443]
15562a5674D66244b31860b5995A13262b57379d1956A52798a39543N3024m795D4689
15550C6640a40269B9416j107b0598j23088j91571a59955f8685k72432H6047g0773
15538b09286C09600J45393A38477a21457A62904a55312J9323O358B17949b01230
15527A72478a25985D4294J67252k1705m651b34288B34989R8938b25569D7307b5463
15515C7829b96733a0212B42416C090c4202A98094n448a48971O7825k3311d1955
15503B20292a43410L4937A67157f3070A73452m4292d4235j66314i2486l21373
15493d13859I8601K6972A2003e6261a7196p4081K6503j48486Q6987A08992a19140
15481a03620g463r1025p3430G9738a52988r5424A74298Q0422a86829j3089B13226
$$ y = [-15674, 466244, -231860, -25995, 113262, -257379, -41956, 152798, -139543, -86519, -91314, 44689, 36640, -140269, 29416, 28309, -20598, -143686, -335257, -159955, -68685, -341117, 86047, -70773, -209286, 309600, 454993, 138477, -121457, 162904, -155312, -135989, -129631, 217949, -201230, 172478, -125985, 44294, 211546, 189841, 185190, -234288, 234989, 333927, -225569, 47307, -25463, 37829, -296733, -10212, 242416, 3090, -34202, 198094, 192646, -148971, -81146, -104457, -41955, 220292, -143410, -108473, 167157, -63070, 173452, 129160, -44235, -210549, -92486, -413859, 98601, 125573, 12003, -56261, -17196, -91277, -64774, -213260, -126273, 108992, -119140, -103620, -7463, -98488, -171918, 79738, -152988, -248412, 174298, 254720, -186829, -199918, 213226]
15469a43312E4714g9242A54698i4767L9364A70826o1873l8856j5249K28733a20880
15457C1092q794f0876A94495a25399a6861k43137K6547B00481m0499h5934j11279
15446a97213B41511l5952i5571j28329B30991l6155B5885a01168j29627i3494
15435b8037H2995B4574g9505j69308b2868A72964b92487e588k77366A89342b577
15423e3622A89096q0441C6194q178i2346j25598k4193P5350n2908F6804B8144
15411a90662H8478b827q74l27744E166J88495h2581j65388i1082k8244A78497
15399e4590j84263A15022c9851F459J35116a03004m516e404k7531p975M820E6307
15386c47810a30749G9524a64624F0304b59255J25165C08368C8233L20762B6224
$$ y = [-143312, 54714, -79242, 154698, -94767, -55403, 170826, 108953, 70097, 54848, 283581, -120880, 31092, 22298, -60876, 194495, -125399, -16861, -259998, -233451, 200481, 159982, -85934, -197213, 241511, 205559, -95571, -223900, 230991, 194836, 25885, -101168, -230795, -93494, -28037, 82995, 24574, -79505, -248813, -22868, 172964, -292487, -5588, -282954, 189342, -2577, -53622, 189096, 108655, 36194, 28016, -92346, -217944, -242137, -166787, -219695, 66804, 28144, -190662, 88478, -2827, -3701, -331445, 5166, 193661, -82581, -247969, -91082, -119326, 178497, -54590, -238853, 115022, -39851, 6459, 141575, -103004, -107520, -5404, -32935, -40910, -36090, 56307, -347810, -130749, 79524, -164624, 60304, -259255, -134090, 308368, 38233, 358995, 26224]
15375h9036o5816c3144k75558B6525e2551H1550M90716e0528F6989a65301A21381
15363a54202A97427m1399B7877h5908b8758a1432j20535G3858N0932P1409c6998
15351G1281a37047d3887A66527J06252b16293R6793e6467A07941a12742D8432
15340C12329H3131j4924j8169b93934A94351a9546j36849E2291a63150b6736A37499
15328A08018K85592b56313b135F8175a37157B36557n5895o8705J25323i3644B73919
15316B03821F6732d229A20513b58772A3306f3591C05229a09704C76267C2377R9056
15305A31433C4193J31642b1557B9608N7688g8170C87570B3991i9240E5656b7282
15293h2955A32232B7126K67020b13203H0683a53703L8286A55594c9187a4159A55598
$$ y = [-89036, -154852, -33144, -308702, 26525, -52551, 81550, 572266, -50528, 66989, -165301, 121381, -154202, 197427, 156028, 27877, -85908, -28758, -11432, -131967, 73858, 124790, 196199, -36998, 71281, -137047, -43887, 166527, 272779, -216293, -119500, -56467, 107941, -112742, 48432, 312329, 83131, 68207, 50038, -293934, 194351, -19546, -156395, 52291, -163150, -26736, 137499, 108018, 393610, -256313, -2135, 68175, -137157, 236557, 180662, 111957, 237280, -93644, 273919, 203821, 66732, -4229, 120513, -258772, 13306, -63591, 305229, -109704, 376267, 32377, 131433, 34193, 165835, -21557, 29608, 87296, -78170, 387570, 23991, -99240, 55656, -27282, -82955, 132232, 27126, 294146, -213203, 80683, -153703, -115417, 155594, -39187, -14159, 155598]
15281D3615i0033l3063I1877K16767a45315E6903i5343B6091a55285r0078D19785
15269A26929a47120m9858d9971j17467f0528A8568b74990c5358B943b0057l4532
15258e4589i523C6485J65644J45510j22469b8400A04859g8144B22308a0192k22736
15247b32928A04542J95659a37917e3091B16568A036J24729m3683h2895G1659a38686
15235B6484J0780J42534H9030K07660A00875a9429p5647A65460h4369C96691j51002
15224B45689K11486Q41138n97787M73755J42835C17905J7070H5191l2242J27341
15214A80290m4721b93693B58385e4802j46940F9680K1451R714a0985A82298M4883
15203B27181n0406m3696a74863N8722I9347J95353M5251j49444a21030A17376
$$ y = [43615, -90033, -123096, 91877, 308644, -145315, 56903, -95343, 26091, -155285, -245363, 419785, 126929, -147120, -196978, -49971, -167438, -60528, 18568, -274990, -35358, 2943, -20057, -54589, -9523, 36485, 202129, 347639, 225170, -28400, 104859, -78144, 222308, -10192, -232928, 104542, 300201, -137917, -53091, 216568, 1036, 125765, 82082, -82895, 71659, -138686, 26484, 37264, 179798, 89030, 296690, 100875, -19429, -95076, 165460, -84369, 396691, 245689, 457175, 1298313, 700526, 1174281, 1317116, 317905, 334975, 85191, 52949, 180290, 135569, -293693, 258385, -54802, -201742, 69680, 91131, 100845, -10985, 182298, 227181, 176775, 133079, -174863, -116141, 99347, 294700, 339951, 190507, -121030, 117376]
15192B20362Q1212A09371a03406j09797A27506i8597c4281B39197R943a06661
15181b25450B7684j3753N6960K6021e8586j5057C444J07608N3795M2283H0548
15169e7558C03009i740B2967J71959a29813A51255J05384Q8734D082d1964A39414
15157f7825A29516E1072a83203A42516f4599F8661K76678a53328C6449K65296
15147C01745h0401B59425i5181B90622F9357b50148g5708i264G5454a12821A15854
15135A13875C9529K08473p1755J10373j461e5674B88138a56623L4503C60980A04595
15123A11516a74104b859E427L32516A47526b16710B07711b14177A6875a03173
15112a43074J7413A42286b47498A26409J65229G5520J61279d4702q9946O0030
$$ y = [220362, 301574, 109371, -103406, -213203, 127506, -98597, -34281, 239197, 249140, -106661, -225450, 27684, 13931, 70891, 96912, -58586, -73643, 3444, 111052, 164847, 207130, 80548, -57558, 303009, -9740, 22967, 194926, -129813, 151255, 256639, 345373, 4082, -41964, 139414, -67825, 129516, 51072, -183203, 142516, -64599, 68661, 345339, -153328, 36449, 301745, -80401, 259425, -95181, 290622, 69357, -250148, -75708, -9264, 75454, -112821, 115854, 113875, 39529, 248002, 176247, 286620, 285159, -55674, 288138, -156623, -122120, 360980, 104595, 111516, -174104, -2859, 5427, 337943, 147526, -216710, 207711, -214177, 16875, -103173, -143074, -125661, 142286, -247498, 126409, 291638, 75520, 236799, -44702, -134648, -74618]
15102g4618D4492P3862N8644K52899a81169A83477b07970B0994L4142M82332a44470
15090A23542c7211B26644n2163G4193K11770b81152d6575A91240p7746a76119
15079A58154n7904e6536b2621D4001J88700a5022A97936F5480M5456K16987i5771
15067h9903B21016E6743K21218a20287e1513k9447B87849a77028C16684a60267
15056h9859A4538O9242J20694G8828l0213J39017A1150J26731a3071C55851j5986
15045C39865C6451K31753A19521J62457j37130M2111q6312g0513m6795b4876B57099
15033A39915C6449c8760D8230a40551D5089b04360C99201a26037A74739N2023
15023B26762k6614a8731E88565a65697C40050a09721G0838J61494a17812C72254
$$ y = [-74618, 44492, 118354, 176998, 429897, -181169, 183477, -207970, 20994, 55136, 537468, -144470, 123542, -37211, 226644, 174481, 74193, 285963, -281152, -46575, 191240, 113494, -176119, 158154, 100250, -56536, -22621, 44001, 232701, -15022, 197936, 65480, 110936, 327923, -95771, -89903, 221016, 56743, 277961, -120287, -51513, -80960, 287849, -177028, 316684, -160267, -89859, 14538, 83780, 204474, 78828, 48615, 187632, 11150, 137881, -13071, 355851, 339865, 36451, 268204, 119521, 281978, 144848, 186959, 100647, -70513, -117308, -24876, 257099, 139915, 36449, -38760, 48230, -140551, 45089, -204360, 399201, -126037, 174739, 226762, 200148, -18731, 588565, -165697, 340050, -109721, 70838, 232332, -117812, 372254]
15012A01616J8475O6408b93841F6257J19739a98061B26829j10377J7237a12971
15001A27628J33084J3236b19770A8625d7317I7551a3781A59232c212D12889j51467
14990B61422a73390H2569K15808N6752j29362c300A52329P6852o9323A0895M54987
14979D65882A38134J48456K05754B02473I3185L8841o1366K45142f3607a3667
14968G1660J90911D8747J10818K45967A10837L05396B01717K73938a70274A63177
14957B57450O3756i5923A9599P7834L39231G3347M68634n8034h4174F276M16963
14946D23239j98113o0590m0191f3767D27182j0374H3664J30474L48892A24297
14935D19840B05379C0515M10568H2418J50442d7370A67698D7102K25178m1609
$$ y = [101616, 120091, 186499, -293841, 66257, 185996, -198061, 226829, 116452, 133689, -112971, 127628, 260712, 273948, -219770, 18625, -47317, 97551, -13781, 159232, -3212, 412889, 261422, -173390, 82569, 298377, 355129, 225767, -3300, 152329, 229181, 159858, 10895, 465882, 138134, 286590, 492344, 202473, 93185, 132026, 70660, 315802, -63607, -13667, 71660, 262571, 48747, 159565, 405532, 110837, 416233, 201717, 475655, -170274, 163177, 257450, 321206, -95923, 19599, 97433, 436664, 73347, 541981, 483947, -84174, 6276, 423239, 225126, 164536, 124345, -63767, 427182, 416808, 83664, 214138, 563030, 124297, 419840, 205379, 30515, 441083, 82418, 232860, -47370, 167698, 47102, 272280, 230671]
14925B30671a49725B72279j12810R3245d3096D16927j39168C4067L35980A29319
14914C98076q1408C3477J65371M38163k42675q4731H7017J01487l1686n367J77491
14903C28942r6970m9619J79271R6134j7252k0994A53481B2557L84409j33105l1548
14892B42313n7053J93769I4726J62130Q2222J51993o0512j62404A7872L57948
14882C75820i90B05665q934K62187e6663B961N1812O2765L57830B11612p3155
14871A38457C6422J28242P2693P2148K41926k39086J33216j03545m9262J60084
14861D52838B20904C0942L79051A13226J17085O518j13938L30371J96251a847
14850c786B33616q4060L48849N894B10128o3074J57015n8306F4369K4148K51852
$$ y = [230671, -149725, 272279, 159469, 252714, -43096, 416927, 277759, 34067, 370047, 129319, 398076, 316668, 33477, 198848, 637011, 394336, 309605, 87017, 188504, 156818, 151451, 328942, 231972, 182353, 361624, 457758, 440506, 419512, 153481, 22557, 406966, 273861, 242313, 185260, 379029, 94726, 256856, 339078, 491071, 430559, 268155, 17872, 375820, -990, 205665, 196731, 458918, -56663, 2961, 54773, 117538, 475368, 211612, 138457, 36422, 164664, 237357, 309505, 551431, 312345, 445561, 342016, 292754, 452838, 220904, 30942, 409993, 113226, 230311, 236829, 122891, 453262, 649513, -1847, -3786, 233616, 149556, 498405, 504299, 210128, 147054, 304069, 245763, 64369, 88517, 340369]
14839C40369J56318J41651l08590J38638j51760A22053Q3803P9336J40426k01135
14829B24483K33684r6243O6339p2265I6230K85644K16643B56492J85256J25187
14819E66935o7833k15176j03162J05572J88289B36608M10931B82499K53584j28882
14809D07201q9145O3614j57949L07411j47221p5358q0530J95924r1801j03554
14799B28592G1564K93484m8597L23208K3860j09835K8872B47289p3199K42157
14789D16247q8782J27679J37644p6981L1289m0160k10275F0182K75340j4923K12747
14778E33346n8296p1857J18494A62304L97320B40474J13557Q6863r0186j35695
14768B15013q0269K55523K64558l3473k53345D5466J14741M05433o9063J37060
$$ y = [340369, 496687, 638338, 329748, 468386, 316626, 122053, 205856, 285192, 425618, 224483, 458167, 361924, 428263, 355998, 96230, 381874, 598517, 256492, 441748, 566935, 499102, 283926, 180764, 286336, 474625, 236608, 647539, 282499, 536083, 407201, 318056, 381670, 223721, 531132, 383911, 308553, 228023, 423947, 332146, 228592, 71564, 365048, 316451, 639659, 663519, 553684, 582556, 247289, 174090, 416247, 327465, 455144, 592788, 515807, 547096, 506936, 296661, 60182, 335522, 320599, 533346, 475050, 403193, 521687, 162304, 559624, 240474, 354031, 440894, 350708, 215013, 134744, 390267, 654825, 621352, 368007, 45466, 160207, 565640, 496577, 633637]
14758F33637p7441J34615B03824J63956J47235B25845K58518N8289r415n9795
14748D73442r4645K10238Q8483A25350J67150Q4434J06760j23744J07975j8956
14738D48969j10885L448A26400P8402J12925M33607k305l52933j46278N82391
14728H32209j26083k51201L14561j8946C49080p5999J63854K76892q5673j31453
14718D96701J53587C03922O51700k73467j20397k6706n6387R9256P4654k84302
14708C68273M69275k73145K42768k76120K44099l54128L11074p8579P1288J7438
14698G42243K8143N106K9554B88154P56357l19167K0577J28266j933j43085j15032
14687F14137j43761K56185j75119N5087L5837J44893k79692L90447l73386P0537
$$ y = [633637, 556196, 690811, 203824, 367780, 515015, 225845, 484363, 542652, 533237, 473442, 378797, 589035, 677518, 125350, 292500, 376934, 483694, 359950, 467925, 448969, 338084, 341532, 126400, 204802, 317727, 751334, 749029, 396096, 249818, 832209, 706126, 454925, 769486, 750540, 349080, 273081, 436935, 713827, 628154, 496701, 650288, 303922, 955622, 682155, 561758, 535052, 478665, 577921, 652575, 368273, 837548, 564403, 807171, 531051, 775150, 421022, 732096, 653517, 724805, 742243, 770386, 775492, 805046, 288154, 1044511, 725344, 745921, 874187, 872254, 729169, 614137, 470376, 726561, 551442, 606529, 642366, 787259, 507567, 898014, 524628, 595165]
14677E95165J88354j80941n3175L53163j20345N2453j26307k04580M48072q3831
14667H68028k38282K52214k79404N0391L4384j49204K73137K3961l17313K18206
14657G36118m6878n7460L17575k39229K32259J11830m01231N2961K50077D65579
14646G92935K50835r2065Q276J89337k64431j69016J49596M9578n5787j51346
14636G07912M43496l02288j5957O4279J6734j54617J30655L40254m75499N12959
14626A267928m19755L14218m10293J50712k12283L20657J06650o4682j03078J01980
14616A052054K52057k92972N3762l64259r1820J49375J67288L26623r3733J59313
14606A317688k50909O1338o041L05158P9374m92036J4309q7688J07179J79453
$$ y = [595165, 783519, 602578, 549403, 902566, 782221, 834674, 708367, 503787, 951859, 868028, 629746, 881960, 602556, 652947, 687331, 538127, 811264, 835225, 517912, 736118, 689240, 631780, 949355, 710126, 942385, 1054215, 652984, 705945, 956022, 465579, 792935, 1043770, 951705, 959981, 1149318, 884887, 715871, 865467, 915045, 859258, 707912, 1151408, 849120, 833163, 897442, 914176, 759559, 890214, 1230468, 754969, 1267928, 848173, 1162391, 752098, 902810, 690527, 1011184, 1117834, 1053152, 950074, 1052054, 1304111, 1011139, 1064901, 700642, 608822, 758197, 925485, 1252108, 1158375, 1317688, 1066779, 1128117, 1122076, 1427234, 1506608, 1014572, 1028881, 941193, 1048372, 1227825]
14596A227825J6464L0244j94722M1374K28372m33966J08766r7739M23499j4357
14586A335760J6071K9297M0368K31545o35698K80050j93114J50570J22314k98363
14576A078800L87583m80537M07183o8944L16150l89503J31255L318k28774K56616
14566A413147j66913K26107n8599k0318K01871j49567L48382k78108J24006r8650
14556A541358L440J3626p2900R4029J63352l05447M22448k37469K46516k81929
14546A587024K26574l16797N88040j4404j33078n586L40707k51277J5061L7947
14536B074211L20645j96936j73073Q2344K14364K60560J1821P1268K63835M56838
14526C385877M32125L21465J069317K495633M346892J0127263K4219698o565036
$$ y = [1227825, 1244289, 1274533, 1079811, 1121185, 1349557, 915591, 1024357, 926618, 1350117, 1335760, 1351831, 1381128, 1421496, 1653041, 1017343, 1297393, 1104279, 1254849, 1377163, 1078800, 1466383, 985846, 1393029, 1324085, 1640235, 1250732, 1381987, 1385305, 1156531, 1413147, 1246234, 1472341, 1413742, 1393424, 1595295, 1445728, 1794110, 1516002, 1640008, 1541358, 1544798, 1558424, 1485524, 1579553, 1742905, 1437458, 1859906, 1622437, 1868953, 1587024, 1813598, 1496801, 2084841, 2070437, 1937359, 1931773, 2272480, 2021203, 2036264, 2074211, 2394856, 2197920, 2024847, 2107191, 2321555, 2582115, 2593936, 2665204, 2929039, 3385877, 3818002, 4139467, 5208784, 7704417, 12051309, 22178572, 46398270, 39833234]
14518C9833234A3322607E303813j894660r62395p12229J13401j76973J18010q6139
14509A702828p8210J46145K2282M30608k93210k00290P4180j22565K59187L8037
14499A978992j02220O7594l3072J82140J15250j14221K44398k14556J17589m0072
14489B201822K4287M19714j09256k56091j22358L43476o3937j26726K09922o8563
14479B452290k29021P72744k67508k09205L80256l43336N65468j22394l82631
14470B616663Q9881q9216M08256l0446J47709l5430k03468J19000k25691L47443
14460C144701P8225k39806L80984j33203J38062j13798k31897M44360j49796P7786
14450C395618M06530j95360r7715j3231q4268k41154N31578j02942q9362K76021
$$ y = [39833234, 13322607, 5303813, 3409153, 2446758, 1734529, 1847930, 1670957, 1788967, 1702828, 1624618, 1770763, 1793045, 2223653, 1930443, 1730153, 1804333, 1681768, 1940955, 1978992, 1876772, 1944366, 1911294, 2093434, 2208684, 2094463, 2338861, 2124305, 2241894, 2201822, 2226109, 2645823, 2536567, 2280476, 2158118, 2501594, 2437657, 2310931, 2520853, 2452290, 2223269, 2996013, 2728505, 2519300, 2899556, 2556220, 3121688, 2999294, 2616663, 2706544, 2617328, 3025584, 2995138, 3142847, 3107417, 2903949, 3022949, 2797258, 3144701, 3222926, 2983120, 3364104, 3230901, 3368963, 3255165, 3023268, 3467628, 3317832, 3395618, 3802148, 3606788, 3509073, 3495842, 3411574, 3170420, 3701998, 3599056, 3509694, 3785715]
14440C785715j70675M2402k6988L30042j10666K22006k65526L52415M1817k34447
14430C966095K02972M5485L45320J34315m78819J48492M32152k71635L39059k50766
14420D612670K47890j50563K88553l5292J612R1124O4038n508O65627m59800R6034
14409E416385N2052K0528M81839k70357K05656K85266p9985K63491j78049J45226
14399F342052k49333K40717J71457j5082L56544k43590k7055J78236M34826K87873
14389G476645l83730L35869k64791O03307J44177j22178J27646R7026m2844J05339
14379H076466L13206K26323L77708m61337J74177L54114j15617L56031j46850
14370I154221N01215J56100l7456J76837M32155J51492L0471J57125O37570k6156
$$ y = [3785715, 3615040, 3657442, 3630454, 3960496, 3849830, 4071836, 3806310, 4158725, 4200542, 3966095, 4169067, 4214552, 4559872, 4694187, 4215368, 4363860, 4796012, 4524377, 4863436, 4612670, 4860560, 4709997, 4998550, 4963258, 4964870, 5055994, 5120032, 5114524, 5780151, 5320351, 5416385, 5468437, 5488965, 5970804, 5700447, 5906103, 6191369, 6111384, 6374875, 6196826, 6342052, 6092719, 6333436, 6504893, 6489811, 6846355, 6602765, 6575710, 6753946, 7188772, 7476645, 7092915, 7428784, 7163993, 7767300, 7911477, 7789299, 7916945, 8013971, 7971127, 8076466, 8389672, 8615995, 8993703, 8532366, 8706543, 9060657, 8945040, 9301071, 9154221, 9655436, 9811536, 9774080, 9950917, 10383072, 10534564, 10565035, 10722160, 11359730, 11333574]
14360A1333574N8074J69012K00331K49719K81653N11927J00596J07138K66256
14351A3278280L14507N09629q3158L92174Q9420N90243J71408R8555J51566P55157
14341A6267781J17535L82223N53452P5765N46155N22397K86087N67965o4159L93050
14331A9648251R23551L68136M83213K58342N03227N50586N43394O59045N93713
14322B4531458L98060R44857P32402O86613O03736N67796J220189N62392M59672
14313C0707175J155203P96943J230362O37510J396761P23447J299966J231190
14305C9178557J359619J459785P66148J508982J176123J801109J881458J696885
14297E0828666J672253J551946K119276J963503K102418K660171K333100K432019
$$ y = [11333574, 11391648, 11560660, 11760991, 12010710, 12292363, 12804290, 12904886, 13012024, 13278280, 13592787, 14102416, 14019258, 14411432, 14500852, 15091095, 15262503, 15361058, 15512624, 16267781, 16385316, 16767539, 17320991, 17396756, 17942911, 18465308, 18751395, 19319360, 19255201, 19648251, 20571802, 20939938, 21423151, 21681493, 22184720, 22735306, 23278700, 23937745, 24531458, 24929518, 25874375, 26606777, 27293390, 27897126, 28464922, 29685111, 30247503, 30707175, 31862378, 32659321, 33889683, 34527193, 35923954, 36647401, 37947367, 39178557, 40538176, 41997961, 42764109, 44273091, 45449214, 47250323, 49131781, 50828666, 52500919, 54052865, 56172141, 58135644, 60238062, 62898233, 65231333, 67663352]
14289F7663352K841207K929799K664443L199344L661360L513615L596156M110388
14281I4179664M453213M271508N209355N061559N470359N991419N919827O865181
14273A37422085O932491P312466P957880R018197Q520608R557941J0085779J0691552
14265B07498999J1172152J1764719J2689148J3154803J4200203J4470242J5225610
14258C00175876J5837313J5982630J6120661J6565581J5991302J5875775J5392945
14251D11942083J3844161J2890645J1130487Q190678J722281M77078L89169o06376
14243D59980206j059378m665288q219256r258063j1659007j3845721j4002472
14236C97271021j4543132j6618072j6895642j6747190j6612090j6047070j4624791
$$ y = [67663352, 70504559, 73434358, 76098801, 79298145, 82959505, 86473120, 90069276, 94179664, 98632877, 102904385, 108113740, 113175299, 118645658, 124637077, 130556904, 137422085, 144354576, 151667042, 159624922, 168643119, 177163727, 186721668, 196807447, 207498999, 218671151, 230435870, 243125018, 256279821, 270480024, 284950266, 300175876, 316013189, 331995819, 348116480, 364682061, 380673363, 396549138, 411942083, 425786244, 438676889, 449807376, 457998054, 459720335, 460197413, 460586582, 459980206, 458920828, 454255540, 446036284, 436778221, 425119214, 411273493, 397271021, 382727889, 366109817, 349214175, 332466985, 315854895, 299807825, 285183034]
14229B85183034j5293192j4002172j3512250j3434869j1809511j1329166j0950370
14222A94851504j0383080r728541q578666q433161p465147p759638p230773o347900
14214A28924598o240469n322917n203419m870862n402467m291777m285768l957921
14206H9348998l314906l269050l431508l129555l642350k550232k680114k455121
14198F4876162k342506k468961j776636k024327k267480j618651j427286j911312
14190D9039003j534241j882206r56971j673688j270246j253449j465805r90788
14182C8011609q76783m31898j295116j502646j021995j094864n05047n40695n72765
14173C0169800j273979n13027m97952p49185j207675n8188r74082l25031j065128
$$ y = [285183034, 269889842, 255887670, 242375420, 228940551, 217131040, 205801874, 194851504, 184468424, 174739883, 166161217, 157728056, 150262909, 142503271, 135272498, 128924598, 122684129, 117361212, 112157793, 107286931, 101884464, 97592687, 93306919, 89348998, 86034092, 82765042, 79333534, 76203979, 72561629, 70011397, 67331283, 64876162, 62533656, 60064695, 58288059, 56263732, 53996252, 52377601, 50950315, 49039003, 47504762, 45622556, 44665585, 42991897, 41721651, 40468202, 39002397, 38011609, 37134826, 36702928, 35407812, 33905166, 32883171, 31788307, 31283260, 30742565, 30169800, 28895821, 28382794, 27884842, 27135657, 25927982, 25869794, 24895712, 24570681, 23505553]
14164B3505553o52076l25442l83599p77480Q0144o99716p75527k84057l69259
14155A9318541n21193n21742o52306j31545j89100j41256o16267o97530p8362
14146A5769240k74688k44995l96259j32033p22616J40394j94721n66530M6240
14137A3424032p1963n98092P804j27126l91140j98149Q8368o47210l59334Q3139
14127A1210329q6819j16983l15899j28676J91393o97973J22153j47732k58020
14118I771773k10477o7246l10049p2146j38446L85547n35089j06094r2112n8005
14108H567656n3232m03818J15240j5385j9328n76918K10235m65142l3078J46382
14098G472612j17646l71827j94297J631O2799k40221k76946K39584R9436m51864
$$ y = [23505553, 22853477, 22528035, 22144436, 21366956, 21447100, 20747384, 19971857, 19687800, 19318541, 18797348, 18275606, 17623300, 17491755, 17302655, 17161399, 16545132, 15847602, 15769240, 15494552, 15249557, 14853298, 14721265, 13998649, 14139043, 13944322, 13377792, 13424032, 13352069, 12753977, 12761781, 12634655, 12243515, 12045366, 12133734, 11486524, 11127190, 11210329, 11123510, 11006527, 10690628, 10561952, 10753345, 10055372, 10177525, 10029793, 9771773, 9561296, 9494050, 9184001, 9111855, 8973409, 9358956, 8823867, 8717773, 8625661, 8567656, 8514424, 8110606, 8225846, 8210461, 8191133, 7614215, 7824450, 7359308, 7326230, 7472612, 7354966, 6983139, 6788842, 6790473, 6853272, 6613051, 6336105, 6575689, 6675125, 6223261]
14088F223261L45821m12696P8285l45327L45970k65083p4976j35875J6660J6783
14078E792823l99592J4116m6548l83055M11520N8133k26678J39937j31211l46620
14068D882825J09954l18124Q9541J15277l97892K80832j68465J9925j61678O5313
14058D517508o0683J18629m09546j29585O2828K25569p1375k35464j88697K92211
14048D121395j11914j31062J11084m220k41730K53654k87519Q7453p3062m1911
14038C682168R3163N4853n4555k47269M5336l2421O7528k65981L51712l98088
14028C296446l14268M02487k20080J71281j47751k63823m9412K69870k17096K83645
14018C211299k5835l72091O2904m8929K12360j41388k11015r7874J28769J81679
$$ y = [6223261, 6569082, 6156386, 6234671, 5889344, 6235314, 5970231, 5895255, 5759380, 5776040, 5792823, 5393231, 5407347, 5360799, 4977744, 5389264, 5447397, 5220719, 5360656, 5229445, 4882825, 4992779, 4674655, 4764196, 4879473, 4481581, 4762413, 4593948, 4613873, 4452195, 4517508, 4456825, 4575454, 4165908, 4036323, 4099151, 4324720, 4253345, 4017881, 3829184, 4121395, 4009481, 3878419, 3989503, 3985283, 3743553, 3997207, 3709688, 3797141, 3724079, 3682168, 3775331, 3830184, 3775629, 3528360, 3573696, 3541275, 3608803, 3342822, 3694534, 3296446, 2982178, 3384665, 3164585, 3335866, 3188115, 2924292, 2874880, 3144750, 2927654, 3211299, 3185464, 2813373, 2876277, 2827348, 3039708, 2898320, 2687305, 2589431, 2718200, 2899879]
14008B899879m26219J99247J79125m866k24293p568j15626l0602N349J41685m2189
13997B573922p3178j06584k00718K55362k02776K52398R539k55478K1442j69470
13987B104459J01418K63156m45884k24958K03057l6741R3300R8034l18752j55686
13977A681403L04318j79009K18267l66611N5748N8891O509J29872j18062J13622
13967A904948j49879J97099j07772J38557J662061K661816P019001K1599021J1727815
13958D6652667B0661267A0326919m010901j668131p77659n12982q7201l60927
13950B909118l03768m8367O413j26032k89210M98967m13758m3974p738P216k36684
13939A952183k80357J81983j41482j4641J80019K57007l01992j11923P8028k4033
$$ y = [2899879, 2473660, 2672907, 2852032, 2847166, 2622873, 2615305, 2499679, 2469077, 2474426, 2616111, 2573922, 2500744, 2394160, 2193442, 2448804, 2246028, 2498426, 2507965, 2252487, 2273929, 2104459, 2205877, 2469033, 2023149, 1798191, 2001248, 1964507, 2057807, 2155841, 1837089, 1681403, 1985721, 1806712, 2024979, 1658368, 1714116, 1773007, 1779516, 1909388, 1791326, 1904948, 1755069, 1952168, 1844396, 1982953, 3645014, 6306830, 13325831, 34924852, 46652667, 20661267, 10326919, 6316018, 4647887, 3870228, 3357246, 3270045, 2909118, 2605350, 2556983, 2563396, 2437364, 2148154, 2647121, 2233363, 2189389, 2181651, 2188867, 1952183, 1671826, 1853809, 1712327, 1697686, 1877705, 2134712, 1832720, 1720797, 1798825, 1774792]
13929A774792m5399K52369O1252l69738Q8176J2471r5763j84029P203J86260J55885
13918A843479j6944J75090k86321k9070j13802N4381J4003j73707L53752l14265
13908A506596K90080o13189K19404P6863J93198l42580K06568j87179p6771m1770
13898A231220N5367J21345K58918j06014o1727o05201J58560k1903J85418m2035
13888A173948J72097l1643J21070k2361k16003O7162J00330J54271n921k90647
13878A222303j24421J26385k19238N7317L81119j26395l40632L29427q0339K5315
13868A250841m33281K86110l61623J67754L27593O6684j29432j1307Q5437J31748
13858A380524k48680n0641j91019R6637J08670Q3687k00614J81887j38745J4861
$$ y = [1774792, 1729393, 1981762, 2043014, 1673276, 1761452, 1773923, 1678160, 1494131, 1501334, 1687594, 1843479, 1826535, 2001625, 1715304, 1686234, 1572432, 1626813, 1640816, 1467109, 1820861, 1506596, 1796676, 1183487, 1402891, 1479754, 1672952, 1330372, 1536940, 1349761, 1272990, 1231220, 1286587, 1407932, 1666850, 1560836, 1499109, 893908, 1052468, 1030565, 1215983, 1173948, 1346045, 1314402, 1435472, 1413111, 1197108, 1264270, 1364600, 1518871, 1512950, 1222303, 1097882, 1224267, 1005029, 1062346, 1443465, 1317070, 976438, 1305865, 1225526, 1250841, 817560, 1103670, 742047, 909801, 1237394, 1304078, 1174646, 1163339, 1248776, 1380524, 1131844, 1081203, 890184, 986821, 1095491, 1179178, 978564, 1160451, 1021706, 1036567]
13848A036567k635o6643K15085m90893O12218k08574k82291J34215q5082J22423
13838I84390k22653J90290j38677J07430L61771o01795K47203K46588m44713M37917
13828A167751l55953J74724K6892j41877L85l65815K57789J86263N1212J20232
13818A121603j33029J71510p4313m58248L69220l73200L34734l05594J29584l0819
13808G51448N00781n72819K9531L22917l64452L93870j66601k07361J04858J48693
13798I40865k37187m5626P7870M14969j91238l80316L68578j8042l51259L75822
13788I54436P5211o3280k41497k19710L00016j78214K20019J24857j44658J2023
13778H39203K6699k82771L77345k87193j5652j00867N45504l02259j96760q3484
$$ y = [1036567, 1033932, 967289, 1182374, 691481, 1303699, 1095125, 812834, 947049, 861967, 984390, 761737, 952027, 813350, 920780, 1282551, 680756, 927959, 1174547, 729834, 1167751, 811798, 986522, 1013414, 871537, 871922, 506107, 763896, 950159, 1001371, 1121603, 988574, 1160084, 1085771, 627523, 996743, 623543, 958277, 652683, 782267, 751448, 1252229, 679410, 708941, 1031858, 667406, 1061276, 894675, 687314, 792172, 940865, 703678, 658052, 735922, 1150891, 959653, 579337, 947915, 929873, 578614, 954436, 1029647, 966367, 724870, 505160, 805176, 626962, 846981, 971838, 827180, 839203, 865902, 583131, 960476, 673283, 657631, 556764, 1102268, 800009, 603249, 519765]
13768E19765P0840j58789J44861J27324J41160r6820J01248j52704k35585J45937
13758F07237N9498K61602n2913J36545m58149A66372M71569K94651D62977P2551
13748E35528J10889k49213M10171k55823J74827q0795B77521K60269K8669j98347
13738C68112M78497k02698l17797J78730K91049B96725J70467J19230J18548k45097
13728D59873M11876J15261l71079J98737l90974K84677k27336r2442J11002J31577
13718F31172Q7044l57914M4406J51932N0642j29529J07981k76365K98440J47230
13708G55039r5353j04391K17972j07079O266j02957j02066o8752K06259j70921
13698D34017A18017K99322J06213m307K16879L12930D66990J38356j51833K48921
$$ y = [519765, 590605, 431816, 576677, 704001, 845161, 748341, 849589, 696885, 461300, 607237, 666735, 928337, 875424, 1011969, 553820, 166372, 637941, 932592, 462977, 535528, 646417, 397204, 807375, 551552, 726379, 645584, 277521, 537790, 566459, 368112, 846609, 643911, 326114, 504844, 795893, 296725, 467192, 586422, 704970, 459873, 871749, 987010, 615931, 814668, 423694, 708371, 481035, 388593, 499595, 631172, 718216, 360302, 404708, 556640, 607282, 477753, 585734, 309369, 607809, 755039, 659686, 555295, 773267, 666188, 672454, 569497, 467431, 398679, 604938, 434017, 118017, 417339, 523552, 519245, 736124, 1049054, 466990, 605346, 453513, 702434]
13688G02434l31519J83121L0946k12877J76215J79648k62875j32503K71570B69122
13677D87842R6755p4124J6969O9720k49000O8171J42707A94982J80074m4604L38151
13666F68603k76441Q040m8488J43342A71878L80054O0725k85078J16186j80922
13656B62843K10251K29976B09206M12746r7990n9371K81120C49205R1963J79865
13646F21033B03556M85192K3924B87557H7293N92731C24637L5730j62047j3088
13636A85232L45434n3368J1904j87017j37791K99057m7293K17255m0138J70073
13626G63348C8825K61118J75086j66064M93079B93316M7127J19503B20647J16242
13616C36889h15H3785L97164j56621j11999K10847j8503J99860k49521j23980
$$ y = [702434, 370915, 554036, 584982, 372105, 548320, 727968, 465093, 332590, 604160, 269122, 487842, 584597, 510473, 527442, 597162, 348162, 416333, 559040, 194982, 375056, 330452, 668603, 392162, 400202, 351714, 495056, 171878, 551932, 612657, 327579, 443765, 262843, 473094, 703070, 209206, 621952, 523962, 464591, 745711, 349205, 441168, 621033, 203556, 688748, 712672, 287557, 87293, 680024, 324637, 360367, 198320, 185232, 530666, 477298, 489202, 302185, 164394, 463451, 416158, 633413, 593275, 763348, 38825, 299943, 475029, 308965, 802044, 293316, 340443, 459946, 220647, 336889, -815, 83785, 480949, 324328, 212329, 423176, 404673, 604533, 355012, 231032]
13606B31032O2329K759K17314k07351A00112M11297j88836j16344L92853m3510
13596E55572k52669K15489B9401M07432j51441J30181J48798m0921R991k57761
13586B75680J9713P8713K92909d0364A90283R686L75974j81182q4323J6861Q9948
13575D17247n6820J46731j31012P5312K48960l10338o0474J14734j99707n9940
13565A84693l9937K11586R4173N4433A94688N05856B28161L2678P3349r8664o4158
13554A71366K21807K24433B84969o4728l6749O2986g015E27752M257o8520k27389
13543B36100J09158K6762J96707B78824K8140K49585A42210l1747K00437j44426
13533A66474M40342B52561E1131J91130K97012A01236K16008J9607j12915J45533
$$ y = [231032, 293361, 296120, 513434, 306083, 100112, 511409, 322573, 206229, 599082, 555572, 302903, 518392, 29401, 436833, 285392, 415573, 564371, 523450, 533441, 275680, 295393, 374106, 667015, -40364, 190283, 199969, 575943, 394761, 310438, 327299, 417247, 360427, 507158, 376146, 451458, 700418, 390080, 329606, 444340, 244633, 184693, 144756, 356342, 450515, 504948, 194688, 700544, 228161, 260839, 334188, 235524, 171366, 393173, 617606, 284969, 220241, 183492, 246478, -7015, 527752, 532009, 463489, 236100, 345258, 372020, 568727, 278824, 306964, 556549, 142210, 110463, 310900, 166474, 606816, 252561, 51131, 242261, 539273, 101236, 317244, 336851, 223936, 369469]
13523C69469A9692M69049Q006d2476A65272M402K01235n5985a9170B66883o1089
13512B05794J76975P0385j64210J93842P5583A316M54648a43570A77599o0160
13502A17439Q839o1960e9621B76821H4713K45506Q4279o3519j57991L15489B05341
13490D4334K07072p8294N3736q609r9101k860a25961C62277J25299j38677j22832
13479B26067k5793K1973J88605A50908J93246A66957K12521l8861K8283I6033
13468A41607L42366k06608j05860J45848A15391m7201K47081A09663R5651K14191
13458D19505A8306i3049B35424r277M169k2653J1104j7344L0763o0930l2795n3246
13446H5215b356D44591E3609L8898J87722g185C46131k0703J25745A19901J15777
$$ y = [369469, 19692, 488741, 496747, -42476, 165272, 169674, 370909, 314924, -19170, 266883, 205794, 382769, 453154, 288944, 482786, 558369, 1316, 455964, -143570, 177599, 117439, 126278, 64318, -59621, 276821, 84713, 330219, 414498, 350979, 192988, 508477, 205341, 44334, 251406, 173112, 226848, 218239, 119138, 116278, -125961, 362277, 487576, 348899, 226067, 200274, 222247, 410852, 150908, 344154, 166957, 379478, 340617, 368900, 96033, 141607, 483973, 277365, 171505, 317353, 115391, 68190, 315271, 109663, 205314, 419505, 18306, -93049, 235424, 226147, 230316, 207663, 218767, 201423, 232186, 171256, 138461, 85215, -2356, 444591, 53609, 92507, 280229, -7185, 346131, 325428, 451173, 119901, 235678]
13435B35678G1107R2364K131J08943C8091N0272J86865e9294C27696K32104k03164
13424C56636B2802L34867G8913J34697J85584A0272K16569k2295L8955j10448
13414A33053f7066r5806E36671F7511J63090I2448M10456j56830o0374K31575
13404E17275j90986A8138L6298M23170A32458Q4000A9894K45788l8322J79961
13394D07321C2658b473H6727J65658J26170G6688d1302A71604N2055A9855p159
13383A2696J12391J6793J55391H7413L39923j12847r4863D5147M21717n6186A49595
13371D61835a09369A92235K03040G2306P3313D4436A34K41384I738R4446L73584
13360D77768M0444E1608N5492J77966a12358A0365K99120j31592G543Q9325c3531
$$ y = [235678, 71107, 163471, 165602, 274545, 38091, 88363, 275228, -59294, 327696, 559800, 356636, 22802, 357669, 78913, 213610, 399194, 10272, 226841, 204546, 243501, 133053, -67066, -162872, 536671, 67511, 230601, 92448, 502904, 346074, 285700, 517275, 326289, 18138, 54436, 477606, 132458, 216458, 19894, 265682, 227360, 407321, 32658, -2473, 86727, 252385, 378555, 76688, -41302, 171604, 223659, 19855, 12696, 125087, 141880, 297271, 87413, 427336, 314489, 219626, 45147, 466864, 410678, 149595, 461835, -109369, 192235, 395275, 72306, 145619, 44436, 134, 241518, 9738, 104184, 477768, 518212, 51608, 107100, 285066, -112358, 10365, 309485, 177893, 7543, 96868, -33531]
13348D63913j41655n6096F394B566M37286j50628K4977N0140j31483J31637e3573
13336A8015L6950M07480B14061J08160A4220R2554Q7845o6566J123m8534K53504
13325C34146J12946a23146E55202E4178a99675E42998A80021J381G6642L79069
13315D55711a10394A0994N11805A14303C0367e9771I8396c2411B90306J99628
13305D89934k08354J72841a58010B29748a09537A76172D1310K59992A2684L00433
13295C13117A7494L8927J91907L246j4556J5572D5155J17277c6463A93700J45104
13284C38804B8485c8310A92645J45991a32708B17554J05971C4087a22873q8019
13274b10892B32282l451J40322G9130J38514H8467e0429F4707a0234M361k36512
$$ y = [463913, 322258, 266162, 6394, 2566, 439852, 289224, 314201, 364341, 232858, 364495, -53573, 18015, 54965, 462445, 214061, 322221, 14220, 106774, 194619, 128053, 129176, 80642, 334146, 447092, -123146, 555202, 54178, -199675, 542998, 180021, 181402, 76642, 455711, -110394, 10994, 522799, 114303, 30367, -59771, 98396, -32411, 290306, 489934, 281580, 454421, -158010, 229748, -109537, 176172, 41310, 301302, 12684, 313117, 17494, 56421, 248328, 251574, 237018, 252590, 45155, 162432, -36463, 193700, 338804, 28485, -38310, 192645, 338636, -132708, 217554, 323525, 34087, -122873, -210892, 232282, 228831, 369153, 79130, 217644, 88467, -50429, 64707, -10234, -5873, -242385]
13263b42385B19148N6195g0798B31511c05212B2190J33406n526A1319O6442A0217
13251A16627P3790J74542K6678A43922J38774a26564a0891E5267q019J64371K87463
13240D99082k6142a27315G3163a85705l4667Q7080b0864C92520I2184a43520C96345
13228C05497j40109A5894L60132j81883B033R6159a3337D13104B9859P6451k3787
13217H2523P4493l571d4634M309I5986L00315D2784L10355k6987J5690G20L32902
13205C33622C4902K06176j15804J51473G780J66150J3535a78j19589A51741K12811
13194C64552A81184N4841o6900c79374J88468A25740a594G6371K6051J40946n4081
13183A89287q2419K08974j01505k2849a1939A34397a41881b1387D88665A80591
$$ y = [-242385, 219148, 275343, -70798, 231511, -305212, 22190, 155596, 150070, 11319, 77761, 10217, 116627, 190417, 364959, 391637, 143922, 282696, -126564, -10891, 55267, 47248, 211619, 499082, 472940, -127315, 73163, -185705, -220372, -133292, -20864, 392520, 92184, -143520, 396345, 305497, 165388, 15894, 376026, 194143, 2033, 98192, -13337, 413104, 29859, 106310, 82523, 157016, 153445, -44634, -40325, 95986, 396301, 42784, 353139, 326152, 341842, 720, 333622, 34902, 241078, 125274, 276747, 7780, 173930, 187465, -178, -119767, 151741, 364552, 181184, 236025, 169125, -379374, -190906, 125740, -1594, 76371, 102422, 243368, 189287, 106868, 315842, 214337, 191488, -11939, 134397, -141881, -21387, 488665, 180591]
13172F6415K21110D0360d125B7472J17844a1103A29223e2348E4293R8683C5803
13160c08234H5820L04060A34627m9455j4811P780h6578G1420A0561b444C06987
13148A10696b90247L3933A18732M76240k81581j03285C9793h9803A58928K4261
13138A83189J3017j5893a02363C59030C9248K90389b4538B3539c7748j1356C24584
13126a15926J3385k80495D90171A32301l5611b45048R6880C96803e7573j6996
13116g4569l735B02725P3866j1467j22254c63891J79202B41356j00030e854A09942
13104a56808C49417l3017b26545A46340a5987A16551K4000j8795B2504J6805K9736
13093F9045K9712N7498A8643K0358J12259K28778I9896a46430b9321D0946a83175
$$ y = [66415, 287525, 40360, -4125, 27472, 145316, -11103, 129223, -52348, 54293, 152976, 35803, -308234, 85820, 389880, 134627, 85172, 70361, 78141, -86578, 71420, 10561, -2444, 306987, 110696, -290247, -256314, 118732, 594972, 313391, 210106, 39793, -89803, 158928, 183189, 196206, 180313, -102363, 359030, 39248, 329637, -24538, 23539, -37748, -49104, 324584, -115926, -102541, -383036, 490171, 132301, 96690, -245048, -148168, 396803, -57573, -74569, -78304, 202725, 276591, 265124, 142870, -363891, -184689, 241356, 141326, -5854, 109942, -156808, 349417, 316400, -226545, 146340, -15987, 116551, 140551, 121756, 22504, 39309, 69045, 98757, 156255, 18643, 39001, 151260, 380038, 99896, -146430, -29321, 40946, -183175]
13081B4122f5644B83002D1329J39191D2634c15485B80603m6238j8427E291L30822
13070C36113a49487K1679A32028O5383o6192M0641n004N8591a51268g3851D6572
13058E9568a3152C82752D6868N0297a12999F8792k3202K42917j0741l3221f7600
13046a88884c7896j03095H7467A8297R6749F236J87671E6801P4915b01178A59989
13034C40132B4729L03411G1802K16768o640a24926F7958Q1555d37437B70730g929
13022C3280J00519J3542c3024A55088J63268m7233a27765B38793a76655C6042
13011A7112N6290d32480A10606K70520a94380M8573A71884q5817J5120K5766J0087
13000A37040E6498K07643p9765q685a4004C4504P4333a15368k9393D22945H2045
$$ y = [24122, -65644, 283002, 41329, 180520, 42634, -315485, 280603, 234365, 215938, 5291, 336113, -149487, -127808, 132028, 197411, 131219, 171860, 166856, 225447, -151268, -73851, 46572, 59568, -13152, 382752, 46868, 97165, -112999, 68792, 45590, 288507, 277766, 244545, -67600, -188884, -37896, -140991, 87467, 18297, 115046, 6236, 193907, 56801, 131716, -201178, 159989, 340132, 24729, 328140, 71802, 288570, 281930, -124926, 67958, 149513, -437437, 270730, -7929, 33280, 133799, 147341, -33024, 155088, 318356, 271123, -127765, 238793, -176655, 36042, 17112, 73402, -432480, 110606, 381126, -194380, -145807, 171884, 86067, 101187, 126953, 137040, 56498, 264141, 184376, 175691, -14004, 34504, 108837, -115368, -144761, 422945, 82045]
12988C91050j58961g7041A42655L2281l3474M8833b06244Q6633c432B04503C4064
12976a00900H6533l7315I031K00939p1532b24868P1197d6830b1341l6758q3114
12965a41213B58978C4294J37143a50097A47024k0256C3012K64634h5603D7590
12954c3457j37506d3447q1873D5650K74947A17163P1079A9455J16592b66132O9003
12943a97129A59383M18680B32910c63633B64625b05592L476C7267b04069B86207
12932a01082C56935A6486a23460C80a01883B71108F2241O3793K30896C5554c7642
12920i9856C27089a69640L1380j69616A59595b1559k71254B02118f8911B96936
12909b20891H9895a3097A47211M4117r074b29949A35540J07665G9444N0840g9307
$$ y = [391050, 232089, -77041, 142655, 174936, 141462, 190295, -206244, -119611, -3432, 204503, 34064, -100900, 86533, 49218, 9031, 209970, 138438, -224868, -153671, -46830, -21341, -58099, -141213, 258978, 34294, 171437, -150097, 147024, 126768, 33012, 297646, -85603, 47590, -33457, -170963, -43447, -125320, 45650, 320597, 117163, 188242, 19455, 136047, -266132, -197129, 159383, 578063, 232910, -363633, 264625, -205592, -202116, 37267, -204069, 286207, -101082, 356935, 16486, -123460, 380, -101883, 271108, 62241, 126034, 356930, 35554, -37642, -99856, 327089, -169640, -138260, -307876, 159595, -21559, -292813, 202118, -68911, 296936, -220891, 89895, -13097, 147211, 191328, 182254, -229949, 135540, 243205, 79444, 130284, -79307]
12897G8292b88166E1656a43047A09234J37137d63504J85291h5597b232C59986
12886A8043J00873B5465L832a19408j73174B08714E513a27016G6486a43729J7172
12875a26557G5880b05138C9297P8237k1615K9300J30112r6388C9015L10266A68879
12863F137J09088Q8215b9702E0081J00743Q4614o7643R0851k5901r6419b24946
12851I070J0184Q0422f3833B80869B5499K9894a40310C00167a48498k6266C3130
12839a32788E668L84845A49475a40999c3433B41821h377j25268m9496P8699n6910
12828a61352A89458q1496A6783L6157A4295K61646R7871a38339B357b01549D77102
12816b63907A22427Q2285a02850I6571a81487L2967A77112l8714A3875e8175C0159
$$ y = [78292, -288166, 51656, -143047, 109234, 246371, -463504, -278213, -85597, -2232, 359986, 18043, 118916, 25465, 29297, -119408, -292582, 208714, 5513, -127016, 76486, -143729, -126557, 75880, -205138, 39297, 117534, 95919, 125219, 255331, 158943, 39015, 349281, 168879, 6137, 115225, 203440, -29702, 50081, 150824, 235438, 167795, 258646, 232745, 136326, -224946, 9070, 19254, 99676, -63833, 280869, 25499, 55393, -140310, 300167, -148498, -174764, 33130, -132788, 5668, 390513, 149475, -140999, -33433, 241821, -8377, -133645, -183141, -104442, -161352, 189458, 107962, 16783, 52940, 14295, 275941, 373812, -138339, 2357, -201549, 477102, -263907, 122427, 204712, -102850, 96571, -181487, -148520, 177112, 138398, 13875, -58175, 30159]
12804A01499l6429k8284O448f7301L039k91662B5370K06600f3445B21793c96456
12792A60489k0755e7681p7595e5640A01942a85186B45586d6982q212G2950c560
12780G0659g5224A2792J23134b6099B21348f5939o2071J0640e6633A95238q7402
12769A07836a64748A59054L2586B5342J899J18360l2370O4142a49737j8685A41048
12757d6701a9925l02655C40977j52286c53235J03976A33610a03055C14530I1549
12746A95118c9526A61151b74689G9427a07208J2454m9926A5907a9524j85227A21981
12734d2778j48157j53262a17612B15825f2309B81155b80966H8816P0146g2994
12723a13890a2738j20948N517A22241b79645E4445e2051A52611O7466C5662J37522
$$ y = [101499, 65070, 36786, 43234, -67301, -64262, -355924, 25370, 231970, -63445, 221793, -396456, 160489, 139734, -57681, -135276, -55640, 101942, -185186, 245586, -46982, -55194, 72950, -3560, 70659, -75224, 12792, 135926, -26099, 221348, -65939, -128010, -117370, -56633, 195238, 107836, -164748, 159054, 191640, 25342, 27241, 145601, 113231, 177373, -149737, -168422, 141048, -46701, -19925, -322580, 340977, 188691, -353235, -249259, 133610, -103055, 314530, 91549, 195118, -39526, 161151, -274689, 79427, -107208, -94754, -144680, 15907, -19524, -204751, 121981, -42778, -190935, -344197, -117612, 215825, -62309, 281155, -280966, 88816, 158962, -72994, -113890, -12738, -133686, -128169, 122241, -279645, 54445, -52051, 152611, 220077, 35662, 173184]
12712A73184g1702D90460A39767i2573a1955C56136M599A20430J24362J17030
12702C61822d5178A55811c52580B17710a64908D04570I4753a75943A18600K1904
12692A40504l06a41160B22196O8512p3995g2694A7422L60312m9812j28697J34013
12681C33238j60658E0602a44501H2893J78541f933A86575K109A1952J27584J62340
12670C01876I2927J12199d0777H7549b294A61462a7222I9577a06303D02749d5469
12658G6989g9888l5001D1050J04973K42582A02180D5497B0972R8606Q4835A2345
12646a24891N4372B47484I453g2194C29108f2598j22746d6316j05287a0309mB00334
12633b75863D9548J01455O6615R0252A49627J06806A08005a12951A8018O5916
$$ y = [173184, -71702, 490460, 139767, -92573, -11955, 356136, 360735, 120430, 244792, 361822, -45178, 155811, -352580, 217710, -164908, 404570, 94753, -175943, 118600, 140504, 140198, -141160, 222196, 290708, 216713, -72694, 17422, 377734, 327922, 199225, 333238, 172580, 50602, -144501, 82893, 261434, -6933, 186575, 188684, 11952, 139536, 301876, 92927, 205126, -40777, 87549, -2294, 161462, -17222, 99577, -106303, 402749, -45469, 76989, -79888, -114889, 41050, 146023, 388605, 102180, 45497, 20972, 119578, 204413, 12345, -124891, -70519, 247484, 9453, -72194, 329108, -62598, -185344, -46316, -151603, -10309, -10313, 200334, -275863, 49548, 151003, 217618, 307870, 149627, 256433, 108005, -112951, 18018, 83934]
12623H3934j3127Q932d05166J48216l2594B09881e15362b32846C25163A2723h1979
12611B56473A17567h4864D6226L01964a43645A3094K73555j34014J89977j35238
12601B07374M6782J55068j07386A22502A8700J16858h3660j32597j37393a05313
12590c05668G4426a31031p16L2420M1699C00674d50353a13059C7246M3396K60428
12579C41070n1676m8443p1055k8510R3684A8052a9448A49380a4840C11456B7758
12567c9514l1826o0578e3488q9519D4195J04838E3294n401c45577D1210A9391
12555B77698a06967J1269j21957b5572m4376C1464O7866b02305I4160i6940m6025
12544a42965I5871N4897F4146a3796k6899j41336B74567d5012j56835a2830l17992
$$ y = [83934, 70807, 79739, -405166, -256950, -289544, 209881, -515362, -232846, 325163, 12723, -81979, 256473, 117567, -84864, 46226, 348190, -143645, 13094, 286649, 152635, 342612, 207374, 254156, 409224, 301838, 122502, 18700, 135558, -83660, -216257, -353650, -105313, -305668, 74426, -131031, -131747, -99327, -57628, 300674, -450353, -113059, 37246, 80642, 341070, 289394, 240951, 169896, 141386, 235070, 18052, -19448, 149380, -14840, 311456, 27758, -39514, -71340, -131918, -53488, -143007, 44195, 149033, 53294, 47893, -345577, 41210, 19391, 277698, -106967, -95698, -217655, -25572, -69948, 31464, 99330, -202305, 94160, -96940, -142965, 95871, 150768, 64146, -13796, -40695, -182031, 274567, -45012, -201847, -12830, -330822]
12533c30822b9106C0091J46681a46743A8041a27725P500j46599D04857a17076
12522f6044j9186j88372i3539B18757b32272l1960d4946a4952E1130a82984Q9517
12511i3467F5564c2110B23006p8336c7261n9181J667A19815d6983j84549e0565
12499f9931j52692B58542A0413a70686f2757j06797D3602a20093l9854k99201
12489d59148a4655p3698l81362D6070M9315e3258a7998B27514d7193B33093d1220
12477h7058m0388D8038L05110c52147B56922m7606L33552B21440I4733Q2428J19392
12466B96553a6640l3703K2213p949C2268K56421a0760j934B52756a83154B85785
12454c7266A16876K12167f1296A06523j1595O392B3153e4051A32948j0441h8213
$$ y = [-330822, -29106, 30091, 176772, -146743, 18041, -127725, -120225, -266824, 404857, -117076, -66044, -85230, -273602, -93539, 218757, -232272, -264232, -44946, -14952, 51130, -182984, -93467, 65564, -32110, 223006, 144670, -37261, -96442, -94775, 119815, -46983, -231532, -50565, -69931, -222623, 258542, 10413, -170686, -62757, -169554, 43602, -120093, -159947, -459148, -14655, -88353, -469715, 46070, 95385, -53258, -17998, 227514, -47193, 233093, -41220, -87058, -127446, 48038, 353148, -352147, 256922, 209316, 542868, 221440, 94733, 177161, 296553, -16640, -50343, -28130, -36079, 32268, 288689, -10760, -12694, 252756, -183154, 285785, -37266, 116876, 329043, -61296, 106523, 94928, 101320, 23153, -54051, 132948, 122507, -88213]
12442A51925J44595a40401j3797C9162a99379A50243a80889F3919J24406D7298
12431i5385p2175P5246l8894q2731C71171a6278l1502j9532A83656b60159a3731
12419E684a57738A39464J3594b80473M3470g5386j64871C55309A22628N5268k5094
12408A52802p1808c49033B95986b5679k22037A40651a5485p0012A17481C8242
12397b50115h7192A43786b94340J05467L1172O6515A5511a9673C00148a51965
12386A22479B6635a8756B7697b0351j67632f0345B4562c70419A31958l2914o788
12375I2256j6832a92976A63159G5462j8887a12248A95578J51098b74871E9244
12364a16004l26621G8282A1665e149B47387l0215C929g4314n5138f2599D3847
$$ y = [151925, 296520, -140401, -154198, 39162, -199379, 150243, -180889, 63919, 188325, 47298, -95385, -167560, -92314, -131208, -213939, 371171, -16278, -47780, -67312, 183656, -260159, -13731, 5684, -157738, 139464, 153058, -280473, -237003, -75386, -240257, 355309, 122628, 177896, 152802, 80994, -349033, 295986, -25679, -247716, 140651, -15485, -85497, 117481, 38242, -250115, -87192, 143786, -294340, -188873, -157701, -91186, 15511, -19673, 300148, -151965, 122479, 26635, -18756, 27697, -20351, -187983, -60345, 24562, -370419, 131958, 99044, 92256, 75424, -192976, 163159, 75462, 56575, -112248, 195578, 346676, -274871, 59244, -116004, -442625, 78282, 11665, -5149, 247387, 217172, 3929, -74314, -129452, -62599, 43847]
12352h6654A51313b57754D2295c22492O7627j2387H6581E321a90259m7658h77
12340B24868n3196n7421a2180n4716n1563a0256j29102E8856J62670P3929a76162
12328H3336k7604R200k2150g0163A56908n3390c8875k75012a52604n2587D2164
12316B79715a79933A21994d3071a2636D2361b02798C28225H6427P1778a83605
12305i0413b995C33628A21693j5922a68732j05636a9583k26094a4584j48191D1673
12293a4393k97052B67172g0969l34386a26862A35635h9537H4533b421n267C75174
12281b8922j64688j4204n9182D8252P0581a06591G6775K79894b58056g0282B7244
12269I7390R8593C6280K66688l8320A31455k1063J50099g4928A94065a81028L6399
$$ y = [-86654, 151313, -257754, 42295, -322492, -254865, -267252, 86581, 5321, -190259, -237917, -877, 224868, 171672, 114251, -12180, -66896, -118459, -10256, -139358, 58856, 221526, 295455, -176162, 83336, 55732, 64932, 42782, -70163, 156908, 103518, -38875, -313887, -152604, -205191, 42164, 279715, -179933, 121994, -43071, -12636, 42361, -202798, 328225, 86427, 158205, -183605, -90413, -2995, 333628, 121693, 105771, -168732, -274368, -19583, -245677, -14584, -162775, 41673, -14393, -311445, 267172, -70969, -405355, -126862, 135635, -89537, 84533, -2421, -7688, 375174, -28922, -193610, -207814, -266996, 48252, 118833, -106591, 76775, 356669, -258056, -70282, 27244, 97390, 195983, 36280, 302968, 264648, 131455, 110392, 260491, -74928, 194065, -181028, -144629]
12258a44629A39786a78975C9514e3213n1575A64281A3122J83897a96265D2624
12247a54999C21915G9826Q4443a45540A67035K7778c4590k29626C26457A40333
12236a23574A09024D6004a0022k14830h554j71032k3065F3188c3599A66098d930
12224a36887L5765H8098b09397B43075b53425H6020K09667a86949a0555I5720
12213a2500p5009b290I5216b80045a14280C49433p2557I2869D5078O5663f1900
12201C67050H3063L21820G7508i5698A37449b17533A83033B0020b99806a8492
12190C42389j04374I6955d3163A36756o4009J82405c9808A06830J51638l8431
12180B20037F5045A2323N4002K89763j60436o5510D4342A2897J38361j4621k8798
$$ y = [-144629, 139786, -178975, 39514, -53213, -104788, 164281, 13122, 197019, -196265, 42624, -154999, 321915, 79826, 164269, -145540, 167035, 194813, -34590, -264216, 326457, 140333, -123574, 109024, 46004, -10022, -224852, -8554, -179586, -202651, 63188, -33599, 166098, -4930, -136887, -101122, 88098, -209397, 243075, -253425, 86020, 295687, -186949, -10555, 95720, -12500, -87509, -2290, 95216, -280045, -114280, 349433, 276876, 92869, 45078, 110741, -61900, 367050, 83063, 404883, 77508, -95698, 137449, -217533, 183033, 20020, -299806, -18492, 342389, 238015, 96955, -43163, 136756, 72747, 255152, -39808, 106830, 258468, 220037, 65045, 12323, 66325, 356088, 195652, 130142, 44342, 12897, 151258, 136637, 107839]
12169A07839J27253J50556A70079D9423J39596B7532L2989J72997g8950L9424
12159c9526A77383D2205J75074O4672d3217A9677i65k37048F3221P0532K48988
12148C82741n0327K6238a7194I8396O2570F9208J84596m8577r5755f5933B25991
12136B45449e5779a1833n6417l0616C5075b30410j2506i8464b0033j5177g265
12124i6007B08527L002m7763b9194j42872j13690A03178J49258I9993F056b13668
12112E1290A4525e6484A72721D4166J8266b06963A14986j2859a11670j12501A87812
12100C79963r7657b07753f7357a8587j90552A17103h7065A19283l3805J06263
12090A91741Q317E9352c9767E8863K239a8840p5574B29028j12921A5632J01094
$$ y = [107839, 235092, 385648, 170079, 49423, 189019, 27532, 60521, 233518, -78950, -39526, 177383, 42205, 217279, 281951, -43217, 19677, -965, -238013, 63221, 133753, 382741, 332414, 358652, -17194, 98396, 160966, 69208, 253804, 205227, 109472, -65933, 225991, 245449, -55779, -11833, -68250, -98866, 35075, -230410, -242916, -98464, -20033, -35210, -7265, -96007, 208527, 211529, 163766, -29194, -172066, -285756, 103178, 252436, 99993, 6056, -213668, 51290, 14525, -56484, 172721, 44166, 62432, -206963, 114986, 102127, -111670, -224171, 187812, 379963, 282306, -207753, -67357, -18587, -209139, 117103, -87065, 119283, 85478, 191741, 200058, 59352, -39767, 58863, 61102, -18840, -94414, 229028, 116107, 15632, 116726]
12079A16726h2465A87200F1215a53978G6140b5643C09642A14331e5297E4773J03376
12068A58149k5301e2360b1383D6310n9R3073a23249H0087a80125A85776b0693
12056b06022H0255L06745L66053B46444G443i1302p9288l8397k80760b22572E8838
12044B88202I2906b55400C28096c08952j2870C18719a02430j27449f9851k56986
12034c26837a28022J8162M8254A25725K5302J3974e4511j0278I230a50551A76698
12022b5589m15935A02878C7237A183N6811B5978N0108A806J02424A7048K07050
12011B24098a99534R5214j04269E7557J63555P562c29764D9234a67786e4517j23381
12000a77898H5591h7712m5870d5895n2168q6616F858J3357h043A04788E448b1059
$$ y = [116726, -82465, 187200, 61215, -153978, 76140, -25643, 309642, 114331, -55297, 54773, 158149, 132848, -52360, -21383, 46310, 46251, 139324, -123249, 80087, -180125, 185776, -20693, -206022, 80255, 387000, 753053, 246444, 7443, -91302, -170590, -208987, -489747, -222572, 58838, 288202, 92906, -255400, 328096, -308952, -321822, 318719, -102430, -229879, -69851, -326837, -128022, -109860, -61606, 125725, 151027, 165001, -54511, -64789, 9230, -150551, 176698, -25589, -441524, 102878, 37237, 1183, 57994, 25978, 76086, 1806, 104230, 17048, 224098, -199534, -104320, -208589, 57557, 221112, 228674, -329764, 49234, -167786, -54517, -177898, 85591, -87712, -133582, -45895, -98063, -184679, 6858, 20215, -8043, 104788, 5448, -21059]
11987e0531B6019a03496A42232b84162a36980O2925F0104a8732B93988f4729K4526
11976d0203B10726e4921A1717d7701j26939q3990H0311M5454O179c53771e8594
11964f7079J2182j17788H5107b26131j16229A1849f0399p8719F6372c99302a61449
11952a65513c3808p2673H0376O1428a82362D1760a56189k33773h4202q8999P485
11941a65716e1929A78774c18168C1149O5630b97860D18027a64800j5252B03832
11930A21578a13321B17727I2803k026b4403B14200A336a49941l5944L5889p6243
11919b26239B05096o1562d03788C8669L1059J84630H1710O7598m0843K42752H5784
11907B79959r3197c3284B9898a61445o1423f2127A64168J83191F2200c30807a30133
$$ y = [-50531, 26019, -103496, 142232, -284162, -136980, -74055, 60104, -18732, 293988, -64729, -40203, 210726, -54921, 11717, -47701, -174640, -258630, 80311, 125765, 131944, -353771, -58594, -67079, -54897, -172685, 85107, -226131, -342360, 11849, -60399, -139118, 66372, -399302, -161449, -165513, -33808, -106481, 80376, 141804, -182362, 41760, -156189, -389962, -84202, -173201, -165716, -51929, 178774, -318168, 31149, 96779, -297860, 418027, -164800, -180052, 203832, 121578, -113321, 217727, 92803, 90777, -24403, 214200, 1336, -149941, -185885, -149996, -226239, 205096, 143534, -403788, 38669, 69728, 254358, 81710, 149308, 108465, 351217, 85784, 279959, 186762, -33284, 29898, -161445, -222868, -62127, 164168, 347359, 62200, -330807, -130133]
11895a40074L3363H0506M2746c5420f687F5872M3664K27592c1480A97733c38168
11883c4404E5141a52883C0031a56224F37024A60968C8955b26522A15016N140b7183
11871c27055F6875d00218i7045J8050i656k81115h2647A793d84088a26350A03263
11859A27554a93763k94671A34830K4775i3805A97395d01907C41607a78908A6857
11848e8062A83110m6439h7555A09259a8362k19517j20275d6157B65299a02802
11837I4205i8950j68595a6419p7343l10976d5981k3631j54837a11893E2736J6604
11826F9340K5533j1071b05252A13885N9297j2768J34097A01238a26775o8906D24481
11814a19574I5304e9556j47244J4770A47553P8402E0099B3012b10413f5911B8638
$$ y = [-140074, -106711, 80506, 123252, -35420, -6687, 65872, 109536, 337128, -31480, 197733, -338168, -34404, 55141, -152883, 30031, -156224, 637024, 160968, 38955, -226522, 115016, 120156, -27183, -327055, 66875, -400218, -97045, -78995, -9656, -290771, -82647, 1793, -484088, -126350, 103263, 127554, -193763, -488434, 134830, 159605, -93805, 197395, -401907, 341607, -178908, 16857, -58062, 183110, 136671, -87555, 109259, -18362, -237879, -358154, -46157, 265299, -102802, 94205, -98950, -267545, -16419, -93762, -404738, -45981, -69612, -224449, -111893, 52736, 69340, 94873, 83802, -205252, 113885, 173182, 160414, 294511, 101238, -126775, -195681, 424481, -119574, 95304, -59556, -206800, -192030, 147553, 225955, 50099, 23012, -210413, -65911, 28638]
11802B00561g7518k02053a23593B04368H4389b0767j27081d9061D0061c1324F4081
11790a41474F6917J22606b78678a27668c2372g23B2787J33436a78594P03B43607
11778a68320a1269q0243D4631a07460j55303b7231k8669j15819B2600a44975B3770
11766e4264f690l3711q9806A1386c42732A79997e9697p8840B03958i9758B74664
11754d0683j59701Q8164B8985J3827M2444k4816J7667a12651B91195I3981h9026
11742B5872a06994o9396r3976e6471H0203b06779c9078p3342A76058C6910a98385
11730A4048a2743l47575g2224k88346a10510A24495b9809A6713b825o9482k58162
11719c30469B8717K22575o3841H1614a20236i833C42903e4447A27801i0583l3297
$$ y = [200561, -77518, -279571, -123593, 204368, 84389, -20767, -147848, -49061, 40061, -31324, 64081, -141474, 66917, 189523, -278678, -127668, -32372, -723, 22787, 156223, -178594, -177891, 243607, -168320, -11269, -91512, 44631, -107460, -262763, -27231, -55900, -171719, 22600, -144975, 23770, -54264, -6690, -40401, -130207, 11386, -342732, 179997, -59697, -138537, 203958, -99758, 274664, -40683, -200384, -112220, 28985, 42812, 85256, 60440, 78107, -112651, 291195, 93981, -89026, 25872, -106994, -176390, -270366, -56471, 80203, -206779, -39078, -112420, 176058, 36910, -198385, 14048, -12743, -360318, -72224, -360570, -110510, 124495, -29809, 16713, -2825, -72307, -330469, 28717, 251292, 187451, 81614, -120236, -9833, 342903, -54447, 127801, -90583, -123880]
11708a23880A04630C5796a26268B52362G0895a20467a2943D75970k10507d7037
11697a00988F2061e7006g790m7067H8140l2978h9728B11558a52805l2091A13927
11685A33071a6560l01431A92710B3743O7040l7061Q0830A3962K444K9876O2649
11674A08931M3543o2531M32467B53591I4651b95820e423A33007a1980m0116A82895
11662E43332F6329K0304e8115o9785J8608E0598J78332a76351B0598b14371I6196
11650A84283b341F3938b8218B72594B6863K36725F6951J70246b07428A93399a19721
11638a27655b1472B4544h0122A58176j4882F2907l0487a77628f8221B98404A07440
11626A02119l9377J82471a7558B4136J18100e9047j69520a08187D7287f4993n2270
$$ y = [-123880, 104630, 35796, -126268, 252362, 70895, -120467, -12943, 475970, 265463, -47037, -100988, 62061, -57006, -7790, -54857, 88140, 55162, -89728, 211558, -152805, -184896, 113927, 133071, -16560, -317991, 192710, 23743, 90783, 53722, 134552, 13962, 16406, 46282, 108931, 152474, 89943, 522410, 253591, 94651, -295820, -5423, 133007, -11980, -52096, 182895, 543332, 66329, 86633, -58115, -127900, -109292, 50598, 228930, -176351, 20598, -214371, 96196, 184283, -2341, 63938, -28218, 272594, 26863, 263588, 66951, 237197, -207428, 193399, -119721, -127655, -21472, 24544, -80122, 158176, 143294, 62907, 32420, -177628, -68221, 298404, 107440, 102119, 62742, 245213, -17558, 24136, 142236, -59047, -228567, -108187, 47287, -64993, -117263]
11615a17263Q023K7020j83698A42389k0394a14846l64113i6543o8468F9500h4573
11603B89490p2016a24885B82344f7870A16719a40181e712A2264N3246k7307P5809
11592A14012K4378l5589m4445a50269I1917h270j44250j99437A14826c8714l52672
11581c91386D02643g8170A54869J06847a25810B97970A41781o8500i1296j26423
11571b17719a04951F7826J02432c19098C87152a04067A41685a88177N4507M1654
11561i2016r4434g836C98989a82316A00110J58266b9893E3464J04352b83791B9340
11549A13192b1527B14080J85268g8828I2723a27099B18392K41374A8765R1899
11539A10664n83J94218q948a11819B98383J5904b2200B41891j20759h0739A03675
$$ y = [-117263, -109240, -82220, -265918, 142389, 121995, -114846, -478959, -96543, -165011, 69500, -84573, 289490, 217474, -124885, 282344, -67870, 116719, -140181, -5712, 12264, 65510, 38203, 114012, 138390, 102801, 58356, -150269, 91917, -8270, -152520, -351957, 114826, -38714, -391386, 402643, -78170, 154869, 261716, -125810, 297970, 141781, 73281, -91296, -217719, -104951, 67826, 170258, -319098, 387152, -104067, 141685, -188177, -133670, -92016, -186450, -7836, 398989, -182316, 100110, 258376, -29893, 53464, 157816, -283791, 29340, 113192, -21527, 214080, 399348, -78828, 92723, -127099, 218392, 459766, 18765, 110664, 110081, 304299, 295351, -111819, 298383, 314287, -22200, 241891, 121132, -80739, 103675]
11527g8663B00088Q8363O1865a40889A2518c0463l5168A46870G607J00160J03301
11516B11068J8510k1869C4815O9171o219D077J49011J13504q4706e2551B56569
11504i9686B9469J8365a98200h212A16962J27506o4625K79532A15586a31925A08385
11492h7576H0392J11257G2298l4243f7917k4951A27015j4557L1397a87243H4162
11480c0267c348B42391b00925C19142f296b057I4442a20628a082A21418a73164
11468A4905L33210a77718B40740J68149H6071J12659A729N0477P8085a2356L690
11457h666l7092p3731M0945D4668i6388b3499o074I9116K07736j38583D3589M2422
11445H6011I695L26200b15837f6330C22443A48741B9191M0293a71762D7110R7250
$$ y = [-78663, 200088, 288451, 350316, -140889, 12518, -30463, -65631, 146870, 7607, 107767, 211068, 229578, 207709, 34815, 103986, 97767, 4077, 153088, 266592, 181886, -52551, 256569, -99686, 29469, 47834, -198200, -8212, 116962, 244468, 179843, 459375, 115586, -131925, 108385, -87576, 80392, 191649, 72298, 38055, -67917, -92868, 127015, 112458, 143855, -187243, 84162, -30267, -3348, 242391, -200925, 319142, -6296, -2057, 94442, -120628, -1082, 121418, -173164, 14905, 348115, -177718, 240740, 408889, 86071, 198730, 1729, 52206, 130291, -12356, -8666, -45758, -119489, -78544, 44668, -96388, -23499, -29573, 99116, 306852, 168269, 43589, 86011, 9695, 335895, -215837, -66330, 322443, 148741, 29191, 69484, -171762, 47110, 144360]
11434A44360a06601D58230a929I8769b0521B80867A16693Q0426n4063F4239L18091
11423C82330a02734P852B99217j39813J00800I8645l6115b03616a8017A44350
11412I9060L19513D6993b80444I8615a20725K3810B26219r3851J25857c01123
11401b02410B51409a02404A96681P702i281m9407k376A7822a27893j15796D8586
11389C6612a03435D06007A00102a26844A8224a98224A4307P7118a26244A67623
11378I4604N2418a06486c3322l39921a9657k30074f8802H9489k9048L61b04144
11366I3560a91618P8339A75942m3581j2332Q517l5824g6731B50982j16720f2486
11354B57342j0567P1968b80670C74921h6783B60951F0681J3840e6873A12308J273
$$ y = [144360, -106601, 458230, -1929, 98769, -20521, 280867, 116693, 197119, 143056, 64239, 382330, -102734, -94882, 299217, 159404, 260204, 98645, 62530, -203616, -18017, 144350, 99060, 418573, 46993, -280444, 98615, -120725, -96915, 226219, 132368, 258225, -301123, -202410, 251409, -102404, 196681, 204383, -9281, -58688, -61064, 17822, -127893, -243689, 48586, 36612, -103435, 406007, 100102, -126844, 18224, -198224, 14307, 91425, -126244, 167623, 94604, 147022, -106486, -33322, -373243, -19657, -249731, -68802, 89489, 60441, 60802, -204144, 93560, -191618, -113279, 175942, 132361, 120029, 128546, 92722, -76731, 250982, 134262, -62486, 257342, 246775, 318743, -280670, 374921, -86783, 260951, 60681, 74521, -56873, 112308, 113581]
11343A13581c6220j21339j12209f4455H5054J84720A28223a03625A81023a81387
11332a9139I2334c3966A40886a99411E0271i8589c1333A92364g2322r8676g0097
11320I473K35017a60252B35364d4263F463L4249H833K58504a9225k54625I1220
11308A80307o7985a16385E6584f8618b2103m8419k4496a3034l61588a63065j08758
11297b71823L5811A51842A7205L48807j14311F305M0334N0424j6060d2131j01167
11286a43298A49849a67001j73791a38230A33077b21134k7083b6471j02243j29809
11276b58523A75542c75296A54012d18341A82719L05276e2646m8463H7356L1330
11266A18686k5327L567m2918h0334A50424a07428j28932B32425b27140B93558
$$ y = [113581, -36220, -157559, -269768, -64455, 85054, 269774, 128223, -103625, 181023, -181387, -19139, 92334, -33966, 140886, -199411, 50271, -98589, -31333, 192364, -72322, -170998, -70097, 9473, 244490, -160252, 235364, -44263, 6463, 40712, 8833, 267337, -19225, -273850, 91220, 180307, 112322, -116385, 56584, -68618, -22103, -70522, -95018, -13034, -374622, -163065, -271823, -236012, 151842, 17205, 366012, 251701, 6305, 46639, 97063, 81003, -42131, -143298, 149849, -167001, -340792, -138230, 133077, -221134, -248217, -26471, -128714, -258523, 175542, -375296, 154012, -418341, 182719, 487995, -52646, -101109, 87356, 118686, 93359, 96926, 54008, -80334, 150424, -107428, -236360, 232425, -227140, 293558]
11255d01860J84710C382J78241K1504p8168J47626i5384j41160B86332a70409
11244d6237B7328K24796J5015b76002p575M9718A41127a68766d9588j31064M3484
11233a37168B39671c04838j43628B1170b27642f2036p8262R897C84818E8638a46082
11221B36482a7058j7985d744B0408J3261e499F8217P0817i1326j95933A76576
11209f3191M398l6951J8098E4475b33361l2936J29177A5201h6059j57191A50454
11197a82942A86842c07490a31825L5873A62332l7098b80485A7677d7326B26764
11186b11911j1794i8997k78931Q8350A9306L7633b03023p1990C80809c66612a07998
11174B1937N5785e7916A56903J8785c78109A88004a05595H7599B3010Q0220c2899
$$ y = [-401860, -217150, 3382, 181623, 203127, 124959, 272585, -95384, -236544, 286332, -170409, -46237, 27328, 252124, 267139, -276002, -283577, -233859, 141127, -168766, -49588, -180652, -137168, 239671, -304838, -448466, 21170, -227642, -62036, -140298, -130401, 384818, 58638, -146082, 236482, -17058, -35043, -4744, 20408, 33669, -5499, 68217, 139034, -91326, -287259, 176576, -63191, -58793, -95744, -77646, 54475, -233361, -266297, -137120, 15201, -86059, -243250, 150454, -182942, 186842, -307490, -131825, -95952, 162332, 125234, -280485, 17677, -47326, 226764, -211911, -223705, -98997, -377928, -289578, 19306, 56939, -203023, -275013, 380809, -366612, -107998, 21937, 77722, -57916, 156903, 175688, -378109, 188004, -105595, 87599, 23010, 103230, -32899]
11162d9292k05898c065k49342A20003m2509b72141o711G1641f0060B9569J51358
11151A80927i5304B0681a92823r6640B17583a38286M1916Q814N210D5836b70248
11139b58500b403q9503k51553B21886a5953k26426F5375c70175k0069E1670b92912
11127C7233M421J99320a71330h0551j4382d5528j96600A5959d9027j24413B07890
11115a12747A4298b96917B12047b40848A67807o3158b07795A41257b44045A03356
11104A30602m7277P055e3560n099A45020a34146I5260a35793L8207b4441I4453
11092B00850a75228B40538A11833K64892b09240Q8250C6856J93255O538a41038
11081b2830B01124a05007B97149A28022M6036J44635j53227O9630F4018b59849
$$ y = [-49292, -255190, -3065, -252407, 120003, 77494, -272141, -278852, 71641, -60060, 29569, 180927, -95304, 20681, -192823, -289463, 217583, -138286, -96370, -87556, -82346, 45836, -270248, -258500, -2403, -91906, -343459, 221886, -15953, -242379, 65375, -370175, -390244, 51670, -292912, 37233, 41654, 240974, -171330, -80551, -94933, -45528, -242128, 15959, -49027, -173440, 207890, -112747, 14298, -296917, 212047, -240848, 167807, 104649, -207795, 141257, -244045, 103356, 130602, 83325, 90380, -53560, -58659, 145020, -134146, 95260, -135793, -97586, -24441, 94453, 200850, -175228, 240538, 111833, 376725, -209240, -120990, 36856, 230111, 236649, -141038, -22830, 201124, -105007, 297149, 128022, 174058, 318693, 165466, 235096, 64018, -259849]
11070B22544D781h9737D2718b3423I7999c27504A64319m3891A0053a84502e6018
11058C35927A67207f0856E85837A83061Q3875j33375P2023K29954A93054k8187
11048A64867Q5377Q7538l1175I0831K1442J70009L2033C3558K42257J67977B8071
11036E78761B32808m2454L49698B50810K67195J4256K02012A63799L30334J42553
11026F36686j87068N0754k8956L71858j56824j93084K21431B58565K72729k44060
11016B87234N31292C85839n106J69430r6040l1314L49125j62795k25041M21720
11006H05818k52583j33024J18297J07375l21291L59643J59130C80987K61991K15208
10996H58186j94838j26720c0914D50998J70439j81435B00339l1634L03773O7127
$$ y = [222544, 4781, -89737, 42718, -23423, 97999, -327504, 164319, 120428, 10053, -184502, -56018, 335927, 167207, -60856, 585837, 183061, 266936, 133561, 205584, 435538, 193054, 164867, 250244, 337782, 306607, 90831, 112273, 282282, 314315, 33558, 275815, 443792, 28071, 578761, 232808, 190354, 540052, 250810, 518005, 532261, 734273, 163799, 494133, 636686, 449618, 500372, 471416, 843274, 686450, 493366, 714797, 258565, 531294, 287234, 818526, 385839, 380733, 550163, 454123, 422809, 771934, 609139, 384098, 805818, 553235, 420211, 538508, 645883, 324592, 684235, 843365, 380987, 642978, 858186, 663348, 536628, -30914, 450998, 621437, 440002, 200339, 168705, 472478, 539605]
10986E39605J4990k38152N33686C88189j09369J34612l8573Q6666K0454B0129
10975E63949m6139N9716I1743K34296J79358o6174j01549K70336B35169L76151
10965F11320q1029L5898m6201o6264J22941J91247C25578L99465j47674K56605
10955H33974J2690K23011r7027n4244K26202l187J03768J4434L07569K27635O23521
10944B418346k16488J37227l42232K11624k48930q390j88783k58293Q8617L477
10934A596175L8096k12618k86058K77168K140J93380j24942J23433j68063l65564
10924A073147N3903j72508m3153l14929K65592l10283L7590K218B50633J37343
10914C87976r909A71897a2059B54053b25020j3925B18855J99662j76328I8437
$$ y = [539605, 554595, 316443, 850129, 388189, 278820, 413432, 374859, 461525, 481979, 20129, 563949, 517810, 577526, 91743, 326039, 505397, 439223, 337674, 608010, 235169, 611320, 530291, 566189, 519988, 453724, 576665, 767912, 325578, 725043, 577369, 833974, 846664, 1069675, 972648, 918404, 1144606, 1141419, 1245187, 1259621, 1567190, 1794825, 2418346, 2201858, 2339085, 1996853, 2208477, 1959547, 1951157, 1762374, 1504081, 1592698, 1596175, 1634271, 1421653, 1135595, 1412763, 1414903, 1608283, 1483341, 1606774, 1438711, 1073147, 1127050, 954542, 911389, 596460, 862052, 551769, 589359, 591577, 250633, 387976, 378067, 171897, -12059, 254053, -225020, -238945, 218855, 418517, 242189, 98437]
10903D08275l0940r0483b37327A29050l1135e852j64728c1453A28804k4163b4671
10891b13476Q5665J782c2633B27726b68659i8130B36848B0252b9628j37042A31929
10879a3265j5137E0987K21602h9101J4745K1611n6105k49905G7174M3136K01896
10868C22206b00806G467J4854h655k23962B0991d3356j19549D31475c46784F7417
10856a78067B95075c15547g9418A82684P4988j17448B1363L4403d49821D3377
10845c09753B08015a10392p644C90649F9589l3889Q7383F0730K9270m0857H129
10833C9673a28381N1915j49235J04866q0985B25402f6425B7845a40765C13938
10822a20883C80058a48757o5882f7620l0215c9010E6418a00878L2841a0524I8980
$$ y = [408275, 377335, 286852, -237327, 129050, 97915, -5852, -170580, -31453, 128804, 104641, -24671, -213476, -127811, -126029, -32633, 227726, -268659, -98130, 236848, 20252, -29628, -166670, 131929, -13265, -28402, 50987, 272589, -89101, -74356, -52745, -108850, -358755, 77174, 120310, 322206, -200806, 7467, 22321, -8655, -232617, 20991, -43356, -162905, 431475, -346784, 67417, -178067, 295075, -315547, -79418, 182684, 257672, 140224, 21363, 55766, -449821, 43377, -309753, 208015, -110392, -118036, 390649, 69589, 35700, 123083, 60730, 90000, 49143, 8129, 39673, -128381, -76466, -225701, -120835, -201820, 225402, -66425, 27845, -140765, 313938, -120883, 380058, -148757, -214639, -67620, -97835, -39010, 56418, -100878, -68037, -10524, 98980]
10810b55720b6929A4472b19928a00233d0638B35216e8731B43956G971b12173a5005
10798a45203j69498G0582M983c93039C17191b6584l444m5357b7679j08394A06376
10786d2701B07665f04201a074p6977j72444K1297a06542k957A84585N910c91177
10774A02242E0458K49458b68652E9778a56170B04696c608l07880C6999J4128c10933
10762g2221A95043C950Q8601b09796l3705B39341b14344Q5306A87041C7210a20258
10750i0312H5016a14462G7058a42392b289j1738B45139b03509a6268G2198D838
10738A59623b98771b0024q1044C01581C7512c1856j81726J9685L2371c9019j30402
10727a69421K4643H5940J91978g902j14350q1297B68143a85385F2589L77570d38324
$$ y = [-255720, -26929, 14472, -219928, -100233, -40638, 235216, -58731, 243956, 7971, -212173, -15005, -145203, -314701, 70582, 75565, -393039, 317191, -26584, -30028, -75385, -27679, -136073, 106376, -42701, 207665, -604201, -1074, -78051, -250495, -229198, -106542, -109499, 184585, 190495, -391177, 102242, 50458, 299916, -268652, 59778, -156170, 204696, -3608, -311488, 36999, 51127, -310933, -72221, 195043, 3950, 92551, -209796, -243501, 239341, -214344, -129038, 187041, 37210, -120258, -90312, 85016, -114462, 77058, -142392, -2289, -14027, 245139, -203509, -16268, 72198, 4838, 159623, -298771, -20024, -101068, 301581, 37512, -31856, -213582, -193897, -161526, -39019, -169421, -144778, 85940, 277918, -7902, -122252, -203549, 268143, -185385, 62589, 440159, -438324]
10715d5619j984F251Q1243a68819G0456a12286B00617c37765h2329A4198R8997
10704A13195i9445C39571a09314B07381q5108R8077i66k39509K8396c1529j24951
10693a56480r317Q253r8006r07O0969f0941K7383C84972a16196n5388P1182A0128
10680a93410d5236A03259a94078J8529j7172Q6042d8597k54367F8898a29673a1910
10668A71987h8399A00072R2538a11990D1027e6823H375M3525p71A1284a3071B9664
10655c49789f7032k69757C08680D089L6281a3336k55683O6561m1838M3682O7886
10644a32728I117b57852I2120q094b4072A3369h7590c1949C5812b42913R3837
10633a49076C0392e551j5596r7142e3667j67509G2564J43017o6776a53392g1575
$$ y = [-45619, -47603, 6251, 87494, -168819, 70456, -112286, 200617, -337765, -82329, 14198, 113195, -99445, 339571, -109314, 207381, 122273, 220350, -966, -240475, -212079, -31529, -156480, -165797, -157544, -255550, -256457, -195488, -60941, -33558, 384972, -116196, -171584, -100402, 10128, -193410, -45236, 103259, -194078, -175549, -192721, -106679, -48597, -302964, 68898, -129673, -11910, 171987, -88399, 100072, 192610, -111990, 41027, -56823, 8375, 51900, 51129, 11284, -13071, 29664, -349789, -67032, -336789, 308680, 4089, 40370, -13336, -269019, -202458, -244296, -200614, -132728, 9117, -257852, 92120, 84026, -24072, 13369, -87590, -31949, 35812, -242913, -149076, 30392, -5551, -21147, -118289, -53667, -221176, 72564, 215581, 148805, -153392, -71575]
10621d84368A24205c24869a39597m1808A54534k0818h2490A30843f2103k60883
10611c22986f9872k98883B7686l959h8319K0954q8883a7357C41888a55824M0031
10600a15793k7260A66848b1767B17774b29190R0144j35324a10148D7950c38400
10589I3264a68056k1709Q7121B37570F5995M0765c2754A32845C2118a41989q066
10578a50055b2854H5765c0708G89e1204q6729B1873h1203k7584q612J6287d3964
10565a0157F2363f6113E2242d15433a00806k47932E1570e2401c185j91759A53714
10553b35353B72289c35943j5614a11520K1919h822H7081B2691J57094D3961N318
10542D9279J64574L0220D466a43210A33979h788G4552f4611j35600E9966K0926
$$ y = [-484368, 124205, -324869, -139597, -181405, 154534, 133716, -82490, 130843, -62103, -322986, -69872, -368755, 27686, 23727, -88319, -67365, -156248, -17357, 341888, -155824, -115793, -143053, 166848, -21767, 217774, -229190, -139046, -274370, -110148, 47950, -338400, 93264, -168056, -189765, -102644, 237570, 65995, 106760, -32754, 132845, 32118, -141989, -150055, -22854, 85765, -30708, 789, -51204, -137933, 21873, -81203, -108787, -117399, -101112, -43964, -10157, 62363, -66113, 52242, -415433, -100806, -348738, 51570, -52401, -3185, -194944, 153714, -235353, 272289, -335943, -351557, -111520, -89601, -8822, 87081, 22691, 179785, 43961, 49279, 213853, 244073, 4466, -143210, 133979, -8788, 74552, -64611, -200211, 59966, 80892]
10531H0892j956k4734N19370c50173D30327k04080b21589e6421A6573J02068l7700
10520H0941d27333b5421B27a35130j48897a40349J7758A73018D2996b53795R0205
10509a63590A24549a93384b2037k3466j02847P3494j85j82135A78352N5311g8263
10497b0304r9884e6983n61766a17938C61129a4346B31748H7167c28664N5075J17617
10486a55972M9088G8955C9084i3357N689B16104c19915A40206b63668b5850G4383
10474A99631q7992a91226A22886a29882A35351a39729b0438j70244I7604J51311
10464B48915O3722E5435N3732m0740k8356b42340a256r8489A13601a9757C14861
10452E19966P9262O8341A86779K4114a01367B65743b7608j94116A81669p7635
$$ y = [80892, 78936, 54202, 573572, -350173, 430327, 226247, -221589, -56421, 16573, 118641, 80941, -427333, -25421, 227, -135130, -284027, -140349, -122591, 173018, 42996, -253795, -163590, 124549, -193384, -22037, -45503, -148350, -74856, -75041, -257176, 178352, 233663, -78263, -20304, -120188, -56983, -618749, -117938, 361129, -14346, 231748, 87167, -328664, -273589, -155972, -106884, 78955, 39084, -93357, -87668, 216104, -319915, 140206, -263668, -25850, 74383, 199631, 111639, -191226, 122886, -129882, 135351, -139729, -20438, -190682, 97604, 248915, 312637, 55435, 109167, 68427, 40071, -242340, -1256, -99745, 113601, -19757, 314861, 519966, 599228, 667569, 186779, 210893, -101367, 265743, -27608, -221724, 181669, 104034]
10442A04034g7154q8872g5639p3748J6717B49282a72678j92467R9299A41001a05286
10430C5485h4764k16250c2004j63234R1151A5724L20320a72053M8216A29561K8804
10419A58365h0174K2048F4818P3112K22683A62643p3858k300c07730d1719q5682
10408a27401a1929k85879A14758J8684e2343k1694o9641A58203D4870b35086i8631
10396E8126a81550A68378e8735d381A93501b32360A63296b8608A35833g635B11134
10384A11449a23893G4611O9541B4681J3295a60369L4421H7605c16910G1320g063
10372b9100m4485A544L8786b6848B59903b2498e92j69426C33942A14888c5430
10360C46433A31205Q2097a40769j00327H1990K2680J88196A38651k3509h666A32393
$$ y = [104034, -77154, -166026, -75639, -149387, -132670, 249282, -172678, -365145, -265846, 141001, -105286, 35485, -84764, -301014, -32004, -195238, -104087, 15724, 336044, -172053, -123837, 129561, 158365, -80174, -58126, 64818, 137930, 360613, 162643, 88785, 86485, -307730, -41719, -127401, -11929, -297808, 114758, 133442, -52343, -74037, -143678, 158203, 44870, -235086, -98631, 58126, -181550, 168378, -58735, -4381, 193501, -232360, 163296, -28608, 135833, -7635, 211134, 111449, -123893, 74611, 144152, 24681, 37976, -160369, -125948, 87605, -316910, 71320, -7063, -29100, -73585, 1544, 40330, -26848, 259903, -22498, -592, -170018, 333942, 114888, -35430, 346433, 131205, 213302, -140769, -241096, 81990, 104670, 292866, 138651, 115142, -8666, 132393]
10348a46615B27789M4461A28224L7406J08030H3103N9304m1779L53666r2128J52233
10337E14399K79845A53682D0784e2614C6011J46870Q3059f9681A22550a31659
10326C25323c85831C41141a74814E99802j78262M0746A24945P4589k564B2342
10315f1896F21488A54504M1035m7695K780J498L97370C5409e6903j04588D1448
10303B47183a83528b1165q752A07652J71877n1328p016d1867A61177J06392H0546
10291b2178B27733E6977N2948q115q32j6082J9983j3548h8244j60389c3188B4774
10278a03643A36773a8576j38190A40804a04872H8863b50041j40721b3504A94509
10267a87033N9721A75396b2676O749C08956i9557K4335C5196i6120B1188b71694
$$ y = [-146615, 227789, 272250, 128224, 165630, 273660, 83103, 142407, 100628, 454294, 362166, 514399, 794244, 153682, 40784, -52614, 36011, 182881, 265940, -69681, 122550, -131659, 325323, -385831, 341141, -174814, 599802, 421540, 462286, 124945, 199534, 196970, 22342, -61896, 621488, 154504, 195539, 147844, 150624, 152122, 549492, 35409, -56903, -161491, 41448, 247183, -183528, -21165, -29917, 107652, 279529, 228201, 221185, -41867, 161177, 267569, 80546, -22178, 227733, 56977, 109925, 101810, 100978, 84896, 104879, 91331, -88244, -248633, -33188, 24774, -103643, 136773, -18576, -156766, 140804, -104872, 88863, -250041, -390762, -23504, 194509, -187033, -127312, 175396, -22676, -15927, 308956, -99557, -75222, 35196, -96120, 21188, -271694]
10255e8676o1734l25279I0855c1641F5799e2321r9635k79130a00116A9456i8460
10243G2620c0048B03914c3104A37711J728M199J92267g3278o0967A92704Q0412
10232B73116C2371K62293H4028M58147k34918c35198E2953J42890m7341E7482
10221B13486a21752m0909f1843C8945J22414a10800N2646J227l5946L9858J253
10210e1762C513L03576A35965a14935j00283A9647L35M0358a55690m3932Q4732
10199a14890d1042G9954K65049e26131E8905b46606C19798h8964H8928a00910
10188B09694F688J57932b2824k27922F5589J7177i5574A59850e8768P700J8232
10177c2836A6362g9312B57760k3343b12426A5608d11688A14518e0762q8264c2636
$$ y = [-58676, -120410, -445689, 90855, -31641, 65799, -52321, -151956, -431086, -100116, 19456, -98460, 72620, -30048, 203914, -33104, 137711, 139439, 143638, 335905, -73278, -134245, 192704, 273116, 32371, 294664, 84028, 542175, 307257, -335198, 52953, 195843, 148502, 57482, 213486, -121752, -162661, -61843, 38945, 161359, -110800, -58154, -56927, -92873, -53015, -51762, 3513, 307089, 135965, -114935, -215218, 19647, 19982, 60340, -155690, -199622, -114890, -41042, 79954, 345003, -526131, 58905, -246606, 319798, -88964, 88928, -100910, 209694, 6688, 164620, -22824, -250746, 65589, 82766, -95574, 159850, -58768, -51068, -32836, 16362, -79312, 257760, 234417, -212426, 15608, -411688, 114518, -50762, -139026, -32636]
10165b41352A30051l7103b10885A84325l227b23456a07449D8014D513J04571B3020
10153a18769G6371J06484i8649J8066j45475B8300a4536B92783A5859L7b57303
10141a19374q6288j5710j17436B8830a4922j96507A74736O5241b79320A28962
10130c36898h8508r5592C6707F879j662J49789M0556j0968E3695A101A39d1554
10117d5447j7347j16975C1224K37372e4017j32653L8382A4319a94508H7523b82910
10105E3215O0412a49550B59643j21949b00838O8293E868b88878J1158j5936A55055
10093i4406C1492a79373g8890A06257R0935b45411A63295b0806B80658a93692
10082b3314A63669b04001F0303i0703A74114f6515o300F1375b22907L0438h3718
$$ y = [-241352, 130051, 92948, -210885, 184325, 181098, -223456, -107449, 48014, 4513, 109084, 23020, -118769, 76371, 182855, -98649, -80583, -226058, 28300, -14536, 292783, 15859, 15896, -257303, -119374, -205662, -221372, -338808, 28830, -14922, -211429, 174736, 239977, -279320, 128962, -336898, -88508, -184100, 36707, 6879, 5217, 155006, 195562, 184594, 53695, 1101, 139, -41554, -45447, -62794, -179769, 31224, 268596, -54017, -186670, -148288, 14319, -194508, 87523, -282910, 53215, 113627, -149550, 259643, 137694, -200838, -132545, 5868, -288878, -277720, -293656, 155055, -94406, 31492, -179373, -78890, 106257, 197192, -245411, 163295, -20806, 280658, -193692, -23314, 163669, -204001, 60303, -90703, 174114, -66515, -72815, 61375, -222907, -192469, -83718]
10070A06570C0908a17213m5549H355c66068a48451B02318G341J01299b26164k00391
10059d26555a24995A6381b19068B0679M1366a68094B59280b2976l8859A50764
10048f2423k37B0571O0966c8730j69875R978G403e784k53749J26215G7609c08983
10035A8323L15374A8271i973n6406G7451G138a04778a4066k2186D7831d9447A18892
10022f9006D6348J21882a86374c9906D7985c74184A32140b91246M7473a11898
10011C21549h6661m7585q5318h9914C9730M4030b74083J17472j20716a25666A2823
9999a01396A25308n7668b18538f4209A29653a68074C2249a01758B01056a46279
9988B694J47231a50812f0654n181C57047E5411a29595j5960r6495a06673G3796
$$ y = [106570, 30908, -117213, -162762, 8355, -366068, -148451, 202318, 7341, 108640, -226164, -426555, -124995, 16381, -219068, 20679, 62045, -168094, 259280, -22976, -61835, 150764, -62423, -62660, 20571, 81537, -38730, -208605, -198627, 7403, -5784, -259533, -133318, 77609, -308983, 18323, 333697, 18271, -9973, -66379, 77451, 7138, -104778, -14066, -36252, 47831, -49447, 118892, -69006, 46348, 168230, -186374, -39906, 47985, -374184, 132140, -291246, -243773, -111898, 321549, -86661, -134246, -219564, -89914, 39730, 83760, -274083, -156611, -277327, -125666, 12823, -101396, 125308, 67640, -218538, -64209, 129653, -168074, 32249, -101758, 201056, -146279, 2694, 149925, -150812, -60654, -65835, 357047, 55411, -129595, -145555, -242050, -106673, 73796]
9976C67769A09922B5409m998L73272a71422Q4508H2617j9590b18605R6160I1104
9964e4910k22492j225A60265Q0218a69182j9343c4371q9819j08719P6756A78190
9952A43136a3833k49310J03552A27070d8655j34865q2749J8011J01790e1535j40459
9941a91994B70758A14462a68511c7021l77670A41593D1369a64975D1430K570J94359
9930B38359a45589M9140j12599A35744f2096k38614O2846a00889E6457k4416N5669
9919H7710a22406j88506C37365a01457j24882A18281a85426H2671L8638e6412
9908b41639g1987p4142K8744M1569b3317I4098a83791e6879q393j1631b2395l48781
9896c71176a13264N6528a3065l3779A03513c3487G7754a66953B2617M37585a80574
$$ y = [367769, 109922, 25409, 20411, 393683, -171422, -86914, 82617, 63027, -218605, -122445, 91104, -54910, -277402, -278627, 160265, 240483, -169182, -188525, -34371, -124190, -232909, -156153, 178190, 143136, -13833, -263143, -159591, 127070, -48655, -183520, -266269, -248258, -146468, -51535, -191994, 270758, 114462, -168511, -37021, -414691, 141593, 41369, -164975, 41430, 44000, 238359, -145589, -96449, -209048, 135744, -62096, -300710, -237864, -100889, 56457, 32041, 87710, -122406, -310912, 337365, -101457, -226339, 118281, -185426, 82671, 121309, -56412, -241639, -71987, -146129, -117385, -75816, -23317, 94098, -183791, -56879, -65272, -76903, -22395, -371176, -113264, -56736, -13065, -46844, 103513, -33487, 77754, -166953, 22617, 460202, -180574]
9884c58246J51336J9644h5496A23932e6675j20567l73703J10187i3584j7812F548
9872c05487B67788g5734F9992a14348B0747i1367k16373B16245J8527a49584j819
9861a51403D48150b9137B58738c18626h3881k02892J12525A81389m0066a56422
9850b15824b3904A65424d7743j43480O5956B26635a70055M493F2275N7979A2172
9838A1146a17259D2806a12376L9479A01865i0320A41135c16719A6208Q8403M7266
9827A51877k5592c15315B3983r834a11968j68203B5450d89909A92010n8157d1840
9815b11303a5174B49792k6487d5039a7715k1064A27932a22973d5716B1296a25087
9803A7919a22324J0684I8833a08777C6905p355a70603j08484c9328A73589b19637
$$ y = [-358246, -206910, -187266, -85496, 123932, -56675, -177242, -550945, -440758, -93584, -111396, 6548, -305487, 267788, -75734, 69992, -114348, 20747, -91367, -307740, 216245, 234772, -149584, -151403, 448150, -29137, 258738, -318626, -83881, -286773, -174248, 181389, 141323, -156422, -215824, -23904, 165424, -47743, -191223, -125267, 226635, -170055, -165562, 62275, 120254, 12172, 11146, -117259, 42806, -112376, -72897, 101865, -90320, 141135, -316719, 16208, 104611, 151877, 126285, -315315, 23983, 14149, -111968, -280171, 25450, -489909, 192010, 133853, -41840, -211303, -15174, 249792, 223305, -45039, -17715, -38779, 127932, -122973, -45716, 21296, -125087, 17919, -122324, -111640, 98833, -108777, 36905, 29550, -170603, -279087, -39328, 173589, -219637]
9791c5694A6075c5730j66416C493d30853J14851k32764g5691j61134B79991i7175
9779H7960J64676A06592g8473p4870A51625P8861b82191b1727l57699B19173B317
9767B00916B6863a71031B97654a3341k41103h2810H8338b47088g2767F2709a14491
9755a57104G6937g5552F5118R8833b41578N307A16991c02273n4352i1991r3843
9744a85834d4155a6239j62778e2636D5630d9104I455b19738P1812f9116B05370
9732h9862M4604j7606m9038A59595b06776e0394J2399l5135B733a00531E6928
9720B71588f6083k27085a33261j54210L9387J05559A58228E5023J01083b62756
9709B23658D9949P0407m7342K81486c8062A3455a68963A33787G525f7785J4214
$$ y = [-35694, 16075, -35730, -202146, 3493, -430853, -316002, -548766, -75691, -236825, 279991, -97175, 87960, 252636, 106592, -78473, -153343, 151625, 230486, -282191, -21727, -379426, 219173, 2317, 200916, 26863, -171031, 297654, -13341, -254444, -82810, 88338, -247088, -72767, 62709, -114491, -157104, 76937, -75552, 65118, 163951, -241578, -236271, 116991, -302273, -356625, -91991, -185834, -44155, -16239, -179017, -52636, 45630, -49104, 9455, -219738, -147926, -69116, 205370, -89862, -45258, -62864, -111902, 159595, -206776, -50394, -37995, -73130, 2733, -100531, 56928, 271588, -66083, -293168, -133261, -287471, -248084, -142525, 158228, 55023, 156106, -262756, 223658, 49949, 120356, 73014, 354500, -38062, 13455, -168963, 133787, 7525, -67785, -53571]
9698e3571n5369q7934P1944O1031l83882A90205B891M7508f5826c0236q9031B35684
9685a27987d5935E9005J87492F0280M1907b1719l20858C54789c60852k3564J2881
9674c71535A93820b52345B15760a84448Q5036j77284l33790f6707j07486L5221
9664a38972E187R5251O5368a67092k00003O3093e7517r3237M3827m2659b6913
9652g7169b5041l28489J12494m6120j66072F6976b2428k61141h8392C40900a56452
9640b5728A65829B0494L38227B3473J50259b74005p6665a34785L1916K5726B04289
9628B52760C4339a75423A4284Q6726b55184g3031A36467b44620R3668p3171R7757
9617a26366I7639b07072O5630J4447C7858d5038j23838P3355O204q9547j63296
$$ y = [-53571, -108940, -196874, -124930, -63899, -447781, 190205, 2891, 50399, -65826, -30236, -119267, 235684, -127987, -45935, 59005, 246497, 60280, 102187, -21719, -342577, 354789, -360852, -384416, -371535, 193820, -252345, 215760, -184448, -99412, -276696, -610486, -66707, -174193, -138972, 5187, 100438, 165806, -167092, -367095, -304002, -57517, -150754, -106927, -149586, -26913, -77169, -25041, -353530, -241036, -287156, -453228, 66976, -22428, -283569, -88392, 340900, -156452, -25728, 165829, 20494, 358721, 23473, 173732, -274005, -350670, -134785, -102869, -77143, 204289, 252760, 34339, -175423, 14284, 101010, -255184, -73031, 136467, -244620, -150952, -224123, -126366, 97639, -207072, -141442, -126995, 37858, -45038, -168876, -95521, -89317, -178864, -342160]
9606c42160J6610C1251a34010a0793l7244g821j63403j8675C7698a84566C3320
9594g9013q8992F693c62308B94216a34862k4503A10264k3409b55889c4098k41525
9583b75623j8176c9288p7786E9507k1664a59815e6175l94319e1685B92679n4881
9572B37798o0672b15458f4912K8691j20071j73007E4710A7637e39129B17897j1447
9561B06450k4315b39193K8458R6223j63766E1023b39218K0331G6153b4762n9042
9550h3804A18210c22033f9558C82540a58632o8040M8213k3420N8712H6327J19704
9539B06031I6375b27064j9150A38328D8948H337P6536h7047A486a36400C8692
9527b00140F2196B4812d3396D9515c33735A27661a4510N260C3561d9885k8339
$$ y = [-342160, -325550, 31251, -134010, -10793, -48037, -7821, -171224, -189899, 37698, -184566, 33320, -79013, -168005, 6693, -362308, 294216, -134862, -159365, 110264, 86855, -255889, -34098, -275623, -293799, -39288, -117074, 59507, 37843, -159815, -56175, -450494, -51685, 292679, 237798, 177126, -215458, -64912, -36221, -156292, -329299, 54710, 17637, -539129, 217897, 206450, 182135, -239193, -210735, -114512, -278278, 51023, -239218, -218887, 76153, -24762, -83804, 118210, -322033, -69558, 382540, -158632, -226672, -178459, -201879, -143167, 86327, 206031, 96375, -227064, -246214, 138328, 48948, 8337, 84873, -87047, 1486, -136400, 38692, -200140, 62196, 24812, -43396, 49515, -333735, 127661, -14510, -9250, 33561, -49885, -78224]
9516g8224l5062B52608c60910B7856a38383E7492a79555B22637b59555f5054C5912
9504b19187h4358j57638a8722l00427A19955a83722e1114J5366j73505H1135k9642
9493E1493R3135d6923k58824A25295m5576Q1072C2621a57965k713M8584k0686
9482a32780E8561h4114A8067a23313A26935O0946c16832B39191I9759C2105a61251
9470B08549a47846B8174h4456j11634i4973j03967j72987I1740a22968l284A72713
9458b16942a2419H0763e6842l11371A49069a7038j18846p280l7492D51464i9476
9446I2518b2903b556k03026A62879b54098p1520i8758B2813a52420J7437b4978
9434a14537c7130j56794e964A59923a56743A03981K9354h4613A91010g1446j9892
$$ y = [-78224, -113286, 252608, -360910, 27856, -138383, 57492, -179555, 222637, -259555, -65054, 35912, -219187, -84358, -241996, -18722, -319149, 119955, -183722, -51114, -35748, -209253, 81135, 51493, 144628, -46923, -305747, 125295, 79719, 160791, 32621, -157965, -160678, -112094, -132780, 58561, -84114, 18067, -123313, 126935, 187881, -316832, 239191, 99759, 32105, -161251, 208549, -147846, 28174, -84456, -196090, -94973, -198940, -371927, 91740, -122968, -126252, 172713, -216942, -12419, 80763, -56842, -368213, 149069, -17038, -135884, -143164, -180656, 451464, -99476, 92518, -22903, -2556, -205582, 162879, -254098, -325618, -98758, 22813, -152420, -134983, -24978, -114537, -37130, -193924, -5964, 159923, -156743, 103981, 133335, -84613, 191010, -71446, -91338]
9423i1338d4215l85341o939J29066B42640b33930B01963G5871O9334a86269A15607
9411a58861m00651b05021b2915A91761L1436a05038A8296a70264b8337k03256
9401b31593J05850j52287g0098N478A23551a70208j94493B6518e0734E8050g7617
9389D0285J57173a2703B31161a6932H1603h8787d52j74296r5595F9000C1863a42310
9376d84216J57333g4623A24447a20737c6232m5787A16247M6294f2704A43403F6986
9364a65973I6380Q572L942n0362J88404c7092F411a0002a738A364N3388a57615
9351A01021b26701o8695a35882l8663G6010b43292A14864c2780j61595a0055D1839
9339C6556d54145A560b22036J7632B82333H0052e723j48782g1430A95754e5032
$$ y = [-91338, -44215, -429556, -436495, -307429, 242640, -233930, 201963, 75871, 145205, -186269, 115607, -158861, -559512, -205021, -22915, 191761, 223197, -105038, 18296, -170264, -28337, -231593, -125743, -278030, -70098, -64620, 123551, -170208, -364701, 26518, -50734, 58050, -77617, 40285, 197458, -12703, 231161, -16932, 81603, -88787, -452, -174748, -270343, 69000, 31863, -142310, -484216, -326883, -74623, 124447, -120737, -36232, -82019, 116247, 162541, -62704, 143403, 66986, -165973, 96380, 104952, 108894, 58532, 246936, -37092, 6411, -10002, -1738, 1364, 54752, -157615, 101021, -226701, -295396, -135882, -174545, 76010, -243292, 114864, -32780, -194375, -10055, 41839, 36556, -454145, 1560, -222036, -204404, 282333, 80052, -5723, -154505, -71430, 195754, -55032]
9327a54742C544e744j60144j67851C601O7391K12979b21035L127J4846A49453
9315i5246k50747f0941k55420Q9928k18867J81241L2273C08528a81454O1425j18894
9304b38923r0529A08283K33832A9519J46048B6631i3727o1804f3260D2172P8424
9293A20596d3449o2691B70151g0712k88089a17758j92771J02599a1502p8330n5473
9282a45305d3246H7115K5747r278M2317b09958C19208b25892A74722m1625Q2506
9271B15603K3489J08448a12125q5202N603C1276a70801I7817d25507B27492a54433
9259a93761J2262H357J65745G212b05617c3654k1488d862o4559F2991b42398H9154
9246d61106a85771J8664c7060j22779I1819b4732j46829C0114b07207F2362a02067
$$ y = [-154742, 3544, -5744, -165888, -333739, 3601, 70992, 283971, -221035, -217908, -203062, 149453, -95246, -345993, -60941, -316361, -226433, -445300, -264059, -231786, 308528, -181454, -120029, -238923, -329452, 108283, 342115, 19519, 165567, 26631, -93727, -155531, -63260, 42172, 120596, -43449, -106140, 270151, -70712, -358801, -117758, -310529, -207930, -11502, -89832, -145305, -43246, 87115, 112862, 103584, 145901, -209958, 319208, -225892, 174722, 133097, 215603, 239092, 347540, -112125, -197327, -191724, 31276, -170801, 97817, -425507, 227492, -154433, -193761, -181499, 8357, 174102, 7212, -205617, -33654, -55142, -4862, -69421, 62991, -242398, 89154, -461106, -185771, -167107, -37060, -159839, 91819, -24732, -171561, 30114, -207207, 62362, -102067]
9234I6758J77265E9261b00480k51865B57659a44586k05623a01397j00914A31871
9223d4509p6301G6936J31797d180m6711p0093c3215o7536d8566B01861J5216g5185
9210h0888k51235F361J80666h7700B44374o5353c77391h4047j47380N2505b651
9198c5692B93290a346k26380E535P9284B0383M00926B2267R7357E1336J9018k2720
9186D7634j8599e7177g683j42340B9936d3466C9272J34815o8202D6306K08234
9175B54540c7210j80922N034A5629J46503a85464a5652j24631B29634d46523a82802
9163B75772a0065k24209f1519j61020B06511d9813G4086J43853b20877k17087
9153d37964e5515J4002l21625J59346c3417A22702a91898G6250g3601a566j84737
$$ y = [96758, 274023, 59261, -200480, -452345, 257659, -144586, -350209, -101397, -202311, 131871, -44509, -120810, 76936, 208733, -4180, -50891, -120984, -33215, -100751, -48566, 201861, 217077, -75185, -80888, -332123, 6361, 187027, -87700, 244374, 179021, -377391, -84047, -231427, -178922, -2651, -35692, 293290, -1346, -227726, 5535, 84819, 20383, 421309, 22267, 119624, 51336, 70354, 47634, 29035, -57177, -7683, -150023, 29936, -43466, 39272, 174087, 105885, 46306, 254540, -37210, -218132, -213098, 15629, 162132, -185464, -15652, -140283, 229634, -446523, -182802, 275772, -10065, -234274, -61519, -222539, 206511, -49813, 74086, 217939, -220877, -437964, -55515, -41513, -363138, -203792, -33417, 122702, -191898, 76250, -73601, -1566, -186303]
9142a86303O2384K7342a5509j04215J76j24902C0209b1022o0363A01074a7077
9130a69043M063b4584r4928j55468D8860a47183N4555J3062l16236g0418m87336
9119e57754b74156O4140p2961P8484P3297B69183a8732k3087G1303a97610N1347
9108a46263k0842f7674q9338j68339e5362B4942e8552n522l3555K6276A6338a49869
9095D0765O6098i5892B24343c23564a03614A0055a08470B9602K30523a3487j27120
9084a40607K8115r5370A91413l7581e110I0520k9887L10354a32201a2249j20212
9073a32461n1272J5017B03913d5738j46596B06901G5250b68924A23342d05247
9062a34605E0623j5542G147K0548K8906b26839a3888k02001B705f9710j89761
$$ y = [-186303, -123919, -96577, -15509, -119724, -119548, -244450, 30209, -21022, -81385, 101074, -17077, -169043, -164980, -24584, -119512, -274980, 48860, -147183, -92628, -79566, -395802, -70418, -557754, -274156, -210016, -282977, -204493, -131196, 269183, -18732, -41819, 71303, -197610, -146263, -167105, -67674, -157012, -325351, -55362, 24942, -58552, -64074, -97629, -71353, 16338, -149869, 40765, 106863, -95892, 224343, -323564, -103614, 10055, -108470, 29602, 260125, -13487, -140607, -112492, -207862, 191413, 153832, -5110, 90520, 60633, 370987, -132201, -12249, -132461, -183733, -168716, 203913, -45738, -192334, 206901, 75250, -268924, 123342, -405247, -134605, 50623, 35081, 7147, 27695, 56601, -226839, -13888, -215889, 2705, -69710, -259471]
9051b59471A05839E2816c66347C06747c48448a7914H5176N4957C7318b32479D9148
9039a11963J2204m6746n813A00152f8525c1670j88460I6349a86716A31539k9249
9028A02290b65134h9223J5286I9602F905f9527r4296A14465O6394a01662p734
9017a09396g793q2177j57948m7808a34400j01001H5167a14458A36621L5559C7671
9005B2856M8408h981d4D6923b6452R073k00919j51149b8566j98509M228I7310
8992A31259a53850L3286a1065A29338J4006d2975j49950a1304E0433a44586N9466
8981h5120A54746F9986b97149A2462e6589k33199M4939j58482f2220o1948l77927
8970e02095c2073H076P6832C9918h892p5742l18677A9023h1354n9383D0046c3949
$$ y = [-259471, 105839, 52816, -366347, 306747, -348448, -17914, 85176, 140133, 37318, -232479, 49148, -111963, -99759, -146505, -152318, 100152, -68525, -31670, -220130, 96349, -186716, 131539, 102290, -265134, -89223, -73937, 99602, 6905, -69527, -163823, 114465, 180859, -101662, -109396, -7793, -89970, -247918, -295726, -134400, -235401, 85167, -114458, 136621, 172180, 37671, 22856, 71264, -8981, -44, 46923, -26452, -17379, -218298, -369447, -28566, -227075, -222847, 97310, 131259, -153850, -120564, -11065, 129338, 143344, -42975, -192925, -11304, 50433, -144586, -85120, 154746, 69986, -297149, 12462, -56589, -289788, -244849, -403331, -62220, -124168, -502095, -32073, 8076, 84908, 39918, -8892, -84634, -403311, 19023, -81354, -140737, 40046, -33949]
8957B0992K07379I1091l0302r970a1252j84845H6083J9710a07404C2913a60073
8945f6524n6424L7587A3260K70181p5605i3919m7746B4206f4719k25471J19206
8934a70984a9100c305l5564p3412C6823c72329a14106j22877A49956m3373f3386
8922a03372k09759b9777q384k49187a43531A0085b89307b2634j20047B8090J38922
8911A67012h9192c7336A2882K5012a67666I7376b27976A2958M3891J13371m2819
8900A27401f224I9573K70261C2491J53764E4814M60282G5894c55975k1783E8087
8888B48877a77224a0376j15724L9567j84790a18296j5138C24253g4721k5216I5689
8876F8182J09058R012C9407J38092a21167n0728J1056A48654m7250i19m9045k5164
$$ y = [20992, 228371, 91091, 60789, 50819, -11252, -196097, 86083, 105793, -107404, 32913, -160073, -66524, -122948, -85361, 13260, 283441, 207836, -93919, -141665, 24206, -64719, -290190, -170984, -19100, -3305, -38869, -112281, 36823, -372329, -114106, -236983, 149956, 106583, -63386, -103372, -313131, -29777, -38161, -287348, -143531, 10085, -289307, -22634, -142681, 28090, 167012, -89192, -37336, 12882, 37894, -167666, 97376, -227976, 12958, 56849, 170220, 127401, -6224, 99573, 369834, 32491, 186255, 54814, 515096, 75894, -355975, -377758, 58087, 248877, -177224, -10376, -126100, -86533, -271323, -118296, -133434, 324253, -74721, -99937, 95689, 68182, 177240, 186252, 39407, 177499, -121167, -171895, -160839, 148654, 101404, -919, -49964, -75128]
8864g5128K0459A09805a08011F5326b47192a7971B5369b7372E1620h2960j50886
8853b33846B8030f2335k3266A33488a50157A75683a91327B01265a11138C827J04242
8842A08069g6075r845p6348B0576d61632A27092f4546j73733i7790L4363A45234
8830a60344g394A50772n8639J06477i7270j24082b080j34199F235J86006k9887
8819A62354A1940a82409B79791i7402F7576G927b59289C1607J9906c12057N6913
$$ y = [-75128, -54669, 109805, -108011, 65326, -247192, -17971, 25369, -27372, 51620, -82960, -233846, 28030, -62335, -85601, 133488, -150157, 175683, -191327, 201265, -111138, 3827, 108069, -76075, -85920, -162268, 20576, -461632, 127092, -64546, -238279, -97790, -63427, 145234, -160344, -7394, 150772, 92133, 198610, -97270, -221352, -2080, -136279, 6235, 192241, 162354, 11940, -182409, 279791, -97402, 67576, 7927, -259289, 31607, 51513, -312057, -255144]
$$ [...]
##END NTUPLES=NMR SPECTRUM
##END=
